##TITLE=1H_Ser 6-8-V
 CDCl3
 8 sc, 
 12.04.2022
##JCAMPDX= 6.0         $$ Bruker NMR JCAMP-DX V2.0
##DATA TYPE= NMR FID
##DATA CLASS= NTUPLES
##ORIGIN= UXNMR, Bruker Analytische Messtechnik GmbH
##OWNER= root
$$ XWIN-NMR		Version 3.5
$$ Tue Apr 12 14:16:22 2022 Russian Standard Time (UT+4h)  she@DPX200
##.OBSERVE FREQUENCY= 200.13135
##.OBSERVE NUCLEUS= ^1H
##.DELAY= (6, 6)
##.ACQUISITION MODE= SIMULTANEOUS
##.ACQUISITION SCHEME= undefined
##.AVERAGES= 8
##.DIGITISER RES= 18
##SPECTROMETER/DATA SYSTEM= spect
##.PULSE SEQUENCE= zg30
##.SOLVENT NAME= CDCl3
##.SHIFT REFERENCE= (INTERNAL, CDCl3, 0, 15.7039)
##AUDIT TRAIL= $$ (NUMBER, WHEN, WHO, WHERE, WHAT)
$$ ##TITLE= Audit trail, XWIN-NMR		Version 3.5
$$ ##JCAMPDX= 5.01
$$ ##ORIGIN= Bruker BioSpin GmbH
$$ ##OWNER= she
$$ F:/spectra/data/she/nmr/H-F/1/audita.txt
$$ ##AUDIT TRAIL=  $$ (NUMBER, WHEN, WHO, WHERE, WHAT)
(   1,<2022-04-12 14:15:09.06 +0400>,<she>,<DPX200>,
      <created by zg, POWCHK disabled, PULCHK disabled
       configuration hash MD5:
       00 E9 B6 7A A2 85 ED C7 34 08 36 98 17 FE 4E 26
       data hash MD5: 16K
       66 21 BE C3 13 A5 0C 6C E4 39 DA A0 04 18 3F 8E>)
$$ ##END=
$$ 
$$ hash MD5
$$ 0C 0F 8A 4E 95 A1 5E 8F FE 3A 0A 12 65 46 E5 10
##$RELAX= 
##$RELAX= 
##$RELAX= 
##$RELAX= 
##$RELAX= 
##$RELAX= 
$$ Bruker specific parameters
$$ --------------------------
##$DU= <F:/spectra>
##$EXPNO= 1
##$NAME= <H-F>
##$PROCNO= 1
##$TYPE= <nmr>
##$USER= <she>
##$AMP= (0..31)
100 100 100 100 100 100 100 100 100 100 100 100 100 100 100 100 100 100 
100 100 100 100 100 100 100 100 100 100 100 100 100 100 
##$AQSEQ= 0
##$AQ_mod= 1
##$AUNM= <au_zg>
##$AUTOPOS= <>
##$BF1= 200.13
##$BF2= 200.13
##$BF3= 200.13
##$BF4= 200.13
##$BF5= 200.13
##$BF6= 200.13
##$BF7= 200.13
##$BF8= 200.13
##$BYTORDA= 1
##$CFDGTYP= 0
##$CFRGTYP= 5
##$CHEMSTR= <none>
##$CNST= (0..31)
1 1 145 1 1 1 1 1 1 1 1 1 1 1 1 1 1 1 1 1 1 1 1 1 1 1 1 1 1 1 1 1 
##$CPDPRG= <>
##$CPDPRG1= <>
##$CPDPRG2= <>
##$CPDPRG3= <>
##$CPDPRG4= <mlev>
##$CPDPRG5= <mlev>
##$CPDPRG6= <mlev>
##$CPDPRG7= <mlev>
##$CPDPRG8= <mlev>
##$CPDPRGB= <>
##$CPDPRGT= <>
##$D= (0..31)
0 1.2 0 0 0 0 0 0 0 0.06 0 0.03 0 0 0 0 0.0002 0 0 0 0 0 0 0 0 0 0 0 0 
0 0 0 
##$DATE= 1649758508
##$DBL= (0..7)
120 120 120 120 120 120 120 120 
##$DBP= (0..7)
150 150 150 150 150 150 150 150 
##$DBP07= 0
##$DBPNAM0= <>
##$DBPNAM1= <>
##$DBPNAM2= <>
##$DBPNAM3= <>
##$DBPNAM4= <>
##$DBPNAM5= <>
##$DBPNAM6= <>
##$DBPNAM7= <>
##$DBPOAL= (0..7)
0.5 0.5 0.5 0.5 0.5 0.5 0.5 0.5 
##$DBPOFFS= (0..7)
0 0 0 0 0 0 0 0 
##$DE= 6
##$DECBNUC= <off>
##$DECIM= 32
##$DECNUC= <off>
##$DECSTAT= 4
##$DIGMOD= 1
##$DIGTYP= 9
##$DL= (0..7)
0 120 120 120 120 120 120 120 
##$DP= (0..7)
150 150 150 150 150 150 150 150 
##$DP07= 0
##$DPNAME0= <>
##$DPNAME1= <>
##$DPNAME2= <>
##$DPNAME3= <>
##$DPNAME4= <>
##$DPNAME5= <>
##$DPNAME6= <>
##$DPNAME7= <>
##$DPOAL= (0..7)
0.5 0.5 0.5 0.5 0.5 0.5 0.5 0.5 
##$DPOFFS= (0..7)
0 0 0 0 0 0 0 0 
##$DQDMODE= 0
##$DR= 18
##$DS= 0
##$DSLIST= <SSSSSSSSSSSSSSS>
$$ [...]
##$SUBNAM2= <"">
##$SUBNAM3= <"">
##$SUBNAM4= <"">
##$SUBNAM5= <"">
##$SUBNAM6= <"">
##$SUBNAM7= <"">
##$SUBNAM8= <"">
##$SUBNAM9= <"">
##$SW= 18.05172834244
##$SWIBOX= (0..15)
0 0 2 0 0 0 0 0 0 0 0 0 0 0 0 0 
##$SW_h= 3612.71676300578
##$TD= 16384
##$TD0= 1
##$TE= 0
##$TE2= 300
##$TE3= 300
##$TEG= 300
##$TL= (0..7)
0 120 120 120 120 120 120 120 
##$TP= (0..7)
150 150 150 150 150 150 150 150 
##$TP07= 0
##$TPNAME0= <>
##$TPNAME1= <>
##$TPNAME2= <>
##$TPNAME3= <>
##$TPNAME4= <>
##$TPNAME5= <>
##$TPNAME6= <>
##$TPNAME7= <>
##$TPOAL= (0..7)
0.5 0.5 0.5 0.5 0.5 0.5 0.5 0.5 
##$TPOFFS= (0..7)
0 0 0 0 0 0 0 0 
##$TUNHIN= 0
##$TUNHOUT= 0
##$TUNXOUT= 0
##$USERA1= <user>
##$USERA2= <user>
##$USERA3= <user>
##$USERA4= <user>
##$USERA5= <user>
##$V9= 5
##$VALIST= <valist>
##$VCLIST= <CCCCCCCCCCCCCCC>
##$VD= 0
##$VDLIST= <DDDDDDDDDDDDDDD>
##$VPLIST= <PPPPPPPPPPPPPPP>
##$VTLIST= <TTTTTTTTTTTTTTT>
##$WBST= 1024
##$WBSW= 4
##$XGAIN= (0..3)
0 0 0 0 
##$XL= 0
##$YL= 0
##$YMAX_a= 141860
##$YMIN_a= -257404
##$ZGOPTNS= <>
##$ZL1= 120
##$ZL2= 120
##$ZL3= 120
##$ZL4= 120
##$ABSF1= 10
##$ABSF2= 0
##$ABSG= 5
##$ABSL= 3
##$ALPHA= 0
##$AQORDER= 0
##$ASSFAC= 0
##$ASSFACI= 0
##$ASSFACX= 0
##$ASSWID= 0
##$AUNMP= <proc_1d>
##$AZFE= 0.1
##$AZFW= 0.1
##$BCFW= 1
##$BC_mod= 2
##$BYTORDP= 1
##$COROFFS= 0
##$CY= 11.3945322036743
##$DATMOD= 1
##$DC= 2
##$DFILT= <>
##$DTYPP= 0
##$F1P= 2.36226072786647
##$F2P= -0.459571619588291
##$FCOR= 0.5
##$FTSIZE= 0
##$FT_mod= 4
##$GAMMA= 1
##$GB= 0.15
##$INTBC= 1
##$INTSCL= 1
##$ISEN= 128
##$LB= 0.24
##$LEV0= 0
##$LPBIN= 0
##$MAXI= 10000
##$MC2= 0
##$MEAN= 0
##$ME_mod= 0
##$MI= 1.114404
##$NCOEF= 0
##$NC_proc= 0
##$NLEV= 6
##$NOISF1= 3.799351
##$NOISF2= 2.8
##$NSP= 1
##$NTH_PI= 0
##$NZP= 0
##$OFFSET= 15.70392
##$PC= 1
##$PHC0= -18390.23
##$PHC1= 13.80078
##$PH_mod= 1
##$PKNL= yes
##$PPARMOD= 0
##$PSCAL= 0
##$PSIGN= 0
##$REVERSE= no
##$SF= 200.130013532006
##$SI= 16384
##$SIGF1= 3
##$SIGF2= 2
##$SINO= 400
##$SIOLD= 16384
##$SREGLST= <1H.CDCl3>
##$SSB= 0
##$STSI= 0
##$STSR= 0
##$SW_p= 3612.71676300578
##$SYMM= 0
##$S_DEV= 0
##$TDeff= 0
##$TDoff= 0
##$TI= <>
##$TILT= no
##$TM1= 0
##$TM2= 0
##$TOPLEV= 0
##$USERP1= <user>
##$USERP2= <user>
##$USERP3= <user>
##$USERP4= <user>
##$USERP5= <user>
##$WDW= 1
##$XDIM= 8192
##$YMAX_p= 0
##$YMIN_p= 0
$$ End of Bruker specific parameters
$$ ---------------------------------
##NTUPLES= NMR FID
##VAR_NAME=  TIME,          FID/REAL,        FID/IMAG
##SYMBOL=    X,             R,               I
##VAR_TYPE=  INDEPENDENT,   DEPENDENT,       DEPENDENT
##VAR_FORM=  AFFN,          ASDF,            ASDF
##VAR_DIM=   8192,          8192,            8192
##UNITS=     SECONDS,       ARBITRARY UNITS, ARBITRARY UNITS
##FACTOR=    0.0002768,     1,               1
##FIRST=     0,             0,               0
##LAST=      2.2672688,     0,               0
##MIN=       0,             -257404,         0
##MAX=       2.2672688,     141860,          0
$$ Real data points
##PAGE= N=1
##DATA TABLE= (X++(R..R)), XYDATA
$$ [...]
1823Hm12K05L97k0M51m02r86K08K41L5M53mq72m39P76l2O72L06o09j04L30L16
1845E18Q4M50j18r44K76N1J43L53J77q02P4n1n8L21j66m70k13l53O2J84K82k51
1867d51k62M68k57P1O57j14l04j1m52M85N61Q1m2o03j17K57K97O44m92p03Q2l43
1889e48j77Q60k64m13k70k09J81K93M45k9k39l86o7Q89N51j59k55j50k41Q06L96
1910A014j18l36k87k79M81K94j57j04o22R6j15M32K31m25n11J53n30K91O30k00
1930f2m5j91m38M65N03n4N0j64l80K03L09N19l57O9l33l74N17L21k92J84o17k69
1952d36J57L01M54j35k65n66k99N58L70N8j04l03q39M71Q35j55M53j052rJ45M09
1973D8K95L36p11k67k57O91M07j5K5p48m28P71L02q9j66k94q45J92K36N11J47
$$ plain form
1823 8 -404 -199 198 178 629 227 -759 -551 -310 -275 178 174 -698 -1137 -361 -393 279 585 -24 -128 202 518
1845 518 602 1052 934 -10 266 317 460 813 990 188 262 211 153 474 308 -162 -375 -728 -666 -482 -200 -451
1867 -451 -713 -245 -502 -431 226 112 -192 -203 -655 -170 391 472 430 -173 -290 -33 264 908 416 -287 -205 -548
1889 -548 -725 135 -129 -542 -812 -1021 -840 -547 -102 -131 -370 -756 -823 66 617 458 203 53 -188 618 1014
1910 1014 896 560 273 -6 475 769 612 508 -114 -18 -133 299 530 105 -406 -253 -783 -492 138 -62
1930 -62 -107 -298 -736 -271 232 178 228 64 -316 -113 196 715 358 427 94 -280 237 558 266 450 -167 -436
1952 -436 -279 22 476 341 76 -490 -789 -231 139 197 93 -210 -1049 -578 257 102 555 -497 -506 -361 48
1973 48 343 679 -32 -299 -556 135 542 527 552 -196 -624 147 449 360 194 -100 -945 -753 -517 -6 141
1994A41o12k32jL61J20N15n5n59j16L97J07O42k9l32p3M3k34N63M23m66j45n58
2016a00J0K22O34j09n28q73K91L45J83M20m07o68j34J35N61N22j29l43l46l40
2036f54Q50L19K74n75l95k0K22O79K40m34o54m83K96N87J01k30o00l35p2L80P61
2057B57k6l81l00j79K13N77J26j38j74n65k8J057m8L53k18o64j29L48M82J54q3
2078F34o36l65k2R05p8j49k71o48L20K04J83L42m03l46l01O1O52J54j02k56l02
2099d24OM53M87P2j86n71j33Q4O08L63r5o40o35J48O85M09l75j99o45j97L67O59
2121B41K70p27n46k44K94O68M87n30n47k46K83P78K67k4K9n30l21M82L77L49l43
2142D67m81J06k23P04K71l88j30o60k23M34K58p3j83p20m58O98K56M75M7m17M2
$$ plain form
1994 141 -471 -703 -704 -343 -223 292 237 -322 -438 -41 66 708 679 347 274 317 83 646 1069 603 458 -100
2016 -100 -90 132 766 657 129 -744 -453 -108 75 495 88 -580 -714 -579 -18 504 375 32 -314 -654
2036 -654 196 515 789 214 -181 -201 21 700 940 506 -148 -631 -335 252 353 123 -477 -812 -884 -504 257
2057 257 231 -150 -450 -629 -416 161 287 149 -25 -590 -618 439 391 744 526 -138 -267 81 563 717 634
2078 634 -2 -367 -389 516 438 289 18 -630 -310 -106 77 419 16 -330 -631 -570 82 236 134 -122 -424
2099 -424 -418 35 522 594 408 -163 -296 -212 396 759 664 24 -611 -463 222 631 256 57 -588 -785 -418 241
2121 241 511 -216 -762 -1006 -712 -44 443 -87 -634 -880 -597 181 448 424 453 -77 -398 84 461 810 467
2142 467 -14 92 -131 573 844 456 326 -334 -557 -123 135 62 -121 -841 -1299 -601 -345 130 177 -240 -198
2163a98k21O26L27J46q0q78j7P32J37N96k21p69m49L57r3P37l95m8r35k96J72
2184g70N20M86l05n15l69L89M38N89M0p06n53O96r5N93J15k03q67J04O70J05L60
2205G22P7j121o4J91L14M68j99o04m00NL72j6K95n02l4l61L27N4M17l6k29O7l81
2228f38L07P77k4j05J5m27n7R22R8j84m83l24l02M97L77K30o65j76n48L14J030
2249F34l64j6j95o21j17Q02L74O5l99m97k95O85P91j93l59k5n94K12Q94r1n07
2270A84j70n67J10M61M15j29j82p09P0R5P42l55o5k18n65L93L16j47J56On17L2
2292f44O90J55L5J03j32l94L4M12K62O7r1p10L10L4P5M25m77n06n6M32j04J45
2314F5M37p38m0j39J70N05L41p69k95K70L8N28M44p89q9j87l3L16L27K17n97j83
$$ plain form
2163 -198 -419 207 534 680 600 -278 -295 437 574 1170 949 180 -269 88 -5 732 337 289 -646 -942 -770
2184 -770 -250 236 -69 -584 -953 -564 -126 463 503 -203 -756 -60 -155 438 553 350 -517 -413 257 362 722
2205 722 799 -322 -386 -195 119 587 388 -216 -616 -611 -239 -255 40 -462 -496 -857 -530 -476 -59 -95 -324 -257 -638
2228 -638 -331 446 422 317 332 -95 -152 770 868 684 201 -123 -425 72 449 679 14 -162 -710 -396 634
2249 634 270 254 59 -562 -679 123 497 562 163 -334 -629 56 847 654 295 270 -324 -112 782 691 184
2270 184 14 -553 -443 18 433 304 122 -587 -517 -422 320 -35 -100 -318 -883 -490 -174 -321 -165 -159 -676 -644
2292 -644 46 201 236 339 207 -187 -153 259 521 588 497 -213 97 131 206 631 154 -352 -408 24 -80 65
2314 65 502 -236 -276 -415 -245 260 601 -168 -463 -193 -155 373 817 28 -61 -248 -281 35 362 579 -18 -201
2336b01n2N81P2N38q28k92q4M6M31K25m57j50n3q2L12J42K58n12j44NJ37L42J53
2359C87o84M55J04n68M60L46k28J90J8l59r1N69m26k4K6n24q4L58L50j32j83n02
2381e42j23M55L72k06n4n23j56O10J06K28L8l16P1l97O33K7j6J25m57k40N76K91
2403E02j72l07m33j30M10J30O9Ol18l48R9K80J09N8O5m41l9O37N7J67j14k61o5
2426c9M08k2j3J90k62j73l0L33l05K09mm91j68K76j83L17lk51L8j74M0J98K70
2449A61m48Q0L7J21O5J84L34o08oj5JO03p5m08r8k44N64JK93l67r3k13K39k56
2473a48K32J74n68j70J99l80O07L4k12R6k43l6L44n7J8j69L36j85J35K42k04J09
2495A54q2Q8j67M61l3q4l33l65K47K26m8J61m94J8J6R8M6j0L9j22l55J93O01l88
$$ plain form
2336 -201 -253 328 400 938 110 -182 -266 -220 211 436 -21 -171 -224 -306 6 148 406 -106 -250 -245 -108 234 387
2359 387 -297 158 262 -306 154 500 272 462 480 121 30 599 173 149 175 -349 -433 -75 275 143 -40 -542
2381 -542 -665 -210 162 -44 -98 -621 -777 -167 -61 167 205 -111 -40 -437 196 223 207 332 -125 -365 211 502
2403 502 330 23 -410 -540 -130 0 69 75 -243 -591 -492 -212 -103 -45 20 -421 -460 177 234 401 287 26 -39
2426 -39 369 347 334 524 262 89 59 392 87 296 292 -199 -367 -91 -274 43 40 -211 -173 -347 -307 -109 161
2449 161 -287 -207 -170 -49 16 200 534 -74 -80 -95 -94 509 434 26 -72 -316 248 249 542 175 82 -131 108 -148
2473 -148 84 258 -310 -480 -281 -661 -54 -20 -232 -136 -379 -415 -71 -128 -110 -279 57 -128 7 249 45 154
2495 154 72 160 -7 454 421 337 4 -361 -114 112 64 225 -269 -251 -235 -137 -91 -101 -62 -184 -539 -346 255 -133
2519a33J03K4P9j25J95K9P4P9k25k94M03L00k65K5k04j74J48j93K11j60P5m20
2541d48J99J2K09J50k36k47O7p9L62J48k09J79l94L15M42j90L48n31O9L2k41L09
2563B66J08m47J6kj64L66j82Q1j88l4M4k8kO8j22j56J77Q3J40R4k49J51k89M82
2587B13J04L4P1l15J52M0j40o1J07j04J54j87o9R9Pr5o6j30%K18j82J86k5k33
2611b22j80J91j8K34k23J07j49n2N40k89J22O5k84K91J04K07j52j32k21K27L6
2632B02j86R1j96P6k23q3L52L4o16J14j61M61J01j02J57n01M28J39k20K75op9
2654E7K31j58R4J66k27j2j50L11Q1l07k45N3J62j07l4k07J75K7q3Orm2J07J28
2678A7K1M7k01M7j67K11M21l66K4J36m4L19j42q1q5M5p3o2j16K04m3j56j44M2
$$ plain form
2519 -133 -30 -6 73 -52 143 172 246 325 100 -194 209 509 244 269 65 -109 39 -154 57 -103 -28 -448
2541 -448 -249 -237 -28 122 -114 -361 -294 -373 -11 137 -72 107 -287 28 470 280 628 97 166 198 -43 266
2563 266 374 -73 -57 -59 -223 143 -39 42 -146 -180 -136 -164 -166 -98 -220 -376 -199 -116 24 118 -131 20 -269 213
2587 213 317 351 422 107 259 299 159 98 205 101 255 68 -1 98 105 10 -56 -186 -186 32 -150 36 11 -222
2611 -222 -402 -211 -229 5 -218 -111 -260 -312 228 -61 61 126 -158 133 237 444 292 160 -61 166 202
2632 202 16 107 -89 -13 -236 -319 33 67 -549 -435 -596 -135 -34 -136 21 -480 -52 87 -133 142 136 57
2654 57 288 130 224 390 163 151 1 312 393 86 -159 -106 56 -51 -85 -292 -117 -90 -173 -167 -176 -218 -111 17
2678 17 38 85 -116 -69 -236 -25 396 30 54 190 146 465 323 242 157 202 129 67 -49 155 112 -44 -188 -146
2702a46Q7l26K57l27K61k57N23q9p8P4k83L65k6K04j97J17k3k7j0J61k06k75L37
2725A16j58K44m01J56m1l6j08P0j01J40K37j02k36J34M8M1J99m93K58J11m2n8
2747b2J99L8j16Mj72J21J78K82k83n8r5l79O48k54q2j11M4K19j41j00L5l4l48
2770d27K23J81o8K62k99k44M58k38K23J0J34O6m48K33l6L18k95J78j15l00R7L71
2792B84j90k87J37j77O9k2O8rrm04J98J4o4K96k2r4k97N23K3P5n5j31K21L7l8
2817A46J08J41k58O3l84L16k37K16n4j2l95K2J73j81M04kn23R5K03o3m1J91k00
2840b72K6O3L27O5p0r1lp3J34P3K92j30l75M78l62J5J46k26P2O4j76O0j59J7j61
2865b66k6J02P8P1K47k53j29P1L4J91J2j0q2J29j88J37J85J5L3j76j7q1O2k42
$$ plain form
2702 -146 -59 -385 -128 -455 -194 -451 72 -17 -95 -21 -304 61 35 239 42 159 136 109 99 260 54 -221 116
2725 116 -42 202 -199 -43 -84 -120 -228 -158 -259 -119 118 16 -220 -86 -38 3 202 -291 -33 78 36 -22
2747 -22 177 215 99 103 -69 52 230 512 229 171 76 -303 345 91 9 -102 -58 161 20 -80 -45 -79 -427
2770 -427 -204 -23 -91 171 -128 -372 86 -152 71 81 215 281 -167 66 30 348 53 231 116 -184 -87 284
2792 284 94 -193 -56 -233 -164 -186 -118 -127 -136 -540 -342 -328 -392 -96 -118 -212 -509 14 37 112 57 -74 147 184 146
2817 146 254 395 137 200 -184 132 -105 111 57 45 -350 -328 -155 -336 68 66 -457 -362 -159 -222 -263 -72 -272
2840 -272 -246 -183 144 209 139 48 45 -28 106 179 471 341 -34 444 82 97 243 17 89 153 -23 37 -122 -105 -266
2865 -266 -292 -190 -112 -41 206 -47 -176 -105 -71 120 132 122 40 169 -19 118 303 318 351 175 158 77 139 -103
2889a03L44o2k63l3n3O5K34k69j87M2l6K54K04l11J58j24j67L36R9L7p4q9k25
2912b23J30M99o6j79J09k59L46j22k6j83j83l3J99Q2q9j93L51n34Q2K48k3Q3j24
2935a08l5j7R9j51K61J12j71p1J98J80j05l2q1J92l39K64oP9J9k68qJ17j85O9
2959A3n9q3k23R0J97j30rL44k22l49L22K2J22N9q9k08J80J58J17j2J9p8Q4k43
2983B2K18p4O8k64k04K33j93K93J36j72m33M7J00O8J13L1k56j33K52j36J48K52
3005A16l43J72J2K06J70j48j75j2J65l00L34j15K31j81%k00l05M82m1l09J0R2
3027a39O5Ko1J25j23k8Q7L5K85j50o9k6j4J70J46q9j54J70k51j34K82m2j37J88
3051A38k06k42Q6J63K1k08L5j58M5J65N5j42m5r9J77L88j64J1J21k02K23j39K8
$$ plain form
2889 -103 241 179 -84 -117 -170 -105 129 -140 -327 -285 -321 -67 137 -174 -16 -140 -307 29 128 165 91 2 -223
2912 -223 -93 406 340 161 270 11 357 235 209 26 -157 -190 9 91 2 -191 160 -374 -292 -44 -67 16 -108
2935 -108 -143 -160 -61 -212 49 161 -10 -81 117 297 192 160 79 271 -68 196 190 269 288 20 12 129 -56 13
2959 13 -46 -129 -352 -262 -65 -195 -204 140 -82 -431 -109 -87 35 94 5 -203 -23 135 252 240 259 181 265 22
2983 22 240 166 234 -30 -234 -1 -194 99 235 63 -370 -323 -223 -155 -42 -11 -267 -400 -148 -284 -136 116
3005 116 -227 -55 -43 163 333 185 10 -2 163 -137 197 82 313 132 132 -68 -373 109 68 -241 -231 -139
3027 -139 -74 -72 -133 -8 -131 -159 -72 -37 248 98 29 3 -11 159 305 216 62 232 -19 -153 129 87 -50 138
3051 138 -68 -310 -224 -61 -40 -248 -213 -371 -326 -161 -106 -248 -293 -392 -215 173 9 20 141 -61 162 23 51
3074E1k02K55j17l2J61N6J7L6j69m27L89r0K37l47O7p6L0K0r1L35r8j08J05p9
3098g7j69K49p7J89r8pJ06R4K5j82J01R4P4n5p2%J35k32p3j54j27N15q7q6j63
3123g7J16l94K57P1m1K4k52j6M36n7q1k76K06J87k04O10m99J98j01N2j83J46l56
3146b34J10J98K24k30j37K3O1r5j4k32J73J55l07n0L51J65m61M00q1J32j02P8
3168A27l48K96o6O9J36J47k27j6Q8j64K28l5k05R0Ll1j52o3J55j96j10J50J80
3191E6n7j48q8j46M55J01k37J14k01J54J92l8j26J64j82o4R2M43j53k36j1j95
3213a11K32j98K5j25p9J40K69k67j53k8J09rK24P1j56n0k0J46k52K25N2j78K55
3236A22p2o0K48j55m8J27l1k13K07k75Q4nJ63n3qj9j54M9k5k62Q1N7J00J22k40
$$ plain form
3074 51 -151 104 -13 -45 116 172 189 225 56 -371 18 -72 165 -182 -115 -191 -161 -141 -232 103 5 -103 2 -77
3098 -77 -246 3 -74 115 17 10 116 210 235 53 154 248 322 267 195 195 330 98 25 -129 -256 259 172 86 -77
3123 -77 39 -355 -98 -27 -68 -44 -296 -312 124 67 -14 -290 -84 103 -101 509 10 208 107 159 -24 122 -234
3146 -234 -124 74 298 68 -69 -46 15 -80 -94 -326 -153 2 -305 -355 -4 161 -300 100 19 151 49 127
3168 127 -221 75 9 78 214 361 134 118 206 42 270 235 30 120 123 92 -60 -123 32 -164 -274 -124 56
3191 56 -1 -149 -237 -383 72 173 -64 50 -151 3 195 157 31 195 13 -51 41 484 331 95 84 -111
3213 -111 121 -77 -52 -177 -256 -116 153 -114 -267 -295 -186 -195 29 100 -56 -106 -126 20 -232 -7 45 -133 122
3236 122 50 -10 238 83 35 162 131 -82 125 -150 -66 -71 92 39 31 12 -142 -93 -118 -380 -299 -242 -142 -20 -260
3261b60L00k36l6L89o5j29Q0J49k48K69j62J72P7l03J7r9L73l42k4J30j75Q0J26
3284H3j99J36k59L82l45R7j8j8J35j55J30K48R8j03K7l73M6K24R1j98q3O9n5J76
3308A36j66J08K3l38n3K62K5J69k2k65P7j14j04K73k20J09k11K68P6k51J84k0
3330e4m8R7K68k71l1K20j13JRo6J75j27K0l25M2J02k21L92J21l60j21L24j40J49
3354D3M2k18J32p0O3K93j55q0J42j41K58P7r2J46j31n09L93j57m5Q0n1k88K84
3377A6j74J06OJ98m73K18R8R0j11m9k15K23J96k74J36j03K81J20j82k29K09K5
3399A12k9j05N8Q3q7K7q5K16l89J43j7j07J46j13l2J3k92K85M7O8q0l6j35J88
3423a21K35j22L04l83O9kK47N4k72J16j42J41j69j03O19m84J32m23l2K28M0N7
$$ plain form
3261 -260 40 -196 -232 157 92 -37 43 192 -56 213 51 223 300 -3 14 -85 288 -54 -78 52 -123 -43 83
3284 83 -116 20 -239 143 -202 -105 -123 -141 -6 -161 -31 217 315 212 239 -134 -88 136 227 29 -54 15 -40 136
3308 136 -30 78 101 -237 -290 -28 -3 166 144 -121 -44 -158 -262 11 -209 -100 -311 -43 33 -218 -34 -54
3330 -54 -102 -5 263 -8 -39 181 68 69 78 12 187 60 80 -245 -203 -101 -322 70 191 -169 -290 34 -106 43
3354 43 85 -133 -1 -71 -8 285 130 50 192 51 309 386 294 440 309 -200 193 36 -9 71 20 -268 16
3377 16 -158 -52 -46 152 -321 -103 -5 85 -26 -75 -290 -67 129 -145 -9 -112 169 289 107 -122 87 112
3399 112 83 -22 36 119 32 59 -26 190 -199 -56 -73 -180 -34 -147 -179 -166 -458 -173 -126 -58 -138 -174 -309 -121
3423 -121 114 -8 296 -87 -18 -20 227 281 9 125 -17 124 -45 -148 471 -13 119 -304 -336 -108 -68 -11
3445a1r4l01p2M53j59K15j14Q3P3k69J93J57p7N9L7J44j80K16l18K82l99R5j67
3468a54J02J26j5O4j32J8j40J39l22L70j05j51K43j57k70L49q2K16l24K46P5l8
3490E8J76j66k4L9R6q9K25m23k35K39J73J13k18r3J33l61K10L77k75K60l88Q1
3512i2j17K43N6m9q5P0R0n38M41PMj8k26K62j1K02k39Q5j52j72K45P3M7q8K27
3537B65m48j14K86j76Oj65K14q2K63L8m86L01j47j68L55k3J45p7N4n1j37L14M1
3560B08j1K16o13K01lQ4K78j91l38J41m11M54N3k92J39j63o9K90n6J04j02R3j32
3583a20pJ92n6j3j41J64J06L32j11k59j41P4N3J46K2q7j02l47M38n26L87L3p2
3606c5K61l68NJ1O6j04o8J36K02k31R4M39k73q5J07N7l18K41j27qmO7M3P3O3k55
$$ plain form
3445 -11 -105 -406 -478 -25 -184 31 -83 0 73 -196 -3 154 77 136 173 317 137 353 35 317 -82 13 -154
3468 -154 -52 74 59 123 -9 9 -131 8 -314 56 -49 -200 43 -114 -384 -35 -117 99 -225 21 96 58
3490 58 234 68 44 83 179 90 315 -108 -343 -104 69 182 -36 -129 4 -357 -147 230 -45 215 -173 -92
3512 -92 -209 34 90 41 -44 26 116 -422 19 26 30 12 -214 48 37 239 0 85 -67 -239 6 79 126 38 265
3537 265 -183 -297 -11 -187 -181 -346 -132 -214 49 87 -399 -98 -245 -413 -58 -81 64 -13 41 -10 -147 167 208
3560 208 197 413 -200 1 -2 82 360 169 -169 -28 -439 15 68 -224 -85 -248 -317 -27 -83 21 -81 12 -120
3583 -120 -127 65 9 -4 -145 19 125 457 346 87 -54 20 73 219 241 154 52 -295 143 -383 4 37 -35
3606 -35 226 -142 -137 -126 -60 -164 -232 -96 106 -125 -31 408 135 50 157 214 -104 137 10 2 -2 65 108 181 244 -11
3632a1J7k30l0K67K32k33j67J18l08J66K13j71rq7Q1J23p2K50p0k19K44N3j76
3655a9M04j7j75q6k91J26K90l26O7K5k3O9k52M07k85j70O3J34j00J20jj56O1J
3679a34M31m66L14m1l57L32m8j49J42K08n2q2Q9o8J40l81J54L1L3j65L77n19J07
3702a04p9J44j49ML6J27k1Q4r0j08J32k4J90lk81l9K33J29J77n49J41N2K02Oj18
3727I2p0J1j74L8K02j01K04k89l7k22R3K93m0o1jk1J6P9J45j3ko6L9L2j58L1J12
3754A32j75L2N7J36Rp5j30k8J39j77J96k30J54r6j33rJ49r2M0n6O5J03j57O7J64
3779H5l31J20K23R0o2J30k80m8m4L09j70n6L29l23p6K20l31J17lJ67j45j73M3
3802b09k2O9J62r2j88N7J67K80k80N8l7J14j47J13K49j85m6J69j10M8k31Q9r8
$$ plain form
3632 -11 6 -224 -254 13 245 12 -155 -37 -345 -179 34 -137 -146 -233 -152 -29 -101 149 79 -140 104 157 -19
3655 -19 385 368 193 107 -184 -58 232 -94 -27 -2 -25 44 -208 199 -86 -256 -193 -59 -159 -39 -40 -196 -135 -134
3679 -134 297 -169 145 104 -253 79 31 -118 24 232 180 98 187 119 259 -122 32 63 96 -69 308 -211 -104
3702 -104 -183 -39 -188 -184 -148 -21 -42 42 -48 -156 -24 -48 142 139 -142 -181 52 181 358 -191 -50 2 204 210 92
3727 92 22 33 -141 -103 99 -2 202 -87 -124 -346 -253 40 0 -61 -62 -83 -67 12 157 144 142 76 115 147 -11 20 132
3754 132 -43 -11 46 182 191 116 -14 -42 97 -80 116 -114 40 -56 -189 -198 -49 -141 -101 -157 -92 11 -146 -79 85
3779 85 -246 -126 97 187 125 255 -25 -73 -117 192 22 -34 295 -28 -104 116 -215 -98 -101 66 -79 -252 -209
3802 -209 -231 -162 0 -92 -280 -223 -56 224 -56 2 -35 79 -68 45 294 109 63 232 122 170 -61 28 -70
3825g0J47j80o8K48J7k35O8q5K63r2Q8p4l75K90k58RL08k87M45m9m6NJ7J11r2
3850A05j63K74j02k9J32k8j53j7k28K83J78k05n7j39J19J18L3l14L0j2n1L3J74
3873a9K70k31K43k06m7L19k34O5P1K2j57P3j85K54k35Q6J37l22L21k80j56L74
3895A63j68j84J29j74J25o8K92j38o8k09L20j60r5M97k75O3Q1j54K6j58Q1K23
3917A49j20K57k5k31k74J39o0K76l5Ql02K72J37j36Rk58J75j44J07j08J16K72
3939B24l37J00j20J84J91q6m5pj02J53j71R2L56m88J72j55J34R6j62K5M5k77j80
3962c58K84r4Q6O4oP4j58j95K84J81Kj93m5L63k25J47k51k6L49r5r7r1M9n8k54
3987b63K81O5J05j06l31n7J38J0J04o4J23k6n0J13o7K2kj58Rk6J48J24q5l8j89
$$ plain form
3825 -70 77 -103 -171 77 94 -141 -73 -158 105 13 101 27 -348 -58 -316 -307 1 -286 159 110 64 69 86 197 105
3850 105 -58 216 114 85 217 189 36 19 -209 74 252 47 -10 -149 -30 88 121 -193 -163 -175 -226 -193 -19
3873 -19 251 20 263 57 10 329 95 160 231 253 96 169 -16 238 3 89 226 -96 225 -55 -211 163
3895 163 -5 -189 -60 -234 -109 -177 115 -23 -91 -300 20 -140 -235 262 -13 50 131 -23 3 -155 -74 149
3917 149 29 286 261 30 -244 -105 -165 111 76 84 -218 54 191 55 64 -194 -19 -163 -56 -164 -48 224
3939 224 -113 -13 -133 51 242 156 111 104 2 155 -16 76 432 -56 116 -39 95 191 29 54 99 -178 -358
3962 -358 -74 -168 -82 -18 -24 50 -108 -303 -19 162 164 -29 -74 289 64 211 -40 -66 283 188 91 0 49 -9 -263
3987 -263 18 83 188 82 -249 -306 -168 -158 -54 -118 5 -21 -71 42 -25 -3 -5 -163 -154 -180 -32 92 7 -31 -220
4012b20K99J00M1M7o3n19K59Q0j52K84j48R7o9L4j33j38J22K74k22m3j8n7J42
4035cr7N9Q0l3J18P0P7k82oJ74l2or2j70J47j7j46Q6j13J73kL7j41j17J99k09
4061b46J98l79L76J93l51O2P9o9l6N09j35q0k56M1J98r3Q1J32k11J23k08M1K86
4084B55k27l9j52J18K52j57j90j1p0K12k16K25n6p3k56K87j22N34l11J07q5j3
4106A2K15j74j10L15K7l85J30K2J48q6j77O1Q4l10K27k04P6Q6j50M6M3j06K55
4129D5o5Q7l1o6l5l0Q2J0K4l00L64j78K56m5J15j75J01n7P7J68j71l26K32j07
4153b5J99l84m7L13k56j4jK86l1R9o35K60L17l31K19l2l9p3J99J83k46K26m51
4176b64K19K63k72k4K55k25K14k85J84j92k04M40l48L4R0M9J3L6p1J28n8JR1N7
$$ plain form
4012 -220 79 179 220 267 204 -315 -56 24 -128 156 8 105 36 70 -63 -201 -79 195 -27 -70 -88 -145 -3
4035 -3 -100 -41 39 6 124 194 271 -11 -17 157 125 119 27 -143 4 -13 -159 -73 -186 -13 -15 22 -119 -236 -37 -246
4061 -246 -48 -427 -51 142 -209 -147 -68 -137 -173 336 201 121 -135 -94 104 11 92 224 13 136 -72 -31 255
4084 255 28 -11 -163 -45 207 50 -140 -151 -221 -9 -225 0 -56 -129 -385 -98 -220 314 3 110 25 12
4106 12 227 53 -57 258 285 -100 30 52 200 114 -63 -2 82 -228 -1 -205 -129 -43 -193 -147 -104 -210 45
4129 45 -20 67 36 -30 -65 -95 -13 -3 21 -279 85 -93 163 118 233 58 159 102 179 347 176 -150 82 -25
4153 -25 174 -210 -257 56 -200 -214 -215 71 40 139 -496 -236 81 -250 -31 -63 -102 -175 24 207 -39 187 -264
4176 -264 -45 218 -54 -78 177 -48 166 -119 65 -127 -331 109 -239 -205 -115 -66 -53 -17 -88 40 -18 -17 74 131
4200A31j08j48J2P3L49r4j12k27K14k4K8j23J54k26k29K10L66m06J83O8k75J28
4222e6N5P5k68K59q3M9nJ66j90j10K70k99J94J58j64J84L7r2J46l27J24j33K56
4245B46k08k43J0J74j16L52m03K55k15J85j12K16k98O0J32p1J67k01P5P8k64M8
4267a33J46nj54J93M3j19k6J05R1J58n35L25k71L6L43j02j70k22M85l78L74j61
4289B3j39j73N01k91J54N9j76MK0l8K6K2K6J06k61K65L0j64o9M06j89l00K81j40
4313a7J37k13J46o8k10K78r7P4k77M5J32n3P9J66J1j72o2P0j15J04K12m2j34M0
4337C4Q3n5J13j30K1N4j38j4j08J15K05m07J3O6j00K53OJ2Lj55n6J32M2k32J99
4362d4j50J6L89k07N8lK59l64pJ29q6J62k18L0O4j39J77P5k04l73L66L7j11N0
$$ plain form
4200 131 23 -125 -113 -40 309 215 103 -124 90 66 94 -29 125 -101 -330 -120 246 -160 23 91 -184 -56
4222 -56 -1 74 -194 65 -18 31 26 192 2 -108 162 -137 57 215 51 235 272 180 326 -1 123 -10 246
4245 246 38 -205 -195 -21 -137 215 -188 67 -148 37 -75 141 -157 -97 35 -36 131 -70 5 83 -181 -133
4267 -133 13 8 -146 47 90 -29 -55 50 141 299 -236 89 -182 -146 197 95 -75 -297 188 -190 184 23
4289 23 -116 -289 212 -79 75 134 -42 -38 -18 -56 -30 -8 18 124 -137 128 158 -6 -75 331 142 -158 123 -17
4313 -17 120 -93 53 -15 -225 53 -44 30 -247 -202 -70 -123 -44 122 133 -39 -101 -31 -146 -42 170 128 -6 34
4337 34 117 62 175 45 66 120 -18 -32 -140 -25 180 -227 -214 -148 -248 5 11 23 26 -129 -185 -53 -11 -243 -44
4362 -44 -194 -178 211 4 62 59 318 -46 -53 76 -10 152 -66 -36 28 -111 66 141 -63 -436 -70 -33 -144 -94
4386i4o7P2l36m9K80L79j7j17q7J23j14J32m9MK26j64j98J14m3j24J43k25M2Q8
4410h1M55o31K45p8L8m4k25M67k15J57k77J71R3j88J13k8J27K00l76L70j84k11
4432a02J06N4R3n8q5q8M56m04m7L69p43N67o9l81J15M4K35j56m8k1J01L9J97k02
4456b8R7m9k4k7M4n5L9k0K7n0j76K97lk53L00J39l55K13n8j72p8K29j84RR0J86
4482A38O1m07J87K27l48L4OK01j12JK6J80n5j58J73j13Q9N9k4j75m2J05k88K36
4506Aj6m6j14J22m4O7j24L5p0L07j42J46k47L79p8k10J9K41m35J69J62j18pJ8
4530A5L1K1j36m6L27l81J33m5Q1j89M9M2p9Q5K0j29K20P1l16L8J38n6J09R9j14
4555a2J32J00k19L79j60l64M7P1J45j13LR6j48O1j09M5K9k16J0K94m0j66K62k37
$$ plain form
4386 -94 -161 -89 -425 -474 -194 185 168 51 -36 87 -27 105 56 60 286 122 -76 38 -5 -129 14 -211 -169 -81
4410 -81 374 -257 -12 -90 -52 -96 -321 146 -69 88 -189 -18 75 -113 0 -28 99 299 -77 293 109 -102
4432 -102 4 58 151 93 8 -80 376 -28 -75 294 -449 118 49 -332 -217 -173 62 -94 -142 -163 -62 -23 174 -28
4456 -28 69 20 -4 -31 13 -42 -3 -23 4 -46 -222 75 72 -181 119 258 -97 116 58 -114 -192 37 -147 -138 -48 138
4482 138 199 -208 -21 206 -142 -108 -102 99 -13 -12 14 194 139 -19 154 41 130 189 165 -10 -52 53 -235 1
4506 1 -15 -61 -175 -53 -97 -30 -154 -119 -189 118 -24 122 -125 254 176 -34 -15 226 -209 -40 122 4 -3 15
4530 15 46 67 -69 -115 212 -169 -36 -81 0 -189 -140 -98 -177 -92 -72 -201 19 90 -226 -188 -50 -106 3 102 -12
4555 -12 120 220 1 380 220 -144 -97 -26 119 6 9 105 -43 18 -91 -46 -17 -233 -223 71 31 -135 127 -110
4579a10o6K7O2J74l15K07P9n9P8k19J79j07J48k72L42l0l04K75M1j6J13m65J60
4602g8K42j35o8j58j33K73j11j08L13j00J86k20J40k80k5L15j84K08k14j8J07
4623d8j79L75j33J00mk37O05k13j61R5r5M7j90K55n80N50m72L21N9Q9q5k06j93
4646c00K98J86j66Mj29Q9P2J33k09Lj32L2m8K4N6L3P1M1j73o4m8J43k02L32k83
4671b37J37K29l9k09J25J27lj11Q1K66l93q6J12J68j92R0J8K10k84Q9L5l83M16
4694A66n9N3k29L0K32k01k25O3J78L1j97k19L72Q3k98L31j58m1O7o3K00K4l27
4717a87L20m15L86j75J00j18J52k9P1r0j99L16k15J08k39L91R4k45J8J47k31q
4739d8K8j66K74j64n2Q0P5Q0q7J32L5k98K47j7m2j48J93j94j2J65o6J84j34j3
$$ plain form
4579 -110 -176 -149 -87 87 -228 -21 58 -1 77 -142 37 -70 78 -194 148 118 -186 89 130 114 227 -238 -78
4602 -78 164 29 -39 -197 -330 -57 -168 -276 37 -63 123 -97 43 -237 -262 53 -131 77 -137 -155 -48
4623 -48 -227 148 15 115 111 -126 479 266 105 200 105 152 -38 217 -363 187 -285 36 95 184 99 -107 -300
4646 -300 -2 184 18 22 -107 -18 54 187 -22 -19 -151 -119 -167 -143 -87 -54 17 58 -115 -179 -227 -84 -286 46 -237
4671 -237 -100 129 90 -119 6 133 130 19 100 366 -27 -113 -1 167 -25 65 83 293 9 98 133 -250 166
4694 166 107 160 -69 -39 193 -8 -233 -170 8 39 -158 -377 -5 78 -220 111 -47 -88 -21 -84 116 140 -187
4717 -187 133 -282 104 -71 29 -89 63 34 105 15 -184 132 -83 25 -214 177 271 26 44 191 -40 -48
4739 -48 -20 -186 88 -76 -128 -48 27 107 20 152 187 -111 136 119 77 -71 122 -72 -84 81 15 199 65 52
4763E2j26k9J29M3r2K3M0l67M45j56q2Q3R0k12K03mr6L10j25j52JN3K03k81P8
4788C1J22k1q9K28j96M2k27ok2KK71m7M1j89q9O7K25j40K5j94P6k0J32K9nk08
4814a62O0L39l13K23j02q1J33p7P1jp2k43J69j13K69k31M5J81q6%o4j00K57m8
4838E4o5j13j68K18N0K72l22J12m9K80k68P0K07j19r5R3j74q6J49M1j13K05k1
4861A58q5j70J97r7J84j56k46J00K9j05R2J26j80J32m6l7O9n6J26j62K3J80o3
4884A3j04q7J89P1k50J1L36j01p9L5K5j33J30k54K79o5Mk70K16N5onj42J43J05
4909A16K8k28K54j72o9p4P6J78k25Q1j34J25j2P8J28l27J16J96p7q6K16l12J90
4932F6K9L2j58r2k2j45M45Nj57L0J70j54p9oK41j72K39l4o2k1k14J98k29K1P6
$$ plain form
4763 52 -74 -103 26 69 -23 0 40 -327 118 -38 -120 -37 53 -159 44 40 -56 254 129 -23 -22 31 234 -47 31
4788 31 153 132 43 271 75 117 -110 -116 -138 -136 135 88 129 -60 -149 -82 143 3 28 -166 -90 -110 22 51 46 -162
4814 -162 -102 237 -76 147 45 -36 97 20 91 90 18 -225 -56 -169 100 -131 -86 95 9 9 -55 -155 102 54
4838 54 -11 -124 -292 -74 -24 248 -74 38 -11 269 1 71 278 159 64 157 -17 -103 46 87 -26 179 158
4861 158 73 -97 100 3 187 31 -215 -115 -86 -191 -99 27 -153 -21 -67 -104 -35 -91 35 -127 -104 76 13
4884 13 -91 -178 11 82 -168 -157 179 78 -1 34 59 -74 56 -198 81 16 20 -250 -34 21 15 10 -132 11 116
4909 116 144 -84 170 -2 -71 -145 -69 109 -116 -35 -169 -44 -56 22 150 -177 -61 135 58 -28 188 -124 66
4932 66 95 127 -31 -123 -145 -290 155 160 3 33 203 49 -30 -36 205 33 272 238 176 155 -59 139 -90 -69 7
4957GO6k02M5J79j74L8M6J34j12j11j26J49K55l73J08k6P2J84K9p1M0m03J76L54
4981B84j48l%j42L1j76J65k66K16n3m4J85j90M2n6N7oR0j04J05R5o6j49K36k67
5006a64K64k02J88L2NJ11j44j4N6q0l1K16r6Q8j79J01M9j44j59K48k83J08J53
5029A23k65O7LR9NJ5o0M6J39Nk72J37j13l5K5K74l33K37J54m05K32J32l87Q2K14
5054A19q1j32L06n6k01j32j75L20P4L3m5k81K66p4Q3l3j31J33pK31kj5Ll33J0
5079a20J28q8N7L0j88N6J1R3o5K2o8o6K10Qq4J86N4k27Pj56K13qk19K04N3j36
5105i3K6P4rJ21P3j3k45j5L0J34q0n6j50q1M96l23m3j97L7L06K8k4n1n1M2J7J78
5132A31j03MJ08o2K4n1O3j17J68k74N4J66j15J12n3O3r3k65J03J11k12K04q8R5
$$ plain form
4957 7 73 -129 -84 95 -79 -41 5 139 27 -84 -210 -61 194 -179 -71 -97 -25 159 188 117 157 -246 -70 284
4981 284 136 133 133 -9 22 -154 11 -255 -39 -92 -136 49 -141 -99 -155 -98 -104 -14 -118 -13 82 16 -133 103 -164
5006 -164 100 -102 86 118 123 234 90 76 132 52 21 237 141 229 50 151 200 56 -103 145 -138 -30 123
5029 123 -142 -75 -72 27 32 47 -13 33 172 177 -95 42 -71 -106 -81 193 -140 97 251 -154 78 210 -177 -95 119
5054 119 38 -94 212 156 -45 -177 -352 -32 42 75 30 -251 15 -59 24 -9 -140 -7 -14 217 215 200 203 -130 -120
5079 -120 8 -80 -23 7 -181 -125 -114 -21 -86 -64 -132 -198 12 20 -64 122 176 -51 -44 -200 13 5 -214 -10 43 -93
5105 -93 -67 7 -2 119 192 179 -66 -81 -51 83 3 -53 -203 -284 212 -111 -154 -351 -314 -8 20 -4 -55 -106 -64 -47 131
5132 131 28 32 140 78 102 51 114 -3 165 -109 -55 111 -4 108 55 118 25 -240 -137 -26 -238 -34 -122 -27
5156b7P6k12K20j56j39J92R6j53J53JK53r0j34j16o3J10J23r2j04K33p2K3j48
5179b6j30Q7J13P2j60r3J56j35R7K9K1k44J75Lj37J12oJ49n7P7k17j36K96l2j22
5204a08L13j82J19m02J40J88j10O1N7J6k20J14rR0l62K14K48k71oQ1J37j16j85
5227a93J15J77P8k95j15M69m7l3m8k11N9m1J94N7j4j51K48l87K11k30J20p3J53
5250D3k37L03r4N1k70K22K0J3j71J66j79L09L1k93r9L71k82K00Q1k55J99k9J9
5273A19j24K72l25k01J86j31L38r1j87J13Po9k2K56j63q2J14m8q9J8O5K49l82
5296a77K54P9p5K13l37J51L5k6Kq6N0j76O7J10O0j73J66o5m45L49J46j84K5k1
5320e8o1J62K51j62k71r5L11j66K89j91K48j57j21J74l91L88j31Q2k48J70J70
$$ plain form
5156 -27 49 -163 57 -99 -238 -46 50 -103 50 51 304 214 80 -36 -99 11 134 42 -62 171 99 122 -26
5179 -26 -156 -69 44 116 -44 -137 19 -116 -19 10 31 -213 -38 -35 -172 -60 -66 83 26 103 -114 -250 46 14 -108
5204 -108 205 23 142 -260 -120 68 -42 19 76 92 -128 -14 -23 67 -295 -81 167 -104 -110 -29 108 -8 -193
5227 -193 -78 99 177 -118 -233 236 189 156 108 -103 -44 -85 109 166 152 1 249 -138 73 -157 -37 -110 43
5250 43 -194 109 15 66 -204 18 38 51 -120 46 -133 176 207 -86 -185 186 -96 104 185 -70 129 100 119
5273 119 -5 267 -58 -259 -73 -204 134 43 -144 -31 -24 -93 -115 141 -22 -104 10 -38 -127 -109 -44 205 -177
5296 -177 77 156 81 294 -43 108 143 117 119 33 83 -93 -26 84 144 -29 137 72 -373 -24 122 -62 -37 -58
5320 -58 -119 43 294 132 -139 -234 77 -89 200 9 257 100 -21 153 -238 150 19 101 -147 23 193
5341A93k30O7k52k2Q2K34q3j03J62N4j7k55K84l84K36j14J02M9K15k52O9j08L
5364g0J17n1j33rr8L55N6k28m5r1K80N7k98M40l74K0Q0R7j52K30m30J66KJ89j49
5389c9R0j06R3J65j94j86J69P8k2o8j47K37Q6J3k31J70J3q9M8l16J12M4j50M25
5413A95k41r1k0J26o3J47P1Q8k94j9J34l6K05k38J06N1p5Nk0J07J0m2M1O3j18
5438I2qM9k7J05k6l25K22k58J67p6K3J54m17O6K82r7j20J69J67r4l0J18k18J05
5462B3J31r8j43Q0j01L5J1L73o5l03LPJ2r5J9l8P2k5KK05k99M44k14k03K07k02
5488a62K39r1J44k64K27Rk89J87K61k94Q9j0J72l53R3J34P5R7o44L33q2J37p9
5511g1k5K18k95J36J60k58q6K34P5JL4M9K8m05O7m4L35k7j62K38l25K68j31r4
$$ plain form
5341 193 -37 30 -222 -244 -162 72 -11 -114 48 102 85 -170 114 -270 -34 -148 -46 3 218 -34 35 -73 -70
5364 -70 47 -4 -137 -146 -244 111 167 -61 -106 -197 83 140 -158 282 -92 -72 8 105 -47 183 -247 -81 -79 110 -39
5389 -39 51 -55 38 203 9 -177 -8 70 48 -20 -167 70 156 169 -62 108 121 32 80 -236 -124 -80 -230 195
5413 195 -46 -137 -157 -31 -94 53 124 212 -82 -101 33 -3 202 -36 70 121 46 51 31 138 148 106 147 210 92
5438 92 84 133 106 211 185 -140 82 -176 -9 -85 -62 92 -325 -259 23 -74 -194 -25 142 48 18 136 -82 23
5462 23 154 56 -87 -7 -108 -73 -62 311 246 -57 -54 -47 -35 -130 -111 -149 -77 -102 -100 105 -194 250 36 -167 40 -162
5488 -162 77 -14 130 -134 93 102 -187 0 261 -33 56 46 218 -135 -42 92 167 264 -380 -47 -129 8 -71
5511 -71 -96 122 -173 -37 123 -135 -221 13 88 89 123 172 200 -205 -138 -182 153 126 -36 202 -123 145 14 -80
5535h0K39j48p3o4J76k52N0J38r6J31k95K11jk41K28L14l64K83k2L7j66j43K20
5558H2j82j13J29N3J53k32K37j7k43K45K9l94J71q4Q4M3K13l17j7O2J51jr0j83
5582b21J38K5J1O3Q0n7k4J94j15J2J12j50j53K07p3k46L15j35k5n0k1P1j5J73
5606A16L3j64p8J5J25j89J89o5j80M8J31J79m2p9pJ46j13J54k45j32M05m07J94
5629C4j34J06LP9j14J18k39K68q7j97K01r9J66j75P4k18K49Mj6M0J52o5o3r4K0
5654A3L12l65J34o7l5K18k23m9J1K53k77K91k78P1j38O2kj16K57q4k30L91k08
5677e9J36l5N7l56L25K06k52J11m08M30j82K07m4N1j71n0j00K25J13l92L52k09
5699d5j89J47N0j69K86k47J6J01N2O1j91Q7n8N8L32k53p5K9K09k24J30j28q6J63
$$ plain form
5535 -80 159 11 -62 -126 50 -202 -152 -14 -110 21 -274 -63 -64 -305 -77 237 -127 156 134 171 5 -138 82
5558 82 -100 -213 -84 -31 122 -110 127 110 -133 112 141 -253 -82 -166 -82 -39 174 -143 -160 -98 53 52 -38 -221
5582 -221 -83 -58 -47 16 96 39 15 209 94 106 218 68 -85 122 49 -197 118 -17 -42 -92 -113 -42 -57 116
5606 116 149 -15 -93 -78 47 -142 47 -18 -198 -150 -19 160 118 39 32 178 65 219 -26 -158 247 -160 34
5629 34 -100 6 9 88 -26 92 -147 121 34 -163 38 -61 105 -70 4 -214 35 39 23 63 215 150 87 -7 13
5654 13 325 -40 94 27 -8 210 -13 -62 -51 202 -75 216 -62 9 -129 -67 -69 -185 72 -12 -242 149 -59
5677 -59 77 42 99 -257 68 274 22 133 -275 155 -27 180 136 187 16 -34 -134 91 204 -188 164 -45
5699 -45 -234 -87 -37 -206 80 -167 -151 -50 2 63 -128 -41 -99 -41 291 38 -37 -8 201 -23 107 -21 -107 56
5723E6o1K14k45j15K19j61K2J77o7j40K91l31l5L46j99n2J17j10J01J11p6n6j5
5746in5l7K03j24N1k18Q6L27l0l27J96P2j33j60L12r4j93O7J37l12J62M2L17l11
5770c1j90K47k17J41J58j85J26J29r3k40J52J17k76k4J7K26K06k64l8J15j8m0
5792A8N8j28n8J85k37k4r3M90k63j73l8J89J71n3J48k96J09M3j52O4J18O2r3q1
5816c4l0j47Q4L2J86r9J89j46N0j70K15k47J60N7j1k27K36k51J86k01J19J67k4
5839I4j87Lp6K34j11P7k1n2r9J26p7L21j54P5j85lj34J29o0JK15j79J8r5L62l75
5865a53n9K69j91L70mk78J9L8j99L23N0l94M23n7k72p3P4J01o9l0q0O8o9K01J08
5890A16j58k27L72nl12K37j97k2K45j31o3J33j25k05K37j66J60QL64l81R3j23
$$ plain form
5723 56 -5 209 -36 -151 68 -93 -71 106 39 -101 190 -141 -176 170 -29 -81 36 -74 27 138 62 6 -9
5746 -9 -64 -101 102 -22 29 -189 -103 224 194 -133 63 135 2 -158 154 60 -133 -66 71 -241 -79 -37 280 -31
5770 -31 -221 26 -191 -50 108 -77 49 178 85 -155 -3 114 -162 -186 -169 57 263 -1 -39 76 58 18
5792 18 76 -52 -110 75 -162 -186 -279 211 -52 -225 -263 -74 97 44 192 -104 5 48 -104 -40 78 140 47 -34
5816 -34 -64 -211 -127 -95 91 -8 181 35 85 -85 130 -117 43 100 89 -138 98 -153 33 -168 -49 118 94
5839 94 -93 -90 -166 68 -43 34 13 -39 -138 -12 -89 232 78 153 -32 -35 -169 -40 -100 -99 116 -63 -45 -140 222 -153
5865 -153 -212 57 -134 236 232 -46 -27 11 -188 135 185 -209 214 157 -115 -188 -114 -13 -82 -112 -192 -124 -193 8 116
5890 116 -42 -269 103 98 -214 23 -174 -196 49 -82 -145 -12 -137 -342 -105 -271 -111 -103 261 -120 -27 -150
5912a50K40j89J40J7O8k57K82N7k30J24r2q8Q5J17r1J62m40J37R5K01k45m9K32
5935A26k87K24K9j62J89l02J14K05r8n5K8J11k8j84J90o6L5j86L16r2j50j92L33
5958I8j63K8M27l18rl55M76k78K02q1p7M6J1KL7k8P0k45J13O5O7j29J89j90L0
5983a2L14k41o0L87l15k29Q8N9J61k72J98k34k7M1o9RL45k97K07Q2n6q6j81K56
6007F8pm4Q6j51J37R2o9J2k25K94k05R3J94j85j9O8k18J35j79j2J40J86m20o5
6031b94Q5J81q0JK44K1k31k8K86L2q5R3l22j64J86J7K19J9k47K58l17j8M00j79
6055G7p8J55j94l8J0o1K28l60P4m0K77j70J79j11K51k82O6k2j30K43Pk51K27K11
6079B68j78n2r1j6J55j4k16L62l24M6J21j93n1L71k31k53N1K05J32k83L69k44
$$ plain form
5912 -150 90 -99 41 58 126 -131 151 208 -22 102 10 -78 7 124 33 195 -245 -108 -13 188 -57 -106 126
5935 126 -161 63 92 -70 119 -183 -69 136 38 -17 11 122 94 -90 100 34 69 -117 199 107 -43 -235 98
5958 98 -65 -37 390 72 63 -292 184 -94 108 27 -50 -4 7 9 46 18 88 -157 -44 21 88 -41 148 -42 -12
5983 -12 302 61 1 388 73 -156 -68 -9 152 -120 78 -156 -183 -142 -211 -202 143 -154 53 135 79 -7 -188 68
6007 68 61 17 103 -48 89 181 112 124 -101 193 -12 81 275 90 71 139 -79 56 -123 -135 5 191 -229 -294
6031 -294 -209 -28 -108 -107 137 158 -73 -101 185 217 132 225 -97 -261 -75 -58 161 180 -67 191 -126 -144 256 77
6055 77 -1 154 -40 -78 -68 -129 99 -261 -187 -227 50 -120 59 -52 199 -83 -17 -39 -169 74 81 -170 57 268
6079 268 90 38 -53 -69 86 72 -144 218 -106 -60 61 -132 -183 188 -43 -296 -245 -40 92 -191 178 -66
6101f6N8K7j45J14j68J15K14k46L0K42J61l75K03j69k10L25k66P6Q4J22j08j29
6123a11K7m5K1R6j27J41J34k56L08j32j72L16J13m58M7PM7R9lr6J12L39j91l60
6147a44J65p2K0N0J00r3Mj62O5m6K28l85N45k45j79L39k88j44K66J26k09J15k83
6170b27K33K27m46K38lQ4j05j32j16J15J24q8j21P9K45j5L7j88K63r7j85r6N0
6193a24q8K44j57j1j16KM21mj99r1j00K56N2j84P4k47M17k40J9Q7r3J28N3o0k67
6218b28J99Oj62K19j01L30j86Q1l05J59j01R5J10r2mk7J23j49j3N1J54j21Q0n2
6242F6l67L53o0K52j65J97k58l8r5QJ38Kk9k01M66m19n1L22r9j3Q9k0l3j81L58
6267B22j80J2o7M9k8j19R3m7R8P4j28K08l17R5J74j64N5M5M4k09k3J31J29o7R8
$$ plain form
6101 -66 -8 19 -126 -12 -180 -65 149 -97 -67 175 336 -39 164 -5 -215 110 -156 -80 4 126 18 -111
6123 -111 -84 -129 -108 -12 -139 2 136 -120 188 56 -116 200 313 -145 -98 -91 -44 55 52 -44 68 407 216 -144
6147 -144 21 -51 -31 19 119 26 30 -132 -67 -113 115 -270 275 30 -149 190 -98 -242 24 150 -59 56 -227
6170 -227 6 233 -213 25 22 106 1 -131 -247 -132 -8 -96 -217 -138 107 92 129 -59 204 107 -78 -174 -124
6193 -124 -212 32 -125 -136 -252 -250 171 167 -32 -123 -223 33 85 -99 -25 -272 145 -95 -76 11 -82 46 99 39 -228
6218 -228 -29 -23 -185 34 -67 263 77 158 -147 12 -89 6 116 24 20 -7 116 -33 -46 5 159 38 118 66
6242 66 -301 52 -8 244 79 276 18 -20 -115 -107 31 33 4 -197 269 -150 -201 121 22 9 98 78 45 -136 222
6267 222 42 54 -13 36 8 -111 -18 -65 33 107 -21 187 -130 -35 139 -25 30 75 119 -90 -113 18 147 80 178
6292A78q6L1O7N8l35K52p6m8J02m34J21J52j99K46J67l24K95r0M7j19j47O8Q5
6315A1j72o0J83j3k57J70j60K15MJ3M2jl9l5L0J86j66r4j05K03N47m35j50K49
6339A66Pk06l00K14%m9K80j37J47Ol35L25k61K29j00m1J47j90K05K4k02K37j31
6362C5j40K8K29k56N7K5q3O0J83PN3l52k6K95r7j2k7p7K90m38J56r7Q9K71k48
6387g5k3J53k09QJ84p2P6o1J51N5k02J27J80l66J34k69K13j2q7J87k65K10K6j43
6411h0J1l4j5J3J98k09l9J43qJ59m57J44JN5L02k81M2K69m15K05lJ73Q6k92M0
6436HlJ82k10J11r8l8L70l62j06J3l3J04J39J06j66m6J44q2j18R8J0k7j87L8Q3
6461g0L67k13K5r1J74m8N7O3k84M1K68m46J16J15P4r1q7P1P6l16L02K2K2k89j62
$$ plain form
6292 178 92 123 190 248 -87 165 89 41 143 -291 -170 -18 -217 29 196 -128 167 77 124 5 -142 -74 11
6315 11 -161 -221 -38 -51 -308 -138 -298 -83 -79 -66 -24 -25 -64 -99 -69 117 -49 -143 -248 -45 502 67 -83 166
6339 166 173 -33 -333 -119 -119 -168 112 -25 122 128 -207 118 -143 86 -14 -55 92 -98 107 131 -71 166 35
6362 35 -105 -77 152 -104 -47 -22 -105 -45 138 145 198 -154 -180 115 18 6 -21 -98 192 -246 -90 -187 -98 173 -75
6387 -75 -98 55 -154 -146 38 -34 42 -19 132 187 -15 112 292 -74 60 -209 4 -8 -95 92 -173 37 63 -80
6411 -80 -69 -103 -118 -105 93 -116 -155 -12 -20 139 -318 -174 -173 -118 184 -97 -55 214 -201 4 1 174 260 -32 8
6436 8 5 187 -23 88 -10 -48 322 -40 -146 -133 -166 -62 77 183 17 -29 115 33 -85 13 23 -4 -191 -153 -70
6461 -70 297 84 109 18 192 144 201 264 -20 21 289 -157 -41 74 148 57 -30 41 117 -199 103 125 147 -142 -304
6486c04N26m07L32l4Qm73L37J49r0R8n7j34K03j35O0k13J65r6nL21l72K02j26
6509d5k31M02N8k65J67j6p8J06p9j30J31k03K95k66J68K6K83j34j00R7Nl14J17
6532fj13Q3O6P6Q3j89j19R3kK1K19m95R1L06k72J21K9K7k66J73K4J3l5J2J19j7
6558D2J60k95K6L74m72J85m7j91P0K41N8p6r6k1k57M98j43r2n8m3J22Q4o8l52
6582c51J83K0J54P9j33Lp0J71k08K91j53n4K51q1k48L00k65j07L38O3kl79qM02
6606A96k63L76j91j71k6j01K10k57K19J00k34P6L15m39M4K30j97J69l8L2J8Jl53
6629b84K97kj27j61M90j16q1J70m80L44j71J60Mo2O3L3k64P5J69l3o4J68j10j72
6653a54j36K03L23k67R1J96m28J79k40J56L10q7k83J06O5m21L28J51k08N6J40
$$ plain form
6486 -304 222 -185 147 113 121 -352 -15 134 44 142 85 -49 154 19 79 -134 31 -65 -70 251 -121 81 -45
6509 -45 -276 126 184 -81 86 70 -8 98 19 -111 20 -183 112 -154 14 40 323 189 89 186 191 -123 -6
6532 -6 -119 -36 30 106 189 0 -119 -26 -28 -7 212 -283 -192 114 -158 -37 -8 19 -247 -74 -50 -37 -72 -60 59 42
6558 42 202 -93 -67 307 -165 20 -27 -218 -148 93 151 75 -21 -42 -299 199 56 -36 -94 -137 -15 69 1 -351
6582 -351 -168 -148 6 85 -48 -45 -115 56 -152 139 -14 -68 183 102 -146 154 -111 -218 120 183 181 -198 -206 196
6606 196 -67 309 118 -53 -79 -180 30 -227 -8 92 -142 -66 249 -190 -146 84 -113 56 18 50 68 69 -284
6629 -284 13 11 -116 -277 213 97 16 186 -294 50 -121 39 43 -19 44 77 -187 -112 57 24 -40 128 18 -154
6653 -154 -290 -87 236 -31 60 256 -172 7 -233 -77 233 146 -137 -31 34 -387 -59 92 -116 -60 80
6674H0Q2j63O5L4j48J88k05Q9R8j06r2o4J69R5P2k97N8j8J40m3Mk79M08k77n0
6699a60K92k54J30qj34Q2j43K15J07k22J45l07M69k44k87K79k0K05k18l6oj43
6721b58K72N3l2NO8J78k12j99o0P2j0rm8K27l6J31j06o3K13j44j43J01N6O3j77
6746e8Q5RJ37J3rl9l00J37j97J61K33k30j6K35k21K00l95K31PNj00J74J00j08
6770E4p9j76L77o5k24k4J40j40L41k11j42K84P1m6l1K6q3k48K82m6n8L02j19l17
6794a32J26o8o0J7n6p8L97r9j17k08L40k73J77RJ88j87q0J20o5R2j18J39k2J02
6818A44M6l90L8J39K5r6L54k54p5l4L3R2j9j61N8J27k17r1L17j52K21j22R7l07
6842b27J70j72L45k31L20j41j69L26r1OnJ28l69O5q4J43n7P3j22L37l20j47L9
$$ plain form
6674 80 162 -1 64 98 -50 138 -67 22 120 14 -78 -142 27 122 194 -103 -45 -63 77 34 38 -241 167 -110 -160
6699 -160 132 -122 8 0 -134 -52 -195 20 127 -95 50 -257 212 -32 -319 -40 -60 145 -73 -109 -115 -258
6721 -258 14 67 35 40 108 286 74 -125 -185 -113 -123 -132 -180 47 11 142 36 -27 186 42 -101 0 56 119 -58
6746 -58 27 36 173 186 177 138 -162 -25 -222 -61 172 -58 -74 161 -60 140 -255 -24 -17 -12 -112 62 162 54
6770 54 -25 -201 176 111 -113 -137 3 -137 204 -7 -149 135 206 160 129 155 72 -176 106 60 2 304 185 -132
6794 -132 -6 -74 -134 -117 -173 -251 146 47 -70 -278 62 -211 -34 -25 163 -24 -104 16 -49 43 -75 64 42 144
6818 144 190 -200 -162 -23 2 -94 260 6 -69 -103 -70 22 3 -158 -100 27 -190 -281 36 -116 105 -17 80 -227
6842 -227 -57 -229 116 -115 205 64 -105 221 130 136 131 259 -110 -45 -129 14 -43 30 -92 245 -75 -222 -183
6865a83M09j80j82N9k4J6J95k78L30k0o8K38m41J79Mj7j16L2o2J05jj65Q7P0n8
6890g1q5K41j54K5J89l66J58k9L37k03l64L13o7L53j00l03nK27O4k55M0p6J89
6913E8k02L75p2J17m97K61m3j36K03j23K4J88J4o07M27j0n2N1j92J62K38k91J62
6936E5j51p7K94J7Mo7m0R9j21r6J48J88j96j78J13R8j20P4J04J15j44Q0l55J46
6960a0QL9j37L07k09j58j4N0K17j16P2M1r1M4l7j9Lp4M2q0mK1J67k21J35j63M00
6987B13l16J38K22k63n7J54j39K49k87K12j71j28K78j36j46j6L23r9k85K16L8
7008@j24Q5l0J64K0L7l42K17j25P9K01j03k41l5J23j01K92K1j98j19M28j31L4
7031A52o4j45R0n8j23K5R3K00l63K21N6j73O9M5N4q3j78L69j82L0r4j52J67%J85
$$ plain form
6865 -183 226 46 -136 -77 -101 -85 110 -168 162 142 74 312 -129 50 54 37 -79 -47 -109 -4 -5 -170 -83 -13 -71
6890 -71 -156 85 -69 -44 145 -221 -63 -92 245 42 -322 -9 -76 277 177 -126 -131 96 160 -95 -55 -131 58
6913 58 -144 231 159 276 -221 40 -3 -139 64 -59 -35 153 167 -440 -13 -23 -75 -24 -216 -54 184 -107 55
6936 55 -96 -173 121 138 142 75 35 134 13 -83 65 253 57 -121 -8 90 -30 44 148 263 119 199 -156 -10
6960 -10 -2 37 -100 207 -2 -160 -174 -124 93 -23 49 90 -1 43 6 -13 -10 -84 -42 -122 -126 -105 62 -159 -24 -187 213
6987 213 -103 35 257 -6 -63 91 -48 201 -86 126 -45 -173 105 -31 -177 -193 130 31 -254 -38 0
7008 0 -124 -39 -69 95 115 152 -190 27 -98 -19 182 79 -162 -197 -74 -175 117 138 -60 -179 249 118 152
7031 152 88 -57 33 -25 -148 -123 -30 170 -193 28 84 -89 -20 25 79 -4 -182 187 5 35 -59 -211 -44 -44 141
7056A41n00N57k27J2j18P8Ro8R6Lj16K8J97j63N3l3K16k5j6j43J56j44J84l04
7080a27K48n1j26J24j51M8J4o7J25M0Q2l39M6J78k64K88l33M21l30K0L9o5J06
7103g4J23M8K0O8j02J73k06K3L3j35J33K01m10R5o0j28J98N3j93K56j72j1J98
7126A31l5j52J04l97K55J29J40k73rJ89P6j17kk37N33l75l8K04n2J60m23L48k99
7149a40L15l61K85k7l2LK13l71K01k80L9K60k20K10Nj54j39L95j46n3k07R4J51
7172D1M0n1Q5J47j91o1j50L4n9J24J15M0k97L66k01l07M75l4O3m61L07q5J08m9
7196aj20R6j16k7k0K00RP0k21O9J91p9M8j45k24L9L53j14L1n5O6j61j7J21K2R
7222B4j2MN1j33k0p5K81o4o4O4Q2k02O4J83j15j14J05R0m2k10K75j73N6k5k41
$$ plain form
7056 141 -359 198 -29 -17 -135 -57 -48 -116 -20 -17 -133 -105 92 -71 -18 -51 165 140 124 -19 137 -7 177 -127
7080 -127 121 70 -56 68 -83 -35 -21 -88 37 77 159 -180 -134 44 -220 68 -265 156 -174 -154 -115 -180 -74
7103 -74 49 97 117 185 83 256 50 73 106 -29 104 305 -105 -10 -70 -198 0 53 -140 116 -56 -67 131
7126 131 96 -56 48 -349 -94 35 175 -98 -107 82 158 41 39 -198 335 -40 -78 126 74 234 -189 159 -140
7149 -140 175 -186 99 72 40 43 256 -115 86 -194 -155 105 -115 95 100 -54 -193 202 56 3 -204 -110 41
7172 41 81 30 115 262 71 10 -140 -106 -165 -41 74 114 -183 183 -18 -325 150 116 179 -282 25 -60 48 -1
7196 -1 -121 -25 -141 -168 -188 12 21 91 -130 -61 130 51 99 -46 -270 -231 122 8 39 -16 50 -111 -128 -7 15 24
7222 24 12 16 67 -66 -86 -161 120 56 -8 56 138 -64 0 183 68 -46 59 149 107 -103 172 -1 55 30 -211
7247b11M11j93k35K31NJ98l32o2K09l1J31n8k30J53j41L61r8K9j76K7L50m20J17
7270C5j1J47n2j9j31J9L4k97K49j12M6K21k48L67l58j12K81K8l46K42j17J69k9
7293FK16k57N9J48j91R6k61J80M0l3j08N5K51j21j37J81O9l67K10J37k35J56k53
7316a59ll2L41k3j45l9l4L3Q9J72k32P0j30J28K7r8l1L44j73j19%Q6K15k76L13
7341C24l24J55j97M0m4j22N1R9Q8j41M1M9k19K54K56l60q9J06J70lo8Q7J21j55
7365A19q7j49J30m6L24n17K39J82J5j22J42k49K9K07q8j87K34L1l79J91k2o6J05
7388C6mJ1j51K59j36q9M1J63m3j35q1l6L07j63j61L7j2N6K04Q8r7k32j6P6j23
7413b01L00j02p5j63K10J50j20K4j10J21j35K15r8l9J6j9k21L42j9j15j20K71
$$ plain form
7247 -211 200 7 -228 3 8 206 -126 -188 21 -10 121 63 -167 -14 -155 206 108 137 -39 -12 338 -82 35
7270 35 24 171 119 100 -31 -12 22 -275 -26 -138 -92 129 -119 248 -110 -222 59 87 -259 -17 -134 35 6
7293 6 222 -35 24 172 -19 77 -184 -4 36 3 -105 -50 201 80 -57 124 193 -174 36 173 -62 94 -159
7316 -159 -162 -194 147 124 -21 -60 -94 -61 28 200 -32 38 -92 36 63 -35 -66 278 105 -14 -14 72 287 11 324
7341 324 0 155 -42 -2 -46 -168 -117 -18 70 -71 -30 19 -200 54 310 -50 -139 -33 137 134 66 153 274 119
7365 119 32 -117 13 -33 291 -226 13 195 210 88 230 -19 10 217 129 -58 176 207 -172 19 -3 -69 36
7388 36 32 43 -108 151 15 -74 -33 130 87 -48 -129 -165 142 -21 -182 -145 -157 -101 103 191 94 -138 -154 -78 -201
7413 -201 99 -3 -78 -241 -31 119 -1 23 -87 34 -101 114 16 -23 -7 -26 -247 95 76 -39 -159 112
7435A12j43k0m0L75l48QJ8L4K6J91j06j93K5N6J11n5j72M29n49k55K90K57M0J3
7459A04J37m87L73K0P8r6J34n60O24m48J64j15J23Q7n02L20O0j07rK8o3r3J60
7482f8j7N0R6J11m30K13J32k11m8L26l0k75J66k5J5r3J31Q3q6K2k45M33k46J57
7506A61k96J61k6q1j41K3J82K29k54j28L30k8j2q6L27l07j5k14K76j51K29j59
7528B0R2k40J24L0r0J4k04L87k92L02k49J38Q8k0j87J82j69K19n9k62J63m1l7
7551i1J00j86k1L50Q8l45J62R2J63l87L03l7j40J31k96K30l25J31N6J73j94J20
7573G7jP3j41o0PJ99m8j24j12RJ53j55O0j75K50o6l6K57n8k04p7L32r4j90J68
7598D4m1J8j73K02n8M3j13O4J97L1Om06K20Qjl03N6K44l7n2K3K7N5J11M0k67J00
$$ plain form
7435 112 -31 -51 -91 284 -64 -56 -38 -4 22 213 107 -86 -61 -5 106 51 -121 308 -241 -496 -206 51 91 104
7459 104 241 -246 127 147 225 129 263 -297 327 -121 43 -72 51 138 -364 -44 16 -91 -100 -72 -135 -228 -68
7482 -68 -85 -35 61 172 -258 -45 87 -124 -172 154 124 -151 15 -10 5 -88 43 126 40 62 -183 250 4 161
7506 161 -135 26 0 -81 -222 -199 -17 212 -42 -170 160 132 120 34 361 54 39 -175 101 -50 179 20
7528 20 112 -128 -4 26 -64 -50 -254 133 -159 143 -106 32 120 100 -87 95 -74 145 86 -176 -13 -54 -91
7551 -91 9 -177 -198 152 240 -105 57 149 312 -75 228 191 51 182 -114 116 -209 -78 -22 151 -43 77
7573 77 76 149 8 -52 -45 154 106 -18 -130 -121 32 -123 -63 -238 12 -54 -90 167 109 -95 -172 160 66 -124 44
7598 44 3 21 -152 50 -8 35 -78 -14 183 214 220 -186 34 42 41 -262 -206 38 1 -51 -28 -1 54 165 205 -62 38
7625C8l48L28J77j21J34M2j42k30O7Lk0K47j83K9j0lJ07N3l3k26J90j50J34O2
7649A45m59N02l14k08K99J86m9o9K8M8m3j70m1m1J72L6k02j05K86j5J40k18Q5
7672gk12o7M62j76k55J41j18K4K29Q4j48j87L53p8k72J22K50K6r8j33O2Q0l7j6
7696B9l3J14m3j85r4J93J53m6k02J65k04J86j85Q4j32O3K81k54p5L96k34M2K2
7719D1j58L0J72Q8m3K29m35J37k51J43J58j31lJ24j56J62j5o0j74L16l65K95j62
7742e8kl2k16J31pL53O4l20Q5K4rm4o0N7J46j05J07l6q6K29j14k52O8J19M7j00
7768a1m1J46j24r7pK11p9j05K8k60K92J68J21m3k34p2L26l2l39J36J06k64K87
7791A13k36J91J57k90J58k4R1k00R2j1j3M2j19j07J31l5m0j3K59J28j26k66j4
$$ plain form
7625 38 -310 18 195 74 208 250 108 -122 -55 -52 -72 175 -8 21 11 8 115 168 135 -91 99 -51 83 145
7649 145 -314 188 -126 -334 -35 151 102 33 61 109 66 -104 -145 -186 -14 22 -180 -285 1 -14 126 -92 -7
7672 -7 -219 -286 176 0 -255 -114 -232 -208 21 105 -43 -230 123 45 -227 -105 145 171 73 -60 2 82 45 29
7696 29 -4 110 67 -118 -212 -19 134 88 -114 51 -153 33 -152 -68 -200 -137 144 -110 -185 211 -23 19 41
7719 41 -117 -87 85 173 130 359 -76 61 -190 -47 111 -20 -23 101 -55 107 92 32 -142 174 -191 104 -58
7742 -58 -60 -92 -308 -177 -184 169 233 -87 -2 22 13 -31 -91 -34 112 7 114 78 -8 221 107 -145 -77 42 89 -11
7768 -11 -52 94 -30 -127 -134 77 -2 -107 -79 -339 -47 121 242 199 -35 -107 219 187 -152 -16 90 -174 113
7791 113 -123 68 225 -65 93 69 160 -40 52 41 28 70 -49 -156 -25 -60 -100 -113 146 274 148 -118 -132
7814a32J89q6K7O3j07k8K11k13M05j61j87K3R4j37j6j0j1J39K1j5J25%r7j7j11
7839c1JM8Q8k55P6L8Q5j84J34P8l6Q3k90K49J7j41J47j21P8J07k75J78m5N7j93
7864a07K7J20J77l6k04J5q2K49m12K59M4j74l2N7K06j25q3J49K3Q2N6j76j00j88
7888b55N34j34l2oj28Q8N6o9N1k21O6j2J61k22J92j81R9n1q3K16j26j55K81J61
7912B30k53K00j11m7mQ7k84J20L3J28j63K12J00m7j77K27l21k5M6J20L7j90J08
7935B6k98L64j07K24p0j82l3J69j08O8k30K89p0M3k66K05M4J86Lm1j04O0N6k94
7959f6q4J24n1J65k76K68j69K9p7K19m2n0p8Q5L06m33K01o8L2k5j88o0K17k4N5
7984A0K4j20r3L71k30K7l5L1p5Q8pLJ06j04k74J50j05K39j54J07J06j46J1J44
$$ plain form
7814 -132 57 -29 -2 61 -46 -74 137 -76 329 168 -19 4 98 -39 -55 -65 -76 63 84 69 194 194 97 80 -31
7839 -31 -30 18 106 -149 -73 -35 50 -134 0 78 42 125 -165 84 101 -40 107 -14 64 171 -104 74 29 86 -107
7864 -107 -80 40 217 181 -23 -8 -90 159 -253 6 50 -124 -156 -99 107 -18 -101 48 71 153 209 33 -67 -255
7888 -255 279 145 113 107 -21 67 123 54 105 -116 -50 -62 99 -123 69 -112 -13 -64 -147 69 -57 -212 69 230
7912 230 -23 177 66 19 15 102 -182 -62 -29 99 -64 148 248 201 24 251 -70 -95 -49 71 108 -82 26
7935 26 -272 92 -15 209 139 -43 -76 93 -15 53 -177 112 42 85 -181 24 68 254 257 216 112 172 228 -66
7959 -66 -150 -26 -77 88 -188 80 -89 -60 -137 82 40 -10 -88 -3 303 -130 71 3 35 10 -178 -238 -21 -45 10
7984 10 34 -86 -179 192 -38 -11 -46 -15 -90 -2 -9 -6 100 -4 -278 -128 -233 6 -148 -41 65 -81 -70 74
8008G4j55n3J49j7j12R1J87k40rj5J13J06K4L6l94L38k41M17l27j25K96k92K40
8031I1r6q8J28k91L02q6Q5K74j91k58j8m2N8J97k9k70k11O91l83K53J99k47j4
8054E4J09k77L25k06K36k52R7k30J45m4q1J22nrL6J67k80q4J12K8j36K12J09o
8078A42l99R4L23n0J17j86n2j46K36K27k27k35J88l3Ml0Q5j59J94n2j75K33q9
8101A0J80m23L09m2L53k59j22l58K15nQ7J12O6m75M23j49J50j19j05N3Q7k0P2
8124D0j17J05j15J58k36L4L93k11Nn4k41K00o5P8J67m4O6j19j75M8L09l11K62
8147A77l3j75N8n0N7K7l13J96N1M0j4K8k53J42jj35L78l94M15j19m19M49j44K19
8171A87j83N8l1PK40m57J64R5N0j10M0l24M3L26j4k64J78l37L85N0
$$ plain form
8008 74 -81 -134 15 -2 -114 -23 164 -76 -85 -100 13 119 143 179 -215 123 -118 299 -28 -153 143 -149 91
8031 91 -5 -93 35 -256 46 -40 45 319 128 -130 -148 -190 -132 65 36 -234 -445 246 -137 116 315 68 54
8054 54 163 -114 211 5 241 -11 86 -144 1 -43 -124 -2 -7 -16 20 187 -93 -177 -65 -37 -173 39 148 142
8078 142 -257 -163 160 110 227 41 -11 -157 79 306 79 -156 32 -1 3 -27 58 -101 93 41 -134 99 10
8101 10 190 -233 76 34 387 128 6 -352 -137 -142 -55 57 123 -352 71 -78 72 -47 -152 -99 -12 -32 40
8124 40 -77 28 -87 71 -165 -131 262 51 56 2 -239 -39 -104 -26 141 97 163 44 -131 -83 226 -85 177
8147 177 144 -31 27 -23 34 61 -252 -56 -5 35 21 49 -204 -62 -63 -198 180 -214 201 82 -337 112 -32 187
8171 187 4 62 31 38 278 -179 -15 80 130 20 60 -264 -221 105 91 -173 5 -332 53 103
8191A03
$$ Imaginary data points
##PAGE= N=2
##DATA TABLE= (X++(I..I)), XYDATA
0@%%%%%%%%%%%%%%Pj5J6j6J6j7K5l2L3m1M8n6O9p7Q8j04J20j36J52j70J92k16
36a14K42k71L03l37L74m16M61n11N65o22O86p58Q36r19J011j114J231j360J502
55G89j665J849k062K315k614K974l422L992m745N794p344R867j4640K6576j07339
70h9675j67729L21034P6965j76762P3109Q4746j85403n163J87064m7572j32237
81f1623Q1488L0415r5867L1286Q2583m4715k8422K8320l0291k3934M7896j3148
93C988n2579M9126L6622p8793K228R8060k3038n9137O9696K0592r5703Q625P5561
106E5248m2902k4309N7993n9605q0805R6237P0516p2562k4938Q705m2147M7641
118a0928Q7796p0963p6973P1944R620p2401O2652O8117r4566m4030P9799J79m0074
$$ plain form
0 0 0 0 0 0 0 0 0 0 0 0 0 0 0 0 7 -8 8 -8 8 -9 16 -16 17 -24 24 -32 37 -40 48 -56 64 -72 80 -90 102 -114
36 -114 128 -143 160 -177 197 -219 242 -269 296 -326 360 -398 438 -481 530 -584 647 -713 789
55 789 -876 973 -1089 1226 -1388 1586 -1836 2156 -2589 3205 -4139 5728 -8912 17664 -89675
70 -89675 -257404 63630 140595 -36167 36942 121688 -63715 -68878 118186 70614 -61623
81 -61623 19865 50280 -45587 -14301 68282 23567 -4855 23465 -6826 -30760 17136 3988
93 3988 -48591 535 37157 -41636 -39408 58652 35614 -23523 46173 66765 -28938 -20313 55248
106 55248 12346 -11963 46030 -13575 -94380 1857 72373 -189 -25127 -16422 -58569 -10928
118 -10928 76868 5905 -71068 876 10496 -61905 747 68864 -25702 -69732 10067 10246 -29828
131b9828O3096K7432r4653j7480R5241L893o9114J5273L1536m4974j6165M7644
143A1901M589l3014J3135J9343j7007l837N685q979J4929P869l6907j0678K2271
156a0700k981J6392M0740l7057n7268N2368N3701n0547k0353L8976l1626m4211
168e2566M0905K7406k5679O071J2487l2719l266N3977J6169l6216j8635j73K779
181i460K1530J2730j8638j2738J0510J54n392K1266J0406l5190j3395K6299r188
194a106k2137K7935J7185l4292p160K7396o017p493L2827j760m2747J916K9603
207A4150M94n910p30q288j163L335p797L586J6833j1995k7043M976J2346l610
221a0816J2926J1100k6153j6400K6073J9541j6749o579J4355j0058k0451J8385
$$ plain form
131 -29828 33268 60700 -33953 -51433 43808 47701 -21413 -6140 25396 -19578 -35743 11901
143 11901 16490 -16524 -3389 15954 -1053 -4890 795 -8184 6745 14614 -22293 -32971 -10700
156 -10700 -13681 2711 43451 6394 -50874 1494 55195 4648 -15705 23271 -8355 -52566
168 -52566 -11661 15745 -9934 -3863 8624 -24095 -27361 26616 42785 6569 -12066 -12239 -9460
181 -9460 12070 24800 6162 -6576 3934 4088 -1304 19962 30368 -4822 -18217 8082 -1106
194 -1106 -23243 4692 21877 -12415 -19575 7821 1804 -5689 27138 25378 -17369 -15453 14150
207 14150 14644 8734 8004 -284 -1447 1888 -5909 -2323 14510 2515 -24528 -19552 -7206 -10816
221 -10816 2110 13210 -12943 -29343 -3270 16271 -478 -7057 7298 -2760 -23211 -4826
233d826K4612j1694j0874Q496m790j0762J4943J2093j4631r971n60q083Q656J8967
247A1576m742r482J368p262K324K2306O41k4323J67J2852j2458l192K4722L042
261A7539j9919k929N783n46N997Q316j0204j8826P35J3802L343o87J715m210m799
276d890K233M909L524K915m808j2770q14J2301J149j108Q217p732j5768Q961J1837
291H156p168l945L421j1373r285J6482J0673r926Q9N400p240n95R873L605k785
306E382l246n566l272P638J1716j569o888k988m129J290Q453k62q618n092J68
321f983l022J694J3424K378j3362k247O346k96M039Q195n235j1656J512R710J851
336F348K746M323q701p713N136L219r76o01n769p470J075N645J191J764L340o402
$$ plain form
233 -4826 19786 8092 -2782 5714 924 -9838 5105 17198 2567 -7404 -7964 -16047 -7391 11576
247 11576 6834 -2648 -1280 -8542 -6218 16088 16729 -7594 -7427 5425 -7033 -10225 14497 17539
261 17539 -2380 -5309 474 -72 5925 14241 4037 -14789 -14054 -252 3091 2404 4119 -91 -4890
276 -4890 -2657 2252 5776 8691 3883 -8887 -9701 2600 3749 2641 10858 3126 -12642 -3681 8156
291 8156 988 -2957 464 -10909 -20194 -3712 6961 -2965 -2876 2524 -4716 -5311 4562 8167 5382
306 5382 2136 -3430 -6702 936 12652 11083 4195 1207 -2922 -1632 6821 6559 -2059 -7151 -6983
321 -6983 -10005 -8311 5113 7491 -5871 -8118 -1772 -2068 1971 10166 4931 -6725 -5213 4497 6348
336 6348 9094 13417 4716 -2997 2139 5358 4382 3781 -1988 -9458 -8383 -2738 -1547 217 3557 -2845
352b845p787O137O905k824j541m5n355j172R463Q144l862j607K817m300k315O342
368F155R87o016m019k423j441L176O385O53l925K0j789j570O720K483p020l815
384e439k79j602J983Q575K515q089k342M554q0K200N591n337r766k29M856L065
400A76K309L68p320m164P823M698q25J858l655o907K928O878J43k345n73l167
416a775m385M898O375l254k587J711n95K74M752J948k961k162O42l326k458M699
432A796P35k992K744J38l370M785P316j573n172p54m359n330O007M346r216m216
448i115K983j60M682Q786l389q494n65J978j231K791K097q967m818P325N654K623
464B180M889r51n343N4N756Q66o229k953j808m682P26M391K90j405K542P44k359
$$ plain form
352 -2845 -10632 -4495 2410 -414 -1955 -2000 -7355 -8527 936 9080 5218 3611 6428 2128 -187 6155
368 6155 7142 1126 -2893 -5316 -6757 -3581 2804 3457 -468 -448 -2237 -3807 2913 5396 -1624 -5439
384 -5439 -5718 -7320 -5337 3238 5753 -2336 -4678 -124 -204 1996 7587 2250 -7516 -7745 -2889 176
400 176 2485 2853 -4467 -8631 -808 3890 3065 4923 1268 -5639 -2711 4167 4310 1965 1392 -1775
416 -1775 -6160 -1262 5113 1859 -728 983 388 662 5414 7362 4401 2239 2881 -445 -2903 1796
432 1796 2531 -461 2283 2421 -949 3836 11152 9579 4407 3653 -706 -6036 -29 4317 -4899 -9115
448 -9115 -6132 -6292 -1610 7176 3787 -4707 -5272 -3294 -4525 -1734 363 -8604 -13422 -6097 -443 2180
464 2180 7069 6118 775 829 6585 7451 1222 -1731 -3539 -8221 -7495 -3104 -2814 -4219 -1677 -933 -3292
481c292K328L653k425p92K577n937l353Q433L073k708K920j427o039M349Q838
496A0198l472n964M9m639l094Q437J948p027j362q48r23O872P238k948n525J015
512d5K568J365L105L65o077n107J750L216k62j253J691j278l543N342M931l482
528C286l21J350l798k261K814p33p14L145j95m133L596M119j901K725P81r519
544a759m091L274q81K01J212m889n535M857Q306K494r15l592o378J668N843Q05
560F20k518m206l050K216M532M797L508m133m322K738J631LK508j239q282j777
576f974N983j66J23M938m326o248N266L311k632J964J32m623O30M567l67O31M465
593F674p41l646J664P42L62M650j429o287j955Q07J609J918j612m060m324j630
$$ plain form
481 -3292 -964 2689 264 -528 2049 -3888 -7241 1192 4265 1557 4477 3050 -2989 1360 10198
496 10198 6726 762 811 -3828 -6922 1515 3463 -3564 -4926 -5774 -6697 175 7413 4465 -1060 -45
512 -45 2523 3888 6993 7358 1281 -3826 -2076 1140 878 -375 1316 38 -3505 1837 6768 3286
528 3286 2965 4315 517 -1744 1070 337 -377 2768 2573 -1560 2036 6155 4254 6979 7760 -1759
544 -1759 -5850 -2576 -3457 -3256 -2044 -6933 -12468 -7611 695 3189 2274 -1318 -7696 -6028 -185 620
560 620 -1898 -6104 -9154 -6938 -2406 2391 5899 1766 -2556 182 1813 1816 4324 3085 -5197 -6974
576 -6974 -991 -1157 -1034 3904 -422 -6670 -1404 1907 -725 1239 1371 -3252 -2622 1945 1578 2209 6674
593 6674 5933 2287 3951 4693 5055 9705 8276 1989 34 841 2450 4368 2756 -1304 -5628 -7258
609g258L001L826K08k226k173j631K187P760K811n416j308j200l250N924P084
624H339n203m769J176j152J123P443L44q827k584J547j835L465L270n379k690
639e732K032k05L271N122j271m663q43R32N75J776O89j858j906l38J071K583J265
656B500K61P43m552l542L618K599J2K11l676l026K756M069Q21R21j917p169k71
673e642O953O71j705J812m946m611O313N695j319q91k435m668L20N949K667j185
689B978l142l965J532O577J754j526r78l799j582K693K039P45p88l669j568J228
705a471J079K453K400m613n707J846K413n58L187P93n696j067M370J492K359K128
721E408m533l312J687R51J357L225j403n970k45L035N64K384N67n927l520J192
$$ plain form
609 -7258 -4257 -431 -223 -2449 -4622 -6253 -4066 3694 6505 1089 -219 -1419 -4669 1255 8339
624 8339 3136 -1633 -457 -1609 -486 6957 7301 -1526 -4110 -2563 -4398 -933 2337 -3042 -5732
639 -5732 -3700 -3905 -634 4488 3217 -1446 -2289 -1357 -782 994 1683 -175 -2081 -2419 -1348 1235 2500
656 2500 2761 3504 -1048 -4590 -972 1627 1639 1850 -1826 -4852 -2096 1973 2794 3715 1798 -5371 -5642
673 -5642 1311 1982 277 2089 -2857 -7468 -1155 4540 3221 2330 -105 -4773 -4453 1496 4163 2978
689 2978 -164 -4129 -2597 3980 5734 4208 3230 -569 -2151 542 2581 3326 2538 -1131 -2699 -1471
705 -1471 -392 2061 4461 -152 -5859 -4013 -1600 -2158 1029 1822 -3874 -4941 -571 921 3280 5408
721 5408 875 -2437 -750 201 1558 4783 3380 -2590 -2835 200 764 3148 3715 -2212 -5732 -4540
737d540K321K717J49k761j676j79J536L860K283j492l261j431m13K865M786r78
753C786l545q4j447J563N715K50m125j825k216j574M305L810l201l238l05j455
769c586K325N845r12m531j349k031P32N144K286k865l291j005J682L305K626r65
785C410l122k091p53K210K948n77j414j696l001J692L442O48n47k250l322M51
801c972L417J103J72j04k791k647K786L927j092Qj131l955L67M587J860N39j152
818A922l154q14K683K555P05j200k959l273J705M180J388K20j808l134RJ564K623
835C212J335m048l924o94R69K373L144k89l824j439K817K345J354Q78l257l636
851b684Q99J048J930K573j701l495K91J745J591J364M97m186l760J210J513m2
$$ plain form
737 -4540 -2219 498 647 -2114 -3790 -3969 -2433 1427 3710 2218 -1043 -2474 -2887 -22 4764 3786
753 3786 241 157 -1290 273 5988 6238 2113 288 -1928 -3502 803 4613 1412 -1826 -2131 -3586
769 -3586 -1261 4584 3672 -859 -2208 -4239 -3507 1637 3923 1058 -2233 -3238 -1556 1749 4375 3410
785 3410 288 -1803 -2556 -346 2602 2025 611 -1085 -4086 -2394 1048 1696 1149 -1101 -4423 -3972
801 -3972 -555 548 720 616 -2175 -4822 -2036 1891 799 807 -324 -4279 -3912 675 2535 3074 1922
818 1922 -1232 -2046 637 3192 3897 2697 -262 -3535 -1830 2350 3738 3958 2150 -984 -975 589 3212
835 3212 4547 499 -3425 -4119 -3150 -777 2367 2078 -1746 -3185 -368 1977 3331 4209 952 -2684
851 -2684 -1785 -737 1193 3766 2065 -1430 -1139 606 2197 3561 4058 -128 -3888 -2678 -1165 -1207
867a207J814j922k542j72J801K801J316j184r95j790m25K216J866K64j151k214
883a524j139J625L008J397j521j538j782j032L355K042j784j429k006j945J361
898b912L420P86k239j757q3j44L271K927j475k450j180k43K045J947L25k476j987
915b225M53J815K233K069j291k507m70j3J200J630l93k864k369L81K048J135J773
932B605n31k826k45J434J252J2n90j257k164n29K490J808N68j3j552p39J487J380
950B590O16n23k334k065J62J583R79n74o4j220j949J814K999p56j500j249j071
967b562p62J535K461r53j768o51J36J300K127O26j212j666j287J781J854K47q52
984C54r67o02m22J123K290m1k282j163J20J273P73M64j44k667j343K298J167o40
$$ plain form
867 -1207 607 -1315 -3857 -4029 -2228 573 1889 705 -290 -2080 -2505 -289 1577 1841 690 -1524
883 -1524 -2663 -1038 1970 3367 1846 308 -1474 -2506 849 2891 1107 -322 -2328 -4273 -2912
898 -2912 508 1294 -945 -2702 -2785 -2929 342 3269 1794 -656 -1836 -2079 -34 1913 2238 -238 -2225
915 -2225 -1772 43 2276 4345 3054 547 77 64 1264 2894 2501 -363 -2732 -2351 -303 832 2605
932 2605 2074 -752 -997 437 1689 1701 1111 -146 -2310 -2839 -349 1459 2027 2014 462 -277 1210 2590
950 2590 3206 2683 349 -1716 -1554 29 1008 434 370 -850 -2799 -985 2014 1258 -242 -1491 -2562
967 -2562 -3324 -1789 672 -281 -2049 -2700 -2564 -1264 863 1489 277 -1389 -2676 -895 959 1206 354
984 354 -613 -1215 -1637 -514 1776 1735 -547 -1710 -1590 -317 456 920 776 -1891 -3234 -936 231 -409
1002d09K01o60r30J64K127J492m03l49o58m26J517J18J00M68j398j457J124J548
1020B169o7k34R0r73j300N67J177r69o71j86o61l86O50J699P27j800m13K99L16
1039C4P67P14p32j539r07O84J444J092j39j826J96K0j35J836O92l551r44J100
1057a194j8O80J478j401k457J91J440Q32J58m08j909j22J680M21Q81L5j623O04
1075g32J310m05K59J118p74j174L85R80j33M0J04m82l74qj30R97j122o68J185
1094C76p96j147J183J014n62j08J51n09K4R68O26o06p60q68R64K313m10j127M96
1113A222p98o45J955N60j684r64L9j5M08O72P7r59r67m46J151J471j531q50M77
1132h27j040L72K304k16j055p3N08K58K53M17r58O9N6m74J345R11k233L61J240
$$ plain form
1002 -409 -208 -868 -1798 -1634 493 1985 1582 1233 575 149 1666 1784 1884 2352 954 -503 621 2169
1020 2169 2102 1868 1958 985 -315 252 1429 460 -211 -397 -1058 -1444 -794 905 1632 -168 -581 -282 34
1039 34 801 1515 783 -756 -1663 -979 465 1557 1418 -408 -212 -192 -327 1509 2201 -1350 -2294 -1194
1057 -1194 -1212 -532 946 -455 -2912 -2721 -1281 -449 -291 -699 -2608 -2730 -1050 -629 252 287 -1336 -732
1075 -732 578 173 432 1550 776 -398 -13 967 834 874 978 496 122 114 -16 981 -141 -809 376
1094 376 -420 -1567 -384 630 68 -40 111 -398 -374 594 1220 614 -146 -1014 -50 2263 1853 726 1222
1113 1222 424 -221 1734 2294 610 -354 -315 -330 78 750 827 -132 -1099 -1545 -394 1077 -454 -1304 -827
1132 -827 -1867 -1495 809 593 -462 -535 -27 231 484 901 -57 12 68 -406 939 1850 -383 -22 1218
1151A218j724j06J408l75j316M3K65n84L15O70q5l74l65k47R64N21o74N07oj592
1171a537J086J456K94m05m93l76R12M69k05K6n72j245J63J567n62j010J397j107
1189a42j875J790M94m34K11p33j076N33R18M46K6K18j255j65J667K37l45N63j259
1208a81p74J453P42l20J76o29j027j83J108N36j88j097j469J46J421j95L66K61
1226A46j866l45J708M22j21m8j159L7M93R34O98J71o43q06Q08P67n64O88M76k174
1246c78N2O87N7M69R0p49p26P8J23M98N18m97j187j05J70P3J688L10j788J22L63
1267a32K66J106P52j268q37l25M05R29J149j012j299r5k01M01J906o90k217j48
1285a310P7J07J481O00j352j275o26Q98J121J001j023j077J12k05J366J823n49
$$ plain form
1151 1218 -506 -612 796 421 -895 -852 -587 -1171 -856 -186 -271 -645 -1010 -1257 -293 228 -446 61 55 -1537
1171 -1537 -451 1005 1299 894 401 25 937 1406 1201 1227 655 -590 -427 1140 578 -432 965 -142
1189 -142 -2017 -227 267 -167 44 -689 -1765 -1232 -314 132 158 376 -879 -1044 623 860 515 1078 -181
1208 -181 -955 498 1240 920 1096 467 -560 -743 365 901 713 -384 -1853 -1707 -286 -481 -115 146
1226 146 -1720 -2065 -357 65 -56 -104 -1263 -1226 -733 201 899 1070 427 -379 429 1196 632 1320 1796 -378
1246 -378 -326 361 418 887 977 228 -498 -420 -297 201 719 222 -965 -1070 -900 -827 861 1171 -617 -495 -132
1267 -132 134 1240 1992 724 -113 -438 -33 896 2045 1033 -266 -361 -562 -161 1745 1055 -1162 -1310
1285 -1310 -1233 -1126 355 955 -397 -1672 -2298 -1400 -279 722 -301 -1378 -1266 -1471 -105 1718 1169
1302A169j616RJ14M2J573L2p55p94j063J152J236Q7p98n36n28q51P37J670j021
1321a41r20K00r17N63J491L26O5o05j111J14J728M99j14k19p29j471J370J787
1339A916l15j49o23j456M18R85Q79j88j022j859j50J602N78N2N6j761j065J435
1357f67J470K15R5j440j495J193J141Q21M04r30j491j6J056J133J13n71j671p89
1375a429J121J223N3n6j373j231M71Q45M19M60j177q77o1L24Q67R82n1j426q59
1394a775Q11N58P74Q81j354j113L16K78J606P60q90p93r51J25R24J199j70j306
1412a20p96m0K86J324J068j118j837l2K50J265P87l93j402q29lJ554J586j22q76
1431E52j094M3M19J370Q83j023q85q95J72J311R23k57p99j469k19Q90J313n9j414
$$ plain form
1302 1169 -447 -438 -324 -282 1291 1323 568 -226 -1289 -137 1099 1186 388 -148 -676 -1527 -790 880 -141
1321 -141 -1061 -861 -1778 -1215 276 602 667 62 -1049 -935 793 1292 1178 959 230 -1241 129 1916
1339 1916 1601 1452 829 -627 -209 776 1655 1467 445 -1414 -1564 38 616 668 724 -1037 -2102 -667
1357 -667 803 1018 1113 -327 -1822 -629 512 1333 1737 807 -684 -700 356 1489 1602 1031 -640 -1429
1375 -1429 -308 915 968 912 -461 -1692 -1221 -376 43 503 -674 -1551 -1612 -1288 -421 561 510 -916 -1775
1394 -1775 -964 -406 368 1249 -105 -1218 -902 -624 982 1742 852 59 -892 -767 157 1356 1186 -120
1412 -120 -916 -956 -670 654 1722 604 -1233 -1265 -1015 250 1037 644 -758 -1587 -1590 -36 1550 1428 552
1431 552 -542 -499 -80 1290 2173 1150 265 -630 -458 853 1776 1519 720 -749 -968 -78 1235 1176 -238
1450b38p81l87J95J379P20p03p29o44O8J086J219j58l15j151k19N66J413L98m45
1469A274p69q50n56J589O62n05l60j465n16P38Q02O73p22j360o79J50J268R46
1487C20j12j212n17m58J388J014O26q08j283q8P99P51J253m01j565o25K54J014
1505C50Q83Q1r28j502j72J209O58L62o58j373j76N71Q57P39j86j053m60j22J261
1524C41Q80l11Nj193l27R63R67K79m8r51o59k24R89M65J43r21o52q49N75J007
1544D79K33q6j005j249K13J049R27L97j430j359K28Q08J428L22m09j234o12J002
1562b98P49P72J86j573q61P24N45J029J38j029j501N9O88O77J52%j423p48Q25
1581h89P78O60K02j557k69R9M96Q84N05o70q76K1O70Q48M44K2j056m30j83R75
$$ plain form
1450 -238 -1019 -1406 -1211 168 888 185 -544 -1188 -1120 -34 1185 1027 712 -439 -658 -92 1321 1719 1274
1469 1274 505 -345 -901 688 1350 845 485 -980 -1496 -758 44 717 -5 -1365 -2044 -1894 -626 320
1487 320 208 -1004 -1521 -1979 -591 423 1049 241 -1042 -1130 -331 420 1673 1272 -293 -918 -664 350
1505 350 1233 1314 386 -1116 -1288 -79 579 941 283 -1090 -1266 -695 162 901 715 -338 -798 -920 341
1524 341 1221 910 915 -278 -605 358 1325 1604 1556 605 -54 -278 711 1176 1319 398 -254 -1103 -528 479
1544 479 712 626 -379 -1628 -1415 -366 561 958 -472 -1831 -1603 -795 633 955 546 -688 -1300 -298
1562 -298 451 1223 1409 -164 -1025 -301 244 1273 1411 382 -1119 -1060 -372 305 457 457 -966 -1714 -889
1581 -889 -111 549 751 -806 -1075 -976 -480 404 909 239 -637 -616 54 902 1346 1368 312 -118 -301 674
1601F74M64o5j168J97n55k23J031P6j57q85o50M01N36O04j47n78l55l80N75J270
1621F65K43o74k0p83j73J168J009k84r16n86Q7K09J383j80l94j140r58N64J474
1640F94pm47o06j056r2J428N86l94o16m78k57Q07J160K00o23p72m37O25J270l24
1660F61l0p6j085o7J076K78l63m6n04m12L95Q94l40j74m80q77P99J20l15P67j15
1681A06j221J36R26K14K95J64o63m83L69N48M42J04n71p27M76N19J18O50o11j163
1701c72K9M15j46Q12l22j046n80N35N36L42N4p28m67J98L86N08L20m18p46k47
1721i37P39L69N51l8p03p14L60O45L81k77l24n92J50l76R61M60j046o24Q22m74
1741f67K39O21j34j82o82K52M56J94J96k25j54K9n8N59R30q43j58K93m78L75M31
$$ plain form
1601 674 1138 1073 -95 102 -453 -676 355 431 274 -611 -1261 -860 -324 280 133 -445 -800 -1180 -605 665
1621 665 908 234 214 -569 -742 426 1435 1151 235 -351 -264 -55 1328 1148 754 -386 -1344 -780 694
1640 694 687 240 -366 -1422 -1514 -86 500 106 -510 -988 -1245 -438 722 922 299 -473 -910 -285 985 661
1660 661 631 555 -530 -597 479 757 394 348 -156 -568 -173 721 381 207 -273 -1150 -351 -231 -546 221 106
1681 106 -1115 -979 -53 161 456 620 -43 -526 -157 391 833 937 366 -361 115 634 752 1402 791 -372
1701 -372 -343 72 -74 738 416 -630 -1210 -675 -139 203 257 -471 -938 -740 -354 154 474 56 -690 -937
1721 -937 -198 171 722 684 -19 -733 -373 272 653 376 52 -540 -390 -766 195 655 -391 -1015 -193 -667
1741 -667 -428 193 59 -123 -805 -553 -97 97 293 68 -86 -57 -115 444 1374 531 373 666 188 563 994
1762I94On33l43l66J55O85P5j41m97l47m15O37J052r61l16p3l46K36P76J18j23
1783B73n64n06N90Q56q5k57m70k74k02P96N01q12K07m65r0O76K74j7l09o15m25
1804i18P60L16R0p41l72j07J16R11J15n67K98n14R3N58M6qL95n53J53J74J75L73
1826G93k16n3l41j94N10j09k40M89j042k78M69r1Q7J57m06n69J96J76N23L80j9
1847B22j019L62M48N7O22K51j023j51O93O2N65q9n71l23m4M28L74l39k58n49m0
1868c22K52K79J93k59j251L41N97J25N46l66l10m17M72K54N70j37l54n06N50O0
1888C17K24L99m53p01J59J44l00N89k23n60k72k70K13M49L2l79k39n2L05J4P34
1909A30j46n17K38j36M75O63p3l22o3k2k10N86K25k99k74k38o25O84Q74o69l60
$$ plain form
1762 994 1000 467 124 -242 -87 598 673 532 35 -312 -727 -90 962 1 -315 -388 -734 -498 278 396 273
1783 273 -291 -797 -207 649 564 307 -163 -437 -639 157 658 -154 53 -412 -502 174 448 431 122 -493 -918
1804 -918 -158 158 248 -493 -865 -972 -856 55 170 -397 -99 -613 -520 38 84 76 471 -82 71 245 420 793
1826 793 577 524 183 -11 499 390 150 639 -403 -681 -212 -303 -216 -59 -465 -1034 -838 -662 -139 241 222
1847 222 -797 -435 13 70 692 943 -80 -231 462 524 1089 1000 429 106 62 490 864 525 267 -282 -322
1868 -322 -70 209 402 143 -1108 -767 -170 -45 501 135 -175 -592 -120 134 704 567 213 -293 257 317
1888 317 541 940 487 -214 -55 89 -211 378 155 -405 -677 -947 -734 -285 -253 -632 -871 -923 -618 -604 130
1909 130 -16 -533 -295 -431 44 707 634 312 249 227 17 603 828 529 255 17 -608 76 950 281 -79
1930g9n62k2L43N98j01j69m96l36K66O42L89j50o26m9N8O18P44p04k77o2k43M13
1952A95M70j02Lo36l29o1Q76L15m85l58p6l07M01Q44p40l0n59j00M27N03k85M13
1974C79o73k9J46M29J86j28j90k22j97L17O15p6j68l24l96J75N92O9nn28o28j46
1996h02N13M63j70j54p62k62N58N74J80j11r47l6N58J53N79k6m69k67L64K74N18
2017G28J16p4p16k56M88L18J71k68q92lK57J2N98k61o43k05R0J91L35K67j22p90
2039f59K63J59N48k7K80l03l46J32J70O56r8l64l1o12KM06P2L61m47m88k06K67
2061b65M52R7q0r29k65L50Q01N8j61m00m49Q1O73O94k23p71J5K1J62O37M15o90
2083B23m18j97L65P26L12o02l49p57N39M01O06m09m16n86q5J50Q49l6l20m06o7
$$ plain form
1930 -79 -641 -663 -320 278 177 8 -488 -824 -558 84 473 323 -303 -352 -294 324 1068 364 87 25 -218 195
1952 195 665 563 566 -70 -399 -460 416 731 246 -112 -188 -495 -94 750 10 -20 -579 -679 -252 251 -34 379
1974 379 -294 -323 -177 252 438 310 120 -102 -299 18 633 557 389 65 -331 -156 436 505 500 -28 -656 -802
1996 -802 -289 174 4 -150 -912 -1174 -616 -42 138 27 -920 -956 -398 -245 334 308 -161 -428 -64 210 728
2017 728 844 770 54 -202 286 604 775 507 -385 -388 -131 -119 479 218 -425 -630 -540 -349 -14 253 131 -659
2039 -659 -396 -237 311 284 564 261 -85 47 217 873 775 411 380 -232 -230 176 248 609 162 -326 -532 -265
2061 -265 187 284 204 -725 -990 -640 161 219 58 -342 -791 -710 -37 657 434 -337 -322 -301 -139 498 913 223
2083 223 -195 -392 -27 699 1011 409 60 -697 -158 243 849 440 24 -562 -647 -497 352 316 -4 -410 -477
2104d77J64L04K55r3O9o59J68J43N66K68m05m50N0m8M17M41r3m43m83L10j02L67
2126B69J76m81o06k11K14M50K89l37n8m08j73O81M63J07m99l91p7K73Q38K77m93
2147C03l01k09K90M25N53m00j93o74k97O18J44K71m72r96j46M76M86L53l84l12
2167d65o03N40Q01M7k97L57p95N8O81M93K06l14k59o25K83O67J18o01P4r51q8
2188f73M03K27J57k22o43J12R3P36O2r1l73l50Q4O60J38J6j10n47J32O58j8L02
2210G53J91r07k84K93K42L35n0k48n95J16P7J21K32l72m74m3n8N35L42m45n23
2231g62l54L84K82M25J80j83l86k8P06J88M02k56q07j13M8L74O02l79n95q8j85
2252e45L55M42J57o52m35L16n8N01L06m10k74L71n27K42R73k71q9j04m21PO29
$$ plain form
2104 -477 -313 -9 246 153 222 -437 -269 -126 440 708 303 -147 -97 -145 272 713 620 177 -306 4 -98 269
2126 269 445 -36 -642 -853 -639 -189 100 -237 -295 -703 -876 -195 268 375 -124 -515 -592 -319 519 796 303
2147 303 2 -207 83 508 1061 661 468 -206 -503 115 259 530 58 -938 -1084 -608 -122 231 -153 -465
2167 -465 -1068 -528 273 320 23 380 -415 -357 324 817 1023 709 450 -175 108 775 893 292 366 -585 -673
2188 -673 -270 -43 114 -108 -751 -639 -546 190 252 161 -212 -562 -478 182 320 336 226 -321 -189 469 451 753
2210 753 944 37 -247 46 288 623 573 325 -270 -154 -77 44 276 -96 -570 -613 -671 -136 206 -239 -762
2231 -762 -1116 -732 -450 -25 155 -28 -414 -442 264 452 854 598 -209 -322 -274 100 702 323 -272 -360 -545
2252 -545 -190 252 409 -243 -678 -362 -420 81 387 -23 -297 74 -453 -211 762 491 402 298 -123 -116 513
2273E13L23k85o41LK48K7N52k7o05L8n04M2O45l8m01j04n30K10M81r8P8m26r0
2296e89l48O58L45L13k74m75k80P08N89k25K41n39m24O0N71M6K68n21l06j81L10
2317e3J89J44o5m73n01M44K64j96L97k99k93L50J45L8L3r6j52j00Q7K76K18J30
2339D87k90o42L74K9P8O15o49m20J37J96J77J28k22r6m30K77J12L59N0n84l81
2360f95N21J02L72K86n65k70J07nM58K42j65j76k28J81R8K50R5j72k75J55m50
2381a34L46K46j88n16K64n29K54N48o71k0k8J12m4L93j2l36l9J81n1M41N4k09
2403F2P0P2l38M68P5k26M6l05p7M7J51K42l47o6j82n6lM16l48j68mj88L89j9M31
2428A42j20j48j51q1R81j47k33J14l42k15N72K50k54K31m63k40L70n0J81m86j58
$$ plain form
2273 513 836 551 -90 -87 161 188 740 713 108 146 -358 -316 329 291 -110 -214 -744 -534 -53 -151 -73 -499 -589
2296 -589 -937 -279 66 379 105 -370 -650 58 647 422 663 124 -300 -240 331 377 645 124 -182 -363 -53
2317 -53 136 280 215 -258 -759 -315 -51 -247 150 -149 -442 -92 53 91 124 28 -124 -224 -137 139 357 487
2339 487 197 -445 -71 -42 36 651 2 -418 -281 -85 92 220 -2 -98 -528 -251 -139 220 270 -314 -695
2360 -695 -174 -72 300 586 21 -249 -142 -147 311 553 388 212 -16 165 263 513 608 436 161 316 -134
2381 -134 212 458 270 -246 18 -511 -257 291 -380 -400 -428 -316 -360 33 21 -315 -354 -173 -224 217 271 62
2403 62 132 204 -134 334 409 183 229 -76 -153 -106 45 287 -60 -126 -308 -364 -367 49 -299 -467 -471 -659 -270 -289 142
2428 142 22 -126 -277 -358 623 476 243 357 15 -200 372 622 368 599 136 -104 266 216 397 -89 -247
2449b47j69o3N03Q7j43r9l31M9L78O7j16M38o90L48j1J27J48J78m22j52L08K82
2471D70k58K08l40k98J25J82j40J50K09l82p0J34k44L27l30J64m51K18O9J46K25
2492A14m7l44K5o7J79K69J12k45o3J17P4J65J78l62k0j38l6K15l3j33k36K5j42
2515c93L81J28q2l16NO4o1L32k8q1l9n7QK02J26Ko0J94j09j3J48k75l05K48j03
2540h4K47K21n2j34l1l83K53O3j33O8k49m1N4k75K50M29j94J45l50K69J01j39
2562C5K38p6n28L49L03k68K05M5k38j72J09K49k77J14k13l33K90N6j88M06n39
2583d33J00k0J68L43m02L2R7N8LK05L0M5r5j87K30K4j65p2L0M5J94O9M8k55j28
2608c6j7n6K25O6k39j30O8Pj47J97J32k35j81K49L7p3L6Q6k3K54j88O6j2L3L51
$$ plain form
2449 -247 -416 -479 24 111 -32 -131 -462 -413 -35 32 -84 354 -336 12 1 128 276 454 32 -120 188 470
2471 470 212 420 80 -218 -93 89 -51 99 308 -74 -144 -10 -254 73 -257 -93 -544 -326 -257 -111 114
2492 114 67 -277 -252 -319 -140 129 241 -4 -67 50 124 289 467 105 85 -53 -89 126 93 -40 -276 -251 -393
2515 -393 -12 116 34 -282 -277 -213 -274 58 30 -51 -90 -147 -139 63 189 191 131 325 216 203 351 76 -229 19 -84
2540 -84 163 384 332 198 167 -216 37 100 -33 35 -214 -255 -201 -476 -226 203 9 154 -196 73 174 35
2562 35 273 197 -331 18 321 53 258 303 65 -107 2 251 -26 88 -125 -458 -168 -112 -300 106 -433
2583 -433 -333 -353 -185 158 -244 -212 -115 -57 -54 151 181 226 131 -56 174 198 33 -39 -9 36 230 299 347 92 -36
2608 -36 -53 -109 116 182 -57 -187 -119 -112 -259 -62 70 -165 -346 -97 -60 -133 -97 -11 -34 220 32 98 86 119 470
2633D70l66K67l40o7M51l06o6k20o9L90l71K21j01J1l75M0N38m84P5Q2%P7N2J58
2657F7p8Q0j57K42j07J98r1J58j1m70L12n5L3p5j71O4K71K0K0k04k04m9j30J07
2681b30M22m43K25j17j65L43k38%J90%J64k6J72L3J57l85K46l60N82j91l27K87
2703C39k99r3J60k31K29j95q1R4k74J4R0l3m5p9J90K35k58M26j59o6M6J90m62
2726b62N39l3P6m29J14O9%L0K67m23j63K9N1R2j63k83J26l2J81K37n7L3qk58J70
2751i7J37q3J04M7o9o9J79L37Mm10k28L44L10k87j20J55j90k31J66r2J89J08j68
2774C6j90K27l2K42k41l73L58q7k24M51Q1j90P3k42L09L6l5j14L4l33J45j19L97
2797B09K7j25J71k24l27J99J64Rk54K3j59J18J94p3j92J6r0O6M66m50J71j7l04
$$ plain form
2633 470 104 371 31 -36 415 109 43 -177 -246 144 -227 -6 -107 -96 -471 -431 107 -377 -302 -220 -220 -143 -91 67
2657 67 -11 69 -88 154 47 245 154 312 301 -169 143 88 121 46 -125 -61 210 230 250 46 -158 -207 -337 -230
2681 -230 192 -251 -26 -143 -308 35 -203 -203 -13 -13 151 125 297 330 487 102 348 -12 570 379 52 339
2703 339 40 -53 107 -124 105 -90 -171 -77 -351 -337 -247 -280 -325 -404 -214 21 -237 189 30 -36 10 200 -262
2726 -262 277 244 320 -109 5 74 74 104 371 -52 -215 -186 -135 -43 -206 -489 -363 -395 -214 23 -34 -1 -9 -267 -97
2751 -97 40 -43 61 108 39 -30 149 486 490 80 -148 196 506 219 99 254 64 -167 -1 -93 96 204 36
2774 36 -154 73 41 283 42 -331 27 -60 -284 167 248 58 131 -111 198 234 199 85 119 -214 -69 -188 209
2797 209 236 111 282 58 -269 -70 94 103 -151 -128 -287 -169 25 -48 -240 -224 -314 -248 218 -232 -61 -78 -382
2820c82N68Rp6P19o31j59j09K8L94j18k01j57N4J36mJ4q6j85K21l88J25K05p5
2843i8p2O9j94L32j53j41L47O3k72K53k6K39j88j38J7J3k8J9L74j56k68l86N06
2866A12K12j65P0k17k9q1j22J41K12j28j99n3j50K79J81j3o7P9k44K70M32K24
2888G44n76pL4J20k93K84m4l17j66J53K58p1p2k88J48k11R4m9M65m09J90j76o7
2911b56R5J65j56J73j7j96J33K14J3rl76L33rJ20J21lj69k62j08J23P0J98j04
2934I3k40o0L0J84M5j04j70l22K81N7K32k35K71j10o8N08l1R5M1m88L4jJ73K70
2958D85l84j15j01n0L51j64R7k41k19K57J19m1J25o8k55j67K78n6K55j03j8j67
2980a82J53K02p4l6K85l22j52K74p7k6J14j80N6m8N3r5K19l21J37j89J98k42L12
$$ plain form
2820 -382 186 195 119 838 207 48 -61 -33 361 243 42 -115 -61 75 71 85 -1 -186 35 -353 -228 -23 -98
2843 -98 -170 -101 -295 37 -116 -257 90 153 -119 134 108 347 159 21 38 51 23 42 416 260 -8 -394 112
2866 112 324 159 229 12 -17 -98 -220 -79 133 5 -194 -247 -397 -118 63 50 -17 62 -182 88 520 744
2888 744 168 161 195 315 22 306 262 -55 -221 -68 190 119 47 -241 -93 -304 -210 -259 206 -203 -13 -189 -256
2911 -256 -161 4 -152 21 4 -192 -59 155 168 159 -217 116 107 227 348 345 176 -86 -194 -71 -1 197 93
2934 93 -147 -207 -177 7 52 -52 -222 -544 -263 -206 26 -209 62 -48 -116 392 361 456 497 9 43 42 215 485
2958 485 101 -14 -115 -165 186 22 119 -122 -341 -84 35 -6 119 51 -204 -371 -93 -149 106 3 -15 -182
2980 -182 -29 173 99 63 348 26 -126 148 71 45 159 -21 35 -13 40 -55 164 -157 -20 -209 -11 -253 59
3003E9r8l96J39K99k85J46L86m41J73r0m1J90J34o5Q7k3M3J52k67K52j84j34J51
3026A87l29M14k12r7L2l70J60k0J10q8j45qL67j19J78p3j9J23j33MN7K99k70r
3050C9P7L6J01pk25Oj66L2L57n3l70J23J13l38J1K78p3l01K21P7j55J04j56K09
3074f0j6J36k01K50j9J06j4O1n00K83J83Q8j57j11r2L6L82j24o0l2j49j63Q4J29
3098D0p7r9R7O8k56K39j72K7Pj84J41J04J39mq1L41j55qM0k81J86N1k9j3l43M65
3124B43j33j88l7o9J80k7M3j70J40o9j95K28p0j46J3J32K72j40k51M37l11M15
3146B97k16PJ19k23J06N6R2j65k54J33J42p8k19M07k58o9K85m44J50j04j09K38
3168a07%j05J27j97K1L55j51K77r9j60o8K11J22J28k27PJ18k87J77K1j38K97m85
$$ plain form
3003 59 -39 -435 -296 3 -282 -136 250 -191 -18 -108 -149 41 175 110 197 174 217 369 102 354 170 36 187
3026 187 -142 272 60 -37 -5 -375 -215 -235 -125 -213 -358 -366 1 -118 60 -13 -32 91 -42 -38 19 318 48 39
3050 39 116 152 253 246 21 27 -139 -107 250 197 -173 -50 63 -275 -264 14 -59 -360 -139 -62 -217 -113 -269 -60
3074 -60 -76 60 -141 109 90 196 182 243 -257 26 209 297 140 29 -63 -27 355 231 171 139 -10 -173 -89 40
3098 40 -37 -136 -39 29 -227 12 -160 -133 -126 -310 -169 -65 74 70 -11 330 175 167 207 -74 112 163 134 121 -222 243
3124 243 110 -78 -115 -184 -4 -31 12 -158 -18 -87 -282 -54 -124 -270 -257 -125 147 7 -244 193 -118 297
3146 297 81 88 207 -16 90 146 238 73 -181 -48 94 16 -203 204 -54 -123 162 -282 -132 -236 -345 -107
3168 -107 -107 -212 -85 -282 -261 94 -57 220 121 -39 -107 104 226 354 127 134 252 -35 142 163 25 322 -163
3191a63J00L70m61K60k21Lk2J65J54k44j82K11J06j65L3q8J39J40R7j34l4lP8
3214A39o1J26j6k68K33n7K15k28J05l70K74k29l6K5j99P0M6K7K2j82Q4Q3kM28
3238B29j95j75J76K50j95j3J72k32P8l8J44L8r6k8K9p7j06K0K09k58k26J13R3
3261h8l5j4P0p6J6l0J56k32Q7m7R7J42j80K42O6k4N8j38J5k8J64j73L38m8k44
3286I4J25j14l28q0K59k09o7K52k75J87K38n4k5o4J55n8K36l85K97j88J86O7m9
3309B00R5L6n00K75J28l9j1k94j42K68j31m9K78j66k5K2n9J28l7p0k3o5J5J75
3333Iq6p6K47j84K62j27p4J51P4j4o1KJ69j83J86j19k64M2J16kj09n8K7j84K68
3358A2J38m27m1K5L74k60K07j60J04O1q0R7j18K37O1%j60m9J70o6M3rj75J50J
$$ plain form
3191 -163 -63 307 -154 106 -115 -112 -134 31 185 -59 -241 -30 76 -89 -56 -144 -5 135 232 98 64 61 139
3214 139 78 204 188 -80 153 96 311 83 188 -182 92 -137 -173 -148 -347 -277 -231 -204 -182 -364 -280 -197 -199 229
3238 229 34 -141 35 285 90 77 249 17 95 57 201 239 143 115 144 67 -39 -19 190 -68 -294 -181 -88
3261 -88 -123 -137 -67 -143 -127 -157 -1 -233 -146 -193 -96 46 -134 108 174 150 208 70 85 57 221 48 386 338 94
3286 94 219 105 -223 -303 -44 -253 -320 -68 -343 -156 82 28 3 -61 94 36 272 -113 184 -4 182 249 200
3309 200 295 331 -169 106 234 195 184 -110 -252 16 -115 -164 114 -52 -77 -55 -114 14 -23 -93 -116 -181 -166 9
3333 9 -77 -153 94 -90 172 45 -29 122 196 182 121 123 292 109 295 176 -88 -46 70 68 -41 -99 -72 -256 12
3358 12 150 -277 -318 -293 81 -179 28 -132 -28 33 -47 50 -68 169 230 230 70 21 191 125 168 159 -16 134 135
3383A35k43j29M68k87M2r3j1L4k4j13Q3L01k44R5L8L11m50oJ66nOJ49j90k15J63
3408a9J06J11o8K53l21q6n7J7M5K63m1m24P8o9K74j80M4l43J51L83K2l02J46r2
3432a09J13J19J01N5n7N7p9j80Q2k92K37N3k59lL13N9k80K18j94k0l11L12k92
3455c57J82J05M8k6n5K72j51J08j75j9j18K05K57j38p5m9K33k99J92K07p3k06
3477F8lm3j4n9q2J45k68J6J07q4J88J93k68k77K65k6Q8L2M6o9K5J52j65j04L37
3502B00k39K19Pj65oK02p5k22Q5l16K97O0o1O3j61L19l29K1J99k08k21K54rO8
3526a8nR5j83J2j72L52rJ55j79j22M4J19O6k9P4l2Qj28J08j54L6l22L00l12Q5
3551b11K96k1l16K10q5q8L14J4j99j92R2N5L05j26QM2o4m8K28K2j90l8O5J96k96
$$ plain form
3383 135 -108 -237 231 -56 -14 -107 -118 -84 -108 -221 -138 163 -81 14 52 363 -87 -93 73 68 74 223 33 -182 -19
3408 -19 87 198 130 383 62 -24 -81 -64 -19 244 203 -221 -143 -212 62 -118 -74 -417 -266 117 139 -163 -17 -109
3432 -109 4 123 224 279 222 279 200 20 102 -190 47 100 -159 -162 151 210 -70 148 -46 -66 -377 -65 -357
3455 -357 -175 -70 -22 -48 -103 169 18 126 -49 -68 -186 19 276 138 63 14 247 -52 140 347 274 68
3477 68 65 22 8 -51 -133 12 -256 -240 -133 -217 -29 164 -104 -381 -116 -142 -54 -22 24 -45 -20 132 -33 -137 200
3502 200 -39 180 187 22 16 218 143 -79 6 -310 -13 47 -14 49 -112 207 -122 -101 98 -110 -331 -77 -86 -18
3526 -18 -23 72 -111 -99 -271 81 72 227 48 -74 -30 89 155 126 200 168 176 48 156 2 38 -284 16 -296 -211
3551 -211 85 64 -252 -42 -127 -215 99 113 -86 -278 -186 -131 174 48 56 98 34 -14 214 236 46 8 73 269 -27
3576b7K85j0j15l77K63r3J49r1r0J5J91m39J35K57j53J48j82l6j7N57j39j85L27
3599C73j16k65L02j23M3p6j54K1j37K46J3o0j02kj53J50K70j07k53J05j6n5J07
3622A1N4J2o9J71j18K54l42L68k69K6L0l60L79j02Q4k36N7N8J7m5jO6k10pJ70
3647bk3j47J83l18L2P2R0L6L2N8l10J02K04l7q6J33R4K4j46K86j55O5j40q7J97
3672A57pj76qk6j29J18K03k82L84k19n03L03J17O9P2n5j00K32k16l6K99k16J67
3695A48p5k33L40j73L69j28k49k4k8L78rq6j88j79mq5M09k72J4m5j6o7K05Q2K72
3720C56m80K95n22K94J83K36k04j27j62M46q8o9Q5r9L0M8j48l01M06j19j61J27
3742B6j43r6K03j3m1m1r4J39L3m5N4j8l1Q0j6o6J87j08J62l0k75J70J14j81P8
$$ plain form
3576 -27 258 248 133 -244 19 -74 75 -16 -106 -91 100 -339 -204 53 -100 48 -134 -170 -187 370 231 46 373
3599 373 257 -8 294 171 214 138 -16 5 -132 114 127 67 -35 -37 -190 -40 230 123 -130 -25 -41 -96 11
3622 11 65 77 8 179 61 315 -27 341 72 98 128 -232 147 45 129 -107 -50 8 25 -20 -21 45 -165 -172 -2
3647 -2 -25 -172 11 -307 -275 -203 -113 -77 -45 13 -297 -195 9 -28 -114 19 113 137 -9 277 122 187 47 -40 157
3672 157 150 -26 -34 -60 -189 -71 132 -150 234 15 -488 -185 -68 1 73 18 -82 150 -66 -102 197 -19 148
3695 148 73 -160 180 7 376 248 -1 -25 -53 325 316 230 42 -137 -141 -226 183 -89 -75 -120 -136 -203 2 84 356
3720 356 -124 171 -351 -57 126 362 158 31 -131 315 227 158 243 144 174 222 74 -227 179 60 -101 26
3742 26 -117 -213 -10 -23 -64 -105 -199 -60 -27 -72 -18 -36 -67 13 -3 -69 118 10 172 142 -133 37 151 -30 48
3767D8o2K02k62L16k37L1R7m36M7K32o4m0J11j64R4J70k22J66j57R3O7J50p0J60
3791B70j92j4J81q1K0k12J67j52O1k0q0J34k22K30k29j85M0L11m9q5O1J64r4l05
3815b81J79j19M70m62L56j66J03q0l73M28k5J17P6j44j4K3mJ5m00K49j8J9q9J00
3839d0M3M2l9j66J25j59K7qj8J27M4j20O2J04oJ05J09j02om0q8j29L45k02k81
3864b71K79J60j66j0J02j05r6J45J4j80k37L82l16J03L74k01j1j68k3K55Q6j8
3886I8o4j22J26J45k55L54l48K59j14j95K47Ol22L06k10J74Q3k32M2k90M5k5J46
3909a46j20L31j62J19l8L23k40R8j01K10l24M5J9J40J88k57J69r2j10l0K92m6
3931B68k20P4n4oLk66M2N0l9J23j06k8Q3j81K31j4j2K14k78J20K33l35K50J2j0
$$ plain form
3767 48 -14 188 -74 242 5 36 133 -303 -256 -24 -88 -128 -17 -181 -87 83 -139 27 -130 -37 30 180 110 270
3791 270 78 64 245 164 184 -28 139 -13 48 28 -52 82 -140 90 -139 -324 -284 27 -22 -107 -46 118 24 -281
3815 -281 -102 -221 249 -213 143 -23 80 0 -373 55 30 147 223 79 65 88 84 99 -301 -52 -70 -51 -140 -40
3839 -40 3 45 6 -160 -35 -194 -167 -175 -193 -66 -22 -142 -80 24 18 123 232 130 124 84 -4 -133 212 10 -271
3864 -271 8 168 2 -8 94 -11 -107 38 52 -128 -365 17 -299 -196 178 -23 -34 -202 -225 30 116 98
3886 98 34 -88 38 183 -72 282 -66 193 79 -116 131 137 -185 121 -89 85 168 -64 -22 -312 -267 -292 -146
3909 -146 -266 65 -97 22 -16 307 67 165 64 274 -50 -5 14 154 342 85 254 162 52 22 314 268
3931 268 48 122 68 62 65 -201 -159 -109 -148 -25 -131 -159 -76 -257 -26 -40 -52 162 -116 4 237 -98 152 164 154
3956A54O1j62L08m62K51q7N0J16m56J66QN4j43L5J46k18K74j4R3q3po7j31k0J82
3981D8j11K9L34m1k23l2k04J26k9J5N8L1%P7j47r7K45j27KoJ02j46j64J82rN4
4007c3j76J26o5L8J34L6J4n7l3O6J63j74j80M23j93k15R4j6J96k68oL3L3n4k0
4032a34Q2J8o5M0J50j3J11m64K44P4k08M7L22m54R5L35N2k56J78k66l2M50m41
4055a35K02p7K47j98l7J48n40L78J6o6k0J92l80J38j52M48k28q9L60j02o5k64
4077b24J55J19J40k0K5j22J38kl74J25J2J31l67M38j32J53n4q1k20L41m89J08
4099b00J67k61J58N14k73k54R2J72j92q5J79R7m3r6P7L38l54qj93L97k40J94O7
4122B53j12q0j60J87qj86K54j11O1j96J46p8l1K7RmO4o0L7Q8l47L38j08O9j90
$$ plain form
3956 154 215 53 361 -101 150 63 113 229 -227 -61 -53 1 -142 -107 39 -179 95 81 174 91 84 17 -114 -134 48
3981 48 -63 -34 300 259 36 4 -200 -74 -103 -88 -30 1 1 78 -69 -166 79 -48 -46 -52 50 -96 -260 -78 -87 -33
4007 -33 -209 -83 -148 -110 24 60 74 17 -16 50 213 39 -141 282 89 -126 -32 -48 148 -120 -126 -93 -60 -114 -134
4032 -134 -52 -34 -99 -59 91 78 189 -275 -31 43 -165 -118 204 -250 -155 180 232 -24 154 -112 -144 306 -135
4055 -135 67 -10 237 39 2 150 -390 -12 4 -62 -82 110 -270 -132 -284 164 -64 -153 207 105 40 -224
4077 -224 -69 50 190 170 195 73 211 209 -165 -40 -28 103 -264 174 42 195 141 60 -160 181 -308 -200
4099 -200 -33 -294 -136 378 105 -149 -57 115 -77 -162 17 114 71 -25 52 390 36 28 -165 232 -8 186 253
4122 253 141 61 -99 88 80 -106 148 37 98 -98 48 -30 -61 -34 -25 -29 35 -25 12 100 -247 91 -17 52 -138
4147a38L72j95j40j73J86K42k29k0K90k20O2j11J37K2q7j95J72j61O8K6j20J16
4169i6m1N8k17qK97q7l15M79Nl1o9R4M9j30J12P1k16k4K08p8j8%K8L7P2l90P3
4196a37J61J72k42qr7n9K19J12k2j2k77K52J29M6n3k22J44k64J22J80j28K25k14
4219B7J47k20J2k14K45ll38M72Q6k77L43j37k76J03l27K17K26o4L9qo0p4L7J21
4243G7j17J31k9j45K41N0k46J62j6j59O1J51j1o8omm29K86K8m8J46k18J88l57
4267c32K66J1J97m03L90M4k9J7j51J59J3j99M02k22o2O2l77L53o4j50J19n9J02
4290H7j84K32j28J58j32j45j02l1J03j34M67k59R0R1k48J45k1J27Q2J75k27r5
4312E1q7J71Q9k54mR8j57L9J10Lq9kJ32j82l7Pp8R8J57j89N4N7n4M5R3pJ29j59
$$ plain form
4147 -138 234 39 -101 -274 -88 154 -75 -95 195 -25 37 -74 63 85 -2 -197 -25 -186 -118 -92 -212 -96
4169 -96 -137 -79 -296 -304 -7 -94 -409 70 75 44 -25 69 118 -12 100 171 -45 -69 139 61 43 43 71 108 180 -210 -137
4196 -137 24 196 -46 -54 -151 -210 9 121 99 87 -190 62 191 237 184 -38 106 -158 -36 144 16 241 27
4219 27 174 -46 -34 -248 -3 -6 -344 128 214 -63 280 143 -133 -30 -357 -140 86 22 61 53 -7 -81 -44 77
4243 77 -40 91 62 -83 158 208 -38 124 108 -51 10 161 150 82 76 72 -357 -71 -43 -91 55 -163 25 -332
4267 -332 -66 -55 142 -261 129 173 144 161 10 169 182 -17 385 163 101 163 -214 139 75 -75 44 -15 87
4290 87 -97 135 7 165 33 -112 -214 -245 -142 -276 191 -68 22 113 -135 10 -11 116 198 373 146 51
4312 51 -36 135 224 -30 -34 64 -93 -54 56 59 -30 -32 100 -82 -119 -112 -190 -92 65 -124 -70 -13 -67 -22 71 64 193 34
4340C4O3l18K93J9K8O8k07K8m5J31o6L8O3l43L41k43K91L0j86j22k7J90j6l09
4364b65J74N1J84j52j47O8L89l17Q2N9j27P1O0K5r3k9j03l4J52J1K1j84J4j47
4388b37J81R8j52K42r4p6N6m5R3l21kK04J95J63j35K2k98j56K30n2L18M8k09P0
4412A43P5j43j8k86O2J69J7P5m44M19j69Qj03J07o5J14M8L3j83L9J59L6l9k9k59
4437b34J44j01J05J09K66j5o0l14J45o8J81j30J06l42J34r4j60J31J52K5j74K07
4459A3q0j94K74q2j37J03Q8N1K5J66n86L35N5l8K88l09P7J0q8K08r1n3M5n9j35
4484a14K11J42m42O7M6p8K2L21k49O1k85M58o8m5j99M8O5K3J38q4K45m95M55k44
4508aM8R0K5k42Q5n0j57K0Q6j13Q3J41L9j1j1n9l7L69k94j25K74j10k2l28K37
$$ plain form
4340 34 97 -221 72 91 119 187 -20 8 -37 94 28 66 129 -214 127 -116 175 205 19 -103 -130 60 44 -265
4364 -265 -91 -40 144 -8 -155 -87 302 -15 67 126 -1 70 130 155 62 33 -70 -104 48 59 80 -104 -90 -237
4388 -237 -56 42 -110 132 38 -38 18 -27 66 -255 -257 -53 142 305 170 192 -106 -262 -32 -84 234 282 73 143
4412 143 218 75 57 -229 -167 2 19 94 -350 69 -100 -92 -195 -88 -153 -39 9 42 -141 -102 57 93 54 25 -234
4437 -234 -90 -191 -86 23 289 274 214 -100 45 -23 158 28 134 -208 -74 -168 -328 -197 -45 -20 -194 13
4459 13 -67 -261 13 -69 -206 -103 -15 36 61 227 -359 -24 31 -7 281 -28 49 59 -29 179 88 35 80 21 -114
4484 -114 97 239 -203 -136 -90 -168 -146 175 -74 -13 -298 160 92 47 -152 -104 -39 -16 122 38 283 -212 243 -1
4508 -1 47 137 162 -80 5 -45 -202 -182 -96 -209 -126 15 54 43 32 -27 -64 305 11 -114 160 50 28 -300 -63
4533f3l8M5J83q7mK35k34J06j1k59L34j80k9n6K22k47J12L4r1q2p2Q5O8Q7k38
4558a80K58Q6j62nk16L38P2l95K31k98K99NJ22J29o3l46J95N5l41J12j9P9L9m5
4582e0J5j44K63j61O5J68l94J34RK41j35k60L15k2J98k43J42l0k01J56k0J50k04
4605hn2K42k23k4j04k6J06J77j69J24j14J27k85nKO0J89k28K15q0J66l70K28J61
4629A09o5L0P8j16r4J82n6k40K08J33j66p1J82J36m57K34l7j33K51n3j16N1j69
4652a79J64j68K35j88o0N4J82m7m7J24J53N2m37L39j98J7OJ65m10M74k26N0j54
4675i9j07L09j20j35n2O0L16j3l44m6K47K14l41J23K20l04J64o8q0J56MJ25j3
4698B16P8k21J98l01J63L8k40p0J10j40J55j76K64j06o8PK20k23j41J36P0O6j97
$$ plain form
4533 -63 -101 -56 127 40 36 271 37 143 132 -127 207 27 -2 -58 164 -83 29 63 -28 -110 -182 -97 -29 58 -180
4558 -180 78 164 2 -3 -219 119 191 -204 27 -271 28 33 155 284 221 -125 70 125 -216 -104 -123 -44 -5 -50
4582 -50 -35 -179 84 -77 -12 156 -238 -104 -95 146 11 -249 66 44 242 -1 141 111 -90 66 46 196 -8
4605 -8 -60 182 -41 -65 -169 -195 -89 88 -81 43 -71 56 -229 -234 -232 -172 17 -211 4 -76 90 -280 -52 109
4629 109 44 74 152 36 -58 124 68 -172 36 169 3 -68 114 250 -207 27 -10 -143 108 55 -61 -10 -179
4652 -179 -15 -183 52 -136 -196 -142 40 -7 -54 70 223 275 -162 177 -21 -4 2 167 -243 231 5 55 -99
4675 -99 -206 103 -17 -152 -204 -144 172 159 -185 -231 16 230 -111 12 232 -72 92 24 -56 100 104 229 216
4698 216 294 73 271 -30 133 171 -69 -139 -29 -169 -14 -190 74 -32 -100 -93 127 -96 -237 -101 -31 35 -162
4721a62K57j81qJ03O0M1P2m5k02k8K39k01L3M6J01j83P1O4j19J31j89L2K78l99
4745a89o1K87j82J60j44J12l7J13P4k91L22k16q6j33N47l1k06q5L6M2n0K17q2
4768A17j50l8J01j36j8L81m46J17m2Nj82Q2K59p4j03M6o7J35J21r1J02k22J78
4791G5J32l17J83N2j23m6J87l40J31p8K27j36K12j11j37O7mJ10k33K48l14J35
4813h0P5M8o9M1Q9k31j57L39j24L6J98j82Q2k17K45j62R5K42l17P5J8p4k4Q1m9
4838b2K21k55L7J11l28J59N4n2L3Q4J73j39J76k56k33L82j08j16oj0K11j70L4
4861b0J03j78L0R4k10L61j18j45R1k46K71q9j26J91q4K0j2K3L5J60j51k3j32J55
4885@L1J61o2q9j25j37P6K41j77K23n1j29K20O7k47M5K22j25k18J62k46J89M9
$$ plain form
4721 -162 95 -86 -94 9 69 110 182 137 -65 -93 146 -55 -22 24 125 -58 13 77 -42 89 -100 -68 210 -189
4745 -189 -250 37 -145 15 -129 -17 -54 59 133 -158 164 -52 -138 -271 276 245 39 -46 -10 32 -18 199 117
4768 117 -33 -71 30 -106 -124 257 -189 -72 -114 -109 -291 -209 50 -24 -127 -81 -148 -13 108 17 119 -103 75
4791 75 207 -110 73 125 2 -44 143 -197 -66 -144 83 -53 159 48 -89 -22 -26 84 -149 99 -215 -80
4813 -80 -5 43 -26 15 104 -127 -284 55 -69 -33 165 -17 65 -152 93 -69 26 268 -49 26 44 -30 -54 27 -22
4838 -22 199 -56 -19 92 -236 -77 -23 -75 -42 42 215 76 252 -4 -237 145 37 -79 -85 -95 116 -54 -20
4861 -20 83 -95 -65 29 -181 180 62 -83 8 -238 33 -56 -182 9 -75 -55 -67 -44 -9 151 0 -23 -155 0
4885 0 31 192 130 41 -84 -221 -145 96 -81 142 91 -38 182 249 2 47 269 144 -74 88 -158 31 80
4908H0k88P8J7K88l24J93O9R7j97j0J30K1k81J2O2L68j59J95n5j31n1n2Q6k59
4932a11J68L9j43J35m7n0l37L26J7J85q8l37N37l53J34j8J45k08R4j53K38j48
4954B5nK1J24j79L6K63k24n5k9K44j71J12k56P3Qj92M55l67J24j57j24K10MJ65
4978A05l37M44r5r8K61k74K21k39%K5J53q0J8p1j28K28k67L6K38j97n9K96k36
5001e6J25j19J80j40j4j66L62r1k07K41j28k47L44j61oj07J98r5K42K6m2j33k72
5024b66L60k3k92K27J07k60o2M00j10n2k09O5L5J43j38K56n19K68K8N1P4r7J19
5047A05M9j06j17R4o5K0Q5j95J09RK69p8j72p4j9K71j00p2k64L72k11j3J53n5
5071eK1NkJ21j54j44J0K58K02j07k23OP0j16J43J00j92j36J33J24l35P3K08n0
$$ plain form
4908 80 -208 -130 -113 175 -149 44 113 210 13 3 133 154 -127 -115 -53 315 156 351 296 165 114 62 148 -111
4932 -111 57 96 -47 88 41 -9 -346 -20 -3 182 94 -243 294 -59 75 57 202 -6 88 -65 173 25
4954 25 20 41 165 -14 22 285 61 6 -23 221 50 162 -94 -21 -13 -205 250 -117 7 -150 -274 -64 -60 105
4978 105 -232 212 117 19 280 6 227 -12 -12 13 166 86 104 33 -95 133 -134 -98 140 -57 -116 180 -56
5001 -56 69 -50 130 -10 -24 -190 172 81 -126 115 -13 -260 84 -77 -83 -190 8 -87 155 181 139 6 -266
5024 -266 94 71 -221 6 113 -147 -209 191 81 29 -180 -115 -80 63 -75 181 -338 -70 -42 9 83 -14 105
5047 105 154 48 -69 25 -40 -20 65 -130 -21 -12 257 179 7 -67 -86 185 85 13 -251 121 -90 -103 50 -5
5071 -5 16 21 19 140 -14 -158 -148 110 312 205 -18 -12 58 -58 85 185 -7 -143 -10 114 -221 -148 60 10
5095A0M5K53k66r7M6k63K80k40L26j98j5Q8K0lL6j27Q7O8J17j82K12k93J33j04
5119f7K6M4Jn7R0N0M0j39j05j15KP4k3mJ61r6o1J21J22n7J28J11n37K38J1j99
5145b41J42j2J36P3j06n6P2j7q2J43K9O9l63o8J17J29L06l64R4m4l51M72J1p7
5169A2j14J54q4J63J41l27J31K20m21K06m3K1J5l57J30K46p5n1Q6j29K68j66m0
5192a4k12K82r3J43l4j89N7q3M8K14k20J24K18k17P8J2k05K96q0j44J57j35J5
5215A8j42L24j99R0R6j76r9J8J55l4N2L4j95m8P5l4k53J73J92R1j28kj45J89o8
5240a6O3J26j99M5P8k23L07k2j71j00L07K25k96r5k77K87j21K34j26k3J15j06
5262A2K2J53j05j10p2J08j24L06k82J58r8J63n5k54J79K63j00k6j98K41K4m38
$$ plain form
5095 10 55 308 42 -55 -9 -272 8 -232 94 -104 -119 -31 -11 -14 22 -105 -18 50 167 -15 197 -96 37 -67
5119 -67 -41 3 4 -53 37 87 127 -12 -117 -232 -230 -156 -179 -183 -22 -118 -179 -58 64 7 135 246 -291 -53 -42 -241
5145 -241 -99 -111 25 98 -8 -64 8 -9 -91 52 81 150 -213 -281 -164 -35 271 -93 1 -43 -394 78 89 12
5169 12 -102 52 -32 131 272 -55 76 296 -125 81 38 59 74 -283 -153 93 18 -33 53 -76 192 26 -14
5192 -14 -226 56 -37 106 72 -117 -60 -143 -95 119 -101 23 241 24 102 114 -91 205 125 -19 138 3 18
5215 18 -124 200 1 91 187 11 -88 -70 85 51 103 137 -58 -106 -31 -65 -318 -145 47 138 10 8 -137 52 -16
5240 -16 47 173 -26 19 97 -126 181 159 -12 -112 195 420 124 29 -248 39 -82 152 26 3 118 12
5262 12 34 187 82 -28 -100 8 -116 190 -92 66 -32 131 76 -178 1 264 164 138 -60 181 205 -233
5284b33K79R5j63K40km37J80j91K73j10n4K28k94M49j34l49O6J39J9O4r2q7%j40
5308b54K23j31M6K39L3k89K62j75J73k22J65p0O7Q2k21q9P1J17N4J2l64K69q0
5331h2KP3k23L16J60j81j06J92j47J84J9P6l77K28P3m27M08j26m7NL21n43J70
5354c2K76j57r9R3l62J78K24l04J1J36L1p4K3J52J03L6k18j9On0K52j78K02k27
5378CP8m1%j44J25j03J05j30J3j54R4K40l7p5K50j43j53K37j84K7k34J67p1j00
5402b30Q5J15K06j62J69j7j18j11Q1J49m0j43l72J70K3L9J43K24m75J25K46k81
5424a74K93l09R0L9k5k8J19m1L7P7p8k0K22n4J32k69j75J34l6K89l99K55r5J14
5448I8kR2m9k19m1L1j07L18k9r1L5l6j04j45K30p4p3j3K05J16q0j15O5K8oL05
$$ plain form
5284 -233 46 141 -22 218 216 -221 -41 -232 41 -69 -123 105 -189 260 126 -223 -157 -18 1 65 -27 -114 -114 -254
5308 -254 -31 -162 -116 123 156 -133 129 -46 127 -95 70 0 67 149 -72 -161 -90 27 81 93 -271 -2 -82
5331 -82 -80 -7 -230 86 246 65 -41 151 4 188 207 283 -94 134 207 -220 188 62 15 20 341 -202 -32
5354 -32 244 87 -12 81 -281 -103 121 -183 -172 -36 -5 -79 -56 96 199 235 17 -2 4 -46 206 28 230 3
5378 3 81 40 40 -104 21 -82 23 -107 -94 -248 -154 86 49 -26 224 81 -72 165 -19 8 -226 -59 -130 -230
5402 -230 -145 -30 176 14 183 166 48 -63 18 167 127 -16 -388 -218 -195 -156 -13 211 -264 -139 107 -174
5424 -174 119 -190 -100 -61 -86 -114 5 -36 1 78 0 -20 202 148 280 11 -164 -30 -66 223 -176 79 -16 98
5448 98 96 188 139 -80 -121 -90 -197 121 92 1 36 0 -104 -249 -19 -93 -166 -179 26 142 62 -53 12 40 34 339
5474C39k21k56n2J48N5k8j80J06J7K55l51M51k79J21l11J81O3k82L37j87O0K55
5496B41o4k46m4K97n5j34M9q7K9r7R7K58j08j26M3L5k27J92j74J71K10j99J4R1
5520A66n5k06n9K82o7j61J98M7l02P0K20k22R3rj54K05p3o3J50j19K78k00l3J71
5544A57l55K40l0K5j45J20Q6k47L31k46J51q8k52L89l8j60K04j02l1J1K94j73
5566A41j62L0j66J70l7j45M11p8m58J54l20L25L29l04J73m4j96L38Mk1k73N2j56
5589b33L89m34K84j62J31K07l85K37K7jL0K44l60Q8K23j61j80K71Pk44K29m00
5611a93L48l27L18j09r4K8J34j19J93k61P2j13l2J59M6%j90N20k07k88M24l52
5633d3K01Qj51J80l19O6p1L14k57l7N8q8j75J69n9J58j16J54J04j78J75j13k31
$$ plain form
5474 339 118 -138 -190 -42 13 -15 -195 -89 -72 183 -168 283 4 125 -186 -5 58 -224 113 -74 -14 241
5496 241 177 -69 -113 184 129 -5 44 -43 -14 -111 -14 244 136 10 53 88 -139 53 -121 50 260 61 75 166
5520 166 111 -95 -154 128 61 -100 98 145 -157 -87 133 -89 4 -5 -159 46 -27 -90 60 -59 219 19 -14 157
5544 157 -198 42 12 37 -108 12 98 -149 182 -64 87 -1 -253 136 98 -62 142 40 9 20 314 141
5566 141 -21 9 -157 13 -24 -169 242 164 -294 -140 -460 -135 194 -110 63 19 -177 161 165 144 -129 -77 -233
5589 -233 156 -278 6 -156 -25 182 -203 34 61 60 90 334 -26 62 285 124 -56 215 222 -22 207 -193
5611 -193 155 -172 146 37 -57 -29 105 -14 179 -82 -10 -123 -155 4 50 50 -140 380 173 -115 309 -43
5633 -43 158 166 15 195 -124 -58 -129 185 -72 -109 -51 -139 -314 -145 -204 -46 -162 -8 96 -82 93 -20 -251
5656b51M12j60j05m2K84p7J02p7k5m4N0J2k34L60m6k30J26Q2j40K51k85K82M5
5679B90k52k66L19l17M0J3L6J42K1K93k23j55L3l9O2K40k57J86k01J86K5m8j60
5702c2J93N5k23m0k32M67j93J8r4K54J6j90q0oJ90j75L01j89n4j24jQ0J31J95
5726B67l32k9J21L9K4P1J21l73K32k42L44j66j93M4J36j15K49l18k13L37j69J17
5748d8l6o9J10J96k50r3J12J01Q7p0j73L34j48J40j34p7J08l17K80j22m0K18k77
5771a68Q5j1J89k06L54j58j04r8J11q5J59j41m4%KJ4N6J90o8OP1l6j18O9M9j36
5797a8N0q5N5j3R8j65K13k2L9j62j27k7M09n00M75j83r5J64N0k73J29j38k6J64
5821A2j13R1J28k28K32J02k46J76j65R5q6N9k09J00P6q0o1l7K54k33m1n5k25M31
$$ plain form
5656 -251 161 1 -104 -146 138 61 163 86 61 17 67 79 -155 205 159 -71 55 137 -3 248 -37 245 290
5679 290 38 -228 91 -226 -186 -173 -137 5 26 319 96 -59 -26 -65 -3 237 -20 166 -35 151 176 128 -32
5702 -32 161 216 -7 -47 -279 188 -5 13 -81 173 189 -1 -81 -87 103 -72 229 40 -14 -138 -139 -59 72 267
5726 267 -65 -94 27 66 90 161 282 -91 141 -101 243 77 -116 -72 64 -51 198 -120 -333 4 -165 -48
5748 -48 -84 -153 -43 153 -97 -190 -78 23 110 40 -133 201 53 193 59 -18 90 -227 53 -69 -109 109 -168
5771 -168 -83 -94 95 -111 243 85 -19 -117 -6 -91 68 -73 -117 -117 -115 -101 -45 145 77 83 154 118 0 69 118 -18
5797 -18 32 -53 2 -11 87 -78 135 113 152 -10 -137 -164 245 -255 220 37 -58 106 156 -117 12 -126 -152 12
5821 12 -101 -10 118 -110 122 224 -22 154 -11 84 -2 57 -152 -52 24 -56 -117 -154 100 -133 -174 -229 -454 -23
5845b3p6R0n8j4J44j97j00L09j77J99q2J04j18J16J73j93Nj83J56r0L6m1j7J07
5869G0J54k19K6K7k35L62k78j32L55k18L64l73j8J14k13J18J33j94K36%N9j66
5891b8K11l08J45N4k54J46J9R3j3mOJ4Nk16K66q1l03l0K78NL6j96L3K0J5J51j32
5918f8K4NJ69j23j89K32L0M9j28j76jJ29K1p2K09k91J25j9J16N8k61L40k04N7
$$ plain form
5845 -23 -99 -9 -67 -81 63 -134 -234 75 -102 97 15 119 1 117 290 97 102 -81 75 -15 21 -20 -37 70
5869 70 224 5 31 58 -177 185 -93 -225 130 -88 276 -97 -115 -1 -214 -96 37 -157 79 79 138 -28
5891 -28 183 -125 20 74 -180 -34 -15 78 65 61 67 81 86 -130 136 55 -248 -278 0 5 41 -155 -122 -102 -87 64 -68
5918 -68 -44 -39 130 7 -182 50 80 129 1 -175 -176 -47 -26 -98 111 -180 -55 -74 42 100 -161 179 -25 32
$$ [...]
8191A00
##END NTUPLES=NMR FID
##END=
