##TITLE=1H_Ser 6-8-V-H
 CDCl3
 8 sc, 
 15.04.2022
##JCAMPDX= 6.0         $$ Bruker NMR JCAMP-DX V2.0
##DATA TYPE= NMR FID
##DATA CLASS= NTUPLES
##ORIGIN= UXNMR, Bruker Analytische Messtechnik GmbH
##OWNER= root
$$ XWIN-NMR		Version 3.5
$$ Fri Apr 15 10:45:41 2022 Russian Standard Time (UT+4h)  she@DPX200
##.OBSERVE FREQUENCY= 200.13135
##.OBSERVE NUCLEUS= ^1H
##.DELAY= (6, 6)
##.ACQUISITION MODE= SIMULTANEOUS
##.ACQUISITION SCHEME= undefined
##.AVERAGES= 8
##.DIGITISER RES= 18
##SPECTROMETER/DATA SYSTEM= spect
##.PULSE SEQUENCE= zg30
##.SOLVENT NAME= CDCl3
##.SHIFT REFERENCE= (INTERNAL, CDCl3, 0, 15.7039)
##AUDIT TRAIL= $$ (NUMBER, WHEN, WHO, WHERE, WHAT)
$$ ##TITLE= Audit trail, XWIN-NMR		Version 3.5
$$ ##JCAMPDX= 5.01
$$ ##ORIGIN= Bruker BioSpin GmbH
$$ ##OWNER= she
$$ F:/spectra/data/she/nmr/H-F/1/audita.txt
$$ ##AUDIT TRAIL=  $$ (NUMBER, WHEN, WHO, WHERE, WHAT)
(   1,<2022-04-15 10:44:08.26 +0400>,<she>,<DPX200>,
      <created by zg, POWCHK disabled, PULCHK disabled
       configuration hash MD5:
       00 E9 B6 7A A2 85 ED C7 34 08 36 98 17 FE 4E 26
       data hash MD5: 16K
       33 A0 8E F7 90 07 E9 E6 55 1B B2 B3 37 7A CE 0B>)
$$ ##END=
$$ 
$$ hash MD5
$$ EB 59 CC 26 95 00 CA D6 A5 A6 48 1E 12 96 E8 3B
##$RELAX= 
##$RELAX= 
##$RELAX= 
##$RELAX= 
##$RELAX= 
##$RELAX= 
$$ Bruker specific parameters
$$ --------------------------
##$DU= <F:/spectra>
##$EXPNO= 1
##$NAME= <H-F>
##$PROCNO= 1
##$TYPE= <nmr>
##$USER= <she>
##$AMP= (0..31)
100 100 100 100 100 100 100 100 100 100 100 100 100 100 100 100 100 100 
100 100 100 100 100 100 100 100 100 100 100 100 100 100 
##$AQSEQ= 0
##$AQ_mod= 1
##$AUNM= <au_zg>
##$AUTOPOS= <>
##$BF1= 200.13
##$BF2= 200.13
##$BF3= 200.13
##$BF4= 200.13
##$BF5= 200.13
##$BF6= 200.13
##$BF7= 200.13
##$BF8= 200.13
##$BYTORDA= 1
##$CFDGTYP= 0
##$CFRGTYP= 5
##$CHEMSTR= <none>
##$CNST= (0..31)
1 1 145 1 1 1 1 1 1 1 1 1 1 1 1 1 1 1 1 1 1 1 1 1 1 1 1 1 1 1 1 1 
##$CPDPRG= <>
##$CPDPRG1= <>
##$CPDPRG2= <>
##$CPDPRG3= <>
##$CPDPRG4= <mlev>
##$CPDPRG5= <mlev>
##$CPDPRG6= <mlev>
##$CPDPRG7= <mlev>
##$CPDPRG8= <mlev>
##$CPDPRGB= <>
##$CPDPRGT= <>
##$D= (0..31)
0 1.2 0 0 0 0 0 0 0 0.06 0 0.03 0 0 0 0 0.0002 0 0 0 0 0 0 0 0 0 0 0 0 
0 0 0 
##$DATE= 1650005047
##$DBL= (0..7)
120 120 120 120 120 120 120 120 
##$DBP= (0..7)
150 150 150 150 150 150 150 150 
##$DBP07= 0
##$DBPNAM0= <>
##$DBPNAM1= <>
##$DBPNAM2= <>
##$DBPNAM3= <>
##$DBPNAM4= <>
##$DBPNAM5= <>
##$DBPNAM6= <>
##$DBPNAM7= <>
##$DBPOAL= (0..7)
0.5 0.5 0.5 0.5 0.5 0.5 0.5 0.5 
##$DBPOFFS= (0..7)
0 0 0 0 0 0 0 0 
##$DE= 6
##$DECBNUC= <off>
##$DECIM= 32
##$DECNUC= <off>
##$DECSTAT= 4
##$DIGMOD= 1
##$DIGTYP= 9
##$DL= (0..7)
0 120 120 120 120 120 120 120 
##$DP= (0..7)
150 150 150 150 150 150 150 150 
##$DP07= 0
##$DPNAME0= <>
##$DPNAME1= <>
##$DPNAME2= <>
##$DPNAME3= <>
##$DPNAME4= <>
##$DPNAME5= <>
##$DPNAME6= <>
##$DPNAME7= <>
##$DPOAL= (0..7)
0.5 0.5 0.5 0.5 0.5 0.5 0.5 0.5 
##$DPOFFS= (0..7)
0 0 0 0 0 0 0 0 
##$DQDMODE= 0
##$DR= 18
##$DS= 0
##$DSLIST= <SSSSSSSSSSSSSSS>
$$ [...]
##$SUBNAM2= <"">
##$SUBNAM3= <"">
##$SUBNAM4= <"">
##$SUBNAM5= <"">
##$SUBNAM6= <"">
##$SUBNAM7= <"">
##$SUBNAM8= <"">
##$SUBNAM9= <"">
##$SW= 18.05172834244
##$SWIBOX= (0..15)
0 0 2 0 0 0 0 0 0 0 0 0 0 0 0 0 
##$SW_h= 3612.71676300578
##$TD= 16384
##$TD0= 1
##$TE= 0
##$TE2= 300
##$TE3= 300
##$TEG= 300
##$TL= (0..7)
0 120 120 120 120 120 120 120 
##$TP= (0..7)
150 150 150 150 150 150 150 150 
##$TP07= 0
##$TPNAME0= <>
##$TPNAME1= <>
##$TPNAME2= <>
##$TPNAME3= <>
##$TPNAME4= <>
##$TPNAME5= <>
##$TPNAME6= <>
##$TPNAME7= <>
##$TPOAL= (0..7)
0.5 0.5 0.5 0.5 0.5 0.5 0.5 0.5 
##$TPOFFS= (0..7)
0 0 0 0 0 0 0 0 
##$TUNHIN= 0
##$TUNHOUT= 0
##$TUNXOUT= 0
##$USERA1= <user>
##$USERA2= <user>
##$USERA3= <user>
##$USERA4= <user>
##$USERA5= <user>
##$V9= 5
##$VALIST= <valist>
##$VCLIST= <CCCCCCCCCCCCCCC>
##$VD= 0
##$VDLIST= <DDDDDDDDDDDDDDD>
##$VPLIST= <PPPPPPPPPPPPPPP>
##$VTLIST= <TTTTTTTTTTTTTTT>
##$WBST= 1024
##$WBSW= 4
##$XGAIN= (0..3)
0 0 0 0 
##$XL= 0
##$YL= 0
##$YMAX_a= 190836
##$YMIN_a= -371259
##$ZGOPTNS= <>
##$ZL1= 120
##$ZL2= 120
##$ZL3= 120
##$ZL4= 120
##$ABSF1= 10
##$ABSF2= 0
##$ABSG= 5
##$ABSL= 3
##$ALPHA= 0
##$AQORDER= 0
##$ASSFAC= 0
##$ASSFACI= 0
##$ASSFACX= 0
##$ASSWID= 0
##$AUNMP= <proc_1d>
##$AZFE= 0.1
##$AZFW= 0.1
##$BCFW= 1
##$BC_mod= 2
##$BYTORDP= 1
##$COROFFS= 0
##$CY= 11.3945322036743
##$DATMOD= 1
##$DC= 2
##$DFILT= <>
##$DTYPP= 0
##$F1P= 2.36226072786647
##$F2P= -0.459571619588291
##$FCOR= 0.5
##$FTSIZE= 0
##$FT_mod= 4
##$GAMMA= 1
##$GB= 0.15
##$INTBC= 1
##$INTSCL= 1
##$ISEN= 128
##$LB= 0.24
##$LEV0= 0
##$LPBIN= 0
##$MAXI= 10000
##$MC2= 0
##$MEAN= 0
##$ME_mod= 0
##$MI= 1.114404
##$NCOEF= 0
##$NC_proc= 0
##$NLEV= 6
##$NOISF1= 3.799351
##$NOISF2= 2.8
##$NSP= 1
##$NTH_PI= 0
##$NZP= 0
##$OFFSET= 15.70392
##$PC= 1
##$PHC0= -18393.4
##$PHC1= 13.40074
##$PH_mod= 1
##$PKNL= yes
##$PPARMOD= 0
##$PSCAL= 0
##$PSIGN= 0
##$REVERSE= no
##$SF= 200.130013532006
##$SI= 16384
##$SIGF1= 3
##$SIGF2= 2
##$SINO= 400
##$SIOLD= 16384
##$SREGLST= <1H.CDCl3>
##$SSB= 0
##$STSI= 0
##$STSR= 0
##$SW_p= 3612.71676300578
##$SYMM= 0
##$S_DEV= 0
##$TDeff= 0
##$TDoff= 0
##$TI= <>
##$TILT= no
##$TM1= 0
##$TM2= 0
##$TOPLEV= 0
##$USERP1= <user>
##$USERP2= <user>
##$USERP3= <user>
##$USERP4= <user>
##$USERP5= <user>
##$WDW= 1
##$XDIM= 8192
##$YMAX_p= 0
##$YMIN_p= 0
$$ End of Bruker specific parameters
$$ ---------------------------------
##NTUPLES= NMR FID
##VAR_NAME=  TIME,          FID/REAL,        FID/IMAG
##SYMBOL=    X,             R,               I
##VAR_TYPE=  INDEPENDENT,   DEPENDENT,       DEPENDENT
##VAR_FORM=  AFFN,          ASDF,            ASDF
##VAR_DIM=   8192,          8192,            8192
##UNITS=     SECONDS,       ARBITRARY UNITS, ARBITRARY UNITS
##FACTOR=    0.0002768,     1,               1
##FIRST=     0,             0,               0
##LAST=      2.2672688,     0,               0
##MIN=       0,             -371259,         0
##MAX=       2.2672688,     190836,          0
$$ Real data points
##PAGE= N=1
##DATA TABLE= (X++(R..R)), XYDATA
$$ [...]
$$ plain form
1923 -360 -163 -83 -286 -837 -1191 -885 -621 -481 -504 -850 -727 -830 -100 150 551 413 175 208 787 1059 1044
1944 1044 946 937 493 622 1101 1009 399 115 -103 -514 -180 20 -36 -512 -1200 -1163 -740 -255 -419 -872 -677 -839
1966 -839 -556 131 260 32 -258 143 325 709 916 922 589 493 854 803 687 925 402 18 67 3 248 -65
1988 -65 -279 -396 -1054 -828 -524 -517 -638 -780 -835 -669 -339 -265 83 32 -315 144 390 640 815 968 594 57
2010 57 602 1122 937 533 55 77 -139 302 280 -5 -523 -830 -1008 -720 -168 -624 -935 -818 -841 -713 -83
2031 -83 139 -178 -333 -137 -185 498 923 730 381 500 422 612 1105 961 667 374 0 42 169 615 -3
2052 -3 -777 -835 -379 -681 25 -305 -1282 -959 -917 -345 -128 -4 -533 -645 58 415 757 675 647 -206 149 1000
2074 1000 953 920 896 542 250 368 600 280 86 -5 -703 -642 -392 -248 -756 -732 -566 -1060 -805 -134 -289 -500
$$ packed form
1923c60J97Q0k03n51l54L06K64J40k3l46J23j03P30K50M01j38k38L3N79K72j5
1944A044r8rm44J29M79r2o10k84k18m11L34K00n6m76o88L7M23M85j64m53J95j62
1966h39K83O87J29k28k90M01J82L84K07Ol33r6L61n1j16K38n23l84M9o4K45l13
1988f5k14j17o58K26L04Pj21j42n5J66L30P4L48n1l47M59K46K50J75J53l74n37
2010E7N45N20j85m04m78K2k16M41k2k85n18l07j78K88N52m56l11J17k3J28O30
2031h3K22l17j55J96m8O83M25j93l49J19p8J90M93j44k94k93l74M2J27M46o18
2052cp74n8M56l02P06l30r77L23M2N72K17J24n29j12P03L57L42q2k8q53L55Q51
2074A000m7l3k4l54k92J18K32l20j94r1o98O1K50J44n08K4J66m94K55O71j55k11
$$ plain form
2096 -500 -248 -559 -276 592 672 549 515 496 632 912 1270 948 282 215 362 367 694 632 -409 -512 -177 -360
2118 -360 -257 -73 -665 -1125 -876 -656 -672 -345 -429 -856 -602 -224 53 121 477 245 222 547 738 572 1090
2139 1090 1026 402 490 487 293 463 357 -26 -319 -347 -67 -281 -54 -583 -1023 -1081 -568 -487 -376 -318 -793 -880 -203
2162 -203 393 162 13 201 -254 221 1139 998 662 275 275 507 698 1252 380 46 48 -238 -151 36 -398 -521
2184 -521 -797 -706 -977 -472 -301 -459 -642 -470 -401 -227 293 371 122 -209 222 469 779 1000 636 -95 393
2205 393 917 730 869 493 -179 -291 105 401 284 -71 -871 -906 -691 -385 -482 -537 -521 -880 -677 -187 -178 -235
2227 -235 -160 -29 -79 216 593 781 508 349 394 514 943 777 517 562 -161 -212 222 302 -6 -571 -626 -856
2249 -856 -683 -241 -149 -719 -718 -956 -551 -101 -343 -270 -472 -70 -45 279 559 642 369 133 545 547 820 743 327
$$ packed form
2096e00K52l11K83Q68Q0j23l4j9J36K80L58l22o66o7J47NL27o2j041j03L35j83
2118c60J03J84n92m60K49K20j6L27q4m27K54L78K77O8L56k32k3L25J91j66N18
2139A090o4o24Q8lj94J70j06l83k93k8K80k14K27n29m40n8N13Q1J11N8m75q7O77
2162b03N96k31j49J88m55M75R18j41l36l87%K32J91N54q72l34Kk86Q7J87m34j23
2184e21k76R1k71N05J71j58j83J72O9J74N20P8k49l31M31K47L10K21l64p31M88
2205C93N24j87J39l76o72j12L96K96j17l55q00l5K15L06r7n5J6l59K03M90Rn7
2227b35P5J31n0K95L77J88k73j59M5J20M29j66k60M5p23n1M34Q0l08n65n5k30
2249h56J73M42R2n70Jk38M05M50k42P3k02M02K5L24K80Q3k73k36M12KK73p7m16
$$ plain form
2272 327 -160 229 129 140 261 -325 -532 -739 -530 -581 -430 -569 -621 -877 -987 -720 -160 -85 -155 -456 -27 90
2294 90 516 607 426 185 344 383 765 866 526 277 403 104 227 177 243 -196 -491 -401 -143 -222 -488 -570 -893
2317 -893 -744 -609 -216 -333 -94 -702 -237 3 306 562 396 277 176 551 735 884 848 315 475 329
2337 329 674 293 435 -66 -404 -200 -352 -38 -325 -483 -859 -787 -492 -422 -424 -290 -512 -509 -347 47 529 495
2359 495 109 296 359 785 817 699 762 237 516 288 538 434 250 36 -307 -104 -253 -67 -383 -585 -571
2380 -571 -746 -596 -515 -214 -592 -363 -437 -54 295 210 97 332 216 420 700 917 761 582 345 359 529
2401 529 557 492 118 -31 -289 -101 -60 -321 -310 -704 -554 -804 -444 -152 -632 -799 -784 -434 -139 179 155 113
2423 113 113 84 486 903 755 537 315 514 358 751 594 263 -76 -65 -12 95 -100 -196 -455 -815 -651 -209
$$ packed form
2272C27m87L89j00J1J21n86k07k07K09n1J51j39n2k56j10K67N60P5p0l01M29J17
2294I0M26R1j81k41J59L9L82J01l40k49J26k99J23n0O6m39k95R0K58p9k66q2l23
2317h93J49J35L93j17K39o08M65K40L03K56j66j19j01L75J84J49l6n33J60j46
2337C29L45l81J42n01l38K04j52L14k87j58l76P2K95P0kJ34k22LJ62L94M82l4
2359D95l86J87O3M26L2j18O3n25K79k28K50j04j84k14l43K03j49J86l16k02J4
2380e71j75J50Q1L01l78K29p4L83L49q5j13K35j16K04K80K17j56j79k37J4J70
2401E29K8o5l74j49k58J88M1k61J1l94J50k50L60K92m80j67J5L50K95L18k4m2
2423A13%k9M02M17j48k18k22J99j56L93j57l31l39J1N3J07j95r6k59l60J64M42
$$ plain form
2445 -209 -289 -579 -591 -884 -485 -197 90 54 -212 -223 -131 102 691 732 435 391 207 423 666 637 384 222 -184
2468 -184 25 207 190 132 -515 -534 -619 -680 -116 -297 -679 -623 -761 -575 -5 -81 -238 -197 -129 127 196 548 393
2491 393 477 218 572 422 532 539 -2 135 21 33 237 198 32 -421 -485 -175 -534 -303 -613 -857 -663 -584
2513 -584 -279 -230 -90 -90 -237 -311 182 285 255 460 627 92 409 539 677 449 406 329 179 521 266 -68
2535 -68 -153 -318 -373 -206 -244 -152 -752 -732 -720 -553 -326 -24 -492 -483 -145 -393 -72 504 300 61 206 557 586
2558 586 596 514 310 39 466 284 582 300 71 -448 -234 -18 -473 -128 -548 -600 -546 -499 -285 -410 -239 -132
2580 -132 -250 -368 107 84 356 232 -238 113 574 644 421 858 413 76 367 749 582 424 16 -205 -43
2601 -43 -74 -214 -571 -618 -263 -708 -188 -289 -137 -376 -445 -307 -101 285 297 31 54 340 277 580 662 718 409
$$ packed form
2445b09q0k90j2k93L99K88K87l6k66j1R2K33N89M1k97m4j84K16K43k9k53j62m06
2468a84K09J82j7n8o47j9q5o1N64j81l82N6j38J86N70p6j57M1O8K56O9L52j55
2491C93Q4k59L54j50J10Pn41J37j14J2K04l9j66m53o4L10l59K31l10k44J94P9
2513e84L05M9J40%j47p4M93J03l0K05J67n35L17J30J38k28m3p7j50L42k55l34
2535f8q5j65n5J67l8R2o00K0J2J67K27L02m68RL38k48L21N76k04k39J45L51K9
2558E86J0q2k04k71M27j82K98k82k29n19K14K16m55L45m20n2N4M7K14j25J71J07
2580a32j18j18M75k3K72j24m70L51M61P0k23M37m45l37K91L82j67j58m08k21J62
2601d3l1j40l57m7L55m45N20j01J52k39o9J38K06L86J2k66K3K86o3L03Q2N6l09
$$ plain form
2624 409 570 485 267 293 513 -50 -103 -34 -163 -14 135 -342 -595 -482 -579 -254 -469 -249 -575 -548 91 -67
2646 -67 196 287 31 270 292 285 335 435 534 158 272 387 554 347 62 -28 14 21 112 89 -129 -195 -437 -581 -178
2671 -178 -385 -663 -336 -440 -556 -651 -141 37 52 -33 -93 -264 170 484 245 458 103 227 605 775 354
2692 354 261 226 301 -27 -3 300 -188 -547 -94 -506 -369 -257 -575 -446 -466 -302 -210 -67 -86 -413 -136 307
2714 307 47 408 248 605 198 205 378 491 508 322 42 49 175 45 -116 110 -466 -293 -379 -156 -326 -366
2736 -366 -454 -376 -354 -306 -189 -159 -190 -116 -117 118 214 316 418 312 647 247 843 597 233 312 390 368 378 256 101
2761 101 -149 -251 -211 -60 -405 -279 -456 -553 -329 -487 -211 -47 -249 -275 -165 62 67 352 275 268 208 259 327 525
2785 525 497 256 448 380 451 87 136 -93 -236 -12 -117 -219 -277 -402 -572 -649 -251 -337 -133 -483 -472 -262 -224
$$ packed form
2624D09J61q5k18K6K20n63n3O9j29J49J49m77k53J13r7L25k15K20l26K7O39j58
2646f7K63R1k56K39K2pN0J00R9l76J14J15J67k07k85r0M2PR1k3k18o6k42j44M03
2671a78k07k78L27j04j16r5N10J78J5q5o0j71M34L14k39K13l55J24L78J70m21
2692C54r3l5P5l28K4L03m88l59M53m12J37J12l18J29k0J64R2J43j9l27K77M43
2714C07k60L61j60L57m07PJ73J13J7j86k80PJ26j30j61K26n76J73q6K23j70m0
2736c66q8P8K2M8J17L0l1P4jK35R6J02J02j06L35m00N96k46l64P9P8k2J0j22j55
2761A01k50j02M0J51l45J26j77r7K24j58K76J64k02k6J10K27NK85p7po0N1O8J98
2785E25k8k41J92o8P1l64M9k29j43K24j05j02n8j25j70p7L98q6K04l50J1K10L8
$$ plain form
2808 -224 -29 -10 186 80 293 234 604 375 502 238 388 366 264 749 228 311 166 180 -154 -139 16 -359
2830 -359 -351 -194 -525 -420 -531 -354 -382 -323 -301 -167 173 148 193 389 149 201 482 473 441 208 236 128 139 494
2854 494 301 172 211 -22 43 69 -123 -746 -428 -493 -270 -311 -479 -217 -451 -331 -218 -95 -94 111 113 36 218
2877 218 265 428 385 404 261 437 166 206 368 305 89 83 -36 142 -260 -148 -49 -221 -330 -122 -494 -427 -607
2900 -607 -588 -332 -310 -215 13 -299 109 -73 228 217 553 133 477 196 398 607 464 220 407 -19 151
2921 151 16 71 -149 -60 -243 -127 -117 -410 -455 -611 -163 -204 -24 -264 -412 -99 -18 32 43 302 165 194 400
2944 400 242 404 307 534 488 -9 257 191 -132 -21 -59 -134 -53 -285 -160 -269 -116 -288 -395 -126 -579 -139
2966 -139 -354 -276 -73 51 107 -163 378 75 358 273 435 273 487 232 232 263 331 115 204 -6 -76 -44 -115 -279
$$ packed form
2808b24J95J9J96j06K13n9L70k29J27k64J50k2j02M85n21Q3j45J4l34J5J55l75
2830c59QJ57l31J05j11J77k8N9K2J34L40k5M5J96k40N2K81rl2k33K8j08J1L55
2854D94j93j29L9k33O5K6j92o23L18o5K23m1j68K62k34J20J13J23JK05Kp7J82
2877B18M7J63m3J9j43J76k71M0J62o3k16oj19J78m02J12R9j72j09K08l72O7j80
2900f07J9K56K2R5K28l12M08j82L01j1L36m20L44k81K02K09j43k44J87m26J70
2921A51j35N5k20Q9j83J16J0k93m5j56M48m1J80k40j48L13Q1N0J1K59j37K9K06
2944D00j58J62r7K27m6m97K66o6l23J11l8p5Q1k32J25j09J53j72j07K69m53M40
2966a39k15P8K03J24N6k70N41l03K83q5J62j62K14k55%L1O8k16Q9k10p0L2p1j64
$$ plain form
2990 -279 -312 -110 -364 -67 -424 -285 -333 -400 -145 -150 -160 -159 58 202 -204 512 135 221 27 303 466 200 589
3013 589 271 365 195 204 36 -85 -97 -256 -310 -153 -660 -254 -181 -253 -314 -172 -230 -505 -176 -275 -172 105 -21
3036 -21 -86 321 138 185 276 272 403 176 299 111 411 417 156 153 -77 -20 5 -15 -377 -174 -354 -485 -148 -276
3060 -276 -419 -528 -54 -212 110 -203 -9 -165 -40 119 186 177 415 350 504 480 219 261 169 72 220 367 16
3083 16 27 72 27 -288 -300 -169 -291 -414 -211 -343 -509 -16 -405 -255 -183 -71 -129 147 58 146 275 171 37
3106 37 281 274 405 263 238 144 146 304 177 -113 -21 -284 -175 -338 53 -533 -201 12 -108 -162 -311 -276 -58
3129 -58 76 33 -102 103 129 25 107 282 105 61 145 471 554 250 197 1 207 63 196 -13 -81 -117 -117 50
3153 50 -262 -361 -589 -271 -124 -114 -210 -241 -168 40 56 -151 47 -33 215 111 148 147 8 117 334 526 450 94
$$ packed form
2990b79l3K02k54K97l57J39m8o7K55nj0JK17J44m06P16l77Q6j94K76J63k66L89
3013E89l18R4j70Rj68j21j2j59n4J57n07M06P3p2o1J42n8k75L29r9J03K77j26
3036b1o5M07j83M7R1mJ31k27J23j88L00Ok61lk30N7K5k0l62K03j80j31L37j28
3060b76j43j09M74j58L22l13J94j56J25J59O7rK38o5J54k4k61M2r2r7J48J47l51
3083A6J1M5m5l15j2J31j22j23K03j32j66M93l89J50P2J12n8K76q9Q8J29j04j34
3106C7K44pJ31j42k5r4KJ58j27k90R2k63J09j63L91n86L32K13j20n4j49L5K18
3129e8J34m3j35K05K6j04Q2J75j77m4Q4L26Q3l04n3j96K06j44J33k09o8l6%J67
3153E0l12r9k28L18J47J0r6l1P3K08J6k07J98q0K48j04L7jj39J09K17J92p6l56
$$ plain form
3177 94 83 223 335 -64 -254 117 -9 -110 -248 -129 -222 -308 -148 -92 47 -122 -154 -157 102 84 203 46 22
3200 22 112 118 423 335 130 33 435 119 456 56 153 -193 -88 -217 -247 40 -454 -254 -330 -349 -354 -188 40 -379
3224 -379 -140 -253 -272 155 -210 239 -73 227 138 412 178 287 118 178 362 79 225 49 202 2 28
3245 28 -143 -191 -397 -31 -449 -216 -388 -154 -248 -229 -223 -400 -98 -169 -40 3 -88 -48 115 155 290 192 186 575 249
3270 249 186 175 16 322 192 37 -207 33 -35 -287 -10 -13 -482 -458 -172 -255 -348 -333 -358 -61 -88 -166 55 -84
3294 -84 44 299 113 257 230 325 251 322 369 234 133 129 190 -54 -137 19 -106 34 -233 -183 -120 -185 -150 -350 -181
3319 -181 -209 -318 -206 -208 34 176 -193 88 69 441 200 352 203 316 3 353 336 128 254 142 159 109
3341 109 242 -161 -66 -108 -123 -213 -120 -7 -148 -311 -151 -207 -119 -55 -245 28 175 -22 73 160 188 234 234 229 186 362
$$ packed form
3177I4j1J40J12l99j90L71j26j01j38J19r3q6J60N6J39j69l2lK59j8J19j57k4
3200B2R0OL05q8k05r7M02l16L37m00R7l46J05j29l0K87m94K00p6j9nJ66K28m19
3224c79K39j13j9M27l65M49l12L00q9K74k34J09j69O0J84k83J46j76J53k00K6
3245B8j71m8k06L66m18K33j72K34r4J9Oj77L02p1J29M3r1M0J63M0J35r8oL89l26
3270B49o3j1j59L06j30j55k44K40o8k52K77lm69K4K86q3r3J5k5K97k7p8K21j39
3294h4J28K55j86J44k7R5p4P1M7j35j01mO1k44q3J56j25J40k67N0O3o5L5k00J69
3319a81k8j09J12kK42J42l69K81j9L72k41J52j49J13l13L50j7k08J26j12J7n0
3341A09J33m03R5m2j5r0R3J13j41j63J60n6Q8O4j90K73J47j97R5Q7K8M6%nm3J76
$$ plain form
3367 362 173 125 234 133 144 -208 -69 -177 -95 -128 -175 -239 -104 -77 -441 -254 -108 -323 59 -116 -166 -96 31
3390 31 127 88 -45 33 -34 361 232 471 347 273 430 40 238 39 244 20 -139 -431 -129 -358 -259 -268 -445
3413 -445 -242 -285 -86 -83 -22 -151 -28 25 36 222 188 61 466 205 107 250 439 59 196 104 191 174 148 153 -7
3438 -7 -212 -156 -280 -209 -43 -248 -496 -323 -404 -267 4 -161 -363 -187 73 55 -117 34 52 196 121 174 431
3461 431 266 463 203 66 145 185 93 197 -66 52 -154 -70 13 -243 -191 -111 -286 -335 -163 -70 -367 -413 -167
3484 -167 -19 -78 21 62 -9 -52 126 404 132 134 162 203 159 301 190 212 -258 139 91 15 -223 -174 -149 -256 -364
3509 -364 -202 -310 -68 -165 -472 -129 -413 -69 -240 -147 -152 28 91 96 192 -5 211 388 448 159 180 -174 -223 129
3533 129 68 -12 -473 -109 -139 -80 15 -177 -271 -131 -50 -375 -125 -62 100 23 138 -102 -72 -20 278 277 178 146 247
$$ packed form
3367C62j89m8J09j01J1l52J39j08Q2l3m7o4J35K7l64J87J46k15L82j75n0P0J27
3390C1R6l9j33P8o7L95j29K39j24p4J57l90J98j99K05k24j59k92L02k29R9rj77
3413d45K03m3J99LO1j29J23N3J1J86l4j27M05k61r8J43J89l80J37r2Q7j7k6Nj60
3438gk05N6j24P1J66k05k48J73q1J37K71j65k02J76K60j8j72J51J8J44p5N3K57
3461D31j65J97k60j37P9M0r2J04k63J18k06Q4Q3k56N2Q0j75m9J72R3k97m6K46
3484a67J48n9R9M1p1m3J78K78k72KK8M1m4J42j11K2m70L97m8p6k38M9K5j07j08
3509c64J62j08K42r7l07L43k84L44j71R3nJ80O3NR6j97K16J77O0k89K1l54m9L52
3533A29o1q0m61L64l0N9R5j92r4J40Q1l25K50O3J62p7J15k40L0N2K98jr9l2J01
$$ plain form
3558 247 274 316 137 338 267 -48 53 117 33 40 -23 -102 -146 -345 -273 -286 -275 -142 -123 -321 -445 122 52 -124 -85
3583 -85 -210 16 421 464 212 118 435 282 227 438 -69 -155 141 162 141 172 -86 -84 -245 45 -68 -37 -42 -146
3607 -146 -308 -159 -93 -225 -128 -295 -138 -40 203 62 86 64 165 135 301 580 286 59 165 67 10 -87 24
3630 24 200 98 -55 -189 -19 148 -181 -245 -223 -328 -345 -38 -333 -337 -149 -33 29 82 256 -100 -38 19 -5 212
3654 212 379 52 38 175 -2 54 158 20 -109 -369 222 76 -239 -124 -115 -246 -248 -273 -111 -378 -105 -140 -174
3677 -174 -94 -200 -65 -39 263 179 -76 16 204 -51 -7 439 -242 304 347 107 -4 84 90 -266 -132 63 -107
3700 -107 -349 -117 -154 -248 -118 -314 -143 -64 -123 -60 -21 241 -34 -15 275 144 -30 293 163 21 166 -43
3722 -43 192 282 203 29 -2 -124 -168 -78 190 -106 -323 -111 -98 -203 -218 34 -345 -278 -84 -52 46 -66 31 -133
$$ packed form
3558B47K7M2j79K01p1l15J01O4q4Po3p9m4j99P2j3J1J33J9j98j24N67p0j76L9
3583h5j25K26M05M3k52r4L17j53n5K11n07q6K96K1k1L1k58Kj61K90j13L1nj04
3607a46j62J49O6j32R7j67J57R8K43j41K4k2J01l0J66K79k94k27J06r8n7r7J11
3630B4J76j02j53j34J70J67l29o4K2j05j7L07k95mJ88J16O2N3J74l56O2N7k4K17
3654B12J67l27j4J37j77N6J04j38j29k60N91j46l15J15Rj31kk5J62k67K73l5l4
3677a74Q0j06J35K6L02q4k55R2J88k55M4M46o81N46M3k40j11Q8Ol56J34J95j70
3700a07k42K32l7r4J30j96J71P9n9O3L9K62k75J9K90j31j74L23j30j42J45k09
3722d3K35R0p9j74l1j22m4R0K68k96k17K12J3j05j5K52l79O7J94L2R8j12R7j64
$$ plain form
3746 -133 27 270 147 236 149 311 192 112 151 28 117 239 -299 -62 159 -3 37 -84 49 -67 -7 -224
3768 -224 174 -72 -264 -185 -95 -66 27 -140 2 -86 -84 102 76 176 336 70 103 -120 -51 139 -239 144 130 3
3792 3 139 -10 -140 39 78 -151 -29 -57 -1 -303 -286 -127 -193 -61 -169 151 121 -120 342 25 -32 140 143 418
3816 418 30 334 121 56 -282 187 111 168 -277 -67 38 -56 -309 -6 -254 -264 -312 -181 -162 -187 -144 -112 38
3839 38 -36 32 -120 62 79 27 -125 -40 181 191 310 217 116 -53 -49 -188 -193 59 -125 -39 -267 -60 -76 -235 -169
3864 -169 -237 7 28 32 -59 -52 -221 -145 -67 -95 94 237 146 114 235 -79 236 499 133 391 390 -178 -58 -100 351
3889 351 -106 -216 189 -69 98 -117 -164 -26 -200 -33 86 -268 -27 -121 -17 -256 155 237 -199 -157 -45
3910 -45 95 100 163 40 -19 182 275 250 131 -64 116 218 -177 -112 -146 35 -148 -237 40 -240 -146 -210 -40 -56
$$ packed form
3746a33J60K43j23Q9q7J62j19q0L9j23Q9J22n38K37K21j62M0j21J33j16O0k17
3768b24L98k46j92P9R0K9R3j67J42q8KJ86k6J00J60k66L3k23O9J90l78L83j4j27
3792CJ36j49j30J79L9k29J22k8N6l02J7J59o6J32j08L20l0k41M62l17n7J72LK75
3816D18l88L04k13o5l38M69p6N7m45K10J05r4k53L03k48j0m8J31J9k5M3L2J50
3839C8p4O8j52J82J7n2j52Q5K21J0J19r3j01j69Mj39nK52j84Q6k28K07j6j59O6
3864a69o8K44K1Mr1Pj69P6P8k8J89J43r1l2J21l14L15K63l66K58jn68J20m2M51
3889C51m57j10M05k58J67k15m7J38j74J67J19l54K41r4J04k39M11Q2m36M2J12
3910d5J40NO3j23n9K01R3k5j19j95J80J02l95O5l4J81j83q9K77k80R4o4J70j6
$$ plain form
3934 -56 -128 -128 49 -2 60 -1 215 93 -10 37 396 -179 177 80 137 237 53 18 -64 -80 277 -117 -38 -82 68
3959 68 -223 -114 -19 -126 -142 -141 -175 86 -137 181 191 -14 -140 -72 195 183 160 50 481 13 211 38 372
3982 372 235 9 5 147 13 -275 46 -114 37 60 72 219 -51 -220 -250 -63 -39 -127 94 63 152 53 2 263
4006 263 279 239 111 80 18 146 268 130 -54 160 79 50 223 236 -58 -99 199 111 -124 0 -227 -253 -327 -50
4030 -50 -59 -200 254 13 99 36 137 108 190 156 46 -117 167 335 208 422 131 -27 78 -9 142 167 -4
4053 -4 -385 -8 206 -13 -241 -164 -131 -384 -129 -78 13 -194 157 17 -103 184 278 50 76 -61 215 374 135
4076 135 106 63 60 49 45 112 8 -302 -141 185 -256 -268 85 -169 -252 -192 -272 -105 98 43 -65 69 69 181 140
4101 140 112 282 93 154 15 190 113 64 69 89 205 116 27 -51 -28 -184 -187 86 -183 -105 34 -454 -71 -119 204
$$ packed form
3934e6p2%J77n1O2o1K16j22j03M7L59n75L56r7N7J00j84l5q2j6L57l94P9m4J50
3959F8k91J09R5j07j6Jl4K61k23L18J0k05j26O8K67j2k3j10M31m68J98j73L34
3982C72j37k26mJ42j34k88L21j60J51K3J2J47k70j69l0J87K4q8K21l1Q9r9n1K61
4006B63J6m0j28l1o2J28J22j38j84K14q1k9J73J3k94m1K98q8k35J24k27k6p4K77
4030e0rj41M54k41Q6o3J01k9Q2l4j10j63K84J68j27K14k91j58J05q7J51K5j71
4053dl81L77K14k19k28P7L3k53K55N1R1k07L51j40j20K87R4k28K6j37K76J59k39
4076A35k9m3lj1mO7j04l10J61L26m41j2L53k54q3O0q0J67K03n5j08J34%J12m1
4101A40k8J70j89O1j39J75p7m9NK0J16q9q9p8K3j56lK73k69P8J39m88L83m8L23
$$ plain form
4126 204 -242 -7 -3 -320 72 407 85 86 108 183 35 274 471 -51 63 130 186 32 97 2 -163 50 -216
4149 -216 -283 10 201 -150 -296 -108 -289 -254 -159 -259 -192 -109 -40 -88 132 89 -37 169 322 169 122 261 -123
4172 -123 -10 -61 201 74 -29 239 -126 -48 28 -157 54 82 -17 -199 17 2 74 -77 -110 9 -33 177 69
4195 69 15 92 92 -26 39 127 80 -81 271 70 133 282 138 -190 -136 58 -119 45 22 -184 -204 4 127 15
4219 15 66 -12 -140 -304 -185 -74 13 217 91 -18 -57 110 124 -85 240 55 219 306 -104 -260 192 56
4241 56 22 102 -17 -142 26 68 -62 40 -264 -280 -99 -33 -73 4 -10 20 49 61 14 -109 66 391 272 107
4265 107 100 183 -161 120 196 58 -81 117 300 -58 339 3 -150 -172 -120 60 35 -145 -115 53 -1 59 -72
4288 -72 148 89 -105 2 -241 171 -12 195 183 134 230 49 244 128 151 173 91 66 204 369 117 -156 -130
$$ packed form
4126B04m46K35Ml17L92L35l22JK2P5j48K39J97n22J14O7N6j54O5r5j65K13k66
4149b16o7K93J91l51j46J88j81L5R5j00O7Q3O9m8K20m3j26K06J53j53m7J39l84
4172a23J13n1K62j27j03K68l65P8P6j85K11K8r9j82K16j5P2j51l3J19m2K10j08
4195F9n4P7%j18O5Q8m7j61L52k01O3J49j44l28N4J94j77J64k3k06k0K08J23j12
4219A5N1p8j28j64J19J11Q7K04j26j09l9J67J4k09L25j85J64Q7m10j56M52j36
4241E6l4Q0j19j25J68M2j30J02l04j6J81O6m0P7j4L0K9J2m7j23J75L25j19j65
4265A07pQ3l44K81P6j38j39J98J83l58L97l36j53k2N2J80k5j80L0J68n4O0j31
4288g2K20n9j94J07k43M12j83K07j2m9R6j81J95j16K3K2q2k5J38J65k52k73K6
$$ plain form
4311 -130 37 -188 128 -93 -126 -94 -61 -86 26 200 -164 -314 136 34 -53 192 -195 64 -89 211 195 -62
4333 -62 -9 84 95 -44 15 -57 -172 -186 -17 -197 -18 17 86 -205 -116 -11 -10 40 73 -47 91 -50 248 6 196
4358 196 2 -197 7 149 247 334 -14 -10 138 315 197 -52 -62 -73 -127 31 -100 -158 65 -131 48 -51 -142
4381 -142 -241 -92 -169 -1 -168 -203 24 -208 -45 125 -98 46 256 234 218 -81 174 -193 171 44 212 198
4403 198 -8 -8 -33 -36 -44 -109 -180 -365 -286 68 331 -99 -153 -170 -123 -215 -161 -46 49 27 137 177 153 428 70 47 255
4430 255 113 47 81 203 122 -58 -256 -53 -91 -70 -16 -253 2 -92 -156 -251 -227 -125 -134 -242 -80 -42 -212 99
4454 99 34 -116 147 144 90 115 103 -135 -31 -196 86 -110 42 37 -70 1 323 -209 219 166 -161 -79 132 -119
4478 -119 -147 59 -70 -105 47 -137 37 101 32 -35 282 55 -80 144 60 333 192 256 70 -40 100 -179
$$ packed form
4311a30J67k25L16k21l3L2L3k5J12J74l64j50M50j02q7K45l87K59j53L00j6k57
4333f2N3R3J1j39N9p2j15j4J69j80J79L5O9k91Q9J05JN0L3j20J38j41K98k42J90
4358A96j94j99K04J42R8Q7l48MJ48J77j18k49j0j1n4J58j31n8K23j96J79r9r1
4381a42r9J49p7J68j67l5K27k32J63J70k23J44K10k2j6k99K55l67L64j27J68j4
4403A98k06%k5lqo5p1j85P9L54K63m30n4j7M7r2N4J15R5k2J10M0k4K75l58k3K08
4430B55j42o6L4J22q1j80j98K03l8K1N4k37K55r4o4r5K4J02rj08J62L8j70L11
4454I9o5j50K63ln4K5j2k38J04j65K82j96J52nj07P1L22n32M28n3l27Q2K11k51
4478a19k8K06j29l5J52j84J74O4o9o7L17k27j35K24q4K73j41O4j86j10J40k79
$$ plain form
4500 -179 87 -11 23 40 -56 105 -142 -17 -46 154 -68 -116 137 -113 -233 -39 -60 103 6 91 -61 42 -42
4523 -42 -7 165 245 162 -37 -227 -16 93 256 43 -268 29 -108 -309 88 -140 1 24 -204 -32 -175 -63
4545 -63 -198 42 -110 -222 40 -20 294 -118 133 195 -70 -104 128 181 40 13 101 81 39 110 57 36 -14 93
4569 93 225 -119 -174 44 -109 -176 -18 -100 45 -222 5 71 -285 231 149 224 25 79 236 -38 -87 47 128
4592 128 -15 148 2 3 184 -119 -263 153 -38 124 -346 167 -99 -94 -134 -15 169 -49 -38 -43 -31 91 167
4615 167 -76 58 166 178 -52 42 -21 63 -48 -231 76 -131 33 44 -269 -6 -72 43 138 17 -354 -140
4637 -140 -154 -6 231 -40 -160 59 156 -276 71 277 54 36 337 229 157 155 -85 80 78 174 66 -62 287
4660 287 -147 -159 175 -141 -101 -165 -75 -23 -214 -17 -47 -73 -147 -323 -160 -76 3 -208 157 191 8 220 5 396
$$ packed form
4500a79K66r8L4J7r6J61k47J25k9K00k22m8K53k50j20J94k1J63r7Q5j52J03q4
4523d2L5J72Q0q3j99j90K11J09J63k13l11K97j37k01L97k28J41K3k28J72j43J12
4545f3j35K40j52j12K62o0L14m12K51O2k65l4K32N3j41k7Q8k0m2P1n3k1n0J07
4569I3J32l44n5K18j53o7J58q2J45k67K27O6l56N16q2P5j99N4J57k74m9J34Q1
4592A28j43J63j46JJ81l03j44M16j91J62m70N13k66Nm0J19J84k18J1nJ2J22P6
4615A67k43J34J08J2k30R4o3Q4j11j83L07k07J64J1l13K63o6J15R5j21l71K14
4637a40j4J48K37k71j20K19R7m32L47K06k23j8L01j08p2kk40J65kR6j08j28L49
4660B87m34j2L34l16M0o4R0N2j91J97l0k6p4j76J63Q4P9k11L65L4j83K12k15L91
$$ plain form
4684 396 126 316 40 201 112 78 212 -111 30 -46 -80 105 -161 63 8 -137 -38 86 -64 -257 -12 -145
4706 -145 -194 48 -134 3 -279 -13 125 73 -4 196 196 -4 331 73 170 170 -194 -64 193 60 -99 -122 18
4729 18 -150 -84 -92 -252 -182 -49 -11 -293 50 -109 -84 -74 103 -138 -259 330 187 40 208 -41 13 126 -151
4752 -151 155 85 200 -184 66 -227 -105 -184 -29 -122 -261 -186 147 -137 73 -144 156 7 -49 -147 -88 -138 -59
4775 -59 -141 -103 305 156 -85 343 79 73 292 -111 -59 320 -106 -295 -84 125 -36 -131 133 70 29 -337 -177
4798 -177 -102 -243 -199 67 -141 36 -145 205 -61 -29 237 259 49 78 10 195 168 62 -76 48 125 436 87
4821 87 -155 -8 129 124 -132 7 49 -247 114 117 -97 -182 -17 -87 -169 130 -147 19 -75 282 94 39 -121 38
4845 38 121 200 -11 131 26 -46 63 38 231 -38 -145 63 115 65 -114 238 -118 -97 -7 63 150 -128 -152 -169
$$ packed form
4684C96k70J90k76J61q9l4J34l23J41p6l4J85k66K24n5j45R9J24j50j93K45j33
4706a45m9K42j82J37k82K66J38n2p7K00%k00L35k58R7%l64J30K57j33j59k3J40
4729A8j68O6qj60P0J33L8k82L43j59K5J0J77k41j21N89j43j47J68k49N4J13k77
4752a51L06p0J15l84K50k93J22p9J55r3j39P5L33k84K10k17L00j49n6r8N9n0P9
4775e9q2L8M08j49k41M28k64oK19m03N2L79m26j89K11K09j61r5K64o3m1l66J60
4798a77P5j41M4K66k08J77j81L50k66L2K66K2k10K9o8J85k7j06j38J24P7L11l49
4821H7k42J47J37nk56J39M2k96L61Lk14q5J65p0q2K99k77J66r4L57j88n5j60J59
4845C8Q3P9k11J42j05p2J09k5J93k69j07K08N2n0j79L52l56K1R0P0Q7k78k4j7
$$ plain form
4869 -169 -83 125 -187 256 69 29 40 300 21 52 102 234 155 12 83 94 -21 -42 -190 44 111 37 -155 42
4893 42 -137 -30 -2 -107 116 -245 -11 -264 -66 173 125 -155 123 79 -156 103 -41 -20 189 -37 -158 9
4915 9 62 247 70 -63 -38 -111 37 66 -231 -202 -73 57 -31 119 181 -2 39 97 74 -20 59 -61 -12 281 -24
4940 -24 222 71 29 198 44 84 166 232 255 -184 240 165 -78 65 -83 -198 1 -201 -244 -52 -117 60 -225
4963 -225 13 -161 33 83 274 254 115 213 -139 -11 155 187 49 76 236 253 -102 -166 -66 68 95 75 -160
4986 -160 -18 -88 25 20 -3 -31 -283 -113 -203 134 -23 23 -108 29 83 -107 -13 -43 57 107 169 262 20 188
5010 188 291 85 181 -52 45 3 -85 102 -66 -169 -21 -170 181 207 21 115 -116 -87 -102 152 37 -190 -93
5033 -93 193 223 117 24 191 -98 193 2 -91 -50 2 91 298 -29 -132 -172 42 68 -158 -131 -18 -74 -301 -36
$$ packed form
4869a69Q6K08l12M43j87m0J1K60k79L1N0J32p9j43P1J1j15k1j48K34O7p4j92J97
4893D2j79J07K8j05K23l61K34k53J98K39m8k80K78m4k35K59j44K1K09k26j21J67
4915IN3J85j77j33K5p3J48K9k97K9J29J30q8J50O2j83M1N8k3r4P9j20M9K93l05
4940b4K46j51m2J69j54M0Q2O6K3m39M24p5k43J43j48j15J99k02m3J92o5J77k85
4963b25K38j74J94N0J91k0j39R8l52J28J66L2j38K7J60J7l55o4J00J34K7k0k35
4986a60J42p0J13nk3k8k52J70r0L37j57M6j31J37N4j90R4l0J00N0O2R3k42J68
5010A88J03k06R6k33R7m2q8J87j68j03J48j49L51K6j86R4k31K9j5K54j15k27R7
5033i3K86L0j06r3J67k89K91j91r3M1N2Q9K07l27j03m0K14K6k26K7J13n6k27K65
$$ plain form
5057 -36 -44 -100 -149 183 176 -42 -4 -38 178 -16 165 161 73 -89 124 484 122 105 -74 9 105 78 58 -54 26 -13
5083 -13 -97 -102 130 94 -4 6 46 -142 -159 -119 -127 -338 -96 328 -108 -25 171 46 -162 -34 -22 118 -16 -154 18
5108 18 152 -80 171 0 101 208 -143 -49 136 107 9 -116 -179 217 -106 11 217 -166 -231 94 157 -121
5130 -121 -117 -93 1 94 143 125 -55 -50 205 71 -47 158 123 -312 92 30 -98 25 132 -218 -127 -66 -160 14 89
5155 89 -153 -115 -43 227 -200 -4 62 -5 -47 129 -203 289 -241 -43 -137 54 -157 -43 128 8 137 110 10
5178 10 -12 69 -166 -146 -142 -8 -188 -18 -152 -177 156 -89 -12 244 24 -22 -61 -44 86 76 -3 -11 176 -166 -22
5203 -22 236 366 -133 219 21 -34 44 44 122 43 21 -116 -56 -143 86 138 38 -208 -45 -235 -159 -234 46 -69
5227 -69 132 25 165 253 112 -115 141 91 43 -139 -4 10 53 -77 -11 228 -227 -131 8 -66 -68 116 -82 -146
$$ packed form
5057c6qn6m9L32pk18L8l4K16j94J81mq8j62K13L60l62j7j79Q3R6k7k0j12Q0l9
5083a3q4nK32l6r8J0M0j88j7M0qk11K42M24m36Q3J96j25k08J28J2J40j34j38J72
5108A8J34k32K51j71J01J07l51R4J85k9r8j25o3L96l23J17K06l83o5L25O3k78
5130a21MK4R4R3M9j8j80NK55j34j18K05l5m35M04o2j28J23J07l50R1O1r4J74P5
5155H9k42L8P2K70m27J96O6o7m2J76l32M92n30J98r4J91k11J14J71j20J29k7j00
5178A0k2Q1k35K0MJ34j80J70j34k5L33k45P7K56k20m6l9J7J30j0p9qJ87l42J44
5203b2K58J30m99L52j98n5P8%P8p9k2j37O0q7K29N2j00k46J63j90P6p5K80j15
5227f9K01j07J40Q8j41k27K56n0m8j82J35J4M3j30O6K39m55R6J39p4kJ84j98o4
$$ plain form
5251 -146 -195 113 25 75 -107 -140 -153 19 92 118 -87 45 134 47 -254 101 157 104 131 106 118 -127 -16 -49 -69
5276 -69 -90 -200 -209 18 -67 -147 -237 -81 -184 67 -113 38 -92 21 -175 55 -11 15 31 17 25 227 191 72 68
5301 68 -14 -64 152 186 246 -213 72 189 21 -288 -91 -141 -265 27 38 -108 -105 24 -92 61 -170 -189 2
5324 2 31 62 84 -21 104 213 135 392 -66 123 2 241 -122 -120 -138 194 -57 -184 14 29 -54 19 -193 -221
5348 -221 -14 25 -265 -43 -141 -171 148 307 60 -234 157 52 99 -174 8 -74 89 169 227 -62 71 -132
5370 -132 -184 94 -91 -101 73 68 -20 -131 81 4 -150 12 226 -153 -362 -159 93 92 22 149 17 137 93
5393 93 -72 116 -17 163 -35 314 -249 143 -44 143 31 -104 14 -257 -15 -52 -107 -19 -9 -87 -186 -248 -128
5416 -128 -114 -59 17 -120 45 30 56 85 62 -82 159 41 -10 166 229 59 31 50 -26 36 154 148 -111 -95 -132 -115
$$ packed form
5251a46m9L08q8N0j82l3j3J72P3K6k05J32Q9q7l01L55N6n3K7k5J2k45J11l3k0
5276f9k1j10rK27q5q0r0J56j03K51j80J51j30J13j96K30o6K6J6j4QK02l6j19m
5301F8q2n0K16L4O0m59K85J17j68l09J97n0j24K92J1j46LJ29j16J53k31j9J91
5324BK9L1K2j05J25J09p8K57m58J89j21K39l63Kj8L32k51j27J98J5q3P3k12k8
5348b21K07L9k90K22r8l0L19J59k47k94L91j05M7k73J82q2J63Q0N8k89J33k03
5370a32n2K78j85j0J74nq8j11K12p7j54J62K14l79k09K03K52jp0J27j32J20m4
5393I3j65J88j33J80j98L49n63L92j87J87j12j35J18k71K42l7n5Q8J0p8r9o2J20
5416a28J4N5P6j37J65j5K6K9k3j44K41j18n1J76O3j70k8J9p6O2J18ok59J6l7J7
$$ plain form
5442 -115 -160 -112 -301 23 -85 143 -242 -113 -132 55 -52 -66 294 120 88 67 51 129 136 -217 77 -132 205
5465 205 41 343 -261 84 73 -74 46 -214 -151 -89 97 -114 -217 -248 -77 -33 -163 -50 -62 19 132 51 0
5488 0 140 -149 -63 326 30 168 -87 259 -112 133 -49 -45 10 199 28 -91 22 -221 -50 -93 -85 33 -160
5511 -160 -21 -56 -54 -50 59 -173 249 -261 -11 47 328 64 -10 215 39 72 52 224 96 179 19 110 11 -88
5535 -88 33 -282 -108 -30 -272 -150 -109 135 -97 -5 8 -218 -33 37 -153 -263 104 -4 -353 -80 212 36
5557 36 59 36 151 -6 -98 16 -239 -100 -29 -44 -136 -99 -104 -131 -195 -214 14 -25 202 -79 -43 148 196 104 85 146
5583 146 -9 -28 202 134 227 219 137 -82 -97 -93 -132 82 -160 -143 23 -51 17 -102 33 0 -43 -26 -332 143 -125
5608 -125 53 9 -64 -181 71 -21 -6 -210 91 119 -90 -63 168 261 78 225 311 167 200 -7 -20 -223 -184 -9
$$ packed form
5442a15m5M8j89L24j08K28l85J29j9J87j07j4L60j74l2k1j6P8Pl53K94k09L37
5465B05j64L02o04L45j1j47J20k60O3O2J86k11j03l1J71M4j30J13j2Q1J13q1n1
5488@J40k89Q6L89k96J38k55L46l71K45j82MN5J89j71j19J13k43J71m3QJ18j93
5511a60J39l5KMJ09k32M22n10K50N8K81k64p4K25j76L3k0J72j28Q3j60R1r9r9
5535h8J21l15J74P8k42J22M1K44k32R2J3k26J85P0j90j10L67j08l49K73K92j76
5557C6K3k3J15j57r2J14k55J39P1j5r2L7nk7o4j9K28l9K27k81L6J91M8r2j9O1
5583A46j55j9K30o8R3qq2k19j5Ml9K14k42J7J66p4O8j19J35l3m3J7l06M75k68
5608a25J78m4p3j17K52r2J5k04L01K8k09K7K31R3j83J47Q6j44L3k07j3k03L9J75
$$ plain form
5632 -9 13 -56 -33 -164 -128 95 -17 33 -48 -48 75 -38 -52 -11 -61 -109 -57 78 63 -57 114 187 -11 77 -97 130
5658 130 -119 -9 -73 -94 73 -75 -134 48 -20 98 -195 -157 -175 -407 -118 -73 -49 -105 -144 -11 -25 136 91 -32
5682 -32 38 242 162 326 408 112 232 135 16 90 -5 112 -193 163 17 -116 91 -113 183 -56 -201 -45
5704 -45 -238 55 254 -40 125 234 -32 130 351 -30 146 -100 81 32 67 47 -132 334 53 92 -43 -42
5726 -42 198 -18 -52 -70 -67 -44 14 18 182 155 -81 -185 -118 -41 -120 -41 -10 99 9 -39 -126 145 99 -12 184 208 112
5753 112 223 141 32 -15 75 187 136 -150 78 177 -126 -250 -22 -105 -56 -201 -160 -136 -27 -89 155 -39 28 -31
5777 -31 5 154 -14 188 119 130 -42 90 297 109 243 -14 -5 19 232 -93 175 92 -143 -313 -163 -347 -126
5800 -126 -203 -154 69 152 13 -153 164 31 -263 15 -28 80 -8 -63 428 -62 118 167 175 -16 99 162 22
$$ packed form
5632iK2o9K3j31L6K23j12N0q1%J23j13j4M1n0m8N2J35j5j20J71P3j98Q8j74K27
5658A30k49J10o4k1J67j48n9J82o8J18k93L8j8k32K89M5K4n6l9J33j4J61m5j23
5682c2P0K04q0J64Q2k96J20r7j19P4r5J17l05L56j46j33K07k04K96k39j45J56
5704d5j93K93J99k94J65J09k66J62K21l81J76k46J81m9L5k0j79M66k81L9j35J
5726d2K40k16l4j8LK3N8MJ64k7k36j04O7P7p9P9L1J09r0m8q7K71m6j11J96K4r6
5753A12J11q2j09m7R0J12n1k86K28R9l03j24K28q3M9j45M1K4J09o2K44j94O7n9
5777c1L6J49j68K02o9J1j72J32K07j88J34k57RK4K13l25K68q3k35j70J50j84K21
5800a26p7M9K23Q3j39j66L17j33k94K78m3J08q8n5M91m90J80M9Qj91J15O3j40
$$ plain form
5823 22 159 -164 -160 -131 -64 -88 -19 -229 -152 -137 63 -33 14 -72 -170 -256 25 111 71 209 86 97 -103 89 72 155
5849 155 111 81 36 13 50 -49 -3 80 12 119 -274 -273 -121 -92 -382 -13 21 140 -201 -226 142 -129 116 -19 52
5874 52 -42 -84 183 208 237 235 77 35 59 337 20 211 -14 2 -42 73 168 -135 -129 -175 -162 -84 -95 -159 -89 -196 -62
5901 -62 -10 -1 -56 186 91 183 26 -34 5 -135 67 119 147 127 92 347 9 25 -184 -203 -44 20 -94 -27 -66 -219
5927 -219 12 -116 -100 93 83 -22 57 -218 -202 19 -112 116 117 36 71 -99 59 10 80 -76 147 79 174 62
5951 62 251 -184 -42 221 96 -175 -77 -267 -241 -151 -166 49 -96 -22 43 -173 -75 9 57 24 247 244 -97 122
5975 122 109 -12 159 180 139 67 187 165 155 133 -115 -228 66 29 -139 -296 -270 -133 240 -104 -28 121 71 110
5999 110 10 -58 102 35 -102 336 -194 7 199 263 235 -122 122 44 155 -131 10 217 85 67 -17 -290
$$ packed form
5823B2J37l23MK9O7k4O9k10P7J5K00r6M7q6r8q6K81Q6m0J38j23J1k00J92j7Q3
5849A55m4l0m5k3L7r9M6Q3o8J07l93JJ52K9k90L69L4J19l41k5L68k71K45j35P1
5874E2r4m2K67K5K9kj58m2K4K78l17J91k25J6m4J15R5l03Om6J3P8j1o4P0j07J34
5901f2N2Rn5K42r5R2j57o0L9j40K02N2K8k0l5K55l38J6k09j9J59O4j14O7l9j53
5927b19K31j28J6J93j0j05P9k75J6K21j31K28Jq1L5j70J58m9P0j56K23o8R5j12
5951F2J89m35J42K63j25k71R8j90K6R0j5K15j45P4O5k16R8Q4M8l3K23ll41K19
5975A22j3j21J71K1m1p2J20k2j0k2k48j13K94l7j68j57K6J37L73l44P6J49n0L9
5999A10j00o8J60o7j37M38n30K01J92O4k8l57K44p8J11k86J41K07j32j8q4k73
$$ plain form
6021 -290 48 -50 -89 160 71 -163 -176 53 65 0 -22 180 120 70 -144 182 37 305 116 -82 -112 95 239
6044 239 5 3 74 208 -128 53 12 -270 -301 -302 -106 9 133 -147 -24 -187 -6 -93 -202 182 -46 -32 -160
6067 -160 51 95 108 78 -53 151 82 -18 140 414 -155 90 55 101 52 87 -12 -140 -91 -412 -68 -102 -205 22
6091 22 -31 -72 13 1 -33 -57 113 119 -130 -111 97 122 71 -143 -198 92 -174 194 57 183 223 45 90 -13 -184
6116 -184 124 -97 184 -125 -203 -83 -330 51 195 -48 10 -329 -211 120 -44 113 -3 115 -54 -9 4
6137 4 -110 126 274 -111 -8 53 100 4 101 6 -120 39 -2 -92 79 -168 -471 11 18 -129 9 -92 -79 21
6161 21 159 -66 -8 -150 -22 11 -52 90 116 103 167 -70 -43 -111 -8 49 -121 -154 86 -172 71 -184 -184 -242 -71
6186 -71 -156 -150 -38 -115 -81 -67 -129 -90 98 275 57 248 213 251 283 288 83 16 160 86 -11 -146 -87 41 58 -116
$$ packed form
6021b90L38r8l9K49q9k34j3K29J2o5k2K02o0n0k14L26j45K68j89j98l0K07J44
6044B39k34kP1J34l36J81m1k82l1jJ96J15J24k80J23j63J81q7j09L84k28J4j28
6067a60K11M4J3l0j31K04o9j00J58K74n69K45l5M6m9L5r9j28M9l21L44l4j03K27
6091B2n3m1Q5j2l4k4J70Ok49J9K08K5n1k14n5K90k66L68j37J26M0j78M5j03j71
6116a84L08k21K81l09p8J20k47L81J44k43N8l39J18L31j64J57j16J18j69M5J3
6137Dj14K36J48l85J03O1M7r6R7r5j26J59m1r0J71k47l03M82Pj47J38j01J3J00
6161B1J38k25N8j42J28L3o3J42K6j3O4k37K7o8J03N7j70l3K40k58K43k55%n8J71
6186g1q5OJ12p7L4J4o2L9J88J77k18J91l5L8L2Nk05o7J44p4r7j35N9J28J7j74
$$ plain form
6212 -116 -81 6 -36 -152 -110 -21 -190 -8 -232 58 -27 27 35 7 -105 -36 150 -63 51 -216 46 82 102 105 76
6237 76 156 -184 68 -51 28 22 73 68 -396 12 -109 -106 -43 22 -96 76 -216 -147 -179 -78 -43 -49 -128 -110 -66 -58 46
6264 46 95 -179 519 57 -11 245 161 104 -373 110 -62 -234 -8 0 -10 -161 -374 -201 -212 -49 -289 49 -55
6287 -55 -22 -295 242 230 104 112 88 -19 -113 -254 -74 -105 40 315 -16 153 220 199 -108 2 -67 -66 -70 -161 -111 66
6313 66 -261 -204 -51 162 18 -71 75 -131 -184 31 -156 9 115 -16 63 52 -48 -48 102 159 85 102 -67 177
6337 177 -9 165 -54 -240 47 -156 -211 -28 -74 -239 -84 -45 91 -245 -120 216 -14 -29 -1 84 132 -36
6359 -36 259 16 121 -259 -28 -58 33 -123 -115 188 -130 39 186 126 -53 17 -256 -305 -211 8 63 -103 201
6382 201 -161 -176 -29 -114 179 108 3 5 -97 95 -60 66 -62 154 -60 187 -187 -134 -16 -180 -108 33
$$ packed form
6212a16L5Q7m2j16M2Q9j69J82k24K90q5N4Qk8j12O9J86k13J14k67K62L6K0Lk9
6237G6Q0l40K52j19P9oN1nm64M08j21LO3O5j18J72k92O9l2J01L5op9J8M4QJ04
6264D6M9k74O98m62o8K56q4n7m77M83j72j72K26Qj0j51k13J73j1J63k40L38j04
6287e5L3k73N37j2j26Qk4j07r4j41J80l1J45K75l31J69O7k1l07J10o9Jmr1N0J77
6313F6l27N7J53K13j44q9J46k06n3K15j87J65J06j31P9j1j00%J50N7p4J7j69K44
6337A77j86J74k19j86K87k03n5J83m6j65J55L9J36l36J25L36k30j5K8Q5M8j68
6359c6K95k43J05l80K31l0R1j56QL03l18J69J47o0j79P0k73m9R4K19N5j66L04
6382B01l62j5J47q5K93p1j05Kj02J92j55J26j28K16k14K47l74N3J18j64P2J41
$$ plain form
6404 33 446 -37 -149 -55 -296 -55 228 -247 -145 159 32 -81 -145 147 -190 -15 17 40 36 3 -33 134 329
6427 329 193 51 -133 -136 40 -216 77 -11 143 145 -8 58 -167 144 -278 -132 -101 -130 4 16 -201 -24 15
6450 15 36 -53 31 192 -60 72 75 160 192 21 194 -17 42 123 -63 -92 213 -294 -237 -13 -61 -28 79 -112 -145
6475 -145 96 -146 -119 -76 -7 -45 -73 32 -31 -16 -11 263 -176 95 -206 181 -87 16 120 132 -35 206 64
6498 64 -110 -30 -125 60 -69 104 -277 43 -23 -187 -207 -78 -32 -21 -219 -227 -92 -210 4 55 -85 20 107 223
6522 223 -58 121 69 -125 -116 -12 214 256 -118 64 155 -77 50 25 47 20 -99 -35 -202 -45 -218 185 -90
6545 -90 -253 -168 26 -15 77 26 -132 233 104 72 41 132 -22 -54 203 189 292 -38 6 66 -101 180 -76 2
6569 2 26 44 -78 -2 -79 -207 57 -94 -88 13 84 -101 -232 253 11 101 149 176 15 -19 93 162 248 34 268
$$ packed form
6404C3M13m83j12R4k41K41K83m75J02L04j27j13o4K92l37J75L2K3ml3l6J67J95
6427C29j36j42j84lJ76k56K93q8J54Kj53O6k25L11m22J46L1k9J34J2k17J77L9
6450A5K1q9Q4J61k52J32LQ5L2j71J73k11N9Q1j86k9L05n07N7K24m8L3J07j91l3
6475a45K41k42K7M3O9l8k8J05o3J5NK74m39K71l01L87k68J03J04J2j67K41j42
6498F4j74Q0r5J85j29J73l81L20o6j64k0J29M6J1j98qJ35j18K14N1j40J05Q7J16
6522B23k81J79n2j94RJ04K26M2l74J82R1k32J27k5K2k7j19O4j67J57j73M03k75
6545i0j63Q5J94m1R2n1j58L65j29l2l1R1j54l2K57j4J03l30M4O0j67K81k56P8
6569BK4J8j22P6p7j28K64j51OJ01P1j85j31M85k42R0M8K7j61l4J12O9Q6k14K34
$$ plain form
6594 268 -192 139 -71 -242 112 -152 -30 -11 -176 -179 -67 240 88 -52 -19 -71 -107 33 184 -136 -61 73
6616 73 33 28 168 -3 -244 161 -12 195 326 -90 -131 -169 69 -30 50 -115 88 -200 71 -200 -358 -127 -279
6639 -279 -145 150 -19 7 -7 94 129 -118 93 72 172 -31 -79 24 54 208 300 210 -99 108 23 160 209
6662 209 -12 101 -283 49 46 -167 178 -166 36 -30 -52 -99 -80 -310 -367 -21 15 123 -185 -183 251 67 102 186
6686 186 68 214 239 108 190 154 -97 62 25 49 145 -191 -128 -55 75 -42 -7 120 -193 -111 -227 -35 69
6709 69 -162 157 95 59 135 309 119 -116 81 45 -18 94 230 26 122 48 199 44 108 -243 32 94 -315
6732 -315 127 26 109 32 73 -324 44 -94 -37 23 196 89 111 142 35 -31 82 5 58 210 57 84 48 35
6756 35 63 171 -58 -13 -144 63 167 -48 -210 -62 -117 -228 -29 -48 -120 97 144 -53 -106 230 -16 70 -1
$$ packed form
6594B68m60L31k10j71L54k64J22J9j65lJ12L07j52j40L3n2l6J40J51l20P5J34
6616G3m0nJ40j71k41M05j73K07J31m16m1l8K38r9Q0j65K03k88K71k71j58K31j52
6639b79J34K95j69K6j4J01L5k47K11k1J00k03m8J03L0J54R2r0l09K07q5J37M9
6662B09k21J13l84L32lk13L45l44K02o6k2m7J9k30n7L46L6J08l08KM34j84L5Q4
6686A86j18J46K5j31Q2l6k51J59l7K4R6l36O3P3J30j17L5J27l13Q2j16J92J04
6709F9k31L19o2l6P6J74j90k35J97l6o3J12J36k04R6p4J51j55O4l51K75O2m09
6732c15M42j01Q3p7M1l97L68j38N7O0J73j07K2L1j07o6J13p7N3J52j53K7l6j3
6756C5K8J08k29M5j31K07J04k15j62J48n5j11J99j9p2K17M7j97n3L36k46Q6p1
$$ plain form
6779 -1 86 -27 -41 144 8 96 115 254 -116 51 89 38 52 -71 70 -111 76 -152 73 -106 67 4 0 214
6803 214 -320 48 47 249 40 -68 19 -43 98 171 68 288 174 53 95 85 81 -207 -35 2 124 1 -91 85
6827 85 -220 103 -98 151 42 -50 -179 102 -107 -315 86 -256 -164 43 -31 104 -345 -5 4 123 383 48
6849 48 147 137 22 71 53 -100 45 -40 2 -147 116 -46 -21 -13 -198 -17 -18 -6 72 -172 -92 -51 62 139 125 117 48
6876 48 -103 177 161 93 74 -46 56 141 144 243 -228 87 -156 -268 -73 69 88 -122 -243 13 50 -9 -19 -131
6900 -131 7 -158 -38 179 -167 33 -188 235 -159 162 -54 117 155 194 62 -45 259 45 216 157 99
6921 99 142 -171 -145 126 -31 73 -8 -33 -178 0 38 74 117 211 85 298 -142 62 -32 -205 24 58 387 72
6945 72 242 -132 10 67 6 86 2 23 38 -131 -45 -25 -64 -350 -233 74 -251 5 135 82 -48 231 76 158
$$ packed form
6779aQ7j13j4J85j36Q8J9J39l70J67L8n1J4j23J41j81J87k28K25j79J73o3mK14
6803B14n34L68jK02k09j08Q7o2J41P3j03K20j14j21M2j0mk88J72L7J22j23r2J76
6827H5l05L23k01K49j09r2j29K81k09k08M01l42R2K07p4J35m49L40RJ19K60l35
6849D8R9j0j15M9j8j53J45q5M2j49K63j62K5Qj85J81jJ2P8k44Q0M1J13P7j4qo9
6876D8j51K80j6o8j9j20J02Q5LR9m71L15k43j12J95J42J9k10j21K56L7n9j0j12
6900a31J38j65J20K17l46K00k21M23l94L21k16J71L8L9j32j07L04k14J71n9n8
6921I9M3l13K6K71j57J04q1k5j45J78L8L6M3R4j26K13m40K04r4j73K29L4L29l15
6945G2J70l74J42N7o1Q0q4K1J5j69Q6K0l9k86J17L07l25K56J30n3j30K79j55Q2
$$ plain form
6969 158 -36 -164 82 -24 -20 -7 22 255 -26 117 -3 185 133 -51 180 -61 -155 -283 -75 139 -91 -145
6991 -145 -28 -139 67 -212 87 -74 -36 68 -48 -179 -114 136 25 127 110 218 127 178 85 53 -37 165 -216
7014 -216 -160 -56 7 225 -88 101 211 -86 -37 -56 -146 162 -266 -158 -202 -123 -137 92 -108 -97 93 -62 75
7037 75 38 23 196 205 8 103 107 57 171 -67 107 14 173 -38 -124 54 191 -275 16 48 -74 43 -177 -53
7061 -53 -108 -115 -131 153 -78 -221 242 197 99 135 -34 35 151 244 143 19 -38 -66 -199 -192 -91 10 1 -60 -99 -24
7087 -24 -71 -14 -146 78 -125 -19 37 -150 36 -96 8 20 -163 86 135 90 176 -183 -5 435 217 233 -254
7110 -254 -76 44 12 -26 100 -60 -212 -77 -122 -387 -142 27 34 -47 134 -27 -139 -250 219 72 70 127 65
7133 65 -112 97 11 4 -61 -166 -87 94 99 -154 -28 -97 -90 -130 -57 -119 -90 -208 -18 -43 -104 -1 -234 -147 20 -255
$$ packed form
6969A58j94j28K46j06MJ3K9K33k81J43j20J88n2j84K31k41r4j28K08K14k30n4
6991a45J17j11K06k79K99j61L8J04j16j31O5K50j11J02j7J08r1N1r3l2r0K02l81
7014b16N6J04O3K18l13J89J10k97M9j9r0L08m28J08m4P9j4K29k00J1J90j55J37
7037G5l7j5J73Rj97R5Mn0J14k38J74r3J59k11q6J78J37m66K91L2j22J17k20J24
7061e3n5pj6K84k31j43M63m5r8L6j69O9J16R3j01j24n7k8j33PJ01J01ro1l9P5
7087b4m7N7j32K24k03J06N6j87J86j32J04J2j83K49M9m5Q6l59J78M40k18J6m87
7110b54J78J20l2l8J26j60j52J35m5k65K45J69Pq1J81j61j12j11M69j47kN7o2
7133F5j77K09q6po5j05P9J81Nk53J26o9Pm0P3o2K9j18J90k5o1J03k33Q7J67k75
$$ plain form
7159 -255 -152 -158 -132 -136 116 -201 62 204 60 -239 94 34 52 295 187 -385 26 13 -17 199 -89 -228 -53
7182 -53 -253 -67 94 196 -163 -57 194 -38 -176 -106 59 -14 -67 83 -54 190 101 -88 103 138 93 175 -145
7205 -145 48 165 -186 -60 -107 12 110 134 -110 -255 88 -20 -170 -151 -294 -1 18 1 209 101 -181 15
7227 15 250 9 88 116 31 -160 203 50 154 157 41 199 16 108 -93 136 141 -248 -389 -6 11 -173 -87 -110
7251 -110 -18 -135 -223 -154 3 146 -160 115 156 7 281 124 65 53 -114 135 126 -13 288 51 139 -67 37
7274 37 260 -81 -197 -57 98 101 -129 -20 46 -12 -109 -148 -185 -144 -129 3 -55 -105 367 89 148 159 -223 -105 83
7299 83 49 -44 -53 152 120 139 -43 -4 -31 97 -11 50 -258 -132 -115 -73 46 -183 7 -59 8 -47 219 -218 198
7324 198 148 123 69 -82 36 75 34 -230 -114 231 -5 174 196 -30 59 -14 42 0 162 26 55 76 -30 -265
$$ packed form
7159b55J03oK6mK52l17K63J42j44k99L33o0J8K43j08n72M11j3l0K16k88j39J75
7182e3k00J86J61J02l59J06K51k32j38P0J65p3n3J50j37K44q9j89J91L5m5Q2l20
7205a45J93J17l51J26m7J19R8K4k44j45L43j08j50J9j43K93J9j7K08j08k82J96
7227A5K35k41P9K8q5j91L63j53J04Lj16J58j83R2k01K29Nl89j41L83J7j84Q6k3
7251a10R2j17q8O9J57J43l06K75M1j49K74j57n9j2j67K49rj39L01k37Q8k06J04
7274C7K23l41j16J40J55Lk30J09O6n8r7l9l7M1J5J32n8n0M72k78N9J1l82J18J88
7299H3l4r3rK05l2J9j82L9k7J28j08O1l08J26J7M2J19k29J90o6O7n5K66m37M16
7324A98n0k5n4j51J18L9m1k64J16L45k36J79K2k26Q9p3N6m2J62j36K9K1j06k35
$$ plain form
7348 -265 -158 44 -20 97 275 -45 3 69 -143 -157 291 119 -69 346 -27 -23 56 -140 33 4 176 -10 -66
7371 -66 -281 -61 -188 -282 22 -196 6 -226 41 -93 -195 -29 17 73 -184 -46 -286 -55 114 74 61 -56
7393 -56 -101 232 81 51 333 237 -39 -131 189 -118 30 29 94 -17 -179 130 -77 66 -43 -356 -50 134 -121
7416 -121 -272 60 -96 -85 -180 -129 -20 225 -246 215 -48 127 115 241 86 -118 -7 251 -129 339 -150
7437 -150 -32 8 13 -4 23 -54 -131 6 -271 -52 -8 11 -161 -137 -37 218 139 196 -143 70 205 140 180 -110 320
7462 320 86 -41 215 -122 -257 76 -201 -98 -303 57 -21 -449 -95 -169 -119 -54 -13 55 -175 12 44 -127
7484 -127 34 -118 44 101 175 370 200 105 51 10 66 393 36 -13 96 28 16 -54 -54 -180 -66 -231 -73 68
7508 68 175 -55 90 29 -58 -198 121 -106 79 -23 227 121 -7 -50 249 -201 -64 128 -54 193 200 -6
$$ packed form
7348b65J07K02o4J17J78l20M8O6k12j4M48j72j88M15l73MP9j96J73k9J72j86n6
7371f6k15K20j27r4L04k18K02k32K67j34j02J66M6N6k57J38k40K31J69m0j3j17
7393e6m5L33j51l0K82r6k76r2L20l07J48jO5j11j62L09k07J43j09l13L06J84k55
7416a21j51L32j56J1r5N1J09K45m71M61k63J75j2J26j55k04J11K58l80M68m89
7437a50J18M0Nj7K7p7p7J37k77K19M4J9j72K4J00K55p9N7l39K13J35o5M0k90M30
7462C20k34j27K56l37j35L33k77J03k05L60p8m28L54p4N0O5M1O8k30J87L2j71
7484a27J61j52J62N7P4J95j70r5n4m1N6L27l57m9J09o8j2p0%j26J14j65J58J41
7508F8J07k30J45o1q7j40L19k27J85j02K50j06j28m3K99m50J37J92j82K47Pk06
$$ plain form
7530 -6 169 -146 85 -28 -74 -134 -290 155 -91 -126 3 -85 -126 -141 -235 17 171 -432 11 -44 90 43 245 72
7554 72 31 -56 18 166 131 86 139 -74 -62 151 -34 -21 -62 -85 -294 -297 -43 41 -168 -1 34 93 -114 164 -32
7579 -32 12 -63 -90 102 -65 -139 235 77 34 165 7 25 49 150 56 74 -82 -60 180 -224 -193 23 -26 13 -109
7604 -109 -186 -234 173 -58 -68 84 -95 15 173 64 -228 -70 69 82 21 32 111 58 -31 165 -223 216 -44
7627 -44 -99 -12 163 39 221 -284 -255 -191 -218 9 70 75 14 23 -18 -168 -33 -23 -116 141 -50 -199 25 -80 184
7652 184 89 -212 -89 313 -151 132 198 -120 214 -179 79 -69 250 24 181 -59 -278 25 9 -296 -109
7673 -109 69 -104 -24 -164 -26 84 70 137 -17 222 -146 56 35 -152 -109 -101 -27 -43 230 -18 -7 -141 -124 -40
7697 -40 -110 -18 -60 -20 66 -149 -189 -169 48 13 -61 -147 118 125 -151 -73 -31 -137 -34 154 18 239 144 141 6 -112
$$ packed form
7530fJ75l15K31j13m6o0j56M45k46l5J29q8m1j5r4K52J54o03M43n5J34m7K02j73
7554G2m1q7P4J48l5m5N3k13J2K13j85J3m1k3k09lK54Q4k09J67L5N9k07K78j96
7579c2M4p5k7J92j67p4L74j58m3J31j58J8K4J01r4J8j56K2K40m04L1K16m9L9j22
7604a09p7m8M07k31j0J52j79J10J58j09k92J58J39J3o1J1P9n3q9J96l88M39k60
7627d4n5Q7J75j24J82n05K9O4k7K27O1No1Rm1j50J35J0r3K57j91j49K24j05K64
7652A84r5l01J23M02m64K83O6l18L34l93K58j48L19k26J57k40k19L03j6l05J87
7673a09J78j73Q0j40J38J10j4O7j54K39l68K02k1j87M3QP4j6K73k48J1j34J7Q4
7697d0p0R2m2M0Q6k15m0K0K17l5p4q6K65Pk76P8M2j06J03J88j36K21r5lj35j18
$$ plain form
7723 -112 91 124 77 -2 -196 3 159 -58 -164 23 -64 2 -187 -107 251 -161 86 -262 39 21 117 27 -102
7746 -102 84 117 -57 -61 108 87 105 -137 51 57 -170 142 -72 -207 39 -33 -45 -63 -38 -159 145 -223 -47 -124
7770 -124 -227 106 -105 -153 -231 -4 81 304 19 -303 34 -140 33 -26 -65 254 -45 -151 -108 -91 25 151
7792 151 98 8 -40 30 -284 6 -464 -143 -129 24 -10 -28 -102 -48 -76 104 89 -4 30 -245 129 83 -80 124 236
7817 236 -27 102 -10 106 312 24 101 -4 68 -239 6 -122 -129 56 -161 -107 -121 -94 204 168 -5 -116 -23
7840 -23 -54 -36 144 -4 38 -55 159 20 -51 106 49 136 134 82 -178 -64 37 121 11 -50 67 133 131 -43 12 -3
7866 -3 66 -101 -21 -100 -104 -17 219 124 -237 -30 72 102 -24 78 34 66 -67 -163 29 83 21 -95 152 150 -72 -168
7892 -168 -17 134 -5 112 -5 -79 -70 1 -19 5 -77 -283 144 95 165 273 247 99 122 0 65 65 170 10 110
$$ packed form
7723a12K03L3m7p9j94J99J56k17j06J87q7O6j89Q0L58m12K47l48L01j8R6r0j29
7746a02J86L3j74mJ69k1J8k42J88Ok27L12k14j35K46p2j2j8K5j21L04l68J76p7
7770a24j03L33k11m8p8K27Q5K23k85l22L37j74J73n9l9L19k99j06M3J7J16J26
7792A51n3r0m8P0l14K90m70L21J4J53l4j8p4N4k8J80j5r3L4k75L74m6j63K04J12
7817B36k63J29j12J16K06k88P7j05P2l07K45j28pJ85k17N4j4K7K98l6j73j11R3
7840b3l1J8J80j48M2r3K14j39p1J57n7Q7kn2k60J14J01Q4j10o1J17O6kj74N5j5
7866cO9j67Q0p9mQ7K36r5l61K07J02L0j26J02m4L2j33r6J92N4o2j16K47kk22r6
7892a68J51J51j39J17j17p4RP1k0K4q2k06M27m9P0J08k6j48K3j22O5%J05j60J00
$$ plain form
7917 110 68 -7 -238 118 -66 -182 -139 -23 51 161 -188 -195 24 -183 -258 -76 -76 153 57 131 134 -204 -145 246 110
7942 110 54 151 -33 93 80 -241 -115 -242 315 116 -162 -75 -113 -309 -118 52 306 -26 60 270 53 -28
7964 -28 -17 -91 -60 95 -20 183 -20 143 -41 -49 116 70 134 -117 -77 40 132 -31 -28 -39 80 156 -51 87 -119
7989 -119 -139 -180 -193 -105 104 -133 -93 12 155 4 180 -127 -163 176 -61 -68 60 -51 123 66 292 -196 16
8012 16 -18 272 85 134 -127 -36 -76 50 -466 -149 -148 -72 77 -125 27 41 -58 25 -27 -59 -107 194 -63 -52 -39
8037 -39 33 -31 -173 -66 -5 -54 -147 -76 48 73 72 -79 -183 206 -57 -65 -31 30 -123 45 -179 -147 -148 71 -28 -91
8063 -91 -81 -184 -21 -80 -108 -215 -44 -17 -89 160 -53 -81 3 63 -183 -125 -109 38 3 -99 309 -51 -14 -162
8087 -162 -61 13 -114 -21 -195 -65 -35 -114 63 228 -33 203 35 -149 -103 180 66 18 22 109 5 155 32
$$ packed form
7917A10m2p5k31L56j84j16M3J16P4J10l49pK19k07p5J82%K29r6P4Ll38N9L91j36
7942A10n6R7j84J26j3l21J26j27N57j99k78Q7l8j96J91J70K54l32Q6K10k17q1
7964b8J1p4L1J55j15K03k03J63j84qJ65m6O4k51M0J17R2j63Lj1J19P6k07J38k06
7989a19k0m1j3Q8K09k37M0J05J43j51J76l07l6L39k37pJ28j11J74n7K26m88K12
8012A6l4K90j87M9k61R1m0J26n16L17JP6J49k02J52J4r9Q3n2l2m8L01k57J1J3
8037c9P2o4j42J07O1m9r3P1J24K5jj51j04L89k63qL4O1j53J68k24L2jK19r9o3
8063i1J0j03J63n9k8j07J71K7p2K49k13k8Q4O0k46N8J6J47l5j02M08l60L7j48
8087a62J01P4j27R3j74J30L0p9J77J65k61K36j68j84M6K83j14m8MQ7j04J50j23
$$ plain form
8110 32 32 -347 -85 43 4 -189 33 -73 -35 -166 175 121 -54 258 -27 -111 -13 29 85 -63 -104 69 -53 125
8134 125 291 -102 46 -277 -104 96 -157 -42 49 24 98 113 -4 -69 212 235 67 -47 -154 16 -24 -258
8156 -258 32 -2 -124 129 86 -129 -276 123 -150 -172 14 244 144 -225 154 -183 52 22 42 -54 68 88
8178 88 95 292 -235 -189 -138 -192 45 96 -104 -72 -50 -25 -77
$$ packed form
8110C2%l79K62J28l9j93K22j06L8j31L41n4j75L12k85q4R8M2N6j48m1J73j22J78
8134A25J66l93J48l23J73K00k53J15R1k5P4J5j17o5K81K3j68j14j07J70m0k34
8156b58K90l4j22K53m3k15j47L99k73k2J86K30j00l69L79l37K35l0K0r6J22K0
8178H8PJ97n27M6N1n4K37N1k00L2K2K5n2
8191g7
$$ Imaginary data points
##PAGE= N=2
##DATA TABLE= (X++(I..I)), XYDATA
$$ plain form
0 0 0 0 0 0 0 0 0 0 0 0 0 0 8 -8 8 -8 8 -16 16 -16 24 -24 32 -37 40 -48 56 -65 75 -86 98 -111 126 -142 159
35 159 -181 202 -225 252 -280 311 -346 382 -422 466 -515 567 -626 690 -759 836 -922 1016
53 1016 -1123 1242 -1378 1535 -1716 1927 -2183 2491 -2880 3378 -4044 4991 -6427 8846 -13665
68 -13665 26805 -133884 -371259 92011 190836 -52160 47473 150630 -88823 -66291 150983
79 150983 47003 -80051 65710 43687 -113713 -24942 91867 1918 -22542 22289 -36602
90 -36602 -36172 62860 5975 -82340 16081 48212 -90231 -52898 101922 31478 -74354 32801
102 32801 82352 -10374 14620 75391 318 -8849 66174 -95 -61904 41463 69775 -15049
114 -15049 -8852 15731 2261 68059 82633 -42563 -40697 79364 26426 -58910 24529 36492
$$ packed form
0@%%%%%%%%%%%%Qj6J6j6J6k4L2l2M0m8N6o9P7q8J04j21J40j61J84k09K37k68L01
35A59l40L83m27M77n32N91o57P28q04Q88r81J082j193J316j449J595j758J938
53A016k139K365k620K913l251L643m110M674n371O258p422R035j1418J5273k2511
68a3665M0470j60689k37375M63270R8825k42996R9633J03157k39453K2532K17274
79A50983j03980j27054J45761k2023j57400Q8771J16809q9949k4460M4831n8891
90c6602M30R9032n6885q8315R8421L2131j38443L7333J54820p0444j05832J07155
102C2801M9551r2726K4994O0771p5073r167P5023o6269o1809J03367K8312q4824
114a5049O197K4583j3470O5798J4574j25196J866J20061n2938q5336Q3439J1963
$$ plain form
126 36492 -70855 -33162 51821 -6244 -29843 39977 14362 -42380 20001 65836 5593 -18148
138 -18148 18965 16896 2536 17575 19003 13966 21643 11524 3526 28895 23329 -22921 -6834
151 -6834 39425 -7445 -60872 -13847 12109 -24078 1124 23627 -47630 -51789 54688 60396
163 60396 -24765 -17858 13808 -18867 -4878 40828 4951 -31643 -7630 -7028 -12907 26480 30881
176 30881 -11485 -12845 -1835 -13980 16684 49071 -5990 -53557 -12743 17301 -1339 4573
188 4573 13250 -22147 -36990 5098 24214 -3523 -11015 233 -14513 -25114 -539 18177 5368
201 5368 -9638 -10629 -6102 5856 17368 20196 17826 -809 -24061 1809 44885 23265 -17584
214 -17584 -7630 1487 -11869 9135 30476 -5940 -28770 511 5654 -10435 7988 19575 -9056
$$ packed form
126C6492j07347L7693Q4983n8065k3599O9820k5615n6742O2381M5835o0243k3741
138a8148L7113k069j4360J5039J428n037P677j0119p998K5369n566m6250J6087
151f834M6259m6870n3427M7025K5956l6187K5202K2503p1257m159J06477N708
163F0396q5161O907L1666l2675J3989M5706l5877l6594K4013O02n879L9387M401
176C0881m2366j360J1010j2145L0664L2387n5061m7567M0814L0044j8640N912
188D573Q677l5397j4843M2088J9116k7737p492J1248j4746j0601K4575J8716j2809
201E368j5006r91M527J1958J1512K828k370j8635k3252K5870M3076k1620m0849
214a7584R954R117j3356K1004K1341l6416k2830K9281N143j6089J8423J1587k8631
$$ plain form
227 -9056 -25157 -9606 11115 21954 9777 -15007 -13907 8785 13569 9838 15772 6313 -9195
240 -9195 3667 20770 12216 4656 12327 7700 -7169 1119 19171 8701 -9350 -529 5475 -9920
254 -9920 -10531 5548 5292 -9197 -11753 -6611 -2300 2367 -129 -4698 1122 1664 -4627 1929 8270
269 8270 4115 8750 11401 -5043 -8092 15356 20632 -155 -5947 1027 -2405 -2772 4802 3356 -5621
284 -5621 -12191 -12561 -6403 -1197 -861 -3871 -11323 -17716 -11735 2549 6689 -2249 -9099 -9839 -7173 2381
300 2381 12758 11059 -2888 -13216 -3962 12279 14731 8337 1242 -7665 -9222 2978 13023 6643
314 6643 -5721 -12175 -14945 -9885 3872 8756 -2885 -17507 -19711 -4693 9826 8441 -1276 -9834
328 -9834 -13258 -5808 8457 14414 5623 -4711 -5681 341 10142 18998 16467 3570 -6243 -2751 9877
$$ packed form
227i056j6101J5551K0721J0839j2177k4784J100K2692M784l731N934r459j5508
240i195J2862J7103q554p560P671m627j4869Q288J8052j0470j8051Q821O004j5395
254i920o11J6079k56j4489k556N142M311M667k496m569N820N42o291O556O341
269H270m155M635K651j6444l049K3448N276k0787n792O974l432l67P574j446q977
284e621o570l70O158N206L36l010p452o393N981J4284M140q938o850p40K666R554
300B381J0377j699j3947j0328R254J6241K452o394p095q907j557J2200J0045o380
314F643j2364o454k770N060J3757M884j1641j4622k204J5018J4519j385r717q558
328i834l424P450J4265N957q791j0334r70O022R801Q856k531j2897r813L492J2628
$$ plain form
343 9877 14511 6244 -2452 -8682 -10996 -2860 8709 8526 -3493 -11357 -7889 475 6638 7014 -569
358 -569 -8613 -9227 -2893 4781 6369 2580 -496 -299 2837 9641 15445 13787 4675 7 4325 7072
374 7072 5595 3816 14 -4932 -5361 -1091 2196 1192 -327 -2161 -5195 -4496 -3487 -3917 -5371 -7857
390 -7857 -10272 -9348 -6430 -3071 378 2722 2515 1580 3962 7658 7408 5919 5022 127 -4939 -5129 -1016
407 -1016 1043 -1452 -4429 -7349 -7904 -2902 1188 -1622 -7006 -13503 -17523 -12751 -5226 -4888 -10157 -12827
423 -12827 -12256 -6110 6438 11281 3606 -1640 -2033 -2340 3167 9129 2133 -9547 -13479 -10115 -1123
438 -1123 7350 4623 -6985 -9099 -2731 2161 5523 4159 -6500 -15467 -14549 -7992 -1150 -255 -7924
453 -7924 -14674 -10665 -92 7706 8186 2652 -4544 -5279 -587 4568 7141 3033 -5765 -8113 -883
$$ packed form
343I877M634q267q696o230k314Q136J1569j83j2019p864L468Q364O163L76p583
358e69q044o14O334P674J588l789l076J97L136O804N804j658r112m668M318K747
374G072j477j779l802m946m29M270L287j004j519j834l034O99J009m30j454k486
390g857k415R24K918L359L449K344k07r35K382L696k50j489q97m895n066j90M113
407a016K059k495k977k920n55N002M090k810n384o497m020M772P525L38n269k670
423a2827N71O146J2548M843p675n246l93l07N507N962o996j1680l932L364Q992
438a123Q473k727j1608k114O368M892L362j364j0659q967R18O557O842Q95p669
453g924o750M009J0573P798M80n534p196p35M692N155K573m108q798k348P230
$$ plain form
468 -883 9656 13920 7479 732 1121 2775 4712 7049 3128 -5292 -10242 -11633 -8403 991 4429
483 4429 -4748 -8635 -1508 3879 8478 11734 4739 -1649 1160 2278 3098 9454 7584 -3205 -3231 5955
499 5955 9104 10425 8724 904 975 7907 4509 346 4334 1737 -4514 -989 3147 2106 3335 4387
515 4387 408 1567 6598 2261 -2568 363 2823 -509 -4702 -5396 293 4316 3261 3165 4008 4756
531 4756 6726 8443 9633 9644 5837 -960 -785 6538 7460 1533 -2490 -5032 -3559 2806 2868 -821 -1452
548 -1452 -5536 -9168 -2968 2981 1136 -2172 -7019 -9039 2235 12019 4567 -1067 4657 3652 1300
563 1300 8735 10082 3711 2126 -1076 -4860 2691 8985 2398 -3922 -3781 -3891 -371 5159 2654 -2926
579 -2926 -5482 -9195 -6436 4250 4375 -5574 -10553 -7924 -1418 5572 5207 -1087 -2942 -655 1490
$$ packed form
468h83J0539M264o441o747L89J654J937K337l921q420m950j391L230R394L438
483D429r177l887P127N387M599L256o995o388K809J118Q20O356j870j0789k6R186
499E955L149J321j701p820P1O932l398m163L988k597o251L525M136j041J229J052
515D387l979J159N031m337m829K931K460l332m193o94N689M023j055r6Q43P48
531D756J970J717J190J1l807o797J75P323R22n927m023k542J473O365O2l689o31
548a452m084l632O200N949j845l308m847k020J1274R784p452n634N724j005k352
563A300P435J347o371j585l202l784P551O294o587o320J41j10L520N530k505n580
579b926k556l713K759J0686J25r949m979K629O506O990l65o294j855K287K145
$$ plain form
594 1490 6890 11513 7550 -339 -2683 1815 9794 10797 2328 -4254 -4916 -1509 3354 2391 -3484 -6006
610 -6006 -6466 -7890 -3836 2038 -1324 -8186 -6793 -2909 -379 3406 1587 -1650 2546 4107 1659
625 1659 5926 8883 4225 2587 3785 1137 2522 6420 1028 -3158 1245 417 -4512 -1103 1513
640 1513 -2665 -3250 -4074 -6166 -2082 1355 -3577 -6313 -2449 -1501 -2013 -269 914 799 1961 952
656 952 1069 4667 5175 2709 2723 3103 1991 2122 2262 3108 2613 -224 -2932 -2588 116 1142 -21 -4588
674 -4588 -7885 -4385 -1304 -2965 -2801 -2101 -5125 -5366 -1611 1663 4989 3116 -3299 -3241 4538 6965
690 6965 4602 4727 827 -3568 2010 7809 4987 2340 -174 -4600 -1861 4555 3909 -400 -4198 -6762
706 -6762 -3795 1987 778 -3274 -3348 -4371 -6554 -773 4601 1762 -2458 -3051 -1493 3563 6855 4983
$$ packed form
594A490N400M623l963p889k344M498P979J003q469o582o62L407M863r63n875k522
610f006m60j424M054N874l362o862J393L884K530L785j819l237M196J561k448
625A659M267K957m658j638J198k648J385L898n392m186M403q28m929L409K616
640A513m178n85q24k092M084L437m932k736L864R48n12J744J183j15J162j009
656I52J17L598N08k466J4L80j112J31J40Q46m95k837k708L44K704J026j163m567
674d588l297L500L081j661J64P00l024k41L755L274L326j873o415N8P779K427
690F965k363J25l900m395N578N799k822k647k514m426K739O416o46m309l798k564
706f762K967N782j209m052p4j023k183N781N374k839m220n93J558N056L292j872
$$ plain form
722 4983 2649 671 483 4353 7341 5224 2017 800 -942 -316 3752 4480 119 -3394 -4472 -2240
738 -2240 1264 213 -2178 -3438 -5375 -5014 24 1899 -615 -2140 -1376 -618 2049 5097 3512 1657
754 1657 1713 1366 3279 5287 2760 1605 2565 940 22 3152 3261 69 -418 -474 -1676 -1005 -881 -3648
772 -3648 -3928 -2978 -4761 -3850 -1916 -3228 -2138 693 -647 -1311 1331 2182 2074 2738 2108 394 1652
789 1652 2676 1844 3319 3545 18 -252 1674 1410 1293 276 -3209 -4351 -3388 -3038 -2784 -3040 -5410
806 -5410 -6480 -4025 -1162 -40 456 -1682 -3550 -1470 1619 2929 1961 -932 -2014 -341 1040 2726
822 2726 4427 2765 -1032 -929 2479 3633 2984 211 -3998 -4771 -2531 -1350 -1182 -1838 -5599 -6769
838 -6769 -2458 -260 -28 12 -2086 -4696 -2751 1885 1754 -412 -1180 -1984 -800 2810 4399 4194 2702
$$ packed form
722D983k334j978j88L870K988k117l207j217j742O26M068P28m361l513j078K232
738b240L504j051k391j260j937L61N038J875k514j525P64P58K667L048j585j855
754A657N6l47J913K008k527j155R60j625r18L130J09l192m87n6j202O71J24k767
772c648k80R50j783R11J934j312J090K831j340o64K642Q51j08O64o30j714J258
789A652J024q32J475K26l527k70J926k64j17j017l485j142R63L50K54k56k370
806e410j070K455K863J122M96k138j868K080L089J310r68k893j082J673J381J686
822B726J701j662l797J03L408J154o49k773m209p73K240J181J68o56l761j170
838f769M311K198K32M0k098k610J945M636j31k166p68q04J184L610J589k05j492
$$ plain form
855 2702 363 820 3837 4872 2649 -166 -1716 -2566 -1793 333 -129 -2597 -3928 -3107 -1448 -169
871 -169 -465 -711 -2741 -3891 -1162 692 238 -470 -543 -853 972 3513 3881 3610 3053 1950 2690 4507
889 4507 3413 1144 1681 879 -861 372 802 -611 -1509 -332 -949 -1871 -1130 -1093 -1956 -1143 -1457 -2173
907 -2173 -1449 -441 -459 821 1533 1018 1500 2759 3567 3263 3741 3870 2097 1639 2882 3189 2448 1879 358
926 358 -705 347 1406 800 -419 -1310 -2326 -3053 -868 27 -1781 -2757 -3027 -2344 -269 1115 776
943 776 98 252 1133 2179 4505 4234 1938 1333 2139 2459 3820 3750 981 -1340 -442 1573 763 -49
961 -49 -472 -2427 -3587 -2572 -800 -249 -1867 -4172 -4181 -2012 300 215 -434 -1011 -1561 -242 3030 3172
979 3172 1799 1146 352 848 2779 3968 2166 -599 -777 533 1068 1126 -379 -1420 -1600 -2283 -1786 -23
$$ packed form
855B702k339M57L017J035k223k815j550q50P73K126m62k468j331Q21J659J279
871a69k96k46k030j150K729J854m54p08p3l10J825K541L68k71n57j103P40J817
889D507j094k269N37q02j740J233M30j413q98J177o17r22P41L7q63Q13l14p16
907b173P24J008j8J280P12n15M82J259Q08l04M78J29j773m58J243L07p41n69j521
926C58j063J052J059o06j219q91j016p27K185Q95j808r76k70O83K075J384l39
943G76o78J54Q81J046K326k71k296o05Q06L20J361p0k769k321Q98K015q10q12
961d9m23j955j160J015J772N51j618k305rK169K312q5o49n77n50J319L272J42
979C172j373o53p94M96J931J189j802k765j78J310N35N8j505j041j80o83M97J763
$$ plain form
997 -23 -1358 -3844 -3581 -2616 -2494 -1792 -1495 -2383 -2257 -661 135 42 679 1419 1339 1290 710 1750 2815 1517
1017 1517 127 1008 1266 567 217 681 114 -1475 -1635 -733 -1167 -1916 -2712 -2794 -2645 -2527 -1741 -2103 -2464
1036 -2464 -1298 -116 -346 -384 -514 419 1541 812 668 2076 1369 171 1437 3347 2008 291 872
1053 872 665 571 2228 917 -1745 -1653 -1105 -1552 -778 -736 -2938 -3549 -1944 -1279 -218 427 -1884 -3190
1071 -3190 886 1954 397 765 1522 -162 763 3573 3017 1963 2254 1206 619 3028 3367 985 -473
1088 -473 -771 -490 402 -84 -1532 -2130 -1713 -2127 -2232 -645 -53 -2029 -2544 -444 -131 -872 679 1301
1106 1301 354 197 1451 1670 1595 3435 2496 146 1451 3067 2538 1859 923 -1182 68 1494 -524
1123 -524 -1322 -20 -1869 -3686 -576 703 -2448 -2517 -1516 -2718 -570 1547 -1061 -1910 308 890
$$ packed form
997b3j335k486K63R65J22P02K97q88J26J596P96r3O37P40q0m9n80J040J065j298
1017A517j390Q81K58o99l50M64n67j589j60R02m34p49p96q2J49J18P86l62l61
1036b464J166J182k30l8j30R33J122p29j44J408p07j198J266J910j339j717N81
1053H72k07r4J657j311k662R2N48m47P74M2k202o11J605O65J061O45k311j306
1071c190M076J068j557L68P57j684R25K810n56j054K91j048n87K409L39k382j458
1088d73k98K81Q92m86j448n98M17m14j05J587N92j976n15K100L13p41J551O22
1106A301r47j57J254K19p5J840r39k350J305J616n29o79r36k105J250J426k018
1123e24p98J302j849j817L110J279l151o9J001j202K148K117k608q49K218N82
$$ plain form
1139 890 1114 2135 1526 455 1648 2516 1621 2658 2508 -159 216 2672 1301 -633 -151 -512 -1081
1156 -1081 -1046 -983 -1864 -2308 -1661 -1587 -1943 -1667 -728 -1315 -1485 -830 528 551 498 -8 127 2078 2423 977
1176 977 1530 2667 1151 665 2647 1917 188 859 619 -1174 -210 417 -1757 -2194 -972 -2064 -2202
1193 -2202 -794 -1440 -2132 -851 -1641 -1753 420 850 -1351 -592 1194 611 1393 2215 1036 504 1905
1210 1905 2140 1780 2111 1239 -180 -11 821 725 146 -873 -2099 -1450 -888 -900 -1386 -1713 -2469 -1887 -1137
1229 -1137 -360 -769 -1637 -1577 -230 443 260 1240 798 94 1382 2353 1761 1467 1649 989 474 1502 931
1248 931 425 337 -704 -1129 -132 -658 -1917 -1154 -1353 -2475 -1669 -717 -1896 -2069 -1335 -1138 -1109 358 143
1267 143 -212 1017 674 923 2275 1802 1137 1242 1625 1392 1499 1582 252 223 455 117 -2 -159 -1482
$$ packed form
1139H90K24J021o09j071J193Q68q95J037j50k667L75K456j371j934M82l61n69
1156a081L5O3q81m44O47P4l56K76R39n87j70O55J358K3n3n06J35J951L45j446
1176I77N53J137j516m86J982p30j729O71k40j793R64O27k174m37J222j092j38
1193b202J408o46o92J281p90j12K173M30k201P59J786n83P82Q22j179n32J401
1210A905K35l60L31q72j419J69Q32r6n79j019j226O49N62j2m86l27p56N82P50
1229a137P77m09q68O0J347O73j83R80m42p04J288R71n92k94J82o60n15J028n71
1248I31n06q8j041m25R97n26j259P63j99j122Q06R52j179j73P34J97K9J467k15
1267A43l55J229l43K49J352m73o65J05L83k33J07Q3j330k9K32l38j19j57j323
$$ plain form
1286 -1482 -1315 -1210 -1295 -1322 -1091 -2073 -1943 -1158 -535 -533 -396 -470 -459 367 1156 1222 1342 1431 1029 1671 2071 1842
1308 1842 1979 1505 635 1002 1256 776 51 -210 -454 -1343 -259 -576 -1231 -1323 -1647 -1930 -909 -607 -1047
1327 -1047 -1228 -688 -363 672 943 360 925 1198 1055 1202 2378 2061 908 1622 1584 1496 1423 845 307 277
1347 277 -336 -21 -325 -750 -1243 -1273 -1292 -1707 -1259 -827 -1297 -1545 -992 -830 10 -45 -294 618 673 505 1068
1368 1068 1534 893 824 1586 1805 1264 1060 708 224 675 576 -96 -619 -855 -1557 -911 -936 -1868 -1854 -1528 -1734
1389 -1734 -1653 -1077 -615 -1332 -924 -528 -142 261 596 543 913 809 957 1501 1713 770 775 732 850 876 805 66
1411 66 -718 -767 -787 -641 -577 -1290 -2054 -1601 -1760 -1109 -836 -1137 -1844 -1163 -556 -94 67 -46 -40 201 686 1278
1433 1278 1727 1431 570 975 1417 1548 1258 992 146 32 308 -58 -178 -259 -1027 -1354 -1252 -1004 -905 -968 -1375
$$ packed form
1286a482J67J05q5k7K31r82J30P85O23KJ37p4J1Q26P89O6J20Q9m02O42M00k29
1308A842J37m74q70L67K54m80p25k61k44q89J084l17o55r2l24k83J021L02m40
1327a047j81N40L25J035K71n83N65K73j43J47J176l17j153P14l8q8p3n78n38l0
1347B77o13L15l04m25m93l0j9m15M48M32m70k48N53J62Q40n5k49R12N5j68N63
1368A068M66o41o9P62K19n41k04l52m84M51r9o72n23k36p02O46k5r32J4L26k06
1389a734Q1N76M62p17M08L96L86M03L35n3L70j04J48N44K12r43Nm3J18K6p1p39
1411F6p84m9k0J46O4p13p64M53j59O51K73l01p07O81O07M62J61j13OK41M85N92
1433A278M49k96q61M05M42J31k90k66q46j14K76l66j20q1p68l27J02K48R9o3m07
$$ plain form
1454 -1375 -1640 -851 -590 -353 -494 87 -257 468 896 1074 1162 1413 1122 958 1555 1770 1084 993 1174 525
1474 525 412 702 309 -276 -390 -693 -1094 -687 -897 -1117 -1110 -886 -1509 -1219 -701 -310 -753 -160 -20 -103 618
1495 618 1233 1159 467 1216 1697 950 1137 1237 734 974 901 307 312 371 -555 -630 -129 -812 -1877 -1252 -805 -1187
1517 -1187 -1138 -1500 -1863 -1174 131 -233 -778 -639 -158 258 1220 933 566 660 1030 1028 1143 1985 1176 -300
1537 -300 366 1208 271 358 -29 -729 -1107 -338 -622 -1224 -925 -1152 -1950 -1370 -453 -1016 -992 -301 -680 -462 579
1558 579 178 229 1301 1104 168 793 1807 1337 1329 1347 323 534 1330 964 -5 -40 -297 -998 -482 210 -743
1579 -743 -1559 -1359 -1119 -1329 -159 -629 -1373 -1098 -267 -2 194 943 157 -85 864 1203 1133 1576 1341 433
1599 433 744 1771 1377 317 546 304 -123 -37 31 -929 -807 -328 -1302 -1335 -710 -1151 -1380 -568 -712 -1312
$$ packed form
1454a375k65P89K61K37j41N81l44P25M28J78Q8K51k91j64N97K15o86r1J81o49
1474E25j13K90l93n85j14l03m01M07k10k20PK24o23K90N18L91m43N93J40q3P21
1495F18O15p4o92P49M81p47J87J00n03K40p3n94NN9r26p5N01o83j065O25M47l82
1517a187M9l62l63O89J305l64n45J39M81M16R62k87l67R4L70kJ15Q42q09j476
1537c00O66Q42r37Q7l87p00l78P69k84o02K99k27p98N80R17n63K4O91l79K18J041
1558E79m01N1J072j97r36O25J014m70qJ8j024K11P96l66r69l5k57p01N16O92r53
1579g43q16K00K40k10J170m70p44K75Q31K65J96P49p86k42R49L39p0M43k35r08
1599D33L11J027l94j060K29k42m27Q6O8r60J22M79r74l3O25m41k29Q12j44o00
$$ plain form
1619 -1312 -761 -299 -454 446 1017 -19 -121 1317 1033 1220 1448 1088 333 725 1026 508 556 329 -623
1638 -623 -451 270 -348 -1254 -932 -874 -1337 -937 -765 -1244 -1201 -592 -967 -906 -432 98 -10 227 364 249 692
1659 692 977 1140 1174 951 830 301 1302 1478 525 -115 116 92 92 242 -442 -1343 -1351 -1035 -939 -701 -390 -1675
1681 -1675 -1610 -521 -209 65 207 -338 -654 294 1112 686 1152 1352 561 798 1823 1386 718 923 294
1700 294 42 584 419 -236 -28 -660 -982 -885 -204 -812 -1020 -1108 -1017 -910 -215 -303 -476 -81 -350 -145 352
1721 352 976 960 712 921 754 869 1319 1744 732 330 375 427 434 461 319 -533 -958 -527 -620 -653 -648 -1252 -1512
1744 -1512 -774 -653 -767 -380 -286 -824 -357 100 468 746 540 853 754 916 1089 849 1251 1030 591 476
1764 476 561 622 430 154 -723 -746 -576 -795 -719 -615 -1051 -1789 -1169 -744 -514 -596 -587 -816 -411 122 540 940
$$ packed form
1619a312N51M62j55R00N71j036j02J438k84J87K28l60p55L92L01n18M8k27r52
1638f23J72P21o18r06L22N8m63M00J72m79M3O09l75O1M74N30j08K37J37j15M43
1659F92K85J63L4k23j21n29J001J76r53o40K31k4%J50o84r01qL16R6K38L11j285
1681a675O5J089L12K74J42n45l16R48Q18m26M66K00p91K37J025m37o68K05o29
1700B94k52N42j65o55K08o32l22R7O81o08k08q8R1J07O95q8j73L95k69K05M97
1721C52O24j6k48K09j67J15M50M25j012m02M5N2PK7j42q52m25M31r3l3No04k60
1744a512P38J21j14L87R4n38M67M57L68K78k06L13r9J62J73k40M02k21m39j15
1764D76Q5O1j92k76q77k3J70k19P6J04m36p38O20M25K30q2Rk29M05N33M18M00
$$ plain form
1786 940 533 371 309 914 942 1191 1242 499 348 563 634 940 375 -525 -281 -337 -662 -157 -250 -801 -1377 -983
1808 -983 -1010 -709 -446 -678 -801 -673 -160 245 585 404 229 176 475 931 1245 1179 567 449 687 849 1048
1829 1048 796 474 -200 -166 -288 41 -232 -708 -1153 -1173 -851 -736 -379 -581 -908 -701 -382 189 438 318
1849 318 -16 -152 332 925 956 1283 914 523 708 745 914 1054 436 -106 -282 -74 36 28 -536 -601 -1112 -703
1871 -703 -597 -523 -408 -770 -748 -720 -817 -224 421 -141 -101 299 374 674 987 1045 603 334 885 724 910 789
1893 789 114 135 -132 -218 232 -102 -592 -829 -1149 -951 -580 -794 -718 -1252 -1006 -590 -376 -37 70 -370 -311
1914 -311 129 451 898 934 499 625 342 833 1146 1050 382 1 -61 355 261 227 -308 -955 -853 -857 -512 -428 -761
1937 -761 -971 -1096 -1129 -596 -292 -136 -553 -458 -282 282 574 888 596 444 259 651 963 1215 765 214 138
$$ packed form
1786I40m07j62o2O05K8K49N1p43j51K15P1L06n65r00K44n6l25N05r3n51n76L94
1808i83k7L01K63k32j23J28N13M05L40j81j75n3K99M56L14o6o12j18K38J62J99
1829A048k52l22o74L4j22L29k73m76m45k0L22J15L57k02l27K07L19N71K49j20
1849C18l34j36M84N93L1L27l69l91J85L7J69J40o18n42j76K08J10qn64o5n11M09
1871g03J06P4J15l62K2K8r7N93O45n62M0M00P5L00L13N8m42k69N51j61J86j21
1893G89o75K1k67q6M50l34m90k37l20J98L71k14P6n34K46M16K14L39J07m40N9
1914c11M40L22M47L6m35J26k83M91L13r6o68l81o2M16r4l4n35o47J02mL45Q4l33
1937g61k10j25l3N33L04J56m17R5J76N64K92L14k92j52j85L92L12K52m50n51p6
$$ plain form
1958 138 254 129 531 173 -582 -672 -481 -236 -546 -631 -1006 -1361 -1003 -502 -480 -409 -436 -473 -537 62 319 745
1980 745 747 374 131 842 1026 1225 1034 741 386 389 515 422 105 30 -145 -846 -535 -442 -474 -758 -878 -1270 -857
2003 -857 -502 -148 -485 -599 -536 -617 -126 600 511 219 349 514 426 1241 1109 596 402 553 598 536 1043 299
2025 299 -334 -360 -420 -391 -221 -330 -812 -759 -689 -818 -588 -477 -309 -869 -787 -238 77 535 404 100 104 442 612
2048 612 1070 953 848 103 431 935 472 615 282 -448 -613 63 13 -199 -453 -908 -1267 -763 -267 -499
2068 -499 -557 -777 -834 -715 247 260 -48 122 -193 26 596 1114 1075 490 417 467 633 870 788 202 311 112
2090 112 -54 79 85 -368 -619 -389 -646 -841 -506 -454 -1036 -1029 -685 -568 -46 389 -1 -89 -215 390 435 982
2112 982 931 383 230 763 912 867 738 222 -149 196 289 -86 113 -349 -1031 -841 -349 -398 -644 -777 -1014
$$ packed form
1958A38J16j25M02l58p55r0J91K45l10q5l75l55L58N01K2P1k7l7o4N99K57M26
1980G45Kl73k43P11J84J99j91k93l55LJ26r3l17p5j75p01L11R3l2k84j20l92M13
2003h57L55L54l37j14O3q1M91P26q9k92J30J65q8Q15j32n13j94J51M5o2N07p44
2025B99o33k6o0K9J70j09m82N3P0j29K30J11J68n60Q2N49L15M58j31l04ML38J70
2048F12M58j17j05p45L28N04m63J43l33p30j65O76n0k12k54m55l59N04M96k32
2068d99n8k20n7J19R62J3l08J70l15K19N70N18l9n85p3N0J66K37q2n86J09j99
2090A12j66J33Om53k51K30k57j95L35N2n82PL44J17N22M35l90q8j26O05M5N47
2112I82n1n48j53N33J49m5j29n16l71L45R3l75J99m62o82J90M92m9k46j33k37
$$ plain form
2133 -1014 -869 -565 -204 -78 -258 -146 -376 -102 512 767 616 417 452 163 736 958 555 666 421 64
2153 64 -263 321 393 204 -293 -683 -963 -460 -124 -604 -1058 -869 -644 -461 -34 -39 -500 -370 104 313 414
2174 414 655 344 344 471 607 842 1074 708 332 65 376 210 193 224 -164 -725 -495 -322 -501 -443 -443 -688
2196 -688 -1020 -571 -330 -133 44 -481 -658 -186 578 251 620 265 -157 168 808 1165 1189 613 196 163 270
2217 270 732 541 -241 -121 -609 -429 -92 -230 -568 -733 -830 -839 -201 -283 -339 -491 -394 -383 -167 436 469 127 210
2240 210 325 738 857 950 630 491 537 351 277 792 302 57 -397 -108 -189 -215 0 -387 -922 -691 -437 -443
2262 -443 -277 -484 -945 -695 -218 -46 534 523 94 140 616 719 673 632 430 302 351 498 631 444 352 -66
2284 -66 -232 -178 -78 -282 -584 -936 -1090 -647 -428 -502 -529 -682 -706 -512 -276 213 122 180 10 100 380 642 785
$$ packed form
2133a014J45L04L61J26j80J12k30K74O14K55j51j99L5k89N73K22m03J11k45l57
2153F4l27N84P2j89m97l90k80N03L36m80m54J89K25J83M27nm61J30M74K09J01
2174D14K41l11%J27J36K35K32l66l76k67L11j66j7L1l88n61K30J73j79N8%k45
2196f88l32M49K41J97J77n25j77M72P64l27L69l55m22L25O40L57K4n76m17l3J07
2217B70M62j91p82J20m88J80L37j38l38j65r7rO38q2n6j52R7J1K16O03L3l42Q3
2240B10J15M13J19R3l20j39M6j86p4N15m90k45m54K89q1k6K15l87n35K31K54o
2262d43J66k07m61K50M77J72N80j1m29M6M76J03m6m1k02j28M9J47J33j87r2m18
2284f6j66N4J00k04l02l52j54M43K19p4k7j53k4J94K36M89r1N8j70R0K80K62J43
$$ plain form
2307 785 502 321 251 603 861 615 300 139 -304 27 -36 -121 -111 -437 -850 -1162 -621 -357 -633 -576 -1083 -771
2329 -771 -255 -87 186 -169 -101 113 297 508 598 660 291 148 455 190 703 649 212 119 -7 141 192 -55
2351 -55 -394 -786 -584 -609 -266 -490 -403 -723 -673 -457 -413 168 73 -108 -180 101 346 667 686 265 460 417 711
2374 711 584 550 371 156 26 144 11 -83 88 -365 -581 -616 -267 -553 -697 -726 -893 -872 -520 -222 -213 -307 -177
2397 -177 -185 41 269 417 564 402 162 470 705 625 899 321 159 399 312 304 45 18 -621 -385 -479 -571 -353
2420 -353 -488 -928 -846 -826 -509 22 -403 -391 -590 93 403 549 605 172 302 273 549 637 701 515 340 150
2442 150 398 599 427 -234 -316 -329 -547 -50 -142 -526 -639 -649 -538 -159 -536 -540 -661 -147 -322 -42 340 257
2464 257 -132 113 418 342 500 940 501 157 250 211 497 483 267 -217 -129 -233 -31 -144 7 -632 -879 -469
$$ packed form
2307G85k83j81p0L52K58k46l15j61m43L31o3q5J0l26m13l12N41K64k76N7n07L12
2329g71N16J68K73l55O8K14J84K11R0O2l69j43L07k65N13n4m37r3j26J48N1k47
2351e5l39l92K02k5L43k24Q7l20N0K16M4N81r5j81p2K81K45L21J9m21J95m3K94
2374G11j27l4j79k15j30J18j33r4J71m53k16l5L49k86j44k9j67K1L52K98Rr4J30
2397a77qK26K28J48J47j62k40L08K35q0K74n78j62K40q7qk59k7o39K36r4r2K18
2420c53j35m40Q2K0L17N31m25J2j99O83L10J46N6m33J30k9K76Q8O4j86j75j90
2442A50K48K01j72o61q2j3k18M97r2l84j13j0J11L79l77mj21N14j75K80L82q3
2464B57l89K45L05p6J58M40m39l44R3l9K86j4k16m84Q8j04K02j13J51o39k47M10
$$ plain form
2486 -469 -484 -356 -344 -410 -553 -645 -88 -98 249 85 -93 199 369 555 475 424 551 267 205 425 606 229 38
2509 38 -150 -267 -137 -13 -333 -459 -536 -527 -531 -360 -415 -365 -455 -490 -544 56 369 22 -28 149 -25 271 432 686
2533 686 606 324 779 554 711 492 693 -12 -180 126 -93 4 -71 -405 -493 -554 -475 -365 -194 -404 -585 -769
2555 -769 -90 -40 106 -84 -199 -134 302 492 321 437 581 571 446 763 618 545 333 313 -327 241 328 67
2577 67 -257 -486 -756 -316 -425 -320 -808 -477 -749 -616 -72 -47 -211 -208 -207 -334 323 531 444 273 421 210
2599 210 593 603 529 35 183 213 67 89 58 16 -208 -301 -372 -404 -162 -486 -515 -687 -306 -376 -365 -39 -38 -295 185
2624 185 276 269 380 306 199 281 577 507 588 485 241 203 152 349 342 218 -36 -537 -364 -287 -246 -142 -174 -657 -494
2649 -494 -460 -385 -334 -359 -144 -295 -218 255 230 214 114 350 212 312 588 189 401 698 132 125 270 69 -97
$$ packed form
2486d69j5J28J2o6j43r2N57j0L47j64j78K92J70J86q0n1J27k84o2K20J81l77j91
2509C8j88j17J30J24l20j26p7RmJ71n5N0r0l5n4O00L13l47n0J77j74K96J61K54
2533F86q0k82M55k25J57k19K01p05j68L06k19R7p5l34q8o1P9J10J71k10j81j84
2555g69O79N0J46j90j15O5M36J90j71J16J44j0j25L17j45p3k12k0o40N68Q7k61
2577F7l24k29k70M40j09J05m88L31k72J33N44K5j64LJj27O57K08q7j71J48k11
2599B10L83J0p4m94J48L0j46K2l1m2k24r3p1l2K42l24k9j72L81p0J1L26Jk57M80
2624A85R1pJ11p4j07Q2K96p0Q1j03k44l8n1J97pj24k54n01J73P7M1J04l2m83J63
2649d94L4P5N1k5K15j51P7M73k5j6j00K36j38J00K76l99K12K97n66pJ45k01j66
$$ plain form
2672 -97 -134 -288 -371 -207 -81 -377 -509 -289 -333 -475 -321 -290 -321 -219 -400 -205 54 334 129 251 253 389 334
2695 334 497 408 311 270 366 247 202 219 -76 -195 -175 -54 -599 -424 -333 -545 -647 -326 -397 -321 -179 -452 -496 -232
2719 -232 -37 -224 -53 295 -123 145 702 344 488 336 409 103 146 448 246 200 -99 -181 -51 -122 5 -575
2741 -575 -610 -242 -515 -226 -233 -345 -659 -558 -167 -191 -98 146 197 -272 125 296 417 570 295 146 369 691
2763 691 335 521 493 330 43 -50 -71 -378 -66 -262 -580 -506 -571 -250 -152 -496 -620 -606 -186 -188 13 46 -140
2786 -140 65 248 325 108 398 681 220 469 376 366 337 160 184 85 -26 168 44 -140 -369 -450 -325 -319 -495
2809 -495 -437 -371 -352 -345 -140 104 -180 -54 282 63 -66 428 317 309 324 605 600 532 639 109 121 354 33 185
2833 185 69 25 -218 -250 -298 -292 -199 -395 -507 -362 -347 -167 -189 -151 -406 -351 78 304 306 379 609 241 221 227 631
$$ packed form
2672i7l7j54q3J64J26k96j32K20m4j42J54L1l1J02j81J95K59K80k05J22KJ36n5
2695C34J63q9r7m1R6j19m5J7k95j19K0J21n45J75R1k12j02L21p1P6J42k73m4K64
2719b32J95j87J71L48m18K68N57l58J44j52P3l06M3L02k02m6k99q2J30p1J27n80
2741e75l5L68k73K89pj12l14J01L91k4R3K44N1m69L97J71J21J53k75j49K23L22
2763F91l56J86k8j63k87r3k1l07L12j96l18P4o5L21R8l44j24J4M20kK01L3j86
2786a40K05J83P7k17K90K83m61K49r3j0k9j77K4r9j11J94j24j84k29q1J25Oj76
2809d95N8O6J9PK05K44k84J26L36k19j29M94j11qJ5K81no8J07n30J2K33l21J52
2833A85j16m4k43l2m8OR3j96j12J45J5J80k2L8k55N5M29K26KP3K30l68k0OM04
$$ plain form
2858 631 564 421 414 271 318 120 256 55 -188 -174 -346 -33 15 -450 -370 -375 -352 -547 -148 -470 -373 -205 -7 -37
2882 -37 -1 137 462 -104 270 316 312 590 489 312 20 259 -161 178 263 -138 30 -197 -206 -66 -319 -343 -459
2905 -459 -419 -487 -170 -234 -365 -191 -198 -171 161 392 348 49 241 143 453 577 402 245 126 203 143 413 259
2928 259 325 -9 -131 -87 -29 -214 -340 -474 -477 -445 -321 -104 -440 -420 -409 -280 -172 118 12 -23 -28 506 73 375
2952 375 365 139 352 324 382 186 207 609 100 30 -66 -61 56 -83 -146 -317 -481 -577 -372 -200 -378 -537 -141
2975 -141 -60 -225 -82 113 -358 34 166 266 295 373 172 367 368 483 185 172 198 50 142 47 127 -1 -178
2998 -178 -382 -438 -276 -232 -490 -272 -402 -228 -14 -304 -86 80 -82 -122 -15 419 527 448 269 398 499
3019 499 188 187 437 171 156 125 110 227 43 -287 -274 -448 -248 -457 -320 -389 -421 -266 -275 -156 -162 -209 -147 -224 102
$$ packed form
2858F31o7j43pj43M7j98J36k01k43J4j72L13M8m65Q0nK3j95L99l22R7J68J98l0
2882c7L6J38L25n66L74M6mK78j01j77k92K39m20L39Q5m01J68k27rJ40k53k4j16
2905d59M0o8L17o4j31J74pK7L32K31m4k99J92r8L10J24j75j57j19P7o0K70j54
2928B59O6l34j22M4N8j85j26j34lL2J24K17l36K0J1J29J08K90j06l5nN34m33L02
2952C75j0k26K13k8N8j96K1M02n09p0r6NJ17j39o3j71j64r6K05J72j78j59L96
2975a41Q1j65J43J95m71L92J32J00K9P8k01J95JJ15k98j3K6j48R2r5Q0j28j77
2998a78k04n6J62M4k58K18j30J74K14k90K18J66j62m0J07M34J08p9j79J29J01
3019D99l11jK50k66j5l1j5J17j84l30J3j74K00k09J37o9l2J55rJ19om7O2p7L26
$$ plain form
3044 102 341 291 295 195 235 406 536 246 118 387 336 290 277 312 78 -46 -67 -253 -73 -81 -97 -194 -404 -143
3068 -143 -373 -471 -200 -271 -334 -333 -254 -83 271 147 165 120 477 449 407 282 537 234 376 358 121 239 239 -35
3092 -35 93 124 -162 -277 -273 -137 -183 -177 -351 -413 -297 45 -325 4 -163 -8 166 141 319 29 150 325 106
3115 106 512 410 265 -88 271 106 25 40 -221 178 -317 -191 -462 -299 -114 -420 -398 -468 -122 -254 -360
3136 -360 -314 -452 -172 60 211 32 -48 286 372 508 287 162 76 238 294 235 165 12 123 85 276 -244 -133
3159 -133 -368 -188 -295 -449 -329 -261 -804 -243 -420 -416 -136 -164 -244 -52 11 354 387 255 377 319 156 227 477
3182 477 92 137 399 282 148 -49 27 1 -326 149 -191 -208 -224 -317 -181 -239 -348 -448 -190 94 88 -82 -172
3205 -172 272 224 270 434 254 209 525 482 19 476 99 127 108 276 94 209 -37 0 -29 -143 -280 -258 -274
$$ packed form
3044A02K39n0Mj00M0J71J30k90j28K69n1m6j3L5k34j24k1j86J80qj6r7k10K61
3068a43k30r8K71p1o3JP9J71L54j24J8m5L57k8m2j25K55l03J42j8k37J18%k74
3092c5J28L1k86j15MJ36m6Oj74o2J16L42l70L29j67J55J74k5J78k90J21J75k19
3115A06M06j02j45l53L59j65q1J5k61L99m95J26k71J63J85l06K2p0L46j32j06
3136c60M6j38K80K32J51j79q0L34Q6J36k21j25q6J62N6n9p0j53J11l8J91n20J11
3159a33k35J80j07j54J20O8n43N61j77MK80k8q0J92O3L43L3j32J22n8j63P1K50
3182D77l85M5K62j17j34j97P6k6l27M75l40j7j6r3J36n8j09j00K58K84oj70r0
3205a72M44m8M6J64j80m5L16m3m63M57l77K8j9J68j82J15k46L7k9j14j37K2j6
$$ plain form
3228 -274 -292 -281 -114 -24 41 -1 -23 -38 -444 96 64 52 229 29 59 279 355 484 258 686 17 102 11 81 39
3253 39 -47 -338 -99 -346 -61 -352 -325 -120 -255 -215 -70 -78 -298 -130 -120 -120 -11 -6 307 217 -26 575 205 304
3277 304 402 61 134 286 104 148 -53 93 -53 -84 55 -189 51 190 -301 -349 -372 -170 -259 -193 -115 -358 -97
3300 -97 6 -72 117 154 13 340 171 339 545 137 267 211 256 345 109 97 -105 25 -160 -39 174 -322
3322 -322 -234 -168 -376 -426 -179 -177 -100 -437 -132 -78 8 261 2 58 120 178 19 291 261 -47 -71 -65 341 333 140 80
3348 80 -90 8 -104 -55 -108 182 -368 -206 28 -190 -301 -228 10 -246 -140 -57 27 111 55 73 39 397 77 271
3372 271 123 110 70 291 275 58 81 290 -75 60 -180 55 -61 -207 -35 -386 -127 -226 -401 -257 -97 -446
3394 -446 -158 -167 99 20 118 150 96 121 239 227 170 415 247 235 228 397 161 -97 9 -202 186 190 -185 -421 -386
$$ packed form
3228b74j8J1J67R0O5m2k2j5m06N40l2j2J77k00L0K20P6J29k26M28o69Q5r1P0m2
3253C9q6k91K39k47K85k91K7K05j35M0J45qk20J68J0%J09NL13r0k43O01l70R9
3277C04R8l41P3J52j82M4k01J46j46l1J39k44K40J39m91m8k3K02q9O6P8k43K61
3300i7J03p8J89L7j41L27j69J68K06m08J30n6M5Q9k36j2k02J30j85J21K13m96
3322c22Q8O6k08n0K47KP7l37L05N4Q6K53k59N6O2N8j59K72l0l08k4OM06qj93o0
3348H0j70R8j12M9n3K90n50J62K34k18j11P3K38k56J06Q3Q4Q4n6J8l4L58l20J94
3372B71j48j3m0K21j6k17K3K09l65J35k40K35j16j46J72l51K59r9j75J44J60l49
3394d46K88rK66p9R8L2n4K5J18j2n7K45j68j2pJ69k36k58J06k11L88Ml75k36L5
$$ plain form
3419 -386 -276 -292 -181 -165 -322 -97 3 -332 -229 5 91 -54 222 102 90 144 223 54 -20 441 381 61 224
3442 224 -3 -48 -2 42 -50 -55 8 -379 -66 -24 71 -136 -174 -29 -319 -5 127 -74 -114 -175 -178 106 29 273 256
3467 256 -36 -89 151 466 496 242 358 32 339 173 71 -52 17 -399 -178 -151 -144 -173 -417 -256 -383 -59
3489 -59 -69 154 -453 -183 -9 12 -253 -127 222 182 378 119 404 95 383 429 225 206 131 86 131 -13 84
3512 84 -289 -156 -161 -192 -189 -113 -279 -152 -191 -283 -291 -114 -346 -27 -54 39 90 189 119 74 378 -150 66 236 -121 15
3538 15 226 199 -106 7 -129 -143 -79 -157 -168 -162 -314 -446 -103 -316 -117 -169 -71 -153 -83 -7 -92 -103 63 58 -76 310
3564 310 138 242 465 223 213 267 134 206 363 -109 181 250 14 -246 -79 -222 -361 -239 -209 -186 -256 -119
3586 -119 -354 -205 40 63 29 113 172 -24 -26 141 603 121 237 421 99 277 205 155 177 116 149 87 -3 123
$$ packed form
3419c86J10j6J11J6j57K25J00l35J03K34Q6j45K76j20j2N4P9j69p4M61o0l20J63
3442B24k27m5M6M4r2nO3l87L13M2R5k07l8J45k90L14J32k01m0o1lK84p7K44j7
3467B56k92n3K40L15L0k54J16l26L07j66j02j23O9m16K21K7Pk9k44J61j27L24
3489e9j0K23o07K70J74K1k65J26L49m0J96k59K85l09K88M6k04j9p5m5M5j44R7
3512H4l73J33nl1LP6j66J27l9r2qJ77k32L19k7R3N1R9p0m5L04n28K16J70l57J36
3538A5K11k7l05J13j36j4O4p8j1Oj52j32L43k13J99n2R8q2P0P6q5j1J66nj34L86
3564C10j72J04K23k42j0N4j33P2J57m72K90O9k36k60J67j43j39J22L0K3p0J37
3586a19k35J49K45K3l4Q4N9j96kJ67M62m82J16J84l22J78p2n0K2o1L3o2r0J26
$$ plain form
3610 123 65 -213 -98 -224 -194 -261 -304 -206 -24 -154 -494 -55 13 -114 57 11 290 181 511 223 43 219
3632 219 248 415 453 99 -207 121 231 111 0 -184 -104 -371 -161 93 51 -186 -178 -233 -318 58 -174 -75 97
3655 97 275 116 99 248 202 89 204 -153 197 340 200 268 229 29 -118 89 -45 -104 -85 -211 -78 -378
3677 -378 -49 -349 -93 -15 -261 -191 74 63 -154 -176 -54 -66 146 163 332 26 -54 -11 142 406 337 130 201
3700 201 190 144 5 -17 28 -165 26 -237 -163 -15 -59 -285 -307 -164 -89 -244 -61 -77 -45 -87 32 65 150 304
3724 304 -155 -15 58 204 219 362 246 -155 109 216 135 19 70 -389 -289 71 -189 2 -221 -348 -324 -110
3746 -110 -46 -190 -193 -102 -61 -81 131 187 11 126 64 225 126 359 -92 307 113 124 289 -14 400 12 30 182
3770 182 73 80 -35 -21 -120 -128 -305 -167 99 -77 -38 -50 -61 24 36 56 136 25 179 204 89 267 307 119 49
$$ packed form
3610A23n8k78J15j26L0o7m3R8J82j30l40M39O8j27J71m6K79j09L30k88j80J76
3632B19K9J67L8l54l06L28J10j20j11j84Q0k67K10K54m2k37Qn5q5L76k32R9J72
3655I7J78j59j7J49m6j13J15l57L50J43j40O8l9k00j47K07j34n9J9j26J33l00
3677c78L29l00K56P8k46P0K65j1k17k2J22j2K12J7J69l06q0M3J53K64o9k07P1
3700B01j1m6j39k2M5j93J91k63P4J48m4k26k2J43P5j55J83j6L2m2J19L3Q5J54
3724C04m59J40P3J46J5J43j16m01K64J07q1j16N1m59J00L60k60J91k23j27K4K14
3746a10O4j44lR1M1k0K12N6j76J15o2J61r9K33m51L99j94J1J65l03M14l88J8J52
3770A82j09Pj15J4r9qj77J38K66j76L9j2j1Q5J2K0Q0j11J54K5j15J78M0j88p0
$$ plain form
3795 49 93 138 181 183 -147 57 -36 130 84 -247 -68 -301 -331 94 -235 -207 -117 49 -143 -64 -7 -51 29 175 259
3820 259 184 373 13 -251 309 202 171 149 274 280 261 76 200 -62 -135 -230 -310 -135 -242 -238 -293 -80 -111 -113 -10
3845 -10 37 -77 121 -263 37 -128 14 -113 196 24 92 281 113 225 56 14 138 43 157 17 14 88 -234
3868 -234 14 -247 16 -133 -168 -111 -210 -216 -269 -99 -174 -98 -34 -135 36 -9 275 172 192 190 49 103 86 -37 439
3893 439 318 158 163 89 -70 -12 -77 -57 -114 -82 20 -299 -121 -264 -164 -106 -388 -352 -33 -183 -69 -5 196 -41
3917 -41 207 -4 234 -150 325 168 314 19 95 14 172 -42 187 -6 -217 -202 -121 -90 -142 -65 -163 -314 -5
3940 -5 -101 -250 21 -11 -105 -97 129 -78 153 -13 137 20 366 -37 95 144 117 81 127 243 34 159 -148 -111
3964 -111 -138 282 -47 170 -191 -90 81 -52 81 -84 -119 -105 -44 221 191 -180 17 -244 156 -22 187 327
$$ packed form
3795D9M4M5M3Kl30K04r3J66m6l31J79k33l0M25l29K8R0J66j92P9N7m4Q0J46Q4
3820B59p5J89l60k64N60j07l1k2J25Oj9j85J24k62p3r5q0J75j07Mn5K13l1kJ03
3845a0M7j14J98l84L00j65J42j27L09j72O8J89j68J12j69m2J24r5J14j40lP4l22
3868b34K48k61K63j49l5N7r9on3J70p5P6O4j01J71m5K84j03K0kj41N4j7j23M76
3893D39j21j60Np4j59N8o5K0n7L2J02l19J78j43J00N8k82L6L19j50J14O4K01k37
3917d1K48k11K38l84M75j57J46k95P6q1J58k14K29j93k11J5Q1L1n2P7r8j51L09
3940er6j49K71l2r4QK26k07K31j66J50j17L46m03J32M9k7l6M6J16k09J25l07L7
3964a11k7M20l29K17l61J01J71j33J33j65l5J4O1K65l0l71J97k61M00j78K09J40
$$ plain form
3986 327 91 46 132 182 167 8 114 109 -47 -174 110 70 -31 -3 -360 -214 -12 -143 -39 -64 -37 -231 172
4009 172 -71 206 -82 148 6 150 44 212 83 416 84 -57 88 12 129 158 -15 -19 -56 31 -61 -226
4031 -226 39 -98 -107 -74 -54 -341 -368 -176 221 -11 173 -77 61 -128 -162 58 104 147 58 170 171 -20 -7 165
4055 165 124 -87 18 95 -100 51 243 -207 -214 -191 92 83 95 -126 -412 -47 -101 122 136 19 113 -284 107 -7
4079 -7 -173 -72 108 -44 212 219 181 71 174 146 -30 27 129 -185 -13 -68 -17 109 146 -118 -212 175 -110 -84
4103 -84 59 203 27 121 -61 42 181 222 383 125 68 76 -32 327 226 -140 -194 90 -216 -319 -40 -133 -171
4126 -171 -123 6 -256 -237 -107 -36 -266 31 119 -124 -44 4 -111 -250 174 226 305 473 91 150 293 336 -57
4149 -57 40 47 -205 -85 -229 -19 47 20 -15 -263 -144 26 72 -112 9 -162 -173 172 -2 -108 -161 -232 -47 137
$$ packed form
3986C27k36m5Q6N0j5j59J06nj56j27K84m0j01K8l57J46K02j31J04k5K7j94M03
4009A72k43K77k88K30j42J44j06J68j29L33l32j41J45p6J17K9j73ml7Q7r2j65
4031b26K65j37rL3K0k87k7J92L97k32J84k50J38j89l4K20M6M3q9J12Jj91J3J72
4055A65m1k11J05P7j95J51J92m50pK3K83rJ2k21k86L65n4K23J4j17R4l97L91j14
4079gj66J01J80j52K56Pl8j10J03k8j76N7J02l14J72n5N1J26L7k64r4L87k85K6
4103h4J43J44j76R4j82J03J39M1J61k58n7Qj08L59j01l66n4K84l06j03K79r3l8
4126a71M8J29k62J9J30P1k30K97Q8k43Q0M8j15j39M24N2P9J68l82N9J43M3l93
4149e7R7Pk52J20j44K10O6k7l5k48J19J70M6j84J21j71j1L45j74j06n3p1J85J84
$$ plain form
4173 137 42 -39 91 75 74 32 303 56 -88 118 127 -12 -12 113 -217 -118 97 -54 -142 38 -135 -351 -141 40
4197 40 25 32 -193 -161 -65 324 -168 181 -48 125 -64 -226 333 194 -47 198 201 116 181 45 2 43 179 -11
4221 -11 44 -220 85 -57 -116 -89 -314 15 -73 -26 -72 -28 -166 94 341 265 16 254 164 -9 241 109 143 321
4245 321 510 -14 -93 149 -105 90 191 -231 -312 -115 -148 -7 -37 -268 -179 -308 55 176 -308 -345 -219 -145
4267 -145 268 319 -124 37 192 5 156 173 138 132 52 94 329 -28 -17 -40 -9 7 31 67 -44 -201 -480 -189
4291 -189 -134 -124 -20 -31 -95 -152 55 82 109 -40 152 243 42 -16 270 209 -59 145 309 435 264 -74 32
4314 32 153 -241 11 195 93 164 10 -217 -103 -51 -96 -136 -107 -122 -7 182 98 13 -295 -46 -66 155 112 242
4338 242 138 -107 96 213 394 215 -136 -49 -53 -12 71 -170 51 -129 -43 -67 88 -106 -15 38 -195 86 -75
$$ packed form
4173A37r5q1J30j6jm2K71k47j44K06Rj39%J25l30R9K15j51q8J80j73k16K10J81
4197D0j5Pk25L2R6L89m92L49k29J73j89j62N59j39k41K45Lq5O5j36m3M1J36j90
4221a1N5k64L05j42n9K7k25L29q8M7m6M4j38K60K47p6k49K38r0j73K50j32L4J78
4245C21J89n24p9K42k54J95J01m22q1J97l3J41l0k31Q9j29L63J21m84l7J26P4
4267a45M13N1m43J61J55j87J51J7l5oq0M2K35l57J1k3L1J6K4L6j11j57k79K91
4291a89N5J0J04j1o4n7K07K7K7j49J92R1k01n8K86o1k68K04J64J26j71l38J06
4314C2J21l94K52J84j02P1j54k27J14N2m5m0K9j5J15J89q4q5l08K49k0K21m3J30
4338B42j04k45K03J17J81j79l51Q7mM1Q3k41K21j80Q6k4J55j94R1N3k33K81j61
$$ plain form
4361 -75 -304 -53 -54 39 -298 282 87 104 37 -26 -13 114 375 236 -68 24 -125 -142 215 -91 74 -12 -156 -232
4385 -232 -214 -120 -86 -78 -28 -260 -137 -212 -211 190 -33 -7 -25 102 51 204 -74 31 6 146 140 186 -74 -180 61
4410 61 -29 -5 237 -152 27 -129 -253 -209 198 -278 -284 -135 76 -110 -137 3 -5 76 155 189 53 128 70 6 -202
4435 -202 -7 -110 290 82 231 178 -32 210 219 137 -15 -60 246 101 96 -212 -60 187 -186 -333 -274 -46 -205
4458 -205 -32 -165 73 149 -116 78 53 167 234 9 84 88 -4 -145 -72 177 -35 -42 208 -105 -40 64 83 13
4482 13 -169 -82 -60 81 -118 -109 -157 64 62 -16 -11 62 81 -125 -82 171 144 210 15 139 -156 1 352 235 -89
4507 -89 -10 140 107 -37 -221 -124 -249 -7 131 53 131 -150 -122 -9 -181 153 84 276 75 -136 135 -30 -134
4530 -134 -161 166 299 69 172 -106 234 -80 114 122 36 -203 -9 178 -171 -29 -358 -282 26 -101 56 49
$$ packed form
4361g5k29K51jR3l37N80j95J7o7o3J3J27K61j39l04R2j49j7L57l06J65q6j44p6
4385b32J8R4L4QN0k32J23p5JM01k23K6j8J27n1J53k78J05k5J40oM6k60j06K41
4410F1r0K4K42l89J79j56j24M4M07m76oJ49K11j86k7J40qQ1P9L4j36P5n8o4k08
4435b02J95j03M00k08J49n3k10K42Rq2j52m5L06j45nl08J52K47l73j47N9K28j59
4458b05J73j33K38P6k65J94k5J14O7k25P5Mr2j41P3K49k12pK50l13O5J04J9p0
4482A3j82Q7K2J41j99Rm8K21kp8NP3J9k06M3K53k7O6j95J24k95J57L51j17l24
4507h9P9J50l3j44j84R7j25K42J38p8P8k81K8J13j72L34o9J92k01k11K71j65j04
4530a34k7L27J33k30J03k78L40l14J94Qq6k39J94J87l49J42l29P6L08j27J57p
$$ plain form
4552 49 -134 -28 -52 -136 -62 180 -52 312 3 -202 97 156 -40 5 65 -107 -22 137 230 -113 -419 -88 -14
4575 -14 82 162 -163 -156 -170 23 -69 -137 -16 76 -106 150 -206 172 43 74 40 335 183 -6 1 13 277 70 -110
4600 -110 -97 134 16 -147 -93 -175 -7 -126 -281 106 -82 -189 -57 109 -35 -359 121 72 -108 -145 -105 -135
4622 -135 -5 -71 17 352 130 61 3 54 -49 307 150 136 215 336 -116 93 68 -156 -209 -175 -134 6 3 134
4646 134 -12 -167 -108 45 -96 -76 99 -71 40 49 9 55 58 60 -61 244 103 -142 77 -39 -201 -112 42 -46
4670 -46 -223 -33 10 -196 153 124 125 -151 -27 -254 -75 36 -92 13 3 -50 -198 -143 133 32 -18 6 29 -85
4694 -85 217 124 -25 21 28 51 -108 37 185 -89 83 -326 -73 188 -73 -101 -225 -300 -73 -10 -2 31 -445 -28
4718 -28 79 -69 -45 7 15 -34 200 355 251 -66 325 -171 74 94 168 86 145 -94 -20 100 -44 -47 -24 -108 -151
$$ packed form
4552D9j83J06k4q4P4K42k32L64l09k05K99N9j96M5O0j72Q5J59R3l43l06L31P4
4575a4R6Q0l25Pj4J93r2o8J21R2j82K56l56L78j29L1l4K95j52j89PJ2K64k07j80
4600a10J3K31j18j63N4q2J68j19j55L87j88j07J32J66j44l24M80m9j80l7M0l0
4622a35J30o6Q8L35k22o9n8N1j03L56j57j4P9J21m52K09k5k24n3L4M1J40lJ31
4646A34j46j55N9J53j41K0J75j70J11Rm0M6LKj21L05j41k45K19j16j62Q9J54q8
4670d6j77J90M3k06L49k9Jk76J24k27J79J11j28J05j0n3j48N5K76j01n0K4K3j14
4694h5L02r3j49M6PK3j59J45J48k74J72m09K53K61k61k8j24p5K27O3QL3m76M17
4718b8J07j48K4N2Qm9K34J55j04l17L91m96K45K0P4q2N9k39P4J20j44lK3q4m3
$$ plain form
4743 -151 -32 106 -8 -239 86 34 -214 199 -197 -51 244 70 43 112 336 98 -26 27 -205 144 -49
4764 -49 74 -218 -346 -99 -199 112 128 -155 -188 -129 -48 -22 173 35 -64 166 -120 -130 -65 211 -21 194 199 -23
4788 -23 -2 36 247 -172 120 82 -99 -52 -26 212 206 -168 20 33 62 -132 -122 -90 130 -350 -346 -122 -104 204 -125
4813 -125 188 93 -81 9 -95 -10 176 37 213 74 67 -115 187 221 -33 185 -118 -197 131 -6 -13 -100 -397
4836 -397 -435 -82 -172 106 -51 61 -149 -230 188 430 115 -67 -41 -14 -82 -279 241 -116 -109 79 -82 268 31
4859 31 115 -34 -111 89 71 -37 -69 -91 -37 -128 15 84 -122 3 -216 67 -141 -33 -67 -50 -229 -121 52 107
4883 107 57 -110 106 62 98 -12 222 -76 -91 151 -249 36 384 10 81 -46 -39 193 27 -30 -255 -131 -205
4906 -205 61 -87 61 -307 -42 82 47 -37 115 54 -29 58 1 -47 43 66 -176 178 -103 107 -22 -149 34
$$ packed form
4743a51J19J38j14k31L25n2k48M13l96J46K95j74k7O9K24k38j24N3k32L49j93
4764d9J23k92j28K47j00L11J6k83l3N9Q1K6J95j38r9K30k86j0O5K76k32K15Nk22
4788b3K1L8K11m19K92l8j81M7K6K38ol74J88J3K9j94J0L2K20m80MK24J8L08l29
4813a25L13r5j74R0j04Q5J86j39J76j39pj82L02L4k54K18l03p9L28j37pq7k97
4836c97l8L53r0K78j57J12k10q1M18K42l15j82K6K7o8j97N20l57PJ88j61L50k37
4859C1Q4j49p7K00j8j08l2k2N4r1J43O9k06J25k19K83k08J08l4J7j79J08J73N5
4883A07n0j67K16m4L6j10K34k98j5K42m00K85L48l74P1j27PK32j66n7k25J24p4
4906b05K66j48J48l68K65J24l5q4J52o1q3Q7n7m8R0K3k42L54k81K10j29j27J83
$$ plain form
4929 34 30 -156 37 38 168 -104 -128 -87 31 -293 67 39 85 -168 124 130 174 162 220 204 370 225 124 32 173
4954 173 -62 -78 64 73 -38 101 -54 -267 11 -165 164 21 -39 -17 -155 -267 51 -162 -88 11 -66 14 -85
4977 -85 -12 -120 24 83 345 193 130 130 14 -94 -88 6 40 -117 -127 -49 144 -54 6 -27 54 4 91 -75 -523 -147
5003 -147 29 38 20 -226 -151 -45 164 79 -19 115 305 79 71 299 113 -100 257 -59 148 -29 41 5 -64 -125
5027 -125 -15 -127 -82 -17 -114 -62 -171 35 -93 -150 -30 -86 95 105 96 52 -46 145 4 177 167 -73 -26 3 -7
5052 -7 -32 124 76 -86 -106 -149 -173 78 138 -184 78 -105 -190 -127 -19 171 -7 -105 94 236 -138 17 -64 313
5076 313 -315 183 -200 129 -2 74 127 -177 -60 60 240 276 -187 -66 102 6 -83 -124 118 -178 -317 -100
5098 -100 -70 -17 -20 -86 -90 85 51 -62 124 38 -49 164 76 -37 -29 195 -88 182 19 -208 58 64 -53 27 -39 161
$$ packed form
4929C4mj86J93JJ30k72k4M1J18l24L60k8M6k53K92OM4j2N8j6J66j45j01r2J41
4954A73k35j6J42Rj11J39j55k13K78j76L29j43o0K2j38j12L18k13P4R9p7Q0r9
4977h5P3j08J44N9K62j52o3%j16j08OR4L4j57j0P8J93j98O0l3Q1n0Q7j66m48L76
5003a47J76Rj8k46P5J06K09q5r8J34J90k26qK28j86k13L57l16K07j77P0l6o9o1
5027a25J10j12M5O5r7N2j09K06j28n7J20n6J81J0rm4r8J91j41J73j0k40M7K9j0
5052gk5J56m8j62k0m3k4K51O0l22K62j83q5O3J08J90j78r8J99J42l74J55q1L77
5076C13o28M98l83L29j31P6N3l04J17J20J80L6m63J21J68r6q9m1K42k96j39K17
5098a00L0N3lo6mJ75l4j13J86q6q7K13q8j13QK24k83K70j63k27K66Oj17Q0o6K00
$$ plain form
5124 161 -167 -215 -298 -5 -203 -156 98 -145 -276 279 -141 -209 13 41 40 -9 60 -94 -165 8 201 187 -42 111
5148 111 -164 55 -37 315 -4 112 72 -172 -93 -61 -181 -84 84 25 -432 -143 -74 55 225 -178 34 133 171
5171 171 108 -107 -87 83 172 97 39 72 40 129 259 110 157 -197 -28 -152 -112 235 234 0 -257 -103 -19 -210
5195 -210 -171 11 -25 11 158 -1 -89 12 -62 2 -137 -40 110 132 111 92 30 89 -92 71 236 88 -54 175
5219 175 -192 -88 -94 -87 -59 -342 -287 -102 -251 29 -69 -124 282 213 31 -63 -58 -84 6 155 39 1 252 -22 -161
5244 -161 166 241 114 -71 143 153 -107 -163 -63 -29 -244 -65 -33 -33 -47 -95 71 76 -187 -80 -183 -71 -162 -201
5268 -201 126 24 26 229 332 181 179 45 278 173 101 191 156 117 188 28 55 -105 40 -224 -19 -218 -7
5291 -7 48 -96 74 -76 66 34 6 -54 -50 -102 73 -43 22 169 162 171 40 10 205 44 63 -122 151 -225 -34
$$ packed form
5124A61l28m8q3K93j98M7K54k43j31N55m20o8K22K8jm9O9j54p1J73J93j4k29J53
5148A11k75K19r2L52l19J16m0k44P9L2j20R7J68n9m57K89O9J29J70m03K12R9L8
5171A71o3k15K0J70Q9p5n8L3l2Q9J30j49M7l54J69j24M0L47jk34k57J54Q4j91
5195b10L9J82l6L6J47j59q8J01p4O4j39R7J50K2k1j9o2N9j81J63J65j48j42K29
5219A75l67J04oPK8k83N5J85j49K80r8n5M06o9j82r4Nk6R0J49j16l8K51k74j39
5244a61L27P5j27j85K14J0k60n6J00L4k15J79L2%j4m8J66Nk63J07j03J12r1l9
5268b01L27j02KK03J03j51kj34K33j05p2R0l5l9P1j60K7j60J45k64K05j99K11
5291gN5j44J70j50J42l2k8o0Mn2J75j16O5J47pRj31l0J95j61J9j85K73l76J91
$$ plain form
5316 -34 26 50 -107 -202 123 -105 -90 167 -196 141 -213 293 209 -452 60 170 159 236 161 -90 -77 141 10
5339 10 263 483 16 65 151 259 -26 -160 61 -133 -91 -161 -79 263 -172 134 -232 18 -73 -131 -166 -24 60
5362 60 -64 372 116 160 98 291 -103 149 123 -20 30 12 161 86 93 -104 85 21 -64 103 -295 75 23 60
5386 60 -135 -148 -77 71 153 62 -102 100 24 201 106 107 134 100 200 94 507 50 89 -149 56 -6 -61 50 61
5411 61 -61 -47 -120 2 110 69 -163 -61 -198 19 -25 -212 -64 -39 11 -79 19 -6 -2 332 82 -44 264 -34
5435 -34 177 72 131 184 -106 176 21 -26 58 -137 -1 -159 -85 -122 21 69 -64 9 -144 184 -13 21 220
5458 220 57 4 -60 97 -89 177 -15 191 158 -8 164 113 311 205 289 58 -21 255 20 -155 -128 -86 -146
5481 -146 -202 -15 -241 -99 -166 262 114 317 -70 -8 -40 94 29 70 229 -85 152 -117 267 209 9 209
$$ packed form
5316c4O0K4j57r5L25k28J5K57l63L37l54N06q4o61N12J10j1P7p5k51J3K18j31
5339A0K53K20m67M9Q6J08k85j34K21j94M2p0Q2L42m35L06l66K50r1n8l5J42Q4
5362F0j24M36k56M4o2J93l94K52k6j43N0j8J49p5Pj97J89o4q5J67l98L70n2L7
5386F0j95j3P1J48Q2r1j64K02p6J77r5JK7l4J00j06M13m57L9k38K05o2n5J11J1
5411F1j22J4p3J22J08m1k32J02j37K17m4j87J48K5N0r0R8k5ML34k50j26L08k98
5435c4K11j05N9N3k90K82j55m7Q4j95J36j58P4l7J43M8j33P3j53L28j97L4J99
5458B20j63n3o4J57j86K66j92K06l3j66J72n1J98j06Q4k31p9K76k35j75K7M2o0
5481a46n6J87k26J42o7M28j48K03l87O2l2J34o5M1J59l14K37k69L84n8k00K00
$$ plain form
5503 209 23 -48 -152 -161 67 14 -21 12 -39 -28 -116 -140 -40 -43 -2 89 -55 -29 41 -141 -28 57 -164 -32 70 -248
5529 -248 190 148 190 258 24 109 -5 -140 277 70 -431 104 224 -65 -62 317 30 -8 57 16 2 6 -203 52
5553 52 198 -5 73 228 -188 48 95 -116 -103 47 -125 11 104 15 204 215 11 154 -198 58 51 -3 7 91
5577 91 16 -200 -43 -135 -93 -49 -44 238 67 -4 -10 -75 17 -82 154 242 22 133 119 103 33 17 32 330 149 -76
5603 -76 39 5 -136 -168 -95 -103 -259 -185 -93 -90 62 -145 32 -146 -41 7 -77 11 75 -63 2 67 32 68 -23 106
5629 106 140 -42 53 247 163 54 -119 113 -23 -253 82 -61 -73 -20 -82 143 -109 -297 62 -131 -218 -15
5651 -15 -77 -44 142 140 279 91 -22 115 -24 91 176 352 23 42 289 121 -126 -201 -5 163 -168 149 -82
5674 -82 2 -56 -205 39 -39 -43 55 2 227 -95 -48 -147 11 14 111 52 -84 83 92 -18 -19 142 -155 -210 -60 148
$$ packed form
5503B09j86p1j04rK28n3l5L3n1J1q8k4J00lM1R1j44K6P0j82J13Q5k21J32J02l18
5529b48M38m2M2O8k34Q5j14j35M17k07n01N35J20k89LL79k87l8O5m1j4Mk09K55
5553E2J46k03P8J55m16K36M7k11J3J50j72J36R3q9J89J1k04J43l52K56pn4J0Q4
5577I1p5k16J57r2M2M4NK82j71p1oo5R2r9K36Q8k20J11j4j6p0j6J5K98j81k25
5603g6J15l4j41l2P3qj56P4R2LJ52k07J77j78J05M8q4Q8O4j38O5O5l5L6r1J29
5629A06L4j82R5J94q4j09j73K32j36k30L35j43j2N3o2K25k52j88L59j93q7K03
5651a5o2L3J86kJ39j88j13J37j39J15Q5J76l29J9K47j68k47p5J96J68l31L17k31
5674h2Q4n8j49K44p8mR8n3K25l22M7r9J58LR7n9j36J67Rj10jJ61k97n5J50K08
$$ plain form
5700 148 108 -44 1 -8 185 -85 -16 119 -68 24 -9 65 -99 18 -249 -307 -117 28 -35 -187 119 62 -67 -174
5724 -174 293 -1 81 185 -19 -47 152 -6 138 -27 125 -184 81 -88 -53 67 -66 -129 -340 -203 -38
5745 -38 44 9 -35 187 94 -214 40 -93 -61 2 134 149 229 51 -118 24 161 195 -13 61 17 36 18 -124 136
5770 136 -24 -168 -64 136 92 -74 61 19 56 -72 16 -93 113 28 -5 -47 18 -111 186 120 24 170 -10
5793 -10 126 180 -69 -162 -87 1 266 157 69 -255 -83 -64 -117 -60 107 -59 -106 33 -153 27 -147 13 -48 42
5817 42 104 129 89 64 178 -49 22 -21 63 -56 -268 39 -131 313 77 240 -51 -9 -207 -120 -274 -92 -45 -107
5841 -107 36 46 -206 9 36 -32 -161 -41 54 -14 -121 -56 96 230 67 273 278 71 328 -175 -111 -136 153
5864 153 -108 -88 113 -151 -129 -114 -187 42 148 -108 195 91 -100 -156 39 -67 93 138 30 81 -17 130 26
$$ packed form
5700A48m0j52M5rJ93k70O9J35j87R2l3P4j64J17k67n8J90J45o3j52L06n7j29j07
5724a74M67k94Q2J04k04k8J99j58J44j65J52l09K65j69L5J20j33o3k11J37J65
5745c8Q2l5m4K22r3l08K54j33L2O3J32J5Q0j78j69J42J37L4k08P4m4J9j8j42K60
5770A36j60j44J04K00m4j66J35m2L7j28Q8j09K06q5l3m2O5j29K97o6r6J46j80
5793a0J36N4k49r3P5Q8K65j09q8l24J72J9n3N7J67j66m7J39j86J80j74J60o1R0
5817D2O2K5m0k5J14k27P1m3Q4j19k12L07j70M44k36J63k91M2j98Q7j54J82M7o2
5841a07J43J0k52K15K7o8j29J20R5o8j07O5J52J34j63K06Nk07K57n03O4k5K89
5864A53k61K0K01k64K2J5p3K29J06k56L03j04j91n6J95j06J60M5j08N1r8J47j04
$$ plain form
5887 26 -21 151 139 54 -26 -61 -22 -104 -112 -220 -15 -166 138 -65 -57 94 -5 21 -224 148 50 -111 8 -226 -169
5912 -169 -118 196 -179 -35 -30 388 150 -21 101 1 254 144 108 61 -65 -96 12 -97 -220 -173 -175 -25 159
$$ packed form
5887B6m7J72j2q5q0l5L9q2qj08K05j51L04k03QJ51r9K6k45L72r8j61J19k34N7
5912a69N1L14l75J44NM18k38j71J22j00K53j10l6m7j26l1J08j09j23M7kJ50J84
$$ [...]
8191E3
##END NTUPLES=NMR FID
##END=
