##TITLE=1H_Ser 6-8-V-2
 CDCl3
 8 sc, 
 13.04.2022
##JCAMPDX= 6.0         $$ Bruker NMR JCAMP-DX V2.0
##DATA TYPE= NMR FID
##DATA CLASS= NTUPLES
##ORIGIN= UXNMR, Bruker Analytische Messtechnik GmbH
##OWNER= root
$$ XWIN-NMR		Version 3.5
$$ Wed Apr 13 14:21:24 2022 Russian Standard Time (UT+4h)  she@DPX200
##.OBSERVE FREQUENCY= 200.13135
##.OBSERVE NUCLEUS= ^1H
##.DELAY= (6, 6)
##.ACQUISITION MODE= SIMULTANEOUS
##.ACQUISITION SCHEME= undefined
##.AVERAGES= 8
##.DIGITISER RES= 18
##SPECTROMETER/DATA SYSTEM= spect
##.PULSE SEQUENCE= zg30
##.SOLVENT NAME= CDCl3
##.SHIFT REFERENCE= (INTERNAL, CDCl3, 0, 15.7039)
##AUDIT TRAIL= $$ (NUMBER, WHEN, WHO, WHERE, WHAT)
$$ ##TITLE= Audit trail, XWIN-NMR		Version 3.5
$$ ##JCAMPDX= 5.01
$$ ##ORIGIN= Bruker BioSpin GmbH
$$ ##OWNER= she
$$ F:/spectra/data/she/nmr/H-F/1/audita.txt
$$ ##AUDIT TRAIL=  $$ (NUMBER, WHEN, WHO, WHERE, WHAT)
(   1,<2022-04-13 14:20:16.37 +0400>,<she>,<DPX200>,
      <created by zg, POWCHK disabled, PULCHK disabled
       configuration hash MD5:
       00 E9 B6 7A A2 85 ED C7 34 08 36 98 17 FE 4E 26
       data hash MD5: 16K
       61 A8 5F C8 23 78 48 1D 30 F6 BF 7C 52 2A A8 D5>)
$$ ##END=
$$ 
$$ hash MD5
$$ D9 A2 16 98 7F 5E 1A 47 CD E3 0C AE EA E7 AC 93
##$RELAX= 
##$RELAX= 
##$RELAX= 
##$RELAX= 
##$RELAX= 
##$RELAX= 
$$ Bruker specific parameters
$$ --------------------------
##$DU= <F:/spectra>
##$EXPNO= 1
##$NAME= <H-F>
##$PROCNO= 1
##$TYPE= <nmr>
##$USER= <she>
##$AMP= (0..31)
100 100 100 100 100 100 100 100 100 100 100 100 100 100 100 100 100 100 
100 100 100 100 100 100 100 100 100 100 100 100 100 100 
##$AQSEQ= 0
##$AQ_mod= 1
##$AUNM= <au_zg>
##$AUTOPOS= <>
##$BF1= 200.13
##$BF2= 200.13
##$BF3= 200.13
##$BF4= 200.13
##$BF5= 200.13
##$BF6= 200.13
##$BF7= 200.13
##$BF8= 200.13
##$BYTORDA= 1
##$CFDGTYP= 0
##$CFRGTYP= 5
##$CHEMSTR= <none>
##$CNST= (0..31)
1 1 145 1 1 1 1 1 1 1 1 1 1 1 1 1 1 1 1 1 1 1 1 1 1 1 1 1 1 1 1 1 
##$CPDPRG= <>
##$CPDPRG1= <>
##$CPDPRG2= <>
##$CPDPRG3= <>
##$CPDPRG4= <mlev>
##$CPDPRG5= <mlev>
##$CPDPRG6= <mlev>
##$CPDPRG7= <mlev>
##$CPDPRG8= <mlev>
##$CPDPRGB= <>
##$CPDPRGT= <>
##$D= (0..31)
0 1.2 0 0 0 0 0 0 0 0.06 0 0.03 0 0 0 0 0.0002 0 0 0 0 0 0 0 0 0 0 0 0 
0 0 0 
##$DATE= 1649845215
##$DBL= (0..7)
120 120 120 120 120 120 120 120 
##$DBP= (0..7)
150 150 150 150 150 150 150 150 
##$DBP07= 0
##$DBPNAM0= <>
##$DBPNAM1= <>
##$DBPNAM2= <>
##$DBPNAM3= <>
##$DBPNAM4= <>
##$DBPNAM5= <>
##$DBPNAM6= <>
##$DBPNAM7= <>
##$DBPOAL= (0..7)
0.5 0.5 0.5 0.5 0.5 0.5 0.5 0.5 
##$DBPOFFS= (0..7)
0 0 0 0 0 0 0 0 
##$DE= 6
##$DECBNUC= <off>
##$DECIM= 32
##$DECNUC= <off>
##$DECSTAT= 4
##$DIGMOD= 1
##$DIGTYP= 9
##$DL= (0..7)
0 120 120 120 120 120 120 120 
##$DP= (0..7)
150 150 150 150 150 150 150 150 
##$DP07= 0
##$DPNAME0= <>
##$DPNAME1= <>
##$DPNAME2= <>
##$DPNAME3= <>
##$DPNAME4= <>
##$DPNAME5= <>
##$DPNAME6= <>
##$DPNAME7= <>
##$DPOAL= (0..7)
0.5 0.5 0.5 0.5 0.5 0.5 0.5 0.5 
##$DPOFFS= (0..7)
0 0 0 0 0 0 0 0 
##$DQDMODE= 0
##$DR= 18
##$DS= 0
##$DSLIST= <SSSSSSSSSSSSSSS>
$$ [...]
##$SUBNAM2= <"">
##$SUBNAM3= <"">
##$SUBNAM4= <"">
##$SUBNAM5= <"">
##$SUBNAM6= <"">
##$SUBNAM7= <"">
##$SUBNAM8= <"">
##$SUBNAM9= <"">
##$SW= 18.05172834244
##$SWIBOX= (0..15)
0 0 2 0 0 0 0 0 0 0 0 0 0 0 0 0 
##$SW_h= 3612.71676300578
##$TD= 16384
##$TD0= 1
##$TE= 0
##$TE2= 300
##$TE3= 300
##$TEG= 300
##$TL= (0..7)
0 120 120 120 120 120 120 120 
##$TP= (0..7)
150 150 150 150 150 150 150 150 
##$TP07= 0
##$TPNAME0= <>
##$TPNAME1= <>
##$TPNAME2= <>
##$TPNAME3= <>
##$TPNAME4= <>
##$TPNAME5= <>
##$TPNAME6= <>
##$TPNAME7= <>
##$TPOAL= (0..7)
0.5 0.5 0.5 0.5 0.5 0.5 0.5 0.5 
##$TPOFFS= (0..7)
0 0 0 0 0 0 0 0 
##$TUNHIN= 0
##$TUNHOUT= 0
##$TUNXOUT= 0
##$USERA1= <user>
##$USERA2= <user>
##$USERA3= <user>
##$USERA4= <user>
##$USERA5= <user>
##$V9= 5
##$VALIST= <valist>
##$VCLIST= <CCCCCCCCCCCCCCC>
##$VD= 0
##$VDLIST= <DDDDDDDDDDDDDDD>
##$VPLIST= <PPPPPPPPPPPPPPP>
##$VTLIST= <TTTTTTTTTTTTTTT>
##$WBST= 1024
##$WBSW= 4
##$XGAIN= (0..3)
0 0 0 0 
##$XL= 0
##$YL= 0
##$YMAX_a= 133829
##$YMIN_a= -243462
##$ZGOPTNS= <>
##$ZL1= 120
##$ZL2= 120
##$ZL3= 120
##$ZL4= 120
##$ABSF1= 10
##$ABSF2= 0
##$ABSG= 5
##$ABSL= 3
##$ALPHA= 0
##$AQORDER= 0
##$ASSFAC= 0
##$ASSFACI= 0
##$ASSFACX= 0
##$ASSWID= 0
##$AUNMP= <proc_1d>
##$AZFE= 0.1
##$AZFW= 0.1
##$BCFW= 1
##$BC_mod= 2
##$BYTORDP= 1
##$COROFFS= 0
##$CY= 11.3945322036743
##$DATMOD= 1
##$DC= 2
##$DFILT= <>
##$DTYPP= 0
##$F1P= 2.36226072786647
##$F2P= -0.459571619588291
##$FCOR= 0.5
##$FTSIZE= 0
##$FT_mod= 4
##$GAMMA= 1
##$GB= 0.15
##$INTBC= 1
##$INTSCL= 1
##$ISEN= 128
##$LB= 0.24
##$LEV0= 0
##$LPBIN= 0
##$MAXI= 10000
##$MC2= 0
##$MEAN= 0
##$ME_mod= 0
##$MI= 1.114404
##$NCOEF= 0
##$NC_proc= 0
##$NLEV= 6
##$NOISF1= 3.799351
##$NOISF2= 2.8
##$NSP= 1
##$NTH_PI= 0
##$NZP= 0
##$OFFSET= 15.70392
##$PC= 1
##$PHC0= -18387.23
##$PHC1= 8.800779
##$PH_mod= 1
##$PKNL= yes
##$PPARMOD= 0
##$PSCAL= 0
##$PSIGN= 0
##$REVERSE= no
##$SF= 200.130013532006
##$SI= 16384
##$SIGF1= 3
##$SIGF2= 2
##$SINO= 400
##$SIOLD= 16384
##$SREGLST= <1H.CDCl3>
##$SSB= 0
##$STSI= 0
##$STSR= 0
##$SW_p= 3612.71676300578
##$SYMM= 0
##$S_DEV= 0
##$TDeff= 0
##$TDoff= 0
##$TI= <>
##$TILT= no
##$TM1= 0
##$TM2= 0
##$TOPLEV= 0
##$USERP1= <user>
##$USERP2= <user>
##$USERP3= <user>
##$USERP4= <user>
##$USERP5= <user>
##$WDW= 1
##$XDIM= 8192
##$YMAX_p= 0
##$YMIN_p= 0
$$ End of Bruker specific parameters
$$ ---------------------------------
##NTUPLES= NMR FID
##VAR_NAME=  TIME,          FID/REAL,        FID/IMAG
##SYMBOL=    X,             R,               I
##VAR_TYPE=  INDEPENDENT,   DEPENDENT,       DEPENDENT
##VAR_FORM=  AFFN,          ASDF,            ASDF
##VAR_DIM=   8192,          8192,            8192
##UNITS=     SECONDS,       ARBITRARY UNITS, ARBITRARY UNITS
##FACTOR=    0.0002768,     1,               1
##FIRST=     0,             0,               0
##LAST=      2.2672688,     0,               0
##MIN=       0,             -243462,         0
##MAX=       2.2672688,     133829,          0
$$ Real data points
##PAGE= N=1
##DATA TABLE= (X++(R..R)), XYDATA
$$ [...]
1823e72l7P11K82j28n74k09l53P19N07r1j58n84l76L12Q49L38q8M2o65j12O99
$$ -572 -609 102 384 256 -318 -527 -880 -161 346 255 97 -487 -863 -551 298 636 548 590 -75 -187 512
1844E12M89k5m70n61k61N90K70j13L58q26p53K27O38k2N07l50j079L21J77M00
$$ 512 1001 976 506 -55 -316 274 544 431 789 -37 -790 -563 75 53 560 210 -869 -548 -371 29
1864B9P6l3l63l27J21P64R3K12l30n87R1N77K96r1j07p06J44j95M11N98m19m30
$$ 29 105 72 -291 -618 -497 267 360 572 242 -345 -254 323 619 528 421 -285 -141 -336 75 673 254 -176
1886a76j48J14R5K78N66o91m66k5K98N7N13j30p79l57K28N97M74J33n49l83n1
$$ -176 -324 -210 -115 163 729 38 -428 -453 -155 -98 415 285 -494 -851 -623 -26 448 581 32 -351 -402
1907d02J86O38M83p32n04J84j02N06M05l19m71l27J36J52L59J8j89n18j50r4P80
$$ -402 -216 422 905 173 -331 -147 -249 257 662 343 -128 -455 -319 -167 192 210 21 -497 -647 -741 39
1928C9J15j53l40m07N2M41O55J87n59m32J8K41P88K91k04o24k05N25J38L36k33
$$ 39 154 1 -339 -746 -694 -253 402 589 30 -402 -384 -143 645 936 732 108 -97 428 566 902 669
1949F69j05l69o03P75K78m31j29j98m25J30O40K5j99j87l92j59N67M53J82j38
$$ 669 564 195 -408 367 645 214 85 -113 -538 -408 232 257 58 -129 -521 -680 -113 340 522 384
1969C84m35k01L19O96r9k32k84m14q7P36L92m32l47l97l30M81J55J54L5n62j49
$$ 384 -51 -252 67 763 664 432 148 -266 -353 383 775 343 -4 -401 -731 -250 -95 59 94 -468 -617
1990f17P3N14K72l32j72l15O5N25L96M2k86j53j91q3M86O12l35o82J36Q9L08K27
$$ -617 -544 -30 242 -90 -262 -577 -512 13 409 451 165 12 -179 -262 224 836 501 -181 -45 44 352 579
2012E79j21m49l25J35j99P62j52j30l59n26L19K83K72L77p50l72J67L02M25N33
$$ 579 458 9 -316 -181 -380 382 230 100 -259 -785 -466 -183 89 466 -284 -656 -489 -187 238 771
2032G71n31p85K12K24L78L05j74n21j55L71O0P8M04o40j65j39K70O3M38q9p74
$$ 771 240 -545 -333 -109 269 574 400 -121 -276 95 155 233 637 -3 -168 -307 -37 26 464 375 -399
2053c99j64K99L39j2R6k31m03l4J02L49L90k25l90j68M82k0L18j3n2m22J93J65
$$ -399 -563 -264 75 63 159 -72 -475 -509 -407 -58 332 107 -283 -451 31 11 329 316 264 -158 35 200
2075B00J25M34m52m13j74O7L21K01l0o07J9n88Q59K96l14n6l53n8K53L99K76l38
$$ 200 325 759 307 -106 -280 -213 108 309 279 -328 -309 -897 -38 258 -56 -112 -465 -523 -270 129 405 67
2097F7k20j12L2P41j3m9k03j70j25K73J54J51m99Qk27J36Q3K7L8k98k75j42L90
$$ 67 -153 -265 -233 508 495 446 243 73 -52 221 375 526 27 35 -192 -56 27 54 92 -206 -481 -623 -233
2120b33M35m2j36k72l52K76L61K39k19k42j53J74M82L09l13q5k99J14K1L16k73
$$ -233 202 160 24 -248 -600 -324 37 276 57 -185 -338 -164 318 627 314 229 -70 44 65 381 108
2141A08J61l51k02k9K54N12l45k60j65o7J09M55k46J08n6p2j39q1M35p5k97r8
$$ 108 269 -82 -284 -313 -59 453 108 -152 -317 -384 -275 180 -66 42 -14 -86 -225 -306 129 54 -243 -341
2163c41K95J14J46L13k38n33J3J13K29L91l78m58PJ47R5M44j06m76j28N5J85K25
$$ -341 -46 68 214 527 289 -244 -231 -118 111 502 124 -334 -327 -180 -85 359 253 -223 -351 -296 -111 114
2185A14J99k21m52q3L61J60J95o9m64P7j01K11K62N11n60k14J01q5K74L58J03
$$ 114 313 92 -360 -443 -82 78 273 204 -260 -183 -284 -73 189 700 140 -74 27 -58 216 574 677
2206F77m75l12K89K47p5K05k17l19j69K10R3j53l42k19l2J87K66K51R7l16l99
$$ 677 202 -110 179 426 351 556 339 20 -149 61 154 1 -341 -560 -592 -405 -139 112 209 -107 -506
2227e06K63M6M27K92k38m7k72J27K77J99l23q5m31J8K92J72J16l14m21q0J95K52
$$ -506 -243 -197 230 522 284 237 -35 92 369 568 245 160 -271 -253 39 211 327 13 -408 -488 -293 -41
2249d1j26L06n80j57K72M79J9k43q7n7N5L18L92j55n38L03l59N4N57Q4l10R1l34
$$ -41 -167 139 -441 -598 -326 153 172 -71 -158 -215 -160 158 550 395 -143 160 -199 -145 412 496 186 277 -57
2272e7j63K61J35n3j52k65n87N53K83J68l03j89l41J18M48J03r0M2j13R5K65J61
$$ -57 -220 41 176 123 -29 -294 -881 -328 -45 123 -180 -369 -710 -592 -144 -41 -131 -89 -202 -107 158 319
2294C19k6q5l14q0J39L27N3L1l31k35K50j04K78j44on31K77K31o3J78N3l18j31
$$ 319 293 208 -106 -186 -47 280 333 364 33 -202 48 -56 222 78 72 -459 -182 49 -14 164 217 -101 -232
2317b32K08N9J15L75o90R3j03L28r7L74k42k29J83J2r7K57K14o15j53J61O7j49
$$ -232 -24 35 150 525 -165 -72 -175 153 56 430 188 -41 142 154 57 314 528 -87 -240 -79 -12 -161
2339a61M05j63m38J28j6k4L84k91m01P0J77K0J80K42l53l5l4J06K32J34j43q2
$$ -161 244 81 -357 -229 -245 -269 115 -176 -577 -507 -330 -310 -130 112 -241 -276 -310 -204 28 162 19 -63
2361f3J41k8o1N54k59q6l29k18R01k38k01j59j15j35J39L76j25k53q3j54J01Q8
$$ -63 78 50 -11 543 284 198 -131 -349 552 314 113 -46 -161 -296 -157 219 94 -159 -242 -396 -295 -207
2383b07N19m62J26j04j80O28Q0o8j29k71J07j22M65P9j65l36P2j49O9L00j64K19
$$ -207 312 -150 -24 -128 -308 320 400 332 203 -68 39 -83 382 461 296 -40 32 -117 -48 252 88 307
2405C07m46l62L41J73j45J38k4l41k3L54K81k72j02l0o3N30l2r4L07p4n25L05
$$ 307 -139 -501 -160 13 -132 6 -18 -359 -382 -28 253 -19 -121 -151 -214 316 284 190 497 423 -102 203
2427B03K46l43K72k86L0o3k3P8k5o4j91r4K12j67J37ML7k38J6NL97l9k77p2k38
$$ 203 449 106 378 92 122 59 36 114 89 25 -166 -260 -48 -215 -78 -74 -37 -275 -259 -254 143 104 -173 -245 -483
2452d83M77J30J53Rk41j13J17k06M77K35n34o9q1J98kpO0r3J63m03K72j34R4l15
$$ -483 -6 124 277 286 45 -68 49 -157 320 555 21 -48 -129 69 67 60 120 27 190 -213 59 -75 19 -296
2476b96J08l33M01J97P3l12n2J7j7L07J54q8J85k89o7K67Q7J38l76R5k94j8M89
$$ -296 -188 -521 -120 77 150 -162 -214 -197 -214 93 247 159 344 55 -12 255 342 480 104 199 -95 -113 376
2499C76m0j83O4m44P4K60j56m0k4m52L54P6J04L9j51OK06k11J60M4J40k06j13
$$ 376 336 153 217 -227 -153 107 -49 -89 -113 -565 -211 -135 -31 8 -143 -137 69 -142 18 62 202 -4 -117
2522a17J23J80K19l7m7k70j27K53n6j60J93j62r9j91K73j86j42K95k90j56J54
$$ -117 6 186 405 368 321 51 -76 177 121 -39 154 -8 -107 -298 -25 -211 -353 -58 -348 -504 -350
2543c50M45j23R3l71l4J84J47J73J09j75k8l64N44K12j79K1k58m1l0M26m30J90
$$ -350 95 -28 65 -306 -340 -156 -9 164 273 98 70 -294 250 462 283 304 46 5 -25 401 -29 161
2565A61j10k06j48L15n5Q7n28K54r2J25J40L51l52k3Q2k01j34Q00l20j75j99L28
$$ 161 51 -155 -303 12 -43 44 -484 -230 -322 -197 -57 294 -58 -81 1 -200 -334 466 146 -29 -228 100
2587A00j88K82J89j68m05M08l78K92L95l93k90J39j2k23L72r3j96n9n6K05k03
$$ 100 -88 194 383 215 -190 218 -160 132 527 134 -156 -17 -29 -252 120 27 -169 -228 -284 -79 -282
2608b82J24K15m12J17J83l59N26K13m49l03M15Q5K3K04J96o43P2M86q7J08j43
$$ -282 -158 57 -355 -238 -55 -414 112 325 -124 -427 -12 73 96 300 496 -147 -75 411 324 432 289
2629B89k00k6k37J15o5J00j32j56J83M2o7J47j00q4l89O33N9k84K50J12j51R0
$$ 289 89 63 -174 -59 -124 -24 -156 -312 -129 -87 -154 -7 -107 -191 -580 53 112 -172 78 190 39 129
2651A29J17K34j69L27k85k32%K68k35M3j97o3J18m9kj90J93k97K10j74L17j88
$$ 129 246 480 311 638 353 121 121 389 154 197 0 -63 55 6 4 -186 7 -290 -80 -254 63 -125
2673a25K33k66K19k28J62Q2K34n15j3J74K64K92j44m00J39p1k3J07J8NLl04kP7
$$ -125 108 -158 61 -167 -5 77 311 -204 -217 -43 221 513 369 -31 108 37 14 121 139 144 147 -157 -159 -82
2697h2L3l08J12r5P4k60M00K13j63q1l2J15q6K33O9l33J06J58l3M96l16l46J43
$$ -82 -49 -357 -245 -340 -266 -526 -126 87 -76 -157 -189 -74 -160 73 142 -191 -85 73 40 536 220 -126 17
2720A7J42j97R7J16J16j64j56k4j93R2K76k27J46j75N0Q8L32k26k89R5J0mp4L96
$$ 17 159 -38 59 175 291 127 -29 -53 -246 -154 122 -105 41 -134 -84 4 336 110 -179 -84 -74 -78 -152 244
2744B44Kk87J04p0K1K29k41k20J95n2L30j79J45k41J22K37j90j54mj16k12K06
$$ 244 246 -41 63 -7 14 243 2 -218 -23 -75 255 76 221 -20 102 339 149 -5 -9 -125 -337 -131
2766a31N6R9Nj41J0j42j06L16J04j55lOL16l85K31K86q2k11Q5N3L3k06L71m47
$$ -131 -75 24 29 -112 -102 -244 -350 -34 70 -85 -88 -82 234 -151 80 366 284 73 158 211 244 38 409 -38
2790c8o9J04R4l8J03k21lP7k94K50J79k68P8j31k97K90J21J71mj94J3J32J78P4
$$ -38 -107 -3 91 53 156 -65 -68 9 -285 -35 144 -124 -46 -177 -474 -184 -63 108 104 -90 -77 55 233 307
2814C07k63J0J53k7j52L10j87l07K27l54L13J16o8j47n9J09m06N35p1J2n1l20
$$ 307 44 54 207 180 28 338 151 -156 71 -283 30 146 78 -69 -128 -19 -425 110 39 51 0 -320
2836c20K7P7L71k16j75P5L49q6L03j04k27mJ61j42J19Q3j17k32o2J00P6J70k94
$$ -320 -293 -216 155 -61 -236 -161 188 102 405 301 74 70 231 89 208 291 174 -58 -120 -20 56 226 -68
2859f8M3Ko3j91M35j51j64r6K12l0J7O5q0MJ10m64L83L83rk16l20K74j27K21J05
$$ -68 -25 -23 -86 -277 158 7 -157 -253 -41 -71 -54 11 -69 -65 45 -419 -36 347 338 122 -198 76 -51 170 275
2884B75n8k8l57J74j07J73r4J55l11p3P5j12K50J10l09K03r2J50P0j20l9K6K5
$$ 275 217 189 -168 6 -101 72 -22 133 -178 -251 -176 -288 -38 72 -237 -34 -126 24 94 -26 -65 -39 -14
2907a4l0J63j3K6j62l00L83Q3J77rn09L58o6J33k65Q0j59J27j17p5n4O9Q8N4k87
$$ -14 -44 119 106 132 -30 -330 53 136 313 304 -205 153 87 220 -45 35 -124 3 -114 -189 -243 -174 -86 -32 -319
2932c19J56L5K10j48nJ28k57L16M0n9P2K3k17j81M73q2P7j67K0P0k39P2J19k92
$$ -319 -163 -128 82 -66 -71 57 -200 116 156 97 169 192 -25 -206 267 185 262 95 115 185 -54 18 137 -155
2956a55K5p5k31L52K3J20j48j04j3k2M41k64m9n7K63j12J02K31k62k97J69j4L85
$$ -155 -130 -205 -436 -84 -61 59 -89 -193 -206 -228 213 -51 -100 -157 106 -6 96 327 65 -232 -63 -77 308
2979C08J86j79l21q4J01k48L22J32j08l77o6K67j85L03kk4k96K19j70J42O5j46
$$ 308 494 315 -6 -90 11 -237 85 217 109 -268 -334 -67 -252 51 49 25 -271 -52 -222 -80 -15 -161
3001a61J30KRl2K20p9J01l38L11K97m88J37r7K3j21J03Q4k04K68l34j38O37k76
$$ -161 -31 -29 -20 -52 168 89 190 -148 163 460 -28 109 12 35 -86 17 101 -103 165 -169 -307 330 54
3024E4J23k04R3l69J17J48q2K35Q0l92j02K87Q2K68l34j00K92M1j49J38q2j17
$$ 54 177 -27 66 -303 -186 -38 -120 115 195 -197 -299 -12 70 338 4 -96 196 237 88 226 144 27
3046B7J9K05k0j20k5p2m24K61J67j5n4m7j50j29K30J76K22j10m20L89k24r4L37
$$ 27 46 251 231 111 86 14 -410 -149 18 3 -51 -98 -248 -377 -147 29 251 141 -279 110 -114 -208 129
3069A29j9L8j14n1j63L85K45k65N6k79%n7oK14n4j48K06l49J22K45k39j51J30
$$ 129 110 148 34 -17 -180 205 450 185 241 -38 -38 -95 -101 113 59 -89 117 -232 -110 135 -104 -255 -125
3092a25j27J16L05k95O8N3k38J47K11M1j34l17N37l47L4J86l7P5J33j37O2p4J40
$$ -125 -252 -136 169 -126 -58 -5 -243 -96 115 156 22 -295 242 -105 -71 115 78 153 286 149 211 137 277
3115B77n4m43n3P0J0L85j47k51P9J3M43j44j70j37j95J75K82m06K91K8j6K9p2
$$ 277 223 -220 -273 -203 -193 192 45 -206 -127 -114 329 185 15 -122 -317 -142 140 -266 25 53 37 66 -6
3138fJ76J59q7k91P6K18m20M8J63Mk30j9J38p6p4L43l32J58l12J51R9J23qj17
$$ -6 170 329 242 -49 27 245 -175 -127 36 40 -190 -209 -71 -147 -221 122 -210 -52 -364 -213 -114 9 1 -116
3162a16J86l48M17K9j15j28q8K26L98j75l26K1P3k53J89J54j41J25j69q2N1J94
$$ -116 70 -278 139 168 53 -75 -163 63 461 286 -40 -19 54 -199 -10 144 3 128 -41 -123 -72 122
3184A22j16J4j46J01j72n7L51j1j40m1qq4M04r8j24m6R8k97J22M05l07J63j39
$$ 122 6 20 -126 -25 -197 -254 97 86 -54 -95 -103 -187 217 119 -5 -51 47 -250 -128 277 -30 133 -6
3207fL5N0j45K91j15j60K69k72J06k28K22k27Pj8K14p2P8j14m8J93N5j08J05M
$$ -6 29 79 -66 225 110 -50 219 -53 53 -175 47 -180 -173 -191 23 -49 29 -85 -133 60 115 7 112 116
3231A16j1j51M0J33j08K68l20K94k08j91J01J20l6k9j88J22K5N6J44j74q5l54
$$ 116 105 -46 -6 127 19 287 -33 261 53 -138 -37 83 47 18 -170 -48 -23 33 177 3 -82 -436
3253d36L11p3O5R6m3q7k35M50J11j70K09l14p2J46L85j58q8r6J52j31J65q4J34
$$ -436 -125 -198 -133 -37 -80 -167 -402 48 159 -11 198 -116 -188 -42 343 185 97 1 153 22 187 103 237
3276B37k30o0j74K04N2L4j6r0m1J9k8P4j8N4j1k35N78j89O3k20n8j61K58j0l3
$$ 237 7 -53 -227 -23 29 63 47 -43 -84 -65 -93 -19 -37 17 6 -229 349 160 223 3 -55 -216 42 32 -1
3301aK20r1P5j32j07M13n98J85j92K27n7J96l43J93k07J41L9n0L77l30R8k10K01
$$ -1 219 128 203 71 -36 377 -221 -36 -228 -1 -58 138 -205 -12 -219 -78 -39 -89 288 -42 56 -154 47
3324D7j76J30k08J55m3QO1N67m93J84j43O3l03K57J29j92L5k18j80K40K4P7Q8
$$ 47 -129 1 -207 -52 -95 -87 -26 541 48 232 89 152 -151 106 235 43 78 -140 -320 -80 -56 21 109
3347A09k25n4J55M4l4Q2l61J68%Q0J59Q1j0M7J48k86j81K28J6j78KL50k38O5j37
$$ 109 -116 -170 -15 29 -5 77 -284 -116 -116 -36 123 204 194 241 389 103 -78 150 166 -12 -10 340 102 167 30
3372C0O8j38Lo3r6m8N5J57q2J10O0j58L47j98R5j93K5K43k5nj44Qj66K64l1J52
$$ 30 98 -40 -37 -100 -196 -244 -189 -32 -114 -4 56 -102 245 47 142 -51 -26 217 192 187 43 51 -115 149 118 270
3398B70k93J68j6o1P7o1r5k7o0M5K00J1j58j36L4j33K27k8j81K69k14J65L1K72
$$ 270 -23 145 129 68 145 84 -11 -38 -98 -53 147 158 0 -136 -102 -235 -8 -36 -217 52 -162 3 34 306
3422C06k46k79J61j5J39J07R3q1n2j95j19L28O9j14r2j22q1J66k8R3j11p3L4k92
$$ 306 60 -219 -58 -73 66 173 266 185 133 -62 -181 147 216 102 10 -112 -193 -27 -55 38 -73 -146 -112 -404
3446d04M53k3l5Oo7j27L12k0j75J13j43K0n9M32k49J56N6m22K06J52Q0l57m7N1
$$ -404 49 26 -9 -3 -70 -197 115 95 -80 33 -110 -90 -149 283 34 190 246 -176 30 182 262 -95 -142 -91
3470i1k3O8J33J38k26J94k27j27J85l15J03K41j25MK1q3P2M36l58j98j23M98k07
$$ -91 -114 -46 87 225 -1 193 -34 -161 24 -291 -188 53 -72 -68 -47 -130 -58 378 20 -178 -301 197 -10
3493a0J26r0j34K15J26r9K4k68q0k1K40%l17K19J06k72R9R3J75l51K85L0k30L
$$ -10 116 26 -108 107 233 134 158 -110 -190 -211 29 29 -288 -69 37 -235 -136 -43 132 -219 66 96 -134 -131
3517a31J01J76k61K29r4k76N43j5rj78P9l19K54Oj71K84k73rJ61l1r9j26l8J14
$$ -131 -30 146 -115 114 20 -256 287 272 263 85 164 -155 99 105 -66 218 -55 -64 97 66 -33 -159 -197 -83
3541h3n4J80L9j78K47l59J54q7R3K58k21p0k0J27J64p9K15J7k40J7p9K18k45Q8
$$ -83 -137 43 82 -96 151 -208 -54 -141 -48 210 -11 -81 -101 26 190 111 326 343 103 120 41 259 14 102
3565A02j06j50n2O5J24N0j97K34l47QL35j4o0j54nL0N1L35k00j71N6qJ41o9J46
$$ 102 -4 -154 -206 -141 -17 33 -164 70 -277 -269 66 52 -8 -162 -167 -137 -86 249 49 -122 -66 -74 67 -2 144
3590A44j4l30K01N3m5R4j09Q2j86Q0k03K21K64k53j90Q7L0J88l38K32j72j44L28
$$ 144 130 -200 1 54 9 103 -6 76 -110 -30 -233 -12 252 -1 -191 -104 -74 114 -224 8 -164 -308 20
3613B0J23k72Q9q8n7K56k40K76Q4j10j81J62l2L16n46L06J30l56k8M32k45K05
$$ 20 143 -129 -40 -128 -185 71 -169 107 191 81 -100 62 30 346 -200 106 236 -120 -148 284 39 244
3635B44l77R2k53L9K34J34k20J42j54j20L19k63K39N2j62j23K35J90p4m02M04
$$ 244 -133 -41 -294 -255 -21 113 -107 35 -119 -239 80 -183 56 108 -54 -177 58 248 174 -228 176
3656A76k18j7K12J76l25J30j05K31j48M9P3k61q0J73j18n0m4Q0Kj02K00m1M0L9
$$ 176 -42 -59 153 329 4 134 29 260 112 161 234 -27 -107 66 -52 -102 -146 -66 -64 -166 34 -7 33 72
3680G2j80p9K13J76j96M23j70k65K1o7J84J23l23K9K25k28J27j75K60j78j36k70
$$ 72 -108 -187 26 202 6 429 259 -6 15 -52 132 255 -68 -39 186 -42 85 -90 170 -8 -144 -414
3702d14M74k14k6K71k93M7Q1R6J17n2j46j32J09P7K24k41j3j89M05l9o4J9k94
$$ -414 60 -154 -180 91 -202 -155 -74 22 139 87 -59 -191 -82 -5 219 -22 -35 -224 181 142 78 97 -197
3725a97L90j81j1rl36M56K4l49L8K5n5J16l2p1PK5Q4K37j42l36J66K99J61l14
$$ -197 193 12 1 -8 -344 112 136 -213 -175 -150 -205 -89 -121 -192 -185 -160 -76 161 19 -317 -151 148 309 -5
3749eL70l00l09J48K35L8n6l5j60m5K16K1j79O7J64n9m30L43J93l0k78P3l9j76
$$ -5 365 65 -244 -96 139 177 121 86 -74 -119 97 118 -61 6 170 111 -319 24 217 187 -91 -18 -57 -233
3773b33N0NJ43j06k48M37N6Q5j92J67k03MJ63j15K37m49L10l70K11nJ22P6k78
$$ -233 -183 -178 -35 -141 -389 48 104 189 -3 164 -39 -35 128 13 250 -199 111 -259 -48 -53 69 145 -133
3796a33Q5J7n9J03J07R5k50J7j53R9J73p9j31J33p6M5LJ64k7j71N5P7j47K89k31
$$ -133 -48 -31 -90 13 120 215 -35 -18 -171 -72 101 22 -109 24 -52 -7 -4 160 133 -38 17 94 -53 236 5
3821EJ94k31m6r7L75l05o0m2K49J3P9pm6k66K50l21K18j08k9L23k38k2K95n1j61
$$ 5 199 -32 -78 -175 200 -105 -165 -207 42 55 134 127 81 -185 65 -256 -38 -146 -175 148 -90 -112 183 132 -29
3846b9PM2J40n6m6j05N0p4J20j32J6L07m28N6NO6p6j70M31j09r2%P9K0j76J29
$$ -29 -22 20 160 104 58 -47 3 -71 49 -83 -67 240 -188 -132 -127 -61 -137 -307 124 15 -77 -77 2 22 -154 -25
3872b5k23J99j76K13M8l41M06Kj29O6J49o6k4j35O9J01l40K37k1P1K2l35K81j89
$$ -25 -248 -49 -225 -12 36 -305 101 103 -26 40 189 123 99 -36 33 134 -206 31 10 81 103 -232 49 -140
3896a40R9J1o0J43j62l6Q9J13l8NJ20r8P9J45j08k57J24n5n1k4o5L15j15K0n4
$$ -140 -41 -30 -90 53 -109 -145 -56 57 19 24 144 46 125 270 162 -95 29 -26 -77 -101 -166 149 34 54 0
3921@JK41k23k08J23J00j2j20J71j12j37J16J15j26N4q3L6K6j24L55j05L2Rk11
$$ 0 1 242 19 -189 -66 34 22 -98 73 -39 -176 -60 55 -71 -17 -100 -64 -38 -162 193 88 120 129 -82
3945h2J40k27J36K17q4q8P8j90j06J85J9o9k14L9K85l47J98j65r9K61Q3J68n2
$$ -82 58 -169 -33 184 100 12 90 -100 -206 -21 -2 -71 -285 -246 39 -308 -110 -275 -374 -113 -30 138 86
3968H6l14L34n1O2r4R2k78L43m4j8k60J58K42k00Pk1J15m1J14k36m0m9jO6J02
$$ 86 -228 106 55 117 23 115 -163 180 136 118 -142 16 258 58 65 44 159 118 232 -4 -44 -93 -94 -28 74
3993G4k52M5k26J95J47k20Q6L15j45l6J33k89K53j88K11J19k65J17R7O5k95j6
$$ 74 -178 -133 -359 -164 -17 -237 -151 164 19 -17 116 -173 80 -108 103 222 -43 74 171 236 -59 -75
4015g5m7J28L2j29K43j64M4k60Q9J45J34m7j05j24O3k7O9O5k40J2N2K73j79K73
$$ -75 -122 6 38 -91 152 -12 32 -228 -139 6 140 93 -12 -136 -73 -100 -31 34 -206 -194 -142 131 -48 225
4039B25k56j66R4J06M4j35J68j40K60m01J66J90r9j27j1J1J24o2n8q1J64k85K32
$$ 225 -31 -197 -103 3 47 -88 80 -60 200 -201 -35 155 56 -71 -82 -71 53 -9 -67 -148 16 -269 -37
4062c7mN9J19j22K5r7L05k75k3J64P7l85m6L85k95K49k42J75R6j72K34j76k32
$$ -37 -41 18 137 15 40 -57 248 -27 -50 114 191 -194 -240 145 -150 99 -143 32 128 -44 190 14 -218
4085b18K8J32K64l00R8m0Q4j31l24M10j04K77j84j1k5J92r9k3J41k43K11j33P4
$$ -218 -190 -58 206 -94 4 -36 48 -83 -407 3 -101 176 -8 -19 -44 148 49 26 167 -76 135 2 76
4108G6P5k73J95j95J67J8K9q4j1J14p1k75R9J11k30L58k63J43J89J14m58j03k7
$$ 76 151 -122 73 -122 45 63 92 8 -3 111 40 -235 -136 -25 -255 103 -160 -17 172 286 -172 -275 -302
4131c02L48lN0o6K33o3j53R1J24k17m9J04l3j63j16N00n84L95j07k47M04j03j37
$$ -302 46 43 93 27 260 197 44 135 259 42 -7 97 64 -99 -215 285 -299 96 -11 -258 146 43 -94
4154i4Lnl9j59R5mM57j51n4K02k64P1L1Qj41R2q2J76J1m3j59J21J4q5J05k99M06
$$ -94 -91 -96 -135 -294 -199 -203 254 103 49 251 -13 58 89 97 -44 48 -34 142 153 110 -49 72 86 1 106 -193 213
4181B13k93M5K9J7j00Q5n5R9m6k69K81j32j12K55j30Q7J00J35j54j70Q4K07j74
$$ 213 -80 -35 -6 11 -89 -4 -59 40 -6 -275 6 -126 -238 17 -113 -26 74 209 55 -115 -31 176 2
4204BK17l58M2K3j33L84o2j96K5J32k86J15l0M42l54J5j87K56m5J2j61N4P7Q5
$$ 2 219 -139 -97 -74 -207 177 115 -81 -56 76 -210 -95 -125 317 -37 -22 -209 47 2 14 -147 -93 -16 69
4228F9j0Q7p4J58o2J08k23jK57l06qq8K3J51O4O1n29N19l44J42J84k90J46n0k06
$$ 69 59 146 72 230 168 276 53 52 309 3 -5 -93 -70 81 145 206 -323 196 -148 -6 178 -112 34 -16 -222
4253b22R4j68K25N9j20L64j32j26J00p4J76p6n7J04j47k2J91N6j66j96K77j7j23
$$ -222 -128 -296 -71 -12 -132 232 100 -26 74 0 176 100 43 147 0 -22 169 225 59 -137 140 123 0
4276@J00l79K11k2k3O7J62k89Q8j52N3J36J16k8j89L13j28j32J20l0j17P4J02
$$ 0 100 -279 -68 -90 -113 -46 116 -173 -85 -237 -184 -48 68 40 -149 164 36 -96 24 -6 -123 -49 53
4299E3J44j78L18j92j2K5m9R6j5l53J43k1n7J73j94M36n43L3j23L34P0r3j10K28
$$ 53 197 19 337 145 133 158 109 205 190 -163 -20 -41 -98 75 -119 317 -226 -193 -316 18 88 -5 -115 113
4323A13O9j92q7J18j45J53q1K5Q7k95M60j28j0K0j03j36J39L4k99L22m0K1j77
$$ 113 182 -10 -97 21 -124 29 -52 -27 60 -235 225 97 87 107 4 -132 7 41 -258 64 24 45 -132
4346a32RL2O0J00l13K85l58L30J68l24j48N54K3k94P6j91K19J42m6q7j54o6P3
$$ -132 -123 -91 -31 69 -244 41 -317 13 181 -143 -291 263 286 -8 68 -123 96 238 192 105 -49 -115 -42
4369d2q6L22j95k4J48j54K32m89L28K40m25J87k2q1j59L91n0o5k46K08p9k98L54
$$ -42 -128 194 -1 -25 123 -31 201 -288 40 280 -145 42 20 -61 -220 171 121 56 -190 18 -61 -359 -5
4392eL0jJ02l02K28P4k03O2q4J35J17k23O7p0J66K01m4l75R8k39K90k60K9N5N5
$$ -5 25 24 126 -176 52 126 -77 -15 -99 36 153 -70 -3 -73 93 294 250 -125 -27 -266 24 -236 -207 -152 -97
4417i7R8o0j13J52j4lq5L4J29k36K41J23m9j45J64j46R8Jj98P8j12K10M3jk7j25
$$ -97 1 -59 -172 -20 -34 -37 -122 -88 41 -195 46 169 120 -25 139 -7 91 92 -106 -28 -140 70 113 112 85 -40
4443d0j08J22J05m1j76J68n3k6j95L38p0O5n6J09j90J48J75r1k05J87m41M66k64
$$ -40 -148 -26 79 38 -138 30 -23 -49 -244 94 24 89 33 142 -48 100 275 184 -21 166 -275 191 -73
4466g3M5J48R7k7l79K47lM9j3j19l8M4j61L30j36k63K68j08K8K84l04J15M2j56
$$ -73 -28 120 217 190 -189 58 55 104 91 -28 -66 -22 -183 147 11 -252 16 -92 -64 220 -84 31 73 -83
4490h3O4J75Lj59r4K42K94m11J5j57R8j98K60j82K00k78K13j69K56K6m12K12J36
$$ -83 -19 156 159 0 -94 148 442 31 46 -111 -13 -211 49 -133 67 -211 2 -167 89 115 -297 -85 51
4513E1K2j78j60J43J62k7l9J72l97J69Q8j71M14l34L27k95r9J08%j01K02M7q8
$$ 51 73 -105 -265 -122 40 13 -26 146 -251 -82 6 -165 249 -85 242 -53 -152 -44 -44 -145 57 104 16
4536A6J08Qr0l8q5J7j04K96R3p8k81m0K99l7k5q7M4LK8J48j86n9L65k54J72k53
$$ 16 124 132 42 4 -81 -64 -168 128 221 143 -138 -178 121 84 59 -28 16 19 47 195 9 -50 315 61 233 -20
4562b0r9N4J95K8J7j61J24j07j37J6K19n1m2m7j69J71m3l8J84q5j98M08k84j10
$$ -20 -119 -65 130 158 175 14 138 31 -106 -90 129 78 36 -11 -180 -9 -52 -90 94 9 -189 219 -65 -175
4586a75K48k08J32k10O3J59j49pK86l7j0o9j46J84j46QJ51K2l12O2nJ37L0j66
$$ -175 73 -135 -3 -213 -150 9 -140 -147 139 102 92 23 -123 61 -85 -77 74 96 -216 -154 -159 -22 8 -158
4610a58J66k20J01N4q7o3K52Q0J97r4k27J17pm3O8P1j46Q1j62n5L7J11q8o9L95
$$ -158 8 -212 -111 -57 -144 -207 45 125 322 228 1 118 111 68 136 207 61 142 -20 -75 -38 73 -15 -84 311
4635C11l44j77J21k22L39j98J24J45J2k60J18j92M1J64J19J9j15K06k58j1J4Q1
$$ 311 -33 -210 -89 -311 28 -170 -46 99 111 -149 -31 -223 -182 -18 101 120 5 211 -47 -58 -44 37
4657C7p2k4q0M73l81j28K12K74j28r1j07j50J56j0j14k3K7K18j65k9j20K92j18
$$ 37 -35 -59 -139 334 -47 -175 37 311 183 92 -15 -165 -9 -19 -133 -156 -129 89 -76 -105 -225 67 -51
4680e1J49O5j78j20R6Q4R2j50J25l68K93J55j73R1O8k18k4K93l35L22j69p1K19
$$ -51 98 163 -15 -135 -39 45 137 -13 112 -256 37 192 19 110 178 -40 -64 229 -106 216 47 -24 195
4703A95l44n9K34j75J73n04O56k28K22k47J73j18J7j38J46O3K60m59J12J41mN2
$$ 195 -149 -208 26 -149 24 -480 176 -52 170 -77 96 -22 -5 -143 3 66 326 -133 -21 120 116 168
4725A68J24l32NK43j60P7k7j44J23k39Q3R3n8J79l82L23p6r4m9L1K46K85l25k43
$$ 168 292 -40 -35 208 48 125 98 -46 77 -162 -79 14 -44 135 -247 76 0 -94 -143 -112 134 419 94 -149
4749a49J94j62M0K35J8j46K24k03p1O2k72J07J95m9j79K15j04o9J42j38J51k82
$$ -149 45 -117 -77 158 176 30 254 51 -20 42 -230 -123 72 23 -156 59 -45 -114 28 -110 41 -241
4771b41K13lm5K53j13l7l5j3j74J68J31K19j33l32K92J54l79L51j98J35k52P1
$$ -241 -28 -31 -76 177 64 27 -8 -21 -195 -27 104 323 190 -142 150 304 -75 276 78 213 -39 32
4793C2K79j67m03J61J24k60K41J78k69L46l21L19k39j75K13j78O0l3N1J08J74
$$ 32 311 144 -259 -98 26 -234 7 185 -84 262 -59 260 21 -154 59 -119 -59 -92 -41 67 241
4814B41k20Jj94K03J09NK6j05k1r7L81m26J40j50K79j65k61J71J66n9k56o2K51
$$ 241 21 22 -172 31 140 145 171 66 45 -52 329 -97 43 -107 172 7 -254 -83 83 24 -232 -294 -43
4837d3O6r5j6J74j71m3M3J54l39J67R9p0j25J50nP6R2N4q5k70L60j57o4J37q5
$$ -43 23 -72 -88 86 -85 -128 -85 69 -270 -103 -4 -74 -199 -49 -54 22 114 168 83 -187 173 16 -48 89 4
4862DP6J27j18R1l02J6Q3K8j10J74m2m4R6k36J36l2M2Q9n7l8J16r3J25Q3j93k53
$$ 4 80 207 89 180 -122 -106 -23 5 -105 69 27 -17 79 -157 -21 -53 -11 78 21 -17 99 6 131 214 21 -232
4888b32J18J66l9k07L22j81M5Q6K3j7n9k27K22l19J70J89j21j53r4K26K48l15
$$ -232 -114 52 13 -194 128 -53 -8 78 101 84 25 -202 20 -299 -129 60 -61 -214 -308 -82 166 -149
4910a49K4K23j33J24O4Q8j57L7L0j81j08K10J08k60q0j07L5K28J75k39P0n3k2
$$ -149 -125 98 -35 89 153 241 84 121 151 -30 -138 72 180 -80 -160 -267 -232 -4 171 -68 2 -51 -73
4933g3J05j41M3j21Q3o5J95k08K91j26J82k34j55L01J40m46K01J47k22J61k78
$$ -73 32 -109 -66 -187 -104 -169 26 -182 109 -17 165 -69 -224 77 217 -229 -28 119 -103 58 -220
4954b20M70K5k54l2j78L2j46J97K85o2j13R1n1k0J05o1n3L6k8P0P2j35J77m93
$$ -220 250 275 21 -11 -189 -157 -303 -106 179 117 4 95 44 24 129 68 15 51 23 93 165 30 207 -286
4978b86K50J34j62Q3R4r1j63L48K7l17j19L52j47k0J19k03j94K27j80J50K20j79
$$ -286 -36 98 -64 19 113 22 -141 207 234 -83 -202 150 3 -17 102 -101 -295 -68 -248 -98 122 -57
5000e7J63k71J75k1JJ91j26m3l9j37K60J76m33L31j62M6j20O4J16j24J09k02j22
$$ -57 106 -165 10 -11 -10 181 55 12 -27 -164 96 272 -161 170 8 54 -66 -2 114 -10 99 -103 -225
5023b25M8l7K63j1O5J0k43L75l26k7lJ30J57M7o1k23N4l78K04J41k2J71L6k17
$$ -225 -177 -214 49 38 103 113 -130 245 -81 -108 -111 19 176 223 162 -61 -7 -385 -181 -40 -62 109 145 -72
5047g2K12k52J96k55L6J65m5j71R4J7J1J57p4r5K7J30j63J36q1R6L8k73J03R0
$$ -72 140 -112 84 -171 -135 30 -15 -186 -92 -75 -64 93 19 -76 -49 81 -82 54 -27 69 107 -166 -63 27
5071B7J51k27j45K89j21j27J99n6q9K65k18L5k76L64k12K45k30L7L4J22l29K34
$$ 27 178 -49 -194 95 -26 -153 46 -10 -99 166 -52 -17 -293 71 -141 104 -126 -89 -55 67 -262 -28
5093b8j25J74n5L6L8n4R2j21J64L7o9j70J08j80N4oK6lJ72k4k06J13PO3k7K6j04
$$ -28 -153 21 -34 2 40 -14 78 -43 121 158 89 -81 27 -153 -99 -105 -79 -82 90 66 -140 -27 -20 43 16 42 -62
5120f2J54P8n1n6J74j35j19J89l20L6K4J00j22r5J75J98j89k1Q3O4m5k7JJ25q1
$$ -62 92 170 119 63 237 102 -17 172 -148 -112 -88 12 -110 -205 -30 168 -21 -42 41 105 60 33 34 159 78
5145G8ll8Oq9J0K40j99n0M9q3M9K1M4n0J4j14J48J3K08j54j31k13L38j81K01L7
$$ 78 75 37 43 -46 -36 204 5 -45 4 -79 -30 -9 35 -15 -1 -115 33 46 254 100 -31 -244 94 -87 114 151
5171A51k57K97k31J82Jj10kJ15l6j40l0k12L54r8j63J07K08K4j44J7j09J31L5
$$ 151 -106 191 -40 142 143 33 31 146 110 -30 -60 -272 82 -16 -179 -72 136 160 16 33 -76 55 90
5194I0l60R5L9K13j48K63J3k17K39l85J46J59j35j04J44L7J28j9k02jN7l25L57
$$ 90 -270 -175 -136 77 -71 192 205 -12 227 -158 -12 147 12 -92 52 89 217 198 -4 -5 52 -273 84
5217H4J13k68j58L07Mj65r5O0J96j40j0j23K91l32K72j48j9K42j56M5K84m46M14
$$ 84 197 -71 -229 78 82 -83 -178 -118 78 -62 -72 -195 96 -236 36 -112 -131 111 -45 0 284 -162 252
5240B52j15j81J46k28P0N4O8q4K2Lj38P6l4o4R9K77k11J5p9J68l92L28q6O1J33
$$ 252 137 -44 102 -126 -56 -2 66 -18 4 7 -131 -55 -89 -153 -54 223 12 27 -52 116 -276 52 -34 27 160
5265A60J01k67L3O7K3Q6l63K60j76N2L3nM2l1p8J29mJ74m65J49L11k86rR3J92
$$ 160 261 -6 27 94 117 203 -160 100 -76 -24 9 4 46 15 -63 66 62 236 -229 -80 231 -55 -64 29 221
5290B21m12K22j82Q9j8J78J5l33L17k12J68p8L0r7K92j85o9J79R5n8q3P9j24k66
$$ 221 -191 31 -151 -62 -80 98 113 -220 97 -115 53 -25 5 -92 200 15 -54 125 220 162 79 158 34 -232
5314b32K97r5J38l6m4Rk79J43ko8J36K67r3j75J54l44R1K45J51j18k59J53j16
$$ -232 65 -30 108 72 28 37 -242 -99 -101 -169 -33 234 141 -34 120 -224 -133 112 263 145 -114 39 -77
5337g7J81j54J50o6j33j78L45J34k51P5m7L5q4J04k5j64K10k32J37J89j69J60
$$ -77 104 -50 100 34 -99 -277 68 202 -49 26 -21 14 -70 34 9 -155 55 -177 -40 149 -20 140
5359A40m1j5j14M6l2j01J67q2J03m4n8O0J50N4k83m0J88L8p5k03M28m20J71o0
$$ 140 99 84 -30 16 -16 -117 50 -32 71 27 -31 29 179 233 -50 -90 98 136 61 -142 286 -134 37 -23
5383b3j40K19j26p6R4J74k53Mj61L45k6N2m7nL4j51J92j8k04L09O1l94J81J22
$$ -23 -163 56 -70 -146 -52 122 -131 -127 -288 57 31 83 36 31 65 -86 106 88 -116 193 254 -140 41 163
5407A63l76K32o3J75L3p7m6m4l7J98j93mn6M1o1J75J13k50K48M2j42l0k7j78J03
$$ 163 -213 19 -44 131 164 87 41 -3 -40 158 -35 -39 -95 -54 -115 60 173 -77 171 213 71 41 14 -164 -61
5432f1K80k34j68M12l75K34K1l13P2J73L7k88L12P9q2j64Nj53PJ78k2J86N9j26
$$ -61 219 -15 -183 229 -146 88 109 -204 -132 41 78 -210 102 181 99 -65 -60 -213 -206 -28 -50 136 195 69
5456F9j03J0n5J66K06k56j5O5l94K03O2K25j86J20j78J22O7j47L62m66k02J03
$$ 69 -34 -24 -79 87 293 37 22 87 -307 -104 -42 183 -3 117 -61 61 128 -19 343 -123 -325 -222
5478b22K14JJ56j82Q4j69L34m55L38QQ5J4o2n2J15j28omj0m8L9N4l9Q0l78n9K67
$$ -222 -8 -7 149 -33 51 -118 216 -239 99 107 192 206 144 92 207 79 73 69 59 11 50 104 65 145 -233 -292 -25
5505b5J1j96J91j79K6L56k21j82K71Pn6j12J64K45k45K38j02k24j77O0J07j7O1
$$ -25 -14 -210 -19 -198 -172 184 -37 -219 52 59 3 -109 55 300 55 293 191 -33 -210 -150 -43 -60 1
5528AK4j21j20M20n7k90K30k19J93n2j76m6K21J30j24k26K63J28n4o1L5p6r1O0
$$ 1 25 -96 -216 204 147 -143 87 -132 61 9 -167 -213 8 138 14 -212 51 179 125 64 99 23 -68 -8
5552hJ29k55Q3J65j03k32K99j00L7K03m06K66mK7j05J6m0L8N2l8j56J52j36J81
$$ -8 121 -134 -51 114 11 -221 78 -22 15 218 -188 78 74 101 -4 12 -28 10 62 24 -132 20 -116 65
5576F5J50j97j19k31J88J46k34J38M12l58M8P9N9k40K23j47J04k53J25K52j83
$$ 65 215 18 -101 -332 -144 2 -232 -94 318 -40 8 87 146 -94 129 -18 86 -167 -42 210 27
5597B7M5m2l8j63K82Lo1J04l05J56K0l03M34K50n06K08J44k23P2j64j89K14K17
$$ 27 72 30 -8 -171 111 114 53 157 -148 8 28 -275 159 409 -97 111 255 32 104 -60 -249 -35 182
5620A82j77P2Rj45L47l13j16J09N6J27m9l62K06P5n4p1N7J43k84Q1q1J56O9O4
$$ 182 5 77 86 -59 288 -25 -141 -32 24 151 102 -260 -54 21 -33 -104 -47 96 -188 -107 -188 -32 37 101
5644A01j84P2Q9k92O2K25J00m7N5k5j63q7J20j80l4L20m00M18k29p3J69j52J13
$$ 101 -83 -11 78 -214 -152 73 173 126 181 156 -7 -94 26 -154 -188 132 -268 150 -79 -152 17 -135 -22
5667b2J33L3l08L57l07K46k65J21J10lp2p7K7M8l8j50M38l85r8J45j6j39J68J68
$$ -22 111 144 -164 193 -114 132 -133 -12 98 95 23 -54 -27 21 -17 -167 271 -114 -212 -67 -83 -222 -54 114
5691A14k75K41J9j75K11J7Jj65J15p0L4j30oO6n2j2o4p0K6L50j46j4j10K6J88
$$ 114 -161 80 99 -76 135 152 153 -12 103 33 67 -63 -69 -3 -55 -67 -131 -201 -175 175 29 15 -95 -69 119
5716A19l01K16j58P8k19J27K19j39o2K17l01L04O2j49K3q1J07l5k46K58k28q3
$$ 119 -182 34 -124 -46 -265 -138 81 -58 -120 97 -204 100 162 13 36 -45 62 27 -219 39 -189 -272
5738b72L33k26K69l00K37o2J34N6j60p4PJ9o3J56J05m7j53J65j79n4j07O7ok0
$$ -272 61 -165 104 -196 41 -21 113 169 9 -65 -58 -39 -102 54 159 112 -41 124 -55 -109 -216 -149 -155 -175
5762a75M28l79Q5J03j13J26k20J6J57n1r2K06k26K04n9K34l20J62l81J3L80j17
$$ -175 253 -126 -41 62 -51 75 -145 -129 28 -23 -115 91 -135 69 10 244 -76 86 -295 -282 98 -19
5784a9j76L21l78M11j22J08j71K04m8k97J30rr7R7K25j30n8k27M18k26R9j33r9
$$ -19 -195 126 -252 159 37 145 -26 178 130 -167 -37 -46 -143 -46 179 49 -9 -236 182 -44 55 -78 -177
5807a77J08J4J72j43m4J16l1j0O1j47p4J94j22J51J5p1k40M48Qk50M0j51J51p1
$$ -177 -69 -55 117 -26 -70 46 15 5 66 -81 -155 39 -83 68 83 12 -228 220 228 -22 18 -133 18 -53
5831e3J29j45j0K15k56j15K59j83K20l83L32K98k97N8k50J64j43J99J91o4j29
$$ -53 76 -69 -79 136 -120 -235 24 -159 61 -322 10 308 11 69 -181 -17 -160 39 230 166 37
5852C7rr4J09j23j17n9K50N2n1j70R3K84k44j14M17l38N3K17l47L28j15n2jp2
$$ 37 28 -66 43 -80 -197 -256 -6 46 -5 -175 -82 202 -42 -156 261 -77 -24 193 -154 174 59 7 6 -66
5876f6j11K77L3j36l9k1J03k47K04k0J44L5j39j3q4J13l4J96k16q2K19l28K99
$$ -66 -177 100 133 -3 -42 -63 40 -207 -3 -23 121 156 17 4 -80 33 -1 195 -21 -103 116 -212 87
5899H7m9j41L88m23J12R5j66K03Q3k58l57N29k69J94j80K51j76P2j8j07J01Lj9
$$ 87 38 -103 285 -138 -26 69 -97 106 189 -69 -426 103 -166 28 -152 99 -77 -5 -23 -130 -29 -26 -45
5922d5q7L87l43L4J95l55L0J04K60k77K9M9K82N7l62n0p9O5J06q1M7L7J73m8k41
$$ -45 -132 255 -88 -54 141 -214 -184 -80 180 -97 -68 -19 263 320 -42 -92 -171 -106 0 -81 -34 3 176 128 -113
5947a13K33j98J71l74L12N1k1k63K28N0j52qk0j55R9K57j97J80l79M18k73J80
$$ -113 120 -78 93 -281 31 82 61 -202 26 76 -76 -84 -104 -259 -160 97 -100 80 -299 119 -154 26
5969B6o1K03k1j29L5J93j90p8j9j03K51j19o4J17o3Q7P2q2j94K82j58R1k09k0
$$ 26 -35 168 147 18 53 246 56 -22 -41 -144 107 -12 -76 41 -22 65 137 55 -139 143 -15 76 -133 -153
5993a53N7J9J57j3j57O7J35j10N2q4q9K3n7J43J45N1L10n61K9L48j77j39j6j0
$$ -153 -96 -77 80 67 -90 -23 112 2 54 -30 -119 -96 -153 -10 135 186 496 -65 -36 312 135 -4 -20 -30
6017c0j0L6J64J3j07O9p2k33P4j9K10j47j74J48J25J95l12q8J06j2j74N6M61j66
$$ -30 -40 -4 160 173 66 135 63 -170 -96 -115 95 -52 -226 -78 47 242 -70 -158 -52 -64 -238 -182 279 113
6041A13j56L6R3n3P3O3k83J50j2J56k69N6k4L7L6M2j50P1M2Q6J4j70J44N0o4P8
$$ 113 -43 -7 86 33 106 169 -114 36 24 180 -89 -33 -57 -20 16 58 -92 -21 21 107 121 -49 95 145 81 159
6067A59j76j14L72j26m1m8Rl19K64pM9Q9J73l90K2L63j94k99K34j07J52J55m5
$$ 159 -17 -131 241 115 74 26 35 -284 -20 -27 22 111 284 -106 -84 279 85 -214 20 -87 65 220 175
6090A75j06Rj31J35J48m11J15N3OnJ63j06Pp7K73j36J0k15K48m56L18p5J24j71
$$ 175 69 78 -53 82 230 -181 -66 -13 -7 -12 151 45 52 -25 248 112 122 -93 155 -301 17 -58 66 -105
6114a05J56m2J88k2j92J30j12l1R9m60L44p5j2O3Kj10K57N6k69J62qk23J51J78
$$ -105 51 9 197 175 -17 113 1 -30 69 -391 -47 -122 -134 -71 -69 -179 78 134 -135 27 19 -204 -53 125
6138A25p5j55J39NL7l91L63o5Q7m4j00M9Q2j03K56Pk40J32k03p6J99O2j54K51
$$ 125 50 -105 34 39 76 -315 48 -17 70 26 -74 -25 57 -46 210 217 -23 109 -94 -170 29 91 -63 188
6162A88j18p0j96J82k1m6L53m05J10N1j61Q2K81j98J43j45K0Nk07P2l0K13J62
$$ 188 70 0 -196 -14 -35 -81 272 -133 -23 28 -133 -51 230 32 175 30 50 55 -152 -80 -110 103 265
6185B65j37j1j18j01J38O0k54K7M3K10k11R3M0J74k12J62l6n9J78k22o1K5M1k50
$$ 265 128 117 -1 -102 36 96 -158 -131 -88 122 -89 4 44 218 6 168 132 73 251 29 -32 -7 34 -216
6209b16M37k56K56j64P6j83J07k04J51J08k86O3J97J93l74J4J90r7Q0R5k59J76
$$ -216 221 -35 221 57 133 -50 57 -147 4 112 -174 -111 86 279 -95 -81 109 12 92 187 -72 104
6231A04P5j08K5o1k77K2J98J80q8N9j76NkN8J9j50q2L46J03l93K73j06k86K34
$$ 104 179 71 96 35 -242 -220 -22 158 70 129 -47 -42 -44 14 33 -117 -199 147 250 -143 130 24 -262 -28
6255b8j36J82J00j86J45l2j08J91o3n3j71J25O3r1K9Q1L7j43J13M3l17K95j8K2
$$ -28 -164 18 118 -68 77 45 -63 128 65 12 -159 -34 29 -62 -33 48 85 -58 55 98 -219 76 58 80
6279H0o8k73N63l47j72J28N4J73j43O0J14j10j65j78J6K07mJ96l20Q0m2P0J0j22
$$ 80 12 -261 302 -45 -217 -89 -35 138 -5 55 169 59 -106 -284 -268 -61 -65 131 -189 -109 -151 -81 -71 -193
6303a93L69q5k27K04j8j02N7pJ83j4k74M11l31j58K28o4K60k31q4q0K74m8J5o5
$$ -193 176 91 -136 68 50 -52 5 -2 181 167 -107 304 -27 -185 43 -21 239 8 -76 -156 118 70 85 20
6327B0j63L68k49K15l09L71j45l6k2Mj29L4J65j42J15k14L00R6r2j30p0l6k32
$$ 20 -143 225 -24 191 -118 253 108 72 50 54 -75 -41 124 -18 97 -117 183 279 187 57 -13 -49 -281
6350b81j1K43l8Qj08J65n7K10J6p1J1l0k4k9k1J3L6j36K26J07k90J2J50m22M29
$$ -281 -292 -49 -87 -79 -187 -22 -79 131 147 76 87 57 33 4 -17 -4 32 -104 122 229 -61 -49 101 -321 108
6375A08j00M7nj25J44R6j90p7K28j58Q4Nk6j68R5K67j26l00J21J82N6j47j32P2
$$ 108 8 55 50 -75 69 165 -25 -102 126 -32 52 57 31 -137 -42 225 99 -201 -80 102 158 11 -121 -49
6399d9N6m0M6J57l00K50R8l61L41j71q1m1L9p0N1L2J68l53N9J15q7L62l49M9%
$$ -49 7 -33 13 170 -130 120 218 -143 198 27 -54 -95 -56 -126 -75 -43 125 -228 -169 -54 -141 221 -128 -79 -79
6424g9m7j81J86J11p0K03R7j32ML6j83J22j21j81J67K01k40j43L99p7j26K11n9
$$ -79 -126 -307 -121 -10 -80 123 220 88 92 128 -55 67 -54 -235 -68 133 -107 -250 149 72 -54 157 98
6447I8k50K98m71K62j44J20K57l58J33J80J23k68j77K76k28M06j55k11N9j11K80
$$ 98 -152 146 -325 -63 -207 -87 170 -188 -55 125 248 -20 -197 79 -149 257 102 -109 -50 -161 119
6468A19j26l3Q0k96J45r7l6L27k0p1J98k5j00r5j02k5R0L2Rkj08K36j91J55j71
$$ 119 -7 -40 40 -256 -111 -208 -244 83 63 -8 190 165 65 -30 -132 -157 -67 -35 -26 -28 -136 100 -91 64 -107
6493a07j46K10J25M7r6k9J54j13m2Qo6K28k32J39K49l57J44k28J21l01L56n0j07
$$ -107 -253 -43 82 129 33 4 158 45 3 11 -55 173 -59 80 329 -28 116 -112 9 -292 64 14 -93
6516i3J80j97J24J37j57q0M8JR4q9M6j40L2J22M7q6J18m2r7J68l03K59M0l45J8
$$ -93 87 -110 14 151 -6 -86 -38 -37 57 -32 14 -126 -94 28 75 -11 107 65 -32 136 -167 92 132 -213 -195
6541a95K19k38K20O0j7P9j63J40j25o5J38k36K54q2rl3n0P2J78j27j92L8K11k20
$$ -195 24 -214 6 66 49 128 -35 105 -20 -85 53 -183 71 -11 -20 -53 -103 -31 147 20 -172 -134 77 -143
6565a43K02k59L72q0M8P2l07J59K0L5k73K88k84K10j26J16p4K04j50NOj3QO6j26
$$ -143 59 -200 172 92 140 212 -95 64 84 119 -154 134 -150 60 -66 50 -24 180 30 35 41 28 36 102 -24
6590b4N2p7r7K18j13K07j73q8L03K3r4k12L98l29R9k20L2J53J03l47K7J59K5m5
$$ -24 28 -49 -146 72 -41 166 -7 -95 208 231 137 -75 323 -6 93 -127 -95 58 161 -186 -159 0 25 -20
6614b0j91J64k82K53J30P1qn0j86K20J37l31r0J26J14P1j72j94J79M8J71j85J38
$$ -20 -211 -47 -329 -76 54 125 117 67 -119 101 238 -93 -183 -57 57 128 -44 -238 -59 -11 160 -25 113
6637A13j93K24j66J62j70q0K86r6k14J7K04l9J16k40J12k31l3K90L09m34J19K50
$$ 113 -80 144 -22 140 -30 -110 176 80 -134 -117 87 48 164 -76 36 -195 -228 62 371 -63 56 306
6659C06l75J78k46J18K03l6q3J28j89j28J09%J60o8o6K05j89m7o3J26J43k64j69
$$ 306 -69 109 -137 -19 184 148 65 193 4 -124 -15 -15 145 77 11 216 27 -20 -83 43 186 -78 -247
6682b47N42m18L21j47k07Q8r2L61p4j17JJ16k38J98o1J9k55L90l01l1K39l42O8
$$ -247 295 -123 198 51 -156 -68 -160 201 127 10 11 127 -111 87 26 45 -210 180 -121 -152 87 -255 -187
6705a87K74p4Q2k7o7j77K2J03P6p8J16j00o5j25N13k97L1k3Q7q3l6M6l8Q7P7M8
$$ -187 87 13 95 68 1 -176 -154 -51 25 -53 63 -37 -102 -227 286 -11 20 -3 84 1 -35 11 -27 60 137 185
6731A85l49J39o9Q0j46J5p2L01q3K65n25K70rr9j85L79j6k6p2L07l08j07N3j94
$$ 185 -164 -25 -94 -14 -160 -145 -217 84 1 266 -259 11 2 -97 -282 97 81 55 -17 290 -18 -125 -72 -266
6755b66J64L11k35j10N9O7j45K88R8l81M04m28K07l08L43j86K23l05K09P8j12
$$ -266 -102 209 -26 -136 -77 -10 -155 133 231 -150 254 -174 33 -275 68 -118 105 -200 9 87 -25
6776b5K77l08J15J27k69Nj04J14r8L38k45M07l71O4k3j65L21k48J1M3k47L36k9
$$ -25 252 -56 59 186 -83 -78 -182 -68 -166 172 -73 334 -37 27 4 -161 160 -88 -77 -34 -281 55 26
6799B6k11L83k35J5K7j44J92j05r0P8n3L13l45P4j7O2P0K70j06n53M72j07J38
$$ 26 -185 198 -37 -22 5 -139 53 -52 -142 -64 -117 196 -149 -75 -92 -30 40 310 204 -349 123 16 154
6822A54j91J26j00r9K12o2k28J57j17k1l2K39K3r9l6J95k5K1R7k60j02N0K89k21
$$ 154 -37 89 -11 -110 102 40 -188 -31 -148 -169 -201 38 61 -38 -74 121 96 117 214 -46 -148 -98 191 -30
6846c0J35q6J73k19M3J0L7J0n4j27J83LL4r9J47r6p4k2J96k32j87R1K32l8l08
$$ -30 105 19 192 -27 16 26 63 73 19 -108 75 78 112 13 160 64 -10 -32 164 -68 -255 -164 68 30 -278
6871b78L00mL9j67Q7j86K39j1K36m41J53j84J72j63k7L24k37K54n9o4o4N4J8m2
$$ -278 22 18 57 -110 -23 -209 30 19 255 -186 -33 -217 -45 -208 -235 89 -148 106 47 -17 -81 -27 -9 -51
6895e1J3o3K31k24K41k11P6k10L08M8m46L75r9O1o0K3r2K71l38K39j61q7J45K54
$$ -51 -38 -101 130 -94 147 -64 12 -198 110 158 -288 87 -12 49 -11 12 -80 191 -147 92 -69 -156 -11 243
6919B43k01M9j04j06J18OR6m8J73k00j34pJ36j59J90k43J01K46j49J14O1j81j57
$$ 243 42 91 -13 -119 -1 5 101 53 226 26 -108 -115 21 -138 52 -191 -90 156 7 121 182 1 -156
6942a56J09J21j7k71R3L22l87Q2O7k5J09j63L05l39K31k36J08J86j81J44l9k33
$$ -156 -47 74 57 -214 -121 201 -186 -104 -37 -62 47 -116 189 -150 81 -155 -47 139 -42 102 63 -170
6964a70J37l2k7J73j59p5K25k29K85k30K62k9j92r0Q5j64K51k93R3L59k49j67
$$ -170 -33 -65 -92 81 -78 -153 72 -157 128 -102 160 131 -61 -151 -66 -230 21 -272 -179 180 -69 -236
6986b36O8K01n4J01k14O9J1p5K51k14N9l5L55l53K44r7j95K74J42k53J8N4l54
$$ -236 -168 33 -21 80 -134 -65 -54 -129 122 -92 -33 -68 287 -66 178 81 -114 160 302 49 67 121 -233
7009b33L34l8K10k79LK19ol18J98Kk27M9J47R5l24J3J99j80j7j3L85m40K74n5
$$ -233 101 63 273 -6 -3 216 210 -108 90 92 -135 -86 61 156 -168 -155 44 -136 -153 -166 219 -221 53 -2
7033bM1j46J26k14p3M80Op4k88J20m3J22j36k7J44n9J9J17j67j9J6nK72j37k10
$$ -2 39 -107 19 -195 -268 212 218 144 -144 -24 -67 55 -81 -108 36 -23 -4 113 -54 -73 -57 -62 210 73 -137
7058a37P8l1m0k3N0n9J36N1j46M2j12Q3R2K3j47P8n0j59L60j84R1J77l76J55J31
$$ -137 -59 -90 -130 -153 -103 -162 -26 25 -121 -79 -191 -108 -16 7 -140 -62 -112 -271 89 -95 -4 173 -203 -48 83
7083H3j59j79QM07k02j13R2N5On2k03J63kK27j37J40j07m7Q2M3j73J17k18l1n3
$$ 83 -76 -255 -247 160 -42 -155 -63 -8 -2 -54 -257 -94 -96 131 -6 134 27 -20 62 105 -68 49 -169 -200 -253
7108b53K28l1J67j97J50J83m55L43K5k52J30M5Q4L0j76O3l17J98j59J81l53K63
$$ -253 -25 -56 111 -86 64 247 -208 135 160 -92 38 83 167 197 21 84 -233 -35 -194 -13 -366 -103
7130a03L21j00j08J5j59J82j15P0R8o5M6j98j07m2L11j6k08J06J2P4P6k3k32K70
$$ -103 218 118 10 25 -134 48 -67 3 101 36 82 -116 -223 -265 46 30 -178 -72 -60 14 90 67 -165 105
7154A05J7k77OJ5J04p4O3oO6k3J59j93M0J89j39r4K18l91M27j03J7j1Mj97n7Q3
$$ 105 122 -155 -149 -134 -30 -104 -41 -47 19 -4 155 -38 2 191 52 -42 176 -215 212 109 126 115 119 -78 -135 -52
7180e2J09k02q4K31k00K57jJ05m4k76L78j22n3j38k32M25PJ67M9n47J57J59k48
$$ -52 57 -145 -229 2 -198 59 58 163 119 -157 221 99 46 -92 -324 101 108 275 324 -223 -66 93 -155
7203a55L19j03l35L22J05k37m9m3K04J25k5m81J54J84j92L74j74Kp4K88L4m27
$$ -155 164 61 -274 48 153 -84 -133 -176 28 153 128 -353 -199 -15 -207 167 -7 -5 -79 209 243 -184
7225a84L5K35K3o1j26J50j60K67k29J4K69k88j1j22J89j20Rn7K15m3K0j86J45
$$ -184 -149 86 109 48 -78 72 -88 179 -50 -36 233 -55 -66 -188 1 -119 -110 -167 48 5 25 -161 -16
7248a6n3P4N9K3k27J17O9j54J96j08j84K14L22k37k57K61j92o8M11k24O4r4N5
$$ -16 -69 5 64 87 -140 -23 46 -108 88 -20 -204 10 332 95 -162 99 -93 -161 250 26 90 -4 51
7271E1j30j2K89O1m8l09J51k9l72L25j08J44J09J04k71rL64m77L65l57Q0q1K69
$$ 51 -79 -91 198 259 211 -98 53 24 -348 -23 -131 13 122 226 -45 -54 310 -167 198 -159 -79 -160 109
7294A09j30q8j01M55k18j26K26j28j42K86r8k32n3K57K4j68K57N3l01J7K09l00
$$ 109 -21 -109 -210 245 27 -99 127 -1 -143 143 45 -187 -240 17 41 -127 130 183 -118 -101 108 -192
7316a92K81j45p8J75R5L9L4l88J06j4pJ43p4kK9Q3K4j01O0J29k48J25k7P2l1j43
$$ -192 89 -56 -134 41 136 175 209 -179 -73 -87 -94 49 -25 -27 2 85 109 8 68 197 -51 74 47 119 88 -55
7342e5k18JL03J75j29O6k53P3j12J56R2r7k1o4J95k87j0R7l2R4j98J45K91l71
$$ -55 -273 -272 31 206 77 143 -110 -37 -149 7 99 2 -19 -83 112 -175 -185 -88 -120 -26 -224 -79 212 -159
7366a59K03k9M3R6j20Q1j36j82K00m0lN6r1K44j20K21k54j0J0j30J77l3J49k98
$$ -159 44 15 58 154 34 115 -21 -203 -3 -43 -46 10 -81 163 43 264 10 0 10 -120 57 24 173 -125
7390a25K20k92J60J02j66K93j23m6J35r9R2j37r3j20L30P1j28j6j38P1O2K1Mq0
$$ -125 95 -197 -37 65 -101 192 69 23 158 59 151 14 -79 -199 131 202 74 58 -80 -9 53 74 78 -2
7414bk0l1j93L11J41r3j35K75k06o9m3K09k1N4k87k7J80J4K10m45K6J71J41l02
$$ -2 -22 -53 -246 65 206 113 -22 253 47 -22 -65 144 123 177 -110 -137 43 57 267 -178 -152 19 160 -142
7438a42j15K91K37M1p5l01O1O1j23j09K13R3k6q6Q1m5Q3m6k88K66k74J40P3m8
$$ -142 -257 34 271 312 237 -64 -3 58 -65 -174 39 132 106 20 101 56 139 93 -195 71 -203 -63 10 -38
7462c8K62k72n0J31j01J6o7ML14j80N2j12J31l03k4M66j63j64K14j98J98j43j73
$$ -38 224 -48 -98 33 -68 -52 -119 -115 199 19 71 -41 90 -213 -237 229 66 -98 116 -82 116 -27 -200
7485b00L61j37j48L00j29j34k4N1R1j7p7J58k85Q2N7K85l14J7J04J69j14L4l16
$$ -200 161 24 -124 176 47 -87 -111 -60 31 14 -63 95 -190 -108 -51 234 -80 -63 41 210 96 130 -186
7508a86K03n9j09L68m41K70n1j7j05O9j33J42K54k73j24P2P8J21n7J13j46N6j06
$$ -186 17 -42 -151 217 -224 46 -5 -22 -127 -58 -191 -49 205 -68 -192 -120 -42 79 22 135 -11 45 -61
7531f1L8J28k39J58N1N4k95J68j58J30o4l0J8Q2q7K23j41N6J77j20j57J25J63
$$ -61 -23 105 -134 24 75 129 -166 2 -156 -26 -90 -120 -102 -20 -107 116 -25 31 208 88 -69 56 219
7554B19j79J93J06m33J50r3K0%j99L03j65r0J90k1Q0r3J71j67R1R4k03l9J6M8
$$ 219 40 233 339 -94 56 -37 -17 -17 -216 87 -78 -168 22 1 81 -12 159 -8 83 177 -26 -65 -49 -1
7578al4k36L85k43o1L03J20M2k68J6m7L57k02k01Q9J34k19J56j00q2L4K73p6n5
$$ -1 -35 -271 114 -129 -190 113 233 275 7 23 -24 333 131 -70 19 153 -66 90 -10 -92 -58 215 139 84
7602H4j75J37L9m4J43j42n3K17k35j8P5mj02J18k30J53K29j39J29l64K31j2j37
$$ 84 -91 46 85 41 184 42 -11 206 -29 -47 28 24 -78 40 -190 -37 192 53 182 -182 49 37 -100
7625a00Q2j97K61m31K14J74k4K00l04K76n2r6p1L32l57QJ4J81k94L05r8n6j30
$$ -100 -18 -215 46 -385 -171 3 -21 179 -125 151 99 3 -68 264 -93 -85 -71 110 -184 121 23 -33 -163
7648a63J34R6j37j08J92k48J45ok12N72J3l05K10k9j08J14k03p4R4N9J41p5R8
$$ -163 -29 67 -70 -178 14 -234 -89 -95 -307 265 278 -27 183 154 46 160 -43 -117 -23 36 177 102 200
7671B00l85k8J82J37j83%o6L4j97L34j37J45m2r2m9J79p3J7Q1p0P7k39K50q7L7
$$ 200 -185 -213 -31 106 -77 -77 -143 -109 -306 28 -109 36 -6 -98 -147 32 -41 -24 57 -13 64 -175 75 -12 25
7696B5jq1J35r0K26l89Q3j31%L89k39j05J74J1J4k25L46Rj06k11L32j75J08j41
$$ 25 24 -57 78 -12 214 -175 -92 -223 -223 166 -73 -178 -4 7 21 -204 142 151 45 -166 166 -9 99 -42
7720d2K10l15m4J04R5k59K88l3Rk2Q9n4j36J58N8K8j19p9K59j07q4R0l2k05Q0
$$ -42 168 -147 -191 -87 8 -251 37 4 13 -9 80 26 -110 48 106 134 15 -64 195 88 4 94 62 -143 -63
7745f3j58O0J83q0N4K4o9P9j38R7L0nj66M4K4J25kJ27k48R3J27o3q3qo6K45N2
$$ -63 -221 -161 22 -58 -4 20 -49 30 -108 -11 19 14 -152 -108 -84 41 39 166 -82 11 138 75 -8 -16 -82 163 215
7772B15l39K38l20J88o2j66L86j11q2j07K15m6q9R6J96k28L7J5K7r2%p5L14l8
$$ 215 -124 114 -206 -18 -80 -246 140 29 -53 -160 55 9 -80 16 212 -16 21 36 63 -29 -29 -104 210 172
7796A72k62M4P6K34j58j35j77K91k89J74L06l72J2R1LL5N8j3j78K16j03J60j47
$$ 172 -90 -46 30 264 106 -29 -206 85 -204 -30 276 -96 -84 7 10 45 103 90 -88 128 25 185 38
7819C8M4j86R5M5j03N9J07j06K7J28r1m3Q9J44l90O9N5J37q0K03l72L4N4j17J33
$$ 38 82 -104 -9 36 -67 -8 99 -7 20 148 57 14 103 247 -143 -74 -19 118 38 241 -131 -97 -43 -160 -27
7844b7p0J12k73L60p7OpLj92L93o6j54j60k3K86p3P3j43j24q4L7J77J54j63Q0
$$ -27 -97 15 -258 102 25 31 24 27 -165 228 162 8 -152 -175 111 38 111 -32 -156 -240 -203 -26 128 -35 45
7869D5l7Q9J8j54k57K41P3j18mK02j72J22J21k50Q4J51m72K14K61k51O7J7l2J80
$$ 45 8 97 115 -39 -296 -55 18 -100 -104 98 -74 48 169 -81 3 154 -318 -104 157 -94 -27 -10 -42 138
7893A38k77J13k5kK22j23M4Qj40jJ5j57j8K00k42J70M01l21L1r6N7l2M3k35J10
$$ 138 -139 -26 -51 -53 169 46 90 98 -42 -43 -28 -185 -203 -3 -245 -75 326 5 36 -60 -3 -35 8 -227 -117
7918a17L6J12R8k42m3M8O3j35J62J11k37k8P8R4N2Lj04K1K6N6j07n3K15J07j18
$$ -117 -81 31 129 -113 -156 -108 -45 -180 -18 93 -144 -172 -94 0 52 55 -49 -28 -2 54 -53 -106 109 216 98
7943I8k00j55K35R3k23J10k7P6l00L00L7R9j18jk12J13K88k67J27OJ4J25j47j05
$$ 98 -102 -257 -22 71 -152 -42 -69 7 -293 7 44 143 25 24 -188 -75 213 -54 73 79 93 218 71 -34
7967c4j52L38k43R9oj40R7J23j00j00L34j63L9k92K43J02p5l60J29K42M4p3Nj01
$$ -34 -186 152 -91 8 2 -138 -41 82 -18 -118 216 53 92 -200 43 145 70 -290 -161 81 125 52 57 -44
7991d4J80j50j86K79k75K22k3n9j17N6j14P3J70j50J11N7Q7J80k63j47Q0JK42
$$ -44 136 -14 -200 79 -196 26 3 -56 -173 -117 -231 -158 12 -138 -27 30 117 297 34 -113 -33 -32 210
8014B10j73J23j8K7j29o6j99J91KJ21l04O7K20P7j60l12Q84n72O2j23m1K67m03
$$ 210 37 160 142 169 40 -26 -225 -34 -32 89 -215 -148 72 149 -11 -323 561 -11 51 -72 -113 154 -249
8037b49K32l1O4M4o9J85m8l20M2K99j49L08l75P1J00j04j28L02j07K41l86K9k9
$$ -249 -17 -48 16 60 -9 176 128 -192 -150 149 0 308 -67 4 104 0 -128 174 67 308 -78 -49 -78
8060g8J39k73Q5M27k11j70n9R9p2M6J03k1J05j31J96l09j71J71P9K3K61m16N6
$$ -78 61 -212 -127 300 89 -81 -140 -41 -113 -67 36 15 120 -11 185 -124 -295 -124 -45 -22 239 -177 -121
8083a21J56j33L56k95M2p1n1L8l1J37j72J48j33m9J23q4K32j18k02R6J49j05K01
$$ -121 35 -98 258 -37 5 -66 -117 -79 -110 27 -145 3 -130 -179 -56 -140 92 -26 -228 -132 17 -88 113
8106A13J6K2l19J61Lj18N5j41L6J29NO7k1R6J49k94R0L4p0J2n1r6n1P1j12J68
$$ 113 129 151 -168 -7 -4 -122 -67 -208 -172 -43 -38 29 8 104 253 -41 49 83 13 25 -26 -122 -173 -102 -214 -46
8132d6m8J56k29J25J77N2l13K36J41l22m7J31J23j78K04k44OK05k07o9l2K78K1
$$ -46 -94 62 -167 -42 135 187 -126 110 251 -71 -118 13 136 -42 162 -82 -76 129 -78 -147 -179 99 120
8155A20j25P4j93J39J95n5k71j57L33L4j0k63Q3J01P7j74K30k55J81l0K4J57p2
$$ 120 -5 69 -124 15 210 155 -116 -273 60 94 84 -179 -96 5 82 -92 138 -117 64 34 58 215 143
8178A43k4j3j91J99r4j23K13n0j11Q1P6k15N5
$$ 143 119 106 -85 114 20 -103 110 60 -51 30 106 -109 -54
8191e4
$$ Imaginary data points
##PAGE= N=2
##DATA TABLE= (X++(I..I)), XYDATA
0@%%%%%%%%%%%%%%%qJ6j6J6j6K4l2L2m0M8n5O3p2Q7r7J08j24J40j59J81k03K28
$$ 0 0 0 0 0 0 0 0 0 0 0 0 0 0 0 0 -8 8 -8 8 -8 16 -16 16 -24 24 -31 32 -40 47 -50 58 -66 74 -85 96 -107 121
37A21k56K85l18L53l91M34m79N29n84O45p11P82q62R49j046J155j275J407j558
$$ 121 -135 150 -168 185 -206 228 -251 278 -306 339 -372 410 -452 497 -549 606 -669 738 -820
56h20J734j936K171k450K789l212L749m455N439o899R277j3774K5030j00337j59768
$$ -820 914 -1022 1149 -1301 1488 -1724 2025 -2430 3009 -3890 5387 -8387 16643 -83694 -243462
71b43462L06662P0629j70158P4329Q3916j74547j229J71567o0589j27642Q3108
$$ -243462 63200 133829 -36329 38000 121916 -52631 -53860 117707 57118 -70524 12584
82A2584K8953q9332L4171P3779m9403k1145L5637k8503k1280M6415j9954n2911
$$ 12584 41537 -47795 -13624 60155 10752 -10393 25244 -3259 -24539 21876 1922 -50989
94e0989N4318L7106p9299r82R0085k3336n3182O8797J8704q8944J0283O8349l9227
$$ -50989 3329 40435 -38864 -39846 50239 26903 -26279 42518 61222 -27722 -17439 50910 11683
107A1683j9831N0445n4552o7884Q5857N5730o4480j6709Q274l5328M8502P0008
$$ 11683 -8148 42297 -12255 -80139 5718 61448 -3032 -19741 -11467 -46795 1707 71715
119G1715p4340n8453P6472K710p2181N4293N5075q4747k9093P3800j0194m2223
$$ 71715 -2625 -61078 15394 18104 -54077 216 55291 -29456 -58549 15251 5057 -37166
131c7166N8708K6863p8196q186Q2085m070o3560J7933L4661l5710k0543L1623
$$ -37166 21542 48405 -29791 -37977 44108 40038 -23522 -5589 29072 -6638 -27181 4442
143D442K130k1262J5407J5444j6936m649N198j936J6018J951l6877r498K0944
$$ 4442 6572 -14690 717 16161 -775 -5424 -226 -2162 13856 15807 -21070 -30568 -9624
156i624m010R896L1732l1884m3760N0334M6859m4334j8616L3855k0235l3668K7495
$$ -9624 -13634 -3738 27994 -3890 -47650 2684 49543 5209 -13407 20448 213 -33455 -5960
169e960J4481k2381O609R261k5177J430M0399P623k4635p545L54K87J4879M161
$$ -5960 8521 -13860 -7251 2010 -23167 -21737 18662 26285 1650 -5895 -5541 -5254 9625 13786
183A3786j9009k668J5756o123j3477K0744J6569k5243j0353K1019j0886k0095
$$ 13786 -5223 -7891 7865 1742 -11735 9009 25578 335 -10018 11001 115 -19980
195a9980K6649J6384l1912r391K3994m359n819K6599q07l3315K585K3163m75m276
$$ -19980 6669 23053 -8859 -18250 5744 1385 -4434 22165 21358 -11957 -9372 13791 13316 9040
209I040q13o546K185K109j0172L059J7729r903k4538L903R608m746R749R967k0611
$$ 9040 8227 1681 3866 5975 -4197 -1138 16591 6688 -17850 -13947 -4339 -9085 664 10631 -9980
224i980j3640K2029J4674j4745m581J4341p711k0259J1406J9490o003p271M891
$$ -9980 -23620 -1591 13083 -1662 -6243 8098 387 -19872 -8466 11024 5021 -2250 2641
237B641n115o166J3652R980j1144p467k453p853P047J2774o369n455M230p059
$$ 2641 -2474 -8640 5012 14992 3848 -3619 -6072 -13925 -6878 5896 -473 -5928 -1698 -8757
251h757j36J9812K250j8801J626J0615j3377n454K0411M770j4847k988M737L55
$$ -8757 -8893 10919 13169 -5632 -4006 6609 -6768 -12222 8189 12959 -1888 -4876 -139 216
265B16N476P773n281j3660k371P047J884Q4K137j748m152j399J436O651P430l725
$$ 216 5692 13465 8184 -5476 -7847 -800 1084 1168 3305 1557 -2595 -3994 -2558 4093 11523 7798
281G798j4615k895R981N66N68Q159o833j4057P375J2757n005k635L821r571j0260
$$ 7798 -6817 -9712 269 835 1403 9562 2729 -11328 -3953 8804 3799 1164 4985 -4586 -14846
296a4846J0193Q673o136l22K660n273p18P790L943M42k283p674n308O966Q417
$$ -14846 -4653 4020 -2116 -2438 222 -5051 -5769 2021 5964 6406 4123 -3551 -8859 -1893 6524
311F524j199l924o65m162o29Q571K887n671m097j053n395j247J1500N080r566
$$ 6524 5325 1401 736 -3426 -4055 4516 7403 1732 -2365 -3418 -8813 -10060 1440 6520 -3046
326c046m325L880j14M531P867k236r393j607L641R98M837M812n051o251K165K302
$$ -3046 -7371 -3491 -3605 926 8793 6557 -2836 -4443 -802 196 5033 9845 4794 -1457 708 3010
342C010K400M129l687r292l044J939J324K711M080m674q142L187P344P49J085
$$ 3010 5410 9539 5852 -3440 -6484 -4545 -3221 -510 3570 -1104 -9246 -6059 1285 2034 3119
357C119j02o306n191N066O106m33J35J884n099k139O794N368j288l221n440m849
$$ 3119 3017 -3289 -8480 -3414 2692 2259 2394 4278 -821 -2960 3834 9202 7914 4693 -747 -5596
373e596J374N836J754l163k462l312j128P229N775k920l771j948l505J586P443
$$ -5596 -4222 1614 3368 205 -2257 -5569 -6697 532 6307 3387 -384 -2332 -5837 -4251 3192
388C192K853o710l436K446p01K748O344j025p326j632K021J132K418K986l764
$$ 3192 6045 -665 -4101 -1655 -2356 392 6736 5711 -1615 -3247 -1226 -94 2324 5310 1546
403A546n275J072M79L48M272m72o498j934J510J102L457M778k639p109m95M188
$$ 1546 -3729 -2657 -2178 -1830 2442 1970 -4528 -6462 -4952 -3850 -393 4385 1746 -5363 -5858 -1670
419a670R70J261P20n565n464K505O816L737Q28m60m034k166N648M695k503k955
$$ -1670 -700 561 1281 -4284 -9748 -7243 -427 3310 4138 3678 -356 -2522 3126 7821 5318 2363
435B363m235n455L134P588J331k588P82j189k180O782N244o457m093M2m646r50
$$ 2363 -1872 -7327 -4193 3395 4726 2138 2920 1731 -449 6333 11577 5120 1027 1069 -3577 -4527
451d527N731R41l525J003P07k058L547O469k308m044o81l409j645N616K594l465
$$ -4527 1204 2145 -1380 -377 330 -1728 1819 8288 5980 1936 1255 -2154 -3799 1817 4411 946
467I46k573M29M74J368N957J889p303n418R54O50M21K661l172p777j118N884K169
$$ 946 -1627 -1198 -724 644 6601 8490 1187 -4231 -3277 -2627 -2206 455 -2717 -10494 -11612 -5728 -3559
484c559K292K834m798l784O504L428n43L484j645p364Q58N538j750p06K874m598
$$ -3559 -1267 1567 -3231 -7015 -511 2917 2374 5858 4213 -3151 -2293 3245 1495 789 3663 -935
500i35n273M888L114p69K500j873o505K17L793J55l96l54k913k410L582N053K110
$$ -935 -6208 -1320 1794 1025 3525 1652 -4853 -4636 -843 -688 -1084 -1438 -4351 -6761 -3179 1874 3984
517C984Q80o12k301j171J282L084j532n702k071m0k392L712O040j615k514R86
$$ 3984 4864 4252 1951 780 2062 5146 3614 -2088 -4159 -4199 -6591 -2879 3161 1546 -968 18
533A8N2P79M798L53n998l624r85l47M888M318l121k412Q02M41M569M188k777n607
$$ 18 70 849 5647 6000 2 -3622 -4607 -4954 -66 4252 1131 -1281 -479 -38 4531 8719 5942 335
551C35k781K11K059K845k83l476m60K56J841M469J133k828j832k230o77L465O46
$$ 335 -2446 -2235 -176 2669 2386 -1090 -1550 -1294 547 5016 6149 3321 1489 -741 -1418 2047 2693
568B693l143o65o25j478L380K497k553K93L158m304l166N288N87l355K534j567
$$ 2693 -450 -1115 -1740 -3218 162 2659 106 399 3557 -747 -3913 1375 1962 -1393 1141 -426
584d26p471J170O421M75j507j638m271j22P416M421j964k638l739l84N893L701
$$ -426 -7897 -6727 -306 169 -1338 -2976 -7247 -7369 47 4468 2504 -134 -3873 -4257 1636 5337
600E337k656l902k168L84K679L374J482k967m156R04K246l1o64k51l177k672K938
$$ 5337 2681 -1221 -3389 -3005 -326 3048 4530 1563 -2593 -1689 557 526 -138 -389 -3566 -6238 -3300
617c300K611j638K841K699k521R86K267k218J409M108m194m694K041j84j357N066
$$ -3300 -689 -2327 514 3213 692 1678 3945 1727 3136 7244 3050 -1644 397 213 -1144 3922
633C922K075p141k357L807M77J619J918n137n553J590L263K849R17k641l604Q11
$$ 3922 5997 -1144 -3501 306 783 2402 4320 -817 -6370 -4780 -1517 1332 2249 -392 -3996 -3185
649c185M156K502P75k380m354J04K303K714J019k981k183J016J007M85J621r41
$$ -3185 971 3473 4248 1868 -2486 -2382 -79 2635 3654 673 -1510 -494 513 998 2619 1678
665A678k628L22L10k085J095L084j213j477M76j939m38M131O08l058j84j053j224
$$ 1678 -950 -628 -318 -2403 -1308 1776 563 -914 -438 -2377 -2815 1316 1924 -1134 -1318 -2371 -3595
682c595L678L033j236j896j237o06K393K894q11k982j551j622J552M531L04k000
$$ -3595 83 3116 1880 -16 -1253 -1859 534 3428 2617 -365 -1916 -3538 -1986 2545 2849 849
698H49j670j764J582L727l04k374j412j879K72L544P29k083R22M1k816J617L444
$$ 849 -821 -2585 -1003 2724 2420 46 -1366 -3245 -2973 571 1300 -783 139 180 -2636 -1019 2425
715B425j519j012M86k791l40M005R70q37N86j474j265K292J762j096n38n68l195
$$ 2425 906 -106 380 -2411 -2751 1254 2224 1387 1973 499 -766 1526 3288 2192 1654 1086 -2109
732b109J45L436O27r81j101j373l16O64J442J278j952l220m1J981R65J766N80
$$ -2109 -1964 1472 2099 1118 17 -1356 -1672 -1008 434 1712 -240 -3460 -3501 -1520 -555 1211 1791
749A791k237j466K213R62M40J204k232k596J399M85M30K793q58m406L14K565o95
$$ 1791 -446 -1912 301 1263 1703 2907 675 -1921 -522 -37 393 3186 2328 -2078 -1764 801 106
766A06K73J511k863l227J753J331J14J511l43k470L26P80J092J571j82k510n13
$$ 106 379 1890 -973 -4200 -2447 -1116 -1002 509 166 -2304 -1978 -1198 -106 1465 1283 -1227 -1740
783a740R79J183J332J100j141j766j92R11J582Q15k327j105j11j057J485K498
$$ -1740 -761 422 1754 2854 1713 -53 -245 666 2248 3063 736 -369 -480 -1537 -52 2446
799B446j152j668j32j153L02K486Q83k396j267M9r1K484K240j845r87K22q46J387
$$ 2446 1294 -374 -506 -1659 -1357 1129 2012 -384 -1651 -1602 -1693 791 3031 1186 199 421 -425 962
817I62K333j207k052r28l4J26J454J478j172j488l45J85J258M24o07p46j844j136
$$ 962 3295 2088 36 -892 -926 -800 654 2132 960 -528 -873 -688 570 994 387 -359 -2203 -3339
835c339K184O65L58J79j387j215R97J984M93k13r87j934m33K321J211l48L91j812
$$ -3339 -1155 -490 -132 47 -1340 -2555 -1558 426 919 706 -281 -2215 -2648 -327 884 536 927 -885
853h85j390K628J810p33l13q42j566M6J869O54j193j04j012j256J107J879k87
$$ -885 -2275 353 2163 1430 1117 275 -1291 -1245 624 1278 85 -19 -1031 -2287 -1180 699 412
870D12n27r08p12P84J100J579j78j543p77O1Q11J342M32q70j507K46Q90J134J321
$$ 412 -115 -1023 -1735 -951 149 1728 1550 7 -770 -709 102 1444 1876 1006 -501 -255 635 1769 3090
889C090m65k007l77J23m21J148P07k255j905K73J442O88J220K22j959q38J149
$$ 3090 2625 618 241 364 -57 1091 1798 -457 -2362 -2089 -647 41 1261 1483 -476 -1314 -165
906a65R50P13m6k105j243N95J304J156R51p81j429k61J966O00p37J12j438k068
$$ -165 785 1498 1452 -653 -1896 -1301 3 1159 2110 1329 -100 -361 1605 2205 1468 1580 142 -1926
924a926L00J199P28o05m69j40o52N42J438L08q49j197o98K9R80N90K19j006q59
$$ -1926 -1626 -427 301 -304 -773 -913 -1565 -1023 415 723 -126 -1323 -2021 -1992 -1012 -422 -203 -1209 -2068
943b068NJ475J547J79q32j61p03j32J221J157p94j665m91J8K56J739P60j532j394
$$ -2068 -2063 -588 959 1138 306 145 -558 -690 531 1688 894 -771 -1262 -1244 -988 751 1511 -21 -1415
962a415J01Q84J038L91n64j292j052L23J443R65l09q86n68Q38M91J445P01n72
$$ -1415 -1314 -430 608 999 435 -857 -1909 -1586 -143 822 513 -373 -941 -103 388 1833 2534 1962
980A962j403j54M78Q57k49n02o06j120j01J520R66j30q16l66m36q50J702P60j548
$$ 1962 559 405 883 1740 1491 989 383 -737 -838 682 1648 1518 702 336 -100 -950 752 1512 -36
999c6r19o48q22J772J715Q4j122n03l80O82K236P8k078j94m74o00J646J549j476
$$ -36 -955 -1603 -2425 -653 1062 1146 24 -479 -859 -177 2059 2137 59 -135 -609 -1209 437 1986 510
1018E10q53L8O6L49J391j70k085j110K93N48K07M15n27p71m75L72J417M38k17
$$ 510 -343 -305 -239 110 1501 1331 -754 -1864 -1571 -1023 -816 -401 -928 -1699 -2174 -1802 -385 53 -164
1037a64j42o66J85K32N15J147J29j384p04O35P62K1R03n83k439M96J676j99k00
$$ -164 -306 -972 -787 -555 -40 1107 1236 -148 -852 -217 545 566 1469 886 -1553 -1057 619 420 220
1056B20Q95k138j329J342J093J50K52j650j004J051J571K82L45j10k412L99K172
$$ 220 1115 -1023 -2352 -1010 83 233 485 -1165 -2169 -1118 453 735 1080 970 -1442 -1043 1129
1073A129J09n90N15q69r33J093R26K33l08o27l24L1j12M7J245p45j923p7N55M07
$$ 1129 1238 648 1163 294 -639 454 1380 1613 1305 678 354 385 273 320 1565 820 -1103 -1180 -625 -218
1093b18N95N36j324q12K8J111J079j11j058m41n77L91J292J339r87j312J83M56
$$ -218 377 913 -411 -1223 -1195 -84 995 884 -174 -615 -1192 -801 491 1830 843 -469 -286 170
1111A70K59J244l15j148q74n63R09J418o09r92M2l95m82J331J414k092p93P33
$$ 170 429 1673 1358 210 -664 -1227 -318 1100 491 -501 -459 -854 -1336 -5 1409 -683 -1476 -743
1129g43p81K49J948j08j304J92n23J82K140j19j289K18j11r77J588J466j383p71
$$ -743 -1524 -1275 673 565 -739 -547 -1070 -888 1252 1133 -156 62 -49 -1026 562 2028 645 -126
1147a26P65j031l79J763K42j372m09m79J9Q99N76o63m24l22l28Q42J327p04l33
$$ -126 639 -392 -771 992 1234 -138 -547 -1026 -1007 -108 468 -195 -619 -941 -1269 -427 900 196 -137
1166a37j04q25O98J079L35J35j167q14J333L50K3N68l88k011Q2J490K01L5J34
$$ -137 -241 -1066 -368 711 1046 1181 14 -800 533 883 906 1474 1086 -925 -843 647 848 883 1017
1185A017j463j180J224N27j05M53r54j460Q51R48j95N32K04k025K32J785J49l76
$$ 1017 -446 -1626 -402 125 20 473 -481 -1941 -1090 -142 -337 195 399 -1626 -1394 391 540 164
1203A64P47q98j325J226R73l42N99k73j202j75O08N27M13n09j428n44O18L88N08
$$ 164 911 13 -1312 -86 887 545 1144 871 -331 -506 102 629 1042 533 -895 -1439 -821 -433 75
1222G5L51r70j241P64N25O29K40o85o02P2L31R18R43p30q99K17R5L88J177M37
$$ 75 426 -544 -1785 -1021 -496 133 373 -312 -914 -842 -511 407 1350 620 -279 -62 33 421 1598 2035
1242B035j712j049O05J48J129j92p72n71k10r5O62R72q66n89l68k08K88J145O45
$$ 2035 323 -726 -121 27 1156 964 192 -379 -589 -684 -22 950 84 -505 -873 -1081 -793 352 997
1261I97j271m86L00PJ005N02p80M5o75m44J217J228p76l88j70o90J9J153L72j276
$$ 997 -274 -760 -460 -453 552 1054 274 319 -356 -800 417 1645 869 481 311 -379 -360 793 1165 -111
1281a11o06m96P3R40N73m61l61p69m77J328Q48p44Q1n14n29L43J380L92p82Po15
$$ -111 -717 -1213 -1140 -200 373 -88 -449 -1218 -1695 -367 481 -263 -182 -696 -1225 -882 498 890 108 115 -500
1302e00K8J230L28l27N5j360o33J195M84k07K21m20q43j0J161J47k56jj252J09
$$ -500 -472 758 1086 759 814 -546 -1179 16 500 293 514 94 -749 -759 402 549 293 292 -960 -851
1322h51O97K17N33j86j090m06R36P21P4P23q79j157L98P39O00P1l84q36m77Q58
$$ -851 -154 63 596 410 -680 -1086 -150 571 645 1368 489 -668 -270 469 1069 1140 756 -80 -557 301
1342C01K28O77k64j480l90L83O16O83l8q32o78j50O64L42M23m11j229K83M47K60
$$ 301 529 1206 942 -538 -928 -545 71 754 716 -116 -794 -944 -280 62 485 74 -1155 -872 -425 -165
1362a65R89l2q86m76M05K68R03k1l37q13l49K01O36P89m22j111m54L61J93R36
$$ -165 824 792 -94 -570 -165 103 1006 985 648 -165 -514 -313 323 1112 690 -421 -875 -514 -321 615
1382F15m78j061j45k10l0J252L05m54q02j4j12Q56J094m67m38m47N1L82P87Lk34
$$ 615 137 -924 -1069 -1279 -1309 -57 248 -206 -1008 -1022 -1134 -278 816 349 -89 -536 -485 -103 684 687 453
1403D53l38p67L03J216k3k49o12p92p3N43R05o7q71m26m40Q04R01k0k94n80m83
$$ 453 115 -652 -349 867 844 595 -17 -809 -882 -339 566 499 -372 -798 -1238 -434 467 447 153 -427 -910
1424i10N21R38N88l22k51n65j60O58Q95j0n99o13l14M88M51J73K5o34j006L6Q85
$$ -910 -389 549 1137 815 564 -1 -161 497 1392 1382 783 170 -144 344 795 968 993 359 -647 -611 274
1445B74J59J9m82l94m78J70R15K31j20n56o92O41N6N87N67q61j250M09J046M55
$$ 274 433 452 -30 -424 -902 -732 183 414 294 -262 -954 -313 -257 330 897 36 -1214 -805 241 696
1465F96L28o81n58m15J87Q88M40o13o72m07J55O71K89k67j18r36k4L62N41J91
$$ 696 1024 343 -215 -630 -443 445 885 272 -400 -807 -652 19 308 41 -77 -1013 -1037 -675 -134 57
1485E7j76n47o31L76R23K18J45m92l96q0N64P61K13j46q26n81M02Q30M89m00k46
$$ 57 -119 -666 -1297 -921 2 220 365 -127 -523 -603 -39 722 935 789 -37 -618 -216 614 1103 703 457
1506D57j018l68R99M12m64mo38l16M15O30L97p30j88k65J0Q33J90j7q7p08j61
$$ 457 -561 -929 70 482 18 14 -624 -940 -525 105 502 -228 -416 -681 -671 162 352 335 248 -460 -621
1527f21R08P81N1l78l90l62k9Q57M42m59m11o53l16L86O58K83o50n80m53J98M91
$$ -621 287 1068 1119 741 351 -11 -40 817 1259 800 389 -264 -580 -194 464 747 97 -483 -936 -738 -247
1548b47Q60m04r34k81J46P64R05j14p03k84J59M06M22O30p25q84r0O01J27P59
$$ -247 613 209 -725 -1006 -860 -96 809 695 -8 -292 -133 273 695 1325 600 -284 -374 227 354 1113
1568A113r0j459k67K29M21K07K06n68q93K78o0M06P70J4q31n8R3l8Q18K56k19
$$ 1113 1023 -436 -703 -474 -53 154 360 -208 -1101 -823 -883 -477 293 307 -524 -582 -489 -527 291 547 328
1589C28j029j4O18M05Q11j56j005n22L34N95L99l2q60l87n7N77M05K3j50p93k13
$$ 328 -701 -715 -97 308 1119 963 -42 -564 -230 365 764 732 -128 -515 -572 5 410 433 283 -510 -723
1610g23N35L29j49L66o37l42o5O43P52l75L69o62n92N16O09j40J1j27q32Q0R59
$$ -723 -188 141 -8 358 -279 -621 -686 -43 709 334 703 41 -551 -35 574 434 445 318 -514 -434 525
1631E25P3NJ35j171n20J155O19o15J99n37r04N27Q09M2k84l90n62O9O53J66J28
$$ 525 598 603 738 -433 -953 202 821 206 405 -132 -1036 -509 300 342 58 -332 -894 -825 -172 -6 122
1652A22j97p14k06Q01N72J18K11m40p90M72M95L85R5o63m63l3j83R09K71m88n68
$$ 122 -75 -789 -995 -194 378 496 707 267 -523 -51 444 829 924 261 -202 -235 -418 491 762 274 -294
1673b94o62L28J74M61L34j048k98K66L39M11P30o67l00J57RO85Q81o15o92j76
$$ -294 -956 -628 -454 7 341 -707 -1005 -739 -400 11 741 74 -226 -69 -60 625 1506 891 199 23
1693B3K31J23O21K66j464k01J75k29O30K40m69m56J84n39M37P86j60o02j96lj46
$$ 23 254 377 998 1264 -200 -401 -226 -455 175 415 -54 -510 -326 -865 -428 358 198 -404 -600 -603 -749
1714g49J208J21n17n32J56k47Q89P45k98o01l83j05P67K49Q6o88m23k76k9O66
$$ -749 459 580 63 -469 -313 -560 329 1074 776 175 -208 -313 454 703 789 101 -322 -598 -627 39
1734C9N60l74o99l61J72O37K10n7J32j080J28O82K53J71j85j19q10M52R92j10
$$ 39 599 225 -474 -835 -663 -26 184 127 259 -821 -693 -11 242 413 228 109 -701 -249 743 633
1754F33j69m14o13p5Q77p4M71o1r50l14N59L79Q9J14n42q67L87P65K05j47j02
$$ 633 464 50 -563 -638 239 165 636 575 -375 -689 -130 249 338 452 -90 -957 -570 195 400 253 151
1775A51n96m93N81O57K09j2r99k9M40L58M24J1m61l79p0P69q9L04j40n12k69J19
$$ 151 -445 -938 -357 300 509 497 -502 -531 -91 267 691 702 241 -138 -208 561 472 776 636 124 -145 -26
1797b6K08O26J86q97l28j93K23M69J93m70q14j65L31O62M49m54n41m6J90K69J081
$$ -26 182 808 994 97 -231 -424 -201 268 461 -9 -823 -988 -657 5 454 0 -541 -587 -397 -128 953
1818I53n69n90j47j61K59R58l2l88p08Q7j03L38N45l65o22L4n3j64Q86j48n26
$$ 953 384 -206 -353 -514 -255 703 671 283 -425 -338 -441 -103 442 77 -545 -511 -564 -728 158 10 -516
1839e16J23m56j17R79M03k29m46m42j8Q42O97k77k88k65l42M76M56L72m91l53
$$ -516 -393 -849 -966 13 416 187 -259 -701 -719 123 820 543 255 -10 -352 124 580 952 461 108
1859A08o26L45L12K77l6m34m80k15M72M05Om1l56o28M94P61q8J80m13p13J7J022
$$ 108 -518 -173 139 416 380 -54 -534 -749 -277 128 134 93 -263 -891 -397 364 276 456 43 -670 -653 369
1881C69Jm4j54l99j04M38M84r8M5l29o33L72L23N6K13o42n39K31K70N86J58m11
$$ 369 370 326 172 -227 -331 107 591 493 538 209 -424 -52 271 327 540 -102 -641 -410 -140 446 604 193
1903A93m69k98M68K82QJ27o96j69K25M17J38L00l69m94j08N18q3O40j14o66l22
$$ 193 -276 -574 -106 176 184 311 -385 -554 -329 88 226 526 157 -337 -445 73 -10 630 516 -150 -472
1924d72L76K03K43J94n72l89j75J9N44L03j47o91l35Q7N33M61l85k52lJ35J02
$$ -472 -96 107 350 544 -28 -417 -592 -573 -29 274 127 -564 -899 -812 -279 182 -203 -455 -458 -323 -221
1945b21M40J23k65m11J23j8N91L89k99j74l70J59J32M44l02j32l56m62J50P61
$$ -221 219 342 77 -334 -211 -229 362 751 452 278 -92 67 199 643 341 209 -147 -609 -459 302
1965C02l75P9j79l08p4J22O33r1M0l52J09J4Q70l6k07l63l33R4M96K74j25l93
$$ 302 -73 6 -173 -481 -555 -433 200 109 149 -203 -94 -80 790 754 547 184 -149 -55 441 715 590 197
1987A97m36k1L84L20j92j08k81m09Q5M72K90j24q44p3J87L44L22j1Q2p85J03M22
$$ 197 -239 -260 124 444 252 144 -137 -546 -461 11 301 177 -667 -740 -553 -209 113 102 184 -601 -498 -76
2009g6K05L28j04l30l39K83J61L52K70q43o3j42J3K35K31Q6p51l3L97n1M48K33
$$ -76 129 457 353 23 -316 -33 128 480 750 -93 -156 -298 -285 -50 181 267 -484 -517 -120 -171 277 510
2031E10p19l71K65L15K45k01m3m60j48L41L39L06K52p95m9L17K34o8K44l26l96
$$ 510 -209 -580 -315 0 245 44 1 -459 -607 -266 73 379 631 -164 -213 104 338 270 514 188 -208
2052b08J96m6M68q2p2l47j80K08K30O9k17m16r4m2N19J17j1j8l14m80K66O54j48
$$ -208 -12 -58 410 328 256 -91 -271 -63 167 236 19 -397 -491 -533 -14 103 92 74 -240 -720 -454 200 52
2075E2L06j0o94J39M11O65L7n38l68l30J18P62R8m74k76l54k81R52K79m83l70
$$ 52 358 348 -346 -207 204 869 906 368 0 -330 -212 550 648 174 -102 -456 -737 215 494 11 -359
2096c59k88k3M51M41j76o33M59q1kO61K29m77j60J13p4L6L62K40l23o40J82m91
$$ -359 -647 -670 -219 222 46 -587 -128 -209 -211 450 679 202 42 155 81 117 479 719 396 -244 -62 -553
2118e53Q79K58l86l19p8l49L86N09j51o28m9L4N2K87Q96q86k24j0J6P88J94k57
$$ -553 326 584 198 -121 -199 -548 -162 347 196 -432 -481 -447 -395 -108 788 -98 -322 -332 -316 472 666 409
2140D09m77J24n0J57M11r0m02j94K40j99J27M09k18m19k82M12R2Q9K02l11n69
$$ 409 -68 56 6 163 574 484 82 -112 128 -71 56 465 247 -172 -454 -42 50 139 341 30 -539
2161e39M37J66O2Q4j29n35K55K1M22J82j47j57n76K37K81J31K00l24n03j26P35
$$ -539 -102 64 126 210 81 -454 -199 -178 244 426 279 122 -454 -217 64 195 395 71 -432 -558 177
2182A77j9K09j88k49m58M66J31P3k01Nn86J29L54J71q9m2k51m15M40K31p7J38
$$ 177 158 367 179 -70 -528 -62 69 142 -59 -54 -640 -511 -157 14 -75 -117 -368 -783 -343 -112 -189 -51
2204e1l2k83k3N41j01M94j32k89l44M31L48j80L16o26k38Q1O93n06M0k64l56j46
$$ -51 -83 -366 -389 152 51 545 413 124 -220 211 559 379 695 69 -169 -88 605 99 139 -125 -481 -627
2226f27N13P7k9m07K06o7O4J68L03J82n04K6l3q2O06J21k20j01j83K8L67J20j95
$$ -627 -114 -37 -66 -473 -267 -334 -270 -102 201 383 -121 -95 -128 -210 396 517 297 196 13 41 408 528 333
2249C33l91k90k3K65K09Qm56p5j53L45k9M52l68j07k3L8J5O12j73l20j05M52j
$$ 333 -58 -348 -371 -106 103 111 -345 -420 -573 -228 -257 195 -173 -280 -303 -265 -250 362 189 -131 -236 216 215
2272B15L06j24j83j24L2rJ59M52l10l66m20J26R1L70k83r5l47j52J53M02lPk03
$$ 215 521 397 214 90 122 113 272 724 414 48 -372 -246 -155 215 -68 -163 -510 -662 -509 -107 -110 -103 -306
2295c06k94J47M33L25j62l04J44j98L00K28j58J61k61k37J54L31j91Q1k46l88
$$ -306 -600 -453 -20 305 143 -161 -17 -215 85 313 155 316 55 -182 -28 303 112 193 -53 -441
2315d41J36N2R8R7j98N7o7L01p6L01l96J86l02R7p9J94M98j67k82k00M26J3J14
$$ -441 -305 -253 -155 -58 -256 -199 -266 35 -41 260 -136 50 -252 -155 -234 -40 458 291 9 -191 235 248 362
2338C62J80l91m33L93L4M05l35j73j25q6J15J96n6j81m66J48J43K69p8j3N2m50
$$ 362 542 151 -282 111 145 550 215 42 -83 -169 -54 142 86 -95 -561 -413 -270 -1 -79 -92 -40 -490
2360d90l4K62J50K25J5k79J11Q3K06M17l92o7l63J37K72J33J71n28j23O1k34K93
$$ -490 -524 -262 -112 113 128 -151 -40 43 249 666 274 207 -156 -19 253 386 557 29 -94 -33 -267 26
2382B6L74o15j24K58l32K15M97k58j99k28J75j19K89M44l99k10n3K11K59L69l84
$$ 26 400 -215 -339 -81 -413 -198 299 41 -158 -386 -211 -330 -41 403 4 -206 -259 -48 211 580 196
2403A96Qj00k67K75K81l01j44K51p22L17L07J59k95m06O8k4L22j57J48k4j97M9
$$ 196 204 104 -163 112 393 92 -52 199 -523 -206 101 260 -35 -441 -373 -397 -75 -232 -84 -108 -305 -256
2425b56L32L0j06J67j56K5l6K86J62k29j86l01K94M37p0j78j8j74j52K11P9k32
$$ -256 76 106 0 167 11 36 0 286 448 219 33 -268 26 463 393 215 197 23 -129 82 161 -71
2447g1K45l47j89J48J5K05j64N0l04K0K21m1M13J54l98k42L19K80q3j2l17J81
$$ -71 174 -173 -362 -214 -199 6 -158 -108 -412 -392 -171 -212 201 355 -43 -285 34 314 231 219 -98 83
2469H3m7K47j86J7J71k80M9P1n6Q4j63Rm20J52J4k1R8mj55K22q0K93M9j92j53
$$ 83 36 283 97 114 285 5 54 125 69 153 -10 -1 -421 -269 -255 -276 -178 -182 -337 -115 -195 98 147 -45 -198
2494a98J01j86M15J55O4k87M9j43L87o7P1k66q0k2P9J07j17P3k79R8l20MK00J72
$$ -198 -97 -283 132 287 351 64 113 -30 357 290 361 95 15 -7 72 179 62 135 -144 -46 -366 -362 -162 10
2518A0p9q5j59M5J57N12j97j46k34m0K11K79j74j58n1k35M21J05J62p5j03j43
$$ 10 -69 -154 -313 -268 -111 401 204 58 -176 -216 -5 274 100 -58 -109 -344 77 182 344 269 166 23
2540B3m90M26L02k88k26q7k56N54j23J91j15j20n1r9L01K73k51j44J66j69L40
$$ 23 -467 -41 261 -27 -253 -340 -596 -42 -165 26 -89 -209 -260 -359 -58 215 -36 -180 -14 -183 157
2561A57o1K58k45J57l37J55K41o1J06k25m75J55L47l02J24L5m33n8N72l34L04
$$ 157 96 354 109 266 -71 84 325 264 370 145 -330 -175 172 -130 -6 29 -404 -462 110 -224 80
2582H0J9l92K41J29m9j06pk07J56J30N38m62K51q8m37M27p5L6N6R1m88J25Q8j36
$$ 80 99 -293 -52 77 28 -78 -85 -292 -136 -6 532 70 321 233 -204 223 148 184 240 331 -157 -32 56 -80
2606h0J83P2k74k76l51O72l21L59J61n50J20n6J24M16n58R2j61J09M34L1J61K7
$$ -80 103 175 -99 -375 -726 -54 -375 -16 145 -405 -285 -341 -217 199 -359 -267 -428 -319 115 146 307 334
2628C34n58M37J28O5j53j21l5j1%J86l33j05j2K33m30M12Ok44J32j27j69j38K72
$$ 334 -224 213 341 406 253 132 97 86 86 272 -61 -166 -178 55 -375 37 43 -201 -69 -196 -365 -503 -231
2651b31K6J87j53K52l40N72R2o5j34M8k09J42J95k95P5j35k30K50O2Q7J55n64
$$ -231 -205 -18 -171 81 -259 313 405 340 206 254 45 187 382 87 162 27 -203 47 109 196 351 -213
2673b13l4k08J72L45m3k46j15P3r3L63J38j42j30m7L92j93K01J33m30P7J54q4
$$ -213 -247 -455 -283 62 19 -227 -342 -269 -362 1 139 -3 -133 -180 212 19 220 353 -77 0 154 70
2695G0K05J77k24j52j13O9q7R3M6k16p4J23l46M44O4j22m47K95j16L36L1P2l56
$$ 70 275 452 228 76 -37 32 -55 38 84 -132 -206 -83 -429 15 79 -43 -490 -195 -311 25 56 128 -228
2718b28qK60NM80l25l73K7m9M95q2k9o9r5k5l7m4L01r8l54R1k18L37J52k63J22
$$ -228 -236 24 29 509 184 -189 -162 -211 284 202 173 104 9 -16 -53 -97 204 106 -248 -157 -375 -38 114 -149 -27
2743b7r8l70K75J93J68J43j81k70L7j93O71j61j69K14k4j11R2J27k29J62n64K24
$$ -27 -125 -495 -220 -27 141 284 103 -167 -130 -323 348 187 18 232 208 97 189 316 87 249 -315 -91
2765i1J58P8J5M8j75l6o9k7l3J17l99r7J62M05M7j15Q4k31K20J38o4P1n4l08K37
$$ -91 67 145 160 208 33 -3 -72 -99 -132 -15 -414 -511 -349 56 103 -12 72 -159 61 199 135 206 152 -156 81
2790H1k22K10O6N1M6j49J85k92K70n9p7m57L37r1p3N58l59k04J32j00oL10J53
$$ 81 -141 69 135 186 232 83 268 -24 246 187 110 -347 -10 -101 -174 384 25 -179 -47 -147 -153 157 310
2813C10l59q8R2j26L63K68m54k1K79j03k4J60K0k65r0o5k12K77J49Pk64j50N6
$$ 310 -49 -137 -45 -171 192 460 6 -15 264 161 137 297 317 52 -38 -103 -315 -38 111 118 -146 -296 -240
2836b40K75J14n35N8j21K9L87o9m7R5j68j99N58lqm5m7L0Q2Q7n2L4n7O2o9m2N3
$$ -240 35 149 -386 -328 -449 -420 -33 -102 -149 -54 -222 -421 137 134 126 81 34 64 146 233 181 215 158 220 151 109 162
2863A62p1m9j74o8j16J82R1L4q6j73K09J58l97J43J75j64L16k23L12r4j14J3l
$$ 162 91 42 -132 -200 -316 -134 -43 -9 -95 -268 -59 99 -298 -155 20 -144 172 -51 261 167 53 66 63
2886F3N0J44j90L61j62j55l61M75j05j11J31n89L12pK40k78J16J28k52j90M56
$$ 63 113 257 67 428 266 111 -250 225 120 9 140 -449 -137 -144 96 -182 -66 62 -190 -380 76
2907G6k58K41k27j1K60j28P2K0J03k77j70L13lL98m31R4P7o8J24j00j26l6m3N2
$$ 76 -182 59 -168 -179 81 -47 25 45 148 -129 -299 14 11 409 -22 72 149 81 205 105 -21 -57 -100 -48
2931d8N7M4j87K63k64p6P3k82N49n5j14k9q4K09l35M92k37J27N2k41L77j11LM9
$$ -48 9 53 -134 129 -135 -211 -138 -420 129 74 -40 -69 -153 56 -279 213 -24 103 155 -86 291 180 183 232
2955B32O2k61K75j8n3k41J7N9p5N9k70J29L1k06k1J79K55q2n8o4P6k60L48l3J3
$$ 232 294 33 308 290 237 -4 13 72 -3 56 -214 -85 -54 -260 -281 -102 153 71 13 -51 25 -235 113 80 93
2980I3q7J78r4kJ40o3O1k87J7qJ9J54l39L85l20M7L17j5k56l42J04K50O6K0m9
$$ 93 6 184 90 88 228 165 226 -61 -44 -52 -33 121 -218 167 -153 -106 211 196 -60 -402 -298 -48 18 38 -11
3005a1l67M33l83K93K09l52L63K2j02j00J67q9K88j19j20J08j72JJ10L6l25k0
$$ -11 -378 55 -328 -35 174 -178 185 207 105 5 172 83 371 252 132 240 68 69 179 215 -110 -130
3027a30J4M51l36R1K0k36KJ45k15J82k55q8o3M20J55q9o1j55K92j48l9M08m35
$$ -130 -116 335 -1 90 110 -126 -124 21 -194 -12 -267 -355 -418 2 157 68 7 -148 144 -4 -43 365 -70
3050g0L82m27K45j62K36J40m03p2N1M6j5K24k95lm3l5J75K27j03k14j85N6K1K53
$$ -70 312 -115 130 -32 204 344 -59 -131 -80 -34 -49 175 -120 -123 -166 -201 -26 201 98 -116 -301 -245 -224 29
3074B9K74l02Q1pj45J77N7O8j84Rk95K46j3K89n27J7J63M0r5n7M8M3j8K51k36
$$ 29 303 1 82 75 -70 107 164 232 48 57 -238 8 -5 284 -243 -226 -63 -23 -118 -175 -127 -84 -102 149 -87
3099h7n2K73l14j52L71R2m12J65l7K32j7j06m0J94J69p1k11j5K2J06J85o2n12
$$ -87 -139 134 -180 -332 39 131 -281 -116 -153 79 62 -44 -84 110 279 208 -3 -18 4 110 295 233 -279
3122b79O8K45l43K16N00o28j66L05O4J73j85J7j53r7M41n3k83J53K70k74j26J07
$$ -279 -211 34 -309 -93 407 -221 -387 -82 -18 155 -30 -13 -166 -263 178 125 -158 -5 265 -9 -135 -28
3144b8J22J24o4J18l34J26j1N1r0J22k45j90K64j91J8q0L64m58M52j84K0J66k10
$$ -28 94 218 154 272 -62 64 53 104 14 136 -109 -299 -35 -226 -208 -288 76 -382 70 -114 -94 72 -138
3167a38j35K71J80k13n2p1j24N55k85O1J44N0j64L1l17M03k5l29J53k80K25m7
$$ -138 -273 -2 178 -35 -87 -158 -282 273 -12 49 193 243 79 110 -207 196 171 -158 -5 -285 -60 -107
3189a07J19q6J4J65j06j15J57p6r8J9j79K2K97O2k91Q6J51k08K76j48J14Q8j69
$$ -107 12 -74 -60 105 -1 -116 41 -35 -133 -114 -293 -271 26 88 -203 -117 34 -174 102 -46 68 156 -13
3212a3k06N69j97j01L2k1r9J60R7r7k77M3j76J50N6J78j06m4r8m9O6J05L3J74
$$ -13 -219 350 153 52 84 63 -36 124 221 124 -153 -110 -286 -136 -80 98 -8 -52 -150 -199 -133 -28 5 179
3236A79k40m5J75J76O2q1j69j1r8K32J54j22o9p2j34L2R8L26k54l40K5K45j48
$$ 179 -61 -106 69 245 307 226 57 46 -52 180 334 212 143 71 -63 -31 67 393 139 -201 -176 69 -79
3259g9k54M05j73k4j34K02PR9K4n8k5j6n3N9R3j95O1L75k53ML3j91J38j96J62
$$ -79 -333 72 -101 -125 -259 -57 -50 49 73 15 -10 -26 -79 -20 73 -122 -61 314 61 65 98 -93 45 -151 11
3284A1l7K6j8r3k9m7K7Q2N5j7J19k69J75j22J76j02J29K47k31j60R5K65J13m78
$$ 11 -26 0 -18 -111 -140 -187 -160 -78 -23 -40 79 -190 -15 -137 39 -63 66 313 82 -78 17 282 395 -83
3308h3K92P8m8j32M7J16n4k08K26K2m46l1J55J5k3K56j82j82J79N7k51L41j10
$$ -83 209 287 239 107 154 270 216 8 234 256 -190 -221 -66 -51 -74 182 0 -182 -3 54 -197 144 34
3331C4kj85m7K98J9j22J00O0j56J74k16K50J45m24K61k33j14L63k87M3k2k12M2
$$ 34 32 -153 -200 98 117 -5 95 155 -1 173 -43 207 352 -72 189 -44 -158 205 -82 -39 -61 -273 -231
3354b31K53m3M4j12Rk5P4j24K15k11L3K48l53J63k9J44N5n9J3J10p7K24r1q9k33
$$ -231 22 -21 23 -89 -80 -105 -31 -155 60 -151 -118 130 -223 -60 -89 55 110 51 64 174 97 321 230 141 -92
3379i2R0j52P5K13k4k36M13n60J54J78k08l8J30J06j95K63j26j53j93O06k25m0
$$ -92 -2 -154 -79 134 110 -126 287 -273 -119 59 -149 -187 -57 49 -146 117 -9 -162 -355 251 26 -14
3401a4K74k16j82K60q6l4j5J72K0l25o9J67L31k16r1k75K5O1K2p3K11N7q8r6J73
$$ -14 260 44 -138 122 36 2 -13 159 179 -146 -215 -48 283 67 -24 -299 -274 -213 -191 -264 -53 4 -84 -180 -7
3426gK3R8l08R0M0k1L24k6j78L11m8j52j39j5L4j14o5J96J55o7rJ5r8j95Q6J22
$$ -7 16 114 -194 -104 -64 -85 239 213 35 346 298 146 7 -8 26 -88 -153 43 198 131 122 137 39 -156 -70 52
3452E2N1k93K72j56j75L8M04l99M2j5l0L90Nj20m8J30k40K13R1r4K48n28J52J53
$$ 52 103 -190 82 -74 -249 -211 193 -206 -164 -179 -209 181 186 66 18 148 -92 121 212 118 366 -162 -10 143
3476A43l30J84J36k91j89J94R9kJ84j8l32K03n3r0J48qJ01k20m3K16R4Nj58O5
$$ 143 -187 -3 133 -158 -347 -153 -54 -56 128 110 -222 -19 -72 -162 -14 -22 79 -141 -184 32 126 131 -27 38
3500C8J06l23M04j57q8P2J3j46j17O2M16l05j34L3p8L38k12j16J81m75L61k11
$$ 38 144 -179 225 68 -20 52 65 -81 -198 -136 280 -25 -159 -126 -204 134 -78 -194 -13 -488 -127 -338
3522c38J39K87O1k01l06M10k19J76j3o2r4K26J47l35J40q3j5J49j80L37k5l2l62
$$ -338 -199 88 149 -52 -358 52 -167 9 -4 -66 -160 66 213 -122 18 -65 -80 69 -111 226 201 169 -193
3545a93L4J7R1M6k61L02l41K69j93R8K46k31J39k0j96M80j91J71l51J10m2K13
$$ -193 -159 -142 -51 -5 -266 36 -305 -36 -229 -131 115 -116 23 3 -193 287 96 267 -84 26 -16 197
3567A97p0j25K77j30j81K21J1l15J78j36P9k19KM76m29J83K2k23P2J24k9J13j46
$$ 197 127 2 279 149 -32 189 200 -115 63 -73 6 -213 -211 265 -164 19 41 -182 -110 14 -15 98 -48
3590d8O1K7M7j97m7M56m43M2K61J35l90J57j95R8M5q5L08l05L31k94J14p9lJ86
$$ -48 13 40 87 -110 -157 299 -144 -102 159 294 -96 61 -134 -36 9 -76 232 -73 258 -36 78 -1 -4 182
3614A82l71J22k25J02K19J04k65n6J45pj05Q3L07l45o7r1L54j74K52j57K6j21
$$ 182 -189 -67 -292 -190 29 133 -132 -188 -43 -50 -155 -72 235 -110 -177 -268 86 -88 164 7 33 -88
3636h8J08L15m19j52K13N8k2r9K16k69Lj37J44m2K23K5j4m7j52J58p8M7oK4J18
$$ -88 20 335 -84 -236 -23 35 13 -86 130 -139 -136 -273 -129 -171 52 77 63 16 -136 22 -56 -9 -15 9 127
3661A27j42j84L30J46J1m11J04k06L47J16j14N8j62j0j21J40j03q5L11k2l11J40
$$ 127 -15 -199 131 277 288 -123 -19 -225 122 238 124 182 20 10 -111 29 -74 -159 152 130 -181 -41
3683d1N9K3J83k52J27o2m0q8K38j45N7K69k3k92m8j40J39J04l8J14j83K82k72
$$ -41 18 41 224 -28 99 37 -3 -91 147 2 59 328 305 13 -35 -175 -36 68 30 144 -39 243 -29
3706b9o5O8j62R7K35j82r7j81K88j8J1N0l72K94M9J75j59P3k2qp5L17k35j6np6
$$ -29 -94 -26 -188 -91 144 -38 -135 -316 -28 -46 -35 15 -357 -63 -14 161 2 75 53 45 -30 287 52 36 31 -45
3732d5N8J70j91J68J64m55Q7J75j12j34J10j74K4lMJ32j62K38J49l77K16NM8K70
$$ -45 13 183 -8 160 324 -131 -44 131 19 -115 -5 -179 -155 -158 -154 -22 -184 54 203 -174 42 47 95 365
3756C65o54L43j56J12J33q6k33J88N5P3J37l23p3L2J07j63K59j96P9l62M78Q0
$$ 365 -289 54 -102 10 143 57 -176 12 67 140 277 -46 -119 -87 20 -143 116 -80 -1 -363 115 195
3778A95k20K7r5j38L23k6%p4J0j03o0Q9K77k68K17j97K22L1l66L14k37J5K35m24
$$ 195 -25 2 -93 -231 92 66 66 -8 2 -101 -161 -72 205 -63 154 -43 179 210 -156 158 -79 -64 171 -253
3802b53J72J5l85N48l4m3L4k27L08j44l3j73L0J71J97K1k80j64K55k55n7M97j51
$$ -253 -81 -66 -451 97 63 20 54 -173 135 -9 -42 -215 -185 -14 183 204 -76 -240 15 -240 -297 200 49
3825D9m2k02L47l63J14M02k62j24N9k29M3R0J09J30q0k94L73k64R2l14N18l90
$$ 49 7 -195 152 -211 -97 305 43 -81 -22 -251 -208 -118 -9 121 41 -253 120 -144 -52 -366 152 -238
3847b38M6l7J38n6L2k1J05J70j06J18j24l20K89j92K90J77k64K80l91K36n2J40
$$ -238 -192 -229 -91 -147 -115 -136 -31 139 33 151 27 -293 -4 -196 94 271 7 287 -104 132 80 220
3869B20k00r4M1K2j48K75j23K0k49K78J19j85J50j20J23J82l84R5L5j05M9J61
$$ 220 20 -74 -33 -11 -159 116 -7 13 -236 42 161 -24 126 6 129 311 -73 22 57 -48 1 162
3891A62j96J8J19P0j84R5o1l07L15r3M0K94l59r4J78l7J27k51m3J06J01j72L23
$$ 162 -34 -16 103 173 -11 84 23 -284 31 -62 -22 272 -87 -181 -3 -40 87 -164 -207 -101 0 -172 151
3914A51k73P6J71j2J8rm8m4J22k89Q2K2L30j56m7k27K02m6R6k7j22r6J20l15L14
$$ 151 -122 -46 125 113 131 122 74 30 152 -137 -55 -33 297 141 94 -133 69 23 119 92 -30 -126 -6 -321 -7
3939gR8k70O8K13q3J83j58K10j04j24L0N1J03k03J5N3j95J67RJ0J99j82j20J16
$$ -7 91 -179 -111 102 19 202 44 254 150 26 56 107 210 7 22 75 -120 47 56 66 265 83 -37 79
3963G9P5k58Q3j61P5m7Mo2J35j18j08K35K5l0n0J04P1N2j4j55r3K73n6k7l9k29
$$ 79 154 -104 -21 -182 -107 -154 -150 -212 -77 -195 -303 -68 -43 -73 -123 -19 52 104 90 -65 -158 115 59 32 -7 -236
3989b36L88Mk91k49O91m60K84J8j44M4O6l62MJ40K22k08M0K61m10K70k6N7J84
$$ -236 152 156 -135 -384 307 -153 131 149 5 49 115 -247 -243 -103 119 -89 -49 212 -198 72 46 103 287
4012B87l47j00R1J10K1J21N9m9j37r2M3K36k08J87k6l17n3J43Lk5j95K63j6P1
$$ 287 -60 -160 -69 41 62 183 242 193 56 -36 7 243 35 222 196 -121 -174 -31 -28 -53 -248 15 -1 70
4036G0nk15j58M08l03K68J50l37R2N7K17m08K83J0j29L5K5j7J62k58Q5L5m6j04
$$ 70 65 -150 -308 100 -203 65 215 -122 -30 27 244 -164 119 129 0 35 60 43 205 -53 32 67 21 -83
4060h3O1j08K0m4K59l30J34J44L7K9k7k55K50j02m4j55K22O4m1OJ74j8l80L42
$$ -83 -22 -130 -110 -154 105 -225 -91 53 90 119 92 -163 87 -15 -59 -214 8 72 31 37 211 193 -187 155
4084A55k39L56k81Q9P3l4nM3l40O9o8K2J75j37P4j2m6j21J17Mm8K34J31k29K3
$$ 155 -84 272 -9 80 153 119 114 157 -183 -114 -182 -160 15 -122 -48 -60 -106 -227 -110 -106 -154 80 211 -18 5
4109EJ01j58J55j15j27K81k17K79j86K79m43J87j73p5K34N2j87K25o9k37O1P3
$$ 5 106 -52 103 -12 -139 142 -75 204 18 297 -146 41 -132 -207 27 79 -108 117 48 -189 -128 -55
4131e5J7R4j6K0l93J57L26Q2q4j11j41J91j41K19n3n3j31p7K39P2rJ93l18n3j41
$$ -55 -38 56 40 60 -333 -176 150 232 148 37 -104 87 -54 165 112 59 -72 -149 90 162 153 346 28 -25 -166
4156a66J43J56r0Pk94r4K99L5j75J22K3nqQ9r4q7J38J25j28P4j47N4R4j11J1k22
$$ -166 -23 133 43 50 -244 -338 -39 -4 -179 -57 -34 -39 -47 42 -52 -139 -1 124 -4 70 -77 -23 71 -40 -29 -251
4182b51L66r7K68l12J65J0k59L4K18j03L3p7j12m7j04M10k33p4K58M0j43p4M5
$$ -251 115 18 286 -26 139 149 -110 -76 142 39 72 -5 -117 -164 -268 142 -91 -165 93 133 -10 -84 -39
4205c9P4J58j89J07L8l36J73K17j26k00L64l39J94Ok20J07j25K41r8j8J57j97
$$ -39 35 193 4 111 149 -187 -14 203 77 -123 241 -98 96 102 -118 -11 -136 105 7 -11 146 -51
4227e1Rk0M3j02N2NnJ82k0j77R9j37K01K04l70J19P0N0k20J96j88J08mj12k5O7
$$ -51 -42 -62 -19 -121 -69 -64 -69 113 93 -84 15 -122 79 283 -87 32 102 152 -68 128 -60 48 44 -68 -93 -26
4253b6k5K1R2l43K55K54l83J51O2J3M1k36J21q1j1m3j30J40L14k9j76Q2n1k9q1
$$ -26 -51 -30 62 -281 -26 228 -155 -4 58 71 112 -124 -3 -84 -95 -138 -268 -128 186 157 -19 63 12 -17 -98
4278i8o2J98k35K11l4j65L6k8J21J9l3m2J94Nk1j39q3K29l06KK83k22J04K9jJ26
$$ -98 -160 38 -197 14 -20 -185 -149 -177 -56 -37 -70 -112 82 87 66 -73 -156 73 -233 -231 52 -170 -66 -37 -38 88
4304H8J05k37K98l57R1J4K09o3j21k3j04o7Q9Q8j84J4J44j45K30k65R9l6L6J53
$$ 88 193 -44 254 -103 -12 2 211 148 27 4 -100 -167 -78 10 -174 -160 -16 -161 69 -196 -97 -133 -97 56
4328E6k35N8J13J35j35j36J58L8Q7j63J02%l2j18q1K56J55j52r4M1J5J1L6P2k51
$$ 56 -179 -121 -8 127 -8 -144 14 52 139 -24 78 78 46 -72 -153 103 258 106 12 53 68 79 115 187 -64
4353f4q0Q2q2J71k93K65m3q2J44k3l5J0J33j05R3j04k2K55k93j81M14k48K29k55
$$ -64 -144 -62 -144 27 -266 -1 -44 -126 18 -5 -40 -30 103 -2 91 -13 -35 220 -73 -254 160 -88 141 -114
4377a14J72j15L8M8L8M9l2k0k2L3P5j56q2O2k50L24%J3j87J60K11R2m35J89j59
$$ -114 58 -57 -19 29 67 116 84 64 42 75 150 -6 -88 -26 -276 48 48 61 -126 34 245 337 -98 91 -68
4402f8J85j36j58J55O0p6J03K37n62N46l91L19j63q5J9m9L40k71J61j75n7%p3
$$ -68 117 -19 -177 -22 38 -38 65 302 -260 286 -105 214 51 -34 -15 -64 276 5 166 -9 -66 -66 -139
4425a39K81j66m5n1P2Q1L1N3r3jj3L14l18K33k76O9q8K19qj81J6k50L97k38Q6
$$ -139 142 -24 -69 -120 -48 33 64 117 24 23 10 324 6 239 -37 32 -56 163 155 -26 -10 -260 137 -101 -15
4450a5k45L65j98J54m6r8K10k60J64Q0L7k65K43j35N1P7j58J55j94J13j23M8J06
$$ -15 -260 105 -93 61 15 -83 127 -133 31 111 148 -117 126 -9 42 119 -39 116 -78 35 -88 -40 66
4473F6j32J49j13q3J35K1j81q2J61r2M6N4k0J74k9k09R0M0L3k49L3R2N1jj7J71
$$ 66 -66 83 -30 -113 22 43 -138 -220 -59 -151 -105 -51 -71 103 74 -135 -45 -5 28 -221 -188 -96 -45 -46 -63 108
4499A08k06K75j13m4k61K24p5M6j7J39q2K00k46m9P7M5Qp6J0L2Nk60K56m3K41
$$ 108 -98 177 64 20 -241 -17 -92 -46 -63 76 -6 194 -52 -101 -24 21 29 -47 -37 -5 0 -260 -4 -47 194
4524A94j67j07N8J00R0l47J33p0J09O1k1J32k20J90l44K47J00k33nJ86k16K42
$$ 194 27 -80 -22 78 168 -179 -46 -116 -7 54 33 165 -55 135 -209 38 138 -95 -100 86 -130 112
4546A12L0K3j75p4J72N1k62L1m5J15l4j34O2J2O3mL10j35k72J14K12j08o5K4r2
$$ 112 142 165 -10 -84 88 139 -123 -92 -137 -22 -56 -190 -128 -116 -53 -57 253 118 -154 -40 172 64 -1 23 -69
4571f9J52J30j50o8J59j71o8K76k51J54j00j04J60j99o1R4J87j86J11m4N6M2J89
$$ -69 83 213 63 -5 154 -17 -85 191 -60 94 -6 -110 50 -149 -210 -116 71 -115 -4 -48 8 50 239
4594B39j72oj6j05J38O4jl10J48o4P2J92k27ok7K0J98l28K01Lj24L07r1k18j1
$$ 239 67 61 45 -60 78 142 141 -169 -21 -85 -13 179 -48 -54 -81 -61 137 -191 10 13 -111 196 105 -113 -124
4619a24j02m2M25n5j89r5K89j33K26j8k66J72J45j52j7J00l24J73J94r1l00J00
$$ -124 -226 -268 157 102 -87 -182 107 -26 200 182 -84 88 233 81 64 164 -160 13 207 116 -184 -84
4641h4K16l0j88J60Ol9k35K2L12l5l45K63o1n1K53m2k32K55J65k99M7r2J13j72
$$ -84 132 102 -86 74 80 41 -194 -172 140 105 -240 23 -38 -89 164 122 -110 145 310 11 58 -34 79 -93
4665i3K35p7j63J74k1o5P4j84J42n3J79l0j43q9L17o0j23Q1k57J05N5j43P2k46
$$ -93 142 65 -98 76 55 -10 64 -120 22 -31 148 118 -25 -114 203 143 20 101 -156 -51 4 -139 -67 -313
4689c13M53k74K37j06R4k09K52J31n5k36J05o8P1Q6j89R0p5J1q7j1J18R7l97K91
$$ -313 140 -134 103 -3 91 -118 134 265 210 -26 79 11 82 168 -21 69 -6 5 -82 -93 25 122 -275 16
4713A6J20J6l13j8J29J46l18M16j23J5n4Q5k66j2M75k62Q9r1r3K19k17J25j19
$$ 16 136 152 -161 -179 -50 96 -222 194 71 86 32 117 -149 -161 314 52 141 50 -43 176 -41 84 -35
4736c5j13J7J15r2O5o9j11Q2K70j94J01O7j52K15p9q0j0K84k82Q8l2j00K00j97
$$ -35 -148 -131 -16 -108 -43 -112 -223 -141 129 -65 36 103 -49 166 87 7 -3 281 -1 87 55 -45 155 -42
4760d2N0Q7o7K12j32Ml58K20pp6r1K81K5N9j96j99J90K22m52K63q9R1J77k43R9
$$ -42 8 95 28 240 108 112 -246 -26 -33 -109 -200 81 106 165 -31 -230 -40 182 -270 -7 -96 -5 172 -71 28
4785B8j10L4P8J02k67%P0J28J84k36j86M05j38l21K59q9K00j45j88L06j55J56
$$ 28 -82 -48 30 132 -135 -135 -65 63 247 11 -175 230 92 -229 30 -59 141 -4 -192 114 -41 115
4807A15K3j8j08j46J96k54J32O9j0j40R1L2l0J79j14p8J15J51j02m1o3j81K75
$$ 115 138 120 12 -134 62 -192 -60 9 -1 -141 -50 -18 -48 131 17 -61 54 205 103 62 -1 -182 93
4830I3r2r7L66k94J06k37M32n31J98K79k90K41j14j57l29K90j2J04k59L90j12
$$ 93 1 -96 270 -24 82 -155 277 -254 -56 223 -67 174 60 -97 -426 -136 -148 -44 -303 87 -25
4851b5J22k33K05L5p0k0J37r2Q9k44J02O0K02m88Q8K25j58J61m7k18J60J26k10
$$ -25 97 -136 69 104 34 14 151 59 148 -96 6 66 268 -220 -132 93 -65 96 49 -169 -9 117 -93
4874i3Q9K18j42l6j29J05p4J84Q0l48K45j9p2J26k51L37l52O6J29m8J13j77K10
$$ -93 -4 214 72 36 -93 12 -62 122 202 -146 99 80 8 134 -117 220 -132 -66 63 15 128 -49 161
4897A61j11r1k2r8K63q5j95J07j82L72j62K4j28J70L5k71K21l4J13k71K25j29
$$ 161 50 -41 -63 -161 102 17 -178 -71 -253 119 -43 -19 -147 23 58 -213 8 -26 87 -184 41 -88
4919h8J75m7o3K66j70qr7J54n6m6j29j70M21N7r7j88KK56k45l7J23M6j88J47J59
$$ -88 87 40 -23 243 73 65 -32 122 66 20 -109 -279 142 199 102 -86 -84 172 -73 -110 13 59 -129 18 177
4944A77k4k71p1Q4J44j33l7P3J89k30P4j21K66P9j51J3J28k89K57k64J04Q7lj57
$$ 177 153 -118 -189 -105 39 -94 -131 -58 131 -99 -25 -146 120 199 48 61 189 -100 157 -107 -3 84 81 -76
4968g6L27o5l32K9n0J57k04J68o5N9J2J80L6n45M09j47P3P0J59j0k26K50l37J35
$$ -76 251 186 -146 -117 -167 -10 -214 -46 -111 -52 -40 140 176 -369 40 -107 -34 36 195 185 -41 209 -128 7
4992Gj04R3J21k43L14l33j7J41j77K70j45r4N3l9n8K90j63M2P7j08K75k89j08
$$ 7 -97 -4 117 -126 188 -145 -162 -21 -198 72 -73 -167 -114 -153 -211 79 -84 -42 35 -73 202 -87 -195
5015a95K23L28l73J05k58L24N3m20L30k39J07P3r5J62L4P8k64p9J18j23J5J43
$$ -195 28 356 -17 88 -170 154 207 -213 117 -122 -15 58 -37 125 159 237 -27 -106 12 -111 -96 47
5037D7n6q1J11J50q4q7P2l19K19K14j53m3m0Ro8K63L2k39J41O7j34p0P5k53L92
$$ 47 -9 -90 21 171 87 0 72 -247 -28 186 33 -10 -50 -41 -109 154 186 -53 88 155 21 -49 26 -227 165
5062A65j88P2o3O9J3M3K3l52L30m2L9j69J14M8k57R5L2j08N0K4K08k22J09J00
$$ 165 -23 49 -14 55 68 111 134 -218 112 70 109 -60 54 102 -155 -60 -28 -136 -86 -62 146 -76 33 133
5086A33k09O9J12k8m8j58J37M2n6J04k19J86k41J58N2j20j08n7K99k95K67m3j75
$$ 133 -76 -7 105 77 29 -129 8 50 -6 98 -121 65 -176 -18 34 -86 -194 -251 48 -247 20 -23 -198
5109a98K12J9j07J86j92J13P5n2P0k32J85J7j20N3m7J60j31O6j60K26o1n3k08
$$ -198 14 33 -74 112 -80 33 108 56 126 -106 79 96 -24 29 -18 142 11 77 -83 143 82 29 -179
5132a79J82K5j08K81j62j82K36l4j69J20J79l64M32l08j21kL17k16J73k7j92J16
$$ -179 3 28 -80 201 39 -143 93 59 -110 10 189 -175 257 -51 -172 -174 143 -73 100 73 -119 -3
5154cJ10j46j56K95r5k6L25k90j8O6j2n6m7J06j26R0K4qqo2N6L9j29r2J36M7j27
$$ -3 107 -39 -195 100 5 -21 304 14 -4 62 50 -6 -53 53 -73 17 41 33 25 -37 19 58 -71 -163 -27 20 -107
5181a07j34K38PJ13J9k99M70l31J46j2%NNp4j27J15JJ47l84J63LM7j21J34m6M1
$$ -107 -241 -3 4 117 136 -163 307 -24 122 110 110 115 120 46 -81 34 35 182 -202 -39 -36 11 -110 24 -22 19
5207A9K34j33O5p5J69l14J27J06j47J13j42P8j69K71k13Q7oj83J89j30m4k1O8
$$ 19 253 120 185 110 279 -35 92 198 51 164 22 100 -69 202 -11 76 70 -113 76 -54 -98 -119 -51
5230e1K55k77J27j75J03J68l40J38K28j79Qpj8J15k1J9Q2j20J20j06L1j68R4J92
$$ -51 204 -73 54 -121 -18 150 -190 -52 176 -3 5 -2 -20 95 74 93 175 55 175 69 100 -68 26 218
5254B18l70K5J16J61k40J41j08k56K42n5J29R4L1l20J89Q9k09K63j31n9P4l2m5
$$ 218 -152 -127 -11 150 -90 51 -57 -313 -71 -126 3 97 128 -192 -3 86 -123 140 9 -50 24 -8 -53
5277e3J97j19J51j39p7Q4k36J78O0j35J07j03K80l03j1l6M4J01K36k46M8Q1o4
$$ -53 144 25 176 37 -40 44 -192 -14 46 -89 18 -85 195 -108 -119 -155 -111 -10 226 -20 28 109 45
5300D5m2J95j27J3J56k12k54L60r5q2j39K12j22J8J8J14J33M2m43K76j5J08j27
$$ 45 3 198 71 84 240 28 -226 134 39 -43 -182 30 -92 -74 -56 58 191 233 -210 66 51 159 32
5323C2j37l9j91L50O4j9l64M51j55J83k74j3J85p5j59r1m8K37K01Ml45J43J74
$$ 32 -105 -144 -335 15 79 60 -304 147 -8 175 -99 -112 73 -2 -161 -252 -300 -63 138 142 -203 -60 114
5346A14j23K6P9j54J42o2N3k10J52j03JQP5j07K44K2j15M7l5j8mj5Q0J27j56J47
$$ 114 -9 17 96 -58 84 22 75 -135 17 -86 -85 -77 -2 -109 135 157 42 89 54 36 32 17 97 224 68 215
5372B15n26J84L24j17k03K00j04L9J14J64k45O5l6l08K57M7j21k02K16N2j79o5
$$ 215 -311 -127 197 80 -123 77 -27 12 126 290 45 110 74 -234 23 70 -51 -253 -37 15 -164 -229
5394b29K07J45j53Q6N2J73j34k64K80o6j96J20q5P9k0j58K61L9m6Lk42J64m5O6
$$ -229 -22 123 -30 56 108 281 147 -117 163 97 -99 21 -64 15 -5 -163 98 137 91 94 -148 16 -29 37
5418C7q1Q3k91J62PJ01j19j07L45K4j27k64L75L5k30oR0m2J68r3M2M3k54r8q0
$$ 37 -44 39 -252 -90 -83 18 -101 -208 137 161 34 -230 145 180 -50 -56 34 -8 160 67 109 152 -102 -200 -280
5443b80K11J34j97K28J44k62O6k0l76J29K74p2K19k72o6K50k57J49k16M77j46
$$ -280 -69 65 -132 96 240 -22 44 24 -352 -223 51 -21 198 -74 -140 110 -147 2 -214 263 117
5464A17J57l83J70r9j23K29P5J41l25j06N9K34k67L6O7J72k10L2k03M75l43K51
$$ 117 274 -109 61 -38 -161 68 143 284 -41 -147 -88 146 -121 -85 -18 154 -56 -24 -227 248 -95 156
5486A56j55j65P7K45r5k97K11L0L7n9jm3Q2K85n84N37j21l69L88nj73j4K3J21
$$ 156 1 -164 -87 158 63 -234 -23 7 44 -15 -16 -59 23 308 -276 261 140 -229 159 154 -19 -33 -10 111
5510A11%j27n3J77j00K03l99L39j40j37K40k49Q5p9K23k09M71m93M7j33L45K7
$$ 111 111 -16 -69 108 8 211 -188 151 11 -126 114 -135 -50 -129 94 -115 356 -137 -90 -223 122 149
5532A49j21j31p6K61j10o5K03Ln3J54k13J3m0J07q5K84l82J73k13N4n1Q7l9k0
$$ 149 28 -103 -179 82 -28 -93 110 113 60 214 1 14 -26 81 -4 280 -102 71 -142 -88 -139 -52 -91 -111
5556a11M3R7r6J23p2Rn5N4M4k2K38l0l6J31j26l10J73R4q7l08K83J11j16O5o8
$$ -111 -68 29 -67 56 -16 -7 -62 -8 36 14 252 222 186 317 191 -119 54 148 61 -247 36 147 31 96 28
5581B8L03l62l7K6J69k32K11q5J22K3k04n8p8O2L48j24k79J17l1L02k42j18rJ39
$$ 28 331 -31 -68 -42 127 -105 106 21 143 166 -38 -96 -174 -112 236 112 -167 -50 -81 221 -21 -139 -148 -9
5605io9K5LJ55l5r8O2l8P0O1Lk02L17m15O5J66j83J75J46r8k9k24J40rJ63l05
$$ -9 -78 -53 -50 105 70 -28 34 -4 66 127 130 -72 245 -170 -105 61 -122 53 199 101 72 -152 -12 -21 142 -163
5631a63J18R5k10J53J29j67k25L89j45J11L3l02K81k41K60j10N7r3j98K64j49
$$ -163 -45 50 -160 -7 122 -45 -270 119 -26 85 118 -184 97 -144 116 6 63 -30 -228 36 -113
5652a13J37J37j28j67J19j91M97k99K7p6K78l01J38j02N8Jm1O1J9j63L3J07lk71
$$ -113 24 161 33 -134 -15 -206 291 -8 19 -57 221 -80 58 -44 14 15 -26 35 54 -109 -76 31 28 -243
5676b43P6J76j74J0J77O8j72R6J69m14K99k62k1M18j57J69k15J0q0r3M33k3r3
$$ -243 -167 9 -165 -155 22 90 -82 14 183 -231 68 -194 -215 203 46 215 0 10 -70 -163 270 247 154
5699A54n8n0K25l41j0M1K83m02J82R9k66j17L15l21K87j04K55m3j8j24L2Lj0q4
$$ 154 96 46 271 -70 -80 -39 244 -158 24 123 -143 -260 55 -266 21 -83 172 129 111 -13 19 22 12 -72
5723g2J08r2J17lP2j67J53j0j62Q6R2O5j46j78N3kJ58j61K6J32j91J13J46j52
$$ -72 36 -56 61 58 130 -37 116 106 -56 30 122 187 41 -137 -84 -86 72 -89 -63 69 -122 -9 137 -15
5747a5j36J35R3j70O4p2L13p0j61RJ46k84K40J1o0K3l25L02j00M1j41J36o3R7
$$ -15 -151 -16 77 -93 -29 -101 212 142 -19 -10 136 -148 92 103 43 66 -259 43 -57 -16 -157 -21 -84 13
5771A3j7K15k09r9J21j59J79qJ16j36L8l5j33L01j72j09o3P6K3K75l65L32j06
$$ 13 -4 211 2 -97 24 -135 44 36 152 16 54 19 -114 187 15 -94 -157 -81 -58 217 -148 184 78
5794G8o7O4j24j1o1J48k77K09o8K19k12K05l23J95Q3q2R8p6n6J87j36m7M3j4J09
$$ 78 11 75 -49 -60 -121 27 -250 -41 -109 110 -102 103 -220 -25 58 -24 74 -2 -58 129 -7 -54 -11 -25 84
5819H4L2j96K97l12J56r3L31J1l46J76j87q9K5L40j12r7J35k23K20j97J9O6J5
$$ 84 116 -80 217 -95 61 -32 299 310 -36 140 -47 -136 -111 229 117 20 155 -68 152 -45 -26 40 55
5842E5L8J8j46l0N0k49L17r7J79j20L08l96m6L13k92J99j11J25m5o0o9Q5R6O7
$$ 55 93 111 -35 -65 -15 -264 53 -44 135 15 323 -73 -119 194 -98 101 -10 115 70 10 -59 26 122 189
5866A89k29J94j11J60j91n8K42k35J8k4j4l1M9J89j88P4K11k81k55L82m4m1j31
$$ 189 -40 154 43 203 12 -46 196 -39 -21 -45 -59 -90 -41 148 -40 34 245 -36 -291 91 47 6 -125
5889a25P9K65j26P9j0k40K31j68J55o2q2J86k74M9l8Q9J26j94L18j49k51J95k38
$$ -125 -46 219 93 172 162 -78 153 -15 140 78 -4 182 -92 -43 -81 8 134 -60 258 109 -142 53 -185
5912a85K27j36j17J14J85Oj55J43j98Q8J41j04l7n9J69K0l09J72J63k35J53L5
$$ -185 42 -94 -211 -97 88 94 -61 82 -116 -28 113 9 -28 -87 82 102 -207 -35 128 -107 46 81
5934H1j51k48J94K02M2J34k03k35J65r0O9j9q7L5m2J60K5l8J36j60j99J40j7K67
$$ 81 -70 -318 -124 78 120 254 51 -184 -19 -109 -40 -59 -146 -111 -153 7 32 -6 130 -30 -229 -89 -106 161
5958A61o6k19L14m76L79Qj0j12m2J86j24J76k31j40J48K36j89o4J21K1k59J93
$$ 161 95 -124 190 -286 93 101 91 -21 -63 123 -1 175 -56 -196 -48 188 -1 -65 56 77 -182 11
5980A1q9J48J86k48Ok3k9P3p5j13J80r9q0K03J7j20J43J0r3M0j28N7o1K06j17
$$ 11 -78 70 256 8 14 -9 -38 35 -40 -153 27 -72 -152 51 68 -52 91 101 8 48 -80 -23 -84 122 5
6005El6K33k03M8k00L07j24j79M1J61j14j82J67Q6j51P7J10L18n7j39J12r4k09
$$ 5 -31 202 -1 47 -153 154 30 -149 -108 53 -61 -243 -76 10 -141 -64 46 364 307 168 280 186 -23
6028b3k54L02J25j62J83r3r0k23J41K76k85K45j74rO8j97K56r8N6j50R6J22J27
$$ -23 -277 25 150 -12 171 78 -12 -235 -94 182 -103 142 -32 -41 27 -170 86 -12 44 -106 -10 112 239
$$ [...]
8191A6
##END NTUPLES=NMR FID
##END=
