##TITLE=1H_Ser 6-6
 CDCl3
 8 sc, 
 17.02.2022
##JCAMPDX= 6.0         $$ Bruker NMR JCAMP-DX V2.0
##DATA TYPE= NMR FID
##DATA CLASS= NTUPLES
##ORIGIN= UXNMR, Bruker Analytische Messtechnik GmbH
##OWNER= root
$$ XWIN-NMR		Version 3.5
$$ Thu Feb 17 09:29:06 2022 Russian Standard Time (UT+4h)  she@DPX200
##.OBSERVE FREQUENCY= 200.131346
##.OBSERVE NUCLEUS= ^1H
##.DELAY= (6, 6)
##.ACQUISITION MODE= SIMULTANEOUS
##.ACQUISITION SCHEME= undefined
##.AVERAGES= 8
##.DIGITISER RES= 18
##SPECTROMETER/DATA SYSTEM= spect
##.PULSE SEQUENCE= zg30
##.SOLVENT NAME= CDCl3
##.SHIFT REFERENCE= (INTERNAL, CDCl3, 0, 15.7039)
##AUDIT TRAIL= $$ (NUMBER, WHEN, WHO, WHERE, WHAT)
$$ ##TITLE= Audit trail, XWIN-NMR		Version 3.5
$$ ##JCAMPDX= 5.01
$$ ##ORIGIN= Bruker BioSpin GmbH
$$ ##OWNER= she
$$ F:/spectra/data/she/nmr/H-F/1/audita.txt
$$ ##AUDIT TRAIL=  $$ (NUMBER, WHEN, WHO, WHERE, WHAT)
(   1,<2022-02-17 09:27:52.70 +0400>,<she>,<DPX200>,
      <created by zg, POWCHK disabled, PULCHK disabled
       configuration hash MD5:
       00 E9 B6 7A A2 85 ED C7 34 08 36 98 17 FE 4E 26
       data hash MD5: 16K
       4F 16 6A 0A B0 32 50 52 29 2D 99 80 80 C8 2C AF>)
$$ ##END=
$$ 
$$ hash MD5
$$ 93 70 B1 92 01 BF E4 DA 10 92 CD F8 EA 06 3E 0F
##$RELAX= 
##$RELAX= 
##$RELAX= 
##$RELAX= 
##$RELAX= 
##$RELAX= 
$$ Bruker specific parameters
$$ --------------------------
##$DU= <F:/spectra>
##$EXPNO= 1
##$NAME= <H-F>
##$PROCNO= 1
##$TYPE= <nmr>
##$USER= <she>
##$AMP= (0..31)
100 100 100 100 100 100 100 100 100 100 100 100 100 100 100 100 100 100 
100 100 100 100 100 100 100 100 100 100 100 100 100 100 
##$AQSEQ= 0
##$AQ_mod= 1
##$AUNM= <au_zg>
##$AUTOPOS= <>
##$BF1= 200.13
##$BF2= 200.13
##$BF3= 200.13
##$BF4= 200.13
##$BF5= 200.13
##$BF6= 200.13
##$BF7= 200.13
##$BF8= 200.13
##$BYTORDA= 1
##$CFDGTYP= 0
##$CFRGTYP= 5
##$CHEMSTR= <none>
##$CNST= (0..31)
1 1 145 1 1 1 1 1 1 1 1 1 1 1 1 1 1 1 1 1 1 1 1 1 1 1 1 1 1 1 1 1 
##$CPDPRG= <>
##$CPDPRG1= <>
##$CPDPRG2= <>
##$CPDPRG3= <>
##$CPDPRG4= <mlev>
##$CPDPRG5= <mlev>
##$CPDPRG6= <mlev>
##$CPDPRG7= <mlev>
##$CPDPRG8= <mlev>
##$CPDPRGB= <>
##$CPDPRGT= <>
##$D= (0..31)
0 1.2 0 0 0 0 0 0 0 0.06 0 0.03 0 0 0 0 0.0002 0 0 0 0 0 0 0 0 0 0 0 0 
0 0 0 
##$DATE= 1645075672
##$DBL= (0..7)
120 120 120 120 120 120 120 120 
##$DBP= (0..7)
150 150 150 150 150 150 150 150 
##$DBP07= 0
##$DBPNAM0= <>
##$DBPNAM1= <>
##$DBPNAM2= <>
##$DBPNAM3= <>
##$DBPNAM4= <>
##$DBPNAM5= <>
##$DBPNAM6= <>
##$DBPNAM7= <>
##$DBPOAL= (0..7)
0.5 0.5 0.5 0.5 0.5 0.5 0.5 0.5 
##$DBPOFFS= (0..7)
0 0 0 0 0 0 0 0 
##$DE= 6
##$DECBNUC= <off>
##$DECIM= 32
##$DECNUC= <off>
##$DECSTAT= 4
##$DIGMOD= 1
##$DIGTYP= 9
##$DL= (0..7)
0 120 120 120 120 120 120 120 
##$DP= (0..7)
150 150 150 150 150 150 150 150 
##$DP07= 0
##$DPNAME0= <>
##$DPNAME1= <>
##$DPNAME2= <>
##$DPNAME3= <>
##$DPNAME4= <>
##$DPNAME5= <>
##$DPNAME6= <>
##$DPNAME7= <>
##$DPOAL= (0..7)
0.5 0.5 0.5 0.5 0.5 0.5 0.5 0.5 
##$DPOFFS= (0..7)
0 0 0 0 0 0 0 0 
##$DQDMODE= 0
##$DR= 18
##$DS= 0
##$DSLIST= <SSSSSSSSSSSSSSS>
$$ [...]
##$SUBNAM2= <"">
##$SUBNAM3= <"">
##$SUBNAM4= <"">
##$SUBNAM5= <"">
##$SUBNAM6= <"">
##$SUBNAM7= <"">
##$SUBNAM8= <"">
##$SUBNAM9= <"">
##$SW= 18.0517287032376
##$SWIBOX= (0..15)
0 0 2 0 0 0 0 0 0 0 0 0 0 0 0 0 
##$SW_h= 3612.71676300578
##$TD= 16384
##$TD0= 1
##$TE= 0
##$TE2= 300
##$TE3= 300
##$TEG= 300
##$TL= (0..7)
0 120 120 120 120 120 120 120 
##$TP= (0..7)
150 150 150 150 150 150 150 150 
##$TP07= 0
##$TPNAME0= <>
##$TPNAME1= <>
##$TPNAME2= <>
##$TPNAME3= <>
##$TPNAME4= <>
##$TPNAME5= <>
##$TPNAME6= <>
##$TPNAME7= <>
##$TPOAL= (0..7)
0.5 0.5 0.5 0.5 0.5 0.5 0.5 0.5 
##$TPOFFS= (0..7)
0 0 0 0 0 0 0 0 
##$TUNHIN= 0
##$TUNHOUT= 0
##$TUNXOUT= 0
##$USERA1= <user>
##$USERA2= <user>
##$USERA3= <user>
##$USERA4= <user>
##$USERA5= <user>
##$V9= 5
##$VALIST= <valist>
##$VCLIST= <CCCCCCCCCCCCCCC>
##$VD= 0
##$VDLIST= <DDDDDDDDDDDDDDD>
##$VPLIST= <PPPPPPPPPPPPPPP>
##$VTLIST= <TTTTTTTTTTTTTTT>
##$WBST= 1024
##$WBSW= 4
##$XGAIN= (0..3)
0 0 0 0 
##$XL= 0
##$YL= 0
##$YMAX_a= 607798
##$YMIN_a= -901036
##$ZGOPTNS= <>
##$ZL1= 120
##$ZL2= 120
##$ZL3= 120
##$ZL4= 120
##$ABSF1= 10
##$ABSF2= 0
##$ABSG= 5
##$ABSL= 3
##$ALPHA= 0
##$AQORDER= 0
##$ASSFAC= 0
##$ASSFACI= 0
##$ASSFACX= 0
##$ASSWID= 0
##$AUNMP= <proc_1d>
##$AZFE= 0.1
##$AZFW= 0.1
##$BCFW= 1
##$BC_mod= 2
##$BYTORDP= 1
##$COROFFS= 0
##$CY= 11.3945322036743
##$DATMOD= 1
##$DC= 2
##$DFILT= <>
##$DTYPP= 0
##$F1P= 2.36226072786647
##$F2P= -0.459571619588291
##$FCOR= 0.5
##$FTSIZE= 0
##$FT_mod= 4
##$GAMMA= 1
##$GB= 0.15
##$INTBC= 1
##$INTSCL= 1
##$ISEN= 128
##$LB= 0.24
##$LEV0= 0
##$LPBIN= 0
##$MAXI= 10000
##$MC2= 0
##$MEAN= 0
##$ME_mod= 0
##$MI= 1.114404
##$NCOEF= 0
##$NC_proc= 0
##$NLEV= 6
##$NOISF1= 3.799351
##$NOISF2= 2.8
##$NSP= 1
##$NTH_PI= 0
##$NZP= 0
##$OFFSET= 15.70392
##$PC= 1
##$PHC0= -16234.97
##$PHC1= 18.80078
##$PH_mod= 1
##$PKNL= yes
##$PPARMOD= 0
##$PSCAL= 0
##$PSIGN= 0
##$REVERSE= no
##$SF= 200.130013532006
##$SI= 16384
##$SIGF1= 3
##$SIGF2= 2
##$SINO= 400
##$SIOLD= 16384
##$SREGLST= <1H.CDCl3>
##$SSB= 0
##$STSI= 0
##$STSR= 0
##$SW_p= 3612.71676300578
##$SYMM= 0
##$S_DEV= 0
##$TDeff= 0
##$TDoff= 0
##$TI= <>
##$TILT= no
##$TM1= 0
##$TM2= 0
##$TOPLEV= 0
##$USERP1= <user>
##$USERP2= <user>
##$USERP3= <user>
##$USERP4= <user>
##$USERP5= <user>
##$WDW= 1
##$XDIM= 8192
##$YMAX_p= 0
##$YMIN_p= 0
$$ End of Bruker specific parameters
$$ ---------------------------------
##NTUPLES= NMR FID
##VAR_NAME=  TIME,          FID/REAL,        FID/IMAG
##SYMBOL=    X,             R,               I
##VAR_TYPE=  INDEPENDENT,   DEPENDENT,       DEPENDENT
##VAR_FORM=  AFFN,          ASDF,            ASDF
##VAR_DIM=   8192,          8192,            8192
##UNITS=     SECONDS,       ARBITRARY UNITS, ARBITRARY UNITS
##FACTOR=    0.0002768,     1,               1
##FIRST=     0,             0,               0
##LAST=      2.2672688,     0,               0
##MIN=       0,             -901036,         0
##MAX=       2.2672688,     607798,          0
$$ Real data points
##PAGE= N=1
##DATA TABLE= (X++(R..R)), XYDATA
$$ [...]
2056E4p9k92n2K45J49j79j4k24J73L00K83l09m25L30J5M15k5p9k94J3L95R2o2
2079D30p47j3M74j30M28m28l58M8L48O7O6n66p0M83j39J1j80j10j36P65J6k21
2101C8j43mM1N70k16m81J51q8M30J5K27o82j80R8M38k87L6n01L14J63J01J42o77
2124d95p4K37N06K2j41j64k78L05L83k02j36o2J56O22p4l99l80K53J71J11N6o34
2146b17j12M8N51J10p36k04N2M11K75r3l84o4J11L08J52j91k65j67N68K22m7j35
2168A93l49K05M26R5m34l11Q0M4K79j27n97p8K76J36N15o94k22l7O98K57q7n64
2190b96l11O87J72N1o6l09k62N33L07n7n90J58j92N37L48m61o77l1N49J46j13
2211A23n97n8q8Q81p5k75l66k4O05R9k20l32j12L01L51M19m70l93J66N13K89l63
$$ y = [54, -25, -317, -369, -124, 25, -154, -168, -392, -219, 81, 364, 55, -370, -40, -25, 390, 365, 286, -8, 5, 400, 492, 430, -317, -330, 144, 14, 442, 14, -344, -296, 52, 119, 185, -381, -451, 32, -107, -96, -276, -386, -522, 243, 259, 38, -105, -109, -68, 502, 286, -195, -44, -132, 298, 313, 540, -142, -322, -224, 214, -73, -37, -538, -224, -61, 40, 182, -495, -569, -332, 174, 196, 55, -109, -387, -82, 301, 99, -37, -99, 57, 679, 605, 206, -174, 79, 250, 361, 417, -217, -329, -281, 270, 380, -356, -560, -508, -97, 178, 85, -299, -363, -252, 56, 208, 17, -248, -415, 153, 375, 328, 193, -156, 49, 475, 570, 136, -175, -95, -51, 228, 101, -496, -574, -298, -162, 353, -341, -563, -600, 98, 355, 268, -296, -607, 80, 252, 303, 237, -72, -334, 199, 506, 449, -141, 17, -175, 362, 710, 249, -428, -459, 90, 236, 123, -474, -532, -620, 261, 186, -89, -455, -479, 126, 225, 5, -327, -439, -138, 213, 632, 162, -231, -65, 448, 737, 374]
2233C74n47l11M63K26K57l44l66l33L11N19l9n91k52K54M98J64m20n73j0O77K20
2254A77J19m02l94M10N83Q4l33m33l79Q13K09O5n93m45K47O55J99p48l61L10J05
2275a12M62jo96m76N29O18Nm42l62j68Q35L33l0m27n35J45O73J16l29m76L55Q2
2297I9P22m6j047j58J62O05j24j23n58j78P71L74k34n36n29J99J126L3q44j41
2317d27Q4O55M11m72l47j69J08N24O1j27n81j60R27J83j65o43l54L10O13M1n65
2338i3o60q4P80M56j84o24m98M92Q34L55o29q67K12O73M15J10n81n35N25M28J05
2359F30l89l58k97N62O38m93o76q7M33Q9L54l95q59L22M89L12j34n15n16M17J063
2380E90k14l33l50k19O65N46O9r24J26O8L84M29n90o80m8P41J38K08r80l81M23
$$ y = [374, -173, -484, -21, 205, 462, 118, -248, -581, -270, 249, 210, -381, -633, -379, 119, 283, -137, -710, -720, -43, 177, 296, -106, -500, -90, 493, 577, 244, -189, -568, 245, 454, 519, -74, -519, -272, 383, 582, -166, -527, -217, -112, 350, 349, -347, -823, -294, 324, 329, -113, -475, -643, 192, 525, 495, 68, -467, -322, 351, 467, 138, -338, 17, 99, 821, 775, -272, -430, -268, 337, 213, 90, -468, -646, 125, 499, 265, -271, -800, -601, 525, 558, -286, -427, -343, 312, 723, 251, -96, -265, -157, 367, 428, 301, -280, -440, 487, 670, 505, -138, -492, -182, 431, 472, -93, -753, -837, -57, 399, 215, -409, -907, -415, 419, 774, 145, -722, -510, 163, 578, 688, 107, -428, 97, 525, 630, 241, -117, -414, 148, 786, 293, -383, -470, -37, 52, 406, 11, -848, -526, -37, 275, 141, -374, -890, -473, 590, 376, 43, -307, -526, 139, 685, 754, -170, -44, 24, 408, 837, 247, -433, -481, 260, 398, 606, -374, -755, -332]
2401c32Q46l03n14j51j77N16N33k91p03J36L51M04l4m5o97J52O20J61L8n12o42
2422f44M82Q94k40l38n82j58P46M92n04n97l50K00R29Q7o88k70N19j09M06J52
2442D27n74p03Q62O61k12m48m51J23Q83J90n43l04o35N54O25M69j007n48K4P24
2462A17M15o0j034l27N35M74K72l34p13k07R28N80l27m49n98N93P16K29q22m82
2482d94J28O35O04k88p82m69P21K30J84n99m85j41R96L21m71l32n72K80J139m45
2502A60o49j60J58N01P65n50o24J34N07L26J05l93r73K50Q67J29k34m18k85j33
2522e17R88L20p83o57q6Q70O34l68j221O4N13M34M47n60q14K09O65M68k22n20
2542a36m86N38R16l4n86o94P9P36L10j30o17o79O15P12J13q00o50N04K53O07j71
$$ y = [-332, 514, 211, -303, -454, -631, -115, 418, 127, -576, -440, -89, 315, 281, 236, -461, -309, 311, 472, 510, -2, -644, -162, 732, 492, 154, -428, -586, 160, 652, 148, -449, -799, -599, 330, 417, -271, -541, -22, -131, 275, 427, -147, -850, 12, 673, 461, 13, -438, -315, 568, 758, 215, -89, -724, -170, 455, 924, -83, -631, -607, 117, 532, 472, -562, -889, -354, 120, 392, 58, -655, -862, 66, 646, 319, -130, -728, -135, 581, 810, -12, -494, -366, 269, 873, 585, -197, -666, 55, 285, 469, -130, -615, -756, 240, 561, 90, -242, -814, -534, 605, 160, -489, -649, -491, 10, 775, 225, -399, -265, 242, 568, 673, 280, -693, -443, 424, 553, 319, -99, -384, -517, 471, 791, 8, -649, -735, 135, 769, 401, -820, -756, -243, 191, 638, 78, -736, -527, 138, 606, 384, -136, -622, -84, 832, 798, 212, -482, -403, 333, 643, 513, -104, -783, -168, 544, 657, -143, -793, -289, -36, 571, 400]
2563D00p99m73L86Q86L5k33l67m38R85N42q61k15j73K09L16O06o36p43L03N67
2583B97Q7k7n01o57M79Q84j11o34n37Q3M13P41m18q60K8P75J77M61n12n94J59
2604b67P97M61n47o19l70M12P98Q7r23n90J69R05K29j66r33m47N40R25p5k34o26
2625d74k35N13P95k71o91k80O28M19N17p20q37L37O04L06m52k30l58K59P12J32
2645F74p67l35J21O06L40k9j065k06M33P39l75k89n69J67O90N82n54p88L04L91
2665G0J28O80o47o55m1J171J55o25m34m85M02R18M2q04q98P60J52N09k4r32j40
2686f98M71Q70l34k67m96q1R59M54m76n63j03K7O32N63q32r26L88N88N96o37l81
2707b46l96M36P36J81q74o20M31K41P53k50r40k80R58M87j89m71n62mQ81N48n54
$$ y = [400, -399, -872, -486, 400, 435, 202, -165, -603, 382, 924, 63, -152, -325, -116, 200, 806, 170, -573, -270, 297, 384, 357, -144, -801, -322, 562, 451, -183, -720, -637, -224, 517, 99, -761, -733, 42, 219, 680, 168, -426, -267, 530, 991, 444, -175, -545, -133, 665, 752, -171, -761, -592, 313, 542, 376, -557, -1004, -464, 461, 386, 152, -474, -709, -196, 599, 328, -363, -643, -15, 404, 921, 201, -636, -299, 305, 611, 159, -71, -429, -170, 542, 674, -93, -428, -307, 299, 639, 610, -455, -661, -228, 511, 136, -153, -722, -555, 135, 717, 163, -625, -321, 70, 198, 878, 231, -424, -465, 706, 861, 236, -198, -683, -281, 637, 679, -125, -1023, -263, -111, 398, 374, -558, -698, -227, 643, 309, 42, -454, -535, 424, 878, 402, -161, -264, -237, 395, 958, 126, -800, -412, 176, 772, 135, -246, -642, -206, 530, 711, -163, -783, -352, -111, 642, 392, -548, -828, 130, 617, 428, -43, -605, -609, 272, 820, 266]
2728B66o77o2K26Q15Q6p26q90O46R41j15j66n80m79R23M91m45m02l05Q7P02N06
2749H42q01q42j7O84O70P4p63m53L98O90L22k25q49m23P81N73j08k89j071K09
2769e98P85L95k17n04o13L22J076j21q65j55K98M26M72l94r82k14Q46L84J47k59
2789B29p08J46P76Q5l44l62k06L13O42J80q31l39J64M70N64l45q65l59R29N04
2809F43l37n66m58L39N14L50m00n02k93N25P76m7q22j06L8M38Q54n54r12L1L35
2830a54O75K01m68r70L05P68L23m56n50o98O49J290o76l87n26J32O65P55p10m26
2850b58m36N89N11M30j082m80M89N92K32l85l61n63O25P34k47l68m27k04O83O96
2870G70n34p59j2N13N58n2n86l39M22L59J65r5p37n74J186L57K0p25l71K45N27
$$ y = [266, -411, -473, -247, 568, 654, -72, -962, -316, 625, 510, 344, -236, -715, 208, 699, 254, -148, -453, -366, 336, 842, 41, -801, -818, -134, 536, 610, -153, -606, -208, 482, 804, 579, -270, -693, 88, 661, 553, 264, -807, -598, 187, 582, 365, -139, -752, -430, 646, 525, -340, -495, -197, 229, 701, 307, -675, -889, -43, 341, 488, 229, -479, -333, 443, 528, 184, -178, -384, -71, 571, 751, -80, -419, -255, 215, 779, 434, -431, -790, 139, 643, 306, -260, -718, -379, 135, 485, 85, -417, -710, -185, 591, 544, -278, -384, -346, 92, 946, 392, -520, -489, -154, 521, 722, 254, -716, -411, 357, 680, 224, -326, -1024, -375, 915, 239, -148, -674, -542, 123, 878, 168, -258, -694, -105, 406, 836, -246, -726, -237, 355, 587, 202, -159, -722, -97, 637, 390, 22, -405, -609, 74, 770, 236, -523, -535, -22, 536, 484, -102, -441, -19, 340, 505, 410, -327, -901, 285, 642, 662, -63, -434, -189, 338]
2891C38K09m45m90j64L72P12J92j004o35N59Q31Qk0j127l00J109K78j62k43o16
2911e98K14P09M81n58n22j7L44N08L94j299j96M90K77L85j95q53n24J268L70l99
2931B79m03n88P3J034L46o76m40k06L35P09j5o62m69M12M57O94n84r19M3R13K14
2952E47J04m70q78K37R50K23q08k41k99N19O40R4j019L8mP14L29m48q05n9O87
2973E1M11j52m50m96L72Q04N7m77j66m62J00J249m22n63m75M66K95J54j12p80
2993e96r1P69M53J88o49m36O8R19M1o94m27j52N16N24m3o70j11K08P25M07q69
3014H0n40J50K62M51K90r57l97N26M44J00j20n45n36P96P09n64k19n97J80Q69
3034C82J12m31m63N9L85L92J83o59q33R73K69R6k54m23l00M59N75m70m2l20l6
$$ y = [338, 547, 102, -388, -552, -180, 532, 724, -280, -915, -356, 475, 483, 463, -664, -964, 145, 423, 261, 18, -598, -384, 325, 806, 248, -274, -291, 53, 561, 955, -344, -540, -50, 227, 612, 417, -436, -960, 308, 678, 279, -124, -712, -639, 395, 741, 65, -375, -581, -246, 463, 448, -214, -683, -271, 186, 880, 296, -623, -580, 333, 547, 651, 181, -697, -460, 490, 713, -95, -336, -635, -116, 524, 618, -401, -363, -367, 347, 676, 228, -577, -636, 51, 462, 310, -140, -636, -264, 540, 597, 120, -46, -508, -408, 841, 419, -144, -619, -153, 142, 296, 184, -596, -687, 82, 535, 723, 74, -362, -294, 625, 666, -28, -455, -607, -91, 433, 390, -280, -391, -183, 542, 949, 80, -460, -310, -48, 403, 693, -264, -661, -135, 309, 409, 289, -256, -792, 4, 713, 149, -70, -667, -487, 382, 494, 63, -400, -341, 44, 436, 619, -40, -873, 100, 369, 465, 211, -212, -512, -53, 522, 52, 10, -310, -346]
3055c46N82K49m49q39M51K29O26j57r14j45L84P19J87o78m40J19P21J46j12l08
3075B5o86M14R52j71n07j71l84N43Q72l35q38l79M91K40L69k92q71r7Q69M69m44
3096F9l79l95J90P50L66r62k09K30K16P30K02j141k71Q02L23j8lp95LO29K85k97
3118C25o76K9q4P84k17q6q27N71L10J80m21j27l42L26P65m1l65n41K45N00L95
3139G03l59q99M5M54M65Q5o13m18j10R57L05l41m70k72K90J83J81o1q30L00L85
3160b0N70j03o27n23N69P42k05k43l76j53J62O99n5p36j52P17N6K33j69o33j53
3181d00N51L67l21l96j96j20Q43K71o14l59P6L16K57J98o63l06M78L53j63j64
3201Hk20j01N72K28j48p19j00M90N46k22l10q28M62M54L31k84o38L3Q5P80K02
$$ y = [-346, 236, 485, 36, -803, -352, -123, 503, 346, -568, -713, -329, 390, 577, -101, -541, -422, 299, 445, 333, 25, -661, -247, 705, 534, 27, -144, -528, 15, 887, 552, -286, -665, -174, 66, 435, 143, -728, -825, 44, 513, 69, -310, -705, -515, 235, 601, -361, -570, -340, -124, 606, 808, -333, -604, 198, 521, 503, 500, -295, -292, 337, 622, 325, -351, -322, -406, 378, 161, 75, -752, -181, 129, 309, -112, -239, -581, -255, 510, 469, 104, -437, -192, 308, 703, 344, -555, -510, -56, 409, 494, -119, -537, -647, 310, 615, 274, -196, -468, -178, 5, 186, 125, -705, -405, -20, 550, 447, -180, -703, -134, 608, 403, 160, -216, -369, -207, 492, 437, -299, -451, 266, 322, 555, 386, -247, -400, 151, 518, 197, -199, -395, -515, 328, 599, -15, -374, -298, 18, 275, 473, -190, -496, -18, 335, 172, 8, -212, -313, 259, 487, 339, -380, -480, 10, 556, 334, 24, -804, -342, 112, 443, 159, -479, -446, -361, 419, 621]
3222F21q25n19N33L66K43o0p16j83M07P93j56l50m35L5N93L49m37o91r3J74Q02
3243D51o5k59o86l7P89J55m58J9k07K01L19J23o69k66M32M2O20j46q13J30M23
3264I8L90pl56n04M1O39n8m7j95n76M07P02k16m59n28L05N70L24m42k52j44J38
3286a70M36J1n34m3J74K21J97j8m07m32N31O06k20k20n76q6P83L17p80j45KK91
3308f2J14M85n50k82j67P31P9k00l47l70M60N14K58p47k18K2K71N49l95n64K81
3329a38M1M47m8m00l13J34J79N33k71m08m64Q00K39q5k75n53J51L94N96m77j89
3350a07l89K87P55k71l27k08J17L10M42j79q91j10P27K81j6k74p43L18O96q3k86
3371D9k52j37J29K95J10k94k04j24M45L58K9p13r3K71N60O8m45n97Q9Q65l8q4
$$ y = [621, -204, -723, -190, 176, 419, 359, -357, -540, -133, 660, 504, 154, -281, -246, 347, 696, 259, -432, -525, -351, 451, 386, 127, -559, -596, 193, 348, -110, -91, -298, -97, 222, 345, -324, -590, -158, -116, 504, 358, -455, -325, 98, 488, 481, 125, -379, -338, 301, 243, 196, 1, -575, -168, 534, 318, -141, -669, -364, 206, 530, 88, -164, -308, -170, 266, 277, -257, -300, -126, 95, 292, 274, -133, -565, -34, 572, 352, 132, -444, -530, 253, 570, -210, -355, -353, -62, 52, 537, -13, -295, -462, 269, 348, 148, -199, -569, -109, 405, 663, -84, -302, -280, -9, 540, 145, -419, -138, -97, 350, 302, -98, -411, -277, -98, 435, 164, -244, -708, 92, 331, 246, -29, -582, -431, -37, 559, 82, -107, -496, -209, 546, 275, -52, -260, -143, 167, 609, 430, -461, -571, 156, 437, 421, 147, -596, -278, 418, 335, 49, -203, -340, -211, 84, 194, -100, -304, -428, 17, 375, 404, -309, -402, -131, 429, 497, 52, -545, -456, 409, 371, 287]
3393B87m61k02L48O05k06m65l50K12P0N87l46n90N7M95K09j31l34m60M11L62K68
3414C66k31k77k66M40M25j85m68j05Q5M71J19m67l10L57Q4Q5K32m38n53L71N38
3435B73j18j25k78n0K22N76k97l62k19L23L33L03o96l35L17n5M70K22p96j15K07
3456b00O12K6k72m10j29L12M75o9m43k25L1J91O17n04l07Q8L4N55k0n33l46M52
3478f5J60J13kl56l07M94L48k53j63m17M86K77J02k73l34K2K3M39J91o61l79L30
3500b25L13K2J79q68k2P96L67n27q5k60p9O12J10m08m2j83K98M07O7o58j83L17
3522e2L20J32o3o37j31N78J32o9k06m54L02N72k02j73n32R2M88M88m05m84m9M26
3544G3j25M65m17l08n5N79N4J27n79r2L90K31j28j78k95k50L68M50j34m36K5K44
$$ y = [287, -174, -376, -28, 577, 371, -94, -444, -232, -162, 425, 79, -511, -454, 41, 250, 119, -215, -675, -264, 98, 366, 135, -142, -408, 32, 457, 272, -196, -301, -216, 255, 374, -93, -403, -46, 38, 123, 355, -83, -636, -265, 273, 155, 30, -248, -298, -76, 500, 203, -159, -378, -55, 278, 581, -115, -450, -133, -188, 282, 504, -292, -407, -200, 412, 438, 166, -244, -373, -61, 414, 345, -98, -323, -292, -101, 516, 12, -295, -207, -173, 382, 362, -171, -517, -65, 95, 208, 206, -150, -457, 37, 385, 132, -31, -448, 38, 315, 417, 144, -190, -168, -145, 294, 485, -176, -555, -225, 88, 110, 289, -579, -601, 195, 562, 35, -50, -310, -389, 223, 333, -75, -117, -300, -2, 405, 472, -186, -369, -52, 268, 400, 337, -300, -431, 147, 279, 210, 4, -450, -148, 424, 222, 49, -483, -391, 97, 585, 180, -304, -353, 73, -52, 413, -4, -312, -367, 212, 266, 393, -186, -278, 112, 343, 215, 37, -258, -508, -140, 310, 176, -260, -235, 9]
3566IJ51n4k03j93r4M75J07l04J48m33J84M45J93o68m5K25J92K26j7m74p0j37
3588c37M90M3j61m5k71K28O6J67l35j75K06L11n1o6l21J09K44M06l75j65q3oP13
3611E92j71m05j40j77L73J41K98n52l84L91K76R2m60J23m60K29N88k48m32Q4L4
3632b08L23K42n49j14J7L17J69R5k81k26J01M08qj83j38M7K0K91L7n49o4J76M13
3655C36k38l58Q6J47K17m3j14l43R3L50K70j76k70m29J74L12L0j18Jk98J77O04
3677D10k2n67p2R3L78J99k59n33o2K62M65%l87k60J21N36l2km22k05K03L65O3
3700B72l03j90K61jN71n53l37n2M86K14j52j49k90L3J34L82j25m14j59M31q3R8
3722G4j63k40K73L88j51p9j02k59K04L85M4n28k08K57K23N1k37l43J28K46J21
$$ y = [9, 160, 106, -97, -290, -384, 91, 198, -106, 42, -391, -207, 238, 431, -237, -282, -57, 135, 361, 344, -130, -200, -337, 153, 196, 35, -10, -281, -53, 13, 180, -155, -330, -124, 187, 136, 70, -251, -142, 102, 508, 133, -32, -115, -121, 592, 421, 16, -124, -301, 72, 213, 511, -41, -425, -34, 242, 334, -126, -3, -463, -234, 354, 106, -326, -242, -208, 115, 357, -192, -306, -289, 28, 197, 292, 11, -215, -114, 294, 286, 103, -35, 12, 32, 323, 360, -189, -253, -77, 336, 98, -260, -174, -27, 190, 147, 33, -310, -217, 133, 403, 227, -43, -472, -298, 14, 44, -74, -73, -371, -194, 410, 388, -179, -251, -158, 220, 419, 160, -373, -435, -173, 292, 292, -95, -355, -234, 302, 270, 268, -154, -359, -156, 209, 272, -31, -221, 40, 39, 610, 57, -280, -332, 154, 368, 216, 67, -223, -190, -56, 326, 201, -213, -372, 59, -24, 74, -89, -329, -56, 332, 181, 102, 0, -259, -55, 330, 374, -154, -362, -105, 118, 169, -68, -411, -283, -37, 84]
3743H4Q4l09j35J32K58K25j70m11m6N01P8j57k25k76K8N36o2l33J35l10M20N25
3765E72m24j11j38o9M15j69J66k77kK12K16k75j54j22J01K01J93l69j21j24K05
3786g4J18lo0n44M95M29o1l11j41K0R1K74l9l71P4J68M3J39l35lJ12K93l6l5n61
3811c18L32l9J07p8j43j73j00N03o7o1n1j60J69R1J71j75lLL4L32l74k11NK02
3835dK81J05m37k39J25R8L55k57r6j88L5L26j04Kk20Q4J9J70J56k27k17J12N05
3858C84j48n6m43r5M41p7J64j99j96J17K42L11k04n17K35r9K26j70m3J02j68N27
3880C34k73J56m93J21L68J42j22k73l4k63K30N89n92l9j93N11j54L72m15j38j40
3901c06N12J94m41r7k19K79J24jk91J36K18L2O6l04k9k43M51L2n8k24N0n8K80
$$ y = [84, 168, -141, -276, -144, 114, 339, 169, -242, -288, 213, 291, 134, -91, -367, -339, 197, 135, -198, -63, -373, 47, 572, 148, 37, -101, -170, 245, 76, 242, -35, -37, 175, 391, 116, -38, -160, -59, 142, 335, -34, -155, -279, -74, 44, 41, -19, -563, -68, 361, 300, -11, -152, -132, -41, 233, 194, -177, -103, 65, 108, 247, -88, -91, 21, 314, 278, 243, -318, 14, -25, 82, 4, -139, -312, -412, 91, 24, -37, -88, -248, -79, 12, 183, 8, 5, 8, 42, 374, 0, -211, -206, -4, 277, 382, -55, -294, -169, -71, 284, 27, -69, -257, -222, 104, 0, 2, -218, -134, -115, 55, 211, -16, -233, -121, 384, 236, 180, -263, -358, 83, 6, 170, -29, -225, -108, 134, 445, 241, -276, -41, -140, 86, -84, -127, -25, -193, 334, 61, 217, -276, -155, 213, 355, 233, -40, -74, -337, -107, 482, -110, -149, -342, 169, 15, 387, -28, -166, -306, 206, 400, -41, -138, -357, -78, 46, 45, -246, -110, 108, 140, 206, -98, -127, -370, 81, 113, 55, -169, -119, -177, 103]
3924A03P0N7k81k8k16L76J27l27P6QK59j21l42K6K28J1K20K2l94j97p4N06K49
3947C58n19Q9J14o7L04j14l93J52J51l4O5l33j13K37K50K18j35o14J72J21L14
3968B23J30m76k03L09J48K22m4m03J50JJ02r9k24k7L7K73P3j03m62K8M33qj68
3991h8j4j37K05J02j59kJ52j23J27L5O7l06k3K55j87L18o6l34J21L9M6J68k27
4014c1Q4m17N47k4j70j22J19J45J4K24l79k59L94J62j59k99N1n2P8J72O0k82P5
4037f9K08r1O6l48J20R1K3L26k33l08M8J59L07m5k29j23m7L35J01k08k56j25J52
4060a46N90k34l56j21J11R2K18j12k74j61M48J64j17r9j41l3K69J44l26N0j31
4081a65L9K20j33k0M4j11K41n9K42m48j47O06l42K23q2p6k96M00Jj95j71J90r7
$$ y = [103, 173, 230, -51, -79, -295, 81, 208, -119, -43, -35, 224, 103, -239, -213, 15, 26, 246, 268, -126, -323, -397, 109, 358, -161, -72, 42, -25, 279, 165, -228, -76, 75, 41, 106, -227, -340, -103, 147, 365, 230, -384, -212, -91, 223, 353, -123, -326, -17, 131, 353, 309, -94, 56, 57, 159, 60, -164, -191, -154, 119, 192, 89, -373, -345, 88, 80, -88, -102, -239, -34, 68, -91, -93, 59, -64, 63, 98, 165, -141, -164, 91, -96, 222, 156, -178, -57, -18, 28, 196, -31, 53, -364, 183, 159, -11, -133, -14, 131, 145, 369, -10, -269, 125, 287, 128, -171, -120, -172, -94, 78, 138, -144, -69, 139, 48, 114, -234, -114, -23, 0, 326, 93, -215, -167, -8, 299, 254, 25, -98, -145, 190, 291, 83, -173, -298, -146, 444, 210, -146, -267, -156, -64, 154, 42, -232, -393, 55, 219, 102, 3, -138, -171, 98, 242, -84, -34, -165, -126, 94, -39, -59, -15, -126, 115, 56, 298, -150, -297, 309, -33, 190, 108, 32, -264, 136, 137, -58, -229, -39, -136]
4104a36L04M9l35o4K6J04J31L4m8k05J63J6j56j4j39P7K67J65J59n53q6L50j35
4127b6J07k20r7K18M2J1j45o1%k5P5K21k00j26K52o4L78l21kj74K59J39k55l27
4151c41J47J95O3J66k62l2J54P3l9r1k01j22K6M53k8L5m43l5M83q2q5L5m14K10
4175a35J12L18j89j88j66M71k8j40j84K6mJ1K32o3l28L8Q8J5k3K23k76K95K06
4198C11k48P9l9k50J12R7j0j51j78K17L66k23l5j57j77L03l6p1R6j74j88Q07m04
4221D7p5j46j45K09M12p6j22k00J06J31J37l69j28j00J83J90k3k62J80qK64j26
4243G9q9l66J50L97M6k61J24j78K50r7k81J8J4P4R9m4J52J24o27L58J63j71r0
4266a56M0rJ45J43j2K1n16M12j57q4J37j9NO2K18j92k97P5J75R0Q7m28L3M7L14
$$ y = [-136, 168, 217, -118, -182, -156, -52, 79, 113, 65, -140, 23, 39, -117, -131, -270, -193, 74, 239, 398, -155, -241, 109, -26, 81, -139, -236, -18, 24, 35, -110, -171, -171, -196, -121, 100, -100, -226, 26, -38, 340, 19, 17, -157, 102, 241, -14, -341, -194, 1, 64, 230, -32, -64, 90, 163, 124, 33, -168, -290, -264, 189, 161, 196, -247, -282, 201, 119, 34, 69, -345, -135, -23, 295, 106, -82, -248, 223, 195, 55, -129, -103, -107, -96, 136, 73, -255, -217, -129, -114, -137, 86, -190, 105, 311, 63, 142, 103, -147, -35, 62, 52, -99, -277, -60, 306, 83, 48, -109, -286, 17, -19, -90, 6, -168, -356, 451, 47, -28, -174, -319, -110, 302, 226, 104, -96, 10, 141, 278, -91, -219, -319, -136, 54, 31, -231, -51, -59, 205, 79, -10, -376, -226, 171, 217, -44, 80, -98, 152, 55, -226, -208, -194, -120, -21, -65, 87, 211, -416, -58, 105, -66, -156, -116, -125, 20, 163, 151, 172, -344, 68, -89, -173, -36, -55, -50, 12, 230, 38, -259, -184, -9, 81, 168, -260, -227, -180, 134]
4291A34l87M10l27Q0K06k2L3ml40K58j73K03J12l05N8R6j80K92k07J24M4J7J37
4314B59l18j72K3R4N64k86o6l23L42P5K2K4k89N0rJ73j22rk18k6L28M21o84J43
4338dnQ6P8O6k56j69O2L15q5J72n41J50L02M4p9r1m08M26K37k5k86j0k79J53L12
4363A65r5j45k05M13OK43n73j05k5L71J13k49m4p0J84K21J19K1k41l78J71K15
4385A12m8k42k0N4OL11j15p9j98K54Q3P0l04k01J71J69N8j67j4Qj8M75k74k08
4409a17K0n6L16L4l65P9q9K10p0r0J71m04J28M62j37j36j50R3l1R4M4k62J89J53
4433H6K96k21l35K12j15M94k14K7l21j62K96J42k59L0k86J16K44j5j28j74j43
4454d30K79O6j10K00q8l2Q6J23n1pj73J93K2J3j88J88r0L40k14j86m7J09j02K60
$$ y = [134, -253, 157, -170, -90, 116, 94, 127, 123, -217, 41, -132, 71, 183, -122, -64, 32, -148, 144, -63, 61, 105, 122, 259, -59, -231, -208, -114, 450, 164, 98, -225, 117, 192, 214, 238, -51, -1, -10, 163, 41, 32, -186, -212, 116, 537, -147, -4, -9, 77, 155, 221, -35, -204, -142, 173, 88, 260, -281, -131, 171, 215, 136, 45, -363, 63, 300, 275, -11, -21, -300, -147, 165, 70, -75, -280, 133, 139, 382, -191, -296, -321, 50, 163, -86, -130, -200, -16, 205, 324, 345, 104, -274, -103, 112, 64, -178, -198, -144, -138, 173, 58, -21, -219, 35, 118, 188, -116, -317, -146, 23, 81, -86, -100, -92, -110, 365, 91, -117, -97, -153, 163, 197, -168, -89, -178, 32, -38, -128, 43, -361, -233, 229, 92, -44, -194, -101, -132, -38, 6, -256, -67, 86, 382, 161, -174, 38, -77, 417, 203, 230, -91, -253, 43, 185, -74, -44, -330, -214, 30, 15, -113, -287, -430, -151, -85, -195, 5, -83, -115, -29, 94, 43, 36, -137, 56, 78, 91, -97, 91, 1, 341, 127, -59, -106, 3, -99, 161]
4478A61J52m26p1Q1N9M83l91j36k84L25J94k41K47k21k32M74J80m10j59K98j19
4499c6K58N3k91j89J26R0J03q5k86K1K42M0M8J17l95L4J39ol6J59j01qK30J30
4523C57l31k35k22M21J82l27K5K28j19K01l48J15j48Q7K16j47J25j86M3K91K9
4544B57k93qm6r7K34J93p7k39j88K65L74j93q2l34J2K94L26j51l17k01K94L24
4566C47l8n12m0J16K90M1j11k44N2J82m7pp5j31J21K59J8j94k20L3pN76j2m08
4590a1j09j48M69k06J27n42J89J59j83K65J36l97L49j6q2n5j07o0N7O1R3n1O0
4613bj10K46R7l72J62l60K99K52L1k37j96K1J49J62p7l92O6K67J25J54k21k19
4635a55k8K38P8l49N7m1P0M32k03q5l02J10JL10K05n87J48J76J34m27J83n4j01
$$ y = [161, 313, -113, -184, -103, -44, 439, 48, -88, -372, -47, 147, -94, 153, -68, -300, 174, 354, -56, -215, 83, -36, 222, 275, -16, -205, -79, 11, 114, 29, -257, -236, 6, 46, 94, 211, -184, -150, -11, -17, -53, 106, 5, -3, 227, 357, 26, -209, -431, -10, 172, -155, -130, 98, -21, 180, -168, -53, -201, -114, 102, -45, 80, -106, -63, 228, 257, -36, -44, -90, -187, 47, 240, 163, -76, -264, 1, 375, 182, 100, -234, -222, 72, 398, 247, -70, -271, 23, 347, 309, -203, -243, -127, 163, 204, 93, -151, -99, 83, 36, 29, -46, -177, -56, 203, 221, 27, -193, -160, -167, 409, 397, -11, -120, -268, 201, -5, 122, -420, -231, -72, -255, 10, 146, -251, 98, 82, 0, -55, -162, -222, -165, -104, -11, -62, -2, -112, 134, 231, -141, 21, -339, -40, 212, 243, 6, -190, -169, -20, 142, 65, -327, -261, 6, 131, 285, 64, -155, -183, 55, 133, -216, -159, -200, -130, 302, 99, 14, -288, -178, -177, 133, 338, -249, -101, 75, 209, -218, -35, -89, -190]
4658a90L59k9j67j15J4J42P2J5l58KJ50J66J55k47n0k70M04K05K5m48k68L63K26
4681A56j95J92m90K33M96j48R6l59l22O1L67l57L29Mk06J97M7J29j97k84K72M07
4703D28j73j55k12J76l8K24k32o2N1j16J75m2J75m25K3J76L22o5j83l24J83L00
4725B06J02l94L8j44M47J86m04j14j44N41m00N7P4m47K67J85O0k02O9k74K88P
4747DK10j20o1k51L74K89n00k51j18M15O6K24l90J0j00P4M56j29k35k55M18m2
4769H8N2m3l34R6K61j8J28m30K7J46K16l7m26j1K57K54j48R4k64J07J13Q9j7m13
4793b13K35j77K04K47j27j25j90O4L02K49n58k8j0J40K61l95QM3J06L2k3j66o8
4816a89k12N29O8j53k08k19N16K17l95K4k96M08p6J87j73j42J46j08J43l1j19
$$ y = [-190, 169, 140, -27, -142, -128, 14, 86, 101, -257, -255, -105, 61, 216, -31, -81, -351, 53, 258, 283, -165, -433, -70, 156, -39, 153, -337, -104, 392, 244, 340, -19, -341, -280, 87, -270, 59, 63, -143, 54, 101, 230, 33, -251, 21, 428, 255, 100, -112, 64, 26, 250, 18, -44, 7, -109, 66, 24, 199, -226, -203, -27, 295, 230, 47, -277, -94, 206, 308, -86, -48, -192, 255, 441, 37, -77, -221, 320, -80, -23, 51, -396, -129, 56, 116, -86, -17, -291, -3, 4, 214, 94, 33, -218, 156, 445, -55, -306, -424, -9, 57, 281, -109, -99, -199, -125, 331, 202, -33, -288, 130, 88, 140, 97, -237, -141, 120, 102, 230, -200, -173, -27, 189, 152, -274, -285, -28, 226, 78, 172, -92, 15, 128, 217, 200, -213, 22, -155, 49, 296, 169, 44, -146, -82, 220, 469, -89, -117, -127, 13, 274, -121, -113, -70, 36, 68, 45, -121, -189, -401, 128, 196, 43, -165, -384, 132, 349, -46, -22, -318, 90, 14, 201, 28, -114, 32, -76, 67, 36, -83]
4837h3l61N02p7L49n00k07K69J47Q1P8k2m48J08J35M69l00m38L0K9K14J53o1k94
4860b27J98J62kj46j40q9J30L25m7k92k00J52L72k61rJ02j22N3j24L62r5j37k49
4883b84L44K81l16q0J52k3K00q7j05l18j30L07K59M2l09J21O3r8J54k27q9J6R9
4906b8K09o5k14j23L76o5K66n22J04K32J9j57mj65k90M33L2m1Q8m30M79q8J15
4929A61j6l02n0QL29J29o52O5K10K55l11L07j90k14J41L01m0l10Q2k86P92L0l31
4952A08m51J45J88K35j35k80j17K06k4K42k95r6O1R1K41L1k14k21J79R8K30j83
4974C9qq8j24K08K36n49M0J11L93j75j74K64l43J51k22K66K30m85J97O0K69nl99
4997a08j76L00O1j79J25j90J87L9L26j38m34K09o5L92p5l92j39J04J09L23k54
$$ y = [-83, -444, 58, -19, 330, -170, -377, -108, 39, 120, 198, 176, -272, -164, -29, 440, 140, -298, -268, -239, -25, 128, 67, -227, -29, 133, 131, -15, -155, -244, -114, 211, 164, -128, -328, -176, 196, -65, -74, 28, -94, -41, -165, 197, 102, -35, -284, 60, 341, 25, -55, 97, 74, 274, 187, 82, -236, -366, -59, 200, 242, -67, 54, 117, 19, 173, -54, -143, -127, -28, 181, 116, -98, -221, 155, 90, 356, -166, -62, 170, 189, 32, 28, -137, -427, 6, 38, -3, 85, -345, 134, 46, 161, 145, -157, -207, -199, 130, 259, -393, -328, -118, 137, -174, 133, -57, -271, -130, 171, 131, -179, -97, -383, 409, 439, 108, -343, -198, -10, 225, 90, -190, -307, -101, -125, 117, -178, -274, -213, -122, 119, 150, -64, -285, -106, -8, 222, 39, 31, -57, -181, 27, 263, -286, -246, -135, 258, 83, -91, 173, -170, -19, -241, 25, 255, -230, -33, 27, 296, 291, -108, -284, 16, 77, -102, 23, -167, 20, 59, 385, 247, -187, 22, -43, 349, 274, -118, -257, -153, -44, 279, 25]
5018B5l16J25L65J75k67j34j29O7K15O5j85j11j02L13K0J72l51p8J6L07J32k13
5040A11j88N7m8L35l35N2o8pK39o6rk84n5L15J47j77m24K69m3M14N5k22l01Q9
5064a44L81k7j77j12q8q7N12l70r5j06J19L73M0L4l99n7J60J23K85m24r4P9J09
5087C5n3J23j40l23M94P4k31L8l4p7J1L16J22l24j66L8K61P6k92k34Q4K18J45
5110A61J12j29k04J05J81j52l49q5M19k31M37k39l04R0J82L29k23j59j46K4K22
5131D1J25j28k18N7J38j44K56k03l88K12M62n6j67o1k13K04L22Ln2l40PK08P7
5154A42k0k56j07K33J66Q0l21L2j65J07L11k35l60N40N7k30K31k9l65R7kJ82J59
5177B47l26j73J66K84j97J53k76j22K31J63p5m44K33P9N2M9l03K14L7K14J14l59
$$ y = [25, -291, -166, 199, 374, 107, -27, -156, -89, 126, 191, 6, -105, -207, 106, 126, 298, -53, -131, -115, 192, 324, 111, -77, -20, -68, 267, -68, -16, -84, -91, 148, 82, 73, -211, -266, 49, 196, 19, -405, -136, -179, 235, 290, 68, -233, -144, 237, 210, 33, -79, -167, -254, 258, -112, -207, -313, -194, 179, 219, 253, -146, -203, -43, 80, 365, -59, -153, -74, 35, -18, 105, -35, -358, 136, 210, -21, 17, -17, -94, -83, 233, 355, 31, -135, -97, 164, 240, -52, -286, -202, 16, 161, 273, 144, -60, 45, 226, 74, -275, -360, 59, -172, 265, 26, -278, -188, -6, 323, 100, -59, -205, -181, 41, 166, 38, -180, -123, 15, -129, 127, -76, -464, -252, 210, 154, -13, -74, -287, -83, 239, 242, 190, -150, -143, 65, 142, 122, -134, -241, -8, 158, 238, -83, -51, -216, -109, 202, -33, -393, 147, 204, -26, 205, 176, -189, -92, -94, 88, 247, -79, -252, -86, 198, 1, 154, -122, -244, -13, 150, 75, -369, -136, -57, -5, 44, -259, -45, -8, 206, 320, -39]
5199c9J09kr9J83l0l24J5J22J06K6J0j92k00J26N23o0m25K2j43K45M01k76l83
5222b85N9P50l46j33k37p4J98J43n5N3m29J38N4K88M8j92q0l8L21l4m2n7m00L13
5246c7J91J85k41p6k70K59K27l7m02KM49j90J13l04K64k10L71j44j76k40J69p6
5268a73M87j0n49k5M49l12K15l2m5j29J43J59o1k99J11P9K13k6j19j57k59N49
5290B09k65K32k49j48K75J23P0j54k07k59M97j01J49k25j72N4J34L91l08k83L42
5311A05q6J53l3k29J16k40K31K48k04k12r3K18L9mL7k60N5J86J40k04k13J28K08
5334H6M0J04m75J96m7K89Mk78j73p0K50N5K16l11k52M34J1P8j10j01j81M60o1
5357A64K32l20j51J75J95j63j31k51J2J68J70L09n07k73K86R7L19k99j58m5J60
$$ y = [-39, 70, 68, -31, 152, 122, -202, -187, -65, 41, 67, 77, -115, -315, -189, 334, 274, -151, -129, -272, -27, 374, 98, -285, -226, 524, 178, 45, -192, -266, -68, 75, 20, 73, -356, -218, -164, 124, 172, -20, -100, -138, 183, 149, 107, 50, -350, -37, 154, 339, 98, 22, -248, 11, 238, 201, -201, -199, 250, 60, 173, -131, 133, -77, 294, 150, -26, -266, -97, -173, 314, 304, -245, -270, 179, -133, 82, 50, 5, -124, 19, 178, 117, -182, -71, 8, 221, 195, 76, -81, -340, 209, -56, 176, -73, -221, 54, 177, 247, 93, -114, -373, 124, 23, 172, -53, -225, -171, -37, 354, 46, -237, 105, 19, 172, 139, -90, 26, -214, 17, 265, 61, -151, -244, -26, 13, 9, 46, -214, -159, 27, 167, -37, -250, -122, 86, 126, 230, -245, -49, -96, 193, 197, -81, -254, -324, -74, -19, 197, -114, -366, 68, 79, 157, 47, -54, -235, 225, 164, 396, 76, -75, 100, 295, 132, 1, -250, -238, -70, 100, 409, -98, -371, -85, 12, 331, 32, -126, -171, -11]
5378a1K09k0q3o9q5K82J41k47l49L6J62M3R6l91J04L02N4J04j23k75ML0pM1k17
5403b69P3J68q3K37Q5n09L37l0j43J61N1j62P1K4L43j80l82K54q7R5K5k1k54K36
5427D0P8R8l76Q1J1K10l13K67m6o4j27K68L9j11l43J18J50J73J11k67l01J89J90
5450G5q1j69p4PK99k0k40L30k91P4O6J26j64l06K43o3K63m5J94p17M37K27k10
5473c9m1J13l33M55M9NQ1n00K04J78m8j39n3k6Q1P8J4j86l33M35k8K3J55m06R8
5498a63K07J43k11q1J48o3R0M5J16k90j6K55n5p5p0k57L71q6J57k44j72J39Q7
5521b5nJ1K62j95k27L56J49m80K21l21K34L14j54q2l15J27J44K32l74L4J64J28
5543A98J50k60ll54K78k4Q1k2k54n2K91n0k80L18k2J47J18l68L5J14k32K65M4
$$ y = [-11, 198, 178, 95, 26, -59, 223, 364, 117, -232, -196, -34, 9, 105, -286, -182, 120, 174, 278, 155, -120, -116, -86, -93, -52, -269, -196, -28, -111, 126, 211, -298, 39, 9, -134, 27, 78, -84, -13, 11, 354, 174, -208, 46, -41, 54, 79, 58, -196, 40, 118, 216, -160, -79, -68, 142, -171, 96, 50, -14, -141, 127, 166, 55, -288, -170, -20, 153, 264, -3, -304, -115, 75, -6, -175, -249, -242, 57, 37, -203, 127, -164, -90, -24, 102, -62, -368, -125, -188, 75, 30, 224, -493, -56, 171, -39, -80, 33, -300, 155, 204, 209, 290, -210, -6, 172, 124, -15, -68, -94, -13, 65, 79, -107, -440, -5, -33, -10, 145, -261, -163, 44, 187, -24, -105, 43, -20, 70, 115, 231, -59, -75, 180, 125, 50, -20, -277, 94, 8, 165, -79, -251, -112, -25, -30, -19, 243, 48, -179, 177, 326, -154, 67, -254, -20, 294, 140, 58, -257, -130, 14, 246, -128, -94, 70, 198, 348, 88, 85, -269, 9, -15, 66, 44, -210, -262, 29, -21, -301, 17, -5, 142, 260, -108, -73, 41, -191, 74, 118]
5566A18J79j67m10oK13K03l4k02RL18k59K18o27J76M33r2r2j56K64m08L47J39
5588A64qn4r8j10J55j00l22L63j97L35j45l5J45k24J53j09L02k16j96K03J3L0
5610D9l25J41l1J66O9j91J04k78Q6K38J55J36j47m36N34k42j16J40k15P8Q7K77
5632B79k35RL7j86j0L48m22mm8K10Q6J79m54L50l17K60K75n80J47L3O9J24k74
5655a24rJ09q7M10k43J7l23M34j47J01j02J7j98K78j94L86l91P2N6J68k75r9j11
5678b55K42R0J58j65k51K52l4p8J73j61j90k58M50R9r2j3k2K6o9K59J9j47M5j9
5702E9J78k77L6j39o3L56Nl71J8J83k9K54m6l5k88J34o0J23L3k4j43J08K0m3k06
5727b17P3J27l6K48j84k07LJ44J35k03J48j95L72l33J59j77O6J85l47K42K3j47
$$ y = [118, 297, 130, -280, -286, -73, 130, 96, -106, -97, 221, -38, 180, -447, -271, 162, 70, -22, -178, 86, -322, 25, 164, 156, 102, 4, -106, 49, -51, -373, -10, -207, 128, -17, -52, 93, -131, 22, -87, 215, -1, -197, 6, 19, 49, -276, -135, -166, 0, 69, -122, -18, -296, -210, 28, 183, 319, 172, -264, 270, 28, -88, 52, -163, -85, 2, 279, 44, 53, 90, -96, -106, 242, -180, -184, -232, -22, 64, 243, -211, 139, -178, 82, 357, -223, -76, -43, 26, 150, -124, -133, -24, -111, 299, 56, 73, -250, 184, 37, 138, 36, 53, -145, 133, -61, 325, -66, 6, 62, 230, -45, -144, -255, -13, 77, 235, 70, -181, 71, 37, -41, 132, -29, -219, -477, -27, 72, -20, -33, -55, -29, -98, 161, 180, 33, 78, 59, 237, -40, -4, -143, -206, 150, 155, -216, -198, -15, -44, 210, 164, 129, -159, -25, -85, 38, 71, 47, -96, 12, 32, -11, -217, -144, -17, -53, 195, 11, -196, -193, -49, 86, -117, 31, -164, 208, -125, 34, -143, -77, 108, -239, 3, 26, -121]
5749a21k33K34J95n3l07L25n5J22O3L8k22k04L08K07k86l66L88p5L44k37Rl0J3
5772E7j39M43k20N9k53n0OJ77P2k48J25k79K00J40J68k17j53J56o1Q1j9L8j04
5795b1K36Q0k18m36K75N7J0o4k11K71j5J6R5O4m36L51o8K29q9n00J44K37K96k79
5819B4L1P3l55K19J19J93n30J53Q0jK43q2j73k6o4J55J03k60j3J30P8j00k44j50
5843c97L42j42R5J87o2l1J44K8j66L4j17j93K62L69k79k40J85j47L96l01J64k95
5865a64J5K26l54J41l5k29L67J68j07P6k32K9M5M20j70k42q4J04J2L5k1j3N9o0
5889a4RJ05k31M7M3J05O6M9l66N0J35K1K17m85K32j20N2J56O7q4j82M19J6j30
5913A77k65l2L28l22J25j25j01P9L58k38rk44K72k00L99j63k62N7K84j21p6K33
$$ y = [-121, -354, -120, 75, 22, -285, 40, -15, 107, 170, 208, -14, -218, 90, 297, 11, -355, 33, -42, 302, 65, 74, 44, 57, -82, 361, 141, 200, -53, -103, -97, 80, 152, -96, 29, -250, -50, 90, 258, 41, -112, 44, -17, 64, 45, 83, -21, 215, 295, 77, -359, -84, -27, -17, -81, -292, -21, -36, -20, 75, 139, -297, 54, -14, 215, 126, -374, -230, 7, 303, 24, 55, 128, -227, -8, 111, 304, -226, -73, 7, 6, 249, 167, -6, -32, -96, 59, 162, -98, -111, 19, 97, -3, -247, -397, -55, -197, -102, 85, 23, -8, 136, 164, -2, 32, -85, -278, -16, 353, 74, -166, 19, -128, 268, -33, 131, -164, -149, 77, -277, -136, -171, -400, -33, 135, 28, 104, -128, -99, -54, 366, 196, -46, -130, -26, -14, 21, 0, -13, 46, -14, -5, 100, -131, -84, -41, 64, 130, 179, -187, -137, -2, 19, 236, -249, -17, -137, -85, 71, 138, 54, -128, 291, 307, 177, -88, -120, 208, -114, 11, -114, -215, -136, 222, -16, -25, -269, 3, -197, 202, 39, -223, -166, 118, -3, -79, 154]
5935A54l53J89l5R2J21m91J72J17j21M37ol79k4p0J10K17j23j22Q1K88l22M0N3
5958B5j21R2Q1KJ36l77k6K7J37K9J34k84J41J4J91l1l68J42J27Q5k24l71O08k09
5982d0J1M73n39n6L5K60N3L9m90K56p9J26R5j97j30J51K8R8k55k3K49j17Q7j7
6006A8j60j29K69J21p4j18oo8K57m0j13mK92k69O9J20o1j87O5J35m5j48Mj10K20
6031C8k22K43l5k8R5m8M7r6J26k94K02K16k76O9j64j27M02K23n39L03l11J67J13
6054A04j46Q3L5m76M81J52k67J01k85L24N8l7k66J6k99O04o0j04j79O7J60K51
6076C17l67O0k73K98N5J84j50l51L47q1l4k0Q8l32K49L09k64j93L50l85J45n4
6098a02L12j58p4l5K3L04j02l17j4K07J05M9k41k50K34j8J44j70M9J04Jo9J10
$$ y = [154, -199, -10, -45, 47, 168, -323, -151, -34, -155, 282, 276, -103, -127, -197, -87, 130, 7, -115, -34, 254, -68, -28, 25, -96, -4, 77, 79, 215, -162, -188, -161, -24, 5, 139, -145, -4, 10, 201, 170, -198, -56, 71, 156, -68, -439, 169, -40, -29, 444, -95, -151, -116, 144, 197, 236, -254, 2, -77, 49, 144, -53, -183, -32, -4, 94, -161, -184, 65, -52, 35, 18, -142, -271, -2, 119, 45, -73, -79, -147, 110, 70, -43, -47, 245, -24, 45, 165, 104, -83, -18, 117, 72, -76, -72, -182, 38, -184, 59, 24, -4, 91, 43, 90, -6, 120, -174, 28, 244, -32, 37, -127, -254, 148, 371, -168, 135, -176, -9, 104, -42, 41, 76, -400, 81, 233, -34, 67, -218, 106, 164, 127, -139, -123, -422, 182, 122, 18, -161, -94, 66, 317, -50, 10, -263, 35, 90, 274, 124, -227, 120, 39, 5, -15, 73, -259, -10, 299, 35, -158, 192, -193, -48, -102, 210, 52, -22, -57, -34, 270, 168, -149, -163, 44, 149, 198, -43, -293, -59, -77, 67, -103, -54, 50, 51, -18, 92]
6121I2n6j58J80r1K94j55o1P7k87J96J38l00J46q0L3j0jJ7K65j06pj39ln2Q8J1
6147C1Oj00K8pJ04J03p7k41J53n1l9Q7Q4j49n6L45J48r8k89Q9J16k53L67k33j25
6172e7j85J79K01o1j12j26J06N8J64k15Kj04J64k5r1k43K4M03J06L1j70M4j53
6195f0K8L93j76k93r5Q9L12j39Q8p4J0ln6Q4p7k83L80r4L6j40Mj90L68j34j66
6220a88M94k23j87J01j49J99j78j89K15J56K28l45M1m7K73P0j91j20j28L40l2
6241A40m6j89j2M6l13N59K9m83J15K02n0l5k35K34K9m0J59l00k8J28L21m0l72
6264a81j99K22N4J62J32o46N87j97J52j74K08n21K57R8j2K12j17o5qP1p4k52J38
6287a53R3O9k04L01k87l7ON44k66q3M9k4k24L28k28R8o7R3k11R6l3J80k58O3K39
$$ y = [92, 36, -122, 58, -33, 261, 106, 45, 122, -165, 31, 169, -131, 15, -65, -32, -42, -43, -26, 239, 133, 126, -13, -16, -68, 20, 31, 37, -63, -35, -42, 62, 165, 88, -153, 0, -51, -90, -3, 81, -68, -124, 221, 369, 271, -18, 71, 187, -66, 301, 68, -57, -242, -63, 138, 77, -35, -161, -55, 3, 167, -48, -46, -150, 14, -11, -102, -345, -321, 82, 188, 219, 49, 93, -60, -32, 361, 185, -108, -203, -114, 198, 59, 147, 73, 83, 80, 24, 108, 31, -252, 128, 34, 70, -70, -66, -256, 112, -22, -188, 306, 83, -104, -3, -152, 47, -131, -320, -105, 51, 279, -66, -25, -72, 201, 271, 80, -40, -168, 172, 140, 94, -95, -107, -61, -374, 185, 214, -269, -154, 48, -2, -37, -272, -38, -9, -49, 110, -190, -218, -90, 231, 191, -181, -380, -158, -104, 58, 190, -456, 131, -66, 86, -88, 120, -401, -144, -46, -58, 154, 37, -28, -36, 35, -39, -291, -153, -60, 9, -195, 106, -181, -218, -212, 332, 66, -17, 32, 8, -216, 112, -116, -18, -85, 8, -203, -107, -140, 40, -218, -155, 84]
6312H4jj63m3J82j49K52j03n3J71l29K11j39L0j76J18Q1R5p4l42K66P0K85j64
6335A09k2j65r3J16J78L1m65L18Jj18J05j14O4k05K16J67J73l46N9m3N1J88l17
6358a12j3j76J28J89o8R0J10k11M8M7J42k36j65K61ok40J24R4J20k55J14k4k13
6381b52J7Q6K28L6r7j21j2L60j62L5k26R3n9L48j91k57n1L48q3N7j11q0L17j05
6405A18O3r5j30P8L0Pj8J16r8j7Q8j37p6j93l5L72j33K25r2k35J17O7o3j13K3
6430a31L05j39QK29l53p2l1K42r3J11k38K03j04j34K45n7m1R1j8q1q3N0j42K64
6454C1K47j39l53L32J9k15K23j53p7j13K24K03k50k16j8J79L07k74j85p5L42j55
6476a16L10j76k28K3K5j7K97j82J35p4J3r5N5N3j87J13N2M3j74N4K84o8p6J10
$$ y = [84, 83, -80, -123, 59, -90, 162, 59, 6, 177, -152, 59, -80, -50, -226, -108, -27, 68, -6, -348, -82, -12, 273, 109, 87, -78, -171, -55, 123, 154, -311, 7, 8, -110, -5, -119, -55, -260, -44, 123, 296, -50, 9, -34, 17, 205, -112, -125, -301, -173, 16, -52, 38, 148, -63, -15, 32, 174, -62, -227, 34, 28, -212, -88, 6, 126, -129, -15, -39, -252, -235, -149, 79, 115, 18, -103, -115, 245, 83, 118, -108, -15, -74, 274, 83, -174, -225, 123, 40, 97, -14, -94, 223, 118, 181, 86, -44, 34, 64, 71, 53, 169, 71, 54, 142, 5, -71, -264, -299, 73, -60, 165, 73, -162, -45, 22, -41, -154, -131, 174, 35, 43, 272, -81, -153, -184, 58, -35, 76, -162, 41, -63, -197, 48, -9, -50, 41, 23, -58, -141, -91, -233, 31, 278, 139, -214, 118, 137, -78, 145, -8, -85, -198, 26, 229, -21, -237, -255, -76, 231, -43, -228, -303, 39, -116, 194, 18, -210, -187, -162, -179, 118, -64, 71, -3, 10, -85, -30, 23, -164, -51, 1, 44, -130, -76, 208, 140, 64, 174]
6500A74m13L45j56Q4l25J52J36P1j35j1k05K21pL50q9j36Q2k71J8J6L87j09j49
6523C0o4P5LN1j90k50L59oR8o4j72r9L23j06j86m2J69m6K21k13P7j05lQ0J42p5
6549GJ39j61lk9J64l05K67j69J52j00Mo0J73k28M22j84K42m32O1J43k26K45j48
6572b6r9J84K04m00Q2j24J46M1M6N3j45j08m7J02L16j62j11kK9K08l36j3nm4J26
6597h5J1J69j15J00j02k57J17J90l62K80M5J46j41J6R2j18L63l69n3j55LL84o8
6620I1p4k94J03L9L48m3k60j7K20k04J21m4N1k4J21J36j65j37q7K07J82l12j39
6643a81L90k27k5R1K4p7k75L45k55Q7n9N9ON4Q9r4j9N4L2j06J58Q5m71K80J05
6668G0J10k11l0j4j5m2K74J0k55K03j14J20Pk7q7O9j54M8k18jQ7K86j90j67j11
$$ y = [174, -239, 106, -50, 34, -291, -139, -3, 68, -67, -78, -283, -62, -69, 281, 192, 56, 138, -133, -115, -99, 288, 179, 30, -34, 41, 44, 95, -95, -345, 14, 8, 106, 42, -130, -229, 94, -12, -198, -240, -71, -117, 104, -109, -32, -137, -140, -60, 82, 7, 146, -15, -18, -47, 117, -188, 79, -90, 62, -38, -34, -94, 79, -149, 273, 89, 331, -101, -40, 103, -123, 122, -26, -125, 59, 263, -137, -55, -179, -33, 8, 54, 107, -38, -146, -193, -91, 225, 63, -48, -50, -21, 187, -149, -162, -167, -211, -85, -74, 95, -20, 80, -22, -279, -162, 28, -334, -54, -9, 137, -4, 12, 104, -14, 349, -20, -73, -228, -225, 159, 91, 17, -277, -174, -135, 213, 170, -90, -107, 113, -91, 30, -14, 37, 13, 134, 270, 105, -32, -119, 88, 270, -42, -181, 209, -18, -43, 48, 72, -5, -280, 65, -190, -103, -162, -103, -97, -43, 46, -48, -67, -13, 19, -87, 71, 156, -315, -35, 70, 180, -31, -61, -75, -90, -132, 142, 152, -103, 100, -14, 106, 113, 86, -1, 68, -86, -38, -256, -257, -170, 116, -74, -241, -352]
6693c52K96N0Q9p1K0m1j70M8L75l1k48k2J21j92K48j51J70j23q6L54l80J15n2
6716c3j28K67ll81K95m33L16K46k13J89j36j23K02J0K74n39k0L01J62m37J09J24
6738D9R1l1P9k13q0K26k28J37j10N8p7J42KL6K8k16K35j84l1J58Lk05J57J35l03
6763a42M57m27R2K7j05L3K66j71k61O00n16K15r5j31M55k92R7l6m40M10m1l1q
6786d4k28l1M06M8o7j02r1m1J47M5N7j72Q6K8J10j71Oj54L77k14n8R1k35K86j92
6811a13J70m7j31O5K63m2k12L9j7J36j86J80j33KK2N9Rl3K59n54J92R1r5LJ84
6836A11j11l6J34o3O4j85jK62n5j25q0j84L34K8j67R1j5q2J23r5K74l34J03p6
6860h5J00O5j57K0j65o8N20l61K3P6J57J1k15Q1q0j0Q6K01j95k15O1K49jk24O7
$$ y = [-352, -56, -6, 83, 12, 32, -9, -179, -131, 244, 213, -35, -57, 64, -128, 120, -31, 139, 16, -70, 284, -96, 19, -33, -161, 106, 103, -278, 17, -416, -100, 146, -67, 122, -14, -137, 65, 75, 349, -190, -210, 91, 253, -184, -75, 49, 140, 109, 188, -25, -105, 121, -107, 30, -80, -22, -99, 43, 45, 81, 109, -107, 128, -56, -87, 71, 74, -131, 26, 161, -142, 315, -112, -20, 7, -98, -65, 201, 30, -231, 369, -147, 68, -27, -158, 297, 5, 102, 66, -374, 36, -5, -36, -44, -272, -303, 103, 151, 84, -18, -109, -150, -3, 42, 99, -73, 13, 41, 151, -20, -14, -168, 209, -5, -63, 28, -207, 79, -113, 57, 10, -121, -56, 207, 165, -47, -8, -25, 111, -75, 105, -28, -26, -4, 55, 64, 31, 290, -264, -72, 19, -76, -73, 111, 0, -36, 98, 35, 99, -86, -87, 175, 120, -5, -85, -269, 65, 93, -74, 17, 2, -80, 43, -52, 222, -112, -9, -85, 15, 80, -77, -57, -222, -290, 230, -131, -108, -32, 125, 136, -79, 2, -78, -88, -2, 199, 4, -211, -150, 99, 98, -126, -59]
6885e9O2L6l5J47P0k50j07R4J66J03k80J32j46m6J32JJ3k7J84k1j40n0j60K57
6909G6P0L6j48l56K85P0p7j5j17L13j44J58j30J90m91K38K28j04p8L8j30J00j2
6932@O3m28M21j97P5K47j54kj87P3r8J52l5K21l3Oj4j16K22k50L6J04nj76L1n6
6958a00K4L16q2k11J03o6q0q1J74M4j25J8K59J2l87J55j29N6J59o9N7k22L91j06
6982A10o3l7N3K4j04J10j08J51j96K16j45J70m47L89M7N1j09j90l0j0J04M9j56
7005a21J07k28J04n2K94j28N6l0J6R3j04m8J47N5O5j25j45q3K60M5k20J13r6n
7029c0r5J00K3o6L7j34J68J25J00p5j40q6k1K33m37M08k42K68K3j55p9P5j96O2
7053a34J19J25n66L19j17N34j85K6k03N0N6K3j41r9K19r0J73k6k73J42L52k22
$$ y = [-59, 3, 39, 4, 151, 221, -29, -136, -42, 124, 227, -53, 79, -67, -113, 19, 20, 33, 6, 190, 169, 29, -21, -181, 76, 146, 182, 34, -322, -37, 33, -44, -59, -176, 137, -7, 151, 21, 211, -280, -42, 186, 82, 4, 42, -88, 12, 0, 63, -365, 56, -141, -66, 181, 27, 25, -162, -89, -187, -35, -70, 151, 118, 124, 110, -6, 216, -34, 2, 106, 101, -75, -44, -100, -76, 240, 158, -53, 50, -16, -96, -177, -3, 41, -84, -66, 193, 205, -182, -27, -156, -100, 59, -10, 47, -175, 216, 110, 47, 10, 63, 87, -17, 93, -15, 136, -60, 156, 11, 181, -266, 123, 170, 221, 112, -78, -108, -118, -14, 35, -121, -14, -242, -138, -190, 104, -24, 32, 2, 18, 111, 7, -41, 106, 161, 226, 101, -44, -127, 133, 178, -42, 71, -25, -30, -125, -25, -2, -68, -31, -165, 3, 128, 228, 153, 13, -73, -94, 139, -298, 110, -132, 136, 159, 4, -75, 0, -196, -134, -15, 110, -456, -137, -254, 280, 95, 121, -82, -32, 24, 47, -94, -193, 26, -64, 109, 83, -190, -48, 304, 82]
7075H2n1n5j35R7J67l28N30o81K76K8L8J17J54k45q0J26O7k3l32K24J13j30J98
7098A57n1j36J6j71K49o9k76J88M56l05o9j62J97j88K66l1j2M3j79q2L80k02n1
7121c2J9l69J86K99N5m85J29L6M6L57j23j62P5l0j15L37k77K5k7K60j61L1k98
7144b24K31L83m83K45k89J80m1j63K28q0rk26N32k09l1j37R8k06K95K01l92M3
7166e4k12N21k40J50j56p7J51J23l31J17j4j55K59K3j1k66J14Kj85K28k5qK98
7189B52j97j73M35m04k47M82j56JJ04j42l41M81J20m30Q3J6R1J15J48m22K61o6
7211A1J1J03R1k54j48J37k71N55l71J62j57l2J29L18j08m51K41j03J02j97K46
7232A4j25jJ91l2j22j09J51M44m40j26J89L5j23L24l74j67J17K15j47K08j00j08
$$ y = [82, 31, -24, -159, -62, 105, -223, 307, -374, -98, -70, -32, 85, 239, -6, -86, 40, 107, 84, -248, -24, 89, -41, 157, 106, -30, -14, -185, 64, -5, -281, -93, 363, 58, -11, -173, 24, -164, 102, 71, 59, 102, -77, -159, 221, 19, -32, -13, -382, -196, 103, 158, -327, -198, -162, -116, 241, 118, -44, 31, 1, -114, 223, -54, -29, -56, 204, 43, 74, -224, 7, 390, -93, 152, -137, 43, 2, -161, 67, -13, -22, -248, 284, 75, 44, -93, 5, -201, 94, 295, -97, -54, -266, 255, 15, 165, 9, -68, 83, 206, -125, -8, -22, -177, 82, 105, 94, -172, -58, -56, -241, -13, -38, -46, 252, 55, -118, 317, -87, -334, 148, -8, -7, 97, -45, -386, 95, 215, -215, -132, -116, -25, 90, 238, -184, 77, 11, 22, 125, 216, -38, -186, -49, -320, 235, -136, 26, -131, -163, -34, 284, 176, -275, -34, -137, -35, -232, 14, -111, -112, 79, 47, -75, -184, -33, 411, -29, -155, 34, 69, -54, 270, -104, -271, -154, 61, -86, 122, 22, -86]
7254h6J32p7J77k71R1K1m4l05L25OJ00k24L0J09K17j54j91K27n2K82k52k53J86
7277fR7j04l0L4k14K34O5Mj60j05K63K0oj33n6k6J37P3M4l86Q6J22k43M46m02
7302b46Q5J72k6K36k21J56j54j90M11j29r3k25r3L75j70N1P8o0k45L28%o9rJ39
7326A01J21j65o7P0K4j19J55k81L09j48J61k47L99k46l30J03K20j64K67j45q3
7347f5J44Q7k28N6Rl1J73k03R7M9J79k55P0j03K5O1l75L09P6j39j28L01r7j05
7371i3J55k00J81l79K00J44K56l52J78k14K39l6j71L20l00j40K82J19k29j59J19
7392h0J71J07J46k62j14j94M45j23K1j90J1K50j04R5l30O8K1j66J34q4p9J09P4
7415g4J73j07k8j04J72N6j9j26o5k77L67N8K00m8l58J93J60K7j88L00l53l2K64
$$ y = [-86, 46, -31, 146, -125, -34, -13, -57, -362, -37, -31, 69, -155, -125, -16, 201, 47, -144, 83, 31, 313, 61, -192, -6, 91, -13, -43, -9, -223, 11, 76, 80, -80, -185, 78, 98, 92, -41, -97, -123, 14, 87, 131, -255, -169, -47, -290, 156, -246, -161, 11, -15, 221, 0, 156, 2, -188, 223, 94, 1, -224, -317, 58, -112, -61, 17, -43, -288, 40, 40, -29, -38, 101, 222, 57, -10, 60, 84, -35, 120, -161, 148, 0, 161, -86, 313, 67, -263, -160, 60, -104, 163, 18, -65, 79, 166, -62, -6, 3, -28, 145, -58, 39, 88, 267, 12, 82, -21, 4, 65, -310, -1, 75, -64, -192, 109, 12, -93, 62, -138, 43, -336, -136, 8, 264, -88, 90, -124, 115, 79, -92, 228, -72, -212, 70, 189, -40, -199, -80, 91, 198, 344, 82, -32, -226, 219, 96, 117, -73, -62, 188, 84, 179, -151, -83, -62, -228, -94, -178, -257, -148, -74, 99, -8, -36, -140, 32, 88, 69, -57, -122, -399, -32, 26, 226, 178, -180, 13, 173, 200, 12, 312, -41, -73, 191]
7438A91j77j99J6J28j16L82k52J55k60J02p3K06j11k51K66P3j03j48Q3j55J76
7459f7MN6k54L2N27j29o4J11r9j0m01L30Q5k95n3K49Q1L4P2j15r0J69j31R6j47
7484iM5L5N3p6k15J54r0J53O7j58l63L00N4L48m02j22L36r6J32M6l17J03P0j68
7508a20K75j64j22J59K01j03m0k01M7K63k65kO7j01m6K34k41K87J23m51K28j65
7530a37J50K88k37j25K87l78L46l17J09J21l43J50J57j83k6L7K03R7K8k27P0j67
7552i7M1Q6l62r5L82J30j36K04j58q6K53j58M8j25O3j17j22L49k07j33K28M4J88
7575B20j96j21q1K32l45M95j90j62J53N6j6J13q7n8l4l4P1J03l15L16k59N7K01
7598A19j22j14J18r2Q4N5l24J81K26k3M4j23j8k1j32K50k86O1k26K41J05K54n00
$$ y = [191, 14, -185, -169, -41, -157, 225, -27, 128, -132, -30, -103, 103, -8, -259, 7, 80, -23, -171, -88, -243, -67, -63, -7, -261, -229, 298, 169, 105, 216, 117, 107, -294, 36, 121, -174, -227, 22, 103, 137, 209, 94, 4, 173, 42, 138, -9, 36, 71, 124, 48, -167, -13, -103, 50, 117, -41, -404, -104, -50, 298, -104, -226, 110, 14, 146, 192, -125, -22, 48, -120, 155, -9, -131, 28, 229, 126, 86, -115, -68, 195, -70, -72, -5, -106, -152, 82, -159, 128, 251, -200, 28, -137, 13, 301, 64, -61, 226, -152, 194, -123, -14, 107, -236, -86, 71, -112, -138, -101, 102, 199, 227, 0, 70, -97, -56, 30, -332, -427, -45, 85, -51, 153, -5, -91, 162, 4, 52, -73, -10, -127, -249, 100, -107, -240, -12, 32, 220, 24, -97, -178, 54, -291, 204, 14, -148, 5, 61, 45, 158, 71, 13, -21, -55, 16, 119, -196, 120, -139, -82, 119, -3, -117, 1, -91, -7, 48, -276, -95, 131, 108, 152, 29, 11, -10, -142, 108, -178, -117, -343, -102, 3, 257, -243]
7621b43p3L38j52J45J5q0q1m2J07o5K09j76mj08M76j14q1j01K74k00O7l6q3N7
7645D9k7O2l6r7j81K43P0j92N7P2K5k4l07L36pr2L3K88j97k46o5J6J73M95k91
7670A57l4j61q0K60k43PK2J85j0l3j5j54N8L7J8J52j04j71J81j89O2J46n2l13
7694b74K81JQ1m2o0K54j16Pk69k5J65J2K12q0K2k87k6J41N6j9J60k34J11k5o9
7719b3j8K3k88K12P6j51J78j08L29j12m3q1r9r6J59J0P3Kk35K06n1k0P0O0j39
7744f6K21J2k67J97j8j12j24L79l45j69k9O69k41j3k3j76J50K50l91Q5p6L42k35
7767B0Q2k46r1K3L26j31Q3k46J26j58K85j32j9J6n1K06l6L8m0j84P7L42m05j8
7791a33J76Nk75J76K24k49j12Q4K43L2l26k8J74M7o3q1J6J10k2j26J17k44L25
$$ y = [-243, -316, 22, -130, 15, 30, -50, -131, -173, -66, -131, 78, -98, -102, -210, 266, 152, 71, -30, 244, 44, 111, 75, -8, 49, 22, 84, 48, -49, -230, 13, 83, -109, -52, 20, 45, 21, -286, 50, 43, -49, -16, 272, 75, -171, -236, -220, -47, 448, 157, 123, -38, -118, 142, -101, -94, -72, 113, 103, 70, 55, -99, -41, -4, 14, 166, 62, -109, 72, -117, -55, 91, 39, -274, 7, 8, 89, 47, -13, 241, 125, 132, -137, -162, 3, 15, 227, 147, 169, -118, -144, -3, 53, 34, 194, -40, 71, 46, -23, -41, -18, -306, -94, -18, -169, 9, -99, 230, 118, 75, -6, -105, -201, -42, -32, 41, 43, -192, 14, -37, -57, 13, 73, -66, 155, 167, -100, 97, 79, -33, -157, 222, -123, -292, -321, 348, 107, 94, 71, -105, 45, 295, -96, -11, -87, 255, 20, 102, -144, -235, -212, 114, -17, 66, -180, -54, -212, 73, -59, -78, -62, -113, 93, 57, 95, 55, -129, -52, 290, -115, -133, 43, 48, -227, -51, 173, -76, -188, -104, 139, 171, -155, -183, -9, 38, -25, -106, -90, 20, -2, -128, -11, -255, 70]
7814G0j69J84Lj58j03J75L15l71J98k80m4O1j6J53j10k0J0nJ32M0r0k7j40K39
7838D7R8l02K52k46J34J73j03r4k27J74J67j78J0L00l13J70j92M2J24J70k79N7
7860a6n6J68k07R7R8m4J75k31j30K43j3n7K20j90j08r5P1N3j1K20K0j82L0J28
7884A83m9k34j39K68l0O0m14N14L1j24q3j68J89r3n1J81O6j0L0r7J51O6p3m21
7908b47L45j42m0L9R3n7j26P0K31j24j3J61j30j35n5L24l52J41Q9k1j84Q3NMK67
7933B26k45k40J7K80k47K01J16k01q7P4K42k16K7K69k23j16K21k50o4K35j81L70
7955B08qk46r8K92o4P2l30J46J58J17k29j80MJ36J34j28kJ18j78L7P7Q8j89J3
7979e2Q8k39J94j62J55l0Q0K85k32j70L40j91J13jJ0k11n8m7L08l91M42k82L5
$$ y = [70, -99, 85, 88, -70, -173, 2, 317, -54, 144, -136, -180, -119, -135, 18, -92, -112, -102, -107, 25, 65, -25, -52, -192, 47, 145, -157, 95, -151, -17, 156, 53, -41, -268, -94, 73, -105, -95, 205, -108, 62, -130, -88, 36, 206, -73, -16, -72, 96, -111, -14, 84, 40, 215, -16, -146, 97, 84, 27, 247, 57, -51, -146, -75, -22, -33, 187, 207, 25, 55, 183, 134, -100, -239, 29, -1, 59, -355, 159, 190, 66, -17, -185, 4, -89, -140, 41, 107, 97, 127, 30, 181, 247, 174, -247, 98, -44, -84, -45, 48, -9, -135, -65, 166, 42, 29, 190, 60, -75, -130, 194, -158, -17, 72, 51, -133, -50, -45, -41, 226, -19, -259, -242, 38, -209, -8, 108, -93, -180, -106, 136, -80, -53, 216, -7, -123, 98, -152, -216, 19, -162, 208, 200, -46, -144, 148, 84, 156, -174, -28, 130, 247, 18, -162, -158, -22, 112, -16, -18, 100, -78, -41, 36, 124, -65, -52, 36, -203, -9, -171, -16, -46, 34, 319, 87, -83, 257, 66, 179, 178, 188, -23, -81, -128, 180, -211, 231, -51, -16]
8002a6j96K05KK2o8K56k29P9o2L4k92L13J84k12j14J10J03j14J00l4j83j18J36
8025i4K30L6m60J57J31L8L4j22j17P7J53j49Q8r7M4L6L6N7M8j93P9J53j21m9N8
8050E3j87J65J73m47M44j57r2O5q7J26j47j40L01j29L7n0N4l21K62J08k30J81
8072a8Km2K42K6n64N44j20m0k3m8r3K31l23K39J58k56Q4o8k0J18J54k81P1J68
8096A41j46L2k21J36n8o1J87J87j61k67K91K8O4j63o6o3J51J32k19J34o6p5j62
8119b45J98r1o8J97K84k92j70L2l8L72k54K28j14l7P6R6k8o7l36j3L32J64j30
8142I6j71R7k16L3J48l2K02Rl85J9L77j87j7L1j34J11j30j29J87M3L7j01K07q8
8166GQ1j67j06K09o5n6K54R2k72K7p1K18r7r6n4K49o7k50L45N7l05q6J20n3L2
$$ y = [-16, -212, -7, -5, 17, -51, 205, -24, 55, -7, 27, -265, 48, 232, 20, -94, 16, 119, 5, 105, 71, -112, -230, -94, 136, 172, -288, -131, 0, 38, 72, -50, -167, -90, 63, -86, 2, -95, -51, -15, 21, 78, 126, -67, 12, 165, 44, -5, 53, -134, 31, 204, -243, 201, 44, -48, 17, -70, 56, -91, -231, 70, -59, -22, -72, -18, -339, -77, 31, -199, -18, -16, -58, 184, 210, -354, 190, 70, 30, 7, -41, -134, 97, -226, 13, 171, -85, -1, -69, -89, 29, 183, -98, -27, 141, -5, 27, -194, -58, -116, -177, 10, 197, 36, -231, 60, 88, 152, -11, -77, -140, 11, 143, -76, 58, -8, -83, -245, -47, -138, -206, -9, 275, -17, -187, -155, -193, 179, -75, 153, 39, 2, 78, 174, 146, 79, -257, -270, 62, 226, 96, -75, 22, -194, -161, -13, -45, 157, 166, -219, -200, 177, -10, -27, 4, -130, -19, -149, -278, -91, -48, -11, -112, 95, 7, 88, -79, -185, 24, -41, -97, 157, 249, -23, 4, -67, 151, 54, -42, -96, 153, 86, -164, 181, 238, -67, -153, -33, -86, -54]
8191e4
$$ Imaginary data points
##PAGE= N=2
##DATA TABLE= (X++(I..I)), XYDATA
0@%%%%%%Qq%oJ4j6J6j6K4l2M0m8N6p2Q8j04J20j40J64j92K24k58K96l38L85m38
32b33M97n60O32p13P98q90R93j110J236j370J517j678J854k048K259k488K741
49A437l020L327l664M040m460M933n472O084o793P622q606R803j1288J3185j5700
64h572J9199k4400L2901m9051Q9702l65922n94893J180686L28148p21155M7257
75f6100K80187l44402J23760L61824l59275l14123L67027J28294k79642k7508
85a29958J87253J623q3241j3391M9220N6692L262j47994j27779J86109K18669
96B00465k46669k31861K87351J41620k54549R8576K28817k53023j01562K97790
106A66955p5575k14211J99728M427k92827J31566K54016j59816j40524Q7697O7402
$$ y = [0, 0, 0, 0, 0, 0, 0, 8, 0, 0, -6, 8, -8, 8, -8, 16, -16, 24, -24, 32, -40, 48, -56, 64, -76, 88, -104, 120, -138, 158, -180, 205, -233, 264, -296, 336, -377, 421, -469, 524, -586, 650, -720, 797, -881, 973, -1075, 1184, -1304, 1437, -1583, 1744, -1920, 2120, -2340, 2593, -2879, 3205, -3588, 4034, -4572, 5231, -6057, 7128, -8572, 10627, -13773, 19128, -29923, 59779, -306143, -901036, 279650, 607798, -113357, -66100, 214087, -130315, -6555, 355269, -4006, -318129, 48898, 177192, -102450, -129958, 57295, 58918, -24323, -37714, 11506, 68198, 71460, -76534, -204313, -18204, 200465, -46204, -278065, 9286, 150906, -103643, -5067, 223750, -29273, -130835, 166955, 91380, -122831, 76897, 81324, -211503, -79937, 174079, 14263, -126261, -38564, 28838]
117B8838R3232k049k10175k470K13701m5565j55122M2313J0832p2224M9788O7454
129A8553k9002k9218J1543L3943J4391K844P0583j8316j83277M5066K48982r9039
141H7053k41587J26140J31521j29160J2116J01966j05003n4173J00554m77l8442
152i492J0482n9595l3959O6776L5884J1423l2554j13829O8751K26044n7163k16981
164a04213N9069J49286k5241n5523l6512l4773O1945M3059p8212l2173M1555J6337
176D604J5244k9599n5922P9427O8177j22374n1631J26350K7693q0878k1587J2734
188b7762M2062M1332o1755l7420P0207q999m2811O6450j1113r6027N9802O7030
200F0996q7209m176P9587n8555n6049R0374M6415p3790n7712L0791Q3532O826
$$ y = [28838, 122070, 120021, -90154, -92624, 121077, 75512, -79610, -37297, -26465, -98689, -48901, 18553, -10449, -39667, -28124, 5819, 20210, 23054, 93637, 75321, -107956, -62890, 186092, 87053, -154534, -28394, 103127, -26033, -13917, 88049, -16954, -71127, 29427, 28950, -9492, 990, -58605, -92564, -25788, 10096, 21519, -11035, -124864, -56113, 169931, 112768, -104213, -45144, 104142, 78901, 23378, -13134, -47907, 14038, 57097, -21115, -53288, -11733, 4604, 19848, -9751, -65673, 13754, 81931, -40443, -92074, 34276, 61969, -18909, -40496, -27762, 14300, 55632, -6123, -43543, 26664, 17665, -25146, 41304, 30191, -65836, -6034, 60996, -26213, -30389, 49198, -9357, -65406, 24968, 71383, -2407, -60119, -29328, 54204, 61030]
212F1030r9800k0732Q1238J058l5592K2737k2624l5905O0106K8634n9660q921
224b8431L6605N617q148j6095Q989M4102l5736o4911P2173O2230r4388l8147P6533
237B0393j175l5719K8827q557l6863K6445K7406q880j2466k3636Q595M3707j7282
250A0795l2151L1832p526m3669M8464M4346o4193l5865M4988K8837r75k3911l4550
263c3578K5834M0288k5738j3069J5698k6620l17N0427j8395m5493L1845J7422
275A8304l5389J0913L1362j9573k3905J583J5925K4421j2755l9750Q193K9113
287H442j161J677m245k8803R630L8247n248k1175k000o000R734K4013j1566k0233
301h688K815n995Q185L3347j9093m5154J9036L1216p491m07m895k7296J2795L7262
$$ y = [61030, -38770, -59502, 21736, 22794, -12798, 9939, -12685, -48590, 11516, 40150, -19510, -28431, 8174, 13791, 5643, -10452, -1463, 42639, 6903, -58008, 14165, 76395, -17993, -56140, 20393, 19218, -16501, 12326, 3769, -33094, -6649, 20757, 11877, -589, -24225, -15630, 28077, 10795, -21356, 10476, 2950, -40719, 7745, 52091, -12102, -47967, -2979, 25858, 24883, 972, -33578, -7744, 32544, 6806, -6263, 9435, -17185, -17502, 32925, 14530, -30963, 882, 18304, -17085, -6172, 25190, 5617, -18288, -16705, -780, 23641, 10886, -28864, -20671, 8442, 7281, 8958, 4713, -24090, -14460, 23787, 18539, -2636, -4636, -10636, -902, 23111, 11545, -8688, -5873, -11868, -3683, 29664, 10571, -34583, -15547, 15669, 8178, 7771, 2876, -24420, -11625, 25637]
315B5637j1274k7953O41M528M035J1680k770j1866k772K956J4368J6437j1615
328A2032k0349K933J1133O941J261j7415j9032P250K0127R206r633k2531l53L1326
342A2896J0636j9918o385o55j1187J3128K0614k1573k7826J2334K2248N463j259
355H516p113q294Q270J7454M296j3708k0047n598J7172J2545j5445j7802M469
368a5285J1901O080O911K207j4222r728J7512J7112j3151k2572m351P600Q603
381a383O584m062j4157k714K1521K2094p382k3584m399J3418O444m839j2141j4566
395a9166k723J3177J2052J234r447j0680J3037K7750J43k1123o768O41J282J2162
409A1571k047k8027q644K0761J3197j97n799r771M150J6500K504o600o452j5496
$$ y = [25637, 14363, -13590, -12949, -8421, -4386, 7294, 4524, -7342, -10114, -7158, 7210, 23647, 12032, -8317, -5384, 5749, 12690, 13951, -3464, -22496, -15246, 4881, 14087, 4454, -18077, -18430, 12896, 23532, 3614, -2771, -3426, -14613, -1485, 19129, -2444, -30270, -17936, 4312, 9775, 8516, 1403, -6891, 1379, 18833, 23129, 9421, -10626, -16224, 948, 13493, -1952, -19754, -15285, -3384, 2696, 9607, 11814, -2408, -12136, 5376, 22488, 9337, -13235, -17586, -9986, -1383, 5201, 1139, -13018, -15732, 5789, 27883, 20501, -3083, -7482, 5936, 12380, 7541, -4600, -19166, -21889, -8712, 3340, 4574, -4873, -15553, -2516, 25234, 25377, 4254, -2514, -1873, -591, 11571, 9524, -18503, -27147, -6386, 6811, 6614, 815, -8956, -4806, 11694, 14198, 7598, 1146, -14350]
423a4350l514K1532P700j8369j2073N665J9103J8296o432j7807j101P656P967
436A4273N723j9320k7385R348J9129m899l736p72j1111R852K5828L98j0879o421
450B8j0578J2502K5887j7644l3335O333J5170K842Q290p676j8899J1047J8134
463A2101l19J001r339j8980J1866J7140j0502k362j320k1851R884L7848p814k9409
477a2056K47P898J1316J3208k1169k4345J5035R580m939J1095p165k3382J6655
490h022K5840n874k342n36j5813R529K5221q685k0975q845k459J8740J3281l0516
504a1456j9395K0924R632j762L589j3212o401J9483L359k347J1663j7117j6907
517a9947L2382J4672k5802J336K298k0289K4162K8696l8584k6711K5721J0143
$$ y = [-14350, -17864, 3668, 11368, -7001, -19074, -13409, 5694, 23990, 17558, -249, -1350, 6306, 14273, 19996, 676, -26709, -17361, 1768, -3131, -6867, -7639, -18750, -8898, 16930, 17328, 6449, 28, -10550, 1952, 27839, 10195, -23140, -16807, -1637, 1205, 9495, 1819, -17080, -6033, 12101, 11782, 12783, 3444, -15536, -3670, 13470, 2968, 606, -714, -22565, -12681, 25167, 17353, -12056, -11809, -3911, 7405, 20613, -556, -24901, -9866, -286, -5225, 5870, -1295, -24677, -8022, 17818, 11944, 9602, 9066, -6747, 2782, 28003, 19318, -1657, -10502, -12961, 5779, 19060, -11456, -30851, -9927, -295, -2057, 1532, -11680, -18081, 1402, 4761, 2414, 14077, -3040, -19947, 12435, 27107, 1305, 2641, 4939, -15350, 8812, 37508, -1076, -27787, -2066, 8077]
529H077k063J058k3020o421K6080k518j0059J5279j0751j9164K4885J6622j5058
542B947L33l373j2563K1113J5501k3607j0274M083l761J6983Q036k8399j959K4477
556I537n800l700J5984q252j3527O850K165M888M355k8740j2281L3022N034k1375
570a1840L558l042m401L0289M843l3289L134K0486m100M653k893k2679J3599K0857
584A9175j9527J751J7285k6183n476L7176q166k7807P686o290n875K8994r641
597C102l7716J6860K3590j0077P542M485k0608J2284K3825j4823n797R442j4917
610b808m296J6344n240m709K417j6626M703L0297r577k4108R420O527k415R869
624I798j0500j7340J4508O036j0478R633P04j3800J2045Q319j1202J0368L770
$$ y = [8077, 6014, 7072, -15948, -22369, 3711, 1193, -8866, 6413, -4338, -23502, 1383, 18005, 2947, 3280, -93, -12656, 8457, 23958, 351, -9923, -5840, -9601, 7382, 15418, -12981, -14940, 9537, 3737, 37, 16021, 7769, -5758, 1092, 3257, 8145, 12500, -16240, -28521, 4501, 9535, -11840, -8282, -11324, -15725, 14564, 19407, -13882, -10748, 9738, 5638, 10291, 7398, -15281, -1682, 19175, -352, 1399, 18684, -7499, -12975, 24201, 16035, -11772, -4086, -10376, -16251, 12743, 3102, -34614, -17754, 5836, -4241, 3301, 7786, -12822, -538, 23287, 8464, 2667, 12109, -2808, -7104, 9240, 4000, -709, 1708, -14918, -10215, 20082, 10505, -13603, -4183, 2344, -71, 9798, -702, -18042, -3534, 2502, -7976, 1657, 2361, -11439, 606, 8925, -2277, 8091, 11861]
637A1861k4898P735K2287j5433r620P878r909R237K0999k2773j4205K7730j84
650A0705j4583J5442o545k2123J7065R682j8226M672K415j7935J3971K0219j4864
663a05o755M019n161J7385J5666k9416j5574K4343O335o504K502j3780o054K0671
677G572L026j0891L418q465o097K0916P43j8448N901M61j2973J8571J2746k5301
691h821n406J5975l75M329L124j8688J794J9006r254m393J3277j4457r678K1881
705H314R40j4219P400l115j0174J7822O907j8560j066M132l293J6025M32k7929
719a6384M173K2403q837n352Q441j2645l753J9874j92r929L049n181j342J7246
733A1571j344j5558K398O39j633J4845k072k0970K685J3372L80K393m760j3051
$$ y = [11861, -13037, -5302, 16985, 1552, -8068, -190, -10099, -862, 20137, -2636, -16841, 10889, 10705, -3878, 11564, 5019, -17104, -39, 9643, -8583, -3911, -1496, -19431, -5460, 14759, -105, -6860, -2841, -8002, 9383, 25049, -4367, -19941, 4402, 10737, 4233, 6735, -7045, -13099, 7572, 10598, -293, 3125, -5340, -11437, 9479, 10222, -8226, -2325, -1864, -14837, 3734, 16480, -8821, -14227, 1748, 1373, 5702, 8826, -9862, -8068, 10938, 1684, -2709, 10568, -3889, -13567, 8314, 9254, -4965, 2435, -680, -10854, 6968, 13875, -4685, -5751, -1619, -4912, 11113, 11545, -16384, -12211, 10192, 1355, -3997, 4444, -8201, -11954, 7920, 7728, -2201, 848, -4333, -5675, 11571, 10227, -5331, -2933, -2294, -3927, 10918, 8846, -12124, -9439, 3933, 4313, 6706, 1946, -11105]
747a1105P712J2377p133J77O58j5612N125K0276q903j1236N889m866K225J8567
761A4151p914j8027Q184O688j464Q501p040j7664J1841J3753r208o79J923j1025
775g980O043J4080q279o562K354o878M302J3452j0225j2371P460J752R80R584
789G712p242j2790J0231Q479l156L216o214j0480J1913R712r800j918J182q462
803g617P347J2997j0341j0074M116J491M699O116j1485q574R817L454j215M061
817D792q256q827J2806Q162p512k631j199k641R262M300p831j441r19k642J0505
832E928N494j5526m855J0393M38J67L965r145o083J0170N456l392k209p270j613
847h082J2486K315j0678j035J434j963Q472N655j0049n450N924N767L564l407
$$ y = [-11105, -3393, 8984, 1851, 2028, 2686, -12926, -7801, 12475, 3572, -7664, -1775, -6641, -4416, 14151, 6237, -11790, -3606, 3082, 1618, 10119, 3079, -14585, -2744, 11009, 1801, 1122, 3045, -7980, -1937, 12143, 3864, -2698, -344, -7222, -2920, 10532, 307, -12064, -4604, -2852, -1872, 7712, 470, -12320, -2089, 6390, 3234, 6450, 236, -10244, 1669, 11381, 1581, -337, 845, -7617, -270, 12727, 2386, -7688, -3572, -2081, 2618, 8734, -2751, -11325, -1508, 1946, 731, 4792, -3464, -12291, 515, 8677, 1165, -1466, -2665, -5306, 3956, 8256, 425, -1016, -1935, -4577, 5928, 11422, -4104, -8959, 1434, 1872, 2039, 6004, -3141, -9224, 946, 6402, 3010, 801, -6469, -8082, 4404, 6719, -3959, -4994, -3560, -5523, 2949, 8604, -1445, -6895, -971, 4796, 8360, 4953]
861D953r384l2P469L42k28j580r440K49J3246J236q310j463j11J387P259r48q134
878c489j800P97J957P218j415j1639J317J0004J852j82p30o962n0R127K099o347
894A757n450k922L906P448j744o996n43J851L742O500k833r543q78O399L066n05
910C255n495o822L575Q285J420k905l332j698N173O965j830p050k876O30L479
925G74L164l656o767j16N149N079J903m790m849K621O664K125m575o743k555M935
941a637M468k163l885k301L11O671N617l618o433Q0M050L539m15n295m964J612
957d363N602K892k426m422j378N463O730k920o726m40J795j64J954J46p242l808
973i307P353N716k819k698o19Q81N018L506l823n080j955K788N810k79q896k913
$$ y = [4953, -4431, -4463, 3006, 3348, 3120, 1540, -7900, -7651, 5595, 6831, -1479, -2942, -3053, -1666, 5593, 4645, -3489, -5289, -4492, -2535, 4683, 3268, -8371, -7054, 2950, 4802, 4620, 3890, -3072, -3122, 6005, 8104, 1757, -3693, -6615, -2709, 4739, 2995, -4001, -4544, -2693, 1049, 7549, 4716, -4827, -5705, 694, 3760, 3255, -2240, -9062, -5487, 2798, 4218, 1313, -2019, -3717, 1456, 8421, 6591, -459, -3335, -2705, 774, 3938, 282, -6485, -6601, -1452, 3627, 5530, 740, -4109, -1488, 5176, 7301, 2726, -4017, -6572, -1637, 2831, 668, -3217, -5518, -5207, 1464, 7081, 3463, -2970, -2890, 1160, 4699, 4284, -1011, -5975, -4363, 1239, 4131, 1705, -2717, -4095, 1368, 8098, 5178, -1548, -1988, -193, -357, 1597, 1743, -5499, -9307, -1954, 3762, 943, -1755, -2374, -1493, 3525, 7031, 3208, -1872, -3827, -1039, 4771, 4492, -4404, -7317]
989g317O973L605p95M09l410m212M556P180j733p250m450K561O528P92n013k128
1005c704L5J418O500K372q327m098N494L791j174j755k895k003K591L694J801
1020C740k326n506J234P620J466m258k725j106J349L661m55m691k928K44M574
1035a07M184n153n321N109L377k741L207K82r261L001J0511l666n706J888j869
1050b265J366Q206l243q351K975L140j379L918k150q929K919P116k804j118R16
1065C17n407j07Q659J399n037k937r92L517N574j436m977j851j9N348M679n413
1081A317n960K938K721J493K652m575o046M091M294k70L86n617m991P812M881
1096E126o713q24J876m690M512Q069p957o026O965J739k174L623l202m408M822
$$ y = [-7317, -344, 3261, 2466, 2875, -535, -4747, -191, 6989, 5256, -1994, -6444, -3883, 2645, 3437, -1576, -3704, -3669, -2251, 4249, 6621, -1706, -5804, -310, 3481, 2307, 552, -2343, -4346, -1755, 1939, 3740, 1414, -4092, -2858, 4762, 6228, 1970, -755, -1861, -512, 3149, 2694, -1997, -4925, -4681, -107, 4077, -1076, -6397, -1288, 2089, -652, 2555, 2837, -6424, -3423, 7088, 3422, -2284, -396, -2265, -899, 7307, 4064, -4287, -1312, 1828, 449, 4367, 2217, -6712, -3793, 3323, 519, -599, 317, -5090, -5197, 3462, 4861, -176, -3113, -4105, -588, 4986, 3550, -1427, -3278, -3297, 2051, 6730, 1317, -4643, -1705, 1016, 2509, 5161, 586, -5460, -1369, 2925, 2655, 3041, -2576, -7567, 245, 5126, -1587, -2411, -535, -5225, -713, 7356, -601, -6627, 338, 2077, -97, 3526, 324, -4084, 738]
1111G38K492k067K034l668n325P969N153q326k019L205k972L038M969o261n125
1126f165L966K995J987m06o493q87O655K0r14K127n182l924Q588M441n931k797
1142a920j84L42N364Q82m678j251j015N62O914o0r515L60N669k110J470L162p260
1159c268k814O932J063p23J23o251n9J0207j172o464K844j038l404Q681K640j1238
1175c941L73O531k376J052J701o726o81O571j89k040J64m701Q52P951j511o354
1191c324J569Q85r38M622j79o215O94L104N90K786k644n216L518L221j392J514
1207B595j098o757L104P094l008k916Q10l200K265O664l616n292K157m42N44N762
1223D666m042o970M524L207k272L487j265o969M000O428l223j186L94l570K208
$$ y = [738, 3230, 1163, 3197, -471, -5796, 2173, 7326, -1000, -3019, 186, -2786, 252, 5221, -1040, -6165, -2199, 796, 2783, 2377, -4116, -5003, 1652, 1672, 758, 2885, -2297, -6221, 2367, 6808, 877, -1920, -2104, -1762, 3602, 4484, -194, -1445, -2460, -1898, 5016, 4956, -4559, -4199, 1470, -640, 830, 3992, -3268, -6082, 850, 1913, 1190, 1313, -4938, -4997, 5210, 4038, -2426, 418, -620, -4024, 4657, 7297, -3941, -3568, 2963, 587, 1639, 3340, -3386, -4067, 2504, 2315, 275, 439, -4262, -3410, 4541, 3030, -3324, -1755, -870, -1808, 2814, 2635, -3580, -2886, 218, 808, 3594, 950, -4266, -748, 2473, 1081, 2595, 1497, -5260, -2156, 4938, 1930, -986, -176, -3376, -1111, 5553, 1937, -3355, -1198, -1640, -1096, 4666, 624, -6346, -1822, 1385, -887, 2600, 1335, -5634, -1634, 4794, 1571, 385, 779, -2791, -583]
1238e83N946m030l558J875q60J219M612m503m342L654J383j011L038k791n487
1253e438L650M438k177p86j450k246M442L391l796n14J04j939M304L708n883l583
1269c775M283O57o0J947l840k899L822J593n78N88m076k030O727J027n421Q09
1285a226M80l020M041L459m809k189K652K70K276J409n267q41M694q85M2K137
1301C223m539k960O224K365m471n17m01q59L960P82m195o82N03m33M113L29n931
1318c489k46M546k80J07J213m020m47M659M75j488n81k362L08N059j046l920J309
1335b03j06q75L921N44n563n5K702l7J242r99l797N08L669k60m14m62l117J350
1353a952M749q22l052N10m89R93L369j488l469Q48R62M70K378j736m306J522L491
$$ y = [-583, 5363, 1333, -2225, -350, -1210, 9, 4621, 118, -4224, -570, 813, -198, 2840, 49, -5438, -1788, 2650, 473, -313, -1763, -4009, 433, 3824, 28, -486, -382, -2321, 1983, 5691, -192, -3775, 508, 1165, 1105, 3052, -788, -3687, 135, 1728, 1150, 1738, -2338, -4368, 2359, 3386, -2035, -1226, -746, -3766, 275, 3734, -1075, -3264, -612, -342, 1934, 3343, -1924, -2765, 1929, 1044, 1086, 3223, -1316, -4276, 1948, 4313, -158, -675, -1076, -1935, 2025, 2807, -1388, -2070, -1567, -2000, 2113, 2442, -3489, -3735, 811, 531, 638, 1851, -2169, -2616, 2043, 2518, 1030, 449, -1913, -1605, 3454, 2408, -1512, -203, -309, -1184, 2737, 3281, -2282, -2337, 365, 328, 1570, 571, -3226, -2718, 951, 691, 277, -185, -3302, -1952, 2797, 1975, -1077, -567, -1056, -63, 3306, 1818, -1651, -803, 159, 629, 3007, 1271, -3035, -1513, 1978]
1370A978q09l90r54k849J521L579j155k154j02j193J694L515j816k965P72R43
1386c85J038K128j854l366K054J771J26P63k102k683K440K715j334j135p75j245
1402a844J718K625k081j861N3k73K171J761k935k195J704J414L71J052k119k279
1418b718K725K497j414r91p94p04J974K206j843j438k82p5J835J589k410k071
1434a914J029J139N79l1k042j313J466J678N45j043j974k14K965P50j530o45l54
1451i09K79K093Q66k057j443N99J521J321p78k587k75J743P70J07p45k531j94
1468b220K892Q59k114k99p81O22J870M43j533j227M72Q52J706l6k193o86J716
1485C43R14k13k4j465r00J779J549j118j606m02N17J460K46j307j341j05J603
$$ y = [1978, 1169, 779, -175, -3024, -1503, 2076, 921, -1233, -1335, -2528, -834, 2681, 865, -2100, -1328, -385, 653, 2781, 927, -2439, -385, 1386, 1512, 2275, 173, -2510, -70, 2645, 1311, 176, -599, -1844, -126, 2499, 418, -1443, -1390, -1663, 508, 2269, -666, -2861, -1157, 257, 628, 1680, -439, -2718, 7, 2504, 1090, 99, -695, -1399, 575, 2781, 938, -500, -782, -857, 978, 2567, 157, -1914, -885, 254, 833, 802, -1240, -2553, -1087, 591, 1136, 93, -1881, -2095, 870, 1620, 90, -555, -909, -630, 1463, 2329, 272, -1171, -572, 949, 2270, 1492, -1095, -1370, 373, 1143, 1250, 505, -2026, -2220, 672, 1531, -583, -882, -1663, -1041, 829, 1272, -261, -1488, -1016, -164, 1542, 1506, -687, -1373, 343, 1257, 1044, 1020, -445, -1345, 434, 1983, 865, -741, -1143, -626, 834, 1080, -227, -1568, -1673, -70]
1502g0R21l93j489p48J269J668l53j414n70N94O96J361j30k031n69J985R72m83
1520A216p26j057j98J550J046j561j230j90P46J257K00j760j354J056Q63M09L40
1537F07j548q45J105J926n3j558m93J94R45J433l7k139j009J715J089q7l19j632
1555g06j22J405N58q75q15k26l28J340R68k114q07J281M23m8P78j095j640J524
1573d99J744p14q58N8n63J084J545j104j046J60L67M41R03j269j651J059J236
1590H93j38m68q10j146Q55J644l50j122j073J024J586R4j053m87l18K89J715K80
1608A415j748o23O35O82J393m18j929M7R70m7Q29k27k591J13K385K1j458N86p32
1627f97r70K189M37j371l5l30o6J420J38j405m72J611J69j71M38j273k70J922
$$ y = [-70, 851, 458, -1031, -1779, -510, 1158, 805, -609, -1179, -585, 111, 1472, 1342, -689, -1258, 727, 1699, 1216, 490, -567, -765, 785, 1831, 270, -960, -1150, -404, 853, 1053, -707, -2061, -1005, -142, 267, 607, -941, -1786, -681, 1245, 1192, -366, -859, -665, 280, 1713, 1676, -463, -1472, 243, 1332, 1245, 926, -706, -828, 577, 1135, 260, -555, -781, -1109, 231, 1199, -915, -1722, -441, -18, -66, 712, -383, -2023, -499, 1245, 531, -327, -269, -832, 252, 1797, 693, -353, -193, 174, 615, 1518, 249, -1402, -343, 893, 755, 287, -523, -1669, -814, 830, 480, -642, -1715, -691, 895, 989, -64, -551, -869, -580, 1135, 1415, -333, -956, -321, 361, 1754, 1336, -593, -546, 424, 377, 1206, 979, -1612, -1499, 886, 907, -551, 35, -697, -1667, 522, 959, -412, -447, -777, -843, 577, 715, -690, -1162, 449, 618, 447, 885, -388, -658, 1264]
1645A264L44j294j75j31l4O66J06r90m82j73M78Q19k79j420K06Q28M51L19p97
1664b94j101P32J086K31k50l03j226J501J111p55n05K73r79N38J842j144j940
1681a183Q55K52q6J150o41j893Q54J320n28R9j45j915J279J793j278n73N95n89
1699f34p0J919k82j700P63K30p2J151p07r95K56P17l7K15n09j258O83J248r87
1718f9n27j45j63L55Q74r66j28J17k94R52Q33j186m06J021j1N33M15j292o70J416
1738F59K03l31Q6o94n92J367K49j286p0P1o21J122N61j481o11J391l81J82N09
1757C33p30r12J267N33j96J13q68j18J463M0p51J45l07l42P40J018j181o73L89
1776c7L84K8M3q61m00O36J20J5n0q29K64R13L04q58N2j15p5Q96J91n82j58J10
$$ y = [1264, 1608, 314, 139, 8, -26, 640, 746, -244, -726, -899, -421, 398, 119, -1301, -1095, -267, 184, 503, -294, -1395, -663, 423, 654, 404, 101, -1125, 376, 1487, 732, 227, 500, -479, 59, 1901, 757, -1183, -328, -76, -162, 988, 347, -1546, -692, 628, 100, 199, 54, -1861, -582, 1211, -67, -640, -45, -634, -704, 1215, 933, -767, -4, 226, 154, 1305, 598, -397, -141, 576, 539, 754, 245, -1013, -330, 918, -69, -596, -741, -904, -549, 325, -641, -769, -652, -946, 6, 839, -347, -753, 268, 257, 790, 1205, -87, -757, 659, 862, 531, 617, -77, -669, 698, 947, -339, -409, -338, -959, 163, 724, -757, -1368, 23, -358, -176, 333, -397, -1309, -42, 491, 295, 408, -460, -578, 885, 925, 174, 319, 12, -330, 410, 1428, 247, -426, -37, 347, 375, 418, -443, -843, -207, -87, -72, -122, -951, -687, 226, 530, -328, -276, -391, -466, 430, 621, 39, -119, -9]
1798iJ50R72j40r28J97K47j12K74l31j067K38N46j12j04o3q77K84J106j12o74
1818e15J65o7L2Q94Q5j362N45M08j7L18m9p30K65Q08j27l79j3o03J24P34j80o57
1840c21N1j39j91J018m36k58jP7l46P76l08p18L87K51N7J65m4n74L18P46j16J1
1862D05J03m39p1Q63n99k84J63k33L2N31o35m55K35K35j33N73l31o11M75O3R2
1883b1j49m4n04N12O97j71o2j19j8K12K62j29l86O5O8k5K42k39o96L73L81l12
1905f3K5L4n09J49L64r3j55j71kK29M26k90l49O10k09K08M88n83L8M2K41L5p3
1928C92m29k33N74J73k92j47k80m04K94O81m10m09J76l15L14N75l51l92K43J39
1948a01R2L74l80j60K10K47j8j10n0j78K13M19j28m30P7j43J18p5j70K56k31k99
$$ y = [-9, 141, 1113, 973, 45, 242, 489, 377, 651, 320, -747, -509, 37, -75, -179, -242, -1119, -835, 271, 159, -515, -350, -417, -385, 509, 594, -768, -223, 185, 168, 486, 437, -293, -28, 780, 653, 274, 261, -342, -218, 516, 336, -321, -270, -409, -600, 418, -18, -276, -277, -200, -546, 230, -78, -796, -409, -158, -101, 64, 20, -554, -236, 510, 394, 405, 508, 69, -2, 861, 262, -22, 141, -92, -60, 471, -164, -619, -384, -149, -282, 291, -40, -651, -176, -113, -21, -170, -214, -718, -206, 491, 320, 258, 139, 121, 333, 595, 466, 80, 145, 213, 188, 430, 191, -505, -132, 249, -63, -38, -4, -513, -364, 0, -93, -248, -419, -421, -192, 234, -56, -405, 205, -4, 204, 692, 109, 147, 189, 430, 465, 392, -37, -270, 304, 477, 185, 38, -242, -646, -352, 329, -81, -490, -314, -629, -315, 260, -91, -483, -240, -101, -9, 365, -15, -175, 35, 282, 264, 154, 104, -74, 139, 558, 430, 0, 77, -66, 52, -23, -193, 63, -168, -467]
1970d67M01N4j48k56L8q4N37J15n60R3J08J73J28J40l80K2O12k50k44K55M4j71
1992A60j2K03m2m36J57l2J7J58m78k46M18N4j36J72k85j75L85L01k46j0o0J99
2014F6L76K50n22j37K16O7J11O0j18o01m5M97K3M9m87J5l0L60r8k23k67J38P7
2037b23L54l4m66k1M04M00l34j41j42J31J10N36j70k01k30L04kJ71m32j4k17N24
2059C07N2m26j13n8M6rL29n91n9oM37R0j15m60R3O08L40l49j57K2j66J41P77k64
2083D69m58k83P13m3J99l55o92J59K81J89m08K2k77Q9O03M4o20j49P5K73L18j84
2105c5J98m80J48M23K63n28K4j7K25j0J18j36k15M9J18J66j70k36m72N21J41J2
2127A07l92l27L23K66K4k48j19K3L56J58R5m73m06M35O74m8k09j18j6J38N37k94
$$ y = [-467, -66, -12, -160, -416, -378, -462, 75, 190, -370, -277, -169, 4, 132, 272, -108, -86, 526, 276, 32, 287, 331, 160, 148, 351, 309, -127, 30, -2, 15, 173, -305, -551, -133, -79, -215, -43, -328, -503, -118, 183, -63, -73, -133, 66, 442, 692, 170, 33, 249, 316, 427, 487, 369, -232, -277, 220, 243, 292, -195, -180, -210, 150, 52, -171, -438, -300, -223, 131, 97, -369, -390, 14, 414, 80, -61, -203, -72, 38, 574, 404, 203, -27, 277, 275, 446, 14, 0, -217, 307, 359, -67, -180, -238, -192, -201, 128, -463, -522, -528, -91, -1, -116, -576, -483, 125, 465, 116, -41, -19, -185, -44, 733, 469, 11, -272, 441, 398, 597, 242, -450, -291, -10, 179, -229, -207, -484, -395, 208, 252, -368, -517, -442, -169, 149, -35, 163, -317, -169, 254, 517, -11, 13, -4, 221, 211, 329, 193, -22, 27, 145, 311, 141, -95, -567, -46, 95, 107, -285, -612, -289, -23, 1, -247, -366, -343, 13, 171, 266, -207, -613, -178, 496, 448, 239, 121, 105, 243, 780, 486]
2149D86m44j07O8P9L03k40n88k04N51J57p1m32j59J1O86P3k47m79K8O15K55L40
2171F81o78j34K35J61M29l52k21q0K46J01j45m62j14K30N37p8l35m67KK83M69
2192C08p6o47k99L85L61K24k82k70J46J07K72L15n38n42P20M79p2m81l45k1N39
2213B83K58l04n08Q1l07P51K91l68j053Q0Q66L07l21l08n56K68J076j69j96j96
2233b5j38M74M29l31m28l77M01M05J70n63j58j25J65K26L70o70n24L59N06Q1l67
2254a20m28j52P43L47l11k64k79J62M32M90m37n17J95q1N36J02n36k72L89M30
2274D29K23l27n05l35Q06K42k94n77j17j72Q36K02p42l9l86M98L72m0l16l27L28
2295b41O12J18j68n48j99O17K36Kn44k63K20O20J25m55n66J17J54O94k06o76m38
$$ y = [486, 42, -65, 3, 82, 385, 145, -443, -647, -96, 61, -10, -442, -601, -590, 96, 169, -78, -557, -529, 86, 341, 681, 3, -131, 104, 265, 694, 342, 121, 41, 287, 388, 243, -219, -333, -103, 434, 356, 21, -446, -444, -161, 308, 232, -415, -714, -329, 32, 256, -26, -296, -150, -43, 229, 544, 6, -536, 184, 663, 591, 110, -235, -256, 283, 541, 237, -271, -190, -497, 254, 545, 177, -876, -796, 70, 377, 56, -252, -808, -540, 536, 367, 171, -25, -163, 311, 740, 409, -19, -396, 5, 410, 580, 17, -141, -266, -101, 125, 495, -175, -699, -340, 166, 247, -120, -548, -700, 43, 390, 79, -185, -464, -302, 130, 620, 183, -334, -139, -220, 316, 418, -118, -390, -1, 429, 652, 325, -180, -515, 291, 533, 239, -338, -455, -627, 209, 411, -331, -370, -756, -258, 114, 74, -242, -569, -241, 371, 489, 321, -227, -426, 191, 427, 429, -115, -378, -158, 462, 587, 132, -434, -317, -163, 531, 325, -351, -789]
2316g89M43M86N5N2p71p6O75J92r5m35k59k2J119K78p29l34j46J91Q64j85o55
2337a41k3J98J92K82q4j006K6P27J17k64k56p00N21P50J38n20k86j70N39N68j68
2358D40p87r3K21M04N52m32p66L34K91L09J70o34l99J41O93k8l24o47J41J06P18
2379D10l63m20l80K48O87L20l82p48L43L60N47l14o02k09L64O81L3n59m19l9N51
2400A09O08l13o86J15L1K07N33n63o71P3M90M76K2p86l85N78M74N9j35o71j71
2421f06O52Q61n31k48m44NN93N02o05l75k68O18N17j03q89m15N48L84Q4l83k41
2442c44m81P92N21l08n94m0j8N31O89q02k04p2K38P79Kp71n54O23N39K23l90o94
2464c35j90O03N86n21k78m84R8O63N06p95m97J18L60N46m8p31l66M46P60L32m85
$$ y = [-789, -346, 140, 195, 247, -524, -600, 75, 267, 172, -263, -522, -544, 575, 853, 124, -210, -356, -165, 699, 514, -141, -164, 34, 226, 508, 424, -582, -556, 171, 288, 24, -232, -932, -411, 339, 477, -43, -329, -499, 40, 608, 440, -347, -440, -219, 185, 737, 305, -461, -127, 164, 473, 643, 9, -390, -249, 444, 416, 92, -555, -414, -308, 410, 47, -373, -753, -505, 182, 502, 120, -628, -285, 75, 622, 308, -294, -503, -139, 542, 575, 16, -403, -442, 109, 717, 404, -282, -167, -136, 71, 604, 41, -630, -557, -67, 409, 431, -355, -740, -162, 312, 371, 236, -435, -606, 46, 907, 376, 128, -316, -311, 282, 784, 179, -196, -464, 154, 671, 568, -321, -736, -188, 196, 280, -103, -344, -825, -33, 488, 180, -414, -454, -472, 59, 748, -54, -258, -330, -92, 687, 689, -82, -636, -13, 526, 749, 359, -335, -525, 78, 664, 143, -135, -619, -521, 142, 648, -147, -644, -526, -166, 380, 332, -399, -765, -319, 441, 773, 288]
2485B88o68k36Q90L13O7o90n53M92O34J4m76m40l3K58O08j89n01m85M06L05L34
2506C38k71q57P9N43O91Q9p85n61N19P80M8m73l98k31K51R89l26o90j04L77L04
2527C12L66n45p51L73L27P86n82o55k72k4J177Nq56j89J4L04J003l04m70o69K34
2548d16N31N08m88o56J00N49N27m0r37l18L82P57L84o02q69P5P41L66l99n59k35
2569e99l2Q22L94q40l31L35K18M55K2p17l61M64N00J48k26m04k72P08M45k41q50
2590c62M3L20L97J40m24r35J45P06K08j11r39k11N42P56L76p71m89M19M45O90
2610I45n6j276j20M99Q97k96n38k94l22Q84N85m02q72n33N47L79N50o62n50k00
2630h35J105J66j44m97p27R39K08K57n35l8m92K58R63J36j334j68P67M18L14m58
$$ y = [288, -380, -616, 274, 587, 654, -36, -589, -97, 537, 551, 75, -365, -398, -140, 468, 279, -222, -707, -301, 4, 338, 67, -790, -711, -168, 523, 612, -173, -734, -215, 565, 613, 140, -258, -489, -238, 751, 425, -265, -369, 8, 312, 678, 133, -618, -245, 82, 868, 286, -369, -641, -665, 512, 517, -339, -528, -514, -210, 793, 489, 19, -650, -416, 115, 623, 135, -521, -421, 128, 655, 615, -322, -640, -258, 499, 883, 281, -588, -513, 228, 594, 195, -364, -599, -631, 191, 585, -255, -586, -251, -33, 422, 444, -273, -634, -170, 330, 478, 252, -152, -424, 284, 729, 488, -362, -319, 1, 398, 538, 114, -821, -676, 30, 238, 127, -812, -1023, -481, 275, 651, -120, -609, -190, 255, 945, 889, -387, -507, -8, 889, 593, 55, -239, -561, 323, 908, 506, -366, -899, -352, 27, 577, -85, -635, -835, 270, 436, 292, -205, -932, 7, 215, 472, -63, -101, -593, -335, 628, 764, -570, -738, 29, 447, 761, 303]
2650C03n77k72J004M35p17n24j69L05L20L28p10p41M23O80K9Q1p90m28Q57J054
2670H91k34n68m00K7N42O65l6j339k13O95P30J07n51q01j77R06N24o00n82n09
2690i23J71R49M14o86o92L03N53M51l4p49l51K06J063J93r08n75P6M22Q23j58
2710E48r36k62M90N62J87k21o25k46R50j1l13l22k77P6Q80J54q97o04N07N37K00
2731C77K09r06l18M19P93k16r7n89r9O09P26o33p85J75L90O77j78n18r70M24P87
2752B77K13k17n86p34O53O95K65n33n65K69P10L59m02p43l30M10R13j38m75m53
2772d12q9P65O75k79j102m3N23L63m7j30o04l29R37K98l94l71m52L94Q30K86q30
2793a1o71K01N80L36J84j040p5O24K90J57n88n54r0J071N30p23n92k34K07R78
$$ y = [303, -274, -546, 458, 893, 176, -348, -517, -212, 108, 436, -274, -1015, -592, 88, 117, 198, -592, -1020, -163, 891, 657, 89, -311, -284, 258, 923, 887, -452, -665, 30, 760, 867, 316, -485, -662, 244, 768, 168, -414, -923, -752, 197, 611, -75, -767, -464, 89, 540, 506, -243, -594, -388, 675, 868, -40, -615, -539, -117, 706, 548, -388, -650, -160, 402, 589, 368, -257, -503, 447, 436, 123, -199, -476, -400, 480, 634, -263, -867, -360, 177, 377, 586, -320, -638, -219, 574, 358, 261, -328, -427, 182, 908, 275, -510, -335, 55, 732, 554, 36, -934, -510, 277, 490, 273, -313, -1047, -394, 301, 566, 33, -532, -263, 447, 806, 404, -339, -669, -259, 654, 516, 41, -412, -501, 264, 939, 660, -442, -485, 38, 401, 354, 224, -380, -709, 228, 526, 132, -239, -691, -297, 533, 819, -11, -682, -481, 99, 435, 619, -421, -496, 128, 418, 575, -13, -567, -657, 414, 944, 221, -371, -605, -398, 580]
2813E80k09n23k46m4K14O62k14m99j81L16N30L1j94q91L42M30O78l42o70o19O54
2834a95J064j71q22k77m53R65N95p69m98j18N03O04j9n07r38N36O33J98j91n11
2854c71n86Q61P34l82m30l08K89N51L48l81p54l46O76O61K29p00o41J33O38K52
2874D73k05p25k49M43R70m90j34p19J19O04N13l42n88l12M49Q27J68q05n88N19
2894g2M33L47l36p93k82P38N49o8m39o51L7Q13L21o76m21O6L9Q65K27j025l86
2915g14K65O09L45j52r54J05N13M48j99m04m08R0Q01L80n11l00m31n8J088J77
2935F90r30k52J66N39M14m75n87j87M93M72p6m62m94L24R97L9n51n26l32N89Q59
2956G10j83r20p1K68K92M75j93q90J15O72O8J56q75n35M48J002k31k94k69p4o8
$$ y = [580, 371, -152, -398, -442, -228, 434, 220, -279, -460, -144, 386, 417, 223, -668, -326, 104, 782, 440, -230, -849, -195, 869, 698, -124, -401, -854, 111, 706, -63, -561, -679, -176, 428, 409, -98, -1036, -500, 133, 331, 140, -371, -957, -96, 638, 256, -174, -482, -193, 358, 706, 325, -429, -775, -99, 562, 791, 91, -550, -417, 221, 473, 268, -457, -706, -263, 707, 217, 83, -636, -517, 87, 600, 258, -330, -642, -193, 634, 802, -3, -591, -72, 361, 708, 372, -421, -703, 35, 584, 516, 77, -574, -537, 276, 597, -79, -500, -434, -395, 470, 697, -328, -714, -449, 160, 505, 353, -601, -496, 17, 465, 266, -138, -546, -456, 345, 725, 214, -86, -517, -575, 513, 690, -240, -492, -326, 213, 627, 152, -435, -622, -129, 343, 267, -195, -689, -365, 632, 671, 120, -406, -738, -149, 710, 527, -393, -464, -196, 96, 571, 378, -512, -397, 275, 343, 499, -376, -911, -463, 539, 308, 14, -255, -329, -397]
2977c97J159k49p11k90o1N31N50k86r77L82M12N37J4o34m19LO78K62l29m08n14
2998g47Q67M77l32p42k5P5M58N41l86q36o7O15M85K71q89m00J37P86M18n34o84
3019e12n5P45O80n32l04n76n1R72N07o80o31L56j10N09K65q96m10M11N99q7o5
3040A35l48n96O70Q59n16n25q2j14O05O12n91m42j10L35N45J84n73q06L35Q30
3060D07P2m23m83k16Q11M62k99q22j27O0Q61K06l78o80K16L18O54m1p61l60K65
3081b58M28L62k76q51K77L63L78K67p09q23L85J076M6p79k63j50K04J038j85r20
3101c90k26N00K09K89p8q92O2O17L98j40l76l31N7M31P28q04n19L78J87L58N3
3122E11o57n38M41M78J08l85n34j57N70P50l02n81k40K98N37J28k08p56j45Q35
$$ y = [-397, 762, 513, -198, -488, -549, -18, 532, 246, -731, -349, 63, 600, 614, -20, -439, -436, 242, 504, 175, -233, -747, 120, 597, 265, -477, -502, -427, 31, 572, 186, -650, -717, -102, 383, 654, -235, -635, -498, 288, 706, 172, -512, -567, 178, 858, 326, 22, -554, -605, 367, 874, 194, -437, -81, -191, 318, 583, -313, -723, -312, 287, 200, 135, -213, -809, -139, 720, 204, -321, -403, -517, 88, 700, 109, -333, -443, -108, 437, 621, 48, -758, -423, 407, 479, 56, -427, -643, 168, 630, 331, -491, -618, -558, 303, 509, 131, -549, -333, -15, 639, 598, -163, -523, -258, 170, 532, 256, -595, -318, 45, 423, 690, -19, -842, -457, 619, 665, -114, -377, -527, -323, 715, 530, -390, -616, -116, 93, 382, 304, -588, -526, 91, 489, 349, -27, -358, -301, 130, 858, 54, -465, -87, 100, 458, 511, -146, -684, -243, 235, 343, -42, -576, -733, -163, 587, 285, -296, -536, -238, 299, 427, 219, -537, -682, 153]
3142A53R3J03o54j12J8Q99L49o68q17K95L65K50L96q71n39M96P91j87l21n49k08
3163g18P10P10k66q71O5k0N87J49o4n83j32M68N99o71L6m59J16Q23J49n40j44
3184e6j14J99L98Q2n51p29N48N06j05m64J7m83P93M74l41o90J30J91N47P0n07
3205h5l19J77M00K04K07p88j59J74P60k9p57l09j33N55Q01k61p06l73N36O49r6
3226D48k99m94j82M24N47j70o38l49O94M70J53j34j004K71N93j65K24m75l41M29
3246BQ12n51j44j69m12L47P38k76r21P3L25J42N52l75q26M43M46L34l70o05M6
3267c89J80N97J03n56l79K62K24N23l38l79k99M12N80L4p72k93J47K10N75p7r19
3288e54j63O46M18p9j93n93j48J004L55k91p96p8J47O81K30n91j71J77M32l5Q4
$$ y = [153, 246, 349, -305, -417, -399, 500, 849, 181, -636, -341, 24, 274, 670, -201, -740, -244, 547, 360, 39, -510, -718, -8, 702, 436, -435, -370, -390, 197, 346, 282, -301, -433, 35, 634, -37, -1, -460, -344, 479, 628, 88, -56, -170, 29, 427, 509, -42, -771, -223, 283, 178, -286, -269, -752, 41, 515, 174, -516, -386, -195, 352, 422, -85, -404, -227, 173, 377, 584, -204, -363, -189, 571, 542, -215, -524, -657, -102, 699, 438, -268, -641, -105, 544, 448, 149, -345, -527, -103, 444, 274, -364, -713, -19, 451, 604, 470, -534, -263, 330, 165, 389, -86, -427, 2, 814, 263, 119, -50, -462, -115, 623, 347, -574, -501, -176, -34, 518, 143, -683, -240, 206, 540, 170, -435, -389, -209, 388, 491, -65, -444, -182, 42, 565, 227, -152, -451, -39, 541, 575, -197, -490, -343, -133, 442, 365, -554, -717, -71, 347, 268, 75, -518, -666, 338, 693, 402, -394, -472, -325, 356, 586, -5, -176, 1, 433, 398, 482]
3309D82p65l49P72K62K30n71l61j3K93L18k36l59j04OO06L78o20l56L64K59N5
3330B91o0m74j43J87O06j37j27m87q0N43P6j70j56l26M06P55l97l83l15K4L7N43
3352B13K16p39k34M05L98l7n27j66p0Q97O8k91j11l93Q9N96J53l50n61L85K23
3373A64L95o8j043L75J70L01m3l78r7l50N15M73p04J13oK25L67j71m57k2j16N25
3395A68K73j47l75k00K97J03M51m99l91o2N70R5l88j05j20K67P76m73k02r60L91
3416e31O52K32l45l64p6O06o0J19j99q27P32K44K01j80l51k84N64L07k45m19k46
3437d70K73J99L35m10k03k30K63K74L22m57l65K88M23m8K20r22l7L41M74Q2n07
3458a55j53%N24L95m75n20J30J50L74M92p09l35J79M53j89J59n51k70P26L6R1
$$ y = [482, -283, -632, 140, 402, 632, 61, -300, -313, -20, 298, 62, -297, -401, -395, 211, 589, -31, -387, -23, 236, 291, 231, -243, -386, -199, 407, 270, 143, -344, -424, 119, 195, 25, -131, -457, -51, 704, 307, -76, -391, -367, -330, 213, 429, -310, -544, -139, 259, 222, -305, -471, -541, 356, 424, 133, 22, -371, -282, 314, 467, 117, -444, -59, 164, 559, 491, -552, -177, -7, 294, 251, -127, -224, -574, -59, 414, -290, -177, -183, 42, 409, 238, -219, -241, -357, 168, 441, 294, -81, -281, 16, 119, 570, 71, -320, -382, 188, 283, -105, -210, -330, -63, 713, 240, 38, -922, -531, 121, 353, 8, -356, -432, 174, 114, 233, 34, -793, -61, 183, 384, 204, -147, -431, 133, 440, 195, -224, -470, -197, 2, 337, -73, -276, -506, -243, 31, 353, -104, -469, -181, 242, 194, 414, -508, -545, -204, 270, 352, -155, -308, -308, 216, 611, 136, -384, -254, -104, 270, 762, 53, -282, -103, 350, 161, 320, -231, -501, 225, 261, 352]
3479C52n19q9j1N52N3l83j95Q0K2L22K12n70k49L98M73k61j37j01l25K72M70n3
3501C13n56k04L30K74J60m17k06o5K22L12L9m32j96L27J91K00k72k21p7K79M66
3522D67j89m20j91K52K91J29l73q6q3P9P15k10r38L38OL67M66m57n14J20L52P6
3544A97j13l69j44K06O84l06n4m24o9L17M31O2n53k07J78J73L23q2n25q0N53M33
3566F31l64k68n19J56K42N76k99l38J06O0K92j89l39o5P9L05M72p41P7j41L64
3587I7L41k83k59J5O4J53L31p00qR5J54J47j77j12k63L27L65m1j65k68n3K56K61
3610B77J0o42j5L83K74r8m8n33M8M21M05m89j11k69K69K55J28r0o03L07J73r3
3632d1J62j38m07L75M18k28j90j46J13l9K85k91K1p2J17K41J04n8l16j50K68R1
$$ y = [352, -167, -256, -267, 285, 338, -45, -240, -160, -138, 184, 396, -174, -423, -25, 448, 187, 50, -51, -376, -104, 366, 313, -243, -447, -117, 157, 317, -100, -306, -371, -149, 163, 202, -230, -426, -99, 92, 292, 20, -201, -278, 1, 467, 278, -142, -333, -81, 210, 339, -34, -120, -203, -124, 591, 381, -557, -219, -213, 154, 620, 163, -351, -231, 121, 197, 84, -285, -429, -223, 461, 155, 101, -323, -392, -75, 356, 418, -135, -342, -164, 9, 332, 250, -275, -355, 198, 631, 267, -1, -520, -364, -122, 454, 155, -183, -77, -17, 275, 86, -253, -318, -239, 66, 538, -203, -126, -267, 97, 438, 155, -104, -89, -25, 128, 459, -241, -249, -154, 0, 147, -30, -142, -405, -78, 287, 246, 81, -187, -240, 16, 277, 287, -355, -370, 13, 287, 189, 141, -392, -344, 77, 482, -7, -118, -387, -118, 137, 265, 175, -428, -121, 52, -41, 121, -17, -424, -49, 369, 141, -49, -195, -82, -121, 164, -127, -106, -178, -61, 180, 284, 226, -90, -240, 28, 119]
3654A19J0k00m2k00L45J75k00m86L39N18j15j46m09l08L44N29o3l13j25o1K99
3675A0K99r3n38r6O19j09J45k09n94K13N46J43k71q0l56J30L95l8j46k19n8N03
3697A96l9j90J4l48K61M54m50N8j73k34L88L51j02j84q6l49N94K53m79l37J48
3718b54O45k78j36k48O9n4L91j46m8l11J74K40K78k31j59k39L97J80K3n01J85
3739b3qL1K31k99J09n54N58K61k29J64l89j12L76J55l61j29j38M92J61m1k17n96
3761e58L35K44K57j50j47k90J87J34J90k83k39R7L61K03l30j13k82M72J95j15
3781A68j68j78k06L00K90J4m45n4J93J99P0j39m19L90K79j58j62J36l60M13K87
3802D50l50j93K6L4M23j69l21j17J5O1L18J55m15n39M21J26K20m49L10j90J14
$$ y = [119, 129, -71, -113, -313, 32, 207, 7, -479, -140, 378, 263, 117, -292, -600, -256, 273, 210, -103, -228, -289, 10, 309, 216, -322, -418, 201, 92, 237, 28, -566, -353, 193, 336, 65, -15, -371, -241, 154, 116, -30, -249, -307, 196, 157, -33, -19, -367, -106, 348, -102, -44, -217, -451, -63, 288, 186, 2, -84, -433, 161, 414, -65, -402, -254, 391, 113, -23, -271, -202, -256, 135, -11, -59, -370, -196, 44, 322, 91, -68, -307, 90, 270, 293, -208, -23, -31, 0, 231, -68, 41, -513, 45, 306, 77, 241, -148, -260, 116, 271, -90, -219, -357, 135, 296, 255, 38, -558, -223, 21, 278, 128, -19, -309, -122, 12, 202, -81, -320, -223, 138, 341, 11, -102, -384, 88, 283, 168, 0, -178, -384, -84, 206, 220, -225, -279, -86, 113, 183, 44, -375, 15, 294, 136, -26, 110, -250, 163, 450, 100, -93, -67, -33, 390, 221, -100, -217, -202, -141, 177, 332, -83, -622, -201, -75, 145, -304, 6, -184, -70]
3823g0M00k75l24J6O6Q4K86k06k15M65l45J55K52l08l23M49N5M6k48j68K58o0
3845a0N78n31k70K85k35J25J62N5l49o1K52J51l4l40M9N5L7L51k08j56j42L30
3867I4J1m9k36j30J68J12K95l58j4R9p1o8J94l02J60K31N3j22j56j47m9J89L25
3890B29q6j73P5l27M78J02k64k19J73J68J03k05l07J30J80m2K22k91j71J69J33
3911G7J3j03K76n29J93K17R8l36l3NJ36j1k24J29k86K45J35K98l13rk69M72j2
3934A69l75L0J9K30m5j9Mk02J16J00J80l5o39K51M50j65O0l5k75N4J74L85l51
3957H1j90j00J05M16j97j90k32j32N23rJ66l07n5J72J28j03j56J7k08L05r3J61
3979A02l90K2K48J98m0k36j08P9N0J46J16m64j51L24L17J75j51l37J23P3J10k46
$$ y = [-70, 330, 55, -269, -253, -187, -103, 183, -23, -238, 227, -118, 37, 289, -19, -342, 107, 162, 208, -40, -208, 50, -10, 568, 37, -233, 52, -183, -58, 104, 159, -190, -251, 1, 152, 118, -222, -173, -118, -81, 270, 62, -94, -236, 94, 105, 56, -180, -310, -142, -30, 265, -93, -107, -8, -79, -147, 47, -255, -95, 136, 189, 67, -89, -236, -285, -96, 229, 143, -30, 45, -282, 196, 298, 34, -185, -12, 156, 259, 54, -253, -123, 57, 15, 237, -54, -225, -56, 77, 90, -13, 263, -266, -73, 144, 242, -94, -127, -122, 14, 3, -221, -92, -378, -133, 2, 300, -13, -22, -291, 181, 169, -206, -176, -157, 73, 28, 9, 13, -189, -73, 27, 207, 172, -467, -216, 234, 69, 129, 94, -181, -127, 47, 432, 81, -109, -209, -104, 312, 115, -75, -307, -439, 84, 75, 241, -66, -121, 51, 179, 76, -80, -63, -271, 34, -59, 102, -288, -266, -18, 180, 140, -96, -204, -125, -75, 71, 187, -277, -428, -104, 213, 388, 237, -100, 23, 96, 206, -40]
4001d0k16j10L86J58r0k34k48L73K18J10m58j30L95k43R2L24l30k07J77J28k19
4022a64J49p9O3Q2P7q8J77j97q4J46K15l23m6M5J74k05Jj92K01m9J81K41l65o5
4046a05j12K42J52j12k5q2mK54J15k57j5j76L6J66L1m68J48J03K40n3k86m16M20
4069b04K71l6N0k4l98K91P7M6k24j02J14M1M99j03m92J29l4K17K00k16j16j62
4091a76M20j36J28m37q6j79P39J22k56j55j64J20l0J95o4j88n2L83k37K2O2j12
4113h1j30L41J28m30QK93K5l4r1n6P9k6L52k85j14J8nL6l1P4k84K05K6L28k22
4138A24l20J40j3O8N8J08k16n9K12K00l05q6Q0L1K28j62j33k96L26Q3N0j86Rk21
4162b80J15N48J4k08l74L16j71Q4J09k09l38K36L53K5j6m48n0K73K00l1m04J15
$$ y = [-40, -256, -366, 20, 178, 88, -146, -394, -21, 197, 307, -151, -281, 114, -129, -37, 287, -43, -250, -73, 55, -164, -15, -94, -31, 51, 128, 40, 217, 20, -64, 82, 297, -26, -72, -27, 147, -58, -57, -249, -48, -97, 84, 325, -40, -105, -217, 25, 177, 65, 40, -42, -46, 208, 323, 66, 51, -125, -89, 77, 108, -360, -212, -109, 131, 78, -208, -624, -204, 67, 31, 81, 57, -341, -50, 27, 73, -151, -253, -139, -98, 401, 298, -194, -65, -99, 118, 318, 102, -14, -176, 244, 108, 236, -201, -287, -466, 273, 395, 139, -16, -180, -60, -90, 105, 41, -147, -199, 184, -53, -31, 31, -81, -211, 130, 258, -172, -164, 129, 154, 120, 29, -27, 52, 26, 378, 93, -21, -3, -8, 28, -3, 71, -213, -8, 18, 346, 124, -196, -56, -69, -1, 57, 165, -51, -110, 102, 302, -3, -89, -9, 22, 250, 88, -45, -341, -15, 68, 118, -68, -59, -280, -165, 383, 397, 189, -185, 131, -40, 44, 153, -56, -394, -158, 195, 220, 204, -244, -294, -21, 179, 148, -256, -141]
4184a41K38N3J78l21k80J25K02%o0K23l34k0L42k2k31j57J38J10n6p0n6J01N0
4207A2N3p1k09J28J2M36Q7n23o0o4J89L04k93k2j67M11k25M2k02J56j54P0K44
4230A54qk53j12J61J26N5j06j32kL94Rj76j93k70K00K08N8o7Mo1N1P1J41k06n29
4255d83M74K97j69j45l33K94K23o9j11J1k29M48J08k82jm67L27J88Q9k9k56l22
4277d37L62M52j68k69M9o1p3M06j09l95j52M24J54J34m88O7j9j4M72j65l89K29
4299A0mL1o0K45l48j72K17J33p4J11j02o9L57k78J87k92Q4j24J54Jj03K9O1J91
4323A85K2n9m16O9K27J42k17j48L3J39J3K13k19k73K83J75j2k26K43l08rL63O7
4346B87j78l73j34K63J45R7l19K85k01M6J24k79J17o2K92o7L4j77j10L30o1K83
$$ y = [-141, 97, 150, 328, 7, -273, -148, 54, 54, -6, 217, -117, -137, 205, 183, -48, -205, -67, 43, -13, -83, -139, -38, 12, 65, -6, -215, -87, -75, 361, 448, -75, -135, -199, -10, 294, 1, -21, -188, 223, -2, 40, -162, -6, -160, -90, 154, 146, -107, -219, -58, 68, 123, 17, -115, -117, 277, 286, 110, -83, -353, -153, 55, 113, 46, 50, -11, 40, 111, 252, 46, -483, -9, 288, 119, -26, -359, -65, 158, 89, -22, -11, -240, 208, 316, 34, 33, -434, -107, 81, 170, 141, -115, -437, -75, 377, 209, -60, -11, -72, -145, 261, 152, -243, -395, 29, 183, 317, -171, -104, -123, -137, 335, 170, -219, 10, 6, 37, -23, 222, -126, -298, -81, 52, -22, 89, -13, -82, 275, -3, 184, -108, -24, -148, 6, 7, -96, -67, -6, 185, 207, 148, -268, -199, 28, 170, -47, -195, -162, -23, -10, 203, -16, -289, -6, 169, 157, -69, 174, -134, -143, 220, 287, 109, -264, -398, -135, 10, 107, -212, 73, -128, -82, 42, -237, -120, -182, 110, 43, 77, -100, -210, 120, 59, 342]
4368C42k30l65J59K30J36k37k66J30j52J83J77k72L8O1K38o1l3j87M8O4M5q2j70
4391b04K0J19L5J66ok23RP9J21M5k72k14M39Q9o4P6j70K4j03J35M9j79l79K78
4415a30N26k63j60k07m8L05K68k13J10n8j22J20p4K14l90q6O2M77k59p0k82K10
4437g0L31K21m42k31n9K69K29M3n84L3R8K69J88j89l21j50N20q7J31M4k98J70
4459A15M5j40J1j22KJ50K8j14L8l25K39K36K4j69p4l21N24m6kk60k70K98J37P2
4483G6Q0m32K55K55%k61j6j49J26L08j4r2k54rJ95Nn1P7j42Q5j46L26j34k67J40
4508c9J45J04N8m23j14K31J74L5p1k60O0J69M12j61m83k44L99J30n2J05l78j5
4530b18L01pr8j97N4J10k0L36n83J27K36j0J84L5n02o3M78j77J32j52k30P7L67
$$ y = [342, 112, -253, -94, 136, 272, 35, -231, -101, -253, -70, 107, -165, -127, -66, 172, 111, 78, -109, -61, 3, 48, -34, -204, -184, -65, -30, 136, 130, -93, -84, -5, 116, 161, -111, -325, 114, 203, 139, 215, 45, 69, -34, 101, 150, -29, -408, -130, 396, 133, -27, -234, -282, 23, 291, 78, 188, 130, 8, 128, 54, 268, -122, -208, -146, 331, 72, 2, -280, -70, 261, 482, 40, -191, -250, 19, 248, 291, -293, -260, -162, 107, 295, 106, -215, -365, 155, 68, 199, 243, -55, 115, 160, 20, 31, -91, -89, 61, 89, -25, 13, -312, -73, 163, 187, 18, -56, -377, 147, 101, 99, -161, -431, -133, 4, 76, 156, -276, -21, 234, 234, -27, -43, -192, -66, 242, 228, 136, -118, -127, 68, 73, 22, 99, -43, 42, -104, 222, 88, -179, -39, 106, 210, 268, -155, -269, -38, 136, 171, 100, -160, -100, 69, 481, 320, -163, -407, -8, 122, 70, 175, -203, -218, 83, 76, -22, -219, -165, -55, -75, 261, -322, -195, 41, 31, 215, 250, -252, -315, 163, -14, 118, -34, -264, -187, 180]
4553A80j61Q2j64j4Q7j2L12k57l41J2K46L24k88Q8l46K48l4R5J4k85J46K31P0
4576B33j53j07l0J74K66l51l6k25N5K80J11k65J0J39Q6j82K18j88j31L2L78l84
4598g0L26k93k58K14J78K9j7k57J71K58k6j48k36J13n3M44k80k55j23K07J46J90
4620B60J2l54k24K62J97K05l71j32j62M00P2j71j49J4J65K93j92j33o4k6J4K48
4642A64Lj80j20L67j74j25l3k61J47K81K39n66M1L71j20j45J43j34J9OK13QJ48
4665B92n00J71o1L23N9k97j34k5L03J24j82j47j67K46K6J62l48l9j27M44l2k23
4687a32n8K12r8J67l6k25j90K69J03Q0r3l49j9L67J94j71k55J9L9K53K25j14o00
4710d12N50L2op2r2m45K38K19L07l39m7n4M3K04q9p6l35M98P4k12m9j8O5N2m6
$$ y = [180, 19, 101, -63, -77, 10, -2, 310, 53, -288, -276, -30, 294, 6, 94, -252, -4, -38, 57, 71, -214, -68, 163, 233, 80, -27, -57, 117, 383, 32, -4, -229, -174, 106, 217, -48, -38, 101, 187, 5, 223, 35, -96, -64, 314, -70, 256, -37, -295, -81, 97, 126, 109, -148, 23, 281, 255, 107, -129, -16, -69, 375, 95, -160, -283, -76, 70, 260, 272, -82, -306, -44, 153, 358, -13, -145, -307, 93, 165, -6, -155, -141, 24, 317, 125, -8, -72, -98, -84, 164, 167, -13, -133, 234, 60, -65, -98, -359, -212, 69, 308, -258, -217, 154, 34, -111, 32, -102, -83, -77, 136, 144, 292, -208, -37, -98, 225, 284, -13, -147, -172, 131, 255, 73, -74, -241, 5, 31, 193, -155, -194, -321, 123, 91, -132, -190, 22, -76, 91, 55, -170, -360, -91, 12, 92, -1, -350, -369, -2, 192, 21, -234, -215, -176, 77, 302, 188, -412, 138, 170, 164, 92, 0, -445, -207, 12, 319, -20, -67, -121, -78, 126, 37, -39, -374, 124, 198, -14, -63, -81, -16, 36, -10]
4735a0j78L34k33j50M90p2j54j96j55K76J63J24k33m19K59M97L9m99j10M3N7L66
4757B39j33j41j12J75K2m8J06j68l82M33L56p1k41n2l7OM09l04m05J48J83K34
4779B17Q2k83r2m3L35ll40j36K56r0K29j21p4j20J24K04j67j11K8l9KL83k69M8
4803B0j77R2Q4K51l61o1n2O31k94k99J75M3K9J07R3m26j17r4M93J68l20j33k3
4826a71j1M64nj89k40J37l0L84l07J23k77J83J51j78l3k11K7N3M33k06l90J59
4848a34M4J73K8j03j15j70K88J98l06o0K0J13R4J55l22k81J87K04J7J16k78j46
4870b78M73j93J19j77K1j65L67J43k46l08j25N14L8m5k32j1k5M34n2j84k36MK86
4893A22J63k69n8m02J32M05M01l72o3r1l40L97J09j76j55L39j1K74l62l10r5M62
$$ y = [-10, -188, 146, -87, -237, 253, 181, 27, -169, -324, -48, 115, 239, 6, -413, -154, 343, 382, -117, -227, -184, -127, 239, 106, -35, -147, 28, 50, 2, 108, -60, -442, -9, 347, 276, 35, -17, -54, -48, 361, 57, -348, -200, -17, 217, 299, 16, -76, -119, 216, 213, -127, -263, -7, -97, 132, 11, -63, -183, -59, 145, -22, -133, -105, -144, -142, 241, -28, 20, -157, -65, 19, 270, -91, -152, -204, 427, 133, -166, 9, 52, 81, 188, 281, -145, -262, -356, 137, 305, -15, -148, -171, -182, 282, 277, 88, -152, -15, -45, 339, 32, 155, -122, 61, 212, 34, 1, -210, -183, -130, 303, 97, -293, -134, -90, 83, 111, 8, -107, -277, 11, 209, -97, -157, -137, -24, 70, 225, -97, -378, -191, 13, 30, 146, -132, -278, 195, 2, 121, -56, -35, -200, 167, 310, 64, -244, -369, 145, 183, 138, -94, -105, -130, 304, 252, 68, -168, -164, 122, 285, 16, -42, -444, -312, 93, 494, 122, 59, -32, -372, 25, 134, -42, -197, 142, 131, 405, 43, -267, -362, 100]
4915A00m5k4P3l52m5K86K95j15l10J16J34n4J31l89J21j22J46K16j36l29K05J16
4937A8J54Nk14j34J19J69M2j70k46L7L32M3J66o41K22J91K51j39N9o47L95K21
4959B33Pk78qj57k8L08Q6r4k50r4L29J24o5r8L2p0K39q5%l90J58R5J81p6j16k23
4985b40J61J42J74j43j37j13K16M65m09o8p0n0K21o0O2k04o3K21q0J73k34l51
5007c87K46J51J28Kr0p5K18m2j48k58M6J18J63O6M8k52l7J96j5J70k66k22M0L84
5031A84J0k69k75N38j59J68on24K31l8K03Q8o4j26l19N45J57j13k56l10K92K08
5053A65k7j08K8k50J25J84l3l21N1l5K16K05O0n25J79J24mK64o05J35n3M20k50
5076e5K9k10j96L70K50R4l30k06J21J68P0P9l59q5L16Q0j20j24o6OK56K0k65r9
$$ y = [100, 55, 31, 104, -248, -293, -7, 288, 173, -137, -21, 113, 59, 190, -199, -78, -200, -54, 162, 26, -303, -98, 18, 172, 177, -37, -171, -52, 117, 159, -11, -257, -220, 112, 155, 321, -320, -98, 93, 344, 205, 264, -383, 12, 233, 240, -38, -46, -203, -231, 77, 163, 69, -181, -275, 54, 178, 113, 15, 47, -23, 216, 131, 131, -259, -101, -6, 175, 99, -17, -240, -79, 63, 237, 94, -43, -156, 60, 525, 116, 48, -22, -72, 149, 89, 151, -53, -116, 105, 25, 198, -36, -387, -141, 10, 138, 140, 50, -25, 193, 151, 3, -255, -209, -91, 72, 138, 186, -66, -103, 93, 78, 248, -18, -240, -200, 184, 194, -75, -350, 188, 29, 197, 191, -333, -102, -140, 63, 151, 87, -39, -358, 187, 344, 231, -25, -335, -43, 165, 138, 30, 58, -192, -67, 117, 84, -237, -186, -221, -5, 200, 260, -265, -86, 38, 34, 298, -307, -172, -225, 195, -55, -26, -236, -432, -62, 188, 282, -48, -254, -133, 35, 105, 184, -175, -260, 56, 136, 16, -108, -174, -168, 88, 108, -157, -256]
5100b56J0J74M69l35k37J98k46M25j63j1k08q5K98j44K86j20j12n9K05j17k46
5121b74J7J40K98j85J6j14p8K12K53k32o1k89J36K39M2N6l50M1K26J42j20k71
5143a56j95L33j03N55k86k29M1o5K31j17J7k31O5K17L07m52l81J23Q5M22R0J9
5165B90l84l2J82J37j15j52J25r4K45l43K00k9o4K2J84k47m0kJ61J9J32j57m2
5188dk56L33K05k99j27P9J87K40k96l83L5pK32k7K97m95K67J84Q8l54Q8P3k68
5211b08N1L47j75J3j19k89M22Q6p0n0L3J76P4j36l67K10m8J88J51m11j50J56J68
5234E2J01j85j74N2K0L13K11k92k17K0K29k48J29p8j36J20R9R5k34k1N2k3L85
5257B70k01p1q0L6R5k0j19J27k27J12M02k37j37j6Q7J24N7k60J9p1J99Q7k6l60
$$ y = [-256, -246, -72, 397, 62, -175, 23, -223, 202, 39, 28, -180, -265, 33, -111, 175, 55, -57, -116, 89, -28, -274, -257, -117, 181, -4, 12, -102, -180, 32, 285, 53, -8, -297, -161, 78, 120, 176, -174, -133, 93, 235, 115, -156, -351, -18, -121, 434, 148, -81, -40, -105, 126, 9, 26, -205, -140, 77, 384, -68, -449, -326, -241, 181, 271, 290, -94, -126, 56, 193, 78, -74, 51, -43, 202, -141, 59, 30, -34, -12, 172, -75, -115, -117, 44, 63, 195, 38, -4, -260, 73, 278, -21, -148, -69, 118, 358, 62, -321, -286, -293, -61, -88, 209, -286, -19, 165, 253, -101, -13, 60, -208, -157, 190, 15, 28, -91, -380, 42, 128, 58, 8, 41, 217, 291, 155, -212, -2, -50, 138, 289, -122, -272, -116, 52, 153, -32, -206, -154, -134, 179, 390, 98, -119, -99, 130, -118, 11, -67, -203, -83, 16, 111, -123, -144, -92, -115, 270, 69, -2, -82, -46, 49, 29, -90, 37, -190, -78, 324, 87, -50, -66, 21, 145, 202, -58, -39, -110, 89, 176, 150, -210]
5281b10l8J9J76L11l92j16K11J02J45J79n73j82M08Q0K33j50m78K85L3J70p3k12
5303g2J59j64q9L62l52M4p3J44J63J39k25l38M53J82o5k91j74P6R9M8n1o8p0K00
5327C7J94m4q4m6k44J92j05N4J3k91M03J24l60R1l1K94k55J12k6k95J74Q9J16
5350A12m6o4l12L16J41j01Kl23R5L04j18o0j08o1j09M03Q4l38o9K14k01M62j61
5373F2j73m22L27M35J59n95J25k18N11J1j52k2l09J28J68L74l60j43p3Q2K64M
5395A83l5q4j90M22k57J61m04O8p0K06L57n73J63K4J39j9j30k12q5K70L64k64
5417C4j80J44q6J97O1O5k27k11K71J00k14n1nJ60o1K80k04j06j6r2J31j81L31
5440A40m13K88J48J21n20J05J02j42L43k11L5j48Q5K11J51m98m0J52m9L60k34
$$ y = [-210, -248, -229, -53, 258, -134, -250, -39, 63, 208, 387, -186, -368, 40, 120, 353, 203, -275, 10, 43, 213, 140, -72, 87, -77, -166, 196, -156, -112, -185, -41, 122, 261, 36, -302, 151, 333, 268, -23, -197, -121, -22, 26, -25, -93, -163, 37, 231, 187, 103, 57, -187, 5, -100, -46, -33, -324, 79, 203, -157, -66, -97, 197, -58, 54, 28, -267, -93, -4, 112, 66, 2, -310, 6, 147, 46, 48, -275, -180, 124, 6, -54, -162, -223, -332, 71, 155, -183, -252, -38, -239, 223, 62, -111, -533, -206, 229, 388, -207, -82, -300, 211, 222, 70, 48, -261, -133, 35, 409, 49, -94, -167, -85, 179, 183, 148, 64, -126, 296, 39, 200, -204, -136, -206, 0, 357, -216, -53, -29, 110, 91, -39, -251, -336, -66, 298, 34, -146, -2, -88, 109, 170, 235, 8, -203, 68, 168, -46, -97, -102, 58, -3, 277, 73, -33, -49, -141, -10, -191, 140, -273, 15, 163, 284, -236, -131, -29, -171, 172, -39, -4, -152, -67, 144, 295, -203, -243, -91, -140, 220, -14]
5461a4o4p8PK65j39k05J04n6L49q7o8M4k54M1K70l0j17k9L6J27m0J64n62P5R7
5486a64J06L03k30j65j18K04K68k55l0J43j16Q1K2l6k42K0L5O3M7k68K23J42L51
$$ y = [-14, -78, -156, -149, 116, -23, -228, -124, -180, 169, 82, 14, 58, -196, -155, 115, 85, -32, -61, -25, 102, 62, 226, -336, -261, -164, -58, 245, 15, -150, -268, -64, 204, -51, -81, 62, -54, 27, 49, 13, -229, -209, -174, -111, -64, -332, -109, 33, 384]
$$ [...]
8191A48
##END NTUPLES=NMR FID
##END=
