##TITLE=1H_Ser 6-6-i-2
 CDCl3
 8 sc, 
 27.06.2022
##JCAMPDX= 6.0         $$ Bruker NMR JCAMP-DX V2.0
##DATA TYPE= NMR FID
##DATA CLASS= NTUPLES
##ORIGIN= UXNMR, Bruker Analytische Messtechnik GmbH
##OWNER= root
$$ XWIN-NMR		Version 3.5
$$ Mon Jun 27 14:17:18 2022 Russian Standard Time (UT+4h)  she@DPX200
##.OBSERVE FREQUENCY= 200.13135
##.OBSERVE NUCLEUS= ^1H
##.DELAY= (6, 6)
##.ACQUISITION MODE= SIMULTANEOUS
##.ACQUISITION SCHEME= undefined
##.AVERAGES= 8
##.DIGITISER RES= 18
##SPECTROMETER/DATA SYSTEM= spect
##.PULSE SEQUENCE= zg30
##.SOLVENT NAME= CDCl3
##.SHIFT REFERENCE= (INTERNAL, CDCl3, 0, 15.7039)
##AUDIT TRAIL= $$ (NUMBER, WHEN, WHO, WHERE, WHAT)
$$ ##TITLE= Audit trail, XWIN-NMR		Version 3.5
$$ ##JCAMPDX= 5.01
$$ ##ORIGIN= Bruker BioSpin GmbH
$$ ##OWNER= she
$$ F:/spectra/data/she/nmr/H-F/1/audita.txt
$$ ##AUDIT TRAIL=  $$ (NUMBER, WHEN, WHO, WHERE, WHAT)
(   1,<2022-06-27 14:16:00.78 +0400>,<she>,<DPX200>,
      <created by zg, POWCHK disabled, PULCHK disabled
       configuration hash MD5:
       00 E9 B6 7A A2 85 ED C7 34 08 36 98 17 FE 4E 26
       data hash MD5: 16K
       D9 F8 33 1D A6 AE D0 C6 1F EA 44 B0 0E 59 94 89>)
$$ ##END=
$$ 
$$ hash MD5
$$ C7 FB 46 80 D4 B0 95 45 B4 0B 12 37 D0 4B 15 27
##$RELAX= 
##$RELAX= 
##$RELAX= 
##$RELAX= 
##$RELAX= 
##$RELAX= 
$$ Bruker specific parameters
$$ --------------------------
##$DU= <F:/spectra>
##$EXPNO= 1
##$NAME= <H-F>
##$PROCNO= 1
##$TYPE= <nmr>
##$USER= <she>
##$AMP= (0..31)
100 100 100 100 100 100 100 100 100 100 100 100 100 100 100 100 100 100 
100 100 100 100 100 100 100 100 100 100 100 100 100 100 
##$AQSEQ= 0
##$AQ_mod= 1
##$AUNM= <au_zg>
##$AUTOPOS= <>
##$BF1= 200.13
##$BF2= 200.13
##$BF3= 200.13
##$BF4= 200.13
##$BF5= 200.13
##$BF6= 200.13
##$BF7= 200.13
##$BF8= 200.13
##$BYTORDA= 1
##$CFDGTYP= 0
##$CFRGTYP= 5
##$CHEMSTR= <none>
##$CNST= (0..31)
1 1 145 1 1 1 1 1 1 1 1 1 1 1 1 1 1 1 1 1 1 1 1 1 1 1 1 1 1 1 1 1 
##$CPDPRG= <>
##$CPDPRG1= <>
##$CPDPRG2= <>
##$CPDPRG3= <>
##$CPDPRG4= <mlev>
##$CPDPRG5= <mlev>
##$CPDPRG6= <mlev>
##$CPDPRG7= <mlev>
##$CPDPRG8= <mlev>
##$CPDPRGB= <>
##$CPDPRGT= <>
##$D= (0..31)
0 1.2 0 0 0 0 0 0 0 0.06 0 0.03 0 0 0 0 0.0002 0 0 0 0 0 0 0 0 0 0 0 0 
0 0 0 
##$DATE= 1656324960
##$DBL= (0..7)
120 120 120 120 120 120 120 120 
##$DBP= (0..7)
150 150 150 150 150 150 150 150 
##$DBP07= 0
##$DBPNAM0= <>
##$DBPNAM1= <>
##$DBPNAM2= <>
##$DBPNAM3= <>
##$DBPNAM4= <>
##$DBPNAM5= <>
##$DBPNAM6= <>
##$DBPNAM7= <>
##$DBPOAL= (0..7)
0.5 0.5 0.5 0.5 0.5 0.5 0.5 0.5 
##$DBPOFFS= (0..7)
0 0 0 0 0 0 0 0 
##$DE= 6
##$DECBNUC= <off>
##$DECIM= 32
##$DECNUC= <off>
##$DECSTAT= 4
##$DIGMOD= 1
##$DIGTYP= 9
##$DL= (0..7)
0 120 120 120 120 120 120 120 
##$DP= (0..7)
150 150 150 150 150 150 150 150 
##$DP07= 0
##$DPNAME0= <>
##$DPNAME1= <>
##$DPNAME2= <>
##$DPNAME3= <>
##$DPNAME4= <>
##$DPNAME5= <>
##$DPNAME6= <>
##$DPNAME7= <>
##$DPOAL= (0..7)
0.5 0.5 0.5 0.5 0.5 0.5 0.5 0.5 
##$DPOFFS= (0..7)
0 0 0 0 0 0 0 0 
##$DQDMODE= 0
##$DR= 18
##$DS= 0
##$DSLIST= <SSSSSSSSSSSSSSS>
$$ [...]
##$SUBNAM2= <"">
##$SUBNAM3= <"">
##$SUBNAM4= <"">
##$SUBNAM5= <"">
##$SUBNAM6= <"">
##$SUBNAM7= <"">
##$SUBNAM8= <"">
##$SUBNAM9= <"">
##$SW= 18.05172834244
##$SWIBOX= (0..15)
0 0 2 0 0 0 0 0 0 0 0 0 0 0 0 0 
##$SW_h= 3612.71676300578
##$TD= 16384
##$TD0= 1
##$TE= 0
##$TE2= 300
##$TE3= 300
##$TEG= 300
##$TL= (0..7)
0 120 120 120 120 120 120 120 
##$TP= (0..7)
150 150 150 150 150 150 150 150 
##$TP07= 0
##$TPNAME0= <>
##$TPNAME1= <>
##$TPNAME2= <>
##$TPNAME3= <>
##$TPNAME4= <>
##$TPNAME5= <>
##$TPNAME6= <>
##$TPNAME7= <>
##$TPOAL= (0..7)
0.5 0.5 0.5 0.5 0.5 0.5 0.5 0.5 
##$TPOFFS= (0..7)
0 0 0 0 0 0 0 0 
##$TUNHIN= 0
##$TUNHOUT= 0
##$TUNXOUT= 0
##$USERA1= <user>
##$USERA2= <user>
##$USERA3= <user>
##$USERA4= <user>
##$USERA5= <user>
##$V9= 5
##$VALIST= <valist>
##$VCLIST= <CCCCCCCCCCCCCCC>
##$VD= 0
##$VDLIST= <DDDDDDDDDDDDDDD>
##$VPLIST= <PPPPPPPPPPPPPPP>
##$VTLIST= <TTTTTTTTTTTTTTT>
##$WBST= 1024
##$WBSW= 4
##$XGAIN= (0..3)
0 0 0 0 
##$XL= 0
##$YL= 0
##$YMAX_a= 245875
##$YMIN_a= -307578
##$ZGOPTNS= <>
##$ZL1= 120
##$ZL2= 120
##$ZL3= 120
##$ZL4= 120
##$ABSF1= 10
##$ABSF2= 0
##$ABSG= 5
##$ABSL= 3
##$ALPHA= 0
##$AQORDER= 0
##$ASSFAC= 0
##$ASSFACI= 0
##$ASSFACX= 0
##$ASSWID= 0
##$AUNMP= <proc_1d>
##$AZFE= 0.1
##$AZFW= 0.1
##$BCFW= 1
##$BC_mod= 2
##$BYTORDP= 1
##$COROFFS= 0
##$CY= 11.3945322036743
##$DATMOD= 1
##$DC= 2
##$DFILT= <>
##$DTYPP= 0
##$F1P= 2.36226072786647
##$F2P= -0.459571619588291
##$FCOR= 0.5
##$FTSIZE= 0
##$FT_mod= 4
##$GAMMA= 1
##$GB= 0.15
##$INTBC= 1
##$INTSCL= 1
##$ISEN= 128
##$LB= 0.24
##$LEV0= 0
##$LPBIN= 0
##$MAXI= 10000
##$MC2= 0
##$MEAN= 0
##$ME_mod= 0
##$MI= 1.114404
##$NCOEF= 0
##$NC_proc= 0
##$NLEV= 6
##$NOISF1= 3.799351
##$NOISF2= 2.8
##$NSP= 1
##$NTH_PI= 0
##$NZP= 0
##$OFFSET= 15.70392
##$PC= 1
##$PHC0= -18052.56
##$PHC1= 21.40069
##$PH_mod= 1
##$PKNL= yes
##$PPARMOD= 0
##$PSCAL= 0
##$PSIGN= 0
##$REVERSE= no
##$SF= 200.130013532006
##$SI= 16384
##$SIGF1= 3
##$SIGF2= 2
##$SINO= 400
##$SIOLD= 16384
##$SREGLST= <1H.CDCl3>
##$SSB= 0
##$STSI= 0
##$STSR= 0
##$SW_p= 3612.71676300578
##$SYMM= 0
##$S_DEV= 0
##$TDeff= 0
##$TDoff= 0
##$TI= <>
##$TILT= no
##$TM1= 0
##$TM2= 0
##$TOPLEV= 0
##$USERP1= <user>
##$USERP2= <user>
##$USERP3= <user>
##$USERP4= <user>
##$USERP5= <user>
##$WDW= 1
##$XDIM= 8192
##$YMAX_p= 0
##$YMIN_p= 0
$$ End of Bruker specific parameters
$$ ---------------------------------
##NTUPLES= NMR FID
##VAR_NAME=  TIME,          FID/REAL,        FID/IMAG
##SYMBOL=    X,             R,               I
##VAR_TYPE=  INDEPENDENT,   DEPENDENT,       DEPENDENT
##VAR_FORM=  AFFN,          ASDF,            ASDF
##VAR_DIM=   8192,          8192,            8192
##UNITS=     SECONDS,       ARBITRARY UNITS, ARBITRARY UNITS
##FACTOR=    0.0002768,     1,               1
##FIRST=     0,             0,               0
##LAST=      2.2672688,     0,               0
##MIN=       0,             -307578,         0
##MAX=       2.2672688,     245875,          0
$$ Real data points
##PAGE= N=1
##DATA TABLE= (X++(R..R)), XYDATA
0@%%%%%%%%%%%Qj6J6j6K4l2M0m8N6p2Q8j04J20j39J63j92K24k56K95l41L89m42
33b35N02n67O39p20Q07r03J008j124J252j390J541j706J887k085K299k537K797
50A465l079L392l739M122m548N029n571O190o903P732q714R901j1366J3226j5684
65h547J9100k4202L2746n0602J54997k29591p4140M26114j85909j86601K25671
76I9036M825k88212J42789J80992j85527q0219J90706l1346j07895R2560M7693
87F5402j19069J7233Q7361n7649n1953Q5962r140q5740O9289P8835j07095k0921
99d7485J27263m1703j19788R4970O7254j23084j1485R5350n9763m0836R9766j2970
111B7489r4094N4950O9408m7985k7179J9994o873L465Q915k3719o182J5437m758
$$ plain form
0 0 0 0 0 0 0 0 0 0 0 0 0 8 -8 8 -8 16 -16 24 -24 32 -40 48 -56 64 -75 88 -104 120 -136 159 -182 207 -235
33 -235 267 -300 339 -381 426 -477 531 -593 659 -731 810 -896 991 -1094 1205 -1332 1465
50 1465 -1614 1778 -1961 2161 -2387 2642 -2929 3261 -3642 4090 -4624 5277 -6089 7137 -8547
65 -8547 10553 -13649 19097 -31505 123492 -106099 -180239 245875 59966 -126635 99036
76 99036 103861 -184351 -41562 139430 -46097 -126316 64390 33044 -74851 17709 65402
87 65402 -53667 -36434 50927 -6722 -58675 27287 18147 -67593 1696 80531 -26564 -47485
99 -47485 79778 38075 -81713 13257 80511 -42573 -54058 41292 -18471 -59307 40459 27489
111 27489 -66605 -11655 57753 9768 -17411 2583 -4290 -825 8090 -15629 -21811 -6374 -11132
124a1132K117P555m949J2975N280k2077J8028K6252l0615r939K1051k3604N52
137h506M6961l2633n1812N8703L4793o3657J846N2111m1186l5270N8709J0745
149C0804o7165j906N1879j1734l0197L7304J7408n2516J2259P5500l0273p3700
161d2337M9312M5847o6964r462N6505l9128l2085O4620j1418o1060N3044L4816
173D1690o8480P813N4337m1608j7027N3588k9928m4482O2593J8242o9217J2741
185a9738N1901l5493k3582M5401j965m4877J6889L5848k4130k3459K3924O975
197G694k1748R897K0353k0164j2915K6186M509k2021N019P649r937R485L932k3481
211a5542Q010K3874k0189j3453K5662k38j8900J3304N139j6905P717J0408j3700
$$ plain form
124 -11132 -9015 -1460 -6409 6566 11846 -10231 7797 34049 3434 -6505 14546 -9058 -8506
137 -8506 38455 5822 -45990 12713 47506 -16151 -14305 37806 -3380 -38650 20059 30804
149 30804 -36361 -38267 13612 1878 -28319 8985 26393 -26123 -13864 61636 31363 -42337
161 -42337 6975 52822 -14142 -23604 32901 -6227 -38312 26308 14890 -46170 6874 41690
173 41690 -26790 -18977 35360 -6248 -23275 30313 385 -44097 18496 36738 -32479 -19738
185 -19738 32163 -3330 -26912 18489 16524 -28353 -11464 24384 254 -23205 719 7694
197 7694 -14054 -4157 16196 -3968 -16883 9303 13812 -8209 -3190 4459 -5478 4007 7939 -15542
211 -15542 -7532 16342 -3847 -17300 8362 8124 -10776 2528 7667 -9238 -1521 8887 -4813
224d813k284Q347j090O424l092j4820J7828J5984k6296k677K9873j6037k3617
237a6270K9305M677l6344J0795K6652k2747q611K4913p697j8360J8575P950k1412
250h574K077J6310j0494q360J5176k833j5213J3872J0955k2038j464K7597j0955
263F056k6035K2858J4892k9869N401K7529k4804j4121L6179n875l6086K2137J9664
276A7926l1960K172K8380k2183j3852L1170n923k5537K2148J0175k7178P441K1256
289A4035k0763r113K5498n927j9079J9262Q742k1663O065J8259j7012q605K2206
302A1905k781k1254J2102J2711j9306q45J8467j3273j1583K1997j110k1813J2788
315a995J3021j9658P70K0783j3445r407K3304m368k0729J8675R154k5786O303
$$ plain form
224 -4813 -7097 1250 160 6584 3492 -11328 6500 22484 -3812 -6489 23384 7347 -16270
237 -16270 13035 17712 -18632 -7837 18815 -3932 -12543 12370 4673 -13687 4888 12838 -8574
250 -8574 -6497 9813 -681 -9041 6135 3302 -11911 1961 12916 -9122 -10586 17011 6056
263 6056 -19979 2879 17771 -12098 -6697 20832 -3972 -18093 18086 12211 -23875 -1738 17926
276 17926 -14034 -11862 16518 -5665 -19517 11653 5730 -19807 2341 12516 -14662 -7221 14035
289 14035 -6728 -15841 9657 3730 -15349 3913 12655 -9008 -2943 15316 -1696 -10301 11905
302 11905 9124 -12130 -28 12683 -6623 -7468 10999 -2274 -13857 8140 7030 -14783 -1995
315 -1995 11026 -8632 -7862 12921 -524 -9931 13373 9005 -11724 6951 16105 -9681 -3378
328c378K1046j9234r017K4789n644k2307J8675J0433k4278L906J9960j6253r556
341a0858J9603k862j7506J2210Q875j6596K236J3924j2969p017J6558l359j4223
354a1984J1995P890j4608K136J3708r521p293J3227p18j2160P259O053j0270L02
368c984P368m990j881N883l033k783N556k043n738N294J78p707N179M790q675
383f586O63Q898m938l585J0389r26q464Q582N393j1719J866J0757j0670n628J4911
398H943l796j5064J2225P765j9112K308J8850j3321j1842K1189L9k1632J3009
411d39J4330k2624j332K3836j1664j5397K2020L242k3588J1835J7075k1788m730
424i224K4154r536j9205J9096P374k3309M980K0839j5427j1212K1738r63k1210
$$ plain form
328 -3378 17668 -1566 -10583 14206 8562 -13745 4930 15363 -8915 -5009 14951 -1302 -10858
341 -10858 8745 5883 -11623 587 9462 -7134 -4898 9026 -3943 -10960 5598 2239 -11984
354 -11984 11 7901 -6707 -4571 9137 -384 -7677 5550 4832 -7328 -69 5984 -4286 -3984
368 -3984 3384 -1606 -3487 2396 -637 -3420 2136 93 -5645 -351 -173 -7880 -2701 2089 -6586
383 -6586 -5923 2975 -1963 -5548 4841 3915 -4549 4033 9426 -2293 -427 10330 -340 -5968 8943
398 8943 5147 -9917 2308 10073 -9039 -6731 12119 -1202 -13044 8145 8184 -13448 -439
411 -439 13891 -8733 -10065 13771 2107 -13290 8730 11972 -11616 219 17294 -4494 -9224
424 -9224 14930 5394 -13811 5285 12659 -10650 -5670 15169 -258 -11470 10268 9305 -11905
437a1905J1189J3122j9442l109J9457q777j4692J6461N331j9070O254J5480j4408
450d109n091J7408n535j4109J3170N611j4864L110J2112q861m158J1016k514p368
464d182N812J002n275J753J53l123J646j186k103M391N23m317N297M460p456K061
480e44Q171p840m358J1346k776j0367Q288N014j2522J689J3114q076r781J4686
494F044L146j5951O818J3538j6245p710K1091l033k0281J4160J3171k4001m7K6093
508A6793j4797j8557K5591K486k8412J4609J9904k9092m373L1987j2256k2791
520a8908K8072O561l1252J3153K4758k6529j0002K9580p676k4750K0060J1417
532A4484k7382K045K4792j4028j5637K1713K761k2557R536J6500j8516p372K2474
$$ plain form
437 -11905 -716 12406 -7036 -10145 9312 535 -14157 2304 7635 -11435 -5181 10299 -4109
450 -4109 -9200 8208 2673 -11436 1734 7345 -7519 -4409 7703 -1158 -5316 5700 3186 -4182
464 -4182 1630 2632 -2643 -890 -737 -3860 -2214 -3400 -5503 -1112 -589 -4906 391 4851 -2605 -544
480 -544 7627 -213 -4571 6775 3999 -6368 1920 6934 -5588 -3899 9215 1139 -8642 6044
494 6044 9190 -6761 57 13595 -2650 -10360 10731 7698 -12583 1577 14748 -9253 -9300 16793
508 16793 1996 -16561 9030 11516 -16896 -2287 17617 -11475 -15848 16139 3883 -18908
520 -18908 9164 15725 -15527 -2374 22384 -4145 -14147 15433 7757 -16993 3067 14484
532 14484 -12898 -10853 13939 -89 -15726 5987 8748 -13809 -4273 12227 -6289 -13661 8813
545H813m658k0073J6659J1386k1151J707K0721j2483j2611K0231K63k0803R881
558b118J2381j6748j431J5846p988q415J3319R10j0655M960N279p389P5M704l640
573i10k308K430m31l3J72j515L426K112m444L141M198o253n76Q420l859p074P996
590D492K430r664K281Q058p639m951J0079l4r918M117O668r228l310J1958l149
605B190j2238R886Q268j4436N4J5593r236j1285J7855K072j9725R717J4972j9002
619e315m237K1639r649j5931J9823L588k2120R038J6315j8618n093J9817q513
632G44j4441J6973M643j9529N398J4563j1943m975J4990l095j2809R377Q599j2998
646d503j824J2455m920q485J0762L513j2089K627J0987q328n330J1770k102j0950
$$ plain form
545 8813 4155 -15918 741 12127 -9024 -7317 13404 921 -11690 8541 8804 -11999 -2118
558 -2118 10263 -6485 -7916 7930 -58 -8473 4846 5756 -4899 61 5340 -2049 -1974 2730 -910
573 -910 -3218 -788 -1219 -1252 -1080 -2595 831 2943 -1501 1640 5838 -415 -991 7429 3570 -3504 4492
590 4492 6922 -2742 -461 7597 -42 -4993 5086 5052 -4866 -749 5919 -3309 -6619 5339 2190
605 2190 -10048 -162 8106 -6330 -6276 9317 81 -11204 6651 8723 -11002 -1285 13687 -5315
619 -5315 -9552 12087 2438 -13493 6330 9918 -12202 -3164 13151 -5467 -10560 9257 744
632 744 -13697 3276 7919 -11610 -6212 8351 -3592 -8567 6423 3328 -9481 -104 8495 -4503
646 -4503 -6327 6128 1208 -7277 3485 6998 -5091 -2464 8523 195 -5135 6635 4533 -6417
660f417P392N073j0490R37Q077o705k964Q475j920n765N535J157n571L830L048
675C692m813J044L312l785J070K977l721K8L982k994j100M550k397m223N676k0
691C278o260M687L209p578j84P171m425n371N823J342o654K751O009n964l511
706e677Q586n57p823N544N237q583o30R729n277q300J1115K047j2781N776J0013
721H419j3173k732J5164o553j2069J4264L874j6527O521J1966j4585l134J6226
734G661p044j1948J4050L248j5109O380J1099j2052l067J5149n248j0673J1482
747C928M250j3396L570J0439r050n498J1972j192j1355P154O630j1584m54J1859
761G273o860p401J0734Q56j1906O940P170j0946o17J1498o290o794J0868p36j0119
$$ plain form
660 -6417 975 6048 -4442 -3505 4572 -2133 -5097 3378 1458 -4307 1228 2385 -3186 644 3692
675 3692 -1121 -77 3235 -550 520 3497 -224 -196 3786 792 -308 4242 1845 -2378 3298 3278
691 3278 -2982 1705 4914 -2664 -2848 4323 -102 -5473 350 1692 -4962 -2211 3798 -2166 -5677
706 -5677 2909 2352 -5471 73 5310 -3273 -3903 5826 549 -7751 3364 5411 -7370 -1594 8419
721 8419 -4754 -7486 7678 1125 -10944 3320 7194 -9333 -2812 9154 -5431 -8565 7661
734 7661 617 -11331 2719 5967 -9142 -2762 8337 -3715 -6782 8367 3119 -7554 3928
747 3928 8178 -5218 -1648 8791 -259 -5757 6215 5023 -6332 822 7452 -4132 -4586 7273
761 7273 413 -6988 3746 4602 -7304 -364 6806 -4140 -4757 6741 451 -6343 4525 3789 -6330
776f330P180N915r681J333Q247o071l617Q086k162p075N765J894p300K472M457
791C113n906o81N350k286k925M399j32m198K461K359l580l07L033k066j042L109
807G01p66k798K261J718l008R23L496k689j847M913j133m407L547J586n461J697
823a267M349m819k296N858k260m851O193J542p149L919M907o978K21P578n023
838g6m419Q067K57p798N242M744q421L75Q357n281m639P892Q8q425M771N000q123
855b389n23Q174m297n738P643M44q676L785O090p443k034R419l272o821P830K740
871D932q911K964P325p585k920R115l452p345P355K101q117K966O517o966j992
886d013Q189l183o267O489J549p537K741N139o134j439O071k907l877N390J095
$$ plain form
776 -6330 850 6765 -2916 -1583 6664 593 -3024 5062 2900 -4175 1590 3484 -3816 -1344 3113
791 3113 -2793 -3474 1876 -410 -3335 1064 932 -3266 -805 1554 -2026 -2333 700 -1366 -2408 701
807 701 -65 -2863 -602 1116 -1892 -969 2527 -162 -2009 2904 1771 -2636 911 2497 -2964 -1267
823 -1267 3082 -1737 -4033 1825 -435 -5286 907 2449 -4700 -781 4126 -2852 -2631 4947 -76
838 -76 -4495 3572 3829 -3969 1273 6017 -2404 -2029 6328 1047 -3592 4300 4388 -4037 734 5734 -2389
855 -2389 -2912 5262 965 -4773 2870 3314 -5362 -1577 4513 -2930 -4964 4455 1183 -5638 2192 4932
871 4932 -3979 -1015 6310 -1275 -4195 4920 1468 -5877 1478 3579 -4538 -1572 4945 -2021 -4013
886 -4013 4176 993 -5274 1215 2764 -4773 -2032 3107 -3027 -4466 1605 -1302 -5179 211 1306
901A306n075L018L609m574N70L842k343k227M050k70l437J997J552l748J269K958
917B497l702n79L733j846k494L742m87m345L271K595m375J19M790m131k063O222
933B947j027n255M408K962o607J746O312n514l084P466j321o180N800L312q836
948b871J474P194n986m483Q254j302q105O079N095r310Q6R599n660n803R268j74
964C355r810M985O846r614r47J0415n033o988R538K228j0506M706P634r127j897
979d215R976l615q779Q058K869j0164K489Q227p616l503R350j809q042O167M464
994C857q230J228Q210n476m537P959l01p242M837M368p001J10O501l701l838N958
1010B702K35n522L249L453n404Q7M269k956k410L775l90l371K509J407l186N21
$$ plain form
901 1306 -3769 -751 2858 -1716 -1146 2696 353 -1874 2176 1906 -1531 466 2018 -1730 -461 2497
917 2497 -1205 -1784 1949 103 -2391 1351 864 -3481 -210 2385 -1990 -1871 2919 -1212 -3275 2947
933 2947 1920 -3335 1073 4035 -2572 -826 5486 -28 -3112 4354 3033 -3147 2653 5965 -2871
948 -2871 -1397 5797 -189 -4672 3582 2280 -5825 254 5349 -3961 -3875 5724 64 -5739 3529 3355
964 3355 -6455 -1470 5376 -4238 -5185 5230 197 -6791 2747 4975 -5531 -825 6809 -2318 -4215
979 -4215 5761 2146 -6633 1425 4294 -5870 -3381 4846 -2770 -6273 3077 1268 -6774 -607 3857
994 3857 -4373 -3145 5065 -411 -4948 3011 2710 -4532 305 4673 -2328 -2218 4283 582 -3256 2702
1010 2702 2937 -2585 664 4117 -1287 -1200 3069 113 -2297 1478 1088 -2283 226 1633 -1553 -1032
1026a032K150k357K89K582j802p65K538r13o82K063o83k332K071J332l238Q74
1042I5K303l483m07M238j590l488L368J506m440Q32L954m281k252N387j411n199
1058d868M614K562o368J825N837m872k623P219j228o915N712L681q012P97P638
1073D999n603m162Q053r76p835N346M327p935J12P603m441m667P204P7p178M405
1089f71M879o854p14O535k989m584N989J337o334K675N349m456k155N712j728
1104A991n169M704K526n388M46M652l981k386N061o70m558L292J650l760J052
1119e38K795l233j186L583j045k042K318k26k073K114R63k746R81J609k003O28
1135a01K099j760j136K758o88k104K118K85l585J574K037l016n02K846j836k419
$$ plain form
1026 -1032 1118 -1239 -950 1632 -170 -935 1603 690 8 2071 1388 -944 1127 2459 -779 95
1042 95 2398 -1085 -1492 2746 1156 -2332 1036 2542 -1898 -1066 2888 -1393 -3645 1742 331 -4868
1058 -4868 -254 2308 -4060 -2235 3602 -1270 -3893 3326 2098 -4817 895 4576 -3436 -2639 4999
1073 4999 -604 -4766 3287 2311 -5524 -178 4149 -3786 -3674 3929 -512 -5179 2025 2102 -5076 -671
1089 -671 4208 -2646 -3360 3175 186 -4398 1591 2928 -3406 -731 4618 162 -1993 3719 1991
1104 1991 -3178 1526 4052 -1336 -890 3762 -219 -2605 2456 1786 -2772 520 2170 -1590 -538
1119 -538 2257 -976 -2162 1421 376 -1666 652 426 -1647 467 1430 -1316 -335 1274 -729 -101
1135 -101 1998 238 -898 1860 1172 -932 1186 1471 -2114 -540 1497 -1519 -2021 825 -1011 -3430
1151c430L963M29m149J750L315l833r99N184j955m372N028J960n802J357N141
1166C587m832k117O638j137o553M993L368o877J124O372n179l882P838j047p162
1181d866M964L562p276O14P121m683m170P409j14o725M193M922o841q19O997l098
1197A190m428N588J173o280K370N027m910k006N859j493n123M385K327o083Q91
1212a513M983m126k344M962q90n144L840K837m717L43L884k230k362M473r91l457
1228b452L482J284m052J599K452l108r22L262j470k205L099m35k463J253J561
1243H85k942R86K482k571r34K448n84k024J630J254k415J014K099k284o19K573
1259I98p26k077K966M54l123J677K211k952m02L829k010l380L854J60l684K185
$$ plain form
1151 -3430 533 962 -3187 -1437 1878 -1955 -2954 2230 275 -4097 931 2891 -2911 -1554 3587
1166 3587 -1245 -3362 3276 2139 -4414 579 3947 -2930 -1806 4566 -613 -4495 3343 2296 -4866
1181 -4866 98 3660 -3616 -3002 4119 -564 -4734 2675 2561 -4164 29 4951 -1890 -2709 4288 1190
1197 1190 -3238 2350 3523 -2757 -387 4640 -270 -2276 3583 2090 -3033 1352 3679 -2404 -1513
1212 -1513 3470 -656 -3000 1962 1072 -4072 -232 2605 -2112 -1769 2115 -115 -2477 1996 1005 -2452
1228 -2452 1030 2314 -1738 -139 2313 -795 -1717 1545 75 -2130 969 534 -1929 -676 885
1243 885 -2057 -1071 1411 -1160 -2094 354 -230 -2254 -624 630 -1785 -771 1328 -956 -1575 998
1259 998 272 -1805 1161 1615 -1508 169 2380 -572 -974 2855 845 -2535 1319 1479 -2205 -20
1275b0K589m085l68M619k403l131M249M36m991L063K516m323L1M441k958k090
1291b425M491J34m270K316K873m196L57L930k802k007M040o38l847K662J688l792
1307a486K45L405k427k024L244l25l045K391J732l497K59L587k344k012L346l65
1323F84l342L013J759m111R17L504l114j492M246j201l288L044J360m303J200
1338a124L064l360j167M372j526l618L691P16l571J002L188k977j071M159j349
1353D29k911L289Q13l808J836L156l105r14L339j277k625L230O64l330J433K625
1369B844k990r47L450j506l003K752R65l395J092K581l075n67L553j269k158K875
1385A202M11l375J962K000l085j64L464k277j894L737q60l546K751J753l449P09
$$ plain form
1275 -20 2569 -1516 -1884 2735 332 -2799 1450 1886 -3105 -42 2474 -1849 -1818 2623 -335 -2425
1291 -2425 2066 2200 -2070 246 3119 -1077 -720 3210 408 -1599 2441 1803 -2044 618 2306 -1486
1307 -1486 -1241 2164 -263 -2287 957 632 -2413 -22 1710 -1787 -1528 2059 -285 -2297 1049 684
1323 684 -2658 355 2114 -1997 -1080 2424 -690 -2182 2064 863 -2425 619 1979 -2324 -1124
1338 -1124 1940 -1420 -2587 1785 259 -3359 332 1048 -2523 -1521 1667 -1310 -2381 1778 429
1353 429 -2482 807 1620 -2188 -352 2804 -301 -1215 2124 847 -1778 1452 2116 -1214 219 2844
1369 2844 -146 -1093 2357 851 -2152 600 1565 -1830 -738 1843 -1232 -1799 1754 485 -1673 1202
1385 1202 1613 -1762 200 2200 -885 -1049 2415 138 -1756 1981 1121 -2425 326 2079 -1370 -661
1401f61K877k799j242L705j082l340K799J204m026J248L095l204j316M052j404
1416i4k725L478J041m119J535L661l389j641M564j320l870L854J769m935J137
1431a054L966l637k053N167j307m596L735K288n019P77M409l560k311M943k92
1446A456m677L224K754m891K99M588k348k793M434J00l725K182K752l701j054
1461a400M208j320l238K660J133l309P15K540k239j497L122o41k409J848J042
1476A215k423K78K267j715m13J524m36j229J153J43p39K84M92o40K25P50j035
1493b99L16M48q70j0J024p68j123J543o3k257J694R12k009l67K837j581j421K800
1511H06k78l042K075K046l102l14L909k070k634M062P22m548K034L583m175p92
$$ plain form
1401 -661 2216 -583 -1825 1880 798 -2542 257 1461 -2565 -1317 1778 -1426 -2742 1310 -94
1416 -94 -2819 659 1700 -2419 -884 2777 -612 -2253 2311 991 -2879 975 2744 -2191 -1054
1431 -1054 2912 -725 -2778 2389 1082 -3514 221 2509 -2510 -1733 2676 -884 -3195 1748 1456
1446 1456 -3221 3 2757 -2134 -1835 2753 405 -2388 2046 2146 -1579 603 3355 -346 -1400
1461 -1400 2808 1488 -1750 910 2043 -1266 -551 1989 -250 -1747 1375 734 -1675 173 1215
1476 1215 -1208 -930 1337 -378 -791 733 297 -932 221 364 -375 -91 401 -239 -14 736 -299
1493 -299 17 465 -405 -415 609 -159 -1282 261 198 -2059 -365 547 -1462 -1829 1008 -573 -1994 806
1511 806 528 -2514 -439 1607 -1495 -1809 2100 30 -2604 1458 2180 -2368 -334 3249 -926 -1718
1527a718M506j791l709L664K001n152J206M258l930k265N063j022m830L661K664
1542B606m833M82M923l044k907M447N83m619K838K673m523l64M762j869l162L108
1558A101J206m053J604L174l441j160L289j132k529K330P95k504L23K108j630
1573e19p95J662k43j435J454K11r90L18M95m55N11N13p82j01P72r16j93J354j319
1592d58p99K019n88j680J825P34k521N84K404k310j090K847p02k924K581J399
1608A321l716Q48L910k680k071L749K32m182K651L163m377n86M928k205l650M485
1624A820J171n764J826M335l962k271N419j153m877M008K282m929N26M927l713
1639c55k625N325p28m656K630L330m351m84M648k117l385M336Q37m275J603L142
$$ plain form
1527 -1718 2788 997 -2712 952 2953 -2199 -993 3265 -665 -2930 2133 1111 -3719 -58 2606
1542 2606 -2227 -1745 3178 134 -2773 1674 2257 -2362 476 3149 -1374 -1738 3024 1155 -2007 1101
1558 1101 2307 -1746 -142 3032 -409 -1569 1720 588 -1941 389 1184 -1320 -997 1111 -519
1573 -519 -1314 348 105 -1330 124 335 -655 -337 158 -297 214 727 -55 -156 616 -300 -493 861 -458
1592 -458 -1257 762 174 -1506 319 1053 -1468 -884 1520 -790 -1880 967 265 -2659 -78 1321
1608 1321 -2395 -1547 2363 -317 -2388 1361 1593 -2589 62 3225 -1152 -1738 3190 985 -2665 1820
1624 1820 2991 -2773 -947 3388 -574 -2845 2574 1421 -3456 552 2834 -2095 -1569 3358 -355
1639 -355 -2980 2345 1617 -3039 -409 2921 -1430 -1914 2734 617 -2768 1568 2405 -1870 -267 2875
1655B875l342j192L770j024l632K909J600l470M86K802k375j691K981j6k264J498
1671h5J009j963M7K049j363p03J357k09j079P19O95q05J93N11n50Q4Q24p52p1
1690i2P76p95l84R31n93q60J209O2j591J045Q29j602j77K326j242j105J966J62
1708H65k316J290J831k179n83L007j310k232K548J044l470P91L134k510j557L686
1724B039n32l276K550J302l568J48L623k540k135L733J34l722J799K669l351k78
1740a405L308j490k453K821P69l049J121K427k663m67K526o89k290J755R10j997
1756h66L20J781j764o37J645k23j418Q68O06j517O06R27j162r0Q43n4p56J148
1774B57R5j086J465m3j330Q42M96j057L62J160j450m97J835o88j577J857L94k249
$$ plain form
1655 2875 -467 -1659 2111 1087 -2545 364 1964 -1506 -1020 1782 -593 -2284 697 681 -1583 -85
1671 -85 924 -1039 -992 1057 -306 -1009 348 139 -940 -221 474 -331 -138 373 -177 -93 731 -21 -92
1690 -92 684 -111 -495 436 -157 -1017 192 254 -1337 -292 537 -1065 -1242 1084 -158 -1263 703 865
1708 865 -1451 -161 1670 -509 -1092 1915 605 -1627 921 1965 -1505 -714 2420 -90 -1647 2039
1724 2039 1507 -1769 781 2083 -1485 -1337 2286 -254 -2389 1344 1478 -2244 -445 2224 -1127 -1405
1740 -1405 1903 413 -2040 781 1550 -1499 -378 2049 -614 -1081 1445 756 -1534 221 1131 -866
1756 -866 -546 1235 -529 -1166 479 256 -1162 -294 312 -1205 -599 328 -834 -924 -81 -135 -891 257
1774 257 352 -734 731 688 -642 200 696 -361 1 1161 -289 -786 1049 361 -1216 641 1035 -1214
1792a214R85J450j865q87K784r88k128K251J128k891R55K405k706r88L507r86
1808H12k755K533J845l262K55K806j802j938L349k56l293J898K074l494j15L333
1824A990j822k019K784M87l351J219K740k839r14L341j379j976K171J032k959
1839a495R75J894j900p02K388n42k072K102O47k192O97J396j229q14J560m22j265
1856i74J145l1j308M64J052j264K82J001r87k36J526m88r64J020K15j273Q88O39
1874G07j649N63J744j317j097J951j94j821J379J119k383K61K354j921q84K248
1890A060k88k638J914J442k833N2K820j681j562K869J07k952J771J955k826n03
1906a293L430j423k234K490J018l410J087K347k086j691L760r59k880K200J222
$$ plain form
1792 -1214 -229 1221 -644 -1531 1253 265 -1863 388 1516 -1375 -420 1985 -721 -1709 1798 812
1808 812 -1943 590 2435 -827 -572 2234 432 -1506 1843 1587 -1706 192 2266 -1228 -1343 1990
1824 1990 168 -1851 933 1420 -1931 -712 2028 -811 -1725 1616 237 -1739 432 1464 -1495
1839 -1495 -520 1374 -526 -1228 1160 618 -1454 648 1295 -897 -200 1196 -33 -847 713 291 -974
1856 -974 171 140 -1168 -704 348 -916 -634 367 -620 -856 670 182 -782 238 453 -820 68 707
1874 707 -942 -379 1365 48 -1049 902 708 -1113 266 1385 -998 -737 1617 -304 -1188 1060
1890 1060 772 -1866 48 1490 -1343 -1291 1529 -152 -1714 1155 1262 -1690 81 2036 -790 -1293
1906 -1293 2137 714 -1520 970 1988 -1422 -335 2012 -74 -1765 1995 1036 -1844 356 1578
1921A578k757M45K225j735j579K764l32k300J461J255k275K09K036j301q86J608
1937D16K04j643J073R39j244k27J338r19p23J177k74q12N51L39p60O25k8n64Q1
1956d51N97n50q1P88r75K2Q69n5j173J192J11j124M93J306j085n99J593j49j562
1975h33J646M60j922L73J689j575r05K374m86k104J571R41k276j00K645j551j912
1992a965K846K21k568J212K069k649n56K880r01k379K527P57k707R98K392k260
2008h3j034K610n67k180J959O53k377J68K288j768j168J904r1j663Q58J412j864
2025i43k56K052j171r19J572N0j336P34Q93j117o5J078p98k21Q40k35n76O66J16
2044C64m66M43o1o21M50J75p63J65P35q36l53J366l56j374J117P56j866P67J408
$$ plain form
1921 1578 -1179 -734 1491 -244 -1823 941 609 -1691 -230 1025 -1250 -1041 995 -306 -1192 416
1937 416 620 -1023 50 989 -255 -482 856 -63 -786 391 117 -695 -144 195 -565 60 32 -532 -451
1956 -451 146 -404 -485 303 -672 -650 219 164 -1009 183 294 -830 -337 969 -116 -715 878 729 -833
1975 -833 813 1273 -649 -276 1413 -162 -1067 1307 821 -1283 288 1229 -1047 -1147 1498 -53 -1965
1992 -1965 881 1102 -1466 -254 1815 -834 -1390 1490 589 -1790 737 1494 -1213 -215 2177 -83
2008 -83 -1117 1493 926 -1254 705 1358 -1019 -851 1437 -331 -1499 405 314 -1349 -491 921 -943
2025 -943 -1199 853 -318 -1237 335 385 -951 -217 676 -441 -506 572 -226 -447 393 158 -418 248 364
2044 364 -102 341 280 -341 109 284 -479 -314 421 -415 -768 598 242 -1132 -15 741 -1125 -358 1050
2063A050j152j191K261k26j898J687Q71k152N55K244j972j299K550j59k737J906
2079C38J670k930k28K878j040k439K663M24l067J134K541k682j005L088r86k414
2095b055K476J332l154M68K526j964j056K864m30k596J856J364k361m16K698j306
2111B46j656K170L42k788J264J378j723l94J772m53j423J198M93j488K39J374
2127E51q74n61J495l56p93Q17L24q23n0N56M2k65m9P3P0j5j27m4L38m20j42N31
2149B78k47o85R29r1p04M24P73q26l16J308p88p35Q12O63j766O71J603j289r05
2168h91J862J27k057J491R47k256J81J950j137j422J898K04k237J041J589j805
2184e15j049K689o93j853J749Q62k293L65J861j259j384K446r2j967R42J510j924
$$ plain form
2063 1050 -102 -1293 968 742 -1156 531 1402 -750 -195 2049 77 -1222 1328 1169 -1568 338
2079 338 2008 -922 -1150 1728 688 -1751 912 1336 -1731 -597 1944 -738 -1743 1345 359 -2055
2095 -2055 421 1753 -1401 -933 1593 -371 -1427 1437 1007 -1589 267 1631 -730 -1146 1552 246
2111 246 -1410 760 1102 -1686 -422 956 -767 -1161 611 158 -1265 -67 426 -1062 -823 551
2127 551 -323 -884 611 255 -538 279 603 -220 -270 286 328 63 14 87 157 142 15 -29 309 -111 -253 278
2149 278 31 -654 275 184 -520 -96 677 -149 -465 843 55 -680 132 795 -971 -300 1303 14 -891
2168 -891 971 1098 -959 532 1479 -777 -596 1354 217 -1205 693 897 -1340 -299 1290 -515
2184 -515 -1564 1125 432 -1421 328 1190 -1103 -738 1123 -136 -1520 926 834 -1133 -191 1319 -605
2201f05j7J802r24j497J808M31k113O53J611j807j81J476p30j207J390J42r87
2218g55K44Q98o04l55J024m24o01N20K34n22N06J33p08J99L75k9j46L36k10j87
2238g2M36j36n69O57r4q17P51M46j102J88O75n44n19R61K04j330R45P01j063l04
2258e86J685q05j327K063m5j873R02J396j658m12J911q42j725J595N94j884P91
2275b20J484j917m01J790l48j949J507P58j900N51J586j108j231J947K43k050
2291a258J287Q65j588j02K054r60j237J732o2j617Q45J227j697l75J625l69j261
2308h91J348M8j243O74Q26j468K17R50m92r27J314l11o87O81L45p27N14L97o45
2327g7q1O29l90l80N22J16o36L05Q20j091L10L28l81l03Q46p8j123R16L73j201
$$ plain form
2201 -605 -622 1180 256 -1241 567 998 -1115 -462 1149 -658 -839 637 -93 -1300 90 232 -755
2218 -755 -511 387 -217 -572 452 28 -573 -53 181 -341 165 298 -410 -211 164 135 -11 325 115 -72
2238 -72 364 228 -341 316 222 -595 156 602 -500 -312 363 -181 -700 261 465 -865 80 781 -282 -586
2258 -586 1099 294 -1033 1030 985 -888 14 1410 -248 -660 1251 409 -1316 279 873 -1011 -220
2275 -220 1264 -653 -1054 736 388 -1561 -54 704 -1196 -645 941 -167 -1398 549 792 -1258
2291 -1258 29 894 -694 -796 1258 298 -939 793 731 -886 -41 1186 -511 -886 739 370 -891
2308 -891 457 505 -738 -64 762 -706 -489 461 -31 -958 356 45 -642 39 384 -343 171 568 -77
2327 -77 -158 471 81 -299 223 339 -297 8 828 -263 47 375 -6 -309 537 459 -664 252 625 -576
2347e76L01J202r52m91P71P0j044R95M82j518L70J193r30m57J328J66j489J020
2365D41Q91j895R7J487r77j209J394K15j378N96J146j541K6J409p90j097J413
2382B28o6q92P26N36j032M7J257o95p88J050K60j045K74P67m26l44O47l68n89
2401d53Q48l1j093N17M89l77k86O05m71l03O70K3m54L1O47q15L28O08o15M1N50
2422D59o6o33Q99q6j146R21L33r76J28P68l90n33Q69k25o98O55K72r89L1J102
2442F95q16m46R71q1j219R48L91p69j01J230o96r33J265J02j213R54N65j240P9
2461c14J222r69o54J218p8j312Q10O46j077l52J397q70m60J094j32q59M77Q82
2479F69j541K48J323j160l60J134p0o22N26O75j028R7P15n01n49Q28l0q67O05
$$ plain form
2347 -576 -275 927 -25 -516 255 325 -719 276 758 -760 -390 803 -127 -584 744 910 -579 441
2365 441 1332 -563 -466 1021 44 -1165 229 444 -934 -338 808 -733 -707 702 -88 -1185 228
2382 228 162 -730 -4 532 -500 -453 804 109 -679 371 631 -414 -140 627 201 -143 504 136 -453
2401 -453 395 364 -729 -212 277 -100 -386 219 -252 -555 115 138 -316 -285 362 -453 -125 483 -132 -91 459
2422 459 393 -240 659 573 -573 348 681 -295 -167 601 211 -322 547 322 -376 279 551 -438 -407 695
2442 695 -121 -567 404 323 -896 52 443 -326 -427 803 107 -826 439 541 -672 282 847 -393 -314
2461 -314 908 -61 -715 503 425 -887 -77 569 -508 -860 537 -333 -793 301 169 -690 -213 669
2479 669 -872 -624 699 -461 -821 313 243 -379 147 822 -206 -109 606 105 -444 384 354 -513 92
2498I2L87q08j90O66k78j64O70l20n00M43J36l08j50Q09o35l62Q98k07n55P91
2518D15L10j381N76J026o62l98P73m79n40J050L1j396M91J030j114l51R60k24
2536A17j023J300j80r03L87R96j010l29J341q01p15R37N48j356J87J399r85o11
2554g01J590m56j434J135M11j126P1J149p04o13J112k28j183Q93M11r83L41P93
2572D78p71n01Q72J83r03P18M16q84R8R07o97r3O14k43n29N46K77n73K51J95k88
2593G3j55L66l16k58O51K6n12K22L8l34L7M72o66M8O38k37n44R67Pq22N63K11
2615D75q70K72Q87o37m90O53J02p76M16O54r46j62J000m33q18R62J2r03M75N51
2635D24j099n7R39M6j041Q80M29j069J08J146r99k99J169n01o54P55K97q56j38
$$ plain form
2498 92 479 -329 -519 147 -131 -295 375 55 -445 -2 134 -174 -324 485 -150 -512 386 179 -376 415
2518 415 725 -656 -80 946 284 -114 659 180 -360 690 721 -675 -184 846 -268 -619 341 117
2536 117 -906 394 214 -689 -302 694 -316 -645 696 -105 -820 117 665 -691 -504 895 -90 -701
2554 -701 889 433 -1001 134 545 -581 -510 639 -65 -678 434 206 -977 -84 327 -656 -315 478
2572 478 -293 -794 78 261 -642 76 492 -392 -294 613 -84 -177 437 194 -335 211 488 -85 166 361 73
2593 73 -82 284 -32 -290 361 387 -125 97 135 -199 -162 310 -356 -308 330 93 -451 516 523 -299 264 475
2615 475 -395 -123 764 127 -363 290 392 -384 32 686 -260 -422 578 145 -673 289 301 -602 -127 424
2635 424 -675 -732 207 253 -788 92 521 -548 -440 706 -293 -592 577 76 -578 177 474 -382 -520
2654e20J417j022j4N34k11r06O30M98j125K74P27m70l57O90O1p71O92K38p76K03
2674b08N45m39q5M84l5l17J58J58k77K56O2m2k22N21j21m28J5L37o55L42K07k64
2696hl08L66k39j06N10L0p77N97K04m38P7N96p47P9P53l11o15O64K18q91K61N42
2718D57n10n24J298m52o47N41K90q65R8P39q64k65J093l21q38J139Q0j288N35
2737c04P30n82j41P99n42q99J076L29p53K17P54p58m02R63j20r13N82R58j278
2756b84J07Q76q70n25J019Q8j066N12P07r37k75J099o80l43R61o9p53M86L41p00
2776c06K69M39l34j36K29J43n45J34N37o04K62M26n05n1M98m41l41L91K35m64
2796a64J15K3n3k33N04m09L3M18j6o33N37K41q12M18O08o84r7N67k41l81N13J81
$$ plain form
2654 -520 897 -125 -139 395 184 -722 -92 406 -719 -445 282 -188 -545 145 206 -565 127 365 -411 -208
2674 -208 337 -102 -187 297 262 -55 103 261 -16 240 302 260 38 559 438 10 25 362 -293 49 256 -8
2696 -8 -316 50 -189 -295 215 245 -532 65 269 -169 -92 504 -243 -164 589 278 -337 327 545 -346 -85 457
2718 457 -53 -577 721 269 -378 163 453 -412 -314 425 -439 -704 389 68 -770 369 449 -839 -304
2737 -304 426 -156 -297 502 -40 -939 137 466 -287 -70 684 -74 -476 487 367 -546 36 994 -284
2756 -284 -177 699 -171 -696 323 411 -655 -143 564 -373 -648 451 -229 -572 389 320 -433 53 394 -306
2776 -306 -37 402 68 -68 161 304 -241 -107 430 -174 88 514 9 -42 456 15 -326 65 300 -164
2796 -164 -49 -26 -79 -312 192 -217 -184 234 218 -415 122 363 -449 -31 577 -107 -204 363 122 -259 254 435
2818D35p34M37J11n48j10O61j12m91N10K13p53J28P91q57k43N45K94p01M29L15
2838C20o38N3O48l74m54Q52j80k65J39M70o14J10M84m55k09M11j06n23M12K31
2858C12o61O9R21p98m8O74m16k75M00K80l63j21K38Mn23N43n2m78N07J15m85K89
2880A32J4k14o6M24m03j64L37j72j95j63P82n81r0L99J74m69K79j27l45N17K09
2901B78o98L59M92m11o18R04n4r52M05J211j388MO89l58PP68l77r35R05J88r23
2922e04OM26j20m87R63r4q98R38J23m18k54K44k52o7O40K99r11M53N80r79K37
2943g5M13j57m30N01no29O31O2p10K48P12o20l47O68m4l57J25l1j96J15P23o15
2965a8k81O30j08o35O23J03m27K49J86k70l23N99o7l81L68K1o22L48L32l47l44
$$ plain form
2818 435 -299 138 249 -299 -409 252 140 -351 159 372 -381 -253 538 -319 -562 -17 277 -424 5 320
2838 320 -318 -265 383 9 -445 407 227 -38 101 571 -43 67 551 96 -113 298 192 -331 81 312
2858 312 -349 -280 641 -157 -205 469 53 -222 178 458 95 -26 212 216 -307 236 184 -294 213 328 -157 132
2880 132 146 -68 -134 290 -113 -277 60 -112 -307 -470 312 -269 -359 40 214 -255 24 -103 -448 69 278
2901 278 -420 -61 431 20 -598 306 252 -700 -295 916 -472 -468 221 -137 -130 638 261 -674 231 419 -504
2922 -504 -498 -72 -192 -679 284 190 -708 230 353 -65 -319 -75 -327 -394 246 545 -366 87 667 -312 -75
2943 -75 338 181 -249 252 247 -382 249 311 -399 -151 561 -59 -406 262 218 -139 -14 -45 -241 -126 597 -18
2965 -18 -299 331 223 -412 211 314 -113 136 322 52 -271 328 261 -120 248 269 -353 -5 327 -20 -364
2986c64P32l36l33M94r8o33N58L58n35l25M53q5n26P15N8n77L26O48p05J38L32
3007B95J00p10M44J50n28J31O07l26m65P66n87k2L93m65j14J77N65n57P7kK5k50
3029b96K90N48p39kM55j09k67N76l16j94O34m35l32J61M47m17q7J79j46Q9J37
3050A76k63j12J90K73k40j83J93j36j71N55m48J3M34J08n16J53L89l48l24N07
3070B50l25k04N82k03m13J80L55m28j43O01j74m58M80l7n12J81N89n25j68N62
3090A90j87m14M39R3l94J36N81k90m98N27N8m78N00M2p46M60M58m87n07Q52r3
3111B42o34L67M10q14J99O23p17L1N03j92m90L56O40r35L79K99j43k39M51o3k62
3132A1L7K17j56MJ2j87n0N17k29j97J87p6r3P8K19l54J66p1n4l00L13J90l07J26
$$ plain form
2986 -364 368 32 -301 193 95 -538 20 378 -157 -482 -29 -114 -640 75 133 -444 -118 530 -175 -37 295
3007 295 395 -315 129 279 -249 -118 489 163 -302 464 -123 -145 248 -217 -331 -154 411 -146 -69 -71 -46 -296
3029 -296 -6 542 -197 -199 256 147 -120 456 140 -54 580 145 -187 -26 421 4 -83 96 -50 39 176
3050 176 -87 -199 -9 264 24 -159 34 -102 -273 282 -166 -153 281 389 -127 26 415 67 -257 250
3070 250 -75 -279 303 100 -313 -133 222 -206 -349 252 78 -380 100 63 -449 -268 321 -204 -372 190
3090 190 3 -411 28 121 -273 -137 444 154 -344 183 241 -237 263 305 -441 19 477 -10 -517 335 242
3111 242 -392 -25 385 -429 -230 393 -324 -293 210 18 -472 -116 524 -411 -32 267 124 -115 336 273 11
3132 11 48 265 109 113 125 -62 -112 405 176 -21 166 90 -3 75 294 -60 106 35 -19 -319 -6 184 -123 3
3156CO0k26K10J74l65K07M36k39m90O92l08k93O5N22m02m09P28l38l94L87K53
3177B73n27o2O35l92l74Q54p13l03O03J86o08J6O94l29m31Q41l34j60K39L82q49
3198c59J61P33k82p30O72K18q88O10L74o78l86Q04k07o32O34N23j059K97M99n09
3218b05jK63J23m04NM03o46M09L39k04j07M56j5n60L57N6m61M01N1m22J8K23j18
3241c9j95J99q6%J91K02n16J8K81l52P0L39k12N2K12J02l89L01J36p63L93J80
3263A24j99k8K64j31k98M46J01n01P6K83l51l4N47l38k33M52j1m61J35M07m88
3284b38k45N68R1m91L73L49n99j34Q48n06l33L47M10q62K67L34k18l27P61n35
3304a40q3M60ql61K13L00n28n3J48J66k48K45J88n97K3N03k64o4L44l40j30L27
$$ plain form
3156 3 63 -163 47 221 -144 63 499 260 -230 462 154 -139 -74 448 46 -363 365 27 -367 20 273
3177 273 -254 -316 319 -73 -447 407 -306 -609 -6 180 -428 -412 282 -47 -478 363 29 -131 108 490 -359
3198 -359 -198 535 253 -477 195 413 -475 135 509 -169 -555 249 42 -590 44 567 -492 -195 304 -205
3218 -205 -206 57 180 -224 -219 184 -462 -53 286 82 -25 431 416 -144 213 269 -192 209 260 -162 -144 79 -39
3241 -39 -234 -35 -121 -121 70 272 -244 -226 55 -297 -227 112 -100 -48 164 266 -123 178 314 -449 -56 124
3263 124 -75 -103 161 30 -268 178 279 -222 -146 137 -214 -248 299 -39 -272 180 169 -292 -157 250 -238
3284 -238 -483 85 176 -315 58 407 -192 -326 522 16 -317 30 440 -422 -155 179 -39 -366 395 -140
3304 -140 -223 237 229 -132 81 381 -147 -200 -52 114 -134 111 299 -298 -275 228 -36 -100 244 -96 -226 101
3326A01J15l34K1L48j69l5K4P5j99K13j9l22K30Qk40K7J89j04P8J14j26j65K33
3349F3p8LN6O4j95j9M27j90k84L33j00l59O26K32o21k96O73n01p5M57K3p30N80
3372H9K71q15m7Q21m70m10P65J40o86L42J70k80nL98k1m61K55K25n64K25P29p70
3394i9o5N06P9p80M51J96m03j56P35o41j70M72J25k36mJ04k68j17O19j41m47P33
3416D93l08l46J64K74k89o5L62k61j75L71l83j16N65k28l31K39K72l88P1K47l98
3437b30J19J80k7k64N0K24l88J84L36j9k78L28p3j54P4j09j69j97Q07n65j03O26
3459C52l34l64M70L83r18N31L05m45r8K91j82m61M38J83m50J84M18m74j13P49
3479D65j40n91K06M77o29J99L02Qk79M30j75l41j39N63m73j00N09l43j25K57m5
$$ plain form
3326 101 216 -118 -97 251 82 47 71 146 -53 160 141 -181 49 57 -183 -156 33 -71 7 121 -5 -170 63
3349 63 -15 -12 44 108 -87 -106 321 131 -153 180 80 -279 347 579 -42 -338 335 -166 -241 216 239 -491 89
3372 89 360 -455 -502 319 -151 -561 204 344 -342 0 170 -110 -115 283 262 -199 56 281 -283 -58 671 -99
3394 -99 -164 342 421 -359 92 288 -115 -271 464 -177 -347 125 250 14 10 114 -154 -271 348 207 -240 493
3416 493 185 -161 3 277 -12 -77 285 24 -151 220 -163 -279 286 58 -273 -34 238 -150 -79 168 -230
3437 -230 -111 69 42 -222 -172 52 -336 -152 184 165 -113 215 142 -12 62 -47 -216 -413 394 -171 -274 352
3459 352 18 -346 124 507 -411 120 425 -20 -118 173 -9 -470 -32 151 -299 -115 303 -171 -284 465
3479 465 325 -266 -60 417 -212 -13 289 297 18 448 273 -68 -207 356 -117 -217 292 -51 -176 81 36
3500C6j57J10M51l69m1K71l67k51K26N43n99Q5K69l89P3L21j85l56M53k71p1L08
3522I0kj59J27L31l93J4M3j33j35M80k13l61K60J46j78R1J98m35j22N71j18l16
3544b14K92J00m15L15J40m56j14Q49l70m52O59R0q69M49L45n11r5M23j9k79K04
3565G2L12m72q8P42o40j09K60J59o09M75J61k07l01Q46l51l30M50k93j40K3L45
3586C05l83M4K87l41K29L21l53n88L20R1o6j64M51k86l45N66j32j8j87K91l13
3607b71L24J01m72K84J54l49M83j29J24l23N7K84l56K30L16m53p9L60k49l90L90
3628C6K95o86J59J37j1l81O00J21q29N74L0n15K61L59m93J63P43r4q36L51M03
3649C87n36Q3L39j4o08O90mm82J15L11l77j63N84p3n10N11N4n76K4O09j28m66
$$ plain form
3500 36 -121 -11 440 71 30 301 -66 -317 -91 452 -147 -62 207 -182 -109 212 27 -329 124 -147 -218 90
3522 90 88 -71 56 387 -6 8 51 -82 -217 263 50 -311 -51 95 -83 8 206 -229 -351 220 102 -214
3544 -214 78 178 -237 78 218 -238 -352 497 127 -325 334 424 -445 4 349 -162 -257 166 147 -132 72
3565 72 384 -88 -176 566 -74 -183 77 236 -373 102 263 56 -245 601 250 -80 370 77 -63 -40 305
3586 305 -78 -34 253 -88 141 462 109 -479 -159 -68 -134 -298 153 -133 -478 88 -44 -62 -249 42 -271
3607 -271 53 154 -318 -34 120 -229 254 125 249 -74 -17 267 -89 141 457 4 -75 285 36 -354 36
3628 36 331 -355 -196 -59 -70 -451 149 270 -559 15 45 -470 -209 150 -343 -180 563 469 -367 -16 387
3649 387 -149 -66 273 259 -349 341 337 -145 -30 281 -96 -259 325 252 -258 253 307 -269 -245 364 236 -230
3671b30K88L9l68K45L80l60j18N22k77l57K75J64m93L99j04j42m60R25k76k34
3691a82K38k35P3J70j38Q7j96M4K33j22o1j8o4j9J36Q4J14j00R6K8K3n6k08K15
3715A42k22J56J27j91j17M12j04l40N4K08m49j02L77J40k71J48M81m99J03K14
3735B67o15l3O51j04m47M76L16n41k99P32k11m28O52k04m96K42L32l83j07M80
3755B80l46k51J72M93p71J49M89m01k05N71J03o38N35K72m67j76O16l33m68N01
3775A25j65n8N1L87k31k81L92K4m78JK65l56M09m1J11m89M02K0j64j1J51j66K0
3798h2OJ05M8p8j17L97N0j98k72J94J96l73K6Q0r8K71ml75R5N85m16l61P43k29
3822A93n42L66J96l95j94L35O0l76O05J12o65M19L17o96J38O79l75k94M62j7n48
$$ plain form
3671 -230 58 97 -271 -26 354 -6 -124 398 121 -236 39 203 -290 109 5 -137 -597 328 52 -182
3691 -182 56 -179 -106 64 -74 13 -183 -139 94 -28 -89 -107 -171 -190 -54 30 144 44 140 168 191 135 -73 142
3715 142 -80 76 203 12 -105 307 203 -137 -83 125 -324 -426 -49 91 -180 -32 449 -50 53 267
3735 267 -348 -381 270 166 -281 195 511 -30 -329 403 192 -236 416 212 -284 -42 290 -93 -200 280
3755 280 -66 -317 -145 348 -423 -274 215 -186 -391 180 283 -355 180 452 -15 -191 425 92 -376 125
3775 125 -40 -98 -47 340 109 -172 220 244 -234 -233 32 -324 85 44 155 -334 68 88 -76 -87 64 -102 -82
3798 -82 -76 29 77 -1 -118 279 329 131 -141 53 249 -124 -98 -18 -116 155 151 -224 -129 456 40 -321 422 193
3822 193 -349 17 213 -182 -376 -41 19 -357 248 360 -305 114 431 -265 -127 552 177 -117 345 328 -220
3843b20L06N68n82k56N85m62j96L52L13o83J69M27n75J34J44J39m19L5P02p17
3863b36j96R46n70m19O30J97m94J34J81k66j34L84k6k15O5r9J70L7K9j24J00L4
3885A28k34j22K55Nk19N5K95o04L34J22l3pJ80p8k23J98K16l19L0j1k04K25L64
3908C53k98m6O0J60m05M32P0m69K26M96q69M9N19k62m31N82O8n12K89N25o71j26
3930b60N58j49n18M77K04o59K20N24l41o8L43L8n35J98K88o61K40P04o91l67O95
3951B40k72l93K95M08m68j5K68m4k48J56L03j89k26K67j78k1L43k13j54L06J05
3972B70m00K35j94MK42J60n36J13m8J61r9rK3j17J84M2j80K50R4m09j6J41K5j36
3996b00M75p5m15J34K04k46qP10o34j61K33J54q3j91L82m34r4L33p5j92L67L14
$$ plain form
3843 -220 86 654 72 -184 401 -61 -257 95 408 -275 -106 321 -254 -120 24 163 -256 -221 481 -236
3863 -236 -432 514 -56 -475 155 352 -142 -8 173 -93 -227 157 131 -84 -19 -118 52 89 118 -6 94 128
3885 128 -106 -228 27 32 -187 -132 163 -441 -107 15 -18 -25 155 77 -146 52 268 -51 -21 -32 -236 -11 353
3908 353 55 9 69 229 -176 256 326 -143 83 579 -290 -241 278 16 -415 167 235 -277 12 537 -134 -260
3930 -260 298 149 -369 108 312 -347 -127 397 56 -12 331 369 -166 32 320 -341 -101 603 -88 -455 240
3951 240 -32 -425 -130 278 -190 -205 63 19 -229 -73 230 41 -185 82 -96 -117 226 13 -141 165 270
3972 270 -130 105 -89 -85 157 317 -219 -106 -154 7 -92 -101 -78 -195 -11 31 -149 101 195 -214 -230 -89 -64 -200
3996 -200 275 200 -215 -81 123 -123 -131 579 -55 -216 17 171 88 -103 279 -155 -249 84 9 -183 184 498
4018D98q18J39N70m32l84O47j83o64P56M67q07q9O14k64k28K80K30m49K99L80
4038E62r06K45O05n79M4J36K5m00M03Q0n35Q6L94m80K87J3j21k19J80K47l31L02
4060C8L10m69L7L20k68nQL52k22R2j10K5l51M47q6l95J04L44l83L83q2k69L3Q6
4084f1k49K37N02l23l66K71K33o25M46J52j77j95L08j20k74O10j37j60q2N67m87
4105G0k86M98j76m37L38L71q09K12M38k24m35L36L09m62M27P4k61r8K79j91l03
4126c30N60k3n08J34O64m31j29K43l8n01K02N79p64K07K16n2k13L44m07J45L7
4147f5lj17J34rk7K51j65m6r4J33K3M4r5M0r6K67l3k26N4J55M8j51j16k8m5K48
4173H1m0J06l31N68l79k67K60J04l46M14o7n68M90j28O2j15J66K67k86K07J18
$$ plain form
4018 498 -320 -181 389 -43 -427 220 37 -627 129 596 -211 -300 314 50 -178 102 332 -117 182 562
4038 562 -344 -99 506 -73 -29 107 132 -268 135 215 -320 -234 160 -320 -33 -20 -141 -360 -180 67 -264 38
4060 38 348 -121 -84 236 -32 -37 -29 323 101 193 83 108 -243 204 118 -277 -173 171 -212 171 89 -180 -147 -61
4084 -61 -310 -73 429 106 -260 11 244 -381 65 217 40 -155 153 33 -241 369 232 72 -10 557 70
4105 70 -216 282 106 -331 7 378 -431 -219 219 -5 -440 -104 205 -257 170 244 -17 -115 164 -27 -330
4126 -330 230 207 -301 -167 497 66 -63 180 142 -359 -157 422 -342 -135 81 29 -184 160 -247 -102 -65
4147 -65 -68 -185 -51 -60 -87 164 -1 -47 -141 -8 15 59 -36 4 -92 175 142 -84 -30 125 173 22 -94 -122 -167 81
4173 81 41 147 -184 384 5 -262 -2 102 -244 170 103 -465 25 -103 -41 -156 10 277 -9 198 316
4194C16m40M1N55l30k98N62k66l02K2O38n21o5J83k21k08M21K3k52J50L48o81
4215c25j75N94n8k60K49J27l90J20L60m00K6K99M5n22J25O29m94j65N82l95m85
4236e13Q01k1m95K50p8j39j06J99mk70L94r8Q7m8J46k44K23j32j0J44J33j87j93
4259a61J76o2K14m0l2N7p9q0KP9J78m03M2J68N3l70J99O7l11J92K36j55j51K80
4283I9K19o29M29K62p44J88O04m18k21M70j64k70J92L41m96k57R33m69m66O49
4303B52j43j65j74L96k00l44M31R8n54M51J06l64K06K77n14J97OK86n46L60ll55
4325b96K13L85l53j46M88k6p07N08J26k60k66M85k39j19K33r1p3K13j48k07K86
4346FJ87k72l2K44K4O5l64K10P4k60M50m25m8J81pj31J68j24k81M48L6l64M38
$$ plain form
4194 316 -124 -83 472 142 -156 406 140 -162 -140 498 -23 -88 95 -126 -334 87 110 -142 8 356 -325
4215 -325 -500 94 36 -224 25 152 -238 -118 242 -158 -132 167 212 -310 -185 444 -50 -215 367 -28 -513
4236 -513 288 267 -228 22 -56 -195 -301 -102 -106 -376 18 -80 7 -41 105 -139 84 -48 -58 86 219 32 -161
4259 -161 15 -47 167 127 95 152 73 -7 -5 74 252 -151 -109 59 112 -258 -59 8 -303 -111 125 -30 -181 99
4283 99 318 -311 118 380 -364 -176 428 10 -211 259 95 -175 17 358 -138 -395 538 69 -397 252
4303 252 109 -56 -230 166 -34 -378 53 151 -403 48 154 -210 -4 273 -241 -44 -38 248 -298 62 59 -296
4325 -296 -83 302 -51 -197 291 265 -442 66 192 -68 -334 151 -88 -207 26 -65 -138 75 -73 -280 6
4346 6 193 -79 -111 133 157 222 -142 68 142 -118 332 -93 -141 40 33 -98 70 -54 -335 113 149 -215 223
4369B23J32l72j67M54n47J10K24J32k63j2J25k33K2N87n68k23O96p5m25J19N19
4390D58m71q1L49m5l67M86L5n67j06M93n72J27J84Q7k68K81K59o11K84O5j59l7
4412a76K39J16m66M77m4l67K09L28k33l62N59q6n40M95R7l2j06L4r2k23J55k5
4434d3k63L60J19j57l76M06k14R6J99k10J45L0j33J13J93n1m27p5M96o7M1r2K29
4457C19l39K55r5M3k33K02j87p0L76k48j85M62k46k74j07M26l01n9K84n2j88M96
4479B79J19n02J38K98n79J78M89j62o44N66M3m38k4O55l98m69P08l53l08N30M7
4500A73q02M23M0oL7R3J4m34M70J24l55k5O19l15j51Q0r6q0M48j49j02R1O9q2
4524H4Q2L3j69l89M14M5l68K31n7J03j6K60j85k82J65K71l87R6K88l14m8J68j97
$$ plain form
4369 223 355 -17 -184 270 -277 -167 57 189 -74 -86 39 -194 -172 415 -153 -376 320 245 -180 -61 458
4390 458 -13 -94 255 210 -157 329 364 -203 -309 184 -388 -261 -77 10 -258 23 282 -329 -45 20 -139 -176
4412 -176 63 179 -287 190 146 -221 -12 316 83 -279 280 194 -346 149 246 214 108 142 50 -173 -18 -43
4434 -43 -306 54 173 16 -360 46 -168 -72 127 -83 62 92 -41 72 265 214 -213 -288 208 141 182 90 319
4457 319 -20 235 140 183 -50 152 -35 -105 271 23 -162 300 54 -220 -327 99 -202 -261 23 -29 -217 279
4479 279 398 -104 34 332 -247 -69 420 258 -386 180 223 -215 -239 416 18 -451 257 -96 -404 126 173
4500 173 -629 -206 -166 -172 -135 -42 -28 -462 8 132 -223 -248 371 56 -95 -15 -111 -191 257 108 6 97 166 84
4524 84 166 199 30 -359 55 100 -268 -37 -94 9 -7 253 68 -214 -49 222 -165 -69 219 -95 -143 25 -172
4547a72J49K76j71P8r7N2j96Q4K22m18J2M06q5k14O6k17l4K46K83n17J05J39J66
4570A63l20lK36k91L00M1m67N0N15L38o61J87J17m62R6M92l77k26N29k20m45L02
4592a06K88l91J99Pj6l40N62k34k89J29N45m62rL00j67j18K22P9j73K70k18j49
4614g1J07j2R5j26o4K58j93K94J5m08M3J93l26K3J57M9m42M49j46n2L02J45l56
4637f6MO7j54p0L90k55K9R9K34k87J81r3k74J59M32l11k45J56K42l45N1J68k96
4660a84q8M76M5o11K09K80m57R9M61k93j18K10L6l67N94j19k25k61M38r3r2N3
4682gJ86k53m5M09o08L35J47k02m23N33o8l38J57R3J53k33K21j54n8L15Q6n36
4704b90O09j00k60K82j42j56QJ05j15j57M53j55k21L00Q5k42j8K8k25m1K04L5
$$ plain form
4547 -172 -23 253 82 160 63 115 -81 3 225 -193 -181 225 140 -74 -8 -225 -259 -13 270 -247 -142 -3 163
4570 163 -157 -160 76 -215 85 126 -341 -291 224 562 -99 88 205 -257 -161 331 -46 -272 257 37 -408 -106
4592 -106 182 -209 -10 -3 -19 -359 203 -31 -320 -191 354 -108 -117 183 16 -102 120 199 26 296 78 -71
4614 -71 36 24 119 -7 -71 187 -6 288 303 -105 -62 131 -195 -172 -15 34 -408 41 -105 -157 145 290 -66
4637 -66 -62 5 -149 -219 171 -84 -55 44 278 -9 172 79 -195 -36 396 85 -160 -4 238 -107 -56 112 -184
4660 -184 -272 204 249 -362 -153 127 -330 -231 230 -63 -181 29 65 -302 292 173 -52 -313 125 32 -60 -7
4682 -7 179 -74 -119 290 -318 17 164 -38 -461 72 4 -334 -177 -84 69 -164 57 -97 -155 160 246 -290
4704 -290 319 219 -41 241 99 -57 -49 56 -59 -216 237 82 -139 161 246 4 -14 14 -211 -252 -48 -13
4726a3k35K86j02o4P1K40k59j24O43m97k74L83K64m32j52N63l50j25L69k62k19
4747b89M51j1l10J66J94k62l18O22k35j95j00M28j67k59N09m50J35K56q0m71J54
4768b32O62n15j35M16p0m19L56r6l62M32K69m49j64P94o01k14K15J47l44L12K91
4789B93l01j01O9J01m66L33n1j13K71J20q2k50L91j59k20J90Ll6J31L6j88k39
4811b68N28j24L3N0k47p0J86R6k97J52K3n05L32J83L3m60N18k62l61N85%m78K39
4834a14K14k66mL93j05p0L1J75m96K01J75j33o23P22R8o48M78J64l33jM06l94
4856a30l76N08o5k73L25L7k97j09O54n29r7K65K76j77j5K27l12r7L75J99n19K53
4878A23r0j00J56K55n36j08N37j37m21M17J51n38M74k36l3K54k44RJ2K28j54j91
$$ plain form
4726 -13 -248 38 -64 -128 -57 183 -76 -200 443 -54 -328 55 319 -113 -265 298 -52 -177 192 -70 -289
4747 -289 162 151 -159 7 201 -61 -379 243 8 -187 -287 141 -26 -285 224 -226 -91 165 85 -386 -232
4768 -232 430 -85 -220 196 126 -293 63 -33 -395 37 306 -143 -307 487 -114 -328 -113 34 -310 2 293
4789 293 -8 -109 -40 61 -405 -72 -123 -236 35 155 73 -177 214 55 -165 25 28 -8 123 159 -29 -268
4811 -268 260 136 169 219 -28 -98 88 184 -113 39 62 -443 -111 72 105 -355 163 -99 -460 125 125 -353 -114
4834 -114 100 -166 -170 223 118 48 79 254 -242 -41 134 1 -622 100 198 -450 28 192 -141 -142 264 -130
4856 -130 -506 2 -63 -336 -11 26 -271 -380 274 -255 -352 -87 189 12 -3 224 -88 -185 190 389 -130 123
4878 123 33 -67 89 344 -192 -300 237 100 -321 96 247 -291 183 -53 -86 168 -76 -67 -55 173 19 -172
4900a72L60p6l81N36P2k28j72RK00m7m7J85k80J88p9o5J53j32j87r1K60l6k76
4923c06J35K72k69L50M2m16m9M34l41j11Q3L23l37K53J81j49l20L86j47j38J88
4944F4K20n70K68L03j98n81N23k86j4j7M50m16M4L79k03r9L30r9l62P7K35k13
4966a65J97L70m36j75K0L31k25M1K93m10K3K59K07l25K10m36R0K15j98j12j6O30
4988C88l00l44L30j87m30M18J88k87K98r1L2k12M42q9q3k19L19k12lJ64m58K16
5010a20K71l48j0M89k35k47J93Q4n00K52M02n84n7O41k28l61J81L57j72l51N93
5031B50J1n43N14j85k05L54R0k78j10L68j99k45L92L1m41J59J29p5k90L40l31
5052b64N9K62J88k43k2R6j77q2L28k0m13O21j94lj65K06l17r9N73n05J32J21p2
$$ plain form
4900 -172 188 112 -269 267 339 111 -61 -52 148 101 54 239 -41 147 68 3 156 24 -163 -254 6 -30 -306
4923 -306 -171 101 -168 182 224 -192 -241 193 -148 -259 -176 147 -190 63 244 95 -225 161 14 -124 64
4944 64 284 -286 -18 285 87 -494 29 -257 -271 -288 162 -254 -210 169 -34 -133 197 98 -264 -187 48 -165
4966 -165 32 402 -34 -209 -189 142 -83 -42 251 -159 -136 123 330 5 215 -221 -131 84 -114 -226 -242 388
4988 388 88 -256 74 -113 -543 -125 63 -224 74 -17 15 -197 245 156 73 -146 173 -39 -42 122 -336 -120
5010 -120 151 -197 -207 282 47 -200 -7 77 -423 -171 231 -353 -410 231 3 -358 -177 180 8 -343 250
5031 250 261 -282 232 47 -158 196 286 8 -102 266 67 -178 214 245 -196 -37 92 17 -273 67 -264
5052 -264 -205 57 245 2 -20 76 -101 -183 145 125 -288 333 139 136 -29 177 -140 -239 334 -171 -39 82 10
5075A0k50R8J78J27l48K70r1l61K60O5k5L40k52k62J66Q6k8J16J70n3m06K55J43
5098B08m01O9K45j56O8K14O3n04K63ok25L63J59n06l10P30l91k82M81k1l90K44
5120h5K38m61l2O16j37j41J38J14n73L69J93k99m3L88k13m13L08p5j59P5K18j37
5142a11j88L50o2m56O79j79n64N29R5k02m2L65m7m15K66K57k75k40M11j86j83
5163a98L40j66K3J78l1l32J77K23m37K74O7K7m27M02j32j90J40K5l2P5j74j69
5185c37J20M50k39l70K74L79m07J62J81q1j61K75R2l84K58mn47J92N61m98k48
5206c32O07l08k62K53J87m55M9L46m8j51K94Pm02K92M86n42l1K55j83j48M82L1
5228D27p92M08K56n24K61M67m99l72L15L30l65K0J42l35l4N92m65jJ85Okj27J75
$$ plain form
5075 10 -240 -142 36 163 -185 85 -6 -367 -107 -42 -67 273 21 -241 -75 11 -17 99 269 216 -190 65 208
5098 208 -193 -124 121 -35 33 247 310 -194 69 63 -162 201 360 -146 -456 274 -117 -399 82 61 -329 -85
5120 -85 153 -308 -340 276 139 -2 136 250 -323 46 239 -60 -103 285 72 -341 -33 -108 -267 -192 26 -111
5142 -111 -299 51 -11 -467 212 33 -531 -2 93 -109 -151 214 167 -248 18 275 0 -240 171 -15 -198
5163 -198 142 -24 -1 177 146 -186 -9 214 -223 51 118 145 -282 120 -12 -202 -62 -37 -69 6 -168 -337
5185 -337 -217 233 -6 -376 -102 277 -130 32 213 132 -29 246 338 -46 212 208 -339 -147 414 -84 -332
5206 -332 275 -33 -295 -42 145 -310 -261 85 37 -114 180 187 -215 77 563 21 -10 245 62 -86 396 427
5228 427 -365 43 299 -225 36 503 4 -368 -53 277 -88 -68 74 -261 -295 297 -168 -169 16 22 20 -107 68
5251F8K2k77L77l30p5J73K28j65K29k61m6L17K27n14j5kN2o9O8r7j87K76l8j81
5275b20M9J75l20L40K48j10m40M14r1l54L99Q8k87j01L75j71j30J90J25n43N13
5296A49k3l18j53N72M1m82N75k36k95pO71n59j49M83l97m34O14J67n24K55M48
5317C98n18k7K19P4m03N13K60m83l15N86l77r5J75J29j07K65l82j85L68K38m12
5338g9L3J25l00K00R6L4n25L80J22l34J05M11j35l00L2K01k69M26O1k86J97R6
5360B91l85K25j12J19k30J79m3k17M74r9j87k81K95k5j05J36k1k38pM20l34N7
5382h8K51r7J44r7l4l11K30N1pP6K82n34K7K93J02m84L40O2n10M5M95j24j86J50
5406G6K88n97K67M72n86k61P34j88n53L97J06k31RM65n62m9M62o4l35M02J04m43
$$ plain form
5251 68 90 -187 190 -140 -215 -42 186 21 250 -11 -57 260 487 -27 -42 -44 8 -61 7 -90 -277 -1 -39 -220
5275 -220 -171 4 -316 24 272 162 -278 136 45 -309 90 178 -109 -210 165 -6 -136 54 179 -364 149
5296 149 126 -192 -345 227 268 -214 361 125 -170 -177 494 -65 -214 269 -128 -562 52 219 -305 -50 398
5317 398 -120 -147 72 146 -257 256 516 33 -282 304 -73 -168 7 136 29 294 -88 -273 95 333 -79
5338 -79 -46 79 -221 -21 75 109 -416 -36 86 -248 -143 268 133 -167 -135 66 -203 223 284 -2 195 291
5360 291 -94 131 19 138 -92 87 44 -173 301 202 15 -266 29 4 -101 35 14 -224 -231 189 -145 -88
5382 -88 163 66 210 113 79 -232 -2 49 42 118 400 -134 -107 186 288 -196 144 206 -304 -259 236 112 -74 76
5406 76 364 -233 34 506 -80 -341 393 205 -348 49 155 -76 -67 398 -164 -213 249 185 -150 252 356 -87
5428h7K54Jj11l26N02k38k44L30O2k66k3J82PJ9oj20j86L21j75J25k6O3j2O1K16
5453C23k61Q0j22J37l61M62J36p15L95P3M6l70J22l1m43P36k40k14j2J65k48J45
5475a97M49l98j58L49J25m96L57K58l83k04N56n1l85M01j81k47R8L45l17M2L5
5496bk2l31M54Q4m22N7K75j08j58M37l36j32J47L24n50J81K29k18P6Q9o5l73L82
5519A8J93m13m3M89j04m8M6k34j35M08P2l89O8J11j89l4J34K2l25M42j07k79P7
5542b20nJ48J29L6k89L99Lj45q3J71J61k18j48K97l82n0J95j24r4K43n9j23r5
5565b53L99j15j80J81l35k0K74K16n33J16L35r6m10O28l34J81j0J06m68L15O30
5586F27p53lN66l16l40J86L00n36K74K17l68n8K73k0k15K85m7k04n9M78k53M8
$$ plain form
5428 -87 167 168 57 -269 233 -5 -249 81 143 -123 -146 36 43 62 56 -64 -250 71 -104 21 -5 58 46 107 323
5453 323 62 142 20 157 -204 258 394 -321 74 147 193 -177 -55 -86 -529 207 -33 -247 -259 -94 -342 -197
5475 -197 252 -146 -304 45 170 -326 31 289 -94 -298 258 207 -178 223 42 -205 -107 238 -79 -37 -2
5496 -2 -24 -355 99 183 -239 -182 93 -15 -173 264 -72 -204 -57 267 -283 -102 127 -91 -15 74 9 -364 18
5519 18 211 -202 -245 244 140 92 138 -96 -231 177 249 -140 -72 39 -150 -184 -50 -28 -353 89 -18 -297 -220
5542 -220 -225 -77 52 88 -201 198 201 56 -27 144 305 87 -61 236 -146 -196 -1 -125 -219 24 -35 -158 -253
5565 -253 146 31 -149 32 -303 -323 -49 167 -366 -250 85 -11 -421 207 -127 54 44 150 -318 -3 627
5586 627 -126 -129 437 121 -219 -33 267 -269 5 222 -146 -204 69 49 -166 119 72 -132 -191 287 34 82
5608H2J39p2k87J43K87o00K46L28m15j11N36j60l23J86Q9k74J42R4Q7ql2J61l35
5631i7J67n4j50K9L30l50O7l0J81j61k8J14P3j69L43m89L42m7J99n78N69j96r3
5654b8M16m97j20R2K14L3l24N29l82k19J39K55j02p2R3k24Q3J54J64k88K27J25
5676B68m14K62l4M5m03M45R7m54L40J45l61l1M93n90J9L73L6m49J73R9r0m6K42
5699A65k84k8K08L51o29J66K58j97j72M26k83K0J40J20j52j13L78l28K50j49Q3
5720B30k22l7m4k15J05K10n04O36n0k87K6K39k35P7J57l16K9K93J14l44R0M49
5742D01l47j48K45k25k4l4N48n10ML76l17j94L25j09k91L13K77m45r4N19m92p2
5764b94M74j24m24N63k25m7o1K19k76J56Q3L25o66M26K77m52j31N8K53j3n1J37
$$ plain form
5608 82 221 149 -138 5 292 -308 -62 266 -149 -260 276 116 -207 -21 68 -206 -64 30 117 109 77 238 -97
5631 -97 70 16 -134 -105 225 -125 -58 -88 93 -68 -96 18 91 -78 265 -224 118 71 270 -308 261 65 -28
5654 -28 388 -109 -229 -137 77 110 -214 315 -67 -286 -147 108 6 -66 27 -197 -114 40 204 -84 143 268
5676 268 -146 116 82 127 -276 169 266 -188 152 297 -64 -95 398 -192 -173 200 236 -213 -40 59 -31 -77 165
5699 165 -119 -147 61 412 -217 -51 207 10 -162 264 -19 1 141 261 109 -4 374 46 296 147 230
5720 230 8 -29 -73 -288 -183 27 -477 159 109 -178 -152 87 -148 -71 86 -230 -201 92 206 -138 -48 401
5742 401 54 -94 151 -74 -98 -132 416 -94 -90 286 -31 -225 100 -9 -300 13 290 -155 -249 270 -222 -294
5764 -294 180 56 -368 195 -30 -77 -138 81 -195 -39 44 369 -297 129 406 -46 -177 -119 134 121 70 207
5786B07m55J67K7J06l1m9l2J2r7P0q2J82R1j75o2L80j82k30K63J59k88P0J21k70
5810i8J35%J82l41K33j5k33K27l36LJ36J4j45P6M24m50JK98k23j24J42o3j0K77
5834A10M8k88O2K07k28j52M12r0l4j49M52l21k41M81k95p0J43L8q5j17K22kk04
5857a01L07j24k14l9J34N3j60L27k47j47M19K71n54j03M85k24j65J92N5m40J89
5878h6N49l85k04L28k39j01L31o5k71O5K6n7k7P2j15j69L43j30p1J33K78o8j6
5901A21J61j55j6j65J33j75kJ48j6j3J53l23R5O4j72J39J46j92k12M74l60K66
5923I9j28j05J77n2J62k92p7J95j84m8N14p9k65O2M26j77m29M83R4m62J69k7k44
5946a88M01r4K10m03J39n2k47J75M65m84j54L58k71k6N3L3l9j3K76m8k13M52l44
$$ plain form
5786 207 -248 -81 -54 52 21 -28 -60 -48 -145 -75 -157 25 116 -59 -121 259 77 -153 110 269 -19 51 172 -98
5810 -98 37 37 219 -122 111 96 -137 90 -246 -243 -107 -93 -238 -162 262 -188 -187 111 -112 -236 -94 -157 -167 110
5834 110 158 -130 -68 139 -89 -241 171 81 47 -102 350 29 -212 269 -26 -96 47 85 0 -117 105 103 -101
5857 -101 206 82 -132 -171 -37 16 -144 183 -64 -211 208 479 -75 -178 307 83 -82 110 165 -275 -86
5878 -86 463 78 -126 202 -37 -138 193 128 -143 -78 -52 -109 -136 -64 -179 -348 -5 -135 -206 -73 205 137 121
5901 121 282 127 111 -54 79 -96 -98 50 34 21 174 -149 -54 10 -162 -23 123 -69 -281 193 -167 99
5923 99 -29 -134 43 -9 153 -139 -216 -21 -205 -253 261 182 -83 -21 405 228 -201 282 376 -86 83 56 -188
5946 -188 213 119 329 -74 65 13 -234 -59 406 -78 -232 126 -145 -171 -118 -85 -124 -137 139 91 -122 330 -14
5969a4o9K16j23l9M8J5k8K6N1L6j34k74K42K7j04o4K24n0L3k50RL66j49k16L13
5994I2k03m5P5PK3K6K93m06J24J63J69l89Q4lOJ9N3j34J04l6k28J27K29l25j99
6019c74J47M60l44j77N25l26O3l50O31l76J66P9j67j14L84j25k26L8M03n31K9
6040a85M23l02Q5P7J75n01L61J07l18J1J48N7k15L38m04k8J44K41m51Q8K73m5
6062G9k75J67J12m07J20N77n50LK69K0k12L64j78k72L80r1m71J34L75j55j76K88
6084A01l9k71J27j42Q0OK18j00n1J44K07j23m8j44J79L3m4J17k17J84k30j28K62
6107A21J9j20m7J38l16M99O1l91k29J28K18k09j4M05l58M2N0j56J8M28l4m86K34
6130AR8qj06LJ30j09NO6l35N0K36j74o2K33q5k1J95o5k73j3K75j32r2K88n8K4
$$ plain form
5969 -14 -83 133 10 -29 19 34 6 32 83 119 -15 -289 -47 -20 -124 -188 36 -14 19 -231 -222 144 -5 -221 92
5994 92 -111 -156 -81 -74 -51 -25 268 -138 -14 149 318 -71 13 10 16 35 88 -46 58 22 -206 -79 150 -175 -374
6019 -374 -227 233 -111 -288 237 -89 -26 -376 255 -121 45 124 -43 -157 227 102 -124 -86 317 -214 -185
6040 -185 238 -64 21 98 273 -228 133 240 -78 -67 81 138 -77 261 -143 -171 -27 214 -237 -149 124 79
6062 79 -196 -29 83 -324 -204 373 -177 -174 95 115 -97 267 89 -183 197 106 -365 -231 144 -11 -187 101
6084 101 62 -209 -82 -224 -144 -138 80 -20 -71 73 280 157 109 -35 144 177 133 250 33 217 -13 -141 121
6107 121 140 20 -27 111 -205 294 355 -36 -265 -137 81 -128 -142 263 -95 -53 -3 -159 -141 287 253 -233 1
6130 1 99 91 -15 -12 118 9 14 80 -255 -205 31 -143 -205 28 -57 -78 117 52 -221 -234 41 -91 -183 105 47 71
6156G1p7m0r1JK88l00J9O9J60l40K20J12k23o4J70l7J39j52L72n62J18K31j40
6179e6P3j39j48L16P7n5k09K46l93L35J20k27M7k31L78qj36j30K03J82p6j8l15
6202a64K9L50k72j7N5J6P4j44J84j62NR7j33J4J38j50j66L19n0k5j36K04k2j95
6226a51L54k84k29L34K17k06j20L95m70j64L69J55m95J82K76m62K83J25k28M3
6246g6K8M7l08N41L4n47J27J87R6l05L48j7j99Q8J04j66J30l03L10n9Q6j55k57
6269b66M93n3l96L2M2J15m8L22m50j73K59m2n9J44l07L36j15J49n1J05K37j57
6291A17o1K56j95j58O0m1L0p5K19r7l60M27k9k59L31N2l72K01J20l09Q7J96k04
6314f4j81K40K61m90K7L93p9J03k38L34o68O17M1l17k27K91m4m39L34K36m46p0
$$ plain form
6156 71 -6 -46 -137 -136 152 -148 -129 -60 100 -240 -20 92 -131 -195 -25 -62 77 -75 297 -265 -147 84 -56
6179 -56 17 -122 -270 46 123 68 -141 105 -288 47 167 -60 -13 -244 134 126 -10 -140 63 245 169 151 -164
6202 -164 -135 215 -57 -74 -19 -3 71 -73 111 -51 -46 51 -82 -68 70 -80 -246 73 23 -2 -138 66 44 -151
6226 -151 203 -81 -310 24 241 35 -85 310 -160 -324 45 200 -295 -113 163 -299 -16 109 -119 -76
6246 -76 -48 -1 -309 232 266 -281 -154 33 129 -176 172 155 -44 44 148 -18 112 -191 119 60 146 -9 -266
6269 -266 227 174 -222 -190 -148 -33 -81 241 -209 -382 -123 -165 -224 -80 -387 -51 -166 -17 -68 37 274 117
6291 117 56 312 117 -41 19 -22 8 -67 152 55 -305 122 93 -166 165 217 -155 46 166 -143 -56 140 -64
6314 -64 -245 -5 256 -234 -207 186 107 210 -28 306 -362 255 296 -21 -248 43 -1 -440 -106 130 -316 -386
6336c86L27J12k89M17k94j42M73l48O1j8J77m63R6L95r0j7K69o5j27N9o5q3J82
6359A81k00q2n9J76Rj08J75Q3k50P3j5K3j57Q3n0l3J57k52L20m9J8j18j33J82
6383b6J6kJ64L0l52J98j0m5p5J60j15j49M1J56j42K47J37k82Q1j14J72j62p9P1
6407h0n4KL14m24R8L45j84p5J32J46k01j0L26m05J38mQ1j59J02l2m8J28J84l96
6431g6q6M93l30j95L11J07l91J37o4jN8m0K91o04M46k6m9k8K70k56J46M00n38
6454b5k08K91K3l6O7j78J38p3L48n22O7J73k13N5J01j11L89m74K44M0L2p8Q8k71
6478a33J21K25k50J51L4j20j4J76p4l57M48P9k41j02L55n16J73J16n2j15M2K02
6500A48l12K35l6o2l56K96K33j59P0p8l05M18Q3n30K10J12O2j27J57J53k79L16
$$ plain form
6336 -386 -59 53 -236 181 -113 -255 218 -130 -69 -87 90 -373 -277 118 28 11 280 215 88 147 82 -1 181
6359 181 -19 -101 -160 16 25 -83 92 175 -75 -2 -17 6 -151 -68 -118 -151 6 -246 74 25 43 -75 -208 -26
6383 -26 -10 -12 152 182 -170 28 18 -27 -102 58 -57 -206 -165 -9 -151 96 233 -49 32 -82 90 -72 -151 -80
6407 -80 -134 -132 182 -242 -144 201 17 -58 74 220 19 9 335 -70 68 64 145 -14 88 56 8 136 320 -76
6431 -76 -162 331 1 -194 117 224 -167 -30 -94 -95 -37 -77 214 -390 56 30 -19 -47 223 -33 113 513 -25
6454 -25 -233 58 81 45 112 -66 72 -1 347 -175 -108 65 -148 -93 8 -103 286 -188 56 96 128 50 138 -133
6478 -133 -12 213 -37 114 148 28 14 190 116 -241 207 286 45 -57 298 -218 -45 71 19 -96 -54 148
6500 148 -164 71 35 -27 -383 -87 146 -13 57 -21 -326 92 175 -355 -145 -33 29 -98 59 212 -67 249
6522B49j31nk81M83k19l62r1O35j87j99J65k05j58M01k79j34K32J85j28o8N6j67
6544b08Q7J51n1o9K05K5k83K47k9J9l5Q5j24r7J29m6j69J33J20J11l78j21P5m1
6568b64J89K50k09r5J86j13j84L01L2j32J91k68j05K27K22r3r2P1n3j77J5K42
6590A41j35Rj37j1l6L40o8j21K02k26PK83o8l93J14J61m5k3j8N5l04J67K86l35
6614a55L68l99K8R9J27P4l60L52lj42K27q9m1k16K24j59j97L25Q1m38J26J12J6
6637d0r6J99j26J50J01k70J01nK25l66J33K68n1j91P1m0j98N1Q8j35J13J37Q8
6660B07k02K43P8l89J15q1R8j11R0k47m8K34j41k9L65J92l42l06M45j76K45j45
6682I5L9j68o2L87k42k05M37m55M6N12k45j28kO9n25K42L65j02j68J27J67j01
$$ plain form
6522 249 118 113 -168 315 96 -266 -357 278 91 -108 57 -148 -306 95 -184 -318 -86 99 -29 -97 -41 -208
6544 -208 -121 30 -21 -90 115 140 -143 104 75 94 59 144 20 -77 52 6 -163 -30 90 201 -177 -298 -223 -264
6568 -264 -75 175 -34 -129 57 -56 -240 61 93 -39 152 -116 -221 6 228 135 43 114 61 -116 -101 141
6590 141 6 15 -122 -133 -169 171 103 -18 184 -42 -35 248 180 -213 -99 62 17 -6 -24 31 -273 -106 180 -155
6614 -155 213 -186 -158 -59 68 142 -218 134 131 -11 216 127 86 -130 94 -65 -262 63 144 -294 -168 -56 -40
6637 -40 -136 63 -63 87 188 -82 19 14 239 -127 6 274 223 32 103 63 -135 -84 4 -131 -18 119 207
6660 207 5 248 326 -63 52 -29 69 -42 48 -199 -247 -13 -154 -183 182 374 32 -274 171 -5 240 95
6682 95 134 -34 -96 291 49 -156 281 -174 -128 384 139 11 9 78 -447 -205 160 58 -110 17 184 83
6704H3o3j10q7PJ15K26m52L63J50l31M4K84n56K62JM7PK11k10j07J76j81K15k65
6728a71N25l33k47L26r1j66Q9K21m82K05K06l66M16L7j78oJ34j39K5q0K40k08
6750d3J23J94l11j08K7L3p2K34j0j29l21N52k38J72K87n61K77j97J32P7rK71n47
6773a67n7J96R1j60J88j9j38J30K16l52m3K24J09l67o9L09k82O4K27j75p3K17
6795F9K57l70p0L27l69R8p2K07j9l25K89K6o1J27On3J54O0r3Q5l25j27k1M38l35
6820i7J30l2k57J15l8L14l70L74j77qj04J96l35L62K61n54K07M8J49k72J59k2
6842D9n6o5o8P9J37J13j61r2K54j11j5n1Q3r6J33k27k58O0N04o0l05k1L39j82
6866a7JO9j25j6K21k4k72jK22j1j24J95j45J26o5K78k92r8K25l85Q4L33k17M93
$$ plain form
6704 83 20 -90 -177 -170 -55 171 -281 82 232 -99 -55 229 -327 -65 -64 -17 -10 201 -9 -116 60 -121 94 -171
6728 -171 354 21 -226 100 9 -157 -68 153 -329 -124 82 -284 132 169 -9 -15 119 -20 5 -75 165 -43
6750 -43 80 274 -37 -145 -118 -85 -157 77 67 -62 -383 169 -69 103 390 -171 106 -91 41 118 109 380 -167
6773 -167 -224 -28 63 -97 91 72 -66 64 280 -72 -115 109 218 -149 -218 91 -191 -127 100 -75 -148 69
6795 69 326 -44 -114 213 -156 -58 -130 77 58 -267 22 48 -13 114 120 67 221 281 188 273 -52 -179 -200 238 -97
6820 -97 33 1 -256 -141 -179 135 -235 139 -38 -46 -150 46 -289 73 334 -220 -13 35 184 -88 71 49
6842 49 -7 -72 -140 -61 76 189 28 -64 190 79 64 13 96 0 133 -94 -352 -292 212 152 -153 -174 165 -17
6866 -17 -16 53 -72 -88 133 109 -163 -164 58 47 -77 118 -27 99 34 312 20 -78 147 -238 -154 179 -38 455
6890D55o95J59J39j53L45Om66J65K54p9k5K6j40j2L48j95j80j89K93j05P7q8J56
6913I6Q4j31J58k33p3K87o7k44K74j84l1K0j60pL99k37k3L72l21j11J85O4O5j48
6937C4%j16J50q9K33l44N0J63j39R2k7l7n1N0M6r4o8L19l60N9J9N5k7N7p3P7J85
6964A64p0j03M5J05j59j75L84J13j07k61L51m14K93k19K08k35J73j46p4J26R6
6985I5m40N78k73J5O0mJ4j15L8P8k18m5L50j13J10K2O2j93K8K24k28m30L67P4
7009E6j46J6K68m58J57L25k17J06p0N8k5L6l22J02K04R6k63J10J66k99R4J33j00
7032B7M1p3k0j27J67M6k17L3K30j08l9Q4k42K54OR6j84N8K37l46kJ7Q4k56M58
7057B24k72k28J77J66J29l31K60k11k5k8QK30k32K75j80K29nj2k42J53P9l93K89
$$ plain form
6890 455 -240 -81 58 -95 250 256 -210 -45 209 130 105 131 -9 -21 327 132 -48 -237 56 -49 28 -60 96
6913 96 180 49 207 -26 -99 188 121 -123 151 -33 -64 -44 -204 -211 188 -49 -72 300 -21 -132 53 117 182 34
6937 34 34 -82 68 -21 212 -132 -82 81 -58 34 7 -30 -81 -31 15 -79 -147 172 -188 -129 -110 -55 -82 -25 -98 -21 164
6964 164 94 -9 36 141 -18 -193 191 304 197 -64 287 -127 166 -53 155 -80 93 -53 -127 -1 95
6985 95 -345 233 -40 -25 35 31 45 -70 -32 46 -172 -217 133 20 130 152 214 21 49 273 45 -385 -18 56
7009 56 -90 -74 194 -264 -107 218 1 107 37 95 70 106 -216 -114 90 186 -77 33 199 -100 -6 127 27
7032 27 68 -5 -25 -152 15 61 -156 -123 107 -1 -40 44 -198 56 62 158 -26 32 269 -77 -79 -62 22 -234 224
7057 224 -48 -276 -99 67 196 -135 125 -86 -111 -139 -131 99 -133 142 -38 191 186 174 -68 85 164 -229 60
7080F0j64J13J54j11k40N5J07J42p3l24K41R1l4j8l3J64m23K94q1j19K83Ql7j65
7104a10k0j56K07J3J38L6J64k41k5K37l29j04J25N1j15l4K29k4k9j53J0m0L3L36
7128A99k25R9q5k03M14l86L18q0N4p0j04J23J65l01J40j20O7j68M18k50j00N0
7150d5J59k44J27J30J38m02k2K5J0K15j49J35j94O9L48j97k13M38m32lK28k62
7172a41J72J31R9l38K21m4l01O5O5R8k20l4M84m28k0L73l12K47m26L91j18P6k5
7195A5j39J59o1L2O0k4j35K00l0j7Q1j4j62j04n7r5K43J7j04j3m6J34K0j78L15
7220I7k61j38k0L61j3l4K70k14q8J70P4j41l1J20j54j23L4m5K44mR9l99J46K16
7244A66j80k10J47P0j26l7K6K31j41n7P9j36K34k19J51J17j72Rj39m6M82m02K91
$$ plain form
7080 60 -104 9 163 52 -188 -133 -26 116 43 -281 -40 51 17 -1 -34 130 -293 1 -80 -199 84 92 55 -110
7104 -110 -130 -286 -79 -66 72 108 272 31 6 243 -86 -190 -65 -14 -129 -163 66 42 13 -140 -130 -170 -137 199
7128 199 -26 73 -12 -215 199 -187 131 51 105 35 -69 54 219 -82 58 -62 5 -163 255 5 -95 -45
7150 -45 114 -130 -3 127 265 -137 -159 -134 -124 91 -58 77 -117 -48 300 103 -110 328 -104 -107 121 -141
7172 -141 31 162 261 -77 144 100 -201 -136 -71 27 -193 -227 257 -171 -191 182 -130 117 -309 82 -36 40 15
7195 15 -124 35 -26 6 66 42 -93 107 77 60 141 127 -35 -139 -196 -291 -48 -31 -135 -148 -194 -60 -40 -218 97
7220 97 -164 -302 -322 39 26 -8 262 48 -40 130 204 63 32 152 -2 -125 -91 -136 108 104 203 -196 -50 166
7244 166 -14 -224 -77 -7 -133 -170 -144 87 -54 -111 -32 -168 66 -153 -2 115 -57 -48 -187 -233 249 -153 138
7267A38k12j31q3L85L1j90J02j89K9m4J18O8J73k18J7j04K32k38K14M2j7J30l25
7290g2K72l63K36J5O2k77K19q4k10Q4K17k29L26l6j51j7K4j13J67K87l81j73L95
7313A98l08O4r5M12n26P9K32j36m1M9J99j09J96Pl81L3J70R9k23J59J19n68Q0
7336b91M62j20L9K92m95j4R1R6J32j91mj51L47j62J6J13j03r1p3L8J24MJ31k23
7360c3lP5J66k50P4m6K6J88l09K54j59j86L40p2j49m0K93o45o6J023j82n27j29
7383c57M48Q8m46M85p49M41L90J0k90o6J88Qr5o4k30L90k42J69J35l37K54J14
7405B44k19J69j94p6l1P3k0K81m17J94P1n1%nJ88j32q6r1M25m74J00P9J74j15
7429H7Lm8n7J45j09pq2J05K2O5k83k9O5K9k5j82L00o8K24m06K75j8j0J72l3j58
$$ plain form
7267 138 -74 -205 -288 97 128 -62 40 -149 -120 -164 -46 22 195 -23 -6 -110 122 -116 98 140 123 253 -72
7290 -72 200 -163 73 88 150 -127 92 8 -202 -118 99 -130 196 160 9 -8 16 -97 70 357 -24 -197 198
7313 198 -110 -46 -141 271 -255 -176 56 -80 -121 -72 127 18 214 221 -160 -127 43 142 -81 78 197 -371 -291
7336 -291 171 51 90 382 -113 -127 -36 60 192 1 -3 -154 193 31 47 160 57 -34 -107 -69 55 59 190 -33
7360 -33 -36 39 205 -45 29 -17 9 197 -112 142 -17 -203 137 65 -84 -124 169 -476 -542 481 299 -228 -357
7383 -357 91 179 -267 218 -531 -90 300 310 20 -46 142 150 55 -9 -239 151 -91 78 213 -124 130 244
7405 244 25 194 0 -76 -107 -34 -54 227 -190 4 75 24 24 19 207 75 -11 -102 323 -151 -51 28 202 87
7429 87 90 42 -15 130 21 14 -68 37 59 124 -159 -188 -123 -94 -119 -301 -1 -69 155 -251 24 6 -4 168 135 -23
7455b3L8J37r8r6J17k44L54l99J67Q1J1j29j4J55k43L4L53l01J60k03j86L08j90
7478b11J66l5jJ06p7K37l6L7k64P5l05L94k94K29N9k15K80n7j43j53J53J19k40
7501a76Q7O7k74L72j42J13q3K3p4N4QK06p4j37n8K95m91M45j07j41J18J1k14L2
7525a40R4R6K5j34R8n1K3J69j02k3J47j34j66j0J40O7k0J81m65J07o3J9j5J4J68
7550B5J14j57M5L2m1R5j9k83j7M39l28K16n1j59j00K10J4J00k20j0J64j34R3J66
7574A94j48j0r4l0K33j19J04j15j40J42J63k04k06J08J80j9O0j50K27j90L7pO7
7597H3J1q5M0p4K3k70L34o7P0J53k22r5p5P9J90l0O1o6N7K9j4k51o1L79m68M08
7623A39m11K57j29M66k16r9J63n7r9J06l01K68n0k11L2J00k19J28j8L12k09J1
$$ plain form
7455 -23 15 152 54 -42 75 -169 185 -214 -47 34 45 -84 -98 57 -186 -152 201 -100 60 -143 -329 -21 -211
7478 -211 -45 -80 -81 25 -52 185 149 186 -78 -3 -308 86 -208 21 80 -135 145 88 -55 -208 -55 64 -176
7501 -176 -89 -22 -296 76 -66 47 -36 -13 -87 -33 -25 181 107 -30 -88 207 -284 161 54 -87 31 42 -172 -140
7525 -140 -46 50 75 -59 39 -12 11 180 78 55 202 68 -98 -108 32 99 79 260 -205 -98 -161 -142 -157 -143 25
7550 25 139 -18 27 59 18 113 94 -189 -206 233 -95 121 70 -89 -189 21 35 135 -85 -95 69 -65 28 194
7574 194 46 36 -58 -88 145 26 130 15 -125 17 180 -24 -230 -122 58 39 99 -51 176 -14 23 16 83
7597 83 94 9 49 -25 -2 -272 62 -5 65 218 -4 -99 -174 -95 95 65 126 60 117 146 132 -119 -180 199 -269 139
7623 139 -272 -15 -144 322 106 7 170 113 14 120 -181 87 37 -174 -142 -42 -261 -133 -151 161 -48 -37
7645c7P2N9L8r5J43p0k8n1Lq7J86l07L04M0l34K52m72K53K10J08k35q7K93j71
7669a3J46j59p3K36l45k2J70K29j00q7J65k59J35K03l62K60j36o3q4P9J44j74
7691a10K10q5MJ68k73j12J26J66l6k15K22q9J12j42J41j14P4N2k89l8K32k63K55
7714dm1j85J80J81p7J20k52J89q6j44P9P0k15J58k1N6j57q7J57nL2P2JJ1j43l6
7740a47J05L21J09m81k4K27j66r8L21l40L62j78j6K3j23O0L2J54j82J10j22j81
7762b34Q3J49J88M1m01J64P3J3rQ8k64L6K04k22l8L98j29k42J16J27L2k14kJ04
7786F1j39j0J67k08M8q5M64l13J45k48J39o7o6K20M5M5j12k1l9J64k35J84j20
7809A9j67p3R2M4n7J34K4J07k14J21k06Q2P8O4M6j8j10O7k0k11L10k1j21Q3k93
$$ plain form
7645 -37 35 94 132 37 180 110 82 31 34 -53 133 -174 130 170 -164 88 -384 -131 79 187 -48 -135 158 -13
7669 -13 133 -26 -99 137 -208 -230 -60 169 69 -18 147 -112 23 226 -136 124 -12 -75 -159 -80 64 -110
7691 -110 100 15 19 187 -86 -198 -72 94 58 -157 65 -24 88 -54 87 -27 47 99 -190 -228 4 -259 -4
7714 -4 -45 -230 -50 131 54 174 -78 111 25 -119 -40 30 -185 -27 -48 8 -149 -236 -79 -84 -52 20 21 32 -111 -147
7740 -147 -42 279 388 -93 -117 110 -56 -154 167 -173 189 11 -5 18 -105 -45 -13 141 -41 69 -53 -234
7762 -234 -151 -2 186 227 -174 -10 63 76 67 155 -109 -73 131 -91 -129 269 140 -102 14 141 173 -41 -43 61
7786 61 -78 -88 79 -129 -81 -166 298 -15 130 -118 21 -46 -112 108 153 198 86 65 26 190 -45 139 19
7809 19 -148 -221 -129 -85 -142 -8 16 123 -91 30 -176 -94 -16 48 94 76 -34 33 13 -198 112 91 -30 53 -240
7834b40M9R4J0K7J09J35j00Q2l08R1J43O3l32J73j48K15m49M52k03k33M07L3R0
7857A60j22NPO4j04j26K8J48j9k79J51Q3n0j81L14q4K76k07k90jL51j64p9P1k0
7882f8K05O8j64j3k15L01J63o9k56N1K52l59J71Q6j03q4J63j83j89K14J54j34
7904iL5L31l37R5l7J42l59J42J56j15J7O0jj17o4N3J0j05M8n9o5L36j40J5r9j7
7930h4K01k83q3L02o8k8p0J4J04R1K20l65O6O5P2j16r1R7j14Q0m6K12k13O9o0
7955b8J22r4j5J19%L5J63m59N3M40l52K67k23nk48J46J11n8jN8J0o7K12j20q7
7980b1J34l29K59j07k0N6J13l9Q0l7J46k3l91L17qj17k56J39J10k08M7M6O3N8
8004A2MK37l71J52R4p4j02J04j81O3Q8j10L37l75O2o1OK63k63K83q8j50k30K03
$$ plain form
7834 -240 -191 -97 -87 -60 49 184 84 166 -142 -51 92 155 -177 -4 -152 63 -386 66 -137 -370 37 70 160
7857 160 38 43 50 114 10 -116 -88 60 41 -238 -87 -4 -54 -235 79 -5 271 64 -226 -227 124 -40 -119 -48 -68
7882 -68 137 205 41 28 -187 114 277 208 -48 3 255 -104 67 153 50 -34 129 -54 -243 -29 125 -9
7904 -9 26 357 20 115 78 220 -139 3 159 44 61 121 120 3 -61 -8 2 -103 -55 -114 -179 157 17 32 -67 -84
7930 -84 117 -166 -249 53 -15 -43 -113 -99 5 96 316 -49 17 82 154 38 -53 44 -70 10 -36 176 -37 32 -28
7955 -28 94 0 -15 104 104 139 302 -157 -104 336 -16 251 28 23 -225 -79 32 -26 -27 31 41 -26 186 66 -21
7980 -21 113 -216 43 -64 -84 -28 85 46 126 89 235 212 -179 138 130 13 -243 -104 6 -202 -155 -109 -46 12
8004 12 16 253 -118 34 128 54 -48 56 -125 -62 26 -84 253 -122 -60 -121 -115 148 -115 168 80 -70 -300 -97
8028i7r6K59j44p1M45l83K68k12k1K12l9J21j49q6J02j18j7k1m6J75l7p0j0k3
8052e8n4J25n7M9L8K81o05K74o7Q7K0l8P5j03P3mj89L59k08R6r0P7o1N4po6M0
8079D1Q2j74l3m4J32J13p4L6L4j63J94l20J52J30k39L56j95l36K04K32j50J37
8101A15K5j8J35m33j29K82l21L25k73M32j97J17J63k53l3j74K93N3j07o1K92M2
8123B75l20o2K8OM8J49j93J11J82l35K44n3K9m50L90O3q1P6k7Q1k99J73j38K42
8147A39o2J5k16K16k17R1P7j17J25ok76L01j6q1l2j20K55J01l23K00R0j19q0K20
8171A65l2m56r8K90K60l02K79j35j83J55J13qk14q2P9L51m24P7K62o
$$ plain form
8028 -97 -193 66 -78 -149 296 -87 181 -31 -52 160 121 242 93 7 109 -9 -26 -47 -93 82 45 -25 -35 -58
8052 -58 -112 13 -44 5 43 324 -281 -7 -74 13 33 -5 70 -33 40 36 -153 206 -2 94 4 81 20 74 67 1 41
8079 41 123 -51 -84 -128 4 117 43 79 113 -50 144 -176 -24 106 -133 223 28 -308 -104 128 -22 115
8101 115 140 122 257 -176 -305 -23 -344 -19 -292 140 -57 60 223 -30 -63 -237 56 109 2 -59 233 275
8123 275 -45 -107 -79 -73 -25 124 -69 42 224 -111 133 80 109 -341 49 112 31 107 80 161 -138 35 -103 139
8147 139 77 92 -124 92 -125 -34 43 -74 51 45 -231 70 54 -27 -59 -179 76 177 -146 54 144 25 -55 165
8171 165 133 -323 -421 -131 129 -173 106 -29 -212 -57 56 48 -166 -248 -169 182 -242 -165 97 91
8191I1
$$ Imaginary data points
##PAGE= N=2
##DATA TABLE= (X++(I..I)), XYDATA
0@%%%%%%%%%%%qJ6j6J6j6K4l2M0m8N6p1Q0q9J06j29J51j73J98k26K59k97L37l80
34b02M28m83N46o10O81p61Q47r41J041j151J274j408J556j714J886k079K292k524
52a322K780l068L390l754M169m643N198n854O638p603Q820j0411J2586j5744K0759
67A1941k9928N1831j96238j45184N08727p8802k75026K05910J08360k81373Q1965
78c7817K24526j79818j48494J95937J3400j49120O4067Q1581j10540m581J08142
89E7283l7375p8260O8751J5647q9837L6686Q6601r0981m8633J26396q49j20790
101g5361P6061R7742j13384m1687J13867l0126p6744P6554P216j03371M0503Q8152
113E9422n1579m3865M0740J2967m156J0835j9553j3576J6559m037j0144M523r075
$$ plain form
0 0 0 0 0 0 0 0 0 0 0 0 0 -8 8 -8 8 -8 16 -16 24 -24 32 -39 41 -48 58 -71 80 -93 105 -121 138 -159 178 -202
34 -202 226 -257 289 -321 360 -401 446 -495 546 -605 669 -739 817 -897 989 -1090 1202 -1322
52 -1322 1458 -1610 1780 -1974 2195 -2448 2750 -3104 3534 -4069 4751 -5660 6926 -8818 11941
67 11941 -17987 33844 -162394 -307578 201149 122347 -152679 53231 161591 -119782 -37817
78 -37817 186709 6891 -141603 54334 67734 -81386 -17319 64262 -46278 -50859 57283
89 57283 19908 -58352 10399 26046 -63791 -27105 59496 -31485 -80118 46278 45429 -75361
101 -75361 700 98442 -14942 -56629 57238 27112 -49632 26922 34138 -69233 -28730 59422
113 59422 7843 -36022 4718 17685 13529 24364 4811 -8765 7794 3757 -6387 -1864 -10939
126a0939k91Q437j5309R911L0695k2862j7932L0896n484j2869L4381j9638n3747
139d4751M7995M7311o1910j6585O1169k0909m1616N4054K1840o7374r278N6021
151B5967j0010m6535J9080K0562m5859o68O9761j6017p2723M4537O5824n7219
163c300k8129O3836j7538m9052N2568Q706o9371L2564M9386o3948j1731O7245
175C1236k4685l7174N0933p227n2157M8018L2307p0338k150O3021k4708l8047
187c0971M1927J0175m5705J2511M2001k1490l0753K3297J4313k4209O45K0276
199A2017j5910j6275K5899J1416k3774O90J5457q134J588Q903j7787P2K3519j5427
213B254j9757K4021O879k3703P598J4028j4714J678J4169j4071q257J1400l90
$$ plain form
126 -10939 -11230 -2793 -18102 -8191 22504 -358 -18290 12606 7122 -5747 28634 8996 -44751
139 -44751 3244 50555 -11355 -27940 33229 12320 -29296 24758 46598 -20776 -30054 25967
151 25967 15957 -30578 -11498 9064 -36795 -37463 32298 16281 -56442 -11905 53919 -3300
163 -3300 -31429 32407 14869 -34183 18385 27091 -42280 -9716 39670 -24278 -36009 31236
175 31236 6551 -30623 20310 13083 -39074 8944 41251 -29087 -31237 31784 7076 -30971
187 -30971 10956 21131 -24574 -12063 29938 8448 -22305 992 15305 -8904 -8259 12017
199 12017 -3893 -20168 5731 17147 -6627 -5937 9520 1386 2974 11877 -5910 -5838 17681 2254
213 2254 -17503 6518 13397 -10306 -2708 11320 -3394 -1716 12453 -1618 -9875 1525 1135
226A135j100j228j2648R720J7890k0912r029L0508n738k6544K5168J5934l4727
239a1571R74L0717j9046j8072K5565K7k3418J3269J3554j9842k238J9063p531
252A451j3480J3911L672j5760P201J2152j8876n848K6502l715k8526J6347K1021
265A6052k6550m214L0874j5879k1624L3338N813l6753J4616K7751l0182r224L2538
278A6556j1740k2553K7415L088k9842J6151J9114k6558j899K5383j4818j5115
290a4818K3664L84k4808J3096J5037j9759l46K0713j2532j3603K1579M178k1823
303i038P479J8004j6267o335J9876p224j7257J7334N214k2476P145J7559j8746
316d732q158K0978p366j5298J9352K234k2718J3130J7340k3273k365K3918j3347
$$ plain form
226 1135 35 -1193 -13841 -4121 13769 -7143 -16172 14336 8598 -17946 7222 23156 -11571
239 -11571 -10597 20120 1074 -16998 8567 8594 -14824 -1555 11999 -7843 -10081 8982 1451
252 1451 -12029 1882 5554 -10206 -3005 9147 -9729 -15577 10925 7210 -21316 -4969 16052
265 16052 -10498 -14712 16162 283 -21341 11997 17810 -18943 -4327 23424 -6758 -15982 16556
278 16556 4816 -17737 9678 12766 -17076 -925 18189 -8369 -10268 15115 297 -14818
290 -14818 8846 9230 -15578 -2482 12555 -7204 -7550 13163 631 -12972 8607 12785 -9038
303 -9038 -1559 16445 178 -6157 13719 6495 -10762 6572 11786 -10690 -3545 14014 -4732
316 -4732 -12890 8088 722 -14576 4776 7010 -15708 -2578 14762 -8511 -10876 13042 -305
329c05j5760K4509K148k5103J2265J7279k2031l628K2977j0740j5648J9203L692
342H858j9440P796J3082j5110k989J6485p688j1541J4348P72j6885Q170J1038
355F896j3975k423J5285n388j0229J1944L339j3253M713J0175r162k569R113k991
369A475m627N817n11l851M726J097n407L909L091p570J238O598p323l209Q717
384D170m044p483P692J443r718N285Q215r181p45J3362o101q780J3549J410j5455
399f381Q532J1088j6852l671J9554q141j6864J7762O023k2278P660J8962j9706
412d312r153K2773n944k0355J7685R776k3710M655K2089j6363j1138K4120k904
425G219k2642J5654J3410k2600k149K1947j0334j5887K0432O029k2037O583J8013
$$ plain form
329 -305 -16065 8444 10592 -14511 -2246 15033 -6998 -10626 12351 1611 -14037 5166 8858
342 8858 -10582 -2786 10296 -4814 -7803 8682 994 -10547 3801 4573 -12312 -4142 6896
355 6896 -7079 -9502 5783 395 -9834 2110 5449 -7804 -3091 7084 -2078 -4647 4466 1475
369 1475 -3152 2665 2154 -1697 3029 4126 -1281 2628 5719 -1851 -613 5985 -1338 -4547 4170
384 4170 126 -7357 335 1778 -7940 -2655 5560 -3621 -4366 8996 2895 -5885 7664 9074 -6381
399 -6381 2151 13239 -3613 -7284 12270 4129 -12735 5027 11050 -11228 -3568 15394 -4312
412 -4312 -13465 9308 3364 -16991 694 10470 -13240 -8585 13504 -2859 -13997 10123 7219
425 7219 -15423 231 13641 -8959 -11108 10839 505 -15382 5050 11079 -10958 -4375 13638
438A3638j5597q451J9505l815j8745J3224J0879j8375o49J7719j1049j0201J7651
451E734l1j6520R172J0087j4468r90J4103o728q549J1015K315q176M767L792n648
466a25J164L496k293M89j11l807K078Q34n773J698M376o452l95R465m120o468
482e944J0109J281j0176N788Q174j1680k815J2311n033j2255J1316O788j5615
495g751K522J6682j0771j1030J8192K044k1253Q363J7460j9736p843K5601p216
508E264k2348K1408J0908k8256O319K5166k2878j4414L0411n134k9716K1521J6063
521A4314l0411L963L0167j9978j6946K9981J425k8517J4984J8969k4608n391K6592
534A4544r143k1376J8849J0127k2603L015K0056j4340j2626K0961Q65k2760J0965
$$ plain form
438 13638 -1959 -10410 9095 5280 -13465 -241 10638 -7737 -8386 9333 -1716 -11917 5734
451 5734 5703 -10817 -1645 8442 -6026 -7016 7087 359 -8190 2825 5140 -3036 1731 5523 -125
466 -125 1039 4535 2242 2731 2620 -1187 891 1725 -4048 -2350 2026 -4426 -4821 4644 524 -5944
482 -5944 4165 5446 -4730 1058 9232 -2448 -5263 7048 2015 -10240 1076 7864 -7751
495 -7751 -5229 11453 682 -10348 7844 9888 -11365 -3002 14458 -5278 -13121 12480 5264
508 5264 -17084 4324 15232 -13024 -6705 18461 -4417 -18831 11580 6446 -23270 -1749 14314
521 14314 -16097 -12134 18033 -1945 -18891 11090 12515 -16002 -1018 17951 -6657 -12048 14544
534 14544 5401 -15975 2874 13001 -9602 -6587 13469 -871 -13497 7464 8329 -14431 -3466
547c466J6387j9352m826K1644p319j6423J7827P525k1088N853J7044j4452p483
560h129J6857m369j3117J1172M589j1798L078Q114o258k253O805j806l529L118
574B474k82k044k93j742M74J372m615R66N430l968k534P895j754o963O276N555
590F247r024p31R416n207o504Q999K337j0094K303R349o639n616R857m86j3011
605h804N856J0818j3058m742J5624m389j3818J4323O913j9701L867J9005j4461
618b567j0373K1350l350j9510J6216J0977k1946L109J9958j4070j0646J9812j975
631F985j8662J3216J0028j8786K77J7103r496j0935J4461J632j4053O482J0675
644H927j1602n195J3588j826j1381P707O625j1156K69J1730n954q239J0496K652
$$ plain form
547 -3466 12921 -6431 -11257 10387 3068 -13355 4472 11997 -9091 -3238 13806 -646 -8129
560 -8129 8728 4359 -8758 2414 7003 -4795 -1717 6397 139 -2114 4691 2885 -644 2474
574 2474 2192 148 -145 -1887 -1413 -41 -4656 -3690 1740 -2228 -4762 3133 1379 -5584 692 6247
590 6247 -2777 -3508 5908 701 -5803 3196 5533 -4561 -2258 7091 452 -5164 4693 4207 -8804
605 -8804 -2948 7870 -5188 -9930 5694 1305 -12513 1810 8723 -10978 -7111 11894 -2567
618 -2567 -12940 8410 5060 -14450 1766 12743 -9203 -6094 13864 -206 -10852 8960 6985
631 6985 -11677 1539 11567 -7219 -6942 10161 665 -10270 4191 5823 -8230 -1748 8927
644 8927 -2675 -7870 5718 3892 -7489 218 6843 -4313 -4044 7686 1732 -6507 3989 6641
658F641j1338N241Q260r605j813R690m885o426P199N7p564M275L193o471R43M941
674B338m652k63M485l141j317L972k560j727L653k157k308M935l63m363M520J951
690C003o314K512N508o029j971P395k329o264N430L245p551J79O596m349m793
705e732P165P07q580K920P356o518k945R806k419r259R108N685j2922J425J2271
720H068r174o432J4769k436j4700J0912Q920j5294J145J5128j1570q083J6506
733G759k063j5545J0448Q169j5178J674J3647r903q238J4112p85j2767Q646P982
747G958j3028P5J2994o277q026J0796K075j1810M822R480j0437l962J1729l809
761B580r715R389M166j2131L082R901r173m539J1352l582r495R293L217j1137
$$ plain form
658 6641 -4697 544 8804 -801 -2614 7076 2191 -4235 2964 3021 -4543 -268 2925 -3546 -2603 2338
674 2338 -2314 -2577 1908 -1233 -2550 1422 -1138 -2865 788 -1369 -3677 1258 895 -3468 1052 3003
690 3003 -3311 -799 4709 -1320 -3291 4104 1775 -4489 941 4186 -3365 -3186 3410 -939 -5732
705 -5732 1433 2140 -6440 -3520 3836 -2682 -5627 4179 1760 -7499 1609 7294 -5628 -4203 8068
720 8068 -1106 -7538 7231 4795 -9905 1007 9927 -5367 -4222 10906 -664 -8747 7759
733 7759 5696 -9849 599 8768 -6410 -4736 8911 -992 -9230 4882 4097 -8670 -24 7958
747 7958 -5070 -4995 7999 1722 -6304 4492 6567 -5243 -421 9059 -1378 -5340 6389 2580
761 2580 -7135 2254 6420 -5711 -2629 7272 -1901 -6440 4912 1330 -8165 1128 4345 -6792
775f792L546Q211q959j909R875m098n739P927R08p378M355M616o985L42O316m111
791A25l142N288j138m840L748J761m414J009L440k744j211L900j563k398K762
806E83N12l196J300J880k902o50L612j306k495M464Q07m457K953L588m990m21
822g18N232l425l391O024n86o382M142L321p217J212O422o418k653Q115k865o471
838e658O584K479p945K980P154p497k583Q737l021o393P066K647q673K844O984
853E705o194l063P953k141p271O545L618q535J086O993o432l880Q732j347q245
868f476N266N166q980P64Q719o032m893R061L97q357N513M630q425J36Q468n269
884c12m851P856m18o879N204M009p169R22O252m065k907N666j468n909M033K444
$$ plain form
775 -6792 -3246 4965 -3994 -5903 3972 -126 -5865 2062 2970 -4408 -53 4563 -2422 -2080 4236 125
791 125 -3017 2271 1133 -3707 41 1802 -2612 -1603 1837 -907 -2118 1782 219 -2179 583
806 583 1095 -2101 -801 1079 -1823 -2473 1139 -167 -2662 1802 2609 -1848 1105 4693 -297 -718
822 -718 4514 1089 -2302 3722 3136 -3246 896 4217 -3000 -1788 4634 -1784 -4437 3678 813 -5658
838 -5658 926 3405 -4540 -1560 5594 -1903 -4486 4251 1230 -5163 1903 4550 -4123 -1279 5705
853 5705 -489 -3552 4401 2260 -5011 1534 5152 -3383 -2297 4696 -1736 -5616 3116 1769 -6476
868 -6476 -1210 3956 -5024 -4260 4459 -1573 -6466 2595 2992 -5365 148 4778 -3647 -3511 4957 -312
884 -312 -5163 2693 2275 -4604 600 4609 -2560 -1638 4614 549 -2358 3308 1840 -4069 -36 2408
900B408n711Q77M453l815j092N072j465l334L919J099l875J836K795l488k97L857
916C239k513j818L826m86l880L291J284m430J353L342m280j259N215k243m183
931c542N050Q90o317L003L991n890m80O451l404m735O364J182p253M081N641p356
947b324r63Q185l868n883P480J640r157L584O956q048k596R488l060q192Q087
962A329L510j0001K656Q434q047m005R743j784r276P392M734j0194J586R533o858
977a248m730J0001k26r151O551N809r527l55R348n947n975Q655O52r417M590O277
993E307p799j924Q655k971o712P273K119q191K583N843n606k081O937j972n328
1008c867N350K484o344J787M559m646r36N348j997l740L528J220m062J679K378
$$ plain form
900 2408 -3303 -2426 2027 -1788 -2880 2192 727 -2607 1312 2411 -1464 372 3167 -321 -618 3239
916 3239 726 -1092 2734 2248 -1632 1659 2943 -1487 -134 3208 -1072 -2331 2884 641 -3542
931 -3542 1508 2398 -3919 -916 3075 -2815 -3295 3156 -248 -4983 1381 2563 -4690 -609 5032 -2324
947 -2324 -3287 4898 1030 -4853 2627 4267 -4890 -1306 5650 -2398 -4994 4494 1434 -6758 1329
962 1329 4839 -5162 -2506 5928 -2119 -6124 3619 1835 -7441 -49 4685 -5509 -3923 5610 -1248
977 -1248 -5978 4023 3797 -5354 1197 7006 -2521 -2876 6472 525 -5450 3205 3857 -5560 -970 5307
993 5307 -2492 -4416 4239 1268 -5444 1829 3948 -4243 -1660 4183 -1423 -3504 3433 1461 -3867
1008 -3867 1483 3967 -2377 -590 3969 -677 -1613 3735 1738 -2002 1526 2746 -1316 363 2741
1023B741l705m66K701j826q30J871j544j451K332M44k073K091k01k272J569K260
1039A641k620n55K920j856j652L816o32m075K573K968l761k4M353l114l582N728
1055B128L17n838K733L826n843o88O666l505n298O431J406p139L882N560p201
1070b563j233Q731l319o079P110J516q139L633O278p399k265Q304k589n938N985
1085B033K387q146K566N991n634l005O826j234o043M582L364o480o5O365l763
1100b56l429N550L77n699L045M183m692r08N445k663l967N282Q72n403K010L078
1116B825m280r1L968k214k677L513L0k888J610J138k908J090J830k375k6J806
1132C51j869m64K470j102j472K496L21k559J967J708l075N23K978k089j405L462
$$ plain form
1023 2741 -964 -1430 1271 -555 -1385 486 -1058 -2509 -177 267 -1806 285 84 -2188 -619 1641
1039 1641 -979 -1534 1386 -470 -2122 1694 1062 -3013 -440 2528 -1233 -1257 3096 -18 -3600 2128
1055 2128 2445 -3393 -660 3166 -2677 -3365 3301 -204 -5502 929 2335 -4804 -922 4638 -2563
1070 -2563 -3796 4935 1616 -4463 2647 4163 -3976 -343 5935 -1464 -3729 4575 1986 -3952 2033
1085 2033 4420 -3726 -1160 4831 -803 -3808 3018 1784 -4259 323 3687 -2793 -2858 3507 -256
1100 -256 -3685 1865 2242 -3457 -412 3771 -921 -1829 3616 953 -3014 2268 3140 -2263 -253 2825
1116 2825 -1455 -1546 2422 208 -2469 1044 1074 -1814 -204 934 -1974 -884 946 -1429 -1455 351
1132 351 -1518 -1982 488 -614 -2086 410 731 -1828 139 1847 -1228 -705 2273 184 -1221 2241
1148B241j348l069K638J537l976N51M043l301k331M468j33m890L511L042n096
1163b113m09O132l261m265N765R10o534L170N802o457j251P394l431n111O573
1178B914J490p832L055N831o494k409P562k971o067O543K190p581J842N916n288
1193a299k928P086j401o016M497L725o255N17N506l665l530N681O12n620K947
1208a43L906n625r7N681k880m117M945N88m958K080L592n208p97M912j852k378
1224b351L105j46m114K747K425l668J51L799k367j323L372k40l269K447J383k801
1240h50O71J981k606J37K159j097j757K151L28k563J948J478k735R3J730j570
1256e02j394K889o46l177K889J645l208M33L513k819j392M411o65l635K726J568
$$ plain form
1148 2241 893 -2176 462 1999 -1977 -1426 2617 -684 -3015 1453 1320 -3570 -59 2983 -2113
1163 -2113 -2522 3610 349 -3916 1849 2759 -3775 -605 5197 -1260 -2511 4883 1452 -3659 2914
1178 2914 4404 -3428 -373 5458 -1036 -3445 4117 1146 -4921 1622 3812 -3769 -1927 3989 -1299
1193 -1299 -4227 2859 1458 -4558 -61 3664 -2591 -2074 3432 -233 -3763 1918 2530 -3090 -143
1208 -143 3763 -1862 -1959 3722 842 -3275 1670 2258 -2700 -620 2972 -2236 -3033 1879 27 -2351
1224 -2351 754 608 -3506 -759 1666 -2002 -1851 1948 -419 -1742 1630 1390 -1879 568 1951 -850
1240 -850 -179 1802 -804 -667 1492 395 -1362 789 1117 -1446 502 1980 -755 -662 1068 -502
1256 -502 -1896 993 347 -2830 59 1704 -1504 -1071 2442 -377 -1769 2642 1977 -1658 1068 2636
1272B636l930R29L954l485j798M457r07m196L399J414m708J196M269l994j596
1287b360M381j610l506L525J390m765J558L318l424j107M211j036l415L712J288
1302B160l785J615K288l258q91L980j368l080L363O52l807J392L055l503p38L429
1318A504j470k628L064N96l511J675K575l249m14L797j943k538L658K25l710K421
1334E2K272l511J88L963k314k724M335m33l757K569K097l904j10L421k587k146
1350b589M122l40l657K602K039l947N73L540k642j893L850l56l093K056K087l531
1366a179L24L460k381j969L577k04l041K017J929l502J51L029k399j933L526r35
1382D70l294K732J434l660P13K986k415j112L381p51l111L313O63l230J443K344
$$ plain form
1272 2636 -1294 -365 3589 104 -1694 2763 1856 -2340 1059 2473 -2235 -1039 3230 -764 -2360
1287 -2360 2021 411 -3095 430 1820 -2945 -1387 1931 -1493 -2600 1611 575 -2840 872 2160
1302 2160 -1625 -10 2278 -980 -1871 2109 741 -2339 1024 1676 -2131 -739 2316 -1187 -1925 1504
1318 1504 34 -2594 470 1066 -2445 -770 1805 -1444 -1858 1939 -4 -2542 1116 1341 -2369 52
1334 52 2324 -1187 -999 2964 650 -2074 2261 1828 -1929 640 2737 -1167 -1277 2144 -443 -2589
1350 -2589 1533 1193 -2464 138 2177 -1770 -1197 2343 -299 -2192 1658 1302 -1791 265 2352 -1179
1366 -1179 -855 2605 224 -1745 1832 1628 -1413 604 2533 -969 -818 2211 -188 -2121 1405 470
1382 470 -2824 -92 1342 -2318 -1605 1381 -1034 -2146 1235 484 -2627 686 1349 -1881 -438 1906
1398A906l127n23L738j665k241L095M24l722K288K026l688K07L509k489k435M006
1414A309K3m091K466K494m068j03M219k503k759M524M29m833L099K849m376j5
1430a336M970k833l525M748Q67n452K344L847m837o27N222k176l716M041J070
1445B607n045J704M019m385j538M784j494l924L604K012m715N79M485k982j828
1460b117L964l81l618K799K141l781k0L364k045j854K645p7k778J534J797k370
1476g97l11K263j400j180J631J52j548R57L39j366L99P42m63k39J021l76M7Q89
1494G60n94o25R34j20r58J281M29k096N70J686j360j128K602j055k421K702O89
1511A296l300R56L115k873j390M060q45l455K875J931m111M69M161l011k319M829
$$ plain form
1398 1906 -1221 -1744 1994 329 -1912 1183 1607 -2115 173 2199 -1489 -1282 2227 -262 -2697 1309
1414 1309 1332 -2759 -293 2201 -1867 -1970 2249 -254 -3013 1511 1940 -2893 206 3055 -1321 -1336
1430 -1336 3634 801 -2724 2024 2891 -2561 -217 3630 -1207 -1834 3388 1212 -2504 1537 2607
1445 2607 -2438 -734 3285 -1100 -2638 2146 652 -3272 332 2344 -2371 -1792 2693 -289 -2117
1460 -2117 1847 1466 -2152 647 2788 -993 -1013 2351 306 -1548 1097 1020 -1758 -224 1573 -797
1476 -797 -1108 1155 -245 -1425 206 358 -1190 -233 106 -1260 -861 -119 -582 -821 200 -176 -129 760
1494 760 166 -459 475 355 -603 678 1107 -989 -419 1267 -93 -1221 1381 326 -2095 607 1296
1511 1296 -2004 -1048 2067 -806 -2196 1864 1019 -2436 439 2370 -1741 -1272 2889 -122 -2441 2388
1527B388k25m653L194K717m597K7M762k891l352M839L51n082K357L674m927j006
1543b424M988j683m088L985J568n213J892L993l874j779M429n04l877K847K036
1558B296m168M55L731k421k050L401J1l208K027J657k649j02K543j188j656J774
1574D53j53j803J062Q43j416L86O90q65J71P32n17k03J202r72j64J144q05o35
1592h50J389L19j834J134J508k039j93K246j455j689K565L18l097J624K467l261
1608h48p23L777j917k998L505J158m260J147L785l690j404M798m83m580L597K595
1624C459n201M07N149l440l329N081J64n109K727L671n089n71N050k275l863M295
1640A126J388n552J839M373m031k100M769p67m213L252K194m580L07M372k526
$$ plain form
1527 2388 2163 -2490 704 3421 -1176 -1149 3613 722 -2630 2209 2560 -2522 -165 3509 -1418 -2424
1543 -2424 2564 881 -3207 778 2346 -2867 -975 3018 -856 -2635 1794 1290 -2587 260 2296
1558 2296 -1872 -1417 2314 -107 -2157 1244 1255 -1953 74 1731 -918 -1020 1523 335 -1321 453
1574 453 300 -1503 -441 402 -1014 -628 62 -803 -632 100 -417 -620 582 -390 -554 590 -215 -850
1592 -850 539 858 -976 158 1666 -373 -566 1680 225 -1464 1101 1419 -1678 -54 2413 -848
1608 -848 -1571 2206 289 -2709 796 1954 -2306 -1159 2626 -1064 -2468 2330 1847 -2733 864 3459
1624 3459 -1742 -1335 3814 374 -2955 2126 2290 -2819 -92 3579 -1510 -2081 2969 694 -3169 1126
1640 1126 2514 -3038 -1199 3174 -857 -2957 1812 1045 -3168 84 2278 -2302 -1995 2377 -149
1655a49k399M039K37m064K247K527l395n52L267j525k270K477P26k835O65K484
1671A480j934q61K302q72j802J741N49j818P20R95p39k36Q82k52o62O72j44j30
1689a09N50k11k91R95N4j083P96M57j312L7J548j512r68K032p67j589J644R04
1707A175k469N44K291j772j281K665m98k715J986J967k711m43L209j660k086L023
1723A225P46l848J580K905l385o61L650j381l085L123J071l833P63L225k959j469
1739b333L469n05l158K295J708l190K79L183j747j766K424L04k463J293J686k328
1755h49n3K116q83j289J854P1j780Q02J084j492J40J184j288l70R41k56n68N00
1773a36J78p72L36P43j042N97Q08j260L48J342p90q88J620J54j829J250J145k551
$$ plain form
1655 -149 -2548 1491 1728 -2336 -89 2438 -957 -1509 1758 233 -2037 440 1166 -1669 -1004 1480
1671 1480 -454 -1315 987 115 -1687 54 603 -1215 -495 500 -239 -475 407 155 -507 165 21 -109
1689 -109 441 230 -61 934 988 -95 701 1158 -154 -117 1431 -81 -1049 983 216 -1373 271 1175
1707 1175 -1294 -750 1541 -231 -1512 1153 655 -2060 -74 1893 -818 -1261 1948 288 -1798 1225
1723 1225 1971 -1877 -297 2608 -777 -1438 2212 831 -2254 869 1940 -1893 -1130 2095 -864 -2333
1739 -2333 1136 631 -2527 -232 1476 -1714 -1435 1748 1 -1765 659 963 -1500 -207 1479 -849
1755 -849 -902 1214 331 -958 896 967 -813 -11 1073 -419 -279 905 -383 -753 188 -68 -636 -136
1773 -136 42 -730 -394 349 -693 -96 712 -548 -200 1142 352 -536 1084 1238 -591 659 1804 -747
1791g47J62K394j665j225K349j46k342J630J490k903l41L198j901j798K651M12
1807A218l464J964K175k869n13L162j145k703L107R25l705J320K950k676j363
1822a617L421o31k917K291J214l233M92L068k564j227K543k39k722J982J638k589
1838a090P3K422j703j751K497J00k289J517J261j912O1K186j097j031J455N5j401
1855f47J017O93j373O4J267r53o07J272o65q30J445k68j385J054L74j182K75J411
1873I62r44p68J790r51j030J552L97k035J018J689j932j46K208j053k120K373
1889A010N97k626Q74K077k282o91K704j154k512K305J207l270P99K570k425j412
1905b229L190k21k831K310J641k977j20L003j633j985K855K90l045J600J952k415
$$ plain form
1791 -747 -585 1809 144 -1081 1268 1122 -1220 410 1900 -1003 -1344 1854 -47 -1845 806 1218
1807 1218 -2246 -282 1893 -976 -1489 1673 528 -2175 932 1857 -1848 -528 2422 -254 -1617
1822 -1617 1804 1173 -1744 547 1761 -1472 -980 2088 -476 -1703 840 601 -2121 -139 1499 -1090
1838 -1090 -1017 1405 -298 -2049 448 548 -1741 -224 1037 -875 -814 1372 275 -756 699 754 -647
1855 -647 370 1063 -310 -246 1021 68 -539 733 68 -762 683 415 -970 84 458 -724 -449 962
1873 962 18 -750 1040 89 -941 611 1008 -1027 -9 1680 -252 -398 1810 757 -1363 1010
1889 1010 1607 -1019 -145 1932 -350 -1041 1663 509 -2003 302 1509 -1761 -962 1608 -817 -2229
1905 -2229 961 740 -2091 219 1860 -1117 -1237 1766 133 -1852 1003 1293 -1752 -152 1800 -615
1921f15o85K963j427k146K592O25k590P39J649j716q07J976m22j939J576O95j418
1938i50M01J550j379j24J208k13j185J072K88r73M98L47n12L7O57l03n71O28l53
1957A23n35R14k04p88J073k22r12N30P59j298K6J333j035q53J418L31j823J286
1975A23J126k004J24K239j167j575K182J55k234J182J664k173o95K761j240k109
1991a641K311O80k910Q18K139j876j253K893m31k726J884J700l238M81K720j483
2007F8k039K421M21k401J454J602k228m33K940j211j827J798K29j971O52J624
2023A099j800m59J763l63j534J584L20j335K33J197r64m85J050l50m98N91M00
2040D49r89N55M34n50N90M2n50J35P48o94r1Q41n52o92J263j30j434O78R31j756
$$ plain form
1921 -615 -1300 1663 236 -1910 682 1307 -1283 -544 1105 -611 -1418 558 136 -1803 -227 468 -950
1938 -950 -549 1001 -378 -502 706 493 -692 380 668 -305 193 540 28 65 722 419 -152 476 123
1957 123 -412 502 298 -490 583 361 -551 -21 738 -560 -534 799 -236 -1089 329 660 -1163 123
1975 123 1249 -755 -631 1608 441 -1134 1048 1203 -1031 151 1815 -358 -1053 1708 468 -1641
1991 -1641 670 1350 -1560 -742 1397 -479 -1732 1161 730 -1996 -112 1588 -1650 -1169 1551 68
2007 68 -1971 450 871 -1530 -76 1526 -702 -1135 1805 594 -1233 565 794 -1177 -525 1099
2023 1099 -701 -1160 603 240 -1294 290 610 -725 -492 705 -259 -744 306 -44 -542 49 449
2040 449 -540 15 449 -101 489 531 -19 116 864 170 79 920 368 -324 939 809 -625 53 984 -772
2060g72K73J667r98j284J837J32k069J076J395j894l64K309r69j905K423N57k816
2077a402R34K426k265j094K842k50k976K081J634l379N40K610j886j859L058J9
2093A033k956J668J835l063l10L493j888j858K560P24k771P58K800k374r46K636
2109A341o78k459K161Q74k356M90J929j072j326J987M5j982J045R58j414l55J653
2126H41r17q62R69N21j247N59O57n32k44N09J8l72L71RL5l4k4J14K8l02j79K53
2148A71L50m27L68N5q21K39J025j092n37J219j39j484J017Q05j476j94J751q47
2166a7j203J938O3j991R16J741j980l38J823l07j674J552J044k502Q0K250j633
2183b38j049J984j00k471J432J435j966k14K135p46j703J969N87k502P48K047
$$ plain form
2060 -772 -499 1168 170 -1114 723 855 -1214 -138 1257 -637 -1001 1308 339 -1566 857 1414 -1402
2077 -1402 -468 1958 -307 -1401 1441 1191 -1785 296 1930 -1449 -909 1701 -185 -2044 1014 1033
2093 1033 -1923 -255 1580 -1483 -1793 1700 -188 -2046 514 1238 -1533 -775 2025 -349 -1295 1341
2109 1341 663 -1796 365 1239 -1117 -627 1302 230 -1096 891 936 -1046 -1 957 -457 -812 841
2126 841 -76 -938 31 552 -695 -136 521 -11 -255 254 272 -100 271 280 315 281 257 371 399 97 -82 171
2148 171 521 94 462 517 -304 -65 960 -132 -669 550 411 -1073 -56 749 -727 -921 830 -17
2166 -17 -1220 718 781 -1210 -294 1447 -533 -871 952 645 -1029 523 1567 -935 -855 1395 -238
2183 -238 -1287 697 597 -1874 -442 993 -973 -1187 948 202 -1501 468 1055 -1447 -699 1348
2199A348j663j010K383n69j908J942R52k035M33J490j267p57J522r0j901J036
2215i4J098j501K26J159r77o21R45R4q13N65J52n55R1N17n01j8L47pk38N22n5
2236C36n68O33M2n99L60M47m55K49M21r75K05M02k42q43P10L32j275L61J356j298
2256d01o99J725p65j168J395P20j777K67K188j852q45K289n66j655J295J025k146
2273i70Q8K238j330j224K127m21j719J218J221j675n13K086j121j211J682K23
2289F99k082N87J750j589n47J913l92j507J562L98j280L21J168j185l09J408k66
2306F49j426J193M49j378M13J044j018n98J352k46j095O84L84r66N60O33q67P2
2324a61N75m65o02Q22J19n73J39N38q36O60O55p59j06N65k24n10M74J63j053M99
$$ plain form
2199 1348 -315 -1325 1058 489 -1419 523 1475 -560 -127 1363 96 -661 861 771 -1130 -94
2215 -94 1004 -497 -271 888 -89 -710 235 329 -484 81 233 -322 -231 286 -215 -233 114 107 -131 391 336
2236 336 -232 401 443 -156 204 651 196 445 866 -109 96 498 256 -587 123 455 -820 -459 897 -401
2256 -401 -1100 625 -140 -1308 87 807 -970 -703 1485 -367 -1212 1077 511 -1144 151 1176 -970
2273 -970 -882 1356 26 -1198 929 508 -1211 7 1228 -447 -960 1126 5 -1206 476 699
2289 699 -1383 -796 954 -635 -1182 731 339 -1168 394 792 -488 -167 1001 -184 -493 915 649
2306 649 -777 416 865 -513 -100 944 -74 -672 680 434 -661 23 407 -559 1 634 -233 -161
2324 -161 414 -51 -653 169 288 -285 -146 392 -444 216 871 112 6 571 347 -163 311 474 -579 -80
2344h0O74r78r1J105n07q33J210n8j388N87Q46j149k60J378m79j083J406Q5j255
2363h70O45J079j298l93J568n18j195J295N08j298L81R42r39o74J292m44j010
2380i29Q67O14j414L47J526j274o80J337Q8j170Q43L84r24J10J092r52l35R93
2398E23K9p18L20O93j096J26Q46l31m97N83J97r10L37K98o02J64M47o12k3M93
2418B67m55k39Q64j76o58L33L46n84J43L54m98M3Q98m27p02Q40P9p72M37P13j156
2439c50m4J021p45l83J035j63q22j6P63n92o37J421m92j115J129K82j028L70R81
2458F15r76l05J516m04j201J119L39j400M40J075r15m63J236j98r78P13N35j290
2476e42J84R38q46m17J146j84r09P06K85r60L56P89r40j94J277m19r07J051K04
$$ plain form
2344 -80 594 -384 -475 630 123 -710 500 442 -946 -359 487 -662 -922 456 -23 -1106 300 385 -870
2363 -870 -225 854 -444 -837 731 213 -982 313 821 -477 -96 846 -93 -767 525 81 -929
2380 -929 -62 552 -862 -515 1011 -263 -943 394 482 -688 155 539 -385 -275 817 -135 -470 523
2398 523 552 -166 154 847 -249 -123 723 392 -105 478 675 -235 102 400 -202 -38 409 -203 -226 267
2418 267 -188 -427 437 261 -397 -64 282 -302 -159 195 -303 -260 638 211 -491 349 428 -344 93 806 -350
2439 -350 -394 627 -118 -501 534 371 -451 -467 296 -296 -933 488 -4 -1119 10 292 -736 -366 615
2458 615 -361 -666 850 446 -755 364 703 -697 -257 818 -97 -560 676 478 -500 213 748 -542
2476 -542 -358 580 -266 -683 463 279 -630 76 361 -599 -243 546 -394 -588 689 270 -637 414 618
2495F18p97K95M72n62j08M70j76l60P05p8o36L83R3n51M9O74n50p15R80J83j156
2516g67P54O83j177J21Q01o74n35J068L40j311P66M09j021L01J034j018n56J112
$$ plain form
2495 618 -179 116 588 26 -82 388 212 -148 557 479 -157 226 319 -232 -183 491 -59 -774 206 389 -767
2516 -767 -13 670 -507 -386 415 -259 -794 274 614 -697 69 478 -543 -242 792 -226 -782 330
$$ [...]
8191a86
##END NTUPLES=NMR FID
##END=
