##TITLE=1H_Ser 6-6-V
 CDCl3
 8 sc, 
 27.06.2022
##JCAMPDX= 6.0         $$ Bruker NMR JCAMP-DX V2.0
##DATA TYPE= NMR FID
##DATA CLASS= NTUPLES
##ORIGIN= UXNMR, Bruker Analytische Messtechnik GmbH
##OWNER= root
$$ XWIN-NMR		Version 3.5
$$ Mon Jun 27 14:30:58 2022 Russian Standard Time (UT+4h)  she@DPX200
##.OBSERVE FREQUENCY= 200.1313499994
##.OBSERVE NUCLEUS= ^1H
##.DELAY= (6, 6)
##.ACQUISITION MODE= SIMULTANEOUS
##.ACQUISITION SCHEME= undefined
##.AVERAGES= 8
##.DIGITISER RES= 18
##SPECTROMETER/DATA SYSTEM= spect
##.PULSE SEQUENCE= zg30
##.SOLVENT NAME= CDCl3
##.SHIFT REFERENCE= (INTERNAL, CDCl3, 0, 15.7039)
##AUDIT TRAIL= $$ (NUMBER, WHEN, WHO, WHERE, WHAT)
$$ ##TITLE= Audit trail, XWIN-NMR		Version 3.5
$$ ##JCAMPDX= 5.01
$$ ##ORIGIN= Bruker BioSpin GmbH
$$ ##OWNER= she
$$ F:/spectra/data/she/nmr/H-F/1/audita.txt
$$ ##AUDIT TRAIL=  $$ (NUMBER, WHEN, WHO, WHERE, WHAT)
(   1,<2022-06-27 14:29:40.26 +0400>,<she>,<DPX200>,
      <created by zg, POWCHK disabled, PULCHK disabled
       configuration hash MD5:
       00 E9 B6 7A A2 85 ED C7 34 08 36 98 17 FE 4E 26
       data hash MD5: 16K
       D1 0F 57 ED AA F4 D6 5D 01 FB 33 51 3D 41 A0 C2>)
$$ ##END=
$$ 
$$ hash MD5
$$ 78 79 AB 3A 46 C1 DA 61 02 4A 19 14 FD 05 DB E4
##$RELAX= 
##$RELAX= 
##$RELAX= 
##$RELAX= 
##$RELAX= 
##$RELAX= 
$$ Bruker specific parameters
$$ --------------------------
##$DU= <F:/spectra>
##$EXPNO= 1
##$NAME= <H-F>
##$PROCNO= 1
##$TYPE= <nmr>
##$USER= <she>
##$AMP= (0..31)
100 100 100 100 100 100 100 100 100 100 100 100 100 100 100 100 100 100 
100 100 100 100 100 100 100 100 100 100 100 100 100 100 
##$AQSEQ= 0
##$AQ_mod= 1
##$AUNM= <au_zg>
##$AUTOPOS= <>
##$BF1= 200.13
##$BF2= 200.13
##$BF3= 200.13
##$BF4= 200.13
##$BF5= 200.13
##$BF6= 200.13
##$BF7= 200.13
##$BF8= 200.13
##$BYTORDA= 1
##$CFDGTYP= 0
##$CFRGTYP= 5
##$CHEMSTR= <none>
##$CNST= (0..31)
1 1 145 1 1 1 1 1 1 1 1 1 1 1 1 1 1 1 1 1 1 1 1 1 1 1 1 1 1 1 1 1 
##$CPDPRG= <>
##$CPDPRG1= <>
##$CPDPRG2= <>
##$CPDPRG3= <>
##$CPDPRG4= <mlev>
##$CPDPRG5= <mlev>
##$CPDPRG6= <mlev>
##$CPDPRG7= <mlev>
##$CPDPRG8= <mlev>
##$CPDPRGB= <>
##$CPDPRGT= <>
##$D= (0..31)
0 1.2 0 0 0 0 0 0 0 0.06 0 0.03 0 0 0 0 0.0002 0 0 0 0 0 0 0 0 0 0 0 0 
0 0 0 
##$DATE= 1656325779
##$DBL= (0..7)
120 120 120 120 120 120 120 120 
##$DBP= (0..7)
150 150 150 150 150 150 150 150 
##$DBP07= 0
##$DBPNAM0= <>
##$DBPNAM1= <>
##$DBPNAM2= <>
##$DBPNAM3= <>
##$DBPNAM4= <>
##$DBPNAM5= <>
##$DBPNAM6= <>
##$DBPNAM7= <>
##$DBPOAL= (0..7)
0.5 0.5 0.5 0.5 0.5 0.5 0.5 0.5 
##$DBPOFFS= (0..7)
0 0 0 0 0 0 0 0 
##$DE= 6
##$DECBNUC= <off>
##$DECIM= 32
##$DECNUC= <off>
##$DECSTAT= 4
##$DIGMOD= 1
##$DIGTYP= 9
##$DL= (0..7)
0 120 120 120 120 120 120 120 
##$DP= (0..7)
150 150 150 150 150 150 150 150 
##$DP07= 0
##$DPNAME0= <>
##$DPNAME1= <>
##$DPNAME2= <>
##$DPNAME3= <>
##$DPNAME4= <>
##$DPNAME5= <>
##$DPNAME6= <>
##$DPNAME7= <>
##$DPOAL= (0..7)
0.5 0.5 0.5 0.5 0.5 0.5 0.5 0.5 
##$DPOFFS= (0..7)
0 0 0 0 0 0 0 0 
##$DQDMODE= 0
##$DR= 18
##$DS= 0
##$DSLIST= <SSSSSSSSSSSSSSS>
$$ [...]
##$SUBNAM2= <"">
##$SUBNAM3= <"">
##$SUBNAM4= <"">
##$SUBNAM5= <"">
##$SUBNAM6= <"">
##$SUBNAM7= <"">
##$SUBNAM8= <"">
##$SUBNAM9= <"">
##$SW= 18.0517283424941
##$SWIBOX= (0..15)
0 0 2 0 0 0 0 0 0 0 0 0 0 0 0 0 
##$SW_h= 3612.71676300578
##$TD= 16384
##$TD0= 1
##$TE= 0
##$TE2= 300
##$TE3= 300
##$TEG= 300
##$TL= (0..7)
0 120 120 120 120 120 120 120 
##$TP= (0..7)
150 150 150 150 150 150 150 150 
##$TP07= 0
##$TPNAME0= <>
##$TPNAME1= <>
##$TPNAME2= <>
##$TPNAME3= <>
##$TPNAME4= <>
##$TPNAME5= <>
##$TPNAME6= <>
##$TPNAME7= <>
##$TPOAL= (0..7)
0.5 0.5 0.5 0.5 0.5 0.5 0.5 0.5 
##$TPOFFS= (0..7)
0 0 0 0 0 0 0 0 
##$TUNHIN= 0
##$TUNHOUT= 0
##$TUNXOUT= 0
##$USERA1= <user>
##$USERA2= <user>
##$USERA3= <user>
##$USERA4= <user>
##$USERA5= <user>
##$V9= 5
##$VALIST= <valist>
##$VCLIST= <CCCCCCCCCCCCCCC>
##$VD= 0
##$VDLIST= <DDDDDDDDDDDDDDD>
##$VPLIST= <PPPPPPPPPPPPPPP>
##$VTLIST= <TTTTTTTTTTTTTTT>
##$WBST= 1024
##$WBSW= 4
##$XGAIN= (0..3)
0 0 0 0 
##$XL= 0
##$YL= 0
##$YMAX_a= 65148
##$YMIN_a= -67823
##$ZGOPTNS= <>
##$ZL1= 120
##$ZL2= 120
##$ZL3= 120
##$ZL4= 120
##$ABSF1= 10
##$ABSF2= 0
##$ABSG= 5
##$ABSL= 3
##$ALPHA= 0
##$AQORDER= 0
##$ASSFAC= 0
##$ASSFACI= 0
##$ASSFACX= 0
##$ASSWID= 0
##$AUNMP= <proc_1d>
##$AZFE= 0.1
##$AZFW= 0.1
##$BCFW= 1
##$BC_mod= 2
##$BYTORDP= 1
##$COROFFS= 0
##$CY= 11.3945322036743
##$DATMOD= 1
##$DC= 2
##$DFILT= <>
##$DTYPP= 0
##$F1P= 2.36226072786647
##$F2P= -0.459571619588291
##$FCOR= 0.5
##$FTSIZE= 0
##$FT_mod= 4
##$GAMMA= 1
##$GB= 0.15
##$INTBC= 1
##$INTSCL= 1
##$ISEN= 128
##$LB= 0.24
##$LEV0= 0
##$LPBIN= 0
##$MAXI= 10000
##$MC2= 0
##$MEAN= 0
##$ME_mod= 0
##$MI= 1.114404
##$NCOEF= 0
##$NC_proc= 0
##$NLEV= 6
##$NOISF1= 3.799351
##$NOISF2= 2.8
##$NSP= 1
##$NTH_PI= 0
##$NZP= 0
##$OFFSET= 15.70392
##$PC= 1
##$PHC0= -18050.62
##$PHC1= 20.40069
##$PH_mod= 1
##$PKNL= yes
##$PPARMOD= 0
##$PSCAL= 0
##$PSIGN= 0
##$REVERSE= no
##$SF= 200.130013532006
##$SI= 16384
##$SIGF1= 3
##$SIGF2= 2
##$SINO= 400
##$SIOLD= 16384
##$SREGLST= <1H.CDCl3>
##$SSB= 0
##$STSI= 0
##$STSR= 0
##$SW_p= 3612.71676300578
##$SYMM= 0
##$S_DEV= 0
##$TDeff= 0
##$TDoff= 0
##$TI= <>
##$TILT= no
##$TM1= 0
##$TM2= 0
##$TOPLEV= 0
##$USERP1= <user>
##$USERP2= <user>
##$USERP3= <user>
##$USERP4= <user>
##$USERP5= <user>
##$WDW= 1
##$XDIM= 8192
##$YMAX_p= 0
##$YMIN_p= 0
$$ End of Bruker specific parameters
$$ ---------------------------------
##NTUPLES= NMR FID
##VAR_NAME=  TIME,          FID/REAL,        FID/IMAG
##SYMBOL=    X,             R,               I
##VAR_TYPE=  INDEPENDENT,   DEPENDENT,       DEPENDENT
##VAR_FORM=  AFFN,          ASDF,            ASDF
##VAR_DIM=   8192,          8192,            8192
##UNITS=     SECONDS,       ARBITRARY UNITS, ARBITRARY UNITS
##FACTOR=    0.0002768,     1,               1
##FIRST=     0,             0,               0
##LAST=      2.2672688,     0,               0
##MIN=       0,             -67823,          0
##MAX=       2.2672688,     65148,           0
$$ Real data points
##PAGE= N=1
##DATA TABLE= (X++(R..R)), XYDATA
$$ [...]
2036A186j635j916K92J750K246O12j554j996m23J485J816R06j007j747j152J78
2052i59J247R64m22j141j122o30N34P69N85P2m10o80n41N93R99J049K63n55j191
2071e76l72Q94J708J191q93j492j833O37J670J371m84j488k087p12J709J680R33
2088A856j182k115r28J020K306R97n46j485j100L59J138J097L56j153j007o37
2104a024k8Q95P93l26m93q99m64k1O98J162K63l74j647J09M57J594J313k77j754
2123b3j196pJ576J659M39j365k268q70J218K000Q63r64k117j124K82K039J606
2140A748m1j129j475M7J267J567L35o68j215p88Q1Q42L92L5p19j168o64j99O90
2159a062N75J54l92j017p31L02J706J428P3j133j191j50J453J766J136j256j697
$$ y = [1186, -449, -2365, -2073, -323, 1923, 2535, 981, -1015, -1438, 47, 1863, 2769, 1762, 15, -1137, -959, 288, 1252, 830, -311, -1433, -2063, -1529, -760, -175, -103, -513, -1193, -1734, -1141, -142, 907, 1170, 615, -576, -948, -54, 1654, 2845, 1952, 460, -1373, -736, 934, 2305, 1821, 333, -1754, -2466, -757, 923, 1856, 674, -1441, -2369, -1349, 957, 1954, 1408, -77, -1177, -818, 320, 1417, 1773, 620, -387, -1024, -1052, -157, 636, 310, -183, -1082, -1546, -1567, -869, 293, 556, 182, -1465, -1356, -899, 695, 2008, 1731, -23, -1219, -1226, 350, 2009, 2448, 1083, -1185, -2055, -837, 1163, 2026, 1062, -1055, -2179, -1897, 142, 1748, 1707, 578, -897, -850, 417, 1984, 2319, 1651, 436, -352, -271, 571, 963, 998, 279, -889, -1553, -1752, -1062, -487, -333, -725, -1742, -2473, -2171, -465, 963, 1036, -97, -1288, -1438, 15, 1781, 2917, 1661, -36]
2176c6r60O02J463J375n64j807j822J04J510J299R6j483j408l51J146J358R65
2193A487l16j080p47J80J072J007J97l80q35q96J28M03L90M93p72r84r36l12J150
2212g51J089M00j114j485m13J121J566J277q17j634j082M80J917J677k70j570
2228C91j853k28J190J432P33j182j873k01N69J149J024M0j019p15j36J140P63
2245A224N10rr26p33j10J93J086L54p19r74j095k15O48J125K47q87j663p69O82
2264b031J732J363m68j232j061k65K096J932L52j395j918l05J128J570N22j091
2280I29j571q64p2J578P64n68o58j209q3O83Q80P17J67o16k92j54N14R00N40J92
2300A777p04p14n68N49Q49O29n45j675j221J01J209J303p6j633j081l54J249J586
$$ y = [-36, -996, -394, 1069, 2444, 1880, 73, -1749, -1645, -135, 1164, 1260, -223, -1631, -1982, -836, 522, 1487, 1171, 91, -656, -476, 596, 1603, 1800, 1420, 585, -311, -183, 220, 610, 1103, 331, -653, -1589, -1901, -751, 338, 738, -376, -1861, -2274, -1153, 413, 1690, 873, -761, -1843, -1363, 554, 2231, 1961, 391, -1462, -1690, -500, 932, 1665, 483, -1390, -1591, -1022, 127, 1151, 1191, 172, -543, -679, 461, 1224, 1734, 1725, 799, 66, -44, 149, 1235, 1589, 870, -104, -1199, -1414, -766, 359, 606, -281, -1944, -2713, -2031, -299, 1064, 596, -636, -1697, -1962, 134, 2066, 2418, 1023, -895, -1200, -72, 1498, 2020, 929, -642, -1506, -1578, 0, 764, 196, -462, -1671, -1754, -1071, -191, 526, 693, 77, -215, -369, 145, 1045, 1585, 1777, 1073, 359, -209, 340, 1189, 1818, 1273, -402, -1623, -1522, -313, 990, 914, -719, -1800, -2154, -905, 681]
2318F81N22r40j073j061O86J892J036n60j416j150L99Q44J077K43j022j053k79
2335a174K17R98O79K9o77p66k05K60R00P64J54m98j066m68Q17R45M91m02j096
2354i8q82m58J064J492J34j228j621m76Q63J704J033p62j455r56O70J474J243
2371A741l10j103j223k7J172Q97L57p14j235l72J30O40K93m8q35l86o40O31P78
2390b54O32J06m27p66J89L21Q21Q18o3r11j015Q3N38J444J50j034j441q62P60
2409i11J144J011o00j499j011l4J492J415n3j001r99m90R55J370P70p07j165l72
2427f85J54Q30O42J22l86r21m81M91K93M55J02n82n55m37J54R28Q49o3p23j003
2447h16m70P72J120K87l43j335r25M29J539J330l63j550j391p5J213J711M06j118
$$ y = [681, 1203, 263, -810, -1871, -1185, 707, 1743, 1183, -233, -1383, -984, -140, 937, 1180, 158, -895, -1174, -957, 41, 720, 749, 72, -694, -899, -639, 261, 1025, 1179, 681, -385, -853, -36, 909, 1400, 998, -98, -980, -1438, -374, 1118, 1252, 24, -1597, -2073, -1210, 494, 1527, 765, -690, -1646, -976, 498, 1741, 1431, 328, -895, -922, 250, 1147, 1504, 790, -445, -817, -687, -47, 246, 198, -637, -1023, -1663, -1032, -254, 378, 484, 57, -709, -520, -199, 622, 1440, 1377, 466, -549, -466, 72, 1516, 1666, 632, -809, -1671, -911, 233, 1244, 644, -855, -1866, -1900, -408, 1007, 954, -47, -1046, -1536, -581, 789, 1559, 852, -313, -685, -531, 299, 941, 1063, 677, -244, -725, -234, 59, 514, 616, 34, -521, -958, -804, 124, 973, 910, 187, -816, -1286, -514, 606, 893, 550, -785, -1710, -1281, 258, 1588, 1225, -325, -1716, -1791, -578, 1133, 1539, 421]
2465D21j172o72Q94J139J014o10j102n57J0N86O70L04o60l95o35R9O18M43J04
2484D99j12p92m14J25P05O91K42m52q36p91O81J082J061l79j157j076j33J301
2502B45J105L2j105j309n69J182R27O81q99j317q42N57J401Q81k94q99j137L59
2520a001N12J101L53m38n70m92K09O47L01L9N3o47o42J66M55O76P21o31j086o75
2540i49K13R64J092j09r21j367k17Q96J237M09o64j451q32P79J121J074p33r68
2558d26p83j32J325R45m8p09r50k72Q94P63K96m66p09m56j53P10L30K46k40m61
2578b96p10M3O75K54Q38l12o65o80OQ37J211M36j335p14l22N19J463Q83r32j427
2598b28q92L02J296P81k86j280r62J02Q05J126k00o14p81n36P13N77N36l33o03
$$ y = [421, -751, -1423, -529, 610, 1624, 1014, -88, -645, -635, -49, 621, 925, 265, -130, -765, -666, -48, 395, 499, 387, -405, -819, -694, 11, 702, 944, 492, -344, -1135, -454, 628, 1689, 1310, 153, -923, -1056, 245, 1350, 1382, 277, -1032, -1601, -419, 508, 1189, 290, -1027, -1869, -1312, 89, 970, 676, -223, -1360, -1001, -489, 612, 965, 527, -43, -535, -326, 321, 622, 661, 714, 67, -575, -409, 46, 722, 1443, 812, -274, -949, -736, 228, 1320, 1211, 290, -1077, -1294, -398, 839, 1248, 584, -867, -1699, -920, 201, 1275, 542, -426, -1209, -1341, -16, 929, 881, 172, -778, -1050, -156, 607, 903, 437, -272, -728, -881, -171, 159, 405, 165, -296, -1006, -963, -288, -34, 804, 492, -173, -853, -847, -10, 1201, 1637, 302, -412, -734, -215, 1248, 2131, 1199, -228, -1120, -818, 478, 1259, 973, -307, -1269, -1167, -362, 764, 564, -50, -831, -1367, -654, -77, 459, 126, -477]
2617d77j26j39L60O91K12l02j51m94l71M99K82Q12q6o40p72k72Q38J088K58o19
2637E91j158o79P70J089J200r45j110q62l3J313J019r2q13j349o1P71J127K53
2655A031q32l15p41L93P70N34P2p45n37k97J45Q70O4L8n57l52o40M28O42J52J12
2676B35o00n90m46Q62R04K82j60j176n39O83Q59J068j91r60j020P3J101J123k0
2695A488r21q21n38M10J267N19q02r73m98L78K94N02J94n30m68k52L12M73M77
2714E11M0n30l62l07M39L63K97J7m72m38l44M35P05L44j41p93q75K22P40R53L07
2735A111j219o20r25J113J450O5o06r98q21O85J184O07k69o97p70j43R74O41Q4
2754H46m13p23k77L30M72K32M18m90m32j90n9L20L78K50l68p05o00K92M91P79
$$ y = [-477, -603, -742, -382, 309, 521, 219, 68, -426, -797, -298, -16, 796, 710, 70, -702, -974, -136, 952, 1210, 591, -567, -1246, -476, 613, 1813, 868, -242, -1104, -1137, 176, 1195, 1103, 290, -1059, -1120, -349, 778, 1031, 199, -116, -857, -464, 306, 840, 912, 167, -370, -667, -522, 348, 412, 450, -107, -459, -1099, -671, -29, 123, 235, -365, -955, -1401, -539, 365, 647, 487, -689, -1228, -545, 314, 1382, 1191, 231, -789, -716, 385, 1508, 1488, 567, -254, -792, -382, 885, 1404, 602, -371, -869, -491, -197, 305, 499, -31, -499, -751, -439, 34, 511, 551, 21, -341, -648, -209, 154, 451, 468, -4, -442, -786, -351, 354, 698, 557, -236, -1111, -889, -149, 804, 1111, -108, -728, -1653, -540, 910, 975, 369, -629, -1450, -765, 419, 1026, 757, 60, -710, -853, 121, 762, 846, 433, -290, -567, -237, 235, 467, 885, 395, -37, -227, -286, 34, 412, 662, 294, -411, -1011, -719, -228, 551]
2774E51j0q82p18N1O81J073P8o56q02p41R27J090N97n58r86p77M37R29J105j72
2794A217j333n16j57O65P91r9k82n77n24J69M56L43L68m51l69k20J62J26M92L73
2814F34m32o53M1Q3O16M66K17p46o14o52J084R15Q2l59j018q12M50Q38O98j55
2834F83r35p88J25O77J019Ro83q39k43O96N84M35k49q43k58L03L36L45J98l51
2854B21l25L9l79N08K96J75j84m37l01k98N70M88J98m60q19j95K80Q43K79k32
2874B67q51o12L03Q69P14Q5o94o87l87R21R43M28m22j111n16N11P56M65l21p64
2894a03m21n2P39K66j88K30p17k32nM1K56K20J10k56p23K65K86M73N46n97o53
2915e15m01N20Q02N47j11p56q03n1Q83R02N5q08j014k94O77J201Pm67o17q22M06
$$ y = [551, 541, -341, -1059, -1008, -327, 746, 824, 168, -634, -1375, -448, 642, 1239, 681, -305, -1082, -645, 284, 1389, 1217, -116, -632, -789, -124, 667, 568, 286, -291, -815, -646, -190, 153, 521, 70, -299, -519, -357, -231, 261, 634, 202, -451, -410, -327, 289, 755, 972, 226, -388, -1040, 44, 959, 1041, 682, -336, -1148, -698, 140, 838, 683, -252, -1040, -915, -238, 781, 790, 107, -732, -975, -279, 305, 740, 491, -352, -610, -307, 29, 374, 572, 221, -104, -65, -444, 64, 360, 535, 351, -86, -387, -685, -115, 373, 571, 111, -708, -903, -623, 220, 499, 267, -584, -1196, -893, -24, 690, 775, 81, -606, -993, -72, 871, 1299, 877, -234, -750, -239, 517, 982, 661, -103, -524, -576, 163, 429, 241, 471, -246, -478, -483, -442, -186, 34, 144, -112, -835, -570, -284, 189, 735, 138, -515, -916, -396, 406, 953, 842, 86, -717, -768, 115, 1017, 1072, 264, -750, -1044, -367, 834, 841, 374, -243, -1065, -659]
2936f59P79N63k22m50l32k35L43P46n9o5k61m57J44L95L02j37N8m31l74j06L01
2957a57M99K23k74n66p57J29O64M85K91p74q02j11O30Q40K83o61o99m21N53R21
2977B96N55j12r11m42J02O05O18J76n69m09l59K54Q67J19k35n42l23N5L35Q4K3
2998A87K18m06m91j02N87J13L89K1o56r46J25Q86P68o7n33q49l96O79R89J98m28
3019B86p16m75K51N39Q36L8r35o54j38O66N10M11n32n14k39J27M79L18K6l68j1
3040i5j26J21L85L01lk00l25j50M03J21L62j36l74m89j92N62M34M01q89n44l38
3061g71J67P28M89j42q75p24j34Q60R17j1n80o33k81N19R08J20k44m25m18K35
3081b95L85N20Qo37Mj88j79M35K97k9m10j76j12J8P07p6K27l12p45K44K1M68O28
$$ y = [-659, 120, 683, 461, 11, -321, -556, -213, 533, 474, 409, 148, -309, -165, 230, 532, 395, 453, 22, -352, -458, -157, 342, 565, 291, -275, -1032, -903, -239, 246, 537, -237, -1039, -1150, -520, 320, 603, -58, -757, -1178, -625, 296, 851, 739, -172, -614, -512, 93, 711, 887, 318, -91, -450, -196, 671, 790, 555, 13, -310, -255, 80, 164, 187, 405, -1, -492, -594, -7, 106, 495, 516, -140, -1086, -961, -75, 693, 626, 93, -756, -1152, -473, 516, 714, 286, -430, -905, -654, -115, 721, 759, -176, -830, -968, -302, 208, 619, 87, -427, -666, -539, -60, 258, 284, -84, -95, -221, -100, 285, 586, 583, 383, 58, -92, 311, 432, 794, 658, 284, -205, -397, 165, 599, 1000, 111, -433, -771, -604, 124, 613, 471, -404, -1128, -1262, -402, 515, 504, -76, -709, -990, -471, 437, 557, 313, -112, -530, -295, 90, 610, 618, -19, -15, -203, -382, 53, 350, 321, -89, -265, -377, -359, 348, 272, 499, 187, -558, -314, -293, 175, 803]
3104H03k67p87l62L02P42M57r6p60l65o15O90J004m7n39o27l02K77O34N46n62
3124A26j95n16j74N28J98K45l69l12J7Q9O7N86l16K2j89Kj96M92L37K32m23l35
3146h4o09L79N62M23K58r47m14m5O24Q05j31o71p56l84O94O04K78k00p68k84J13
3167e53N92N97l13n11l50j20O20M54l9R1n62r7k35P66K7m9pm96j98L30j43N22
3189C26j48O8m76l95K4M71M77J43n24l09k62M36O42K53m33p12q9J40J148M15m12
3210G83p38q23L63N59K99K34l63n96k60K06Q08m9m22l30k54M7N76L45l23J65l06
3231g9j63n0K11K26K60n8n00m91K89K54O39n6k31n65k50M59O46L02k08q84j29
3252c78p5Q53L01j06p24m78r7P49K78J96m81n91k33M73K62P08l50k98l04J3N26
$$ y = [803, 536, -251, -613, -311, 431, 888, 792, 32, -333, -948, -258, 746, 699, 160, -467, -769, -492, 142, 688, 126, -69, -585, -759, -231, -33, 212, -157, -469, -452, -363, -296, 290, -26, -4, -193, -191, -387, 105, 442, 674, 251, -84, -693, -314, 248, 671, 929, -18, -432, -477, 147, 952, 821, 150, -606, -990, -296, 308, 586, 386, -382, -666, -553, 39, 636, 323, -188, -538, -658, -38, 416, 377, 468, -94, -191, -426, 340, 367, 318, 311, -185, -383, -53, -196, 326, 178, 246, -230, -625, -601, -130, 347, 490, -34, -343, -605, -169, 473, 726, 293, -419, -508, -368, 780, 1195, 783, 45, -778, -415, 144, 443, 677, 314, -282, -542, -336, 472, 423, 1, -329, -583, -536, 40, 385, 62, 227, -79, -242, -292, -81, 145, 405, 347, -153, -644, -355, -101, 538, 482, 251, -314, -564, -105, 541, 843, 635, -249, -378, -453, 400, 701, 595, -129, -607, -704, 45, 323, 519, 38, -553, -786, -313, -51, 657, 307, 9, -295, -282, 244]
3273B44K8L55k93k81k20R1K13K06J00j0m67k53j77L18J16M01k14p58k31L15O32
3294A15M41Q3j062o2j14O19O83J93p84p49J17N68O76O3l95o24k89M10K21N01m9
3315E62q26l70J73j9M94K87k24l95O9k01N8L55L04j22L4o18j06N34J97J72n6n25
3337b23k91K53L54M30J29m46p37J91L77N18K18q17l46k01L65L47M37l76l76m91
3357f85L43O26J77Jm86m22Q0rL03K89O6l00m51K89oL80P3N3j11j98l17K93L11
3380B99J94n3n27k38j11M54L39J81n86m23l63M59O85K29l32n84k98L15P43L23
3400G06M1m58o16K92M86K01m2m26l30r9P9L93j24j77JRm12l2K49K65J17j77m35
3423d89O9J81K12K86K0j76n99L6L90O09N6j16q86k87K62R12J41j52p46j74L08
$$ y = [244, 272, 627, 334, 53, -167, -76, 137, 343, 443, 433, -34, -287, -464, -146, -30, 371, 157, -601, -832, -517, 115, 556, 639, -423, -485, -599, 20, 703, 896, 112, -637, -520, 48, 724, 787, 392, -232, -521, -111, 110, 611, 562, -264, -634, -461, -480, 14, 301, 77, -318, -249, -450, -392, -37, 267, 145, 179, -439, -545, -11, 186, 358, 302, -223, -514, -261, 93, 523, 652, 206, -531, -340, 37, 555, 773, -44, -390, -591, -226, 121, 558, 182, -194, -685, -342, 284, 461, 462, -24, -446, -366, -375, -72, 217, 283, -17, -468, -179, -185, 195, 268, 321, 210, 12, -305, -12, 299, 493, 440, -87, -325, -436, 18, 357, 538, -48, -471, -834, -375, 310, 539, 207, -377, -675, -360, 383, 706, 747, 289, -327, -35, 451, 652, 610, 184, -146, -245, -166, 227, 103, -74, -73, -64, -476, -508, -259, 6, 123, -54, -489, -420, -239, -27, 259, 279, 103, -496, -460, -70, 539, 595, 479, -407, -694, -432, 480, 621, 469, -277, -451, -143]
3444a43J44M22j37j33n63J79pN37L10m50m01m2P7K05L92l01J38l41l6j17M59j64
3466B8M9m9l58K09K1M5N12k03n4n55k20R1N43M11k54n28l62J62P27K08j7n60m22
3489e76J59K02L14J85O5o40L09r9M54L86m00O2n19J3M42Q3m1l27o0j07J01J91
3511A97P3J97l41k78l43J45O9O19l44Q4n57k85M71N82r7j20j43k54L9L76N45m5
3533E90l90m51J11K33L27K03k71q26J57j0M96K82l47p2n79J82M51j05L59l68J7
3554a1j5LJ76j83K98K7k69l26L69o4L48p3k10l8l41J33L29N9L24p22m10K38M40
3577H2J96R5k38n12k90l4O31L95k32m52k00J36M87K92k01j98k45J39K50K47J89
3598E37m29j36m1k18L08K88k5k38l5Nk44O0K29J35j31k11k04%N91j5J99n44l03
$$ y = [-143, 1, 423, 286, 153, -410, -231, -238, 299, 609, 159, -242, -284, -207, -2, 390, 89, 227, -114, -150, -267, 192, 28, 77, 28, -330, -121, -100, -55, 457, 254, 200, -355, -575, -484, 59, 470, 216, -312, -674, -512, 215, 423, 406, -154, -576, -417, -215, 99, 284, 349, -291, 18, -81, 373, 759, 359, 421, -98, -85, 357, 440, 399, 72, 12, -95, 6, 197, 270, 467, 126, -152, -495, -350, -281, 338, -6, 78, -479, -764, -293, 289, 192, 72, -71, -325, -286, 90, 635, 590, 200, -251, -140, 93, 420, 623, 352, -474, -317, -327, 169, 451, 104, 32, -547, -365, 86, -19, 340, -28, -11, -26, -23, 153, -30, 268, 295, 26, -300, 69, 5, 353, 280, 70, 32, -309, -176, 153, 212, 536, -186, -596, -358, 82, 278, 373, 135, -377, -667, -701, -70, 325, 93, -359, -559, -423, 64, 356, 155, -43, -288, -149, 101, 348, 537, 108, -28, -69, -287, 21, 309, 284, 46, 11, 16, -228, -168, 61, 196, 65, -146, -350, -350, 241, 226, 425, -119, -422]
3621d22j71M35M78K61m84l16m43K14O18O4J89l52o49K53N84K63nn78l36J21K60
3642a6J95J89k17k04l00O4J88n5J65L38n09oj3J16K09K33L6r9k92k40J87L65L94
3665G28n15k55l33M10L10K03k8m51o39L07M40K35k41j29r14J75N65J97J65k69
3685c9m22k38N42M43J37k9m28j62k06M02M35q3J85m17j94J66j70L96l0k87qj00
3707a07k22L41L6K71m8m88k50P0N96K89Pm60o20J57M37M86k00m4l51o74R08K8
3729A62K23l06k48kj19K82J71J02rm31O9J67R8J71k03P5j22k01o4K24J71j09j00
3752Al63J37L6M01N2N6n52Nj63M38N21j21k03n70j07M73K98L22m14m28k71J84
3774b68N37q7k7n11k65K89R4N06j99M4m48j05R2L65J23J78P6l46J48k90N71j16
$$ y = [-422, -593, -158, 320, 581, 97, -219, -662, -448, 170, 234, 423, 71, -578, -325, 259, 522, 517, -61, -397, -276, -16, 179, 368, 151, -53, -353, -289, -101, -156, 9, 347, -162, -168, -181, -65, 144, 377, 413, 314, 22, -218, -31, 334, 728, 213, -42, -375, 35, 345, 548, 520, 69, -570, -263, 177, 412, 171, 42, -872, -697, -132, 65, 230, -39, -461, -699, -157, 286, 423, 394, -34, -196, -402, 0, 435, 352, 537, 120, -74, 92, -78, 318, 288, 1, -7, -107, -329, 12, 48, 319, 271, -217, -467, -397, 199, 488, 495, 35, -585, -428, 9, 495, 295, 251, -100, -774, 134, 162, 385, 79, -169, -171, -290, -8, 163, 265, 256, -175, -106, 61, 159, 330, 127, 202, 80, -121, -185, 39, 210, 101, 1, -362, -225, -189, 212, 264, 320, -232, -227, -390, 48, 569, 448, 245, -325, -432, 41, 339, 661, 247, -181, -452, -268, 269, 182, 155, -356, -621, -332, -238, 268, 69, 113, -335, -440, -348, 17, 140, 318, 394, 48, 196, -94, 477, 361]
3796C61j37J87m35k43J57K94Q2l6n64p7K0P6N81k76Rn27Q7L95Q7N52j46n17k84
3819c54K43J87L66R5o25l52J74L39n3O8l01M3o1O1K72k94L03r3j59k69L72jL94
3842C55l50J24j02j34j98N62J93k72Q5m70R2PK30K60k35l00l02J66P32J63l07
3863B99l75l46L51J61M22J07o51l08j18K00K31J88j44m00k0j28M16r8Q2j27j77
3884d35N7J69J74K95j12K47l01J05k75M48M5j53l5l20L03p7KJ27j42m28J48k12
3906c70L27K80M5l31l31j17L02Q14j88k09m45J80R3L95m2j17l12k22K54k32R2
3927a34L9J30o8l53MM0M50j58r5n8l81J86J62L59J30J0n72J78K04J84L04l20j33
3950A08k67k11N46O6J70l97l69MN18o2j2M2k24k61O9M82K9nj96l32R3J58J0K91
$$ y = [361, 224, 411, -24, -267, -110, 184, 266, 230, -334, -411, -391, -315, 266, -10, -1, -528, -441, -46, 41, 593, 447, -70, -354, -111, 76, 442, 537, -88, -440, -266, 73, 20, 88, -213, -170, -231, -170, 102, -192, 111, 18, -141, -410, -38, -39, 355, 5, 129, 27, -107, -305, 257, 450, 178, 263, -207, -115, -108, 122, 382, 147, -153, -455, -289, 443, 606, 299, -76, -422, -71, 90, 512, 619, -32, -340, -458, -258, -27, 161, 17, -383, -403, -531, -115, -213, -131, -258, -435, -378, -209, -35, 260, 148, 395, 94, 199, -76, 372, 417, 264, 229, -91, 212, 135, 137, 264, 122, -306, -158, -370, -43, 237, 282, -49, -380, -497, -195, 619, 431, 222, -223, -43, 50, 445, 403, 286, -26, -248, 6, -226, -134, -95, 35, -33, -386, -382, -342, 108, -50, -145, -203, -584, -398, -236, 123, 253, 263, -309, -131, 73, 257, 561, 241, 108, -159, -370, 176, 242, 412, 15, -354, -350, 168, 106, 94, 136, -88, -349, -280, 202, 231, 226, 30, -302, -209, -51, -41, 250]
3974B50o80K58j42p3R6O2p2L71l16j53PK93J98k0j3k45k53M41L88K6J85l94k89
3997g5k24K23L66j22J10o21l12L65R0M52k16p0l37K22L00J80%j26k77j13J40K46
4019B01K20rO6m24k60K64J81j77r0J65k19k43J09R4MK10n10l7k0M45q7M28m14
4042a03k8n0P1L82J59k47l03r5P1L12L22k33k23k3j80J57P9M7m18j42J39J53L84
4065B31J09j94k17m3m7J24J05J07l11L34l46j31K48K23Ok49J25p2l76L71K19J61
4087C77j50k35k96K41K50K80k57l17l84J60L90J2J06j95k12j85K75K82J20l70
4107a08J28k66P8K22K13o1j71j39J98j50N2J71J15l00L8O2k32L10m7M8k29j57
4129b25p2K69j15L85k11k89p8K62o2L64j01l19j5j97N68l1L92k08m11q6J33L37
$$ y = [250, -430, -172, -314, -387, -291, -229, -301, 70, -246, -399, -392, -99, 99, 79, 66, -179, -432, 9, 397, 423, 608, 214, -75, -299, -76, 290, 168, 278, -343, -655, -290, -200, 252, 36, -34, -371, -149, 151, 331, 331, 205, -72, -185, -45, 201, 421, 412, 478, 54, -206, 58, 239, 62, -28, 137, -82, -325, -216, -122, -118, 92, -418, -455, -475, -30, -117, 311, -103, -131, -181, -110, 272, 431, 184, -119, -214, -143, 169, 491, 258, 35, 12, -168, -11, 68, 115, -303, -445, -306, -153, 231, 340, 146, -71, -114, -161, -37, 68, 175, -136, 198, -148, -279, -31, 192, 198, -51, 74, 2, -374, -3, 216, 377, 227, -8, -304, -63, 187, 467, 210, -107, -491, -331, 59, 71, 177, -18, -230, -415, -140, 142, 262, -108, 20, -246, -168, 54, 267, 206, 35, -104, 94, -56, -4, 167, 282, -18, 20, 82, -150, 160, 113, 161, -68, -225, -297, -28, -143, 242, 31, -258, -336, -74, -136, 228, 127, -192, -207, -404, 164, 133, 525, 317, -94, -180, -47, 290]
4151B90J50k48l04j4j09L70L21k26m55Q5j05J81j92%J18K38l19O7l5K72r2J57
4173A50j31r0O8j95L55J14n5k04q8j31J74L50J57n23j22o8o5L88K06l54k87L17
4195c4j91M44J63l49nk56K72J73n9K87m35j78K0K21n9J65j72J7K3L0l19J35K32
4218A25Q0j81k25r8j08L77K34j33m0l36l4J41M11o0p0k13l69K55L81K36k69k59
4240a55k53L86N9Q8p4J9k66Q5J74L8P6Kk22N0p8L17o1K7j50M8l28R5K43j19k5
4265b4l3j73j86J51J49K03l0J2l93J99M2M54n5n2j25j77J4M8J8K34j67l98J9K47
4289b3K19q9k23R3m80K18L51j38J81k04n7J44j05J95k70L70M7J31j95j58J37m3
4311A01n8k8j72rj40N95k52L0l2l82J59J81J21k72L7m35J18O20k75M24m76Rq6
$$ y = [290, 440, 192, -112, -126, -235, 135, 456, 230, -225, -140, -245, -64, -256, -256, -138, 100, -219, -152, -187, 85, -7, 150, 19, -71, -3, -198, 157, 271, 216, 12, -76, -207, -33, 317, 474, -49, -171, -239, -304, 84, 290, -64, -351, -34, -225, 219, 382, 33, 28, -228, 44, 217, 158, 445, 10, -168, -148, 73, 14, 179, 7, 24, 47, 77, -242, -107, 125, 205, 24, -201, -299, -407, -30, 204, 71, 31, -305, -339, -198, 213, 153, 83, -130, -499, -244, 137, 373, 104, -155, -408, -22, 37, 125, 51, 70, -196, -111, 63, 101, 177, 179, -43, 7, -71, 246, 185, 212, 62, 110, -218, -123, 120, 1, -24, -57, -230, -416, -265, -116, 87, 57, 69, -324, -125, -83, 371, 316, 264, 139, -38, -24, 24, 42, 276, 109, -289, -270, -23, 196, 107, -116, -23, -503, -285, 66, -72, 109, -95, -152, -8, -113, 82, -188, 182, 229, 360, 165, 7, 144, 101, 43, 15, -157, -166, -306, 289, 37, 67, 35, -347, -188, -7, 114, -158, -121, -556, -438, 182, -93, 331, -145, -136, -222]
4334b22K19J10J35k46N4l24L14K15o5j51M7j46j61L40J04oK11m38j7N7J30J50
4356C10j25J3p0k2m72J90L05j24L8j92k82O7M21J30J07m02j03M8M15J93j15l60
4378c0O2l25K75L75q4k85r5j07L2M46l10K30k67j78M7N9J63j22K7L0o3j06L07
4401H1k20L30J6k13l8j33J31J71J69k80j13J27l20K26K24J4l18k53L5N08l19L18
4423A43k40j94p2L17k8J83jj13j74Q0K78p8P2m3l40L9J52r6Q2m7N6k4L3j84K58
4448E9j54L4J87k64j98L34j58M32l55j45p4J44J10k7L07j59r9j88jL44M1n9l78
4471b67j39K56K66l58N62j05l66L38l8k02M06k92l57Q7OK46l58L87j61J66j92
4492a15j59P9K18M1j65J24k01J7J76M0J76r3j76j11K52P0K78l00j41j49J71J4
$$ y = [-222, -3, 107, 242, -4, 50, -274, 40, 255, 190, 39, 86, -60, -221, 119, 223, 217, 428, -10, -27, 30, 160, 310, 185, 198, 128, 106, -366, -176, 129, 5, 43, -149, -431, -364, 57, 187, 294, -108, -211, -163, 252, 445, 330, -30, 32, -293, -18, 357, 273, -12, -107, -214, -182, 264, -46, 184, -83, -261, -214, -155, 8, -114, -87, -57, -120, -226, 81, -139, 191, 207, -6, -44, -177, -46, 125, 294, 14, -99, 28, -292, -66, 158, 172, -146, -399, -364, 144, -175, 143, -97, -291, -363, -46, -74, 109, 108, -5, -179, -99, 179, 101, 173, 130, -210, -171, -19, -115, -33, -80, -24, -48, -15, -199, 59, -95, -61, 126, -138, -336, -2, -160, 272, -83, -228, -302, -158, -48, -75, 232, 73, -26, -214, -215, 129, 170, 111, -267, -406, -150, 116, -242, 320, 215, -151, 187, 149, -53, 353, 61, -296, -209, -203, 43, -315, 72, -89, 77, -115, -274, -195, 23, 64, -101, 23, -178, -161, 15, 55, 231, 138, -38, -149, 103, 173, 451, 151, 10, -139, 32, 46]
4514D6K75K9m01j17k4N13l79L36m78j10o2M25m8J67l4j84r1J30p5J74J20r9q0
4537C3K8o0J07m6k4J47j89%j05p6J77J21M5k27m9j33L15k68K57p9r3r8J48M22
4561C53k63Q7m94L92j72K04Q8k39j79n6K06OJ70K40j71m10K81N9p5j72J61r4Q8
4584A0q7N0p8J33k9Q1j3j61R7J26k55L92k04k06K96j16L40l30J07k37k41M98J84
4607C57m2p9l61M9J01J5j24K88n55J25Q3R4K05k80J90l34L3L39j05J59l5m02q8
4630c67N14L0M7n2l52K09r0k19J19J94LJ38l13J40K5j11N61p05L39j08j25n2R7
4653g8J70J05k67k62L60J19q6L3k70lQK06J81Q9l18M6j9j53K72J33q0rJ01k12
4677F6k76K78j26Oj1j73j0K39j02q3K92j31j54m5L31j62M20k14l58J53K8L19r6
$$ y = [46, 321, 350, -51, -168, -192, 321, -58, 278, -200, -310, -372, 53, 5, 172, 138, -46, -137, -7, -82, 92, 212, 113, 33, 61, 1, 108, 62, 38, 185, -4, -4, -109, -185, -8, 113, 158, -69, -118, -251, 64, -204, 53, -26, -119, -217, -69, 353, 90, 177, -317, 75, -97, 107, 195, -44, -223, -279, -73, -67, 103, 343, 172, -238, 43, 102, 27, -145, 16, -78, 10, -77, -27, -105, 28, -1, 80, 67, -94, 3, 129, -126, 266, 62, -144, 152, 36, 376, 46, 153, -84, -325, 173, 357, 315, 236, -125, -76, 25, 40, -84, 204, -351, -226, -143, -49, 156, -124, 66, -268, -235, 104, -1, 158, 123, -279, -367, 147, 177, 224, 172, -180, 29, -61, -280, -161, 33, 36, 174, -139, 1, 26, -85, 476, -229, 110, 2, -123, -175, -78, 92, 197, -70, -332, 28, 147, 61, 94, -176, -179, -171, 35, 216, 305, -13, 33, 14, -139, 133, 266, 186, 177, 278, 66, -210, 68, -58, -52, -63, -236, -246, -7, -109, -192, 100, -31, -185, -230, 101, -61, 359, 145, -213, -60, -32, 287, 191]
4700A91J54l81o6p0K98K77k44k02K77j74k26J9J69N6j95J58L4j79L7J33r1k01
4722b26J9J67N7j05J38l6nl9j04Q6K6L03k08j35l2K6L23J78l91j40k7M2K19l8
4746I8J30l31j08K87j77L05Ok61j11J17k17M04r2J39j66J01l11J14J80k53M90
4767C44n79L57k59J19J40l55K51l33Q2M4K59l19L26m58J19O4L2J49L2l4m8k0m3
4790a30M7L74n0l05r6p0K56J28P1m27M59n15K4K36J65j17n7j13J3oj0J36R0m16
4814c13J38J49L5N9p1j87OK46MN7J40k06qp7j34N9K62L04j58k43k19J41j16p1
4838b03J14M8k37J23J29J74j78J81j73k43jK69L0J32k14k88M64l50L04J91l72
4859a00K26m7n8R1j76Q6O5n8m3O7O0j81J13P4j53J62k46J64j5k12J53j20j4K00
$$ y = [191, 345, -36, -102, -172, 126, 403, 159, -43, 234, 60, -166, -147, 22, 78, -117, 41, 75, -104, -67, 66, -25, -226, -207, -40, 17, -88, 50, 14, 9, -30, -134, -48, -22, 281, 73, -62, -94, -68, 255, 433, 42, -98, -125, -83, 136, 98, 228, -103, -211, 76, -101, 204, 210, -51, -162, -45, -262, 142, 50, 189, 23, 124, -187, -73, 107, -146, 344, -235, 122, -137, -18, 122, -233, 18, -315, -233, -189, 70, -249, 77, -381, -262, -198, -166, -17, 15, -19, -67, -87, -130, -83, 291, 241, -64, -160, -230, 26, 154, 225, -202, 257, -258, -234, 2, 167, 50, -7, -120, -107, -113, -123, 13, 103, -313, -175, -26, 9, 68, -3, -190, -184, 62, 66, 123, 263, 57, 49, -28, -162, -103, 159, 463, 305, 62, -157, -16, -132, -203, -89, -41, -278, -155, -26, 148, -30, 151, -22, -265, -266, 3, 33, 165, -49, -337, 127, -223, 81, 272, -100, 126, 79, 21, 112, -64, 22, 87, 29, -14, 53, 113, -68, 45, 119, -34, 128, -118, 46, 31, -181, -28, -148, -162, 38]
4883C8q8l8J23k18j0K74Q5J82l23O9k40K73q0L02l83j40j2K38j90N1K17l42J46
4906f6k9J73l3k51L03j94P6J75l06J73K6%J74j41j08p0L6M06j41j61L3l51L64
4929H8J87j3k27k26J19j2R9K97o6l68j22K15n3R7k3k3P9k14m6K19M10n58P0J9
4953e2j15J35Jj63K11Q5p2r1O0J53j7q7P1k00kO5J98j93rJ54l29O8r9K99j6k2
4979C3j36l56N12J88m19K20l75J95P6K0J74o9k65J47J52n2J20r9P5j21j89J84
5001A5P8j49L2N2J1j01K8QQJ00r7j1J12j07j45J81j35O1J49R2M9j83P3k45J25
5026Ak11R5L01r0j65K2k85k5J65K19R7j05n96L78J78O3L4k60J96RJ93m08N6J21
5050a7J30P3j7j38J6J10K9k24K11N4k76M8O0J57l18Q3j37O6K05N8j60Ok61O3J38
$$ y = [38, -50, -88, 35, -183, -193, 81, 166, 348, 25, 94, -146, 127, 47, 349, -34, -174, -186, 52, -138, -87, 130, -212, -66, -95, 78, 45, -206, 97, -97, -21, 154, -152, 21, 47, 47, 221, 80, -28, -98, -62, 344, 203, 42, 75, -276, 88, 275, 262, 35, -191, -72, -84, 15, 312, 246, -122, -244, -29, -82, 15, -8, -31, 48, -166, -212, 7, 417, -141, -71, -52, -167, -32, -31, -194, 17, 102, 30, -61, -1, 152, 135, 48, 119, -81, -83, -18, 180, -13, -22, 132, -197, -129, -228, 71, 55, 33, -103, -459, 53, 241, -178, 42, -333, -138, -62, -42, 132, 63, -202, -55, 97, 45, 165, 66, 141, 20, -169, 15, 93, -56, -24, 28, 39, -62, -34, -26, -18, 82, -15, -26, 86, -21, -166, 15, -120, -59, 90, 182, 231, 48, 121, -124, 1, -210, -115, 186, 96, -69, -47, -332, -357, -192, 27, 124, 19, -577, -199, -21, 42, 76, -184, 12, 21, 214, -194, -138, -17, 113, 186, 169, 31, 47, 157, 186, -38, 173, 227, -49, -1, 59, 216, -102, -19, -156, -90, 115, 173, 13, 19, -242, -179, -41]
5075d1k29P9O3j57L33O9k52K29j42p7j01L7K86k1q0k89K75K41l62K81k13R3j10
5098h8J54j5k4J52j06j65K28k40k9j74L52J4o4O6o6M6j10Q5r6L6j09K7N4J59k3
5123F4k39J7o4K53r6M4n1J7k9k84L38J49k08rj97K05M3J50r5j47m9J11j05J15
5147f7rR9k3J17J28j19j76N4k3m9m9K1k68M75q6J58j38k29K22L2J70l39K86k32
5171d5r8M36j64K57m34J86l47K06k7j13J23J07P4j05j5n6J10j41J44j46j15J03
5193f0K85j94m9O9r1O6k69L30M5j64j15J81j65k9K69j3n7k09J53r3K66r2j70J36
5217C0P6Q0j97K33j53qJ6m23O16j52j6j32l3K90l25K2L6J0j47K02k36K82K13j61
5241A23l1J16m0N8j52n3L3J10q8k34J26l0J91j61J36k93L6N0J47J11j70O4k67
$$ y = [-41, -270, -191, -128, -285, 48, 117, -135, 94, -48, -125, -226, -189, 97, 76, -4, -293, -18, 223, -139, 142, -71, 22, -88, 66, 51, 27, 179, 73, -92, 136, -104, -133, -307, 45, 59, -5, 61, -5, 41, -69, 16, -80, -44, -153, -126, -72, 87, 64, -175, -158, -222, 31, -65, -21, -72, -55, -84, -368, -30, 119, -89, -98, -295, -90, -47, 103, 8, -139, -188, -77, -182, -67, -76, 23, 0, 117, 245, 126, -50, 4, -19, -68, -117, -96, -364, 111, 25, 183, 45, -184, 38, 70, 240, -99, 187, -45, -143, 293, 129, 386, -48, 138, -209, -3, -30, -143, -20, 87, 161, 56, 41, -15, 95, -46, 98, -48, -163, -60, 225, 31, -18, 51, -40, 26, -243, 87, 132, -32, -147, 34, -131, -160, 109, 96, 39, -170, -17, -110, 156, 64, -106, 30, 106, 186, -11, 222, 69, 61, 77, -346, 270, 118, 102, -30, -63, 227, -98, -76, -40, -30, -177, 25, -211, 71, 284, 123, 92, 208, 168, 226, 74, 21, 54, 164, 76, -158, -32, -62, 129, -32, 104, -189, -153, -103, 44, 155, -15, 49, -218]
5264b18K69k05K30k28J54l13M04J69k80K76M9n30J55K20k60J87J12q1j95K88j34
5285F9j32N7K35k26K4r1j3M3J77k56j26L48m18K85p3J93L7j4j93k6J49RJ7j98
5309a23N1L5K21rj2k37j36K37j68K14n9J80j19Mk2N6j0j1L0J22k81j89K37O7K65
5334C43l20o8J67k47j11K50k42J85K67m90J48M1J27n4n3L7m1l8O2R2k30M4J18
5357a3J74j73Q7l80J58J28K29p0J5r1l0q5J14j31j09K54p4n3j36J10l0O9J1N9
5381C3J59j74L9j99L15J5j33r5J21p3JN9j00j64M5K91j21Q1l41J89l7r4J82K15
5405B14j49Nn7j3J73q1n8J72l10k03K48K54k94J1M3J87K0m36O1K56Q7k24N6j86
5429b24K12j64N19l60J10j68j73K92J64j09j60J91l23J67n5K65J17k37k25j63
$$ y = [-218, 51, -154, 76, -152, 2, -311, 93, 262, -18, 258, 307, -223, -68, 152, -108, 79, 191, 110, -85, 203, 69, -63, -6, 229, 3, 27, -64, -77, -34, 143, -113, -239, 109, -309, -24, -97, 96, 133, 119, -74, -100, 49, 58, 75, -123, -72, -37, 184, 175, 163, -74, -210, 27, -141, 73, 14, 194, 75, 79, 57, 113, 103, 92, 122, 244, -37, -226, 11, 78, 343, 23, -45, 122, -125, -236, 14, -228, -43, 224, -266, -118, -77, 50, -4, -57, -20, -61, -99, -37, 55, -175, -131, -13, 161, -12, 75, -305, -147, -19, 210, 140, 155, 64, 34, -51, 63, -68, -177, 77, 3, -50, -186, -76, -106, -37, -26, 33, 192, 18, 57, -142, 173, 188, 55, -40, 81, 8, 9, 68, -32, -196, -151, 140, 19, 100, -241, -52, -89, -183, -1, 214, 65, 70, 13, 0, 173, 92, 34, 206, -104, -307, -59, 195, -99, -88, -45, 142, 162, -274, -213, 43, 130, -94, -38, -224, -12, -176, 343, -17, 93, -75, -248, 44, 208, 99, -61, 130, -193, -26, -81, 184, 301, 64, -161, -324]
5449c24K17J21j16R1m0k59L95j07L9J07j86jK68j34p9K37k34k54K85P7j38q9K86
5472A62Ql0n0J93j86j0j39L81l32K8k13J97Q5j85rm8Q4J3N6J43k19Q6O0j59J19
5497C5k29L13l2R4k80J54L0k18J48j03Q1P4K1k6j66O7k3J10l1j82R7K0l59K06
5521a99K51q2J32n8pJ3j99l0J79K6J55pj87j00J01J00m1J03k54J3K66K05k26j46
5545HK61l79L12j38k6n5P2k40L3M37m19K09K2j46k3j28L55j69J08m5n3O2J80k27
5569A1L0k10K08P7l38m8L45l1J5J88j70q6m1M6q5o0K75k67J08k71J24J8j75L41
5593DO1k90J21J4K27n0j04J42j59o6M6l1K09N1m9K9Mo2k34L01k24P6k9N1J85k6
5619A97l50M7j67L17q2j07K81k42q5K56l29K02j7n9L19k19j44L13j23P8m63K16
$$ y = [-324, -107, 14, -102, -11, -51, -310, 85, -22, 17, 124, -62, -63, 205, 71, -8, 229, -5, -259, 26, 103, -35, -124, 162, 170, 140, 90, 283, 97, 87, -52, 329, -3, 25, -188, 9, 94, -91, -100, -148, -64, -51, 5, 148, -71, 15, 75, -84, 35, -194, 119, 87, 181, -99, 55, 85, -133, 15, -88, -7, 67, 88, 62, -104, -37, -60, 50, 19, -163, -66, -46, -405, -199, 52, -30, 102, 44, 37, 50, -149, -179, 0, 26, 181, 174, -13, -113, -12, 88, 47, 150, -104, -91, 175, 380, 154, 8, 269, -110, 202, 64, 38, -17, 55, -185, -152, 285, -134, 75, 97, -49, -72, -200, 155, -14, 94, 49, -4, 58, 238, 11, 41, -169, 39, 116, -222, -270, 75, 44, 59, 247, 77, -9, -50, -4, -89, -149, 126, -141, -33, -304, -180, -162, -337, 4, 65, -225, -104, -90, 137, 87, -17, 125, -34, -100, -54, -85, 124, 175, 126, 155, 159, 97, -137, 164, -60, 16, -13, 38, 223, 197, -153, -106, -273, 44, -38, -145, 136, -106, -191, 65, -264, -62, -79, -138, 181, -38, -182, 131, 8, 86, -377, -161]
5641a61L90p0j4j10M3m9o5J0j86P7L00K9k6k14RK45k95K0K32l77L60l79L63J11
5665B43m58K77Q3j02L2Q9q8k16J62N0j25K31j31k22J47J01j37J53k4P7k85K67
5687A24r4M6r4L2j44j26K5M67k70Q1n1j10J17Q4j76o1JK25K31k92K26m19L96j86
5711C2P0k54J85p8J42L2m49L67r6J84rn06K96j19K0K13K23k66P6q4j6K34k81K99
5735B15j78L0pl7L9j10J4J76j74J20M2r8k2J41m22K21o5K82j74l6j00J76j2P7
5759I8r8M3j11O1r3J13k55M24k04j80K82N1j06m9P5j81J07p5K10r0j93L3O0j25
5783b03K24P9oj07n0j79K93j67m6K34j0k9J09l6j9k22J03P3O7l8k73J05n0JL18
5808A71k17K23l91J63R1J40q8pm2Kr6R6P7j40K42k62J35j78j11L30j95QJ2K5K59
$$ y = [-161, 229, 159, 145, 35, 78, 29, -36, -26, -212, -135, 165, 194, 168, -46, -37, 208, -87, -67, 165, -212, 148, -231, 132, 243, -215, 62, 145, 43, 75, 164, 76, -140, 22, 72, -53, 178, 47, -175, -28, 73, -64, 89, 65, 142, -143, 124, 30, 76, -18, 14, -130, -256, -231, 236, -34, 47, -4, -114, 3, 87, -89, -150, -149, 76, 307, 15, 241, -178, 218, 32, 102, -152, 33, -45, 97, 129, -320, 47, -49, 135, 126, -380, -84, -203, -183, 30, 253, -13, 63, -21, -37, 197, -84, 215, 37, 67, 60, 23, 62, -48, -34, 142, -32, 88, 130, 32, 10, 151, -271, -50, -115, 167, -7, -43, -143, 33, 21, 98, 0, 43, -68, -7, -100, 13, -242, 182, -22, -202, 80, 131, 25, -24, 51, -130, -23, -98, 112, 22, -171, -138, -78, -203, 21, 100, 94, -13, -63, -242, 51, -116, -162, 72, 62, 33, 142, 106, 87, -135, -32, 41, 108, 70, -203, -98, -148, -147, 171, -46, 177, -214, -51, 40, 180, 92, 85, 43, 45, -51, 45, 122, -18, 224, -38, 97, -81, -192, 138, -57, -49, -37, -12, 247]
5833B47L0k53j79j20L63l41M42l27J72j63K35k10K9M5L5J51j31j14M50k49k42
5854a30J96K8k57K7K10j83M6R5R0j71J58j77O4O5k22J28l1J97j24n8j77J89K9
5877hNj03q6J43l8pQ0JoJ36j75K1J23OJ87j46r2J76k40j1J05M6n6m2q6K0O9L47
5905C69k50k74J89m3qJ93K6K6k05o8k17K66r6K11r5l9j3J05j44O2l8M0o1j24K34
5930D6M8j31J39J47k48j73K54j98l8J17O8J10j37Km7Q4m8R5j18j25M7OJ20O7P
5955I4l75K41k04L15j69Q1P2j01np6K36m9j45m3K75k10J19kk87M26r2j08MM5l10
5980b68K79j52L49k33j3R8k08J8N9r3o6K82J15n2K2J22j23j87K0K96k14N2p1j3
6004A9Ml8j37K10p8j08j77L33l8O6j21lr0J50k17Q3J24J61j5j02m2O1o5K1L8q3
$$ y = [247, 277, 24, -155, -275, 88, -253, 189, -138, 34, -129, 106, -104, -75, -30, 5, 156, 25, -89, 361, 112, -130, 66, 94, -163, -136, 74, -109, -63, 32, 122, -49, 109, -68, -4, 61, -161, -33, -64, 133, 9, -49, -226, -37, -8, -3, -106, -192, -49, -87, -94, -14, -13, -19, 117, -58, -37, 86, 92, 279, 133, 41, 217, -23, -34, 71, 117, 61, 19, -67, -47, 22, 369, 119, -155, 34, -9, -17, 176, 202, 228, 23, -45, -262, 4, -92, 119, 24, -15, -28, 77, -67, -5, -43, -3, -64, -188, 46, 94, -37, 102, 249, 1, -172, 82, -116, -154, -37, 31, 141, 4, 6, -41, 43, -5, 90, -28, -153, -106, -100, 20, 87, 94, -281, -40, -244, 71, -98, -17, 55, -46, -51, -127, 109, 60, -85, -128, 147, -63, 56, 54, -233, 193, 101, -7, -3, 42, -268, 11, -141, 208, -25, -38, 60, -148, -130, -71, -164, -230, 52, 167, 115, 137, 259, 136, -51, -31, 265, 51, 103, 32, 19, 23, -15, -152, 58, -20, -128, -305, 28, -10, 56, -65, -68, -158, -8, -225, -142, -18, 143, 128, 26, -16, 45, -20, 1, 39, -44]
6030d4J05L0K31n02J92l6j8j10L38j40lJ95k36n3q8L41Lj82L0r7K82j91J9pK1
6055H0j17j40L21l26J87J10nk26P4k02K15j63K02k4J19J6o2o5j7L7j0j68J14J27
6079G7j74J17J4j23k1L9j3M1J36j09n6K70pj56O5J06k10k9J69J0j40K81l70R6
6103A3n2r8j59L31q9q6J64Q2p1lJ49l75L61j45j01K89m5r1k03Q1K67k66kJ95j65
6128a9J29k66J70m8M2O4k40LR4j2l1m9K59k33N9P7Q7q2M5j35N2k9o9L05o7j28
6154b2j03P2j5J06j5j41k2L37n1j22J4R3l16L91l3j69j90L82k20j20L10k68K26
6177A24q2J96m09k0J74O3PN2k18J54k25K76J61j56J04j82j63K81l91K91Oj44J75
6200G4j30N4K57K0k65K1J26j74K46l09J02m6N9Q8k41K48o2p3j58K9L45N6l26N7
$$ y = [-44, 61, 91, 322, -180, 12, -24, -42, -152, 186, 46, 43, 238, 2, -51, -139, 202, 205, 23, 53, -44, 238, 47, 66, 59, 80, -37, -177, 144, -182, 5, 115, 110, -116, -42, -244, -29, -192, 10, -14, 105, 121, 59, -6, -23, 14, 4, -164, -50, 77, -97, 20, 34, -89, -110, -71, -84, -43, 93, -16, -72, 198, 191, 35, 100, 206, -4, -33, 136, 146, 6, 287, -83, 13, -39, -137, -296, 35, -54, -140, 24, 106, 35, 32, 181, -194, 167, 22, -79, 210, 165, 74, -129, -48, 219, -47, -49, 146, -19, 110, -156, 14, -34, 8, 72, -168, -165, -71, -83, -114, -163, 96, -137, -78, -1, 86, 4, 49, -86, -34, -63, -132, 173, 106, -22, -125, -53, -68, 38, 23, -118, -140, 197, 146, 24, 38, 131, -185, 206, 173, 4, -186, 196, -24, -144, 166, -102, 124, 42, 238, -171, -191, -17, 46, 53, 105, -113, 41, -184, 92, 253, 97, 201, 19, -144, 137, -254, 37, 43, -101, 74, -56, -2, 255, 275, 10, 31, 157, -17, 229, -80, 22, -24, 35, 123, -118, 130, 68, -5, -163, -134, 211, 267, -59, -2]
6224bJ0K3j19q5Q2mr0J53J09k27J26l22K20J12J21n1O6p6J25k20M3L0k22J24k3
6249i7L8K03J4j95j96K53j31L33j95J2p9O6k37K74j88J45j17j32K82J88j68q2
6271il27M58j75L3N1J53k19o7J81j57p3J94o5N4K6k4K88j89j71O1k45J35K07p5
6295D5j19J37J7n3L6p5j33NJ74k5j61L66k88L45j82j81J06n3J61k6J75k17o3M3
6319C4N3K9L5j01J63k68K14l6m14L82j84P8k43K40k5K7J1j5K8J9L9k29J95j41
6343a09J87J4k69L25l64J57J08k11j67L42J59j05M9j78j19K21K46m44J64N9k47
6364a82K23Pj59N5PK32l18K73j74k7J78k15P2q9l8k9L54j93L5j9J18J5k71J57
6388A2j48O0Q0J49j20j2j93j54K19m1J49nk2r4KL16k71Q8M1P4j55jP9JR4l93K92
$$ y = [-2, 8, 31, -88, -173, -91, -95, -185, -32, 77, -150, -24, -346, -126, -14, 107, 56, 122, 46, 171, -49, -6, 24, -198, -74, -97, -59, 144, 158, -37, -233, 20, -111, 222, 27, 39, -40, 26, -211, 63, -125, 20, -97, -229, 53, 241, 73, -9, -336, 122, -53, -20, 31, 184, -35, -102, 79, -78, -151, 43, -22, 32, 58, 34, 322, 133, -38, 23, -222, -87, 120, 45, -74, 63, 80, 27, 63, -12, -145, -140, 34, 9, -152, 214, -74, 271, 89, -92, 14, -39, 122, 96, 271, 54, -9, 34, 87, 116, 151, 50, 213, -55, 159, 123, -291, 91, -93, -15, -258, -18, -43, -16, -5, -20, 8, 27, 66, -163, 32, -109, 78, 92, -177, 148, -216, -59, 49, -162, -329, 13, 172, 67, 116, -62, -181, 40, 286, -158, 6, 65, -182, 41, 48, -111, -56, -49, 183, -135, 138, -36, -63, 115, -100, -28, -117, -155, -184, 170, -23, 12, -7, 111, 126, -145, 12, -136, -76, 4, 153, 33, 21, -172, -326, -107, -148, 1, -4, -26, -120, -118, 198, -73, 15, 56, 130, -25, -26, 53, 54, 148, -245, 47]
6415D7J37m4j64k3L6k8k23J81jp5J74K33l42J97k67j37L64K60l08q9J19qq6J08
6439F1j23j02J88J07q1K6Qk5j01J77k78J50k4Q3L47m42M4j38L02j84J92m10K25
6462BR5k38J61n3J30k82K77j00Q1j00q9K23j03J24j29k9j02J56nl5j16K01j12
6485d3ko6K63k01K29k84M03k50P2k28J04M8j42K5M2Q0Q3k31L46k49q9J77lJ33
6509B17j69O5l38K54j36L28J30j96j12N5k74J90R1k9l09L20O4k49K54j25J24j70
6531a5R1J84m15q7M34j82q7L14k70J15J08j55m9j3K4K8m4J19J18j94P6k48J8P0
6555f0J75k59L07np9p3q9J90k47J87r5J44k97L4%l2lQ0J23l3q3K6J6n3J54O1j47
6582e8J00n6l8Qj41K34J12l45K57j03J04j50j23K33r9n2K21j42j0O4Kl11K36J04
$$ y = [47, 184, 140, -24, -47, -11, -39, -262, -81, -82, -157, 17, 250, -92, 105, -162, -299, 65, 325, 17, -72, 47, 39, -47, 61, -62, -164, 24, 131, 50, 76, 84, 59, -42, 135, -143, 7, -17, 66, 413, -29, 15, -123, 179, -5, 187, -223, 2, 97, -141, 20, -33, 97, -185, 92, -8, 73, -27, -116, 107, 4, 128, -1, -30, -132, 24, 19, -16, -132, 69, -43, -45, -111, 152, -49, 180, -104, 299, 49, 121, -107, -3, 45, -97, -72, -30, 50, 133, -98, 248, -1, -90, 87, 84, 217, 48, 113, -225, 29, -107, 221, 351, 155, 43, 98, -176, 14, 105, 76, -233, 87, 151, -98, 156, 31, 155, -15, 76, 260, -155, -242, 192, 10, -77, 237, -33, 82, 190, 35, -14, -27, -3, 25, -19, 100, 218, 24, 100, -148, -130, -60, 115, -144, 163, 158, 79, 6, -83, 107, -140, 47, -48, 96, -201, -167, -167, -199, -202, -122, 1, -32, -115, -89, -73, -126, 28, 89, -58, 42, -14, -52, -44, -185, 49, 161, -184, 73, -30, 74, -76, -199, 34, -65, -117, 104, -38, -48, 16, 18, -293, -57, 47]
6606D7K12k93J02J46j2K75m78P7L2KRk9k67j01J04L62j99p0K0O9q6M3K03n1j64
6631d7J17J5L7j10K23k61L8J04q2K27m07r7O09l56J20j82OK85k64j6j81M62k62
6654b2l2K6J60j09R7l6k92R8J97k41K0J4J85J12k84M01k29o5O0L1j02j01J22k32
6678b22J83K2j86J63J04k02J66p2j06J22o8K63k52Q3p3J88j92L3J58j36j04N8
6700g0L26k99Nj25J33J64j26k85M43k48J40q8m3L57l37j67N83j52J22l02o2L2
6722Ak9r7Q4J07k60K70k93L68m03J61o1L0p9K84j53l7J69o8J0J67j68l4J88m5
6746A12j11j65J91J76l86J56K26r4k67J83L4j62K42J28l61j42K76l0n7J84l42
6767b09J01L18r0k51K57o2k6j8K06r3k2r5L8K7k6R6K71n79Nm5K81j81L6o9K73
$$ y = [47, 259, -34, 68, 214, 202, 477, -1, 76, 108, 110, 119, 90, -177, -278, -174, 188, -11, -81, -61, 8, -78, -35, 168, 117, -47, 70, 85, 122, 12, 235, -26, 12, 116, 34, 261, -146, -243, 366, 10, 130, -52, -46, 239, -25, -41, -222, 240, -22, -54, -28, 132, 23, 120, 84, -208, -110, 87, -154, -134, -120, 65, 177, -107, 294, 65, 0, 60, 91, -11, -112, 10, -222, -39, -17, -203, -40, 64, -138, 28, -44, -150, -28, -96, 167, -85, -2, -75, 113, -79, -46, 112, -24, -128, -70, 256, -43, -38, -163, -30, 134, 8, -277, 166, -82, 58, -30, -73, 284, -53, -220, 363, 211, 333, 31, -31, 1, -28, -125, -41, 66, -194, 76, -217, 151, -252, -91, -152, -122, -201, 83, -70, -107, 62, -6, 4, 171, 3, -31, 157, 112, 1, -164, 27, 203, -183, -27, 199, 105, -162, 21, 55, -107, 135, 263, -98, -240, 36, 6, -51, 133, -209, -108, 210, 120, -131, 126, 64, 38, 20, 226, 133, 111, 16, 54, 81, 55, 151, 422, -157, -152, -197, 84, -97, -61, -130, 143]
6792A43j5l86J30K45j97J37R6n5kk61L9R6M2q9K06j63jJ5J92M5l92J96J18j86
6816d7J46o1j37J28J38j04R3p8l11P1K02J58j78o6J66r5J47j50K19l25q9J25J25
6839G7J29k75j12K01K42l8m03K15l95J62J58j47J94Ql4J22j04K36l33j17L32j39
6861b1J96j29k94K92K0j52K23k47R9n5r2K42l0n0J21O6j95R7k84J10M2k24J29
6884a36j5K49j18j32N6Pj70K88L2m2J15j63L4J41k06J24j62p4J31L21l07l4J97
6907A36j43P1p4p5j35J85J07J2j31j75K85j3j42J51P1J7M1l27j36M63j74j36J51
6930B9R2j02J7j11N3o9L8k06J47J3K1l3j44L4K97j28Q6J21J49k99kJ23o4k3J13
6955A52j22L85m74K14k04K4P6o4LJ49j76K69m06J40L6L4m3J69j44k45K78m32K32
$$ y = [143, 128, -258, -128, 117, -80, 57, 153, 98, 96, -165, -126, -30, 12, -77, 129, -34, -35, -20, 172, 217, -175, 21, 139, -47, 99, 38, -99, 29, 167, 63, 156, 78, -233, -162, 40, 198, 20, -46, 120, 25, 172, 22, 241, -84, -173, -48, 77, 206, -69, -181, 20, 262, 224, -179, 36, -359, -197, -39, -186, 8, 16, -18, 104, 0, 236, -97, -214, 118, -21, 175, 46, -248, 44, 64, -88, 135, -112, -13, -68, -160, 82, 52, 2, 123, 189, -6, 91, -193, -83, -41, -265, -136, -151, 98, -20, -152, -96, -89, -259, 29, 61, 19, 134, -29, 5, 146, -60, 64, -98, -172, -41, 280, -27, -61, 136, -7, 64, -10, -85, -220, -35, 72, 84, -47, -222, 63, 50, -92, 59, 130, 147, 188, -139, -275, 188, 14, -122, 29, 121, 19, 36, -75, -22, -91, -53, -259, -112, -99, -78, -111, -255, -221, 76, -52, 34, 155, 304, 5, 3, 126, 62, 39, 152, 30, 415, -59, 155, -49, -25, 51, -13, -10, 139, -37, 232, -174, -34, 2, 36, -7, 162, 18, -227, 51, -381, -149]
6978a49K81k11J91j09K50m74N5K0JN1JO6N1L9p6J07q0M3j10r2K01j53J56J56k02
7003A3J79k9j32k15L64k19J44k82J41Q7P7j04L10m40J98k80L44l94K85r1R9o8
7025a3k86J15JL97q4l64M0L47l09J65j25j0K59j12k03L23j39p9N6k0k90M41j06
7048DKl5RJ33l10J43K01k08L2j15J36k61K90k89J24J31j60J87k7l76R9K88LK0
7072B1L34l21L3q4l38L82p4j40L04j53k1L05m14L20j55J6J92j75lj15K42k51J24
7095B9M7j26k4O5r1NO9L2n9m5j68L51j7j70L2K27k75J48q6n4J3K40j09m0L6K98
7121C28k91r2J71k95J85J14r4j34K08r4N6k39R6J7p4K2J09l01N33m57K9L70k8
7144A39j73M8N6R5m9j7j00J57k47l6L38k90L9R3J6k46J54j54L45k36j42L28j87
$$ y = [-149, 132, -79, 112, 3, 253, -221, -166, -146, -145, -94, -93, -27, 24, 63, -13, 94, 14, 57, -53, -145, 56, -97, 59, 215, 13, 192, 163, 31, -184, 180, -39, 105, -177, -36, 51, 128, 24, 334, -106, 92, -188, 156, -238, 47, -44, 55, -13, -299, -184, -183, 214, 130, -234, -194, 153, -156, 9, -116, -126, 133, 21, -182, 141, 2, -77, -21, -41, -331, 110, 4, 6, -29, -20, 113, -197, -54, 147, -61, -29, -144, -8, -269, 21, -268, -144, -13, -173, 14, -13, -389, -290, -2, 1, 21, 355, 34, 67, -17, -355, 27, -47, -187, 117, -36, -57, 248, -166, 154, -1, 15, 207, 32, 29, -86, 156, -95, 29, 76, -50, -74, -9, -100, -95, -26, 6, -53, -98, -266, 85, 68, -102, -70, 157, -118, 30, -56, -110, -97, 143, 34, -6, 30, 328, 37, -55, 116, -179, 6, 120, 26, -108, 100, 6, 62, -177, -81, -64, -138, -116, -7, -308, 225, -232, -203, 167, 139, -34, 14, 70, 165, 116, 99, -1, 156, -91, -127, 211, -79, -40, 53, 69, -177, -23, -177, 168, -68, -210, 118, -69]
7167f9J25j4N3k09oN9QJ01j10j1J7m3K44P3k76J41pl1j34K01l51J68j33K63r9
7192d0j80J67K07k34K05o5j36J02j9k0J22j06K42l34N8N38m08q2n6K21m5K2m14
7215b55K22J16r7J36jk50O2k2j87L17k43J81K57l81J84l6n2J12r6K81m41R8R8
7238Cj6K9J4K42l13J27q7l9Mm5J08l2K4j65K56q5P8oJ2q0j2J53n0qK10j61m8j36
7266b3q0Q0Q8j30K8j3j1K3P6R3j26j11mJ08K8k5P1o9p5K24k09O7p1P5j38J82q2
7293b4L38m76m7L02k13L6k4J52n8J56k69k1l9N0L01ok01P3j13J49J78l12J78l22
7317b12K28J09R8m86L73j60J04o3q8R9l6NJq3%j04L39j66J5k4J00L8j46K9j64
7342a94M10l25K45m4j12Q0m1o0L5j07J85K%q1R0j83K23J02m52K04K21k6l60L14
$$ y = [-69, 56, 42, 95, -114, -120, -61, -53, 48, -62, -73, -56, -99, 145, 218, -58, 83, 76, 45, -89, 112, -239, -71, -204, 59, -40, -220, -53, 154, -80, 125, 60, -76, 26, 7, -13, 109, 3, 245, -89, -31, 507, 99, 17, -39, 182, 137, 159, -255, -33, 83, -14, 122, 121, -129, -67, -89, -276, 41, -202, -21, 236, -145, 39, 3, -49, 63, -33, 248, -193, -95, 3, -13, 16, 30, 272, -41, 86, -1, -40, -36, -81, 27, -5, 19, -146, 110, 25, 103, 97, 109, 29, 17, 170, 120, 112, 322, 161, 113, -23, -103, -23, 65, -65, -37, -50, -61, -38, 38, 131, 5, -106, -110, -2, 26, 1, 72, 3, -72, 152, -57, 10, -61, 14, -124, 58, -24, 314, -162, -209, 93, -120, -84, -108, 44, -14, 142, -127, -148, -187, -137, 164, 158, -43, 30, -83, 66, 244, -68, 110, -212, 16, 125, 223, -263, 110, -50, 54, -9, -97, 2, -34, -29, -28, -111, -111, -215, 124, -42, -27, -51, 49, 87, -59, -30, -194, 216, -109, 136, 92, -20, 60, 19, -41, -6, -113, 72, 74, 74, -7, 83, -100, 123, 225, -227, -23, 198, 172, -188, 126]
7366A26J7l55K70o9L14k15J33k50J19j66J11M5p9K9k01k5RK10K95k96j4l60M38
7389H6o8K1nj72R7m9n5R3N0N9j62k13L56R6p4j46P4k7P6k91PJ60J79k29J54L16
7415C33k89J23k39K21l00j22L65N0q8k00N3J47j52P8K9k10K41J13j85J89k06k35
7437b84J91J66l31L06j16LP2J34j13j47o9L94l23Q3p1J32K3j88L37m64L32L5J01
7460B03k21j01r%J19j3o9J92j20k02M24j46j34J50J01L6l43J60k2j31J15R9k32
7483a44K78J0j28k1O7j06m7J89j06j4M8P5j9k95J13K20n29N98k7kk33J81J67k53
7507B2Lj93K40J89m69K58k8j43P4J38o2NO6j57LK21k47K42j92K02j77j7o1P2Q0
7532F9q5q1l3J84q6J40J30j43M6j43J34j40R9k7p9P4K6l35K93j00k17K65O0j37
$$ y = [126, 143, -212, 58, -11, 303, 88, 221, -29, 90, -76, 35, 80, 1, 30, -171, -196, -187, 23, 318, 22, 8, -352, 86, 18, 39, 34, -138, -41, -90, -145, -52, -2, 57, -105, -318, 38, 134, 60, -86, -12, -39, 37, -254, -247, -87, 92, -137, 17, 333, 44, 167, -72, 149, -151, -273, 92, 142, 54, -146, -93, 54, -98, -20, 9, -201, 40, 153, -32, 157, -49, -284, -93, 73, -258, 48, -68, -65, 7, 141, 28, -119, -188, 206, -117, -34, -105, 27, 50, -138, 199, -265, 67, 102, 203, -18, -119, -128, -128, -9, -22, -91, 101, -19, -221, 203, 57, -77, 73, 174, 210, -133, 27, 5, -126, -11, 88, -144, 134, 144, 16, -5, 62, -44, -91, 98, -8, -22, 26, 101, 82, -213, -100, 120, -409, 189, 162, 160, -73, 108, 275, 22, 25, -168, 72, 261, -208, 50, 22, -121, -47, 91, 29, 34, 100, -57, -54, 167, -80, 162, -30, 172, -5, -22, -83, -11, 69, -16, -97, -130, 54, -32, 108, 238, 95, 141, -2, 132, -8, 91, 64, -15, 59, 85, -250, 43, -57, -274, -9, 51, -86]
7556h6n8J40K68k43n8R5R0P1q4J03n47K27L0K99k37j04R0mp9K29k87MK44j40J75
7581A38k76K05n3L4j1l22M28k73J1PP1K66m41M53k71L8K37ok36K51l67J0K66k3
7605A36j56Q1k41K35j64J26J00k64L35%l33J88r1j4O4k2j43L19j86P1k9M1j56
7628a03k4K15P7j06N6k54J53O7J16k81J33K73l01J27o4k12l2K16K5k62K10j62
7650a33P0J61J22j43j31P5J33k6j15k31J23P4n7K5mj16K34O6k67J65O8L3j5n3
7674E8o3J65k62K19k68K76k18J21O1j67J70r1M7o9L6r1J45k02K7k31L59qJ5j38
7698a09M97l91J87L8l56L29k42P0N4j48j36J32J45r2j22O8N5J9N9j23J77Mj53
7721c8N3L0J67l46K50j83o9J26j86K03k00Q2J91k9l9n3J45J04j42L4n2j81K75
$$ y = [-86, -144, -4, 264, 21, -37, 58, 148, 219, 135, 238, -309, -82, -52, 247, 10, -94, -4, -8, -87, 142, -145, -141, 103, -37, 138, -138, 67, 14, 48, 37, -285, 143, -130, -119, -112, -41, 225, -216, 237, -34, 4, 241, 235, -1, 250, -117, -107, 159, 136, -20, 61, -180, 55, -109, 17, 117, -147, 188, 188, -145, 43, -48, -62, 2, -20, -163, 156, -30, 41, 12, 53, -103, -127, 88, 165, 59, 115, -139, 14, 81, 197, -84, 49, 322, 21, 148, 84, -128, -160, 56, 81, -181, 29, -133, -63, 98, 220, 77, -54, 21, 154, 128, 13, -218, -95, -21, -78, -53, -57, -173, 61, 127, -140, 25, 93, 126, 111, 58, -5, 160, -102, 117, -151, 125, -93, 28, 89, -78, 92, 1, 48, -21, 15, -76, 69, -133, -106, -337, 22, 14, 29, -109, 388, -3, 184, 222, -134, 195, -47, 23, 77, -71, -207, -75, 70, -22, -144, -76, -21, -2, 57, -66, 111, 115, -38, 15, 45, 212, -134, 116, -67, -136, -10, -196, 7, -193, -111, 80, 51, 12, -41, 104, 208, 66, 100, 48, -133, 142]
7744A42k57J23J09j3jk66J84n7l6J57q8J06j30j27J97j15k3j2L11n7j53r9M3L54
7768B92k17l59L93R1Q7k08k43L20l06K13r8n8j0K34r2q7lL0J64k80K1Q0J70j62
7792b8J67j07m4K35k29R1l01K18K9J96Jk98J12O6M5j0j12J70k22K04j45M1J35
7815B14j24k29M8J01k09k7kL39j6j19k2K10j85J84l6k27K5J95j98J05N4N8l8j19
7839a8Q4j29l9K0J26m5K88l51J30n0j35L6K46l26J31K30k50K16m42O29j57m81
7861b87L61k0j12K5r7O1J72j06J74n1N4Kj66p0Q6K23k52r2J32J47r9j19R6P9j19
7886B2r7L3j63J73K7j5Kj29J91j34K57l00P5K05j31M5L5k15oL5l4J84r9m0K28
7911A49J0k19K01j98j09M77m71L60k66L4O4q2J41l25J68N9N3j71K66k55O2P4j47
$$ y = [142, -115, 8, 117, 104, 103, -163, 21, -36, -72, 85, -3, 103, -27, -154, 43, -72, -95, -107, 204, 147, -6, -105, -62, 292, 75, -284, 109, 200, 287, 79, -164, 156, -150, 63, -35, -93, -103, 131, 39, -48, -51, -21, 143, -137, -116, -36, 134, -28, 139, 32, -12, 223, -6, 85, -216, 2, 31, 227, 228, -70, 42, 108, 153, 143, 31, 201, -21, 183, 38, 79, 214, 90, -139, -91, 10, -199, -226, -228, 111, 95, -24, -46, 164, -21, 163, 127, -100, -75, 120, -78, 27, 81, 139, 101, -18, 66, -63, -102, -82, 44, -1, 287, -64, 66, 16, -119, -83, 163, -163, -32, 198, -52, 164, -278, 351, 194, -287, 74, 54, -58, -33, -130, -69, 103, -3, 171, 120, 174, 176, 10, -60, 26, 249, -3, -95, 37, 184, 85, -34, 62, 141, 22, -75, -42, -205, -32, -5, -20, -18, -147, 44, -90, 167, -133, -58, 147, 16, 61, 96, -119, -125, -90, -124, 60, -39, -79, 149, 159, -60, 141, -57, -166, 311, -160, 200, -66, -32, 32, -50, 91, -234, -66, -7, 46, -125, 141, -114, -52, 22, -125]
7934a25j06J19Q2p9o5K53Q2k3k06n1J12m3J86k4j02k2p3M9K3K65R9m36j17R0J65
7959E3rQ1Op8j90J39j54j1J91l42K92J89l10Q8O0Q3l0j51j04L50o4j11K51k91
7983f2j42K00Mj17k8L3K61rr3k4N7j38J64j82K46j08k62K02j50N6j70L86J3j57
8007b0m9J15j36L2N6P4K9r0J3l4K04J27j64j98K29k61L43j18k82L00j29l4j85
8030a78N3K40j92J09m4j72L62j28j42K01j20j70N76m14lp3p5j32J38J43l07O20
8052B92l43P3j40J55J0l6J03j89K12j18Qj1q2J25K3Qj40j47L13l7Jk72L20k22
8076i4O6J43j93J11j32R6q3OJ39O1l64J88k77J99k10L75J22m0j70J80k01L0J62
8099A14q3j89Q8R0j1l6o0l75M29q1p2J89k2J94j70J90Nl28J9R1J49k24R2K46k23
$$ y = [-125, -231, -112, -30, -109, -174, 79, 161, 138, -68, -119, -7, -50, 136, 112, 10, -12, -85, -36, -13, 252, 351, -85, -202, -112, 53, 44, 125, 131, 53, -137, 2, -152, -163, 28, -314, -22, 167, -143, -55, 5, 88, 58, -93, -197, 153, 89, -22, 229, -62, -204, -4, 0, -117, -145, -112, 149, 140, 47, 23, 80, -58, 106, -76, 170, 62, -200, 2, -148, -92, -262, 124, 137, -20, -69, 46, -90, -58, -2, 72, 101, 11, 24, -10, 194, 321, 157, -41, 188, -73, 270, 152, -130, 170, 41, 7, -178, -125, 115, -77, 32, -12, -184, 178, 50, -92, 109, -11, -181, 395, -19, -22, -95, -170, -302, -164, -21, -328, 292, -51, 22, -118, 37, 47, 11, 114, -75, 137, 19, 27, 16, -66, 59, 82, 90, -50, -197, 116, 79, 80, -192, 128, -94, -28, 115, -78, 33, -99, -3, -86, -80, 59, 120, -244, -56, -333, -134, -344, 31, 153, 113, -57, 123, -78, -48, 114, 31, -158, -70, 20, 9, -27, -87, -462, -33, -114, -186, 3, -19, 175, 5, 195, 200, -128, -109, -18, 131, -93, -1, 245, 22]
8124B2j09J42K66l61q5J95n3l8j2Q7j41O0j1j69M17j13j35n3J4J82Q1k82M82n51
8148a65J30J39J7j3r2O0j19k4j68J68J92k9Q3qk47j38M29j7l00k5N7J01oO9j69
8173g5K37k62J51J04j96Q9o6K77m41K69k44L54r0j69n8P7R6J08
$$ y = [22, -87, 55, 321, -40, -125, 70, 17, -21, -33, 54, -87, -27, -38, -207, 210, 97, -38, -91, -77, 105, 186, -96, 386, -165, -35, 104, 121, 108, 16, 76, -43, -67, -235, -67, 125, 96, 179, 171, -76, -214, 215, 198, -102, -127, -70, 31, 25, 94, -75, 162, -100, 51, 155, -41, 48, -18, 259, -182, 87, -157, 197, 107, -62, -120, -43, 53, 161]
8191A61
$$ Imaginary data points
##PAGE= N=2
##DATA TABLE= (X++(I..I)), XYDATA
0@%%%%%%%%%%%%%%%%%%Qj6J6j6J6j6K4l2L2l4M2m8N6o4P2q5R3j04J19j34J50j66
40h7J84k06K28k52K80l09L42l76M13m56N02n54O11o74P43q23R15j016J136j276
60f75J444j649J903k233K679l318M318o121J0408m2960l1619M8147L1699K2780
74C4803l530j3718j8487L210J5952J8506M900m743k0188j9635n437J1069J4617
87A7319N514j6360k4814j6986O624K4883K1929n01k1733k4064Q83K6833L0763
100C0290J0810j7002k9309j3655J3301K8273J5122j3411k9595k4638j420K0977
112a0257J8339j406j9270k1716o116J2416J9432J2406j251j0200r153R51J2958
125b867J6094R850m15j2015j3006k802Q360J4393Q080r357k0316j6705L36J7106
$$ y = [0, 0, 0, 0, 0, 0, 0, 0, 0, 0, 0, 0, 0, 0, 0, 0, 0, 0, 0, 8, -8, 8, -8, 8, -8, 16, -16, 16, -18, 24, -24, 32, -32, 40, -45, 48, -56, 63, -71, 79, -87, 97, -109, 119, -133, 147, -162, 180, -196, 217, -239, 263, -291, 320, -354, 389, -434, 481, -535, 601, -675, 769, -880, 1023, -1210, 1469, -1849, 2469, -3652, 6756, -36204, -67823, -19676, 12023, 34803, 31273, 17555, -932, 2278, 18230, 36736, 41636, 36893, 16705, -2930, -8367, 2702, 17319, 22833, 6473, -18341, -35327, -28703, -3820, 18109, 17608, -4125, -28189, -27306, -473, 30290, 41100, 24098, -5211, -18866, -5565, 22708, 37830, 24419, -5176, -29814, -31234, -10257, 8082, 6676, -12594, -34310, -40426, -28010, -8578, 3828, 2577, -7623, -16776, -15825, -2867, 13227, 23077, 22662, 10647, -2359, -5161, 3199, 17592, 25672, 16315, -4001, -20706, -20370, -3264]
139c264J8430K635j7343k1708n091J7092K4970J5367q916k3406j3303Q627K3944
152A8034J7681m078k1074k2203m173J4567J5288J206j4569k0179j0988L387J3725
165a3376J0254j104r226r527j818R269J3832J1195L371o502r220k244P646J4023
179A6573R705k985j4916j6611l145J2007J4118L606j3174k1652j1417Q320K0560
192I89J3668n361j8261j3852L777K0817J9693L352j3065j6761l882J2219J6346
205A9679P198q277j6812j1793M03R686Q600j256r541j2157o405L219Q741Q680
219c5K505o327q375m554N579J2904J1390J736r499j3065l431R723J5106P900q526
234A3031j8243j2580L956J6610J2922k377j5998j6378j659J5385J7274N810j0018
$$ y = [-3264, 15166, 17801, 458, -21250, -26341, -9249, 15721, 31088, 22172, -1234, -14537, -5910, 18034, 35715, 31637, 10563, -11640, -15813, -1246, 14042, 15248, 679, -19500, -30488, -27101, -13376, -3122, -4226, -13452, -22979, -24797, -15528, -1696, 9499, 12870, 6368, -2852, -5096, 2550, 16573, 26278, 23293, 8377, -8234, -11379, 628, 14746, 18352, 5178, -16474, -27891, -19571, 989, 14657, 9296, -8965, -22817, -19040, 1777, 21470, 24822, 11757, -5004, -8886, 3333, 19679, 26877, 18600, 1788, -10005, -9602, 84, 8684, 7428, -2113, -14270, -20675, -17456, -8715, -35, 2470, -3857, -12232, -16786, -11207, 1697, 13087, 14823, 5324, -7741, -11172, -1449, 13657, 21557, 13031, -5212, -17792, -13836, 2774, 15696, 13319, -2679, -19057, -20716, -5331, 11943, 17753, 7735]
247G735j5645o405R301J6081J0127m164j3313j0883m97R594R144J232p242j1168
261f103p464J352O379P519J791n074q328n761K594J0952J0587L629o349j1676
275e952m749Q037J4449R615m121j5327j2964j56J3674J2988J64j3613j7656o080
289b1691J0585J5327O948p846j5156q369N353J5485J2025q50r822r666p17R089
303F95J0921M274m247r365o754p7N457O360J767m428q847p702l37O671Q438L844
319F670n451j0937o262M423J3131J1343l62j1037j1843j172J1841J4952M581r554
333A0323j5571p265O913J3902Q901n877j4547j0712R04J1948J0712L95r309j0692
347i975l267O767R776N049k596p917n794l39N036P447K898k343o220p151p33N102
$$ y = [7735, -7910, -14315, -5014, 11067, 21194, 17030, 3717, -7166, -7663, 1931, 11075, 12307, 5065, -6103, -13567, -12215, -5836, 1683, 3474, -1600, -9928, -15689, -13095, -2143, 8444, 12073, 5724, -5952, -10701, -2664, 11785, 21400, 17279, 1952, -11012, -11168, 2506, 15494, 15658, 2045, -15611, -21691, -11106, 4221, 11169, 3323, -11833, -20202, -14849, 636, 12661, 11811, 1989, -7677, -8394, 695, 11616, 15890, 11643, 2278, -4476, -4553, 904, 7264, 9031, 4603, -4244, -11946, -12283, -5612, 2826, 6670, 1219, -9718, -15980, -11557, 1574, 12917, 12555, 1518, -10325, -11497, 344, 15296, 19877, 10323, -5248, -12513, -5600, 8302, 17203, 11326, -3221, -13933, -13029, -1081, 9631, 10026, 717, -9975, -13242, -6475, 3301, 8350, 5754, -2163, -7957, -8296, -3260, 4187, 7085, 4742, -1478, -8629, -9362, -4260]
363d260P872M898l979r424p365J206J0949J0769J551q701j1789m012R615J3449
377A0779P211o674j4024q148L985J2717J0449k914j2332j1496j749J0029J0505
390H338K309p705j0731m843M773R212O168j247o933n610j103M167P131L599p19
405F806n585o153k172L636O938M925k588q704q084j441P802R807K907p306j1633
420a0845n592N909J3515Q464l076j1522q984K276J2228J2159R89r117j1085k817
434g498Q084J1168M627n836j0654o400K162P428O676j556o848p163k694K475N886
449a43M053n15m493o131k163K673O836N540n76o091p739j955O638R476M662n032
465E040j1002o917L325J0958R106j477j0906r891r86R753J1690L312p683j0984
$$ y = [-4260, 3612, 8510, 4531, -4893, -12258, -11052, -103, 10666, 12217, 3516, -8273, -12285, -2670, 10779, 17990, 11316, -2708, -10856, -6871, 5846, 16295, 13381, 1049, -10447, -12196, -2167, 8338, 10647, 2942, -7789, -12632, -7859, 1353, 7521, 6274, -659, -6269, -7372, -3205, 3926, 7525, 6806, 1221, -4932, -7104, -3468, 3470, 8395, 5807, -2897, -10981, -12422, -4620, 5187, 8094, 788, -10845, -16437, -10528, 2987, 11451, 8375, -3147, -12131, -9855, 2373, 14532, 15521, 6404, -4681, -7498, 586, 11754, 16381, 10545, -109, -6509, -4347, 3081, 9757, 8201, 1353, -5810, -8504, -6029, -143, 3910, 3395, -1098, -7229, -9392, -6719, 117, 5657, 5081, -1010, -8749, -10704, -4066, 5410, 10072, 5040, -5962, -12879, -9554, 1404, 10510, 9033, -1873, -11764, -12750, -2997, 8693, 12005, 4322, -6662]
479f662m465O051J1319O406l344r403o939J365P368P674Q28n190o850l127K280
494b689N289M344L18m441n428k750J146O006N299J59n463p513l174M185Q392N285
510H965l504r770p592N08R012R322K32q813j0969k931P674J1347N069n444j0557
525g451n599M739J0682Q040r87q133o999o9P392P692K077l901o712l946J485M812
541C122M076L94m272m955l740M33M604M607J394m191o800l753L036P711O678j070
557G274p967p287q52P503R837K464o353j0933m928N200R996O064m301j0249p667
572a2199J476Q688Q212j86o906p879j596N384P855L791k381o056l585J298M435
587C51N063J706k254m247l314j27L866M875K101k655o409m667J246O037O823L40
$$ y = [-6662, -11127, -5076, 6243, 12649, 9305, -98, -7037, -5672, 1696, 9370, 10198, 5008, -1842, -4969, -2689, 2600, 6944, 7262, 2821, -2607, -5357, -4211, 1795, 7094, 7253, 1790, -5723, -8897, -4712, 3680, 8965, 5461, -4309, -11901, -11393, -2381, 6941, 7173, -1640, -12609, -15540, -7866, 3481, 8550, 3106, -7451, -13050, -8311, 2371, 10411, 9424, 1291, -5708, -5777, 1615, 9307, 11384, 7483, 771, -3175, -1690, 3122, 7198, 7592, 3320, -1635, -5375, -4942, -338, 4269, 5663, 1472, -5328, -9081, -6045, 1666, 8344, 7274, -693, -7980, -8832, -1329, 8508, 10972, 4619, -6314, -11242, -6042, 3954, 10018, 5717, -4532, -12199, -10723, -2035, 6177, 5991, -915, -8794, -10390, -5006, 2849, 6640, 4259, -1797, -5382, -4084, 351, 5414, 7120, 4866, 619, -2695, -2822, 1044, 5919, 8020, 5365, -1044, -5711, -4465, 1572, 8395, 8735]
603H735o503q026l018N764Q837M215m598r989o055K910R033P140j600r259q248
618a0662m73P649Q286J905n625p876l033M264P576M659j435n571m073J48L774
633d87M970K483j982m003l852q48L055L984K635j943n409n186m86N224O681J757
649F593m905p349l743M410Q770N765k132q475o793J603Q283Q132L33p682q381
664e571k486N746Q091K791m534q162m821K449O090N031q71n327m481r98L251N236
680A434K735r86l357l516m10K584M225L328p53m493m447j261M163N907K399l350
696D202p257m523K088P157O179p97p545p096p84O872P831J764n570q483l185M568
712d579P796M136k879p263m913J258O071N533K26m145m960j638K929M440L011
$$ y = [8735, 2232, -5794, -8812, -3048, 5789, 10004, 5406, -4583, -10638, -7728, 1305, 8445, 6845, -2414, -10662, -11135, -3486, 4800, 6705, 1080, -6796, -9829, -5565, 2011, 6670, 5235, -336, -4409, -4261, -487, 4483, 6966, 4984, 981, -2871, -3719, -664, 3320, 5955, 4012, -1397, -6583, -7069, -1845, 4836, 6593, 1688, -5661, -9404, -4994, 3776, 9541, 7409, -1066, -7859, -6256, 2027, 10159, 10492, 2810, -5571, -8057, -2311, 5780, 8571, 4037, -4125, -8946, -6497, -407, 4624, 3753, -1574, -6055, -7053, -3802, 1434, 4169, 3183, -174, -3690, -4100, -1516, 2709, 6037, 5284, 791, -3656, -4917, -754, 5153, 7552, 4202, -3055, -7578, -5490, 1667, 7846, 7049, -496, -7592, -8376, -1504, 6327, 8091, 2521, -5962, -9147, -4579, 3217, 7353, 4474, -2789, -7702, -6444, -373, 5160, 5386, 1241, -3719, -5357, -2428, 2012, 5023]
727E023ol175l279j242J570L996K852p3m120m521k051K628N242K870j952o706
743b944n041O21O046O526N03n941o826j781N470P926L588l642p591m125L016P180
759B985M968j449o320n802l67M881N334J273l602n598k644J951M261K958K52k808
775B73l363j282J541L839L266R04k734m053k050K345N034L824q90n650n059l95
791d450M490O438J202m615p135l476L638O946L868k409p391n352J439O163N545
806D901L3n612n952r95L846N678K182k456m908l096J525L982L369P36k208k919
822a894j663Q35L437L477R86j858l928k298J087M368M288p2n019m993k118M028
838a337O088K153l349o727l922K290O400M746p74o230n521K10N586O071J168m555
$$ y = [5023, 5017, 1842, -1437, -2679, -1109, 2887, 5739, 5666, 1546, -2975, -5026, -2398, 2844, 5714, 3762, -2944, -7985, -7364, -1318, 5208, 5711, -230, -7056, -8837, -3367, 4559, 8147, 4505, -3086, -7211, -4195, 2985, 7953, 6504, 184, -5618, -5985, -1104, 4230, 5503, 1901, -3697, -6341, -4390, -129, 2829, 3081, 273, -3090, -4372, -2831, 1008, 4274, 5178, 2444, -1609, -3659, -1314, 3720, 7544, 6654, 1004, -4055, -4450, 40, 6478, 7680, 3065, -4070, -7546, -3908, 3038, 6906, 4497, -2894, -8246, -6807, -644, 4901, 4934, -678, -6630, -7625, -3779, 1899, 4081, 1625, -3283, -6379, -4854, -872, 2497, 3233, 1025, -1894, -3557, -2722, 715, 4192, 5178, 3320, -608, -2906, -1819, 2549, 6837, 6765, 1746, -3247, -5365, -1337, 4751, 6904, 3555, -3172, -7094, -4804, 1596, 6342, 5568, -662, -6183, -5973, -387, 5684, 6852, 2297]
854B297n502k782L684N102K516k209m625l625PL084L203R87k320l413k123L6K874
871b809L101J547j257l196k066Q21L755M597J440l267m601j949L027N809L510
886H462k080o240m214O21N785N274j05n432o193j435M081O234J920l799n839l040
902f000K072N148L409j120m298l895k94K636L680J287j695l336k202J46K207K700
918D45J681r98l140k448r4L413M021J462k334m239k627J833M935M171m40n580
934F1n193K15M637N443J299m546n274k589L573O085L176k064n635l553J389N144
950B168L911L07m095m143o23K345L175J311j209l402k898m88J502K180J390j042
966C89k992k739o20K229L764J847j297l916k749J409M382M609M94l883m800q81
$$ y = [2297, -3205, -5987, -2303, 2799, 5315, 3106, -1519, -5144, -5137, -2053, 1150, 2137, -183, -3596, -5719, -5683, -2809, 292, 1839, 582, -2614, -4680, -3859, -104, 4493, 5933, 2666, -1935, -3884, -857, 4952, 8462, 6382, 142, -4072, -3451, 2334, 7608, 7503, 2071, -4122, -5557, -1476, 4758, 6678, 2879, -2960, -6000, -3928, 1220, 4629, 3509, -789, -4684, -4978, -2342, 1338, 2625, 930, -2406, -4608, -4462, -2255, 445, 2126, 1128, -2012, -4460, -4554, -1141, 2880, 4342, 2008, -2231, -4858, -3025, 1910, 6081, 5641, 61, -5132, -4917, -280, 5163, 6462, 1916, -3358, -5947, -2374, 3711, 6887, 4823, -812, -4365, -2976, 2168, 6079, 6386, 2291, -1852, -2475, -130, 3045, 4356, 3147, -255, -3153, -3641, -2139, 41, 1431, 389, -2603, -5342, -5962, -3733, 31, 1878, 581, -3335, -6084, -4675, -293, 4316, 4810, 927, -3873, -4754]
982d754L577N938K147k746n739l517K588N393L831j495n167m603N82L924M132
997D091J007l380l975j680K172L683J739j83k985k432m48J264K496J681n28k486
1013C6k510j515J977L073K225j250l462l435M0L545M175J471l431m808k109K636
1029c342N514K877k223m873m156J402M925M385j96m508m196o59L760M466J715
1044D891k051m024j820J373L806K383j35k177k949o86R70K433J823m47k093k888
1060a591j418J190K282K022n55l238l272p11K915M441J420k520m327k688K214
1075c836N173L598o22m736l874L02M322M609M97l757m793j305K749M335J779k131
1091B310l895k761Q79L160K650M57k094k671r71J069K362K162J07j663k222j404
$$ y = [-4754, -1177, 4761, 6908, 4162, -1577, -5094, -2506, 2887, 6718, 5223, 56, -4547, -3965, -41, 4091, 5098, 1718, -2257, -3937, -1765, 1918, 3657, 3474, 489, -1943, -2391, -1127, 1369, 3050, 2522, 36, -2474, -3989, -2012, 1061, 3286, 2036, -1426, -4861, -4821, -1276, 2899, 4370, 939, -3869, -5978, -3342, 2172, 5049, 2826, -2047, -6203, -4801, 124, 4509, 4313, -195, -4391, -5050, -1290, 3176, 4891, 2840, -1184, -3004, -1631, 2175, 4558, 4423, 2246, -703, -1389, -419, 2014, 3837, 3390, 1297, -1591, -3009, -1819, 463, 2485, 1930, -1308, -4580, -5291, -2376, 2065, 3485, 965, -3362, -6050, -3836, 1337, 4935, 4313, -423, -4297, -3995, 327, 4936, 5433, 1676, -3117, -4422, -1673, 2662, 4441, 2310, -1585, -4346, -3467, -307, 2343, 2800, 706, -1965, -2936, -1867, 495, 2657, 2764, 1101, -1121, -2525]
1107b525J262K607K238r7k586l317q46K118L597J782j637l983l338J151M140L547
1123D113K34m309m228p39L652M557J400k995m542k050J963M291K525j068l707
1138i03k851J30L124L010O68j852k749r66Q28K570J713K96j264k337j195M06K180
1155H08J906J66k139l066j716J236L548K260j057l651l419L7L911L828J055l124
1171E83m332j081K812N056K379j958m295k359J162M324K644m67l321l405o14K358
1187e14K979P48j695k884j627L34K091J673Q34j516j967j029K96K057K067R14
1203B761j329k827j286M94L352K521m88k989l631o16K840M135J203k767m372k155
1219e154K310L956K844j223m025l285Q27L617L423N38k932l502n88K187L144J404
$$ y = [-2525, -1263, 1344, 3582, 3485, 899, -2418, -3264, -1146, 2451, 4233, 2596, -1387, -4725, -3574, 566, 4113, 4347, 38, -4190, -4929, -1277, 3280, 4680, 1685, -2857, -4907, -2944, 1347, 3872, 2804, -903, -3754, -3624, -500, 2510, 3178, 1326, -1423, -2389, -1561, 1009, 2722, 3018, 1754, -583, -1778, -1372, 808, 2714, 2880, 741, -2325, -4041, -2805, 743, 3003, 1946, -1705, -5124, -5087, -1176, 2652, 3707, 583, -3749, -4830, -2018, 3038, 5417, 3459, -836, -3195, -2033, 2291, 4935, 4468, 1147, -2258, -2872, -514, 2465, 3213, 1518, -1366, -2993, -2659, -568, 1105, 1939, 423, -1544, -2573, -2277, -220, 1847, 2761, 1432, -1395, -2681, -2187, 1165, 3686, 3198, 209, -3422, -4038, -1198, 2937, 4140, 1373, -2999, -5154, -2844, 1112, 3956, 2733, -1292, -4577, -3750, -133, 3290, 3828, 896, -2606, -3194, -1007, 2137, 3541]
1235C541j247k735j693K08K272J855O47p76k062j192n8J641K205M52p09k554k274
1252b479M82K307K337M13k730l639j427K070L989J625j864l849l102J483L973
1267d11L322k01l775l319o9L653L935J120k429l169j525J688L501J688p98k697
1283E14k235j82J958J672Q02q93j976j715m6J647J853R99r97j761j835J02K172
1300G9K943R95k010l450j571J508L420K368j480l309l253M80K944L228L36l152
1316G6m186q91K491L896J364k010l386j759J068L118K255l7k297k234k2J525K324
1333A295J189j084j088j585j45J239J795J421m02j811j832m89J790K607J352j399
1349B853k963k523R35L112K236j94l535l407j79K451L643O17k660l617j622J707
$$ y = [3541, 2294, -441, -2134, -1926, 346, 2201, 2848, 2072, 10, -1182, -1240, 401, 2606, 3058, 2349, -205, -2479, -1997, 310, 2647, 3060, 330, -3309, -4736, -2666, 1323, 2948, 1084, -2765, -5867, -4384, -411, 2911, 2710, -1065, -4384, -4453, -800, 3135, 4255, 1826, -1343, -2868, -1180, 2321, 4009, 3211, 514, -1721, -1903, 55, 1727, 2529, 1636, -340, -2055, -2101, -454, 1399, 2398, 1401, -360, -2195, -2093, 79, 3022, 4017, 2007, -1443, -3014, -1506, 1914, 4282, 2802, -507, -3760, -3280, -336, 2892, 3228, 76, -4110, -5001, -2510, 1386, 2750, 740, -2646, -4405, -3337, -219, 2036, 1999, -298, -2532, -2554, -1029, 1295, 2484, 1400, 312, -1273, -1418, -179, 1616, 3037, 2635, 824, -1008, -1497, 293, 2900, 4252, 2853, -110, -2633, -1698, 1414, 3650, 3456, -79, -3486, -3665, -1214, 2429, 3046, 386, -3231, -4853, -3146]
1365c146L929K112j056l162k227P7L202K644K30k233k393m32J269J994J445m94
1381A759j800j412p60J012J490J197R6j757k061k36J258K240J725q48k145k351
1397b593O78K771L043L89k465l454p07K139L405J798k220l995k107J093L374K129
1413C278p27l269k898O6K282K676Q15k045k632q86R88K130J575l75j303j530q04
1430b659J200J909J010J56r72k033r57J220K221J563j12k331k275q9K508K713
1446C072J005k108l314j335J102L904J676j321l408k631K07L454K655n00k429
1461B9k912n43K289K918J217j472k391j280M52K538J398k16r44j978q88O74J467
1478C58R89J13j491j540j329N01J889J744P9k030k077n60K035K796J353j146k927
$$ y = [-3146, 783, 2895, 1839, -1323, -3550, -3473, -271, 2373, 2603, 370, -2023, -2455, -1186, 808, 2253, 1759, -41, -1453, -2213, -1201, 289, 1486, 1582, -175, -2236, -2472, -1214, 1026, 2751, 1903, -242, -2593, -1915, 856, 3899, 4288, 1823, -1631, -2338, -199, 3206, 5004, 2784, -1211, -3318, -2225, 1149, 3278, 2551, -718, -3616, -3550, -1268, 1408, 2223, 178, -2454, -3340, -2352, -222, 1353, 978, -325, -1855, -2659, -1459, 450, 1460, 1616, 644, -1389, -2346, -1126, 1095, 2658, 2546, 215, -2060, -2149, 359, 3072, 4077, 1969, -1345, -2680, -1578, 2326, 4002, 2681, -727, -3358, -3151, 303, 2958, 2458, 29, -2883, -3426, -1137, 1781, 2998, 1526, -865, -2145, -1693, 845, 2243, 2027, 1083, -895, -1783, -1109, 358, 1347, 1460, -31, -1571, -2900, -2399, -510, 1234, 1313, -717, -2794, -3354, -1319, 1477, 2830, 1684, -1243]
1495a243j788J367L266K661n77k869k848j60K765K952K75k458l070j202J426K855
1511A352J603j296k728j814N88J975J778K69j137j742p48P12J161J227K65o18
1527H47j610j350M87J717J480K23j471k320p49J134K941J466m83l027j884L01
1543b298K781K870O0k410l482n33K259L156O76k042k944j770J030L049J712n39
1559A575k456k064M35J660K264P39r55j604q37N12J665J107L21r14j243j607M06
1576i96J097J318L59j325k438j147P48K115K081m35k366k301j16K825K938R74
1592C331j811l030j141J973L174J608j016l242j728R2K675K014n13k285k711l91
1608c001J594J863O95p93j719j094K88J360J709K30l02j256j285L13J300J447
$$ y = [-1243, -3031, -1664, 1602, 4263, 3686, 817, -2031, -2191, 574, 3526, 3801, 1343, -1727, -2929, -1503, 1352, 2955, 1659, -1069, -2883, -2295, -320, 1458, 1727, 590, -1152, -1900, -1188, -27, 1200, 1465, 847, -763, -2113, -1626, 91, 1571, 1794, 323, -1997, -2746, -1612, 1329, 2795, 2312, -715, -2599, -2298, 483, 3353, 3413, 1003, -2479, -3012, -753, 2403, 3079, 1037, -1907, -3677, -2647, 402, 2114, 1575, -881, -2945, -2510, -850, 1414, 2153, 1198, -406, -1243, -731, 934, 2041, 2362, 1448, 205, -1402, -996, 101, 1419, 1778, 453, -1985, -3132, -2384, -269, 1812, 1377, -989, -3290, -3406, -581, 2357, 3331, 1520, -1510, -2651, -678, 2496, 4104, 3088, -154, -1882, -1790, 885, 2899, 2386, 101, -2610, -3001, -1407, 456, 1151, 358, -1361, -2455, -2167, -807, 902, 1132, 830, -426, -1711, -1398, -98, 1349]
1624A349P04o25j674j757K0K108K017K7k017k529l74J732L172J145j552l059j312
1641b625J128K973K182o66k575k429J55K301K165L12k096k683r50J118K132J127
1657A569p35k066j230r8J445J586O74k04j090j041J07J192J149J189p95j580j688
1674a616m14K013J486N73j834k668r96J125K658J825j053k823j794J007K862K622
1690B973L83k333k294r3K192K609P29j458k556j231P19J997J107r28j809k208
1706b201L1J155P79O46m34j252j400K00R06J587J229k59j528j241r3J192K457
1723A774P56j259k482j356J100K495J595o69k547k444L1K443K555J79j606k811
1739b246l82J686K654J486j160j976j411M18K121J478k6j617j947k75Q40J188
$$ y = [1349, 2053, 1428, -246, -2003, -1983, 125, 2142, 2169, 152, -2377, -2751, -1019, 2153, 3298, 1746, -1313, -2625, -1497, 1476, 3658, 2992, 417, -2012, -1857, 444, 2609, 2921, 825, -1858, -2808, -1690, 442, 1569, 834, -1232, -2462, -2560, -1115, 471, 1145, 941, -149, -1190, -1083, 109, 1258, 2447, 1652, 72, -1616, -2030, -17, 1469, 2042, 208, -2460, -3456, -2331, 327, 2152, 1099, -1724, -3518, -2511, 351, 2973, 3356, 1023, -1271, -1364, 828, 3437, 4166, 2708, 152, -1079, -360, 1637, 2744, 1816, 7, -2201, -2170, -1015, -236, 410, -24, -1276, -2676, -2476, -1570, 17, 1246, 987, -541, -1782, -1875, -683, 1774, 2530, 1271, -1211, -2567, -1467, 1028, 2623, 1954, -593, -3037, -3006, -563, 1992, 2171, 565, -2246, -2628, -942, 1712, 3198, 2038, 62, -1349, -931, 1190, 2668, 2642, 1025, -922, -1197, -357, 831]
1755H31L45k89j011j361l00P72J135J080R2j587j318j02J235J984R09j019j824
1772d28j729K41K241J610o3k286k691m67J975K273R96j723k554j193J398K608
1788B08K377j100j612j324L07K162J920L91j353j512p64P93J014J150n01j516
1804F40j224n57J52J023P43r3j013j435n94P72J857J376o36j342j494k07K258
1821B26K239N38j778k555j059J251K355J515j539k684j611M56K386J783k40k118
1837h35j923l08K057K025P65r45j549p43R46J088J215K23j102r21o44O34O48J106
1855A737J91j117j560o93K10J762J281l55j424j753m94J872K014O74q70k698j289
1872b512Q54K459J713r39k254j936rK119K063k22j738j987m38J336J703J358q57
$$ y = [831, 1176, 887, -124, -1485, -1785, -1013, 122, 1202, 1294, -293, -1611, -1713, -478, 1506, 2415, 1396, -428, -2157, -1916, 325, 1935, 1872, -414, -3105, -3572, -1597, 676, 1672, -51, -2605, -3798, -2400, 208, 2585, 1485, -127, -1451, -1144, 1018, 2938, 3329, 1976, 464, -300, 493, 1507, 2657, 2156, 640, -584, -1141, -989, 34, 777, 684, -329, -1764, -2358, -1586, 271, 1647, 1011, -331, -1825, -2032, 226, 2465, 3003, 1225, -1330, -2389, -1138, 1217, 2732, 1193, -1491, -3102, -2646, -260, 1523, 1283, -835, -2758, -3066, -1009, 1016, 1781, 836, -713, -1456, -510, 578, 1793, 2016, 914, -7, -651, -17, 631, 1737, 1928, 811, -749, -1442, -1232, 530, 1811, 1456, 32, -1721, -2215, -343, 1671, 2345, 1475, -1223, -2512, -1658, 801, 2514, 1575, -679, -2615, -2624, -505, 1558, 1336, -402, -2389, -2827, -1491, 212, 1570, 713]
1889G13j606o83L61J493J319K89p12r42q50M38Q91Q36M73q72j331j200L76J253
1907B46J001J0j292j936o07J055K102J026m58k131j304P03K406J933l11j957j954
1924a468j97J754K377L79j431k437r99Q42J617Q72l95j795j601k2J042J708J47
1941C93n54j023n72M48J124J085M87j77q98o54k43J110J330M36j102j942r10P16
1959i46J683J518j033j790j884n0K171J912L69j756k177n11J456J996J451r94
1975A415k201r54O25J980J251n54j255j671r8Q03J529N43o93j149p37q3J059P34
1993E44P10m72p89j169R2R89J369M79n00j671j104K86J738J293k49j864j718k98
2011b334J637J802M11j258k219j009J171K555J039l38j882j397N58J825J712k56
$$ y = [713, -893, -1576, -1215, 278, 1597, 1886, 1174, 232, -618, -180, 711, 1547, 2020, 1148, -183, -1383, -1007, 246, 1247, 1257, -35, -1971, -2578, -1523, 579, 1605, 1147, -984, -2288, -1585, 821, 2754, 2443, 486, -1468, -1665, 89, 2466, 2845, 1414, -1023, -2022, -1180, 437, 1309, 914, -881, -2482, -2504, -1462, 246, 393, -161, -1184, -1756, -1308, -184, 901, 1388, 1211, 313, -341, -584, 526, 1856, 2292, 1190, -752, -1662, -946, 737, 2255, 1222, -568, -2452, -2502, -331, 1581, 1950, 194, -1983, -2494, -1038, 958, 2409, 1415, -786, -1740, -1115, 865, 2116, 1562, 307, -1364, -1462, -659, 870, 1413, 720, -429, -1166, -1249, -190, 544, 1254, 782, -7, -1176, -1084, -95, 1274, 1753, 1253, -418, -1522, -1236, 502, 1795, 1546, -318, -2036, -2334, -697, 1105, 1516, 258, -1961, -2970, -1799, 756, 1795, 1457, -425, -1822, -1264, 561, 2273, 2017]
2027B017r58j302o38P01R34Q09o42j049r44l38N86Q49M37l75o59r05j54Q83J483
2046G35P18k45j122j246M11J462J935K28j644k165l92J097J788Q84j385k315j651
2063b907O29J758J714m15k055j516M1J613J630O13j198j068o0N70J462R44l7q97
2081H21j081l02N30P85P74m32o42j001m83N9J326Q13l42j268j293K70J123J388
2099A045J031o59j889r64O78K126J323r51j741j389j79J654J690m8k092j763n68
2116b696J257J966M83q00j590o53P18J349J137Q6q95o24n36K78J042O44J1o18
2134E59j048n58j60Q54J231l76j005j315k85J091J775Q59m98j418j078O14K271
2151A513J684l42j497j690j92J441J691J00j468k494n57P13J386P89j026j685
$$ y = [2017, 1059, -243, -881, -180, 754, 1563, 921, -128, -1072, -1410, -824, 25, 462, 87, -572, -1477, -1631, -748, 735, 1453, 1208, 86, -1160, -749, 713, 2648, 2876, 1232, -933, -1325, -228, 1560, 2444, 1059, -1256, -2907, -2278, -520, 1194, 779, -1276, -2792, -2751, -1138, 492, 1105, -93, -1161, -1221, -651, 811, 1755, 1718, 821, -260, -562, -32, 753, 1527, 1095, 453, -548, -1031, -972, 354, 1167, 825, -443, -1736, -1466, -343, 1045, 2076, 1417, -472, -1436, -758, 1368, 2691, 1740, -1, -1390, -1569, 85, 1775, 1727, -365, -2128, -2696, -1439, 527, 1010, 210, -1380, -2033, -1315, 34, 1171, 1257, 362, -262, -798, -520, 522, 1166, 1177, 559, -489, -1047, -1207, -353, 878, 502, -503, -1818, -2103, -1012, 763, 1622, 1124, -294, -1372, -758, 1513, 3197, 2855, 1358, -332, -524, 917, 2608, 2708, 1240, -1254, -1811, -1098, 288, 1077, 51, -1634]
2167a634j100K77J201J299J52p51n87k51P58J035N42M75n51p05m53j79J012J126
2185A666k13p85j450p38K89J421Q72m68j820j182M41J582K014m1j288j488k15
2202a403J608J799Q47j068j654j110Q19J322P82j31j580j600L0J103O54L29o55
2219I2j046n53J07Q94P63J65m90m99m95L92Q42P41J07m78j292n86K78J206R26
2238A074j35j471j350k68J388J470Q72r04j990m57J110K021J168l24j979j005
2254g80N91J369J364n25j230j156n92N62Q89N38o22j152q52L7P57P67J99j57r05
2273h98l22L21O55R34N62r9j093p02J91J067J088j53j276j387r56J027J551P89
2291A299j107j648j140N88J539J841m98j430j206K78J530J495L01o74j341l40
$$ y = [-1634, -2734, -2457, -1256, 43, 195, -556, -1143, -1394, -636, 399, 941, 1416, 865, 160, -293, -472, 540, 1666, 1453, 668, -782, -1520, -1231, 190, 1062, 594, -1226, -2408, -1967, -385, 1629, 1588, 300, -1188, -1403, 205, 2004, 2851, 1783, 129, -981, -162, 1160, 1942, 1811, 231, -1369, -1339, -236, 418, 747, 92, -954, -1507, -1400, -506, 257, 422, -68, -567, -1062, -670, 172, 913, 1020, 542, -750, -1336, -1058, 148, 1074, 939, -532, -1882, -2150, -762, 708, 1580, 676, -1314, -1771, -661, 1360, 2528, 2204, 225, -780, -189, 1180, 2544, 2019, 789, -367, -959, -397, 492, 1030, 408, -744, -1596, -1559, -802, -35, 164, 7, -898, -1220, -899, -244, 690, 1252, 1153, 60, -642, -451, 616, 1704, 1551, 275, -1112, -2068, -1041, 510, 1299, 192, -1456, -2596, -2008, -469, 1372, 874, -556, -1762, -1484, 46, 1541, 1842, 1168, -173, -513]
2307e13Q60J031N42m22j023j159J49N43N44J06l45j026l77k5M74P31P01n38n75
2326c22p40l3J006J224K82o68j719o99R62J517O60m80j715j256L47J331J821m49
2344A069j091j397n21J417J681M00p31j503n56P96J412L84j83q61p83m09Q31N67
2362E22Nm11m01p39k3J50R55M89j14n23q94R2N87J407N89o25j012j129K85J771
2382I81Q34q2j655j476k57J214J356J78j444j314n41R31J565P32o02j283o57L75
2400a145J229R24K74o97q48k62O38Q79N5n9n11o63m95N06L53Q50n04p32n88m32
2420a228M30J090N67j60j317o61K4J264J509j39j063j323l37J165J246Q14j031
2437H50j574q17Q93J309Q20j65j451r92Q0J294P01L21p25j292l2M06O92P26l67
$$ y = [-513, 347, 1378, 1920, 1498, 475, -684, -535, 8, 552, 658, 313, -713, -1090, -1115, -641, 90, 791, 253, -322, -1062, -1095, -89, 1135, 1417, 749, -970, -1669, -707, 810, 1470, 990, -725, -1981, -1634, -303, 1518, 1069, -22, -1419, -1940, -523, 1158, 1558, 827, -676, -1232, -436, 976, 1360, 1177, 316, -467, -876, -45, 522, 527, 116, -285, -1024, -1047, -897, 58, 547, 433, -90, -984, -892, -305, 1102, 1691, 1066, 54, -1075, -790, 981, 1815, 1733, 78, -1398, -1655, -441, 915, 1093, -351, -1665, -2206, -1275, 290, 1022, 420, -863, -1520, -1145, 84, 1008, 1282, 585, -263, -525, 113, 992, 1047, 988, 477, -186, -681, -175, 178, 1028, 524, -208, -796, -1228, -798, 292, 859, 699, -618, -1279, -1255, 9, 1518, 1379, 316, -1007, -1344, -179, 1067, 1881, 850, -724, -1541, -648, 661, 1481, 1316, -135, -1127, -1047, 247, 948, 1269, 544, -748, -780, -374, 318, 1044, 677]
2456F77m45q32k63K95M67P35l01j67j079l49N13P58J029j47r47j181K11P55J573
2475A302M48j263j451l05O71J589N74o20j434j002M80J287P82j05j071j072n6
2492a246P13J244J38j61j209n22M44Q64P98jp62k66j83n8N62P37l36j15p60o65
2512g84O2J090N91K2j102j031k46P62R26P60n63j633o54N85J354R59j40j400j091
2531a533J47J117J573J07j047j126m61Q24R36Q86m84q33p11M72M18N77J24p56
2549B30n15q8q8O18L91K49l43o38l21j22O85O66m6m83j049k75O00J147P99p26
2569F91j003r84K29J186J170M4j237j235j71Q54J287J78q29p96j072O63J208P17
2587I00n38p11p88J75P06P40M83o84m03k66K88N74O9L96Rp45n82Q8Q11N08J81
$$ y = [677, 232, -600, -863, -568, -101, 634, 333, 166, -913, -1262, -749, 9, 1038, 891, -56, -1237, -1026, -271, 1302, 1750, 487, -964, -1269, -598, 991, 1565, 945, -489, -1491, -1011, 276, 1058, 953, -118, -1190, -1246, -533, 711, 849, 688, -521, -1043, -599, 265, 1063, 1062, 300, 34, -149, -207, 355, 1092, 756, 641, -119, -784, -722, 368, 959, 981, -121, -1152, -1398, -636, 290, 1050, 487, -1146, -1800, -1215, 139, 1098, 958, -442, -1533, -1386, -269, 1304, 1411, 364, -762, -1223, -399, 537, 1423, 939, 106, -605, -133, 285, 862, 986, 230, -285, -373, -461, 157, 548, 797, 454, -184, -505, -627, 58, 724, 678, 195, -854, -1129, -529, 618, 1417, 691, -312, -1296, -1067, 119, 1289, 1333, 96, -1139, -1310, -456, 831, 1009, 180, -616, -1688, -1025, 183, 900, 362, -349, -1137, -962, -256, 484, 967, 283, -120, -386, -98, 476, 545, 941, 950, 205, -377, -289, 522, 1030, 1211]
2608A211o07n69q41R0J090O22j64r93j238LJ095J138L40j243j102j55N45J144
2626C66O12n61j347m39L70J102Q63k07p46q46K7M85P31N01k68o72n27R6L24O52
2646E16K00l03n09n01l0M21O55K34p1p92n49m5P12J212O1j022j035j13R20J105
2666A066L96m25j339l14Q6J559M44l92j499o50l8J191M63J38q20p18l61L91P35
2685h7J84j3p75j97J17M34J88P05k66k45l55j55K48R21L51j32o85p38l6Q49P83
2706A096K2p86j013j84M00R90O55l98j280o22K48Q33J354r6j255r84o5P96J369
2725A080Q4r64p16k28L23P62N31k46n68p01K45o5O32R6N9o01R0n76K29O67M27
2746E60J61p99o48j84N17J003K31o06j046k86M03J109P42m16q51j072K56J055
$$ y = [1211, 604, 35, -806, -716, 374, 996, 832, -161, -1399, -1396, -301, 837, 1177, -66, -1168, -1323, -778, 366, 978, 417, -930, -1369, -999, 103, 966, 759, 13, -833, -806, -321, 410, 911, 643, -29, -556, -460, -136, 516, 716, 413, -96, -597, -627, -206, 449, 683, 612, -180, -729, -774, -62, 1150, 1211, 189, -846, -959, -39, 1066, 1462, 1037, -302, -616, -530, 1029, 1473, 1081, -418, -1068, -1106, 85, 548, 686, -134, -852, -1213, -822, -87, 97, 84, -691, -888, -771, -337, -149, 556, 290, 45, -310, -465, -217, 704, 1055, 923, 238, -500, -536, 313, 1096, 1118, 332, -681, -865, -465, 525, 1180, 782, -498, -1120, -872, -39, 1315, 1219, -36, -1020, -1085, -289, 1080, 1164, 200, -516, -744, -421, 341, 872, 626, 58, -643, -398, -463, 169, 265, 324, -277, -187, -763, -534, 133, 560, 721, -78, -726, -910, -393, 610, 841, 235, -811, -1097, -694, 415, 1157, 741, -110, -1182, -926, 129]
2764A29J003L7q34q12m05O04J199L04p09q19k94J78M65P31m84l57n71j85K72M74
2784g4O16m26j84m69k54O22L43M41k01k25n57l71N46N72O88l32q19l78J02M73
2804A13Q61Lq95r13l62R00J103j4p42p82n55O62J114L73m23p49m90J67Q24M25
2824F20K95p73m39l89L74N45L85N0m11k26m49J92R7M93J58k91n70l76K82Q64L30
2845G61n10n15p15o6J049O42L66p24j049j22P02P81L90n82n45q66L05R65Q69j56
2865I80p00p34l71O42P76j85m59j56n27L52L96K58Q1o93q5k90N7N09M31N2L0o90
2887c26l03K12O77M32J96n36p89j97P13Q86J02m36q81o12N06Q89M19k07j002n61
2907h18qQ18K00M43o46q09j4L14Q07J52m08l55l52K09L81L41M8j86j14l38k7K04
$$ y = [129, 1132, 1169, 335, -477, -882, -278, 921, 1225, 516, -303, -597, -419, 46, 777, 293, -64, -635, -820, -548, -74, 542, 116, -68, -537, -791, -169, 174, 615, 414, 189, -368, -739, -193, 379, 1067, 735, -84, -462, -360, 113, 974, 977, 82, -831, -1193, -293, 810, 796, 54, -728, -1283, -621, 493, 866, 443, -306, -796, -629, 195, 620, 915, 142, -297, -686, -312, 233, 618, 668, 257, 31, -418, -226, -129, 364, 522, 231, -339, -715, -433, 431, 761, 251, -264, -979, -1045, 4, 646, 1012, 288, -761, -883, -181, 600, 990, 408, -137, -1003, -698, 267, 1136, 980, 280, -454, -825, -183, 593, 408, -51, -207, -734, -382, 14, 272, 353, -340, -425, -715, -658, -149, 282, 334, 364, -326, -629, -417, 260, 692, 888, 352, -437, -634, 79, 965, 1067, 631, -250, -862, -356, 533, 952, 745, -257, -818, -826, -8, 192, 635, -11, -820, -834, -520, 287, 439, 31, -324, -676, -467, -86, 255, 303, 117, 3, -335, -362, -158]
2929a58M79K96l37m23n19J44N01M27L01o27o85j97M96O87L46l30q22p52K66J305
2949C98N29k08o21o68J13P09N23K26n43p37K6M49N73N9m6p67m36r0N52M29J1l67
2971A14l19k56l24M84L90K04l18o42Qj72M98N70K51l54p20j42L78P36N54l02o35
2992Cp95K21Q53N50J75r71p16q0Q41P78J15m30q89m48P01K12N69K7p77l48j72
3013e81M74L02L07j27l80k15j82M69J79K48k02k05p00J60J90O25L94m23m82o68
3033h17K50N22O35j99n16r94m5P39J043J88q38r12j6N69R84M31n50p20l85N91
3053d0L65K27M58n60m23n7J47M11J97l69k06r2k62J85R1L52k47k99n43P0J60Q48
3075D13K1r7n99n29J27O46Q08J0p51q46N4O52N87M28o13p88k27P2R77N94n18n40
$$ y = [-158, 321, 617, 280, -143, -662, -518, -17, 410, 711, 84, -601, -798, -302, 385, 731, 401, -421, -1173, -907, 398, 927, 719, 98, -570, -457, 252, 775, 1001, 458, -279, -253, 196, 769, 828, 782, 15, -421, -511, 41, 470, 481, 114, -205, -461, -785, -301, 89, 293, -25, -667, -659, -831, -333, 237, 488, 134, -586, -728, -350, 386, 940, 638, 3, -792, -571, 282, 832, 1007, 36, -680, -760, 81, 859, 974, 544, -345, -793, -92, 120, 689, 716, -61, -409, -581, -107, 195, 502, 375, -5, -220, -402, 67, 246, 494, 292, 87, -613, -453, -263, 362, 756, 333, -149, -817, -567, -45, 590, 391, -125, -1119, -1164, -425, 618, 806, -32, -944, -960, -391, 593, 1024, 474, -246, -631, -40, 325, 552, 1010, 450, 27, -30, 117, 528, 725, 356, 150, 58, -204, -19, 72, 424, 177, -122, -665, -595, -435, 413, 434, 337, -262, -791, -664, -18, 790, 800, 49, -797, -743, -91, 496, 924, 311, -477, -704, -632, 345, 939, 421, -119]
3097a19o15p9P91N36R5m96n85p4K58O32J65k95k18l28M5J13M40L36m7o28j04j72
3119c49J78M35J44L41l67q88r6L39Q10K22q10n41j77L10N36N44k61r89j44RP46
3140hO96k45n54r96N57K98L48L09l33n92o8K72N65L17j09m25j11k6M3M37Q6p8
3162C83k63j99l23J68K90M79k17l79m65r5M87N17K29k82n88n05K60P26O70j13
3182G80p76o06J4N99Q94L4q12o06n3K46O65Pn0r75NJ65L89J63L71l11n69j19J98
3205c47M47J20j92K27k65l80K19M57K96K32l73n56j76J8R59J53k98p30k66J0Q46
3226D01L15M4p63p13j59O20O54J50l32p49j73K82O31K27j31n12k09k17Q02m7L80
3247E01l38n04K9K08L62J65j10M2k79j08J59r9L25K32m35m76j8J2L43L10J47q84
$$ y = [-119, -734, -813, -22, 514, 609, 113, -472, -546, -288, 344, 509, 214, -4, -332, -287, -174, 266, 602, 555, -73, -177, -349, -171, 264, 408, 749, 382, -506, -602, -263, 547, 769, -41, -582, -759, -449, 87, 631, 370, -619, -763, -754, -8, 688, 443, -111, -1107, -550, -252, 96, 405, 72, -520, -588, -316, 249, 566, 457, 32, -79, -105, -62, 375, 461, 383, 120, -79, -402, -234, 56, 535, 318, -61, -526, -621, -134, 383, 612, 330, -258, -763, -503, 223, 893, 780, 4, -602, -588, 11, 905, 939, 127, -479, -532, -286, 379, 386, 336, -639, -634, -469, -80, 83, 454, 143, -426, -545, -347, 100, 220, 28, 255, -10, -390, -171, 286, 582, 814, 441, -115, -291, -273, 686, 839, 541, -189, -455, -445, 401, 716, 760, -3, -716, -875, -255, 399, 549, 217, -532, -705, -423, 208, 435, 304, -208, -417, -634, 168, 121, 501, 163, -341, -312, -104, 258, 423, 313, 355, 76, -32, 127, 28, 353, 585, 150, -326, -344, -332, 11, 321, 468, -416]
3269d16k42k02P45M25L29o24n45j63K54R63J00j08o00n24K77P01L04j10k34p29
3289c99N7K84J76M23j93o63j09J02Q4L39k12j80K8j28N0J07L94N40m90k97m81
3310e68N52K36K80L98p26m97j31M60N30K08l28q42j12J9N78N42l96k18n52M7M29
3331i1N46K31o05n21RJ41N22J25j68n47J0jL07L63o1J15n22L9k62M53K05K48j48
3354C88j56o75R9L55N58Lk38p02NJ30L64O71l26p17o49J78M57O47J13q09k42P7
3376d69L31M25J86k61n90O3K59L09K05j48n23p0n1L55K72j5k06m34o3Q6j62M40
3398f1J07J91m24k60Q4K86K77M83l0p72j89j92Q06O67k14l88p63J59L60N34J11
3419G72o88o95m9K98O69M63m77m94o04R4M75K83n8o9k99PJ29M15J12l52P0k44
$$ y = [-416, -658, -860, -115, 310, 639, 15, -530, -693, -439, 524, 624, 516, -84, -608, -331, 370, 674, 564, 330, -399, -342, -58, 118, 541, 348, -315, -424, -322, -238, 101, -111, -291, -263, -391, -341, -234, 160, 700, 210, -87, -568, -16, 220, 500, 898, 172, -325, -456, 4, 534, 742, 414, -428, -540, -521, 57, 599, 203, -15, -567, -520, -91, 455, 686, 81, -440, -431, -290, 232, 357, 189, -358, -348, -349, -42, 321, 260, 375, -147, -108, -370, 83, 288, 536, 388, 232, -443, -344, 11, 569, 572, 334, -368, -363, -233, 131, 802, 476, -241, -890, -712, -255, 392, 505, -304, -546, -469, -138, 287, 473, 212, -378, -315, -56, 253, 458, 310, -213, -283, -334, 21, 293, 278, 72, -362, -425, -339, -501, -61, 46, 237, -187, -447, -363, -77, 200, 683, 653, -119, -308, -500, 306, 973, 759, 371, -392, -233, 127, 661, 772, 84, -611, -660, -362, 307, 770, 293, -201, -805, -711, -236, 47, -11, -80, -379, -372, -243, 172, 284, -68, 2, -242]
3441b42j5P5J30L00K02m16n2j15J31N67k25k66j16k59N3J98M60l8l54m01K8J82
3463a73M21M47l63p29l85L63P59K50m57m18q4J9K97L74J25m02k81j04L16qJ92
3484A59K30k78k57j45K25J24K60l73p6o7m04K53K37J97K01n19j19j12M24Q00k08
3505E52l50o02l51M62P91J80l0l81o18J74N91K94k28k83n84r4N46K47L1k70l85
3526c08j99K97K70o8r8J89l61J21R9j71K90L45m40r0k39j07N70R1J1m51j90KK79
3549a58M56j4r6o63n7M55M62q4j09l37n23K46M39N46N2n74m63J54K27M55K46m14
3571B46j62n33M09M30K33j00l10j09n39L79K61j84N0N9j55k78LJ24M69j42J4o94
3593e29N3K27M73L27l28n02n7k6M37L40L1m18l30k40N88L42K61j29q24k53L43
$$ y = [-242, -257, -182, -52, 248, 450, 34, -18, -133, -2, 565, 340, 74, -42, -301, -248, -50, 410, 372, 18, -383, -355, -173, 248, 695, 332, -397, -782, -419, 340, 590, 133, -285, -369, -350, -53, 321, 446, 44, -237, -341, -25, -33, 159, 389, 111, -146, -291, -66, 58, 318, -55, -131, -198, -602, -349, -112, 85, 286, -233, -352, -464, -40, 760, 552, 202, -400, -751, -289, 502, 682, 652, 271, -347, -173, 418, 712, 484, 201, -383, -477, 69, 316, 347, 77, -308, -507, -210, 60, -8, -106, 83, -278, -157, -58, -229, 61, 406, -34, -124, -363, -470, 100, 191, 202, -249, -439, -437, -158, 298, 284, 188, -475, -532, -77, 385, 301, 192, -145, -668, -422, 17, 563, 615, 41, -422, -268, -41, 414, 660, 246, 84, -449, -40, 390, 623, 523, 213, 104, -435, -56, 205, 21, 71, 130, -25, -303, -300, -176, 293, 151, 165, -529, -476, -249, 224, 551, 223, -279, -336, -362, 75, 415, 446, 28, -302, -542, 46, 388, 649, 520, -304, -557, -214]
3614b14L96K70k43l79q4j30M19K58k13k1k92j58K80p6K25J32O5m60n9J27J77J74
3636A94J00j68m58J0J65J47N96j93l71l19j32N55M66k26l20p49j35N93N08J68
3656D31k16p80J83j64N63J11J10k06l80P7K93L70j41o0m8j05M4R5J63p4l2j80
3678E4j84K1K3L32R7k55m84q1J70N59j9k52pl53j98O63N84k57j75m72l95P35%
3701A06O13q3o56j63j39N79J5k1k70l84oO16M7j22L4l26k84K64J41K86k60K83
3723B70j29n74L9M91K67r1K3k23l70j34N02K20J66k76m37n9J06M06L21l04l57
3744a43m21K27Q03J15l59k35k77j65L70M74j40j80n80j24K69L50r4J70j52JLJ1
3766g7O8M55k79j41QK88k20J80N2k9j81j66J69l80O33l9n37j57l56M40K76J98
$$ y = [-214, 182, 452, 209, -170, -254, -384, 35, 293, 80, 59, -233, -391, -111, -187, 38, 170, 235, -225, -284, -157, 20, 194, 294, 126, -332, -322, -157, -10, 586, 393, 22, -297, -429, 126, 592, 366, 46, -703, -838, -245, 263, 431, 215, -565, -382, -546, 17, 128, 238, 32, -348, -271, 22, 392, 251, 191, 143, 38, 82, 177, 340, 266, 234, 54, -130, -109, -86, 246, 343, 88, -396, -477, -307, 252, 233, -19, -26, -379, -577, 86, 670, 413, 238, -234, -629, 106, 106, 719, 636, -20, -183, -322, 257, 272, 251, -19, -403, -409, 207, 254, 132, 166, -160, -444, -180, -39, 247, -13, 270, 141, -433, -394, 97, 364, 273, 296, 73, -297, -431, 71, 291, 457, 181, -256, -315, -209, 197, 518, 214, -143, -564, -337, 466, 581, 222, -13, -290, -455, -85, 389, 249, 69, -511, -635, -366, -16, -110, 60, -92, -91, -88, -77, -9, 446, 167, 26, 34, 322, 102, 282, 334, 305, 124, -42, 127, -253, 380, 341, -196, -353, -709, -269, 7, 205]
3788B05r7n19j06O8P22J57r3l09k04j67L93L17L08j5o71R9o4K50j5K57n03k00
3810a87J20J15j81J63k68P0O7j64K78P7K37Q2k10l94J15j65N53J60k26m25j33
3831c16L20K09K58J4n40m52j03L54P35k43l20m17J53M73K24K74m94l12j49J40
3851a92J82L58K42n86j67mo9J46K1L28k24j08Qq9K66K72j2l32K2n0K17J69o9K30
3875E59n00n15K68L29J80j06k69k24k99K09K26K12j2p20K9L50M38J04j36l26j08
3896c11M66J17L44j63j33j68j46K05o7K21m9l55J06j68j98P5J33n7l6P3n0K5J59
3919B3L20K0l44m1K2L54JPl27j3k48K30K39K02k32l14l62J70K75L70o4m50k54
3942d16L3J69K24J08j09q6k16M11j39J11J0k7n3l84l7M49J73o5j71j49k86K57
$$ y = [205, 108, -411, -517, -449, 273, 430, 337, 28, -176, -343, 50, 367, 675, 660, -11, 88, 24, 274, 259, 516, 13, -187, -67, 48, -133, 30, -238, -168, -101, -265, 13, 90, 327, 409, 199, -195, -80, -245, 308, 468, 242, -183, -316, 4, 213, 471, 485, -55, -507, -610, -256, 479, 236, -84, -501, -348, 125, 349, 623, 129, -183, -332, -192, -10, 348, 590, 4, -163, -167, -236, -90, -69, 259, 35, -73, -65, -154, 112, 384, 372, 40, 62, 12, 229, 398, 329, 559, 59, -456, -188, 141, 321, 215, -54, -278, -577, -368, -142, 70, 58, -662, -633, -283, 155, 259, 123, -203, -311, 155, 272, 616, 453, 320, 152, 6, 211, 144, 365, 316, -39, 67, -101, -299, -224, -91, -148, -184, -111, -161, -136, 23, 343, 363, 19, -22, 0, 354, 355, 362, 35, 22, -226, 4, 243, 445, 213, -101, -463, -293, -18, 352, 288, -162, -416, -383, -214, 10, 118, 9, -77, -293, 118, -21, 90, 100, 73, 20, -364, -401, 48, 221, 156, -15, -164, -450, -193]
3964a93N7M55J00m28l4j28K12K26P9J68q48J24j97L23O33k16l98j88k3J79M45
3985C48k32l97m0l25L05N36K33k31l05j57J91J83K69j31p8l7j87M2K27l95M95
4006C14j95o2m24N4J01M05j5k46l19l7L23L22O6k29Kk77k9M56L66k03k00l38O7
4029i8p1O28j70n0l43k71J75J89J74J15m93j92l1L51K24kj60M6J27n2k72K38K35
4052B97k08K47l27l06K51K87o2J24j76m61K07R6K35n1l9l70L94j85K31P0j64m75
4074c85Q1K82K31K34k46l05o2l03M52L92k41j07l07M7J88K46o4j35P7l4j7J76
4096B00j19J69l57O7k32Q6k0J94K86k28j04l39l2O73j25J5k88k1k93K17M86K7
4118B62k01k64j27L51n3N57k33m04l8O3J99K90j45j52j17k81L56J42j67L5l5m37
$$ y = [-193, -136, 319, 419, -9, -43, -171, 41, 267, 346, 514, -334, -210, -407, -84, 549, 333, -65, -253, -276, -97, 348, 116, -281, -321, -646, -341, 195, 428, 197, -108, -265, -74, 109, 378, 247, 169, 132, -55, -13, 214, -181, 314, 119, 57, -367, -313, -212, 193, 178, -68, -387, -424, -101, 221, 287, 58, 60, -217, -246, 210, 576, 373, 173, -165, -98, -169, 459, 289, 239, -104, -375, -200, -11, 163, 278, -215, -407, -438, -87, 137, 135, -25, 21, 148, 96, -176, 62, 297, 89, 336, 9, -297, -46, 241, 179, 303, 127, -334, -127, -31, 204, 153, 114, -256, 138, -47, 184, 254, 90, -385, -304, -22, 209, 443, 197, -108, -170, -473, -21, 371, 130, 23, -284, -237, -49, 197, 133, -2, 75, 41, 24, 200, 81, 250, -107, -40, -272, -186, -206, -12, 274, 46, -58, -397, -429, 244, 119, 134, -154, -175, -468, -251, 235, 262, 61, -203, -330, 21, -32, 525, 292, -112, -150, -87, 112, 402, 257, 105, -12, -293, 63, 205, 38, 73, 38, -399]
4140c99j24O68j69j8J73l45J58l99L27J72K88j36P7l98J19N5L08P9k15l18k31
4161c28K86L96j60r8j07l01M7J94M35k82k66l60L26J05p2J55M1j88j9K61J38J0
4183B13j79K35l21k0K49r3j3j35R9n0m8o4K58j47M07k20k46j91j05L43KN7k69
4206b38K01k23Q7M29o6l09k24K12J17K42J49k78l5j97K0L93k8j23l78L10l46L55
4228G0K49j58k49P7L0j86J36l2J54n7j17k17J25L26r4J32k9k12k01nL47J67l49
4251i3O1l96j0N70K11K50p64J06k34J18N90m1r6k76l99K12L64J38j75l16k4q4
4273b88K75J20j41Rj53K42k28J32J64l5j66N3j83J39K74r1J42r0m48l04M27M4
4295a06K83j64k11k71O5J60M84o0l68r6j7J09L09j3J75k65k39K52M2L29j50n00
$$ y = [-399, -523, 145, -24, -42, 131, -214, -56, -455, -128, 44, 332, 196, 273, -125, -6, 49, 357, 436, 221, -97, -328, -42, 354, 194, 96, -11, -312, -265, -71, 364, 82, -184, -544, -218, -113, -185, -30, 11, -177, -196, 65, 203, 213, 34, 269, -52, -72, 177, 84, 71, -64, 35, -15, -63, -127, 131, -16, 391, 171, -75, -266, -371, -28, -26, 31, -238, -37, -260, -173, 256, 190, -119, -343, -131, -14, 228, 377, 99, 64, -133, -113, 280, 252, 129, -249, 61, -285, 70, 319, 161, -88, -11, 19, -167, -31, -63, 91, 34, -83, -300, -175, 151, 57, 189, 160, -52, -253, -258, 89, 256, -93, -32, -428, -438, 132, 343, 593, -171, -65, -299, -181, 409, 368, 272, -4, -403, -191, 173, 311, 136, -180, -204, -288, -13, 107, -34, -25, -178, 64, -164, -32, 132, 97, -69, -16, -199, -60, 214, 123, 265, 175, -273, -577, -150, -106, 177, 13, -198, -469, -404, -244, 240, 180, -188, -284, -301, -192, 117, 104, 279, 14, -225, 27, 69, 398, 248, -252]
4317b52P8L56Q1l2k1j27l27K83o8j39J79J83k22o2J19l10J40K89L67m67k58m2
4339b52j34N6N30kj0k98k07O5L72o9q0r5m3J41L12J18j65n6k45m8L78j9l4k33
4363a8l03o0L96J76k29R1p3j6o5j2J03j00L12l33K62k29KK49q7K64j82j37O5r8
4387b2K51R6n0l52j73J09L99J00j02p35J6L05j9K35J27k01j89j73K99J00K23k81
4409c7L7j09J08J54J35p9l2m9j79K9R4J60j36J75l87J25k50M19L8m8k21J34j17
4432c6K6J12p5L36l65j41l6L73J67l84j33J54j15K55o4p0NL6k14k08O33R1l26
4455B1J2k91J52q9L15L6l73J53l8O9J29k6k65J66M3jq9j02K16j61J36j90J8J09
4479e0M2K00O2k17j73j62M29N9n0r9p3j50K00m6L45k79n41R5J37K62k10N06n66
$$ y = [-252, -174, 182, 263, 231, 210, 83, -244, 39, -29, -168, 11, 194, -28, -90, 29, -281, -141, 148, 515, 48, -210, -252, -386, -330, 200, 198, 188, -110, -317, -252, 120, 51, -29, -124, -167, -26, 286, 404, 239, 183, -62, -110, 268, 249, 215, -18, -321, -381, 15, 191, -38, 53, -20, -36, -101, -113, -10, -110, 202, -131, 131, -98, -96, 153, 66, 330, 148, 11, 76, -22, 229, 325, 275, -77, -250, -141, 258, 358, 256, -479, -463, -158, -177, 58, 185, -16, -205, -378, -79, 21, 244, -37, 0, -109, -1, 153, 288, 209, 177, 128, -51, -22, 72, 232, 96, 271, -116, 9, -241, 178, 216, 168, -53, 81, -36, -10, 102, 27, 363, -2, -143, -179, 194, 361, -23, -156, -2, -117, 138, 74, 4, 9, 45, -169, -377, 256, 347, 21, 33, -258, -106, -195, 120, 156, -217, -64, -102, -33, 96, 70, -195, -29, 14, 13, -76, -178, 38, -123, 13, -177, -159, -50, -8, 192, 254, 37, -136, -298, 131, 190, 140, 41, -32, -182, 18, -28, 317, 38, -503, -408, -271, -9, -219, 287, -279]
4502b79qK15K01k4l5P0j90oOL09J52j49j35o6j57J14J59j76K52k82q9n2Q8M6J57
4527A21r8q8m49J45L36K9K62k71j05n6J02J73L03q3l62qK31l9j19o1l16K75L0
4550d8P8Q2J37j26k9l27M13k45J66j09q3K4q8J95j25J91nO1p8j79N6m8M31j67
4574A77m6j62o6L40k52M02j75l80q6K51R4m2k83o4K02j94K85L56j37l21P0k04
4596b35L20J24j02m4k10K21k03K48NM3j15Q7l2o8J7K2Q2J48l50Q1J14k61L09J5
4620B16l36J29J69l59J42J91P9m65J2K30o4K17R2l24j99J75j68N31m1j77J2n8
4642Dkj89M89l50J25k07R2J65r3L95m07j97J09m84N81O3k14M5J31q5p8l9L49m5
4666A58n8j76j04K87J56j21p6k50Q7k21L57M19k39j04m04K11J04l7K54O0l72J13
$$ y = [-279, -287, -72, 129, 105, 70, 140, -50, -56, -50, 259, 411, 262, 127, 61, -96, 18, 177, 1, 253, -29, -118, -170, -82, -36, 121, 23, -65, -514, -369, -33, -4, 258, -13, -118, -174, -72, 101, 404, 321, -41, -49, 182, 143, 24, -37, -353, -78, -48, 30, 112, 249, 123, 94, -233, 180, -65, 101, -8, -91, -67, -155, 40, -85, 106, 101, 162, 84, -95, -39, -87, 344, 177, 131, -31, -97, 243, -9, 393, 218, -162, -248, 3, 97, 55, -228, -292, -90, -284, 1, 357, 220, -101, -31, -235, 85, 209, 107, 63, -147, 74, -129, 119, 124, 167, 52, 139, 107, 39, 56, 78, 160, 308, -42, 39, 153, -108, 201, 216, -120, 9, 178, -181, -39, 152, 231, -234, -222, 8, -56, 161, 253, -71, -270, -95, -263, 268, 227, 50, 62, 4, 2, -187, 302, -48, 77, -130, -38, 127, 34, 429, 22, -175, -66, -550, 31, 94, -120, -75, 56, -29, -107, -146, 203, 158, 100, -76, -180, 107, 263, 142, 66, -184, -97, -318, 39, 458, 219, 115, -289, -78, 26, -11, 243, 303, -69, 44]
4688D4j01Mk8K34k58J39m34M54jR4l21O7j62L28n3m6NN4J75k37J10Q1j67KK76
4713B59l41l07K96J45j15N3j00M4O6R4J17R7m22J23q0k0L24l4k81m8K4n2M64l33
4737b7ON5k48J62q9K13N36m67n6j56J8K2J36j5l1J74k58j70O5K68j09j05p1J40
4761gj35O3J06Q3Jp9j20J67j3J00L8k48m7R7J00L85k27m99K06q4K26k17K07r4
4785In8o5j9J83Kk24L43j71j99K74n9R9P2L1l57L5j9K37k81L21l3j75p9j7K53
4810A03j57n7q3o3K03M55l48l56L60k16L8L23q2p6P0j65j52J11L19j0k6l53J46
4833a6J72k13o8P2M6K44j4r4j79mN3O1j85q8K74k25K42%j86j26Q2k9K36O8p2r0
4859c9k11j76L97R6ol04o3K90n1O5J11j96j16K21p6K45l1k6Oj82k46M7K12P2j16
$$ y = [44, -57, -53, -81, 153, -105, 34, -400, 54, 53, 147, -174, -107, -269, 59, 6, -40, -35, 19, 194, -43, 67, 148, -19, -17, 259, -82, -389, -93, 52, -63, -10, -110, -66, 0, 94, 211, 308, -114, 9, -71, -91, 233, 199, -82, -130, -106, -158, 306, -27, -21, 34, -214, -52, -141, 72, 608, 141, 85, -71, -53, -31, 105, 90, 59, 233, -25, -195, -130, 138, 29, -76, -147, -7, -142, -79, 27, 110, 111, 32, -88, 79, 66, 166, 204, -44, -91, 6, 106, 491, 264, -235, -29, -113, 113, -104, 103, 9, -49, -114, -133, 50, 52, -172, 171, 0, -199, 75, 16, 115, 187, 218, -139, -104, -123, 114, -167, 154, 121, -54, -133, -150, 103, -54, -111, -194, -257, -54, 401, 53, -303, 57, -159, -121, 202, 120, 44, 114, -51, -203, -92, 227, 217, 191, -162, -16, 156, -57, -125, -53, -7, 237, 223, 129, -50, -54, -1, 60, -125, -213, 61, -164, 78, 78, -108, -234, -152, -181, 55, 123, 51, -39, -250, -426, -29, 67, 61, -243, -306, -16, -67, -2, 109, -87, -203, 18, -58, 187, 156, 130, 136, -46, -292, -245, -33, 39, -77]
4884g7J43m36L07R5j85R2J59l29J70j53n6M29j04J56k62M2o5K29j67J08O6j58
4906Dk57K79J69J62l91N9j96j09J87M07k73k86J14J96j29L94l25K5M3q1J7q3J52
4929G8P2r5r1J95l89J62r7J06k11O9j16M95l46K61R1l17J62k10K39M4j80Q1K50
4952B53l64j10J61K81l27p3n3L1L78k88P9J37l20MK46R5j79J53p8k3m7K91o6J4
4976A95p6m8n8o6j35lJ71r2r9j3J79q9J27J93j93j39r6j00L00K82J51l35j41J56
5000G1K52j35o6O0j24L5K8j61R9k14L0j68J33K37j54J32k9P1q7N7Q6j81l8K05
5024A39j88M8kj49L66k98K00l06J67J05j28K9j03K73K6n7L1Kj13k93K23k30M38
5047A80l47R4K7m5O8K0r8L24j55k63P0J4RJ55k12K27k66P8J77j6r7Q5j61j61K71
$$ y = [-77, 66, -370, -63, 32, -153, -61, 98, -231, -61, -214, -270, 159, 55, 211, -51, -9, -74, 155, -12, 96, 162, 4, -253, 26, 195, 357, -34, 25, -171, -280, -93, 314, 41, -245, -131, 65, -64, 330, 5, 30, 73, -8, 9, -74, 78, 150, 55, -36, 159, -230, -68, -165, -59, -270, -201, -317, 178, -168, 93, 184, -133, 29, -181, 58, 102, -78, 3, 253, -111, -221, -60, 221, -106, -179, -232, -201, 177, -111, -32, 105, -215, -211, 35, 130, -49, 104, 26, 3, -44, 247, 181, 195, 119, 71, 13, -53, -188, -191, -20, -112, -211, -224, -45, -134, -7, 186, -7, -146, -242, -342, -42, 240, 391, 56, -85, 71, 323, 188, 122, 182, 58, 93, 121, -40, 59, -155, -125, -293, -160, 77, -77, 55, 26, 97, 10, 67, 153, -28, -66, 139, -49, -1, -3, -152, 214, -84, 116, -190, -23, 82, -46, -17, -120, 153, 179, 122, 153, 155, 42, -251, -28, -258, 180, -167, -73, -46, -91, -23, -3, -101, 223, 68, -195, -125, -111, -102, 53, -159, 68, -198, -120, 57, 41, -56, 29, -132, -293, -22]
5072b2j9n4K15Lj10m0j46J13L5J00q2j0J32Q0j65M0o8n2j83K60K8J98N4m73P3
5097i3K53J4j08p3k50M88n11J09J11K05j00m25J60K68j7j4j74K58k76Q3R9R1q
5120I0k73M3Q1K35j9j92L94j49Q4m12L1o4J96J80k35J53m23K77r0K08L8j54l89
5143c90J73L04j47Q5N4k48j79M15j74M81k99k48RK02K07k03K3J9j42M0K2j71M02
5166B35k27K65l03l9K7k69L96k82J78J32l04L8J05P4j08K19l97J33J84K5q1L2
5188C3j12j13K0N98l21j14k3P4m48K15L76k16j47L00k59K35q8p4l3p3J37j2k77
5211c22K36J62j81J44k57K63k8J14m51M31p5j32K13j16R2J1l42M13l06J55j52
5232a28M05m9k94n6p2K36r4J17j87o3J33O4j68j35L22j51J8K29j10J79j27R3j59
$$ y = [-22, -41, -95, 120, 123, 13, -27, -173, -60, -25, 75, -7, -17, 115, 195, 30, 70, 2, -50, -233, 27, 55, 253, 307, -166, -93, 160, 174, 66, -7, -257, 231, -280, -171, -60, 145, 45, -380, -220, 48, 31, 17, -157, 101, -175, -92, 7, 98, 90, -183, -140, -59, 176, 157, -35, 359, 210, 294, -118, -87, -151, 45, 225, -10, 143, -280, -3, -93, 115, 153, -1, -390, -217, 87, -60, 25, 79, -169, -348, 67, -107, 374, 75, -173, -164, 38, 245, 42, 65, 84, -58, -18, 4, -167, 235, 8, 273, -30, -69, -42, -311, 85, -197, -19, 113, -191, -153, -48, 26, -82, 137, -260, -127, 57, 82, 1, 33, -79, -192, -172, 426, 105, -9, -32, 42, -406, -191, 185, -31, -178, 122, -137, 98, 10, -64, -97, -170, -33, -45, -322, -86, 76, -105, 39, -218, 45, 17, 131, -320, 111, 36, -96, 117, 1, 93, 104, -238, 175, -131, 24, -128, 277, 228, -66, -122, -194, 42, -52, 65, -122, -185, -52, 12, -156, -291, 31, -120, -102, 127, 17, 196, 69, 162, 3]
5255Cp0Q8K02l46M4K7j82M93j46k50J72J66m65K45J99j06j32K50k15n3M7j83K48
5278C6Q6j71q8R4J0N4J13j07K1r9n3J00J05R3Q0l33j7J35J30j12J43q7l40K08
5302Aj00Q4J05J67r8l62J75N5L39m27L43k28RL3k90K66J14j94J04j46N5K02k08
5325aR1l1l10J76J34r1J3J73l74K32j27K42O7k80O5k90R9J51K99k96j69L72k26
5348h1J55J02k52O8L5j18R6J32k09L9m9p8J85N7p2P1l8M7l49N8J36K6n3K76k54
5373g0K29j7M5n8L1m02M29l66L03O6o8r9O6k62J15N1J33K9m7k77J99L35n20K67
$$ y = [3, -67, 21, 223, -123, -79, -52, -234, 259, 113, -137, 35, 201, -264, -19, 180, 74, -58, 192, -23, -76, -29, -212, 36, 122, -49, -137, -43, -33, 21, 134, 27, 48, -51, -104, -4, 101, 194, 274, -59, -76, 59, 189, 77, 220, 133, -207, 1, -99, -15, 90, 257, 159, -203, -28, 27, 366, -61, 282, 54, 63, 96, -194, 72, 186, -8, 96, -50, 5, 207, -1, 90, 59, -251, -75, 59, -32, -19, 154, -220, 12, -115, 127, 194, -86, -21, -311, -212, -61, 238, -58, -227, 145, -81, 74, 176, -76, -8, 27, -91, 5, 137, -72, -33, -82, -160, 25, 82, 10, 81, 43, 90, -259, -201, -65, -39, -92, 184, -70, 159, 142, 187, 129, 160, -242, 187, -179, 124, 190, 122, 23, 89, -173, -58, -7, 126, 155, 108, -169, 30, 365, -155, 112]
$$ [...]
8191G5
##END NTUPLES=NMR FID
##END=
