##TITLE=1H_Ser 6-6-V-5
 CDCl3
 8 sc, 
 1.07.2022
##JCAMPDX= 6.0         $$ Bruker NMR JCAMP-DX V2.0
##DATA TYPE= NMR FID
##DATA CLASS= NTUPLES
##ORIGIN= UXNMR, Bruker Analytische Messtechnik GmbH
##OWNER= root
$$ XWIN-NMR		Version 3.5
$$ Fri Jul  1 15:07:12 2022 Russian Standard Time (UT+4h)  she@DPX200
##.OBSERVE FREQUENCY= 200.1313499994
##.OBSERVE NUCLEUS= ^1H
##.DELAY= (6, 6)
##.ACQUISITION MODE= SIMULTANEOUS
##.ACQUISITION SCHEME= undefined
##.AVERAGES= 8
##.DIGITISER RES= 18
##SPECTROMETER/DATA SYSTEM= spect
##.PULSE SEQUENCE= zg30
##.SOLVENT NAME= CDCl3
##.SHIFT REFERENCE= (INTERNAL, CDCl3, 0, 15.7039)
##AUDIT TRAIL= $$ (NUMBER, WHEN, WHO, WHERE, WHAT)
$$ ##TITLE= Audit trail, XWIN-NMR		Version 3.5
$$ ##JCAMPDX= 5.01
$$ ##ORIGIN= Bruker BioSpin GmbH
$$ ##OWNER= she
$$ F:/spectra/data/she/nmr/H-F/1/audita.txt
$$ ##AUDIT TRAIL=  $$ (NUMBER, WHEN, WHO, WHERE, WHAT)
(   1,<2022-07-01 15:06:02.07 +0400>,<she>,<DPX200>,
      <created by zg, POWCHK disabled, PULCHK disabled
       configuration hash MD5:
       00 E9 B6 7A A2 85 ED C7 34 08 36 98 17 FE 4E 26
       data hash MD5: 16K
       F2 99 00 14 05 1A 84 EE CD 10 1E F5 30 2E 5B D9>)
$$ ##END=
$$ 
$$ hash MD5
$$ 36 D0 5B 47 68 58 1F 70 8F DF F3 E5 7F 96 82 BF
##$RELAX= 
##$RELAX= 
##$RELAX= 
##$RELAX= 
##$RELAX= 
##$RELAX= 
$$ Bruker specific parameters
$$ --------------------------
##$DU= <F:/spectra>
##$EXPNO= 1
##$NAME= <H-F>
##$PROCNO= 1
##$TYPE= <nmr>
##$USER= <she>
##$AMP= (0..31)
100 100 100 100 100 100 100 100 100 100 100 100 100 100 100 100 100 100 
100 100 100 100 100 100 100 100 100 100 100 100 100 100 
##$AQSEQ= 0
##$AQ_mod= 1
##$AUNM= <au_zg>
##$AUTOPOS= <>
##$BF1= 200.13
##$BF2= 200.13
##$BF3= 200.13
##$BF4= 200.13
##$BF5= 200.13
##$BF6= 200.13
##$BF7= 200.13
##$BF8= 200.13
##$BYTORDA= 1
##$CFDGTYP= 0
##$CFRGTYP= 5
##$CHEMSTR= <none>
##$CNST= (0..31)
1 1 145 1 1 1 1 1 1 1 1 1 1 1 1 1 1 1 1 1 1 1 1 1 1 1 1 1 1 1 1 1 
##$CPDPRG= <>
##$CPDPRG1= <>
##$CPDPRG2= <>
##$CPDPRG3= <>
##$CPDPRG4= <mlev>
##$CPDPRG5= <mlev>
##$CPDPRG6= <mlev>
##$CPDPRG7= <mlev>
##$CPDPRG8= <mlev>
##$CPDPRGB= <>
##$CPDPRGT= <>
##$D= (0..31)
0 1.2 0 0 0 0 0 0 0 0.06 0 0.03 0 0 0 0 0.0002 0 0 0 0 0 0 0 0 0 0 0 0 
0 0 0 
##$DATE= 1656673561
##$DBL= (0..7)
120 120 120 120 120 120 120 120 
##$DBP= (0..7)
150 150 150 150 150 150 150 150 
##$DBP07= 0
##$DBPNAM0= <>
##$DBPNAM1= <>
##$DBPNAM2= <>
##$DBPNAM3= <>
##$DBPNAM4= <>
##$DBPNAM5= <>
##$DBPNAM6= <>
##$DBPNAM7= <>
##$DBPOAL= (0..7)
0.5 0.5 0.5 0.5 0.5 0.5 0.5 0.5 
##$DBPOFFS= (0..7)
0 0 0 0 0 0 0 0 
##$DE= 6
##$DECBNUC= <off>
##$DECIM= 32
##$DECNUC= <off>
##$DECSTAT= 4
##$DIGMOD= 1
##$DIGTYP= 9
##$DL= (0..7)
0 120 120 120 120 120 120 120 
##$DP= (0..7)
150 150 150 150 150 150 150 150 
##$DP07= 0
##$DPNAME0= <>
##$DPNAME1= <>
##$DPNAME2= <>
##$DPNAME3= <>
##$DPNAME4= <>
##$DPNAME5= <>
##$DPNAME6= <>
##$DPNAME7= <>
##$DPOAL= (0..7)
0.5 0.5 0.5 0.5 0.5 0.5 0.5 0.5 
##$DPOFFS= (0..7)
0 0 0 0 0 0 0 0 
##$DQDMODE= 0
##$DR= 18
##$DS= 0
##$DSLIST= <SSSSSSSSSSSSSSS>
$$ [...]
##$SUBNAM2= <"">
##$SUBNAM3= <"">
##$SUBNAM4= <"">
##$SUBNAM5= <"">
##$SUBNAM6= <"">
##$SUBNAM7= <"">
##$SUBNAM8= <"">
##$SUBNAM9= <"">
##$SW= 18.0517283424941
##$SWIBOX= (0..15)
0 0 2 0 0 0 0 0 0 0 0 0 0 0 0 0 
##$SW_h= 3612.71676300578
##$TD= 16384
##$TD0= 1
##$TE= 0
##$TE2= 300
##$TE3= 300
##$TEG= 300
##$TL= (0..7)
0 120 120 120 120 120 120 120 
##$TP= (0..7)
150 150 150 150 150 150 150 150 
##$TP07= 0
##$TPNAME0= <>
##$TPNAME1= <>
##$TPNAME2= <>
##$TPNAME3= <>
##$TPNAME4= <>
##$TPNAME5= <>
##$TPNAME6= <>
##$TPNAME7= <>
##$TPOAL= (0..7)
0.5 0.5 0.5 0.5 0.5 0.5 0.5 0.5 
##$TPOFFS= (0..7)
0 0 0 0 0 0 0 0 
##$TUNHIN= 0
##$TUNHOUT= 0
##$TUNXOUT= 0
##$USERA1= <user>
##$USERA2= <user>
##$USERA3= <user>
##$USERA4= <user>
##$USERA5= <user>
##$V9= 5
##$VALIST= <valist>
##$VCLIST= <CCCCCCCCCCCCCCC>
##$VD= 0
##$VDLIST= <DDDDDDDDDDDDDDD>
##$VPLIST= <PPPPPPPPPPPPPPP>
##$VTLIST= <TTTTTTTTTTTTTTT>
##$WBST= 1024
##$WBSW= 4
##$XGAIN= (0..3)
0 0 0 0 
##$XL= 0
##$YL= 0
##$YMAX_a= 263012
##$YMIN_a= -469913
##$ZGOPTNS= <>
##$ZL1= 120
##$ZL2= 120
##$ZL3= 120
##$ZL4= 120
##$ABSF1= 10
##$ABSF2= 0
##$ABSG= 5
##$ABSL= 3
##$ALPHA= 0
##$AQORDER= 0
##$ASSFAC= 0
##$ASSFACI= 0
##$ASSFACX= 0
##$ASSWID= 0
##$AUNMP= <proc_1d>
##$AZFE= 0.1
##$AZFW= 0.1
##$BCFW= 1
##$BC_mod= 2
##$BYTORDP= 1
##$COROFFS= 0
##$CY= 11.3945322036743
##$DATMOD= 1
##$DC= 2
##$DFILT= <>
##$DTYPP= 0
##$F1P= 2.36226072786647
##$F2P= -0.459571619588291
##$FCOR= 0.5
##$FTSIZE= 0
##$FT_mod= 4
##$GAMMA= 1
##$GB= 0.15
##$INTBC= 1
##$INTSCL= 1
##$ISEN= 128
##$LB= 0.24
##$LEV0= 0
##$LPBIN= 0
##$MAXI= 10000
##$MC2= 0
##$MEAN= 0
##$ME_mod= 0
##$MI= 1.114404
##$NCOEF= 0
##$NC_proc= 0
##$NLEV= 6
##$NOISF1= 3.799351
##$NOISF2= 2.8
##$NSP= 1
##$NTH_PI= 0
##$NZP= 0
##$OFFSET= 15.70392
##$PC= 1
##$PHC0= -18046.84
##$PHC1= 17.60069
##$PH_mod= 1
##$PKNL= yes
##$PPARMOD= 0
##$PSCAL= 0
##$PSIGN= 0
##$REVERSE= no
##$SF= 200.130013532006
##$SI= 16384
##$SIGF1= 3
##$SIGF2= 2
##$SINO= 400
##$SIOLD= 16384
##$SREGLST= <1H.CDCl3>
##$SSB= 0
##$STSI= 0
##$STSR= 0
##$SW_p= 3612.71676300578
##$SYMM= 0
##$S_DEV= 0
##$TDeff= 0
##$TDoff= 0
##$TI= <>
##$TILT= no
##$TM1= 0
##$TM2= 0
##$TOPLEV= 0
##$USERP1= <user>
##$USERP2= <user>
##$USERP3= <user>
##$USERP4= <user>
##$USERP5= <user>
##$WDW= 1
##$XDIM= 8192
##$YMAX_p= 0
##$YMIN_p= 0
$$ End of Bruker specific parameters
$$ ---------------------------------
##NTUPLES= NMR FID
##VAR_NAME=  TIME,          FID/REAL,        FID/IMAG
##SYMBOL=    X,             R,               I
##VAR_TYPE=  INDEPENDENT,   DEPENDENT,       DEPENDENT
##VAR_FORM=  AFFN,          ASDF,            ASDF
##VAR_DIM=   8192,          8192,            8192
##UNITS=     SECONDS,       ARBITRARY UNITS, ARBITRARY UNITS
##FACTOR=    0.0002768,     1,               1
##FIRST=     0,             0,               0
##LAST=      2.2672688,     0,               0
##MIN=       0,             -469913,         0
##MAX=       2.2672688,     263012,          0
$$ Real data points
##PAGE= N=1
##DATA TABLE= (X++(R..R)), XYDATA
$$ [...]
$$ plain form
2705 -1960 684 -189 176 199 969 274 -756 -434 1706 -180 763 85 149 27 460 782 -38 749 -473
2724 -473 458 -160 1166 884 -704 -1330 140 954 -707 214 -566 -113 -545 572 284 -748 -1377 1034
2742 1034 -266 -533 47 -1752 -345 1093 449 49 1142 -659 -1151 913 -123 -190 440 -149 474
2759 474 -294 -268 -11 -374 -294 1343 138 1071 -665 112 189 160 245 1245 -464 954 -111 -943 -33
2778 -33 68 -807 238 -379 12 10 -1752 -1276 -913 -1732 -45 -145 -1071 453 -742 148 81 -435 -793 76
2798 76 484 -279 -246 967 -1330 -389 -556 -99 1634 801 -1678 300 -5 -461 -1014 -911 703 826 -613
2817 -613 -353 181 188 -916 -159 -984 1065 268 84 -493 204 581 -941 94 -921 88 -744 -130 -1094
2836 -1094 -701 -401 -246 -550 -555 -509 -675 -310 -398 -887 671 -826 4 -433 942 -1704 966 1708 -454
$$ packed form
2705a960K644q73L65K3P70o95j030L22K140j886R43o78O4j22M33L22q20P87j222
2724d73R31o18J326k82j588o26J470Q14j661R21p80M53m32J117k88j032o29K411
2742A034j300k67N80j799J407J438o44m00J093j801m92K064j036o7O30n89O23
2759D74p68K6K57l63Q0J637j205R33j736P77P7k9Q5J000j709J418j065q32R10
2778c3J01q75J045o17L91kj762M76L63q19J687j00r26J524j195Q90o7n16l58Q69
2798G6M08p63L3J213k297R41j67M57J733q33k479J978l05m56n53J03J614J23j439
2817f13K60N34Pj104P57q25K049p97j84n77O97L77j522J035j015J009q32O14r64
2836a094L93L00J55l04nM6j66L65q8m89J558j497Q30m37J375k646K670P42k162
$$ plain form
2855 -454 -474 -949 2481 -324 691 -766 -955 725 -152 1700 243 29 268 -373 2930 -474 127
2872 127 -725 262 852 -414 360 1354 1265 683 -132 -189 313 -847 -316 1371 573 90 -46 1340 -426
2891 -426 -1790 606 63 873 -491 -1198 451 -271 -380 657 22 -958 408 358 788 -652 1090 211
2909 211 -279 -241 -206 -397 986 161 427 1378 995 -113 -137 -656 -527 124 -32 950 690 -1525 -427 656
2929 656 -284 -1405 496 635 -43 356 465 739 962 80 291 -533 -699 -495 -520 505 -578 -294 -155
2948 -155 221 -112 -709 -702 1186 -2373 362 215 853 1977 -340 -211 -892 -1508 -643 674 -2113 496
2966 496 830 917 -486 84 469 -941 701 -109 182 -49 -1233 -197 854 -804 49 214 167 -975
2984 -975 529 -777 -2462 141 -521 -116 -81 -1068 533 -971 715 -1534 1377 143 -1145 478
$$ packed form
2855d54k0m75L430k805J015j457j89J680q77J852j457k14K39o41L303l404O01
2872A27q52R87N90j266P74R94q9n82q15n7N02j160N31J687p98m83j36J386j766
2891d26j364K396n43Q10j364p07J649p22j09J037o35r80J366n0M30j440J742q79
2909B11m90L8L5j91J383q25K66R51l83j108k4n19J29O51j56R82k60k215J098J083
2929F56r40j121J901J39o78L99J09K74K23q82K11q24j66K04k5J025j083K84J39
2948a55L76l33n97PJ888l559K735j47O38J124k317J29o81o16Q65J317k787K609
2966D96L34Q7j403N70L85j410J642q10K91k31j184J036J051j658Q53J65m7j142
2984i75J504j306j685K603o62M05L5r87J601j504J686k249K911j234j288J623
$$ plain form
3000 478 752 443 -620 888 14 477 647 468 -1704 773 -385 253 -491 94 -359 -240 167 906
3018 906 -1246 -576 -24 69 -1341 -168 628 -197 4 -436 1157 747 -945 -207 2184 375 -1048 347
3036 347 -210 -253 -654 -1354 880 1313 -263 -313 540 -510 -184 1090 -1467 180 426 842 -965 -611
3054 -611 1011 -1040 -1143 -1713 377 784 -1167 -676 -1338 28 -300 326 629 -256 920 421 1826 1518
3072 1518 -685 -374 1168 -939 349 -45 -151 -856 -672 -401 -126 -81 -833 -347 -120 -66 1171 50
3090 50 260 -304 -646 -628 -631 -799 -1020 749 -1107 817 1542 -1009 187 -1432 447 193 1441 354
3108 354 1081 61 -863 -331 -623 113 1284 405 1815 -447 -576 449 188 1127 1068 -558 -309 693
3126 693 247 -672 1337 294 1058 475 65 -811 550 1420 -1242 -97 1640 -241 447 105 -615 487
$$ packed form
3000D78K74l09j063J508q74M63J70j79k172K477j158O38p44N85m53J19M07P39
3018I06k152O70N52R3j410J173P96q25K01m40J593m10j692P38K391j809j423J395
3036C47n57m3m01p00K234M33j576n0Q53j050L26J274k557J647K46M16j807L54
3054f11J622k051j03n70K090M07j951M91o62J366l28O26L03q85J176m99J405l08
3072A518k203L11J542k107J288l94j06p05J84K71K75M5p52M86K27N4J237j121
3090E0K10n64l42J8lj68k21J769j856J924P25k551J196j619J879k54J248j087
3108C54P27j020r24N32k92P36J171q79J410k262j29J025k61R39n9j626K49J002
3126F93m46r19K009j043P64n83m10q76J361Q70k662J145J737j881O88l42p20J102
$$ plain form
3144 487 -1567 2348 -356 -126 250 665 832 262 -637 -2127 1017 527 -470 -241 -1562 -648 546 -1166
3162 -1166 818 396 -1292 -1093 -11 -133 -335 -175 -763 -1572 1357 477 -18 -1220 158 269 1394
3179 1394 589 272 -6 -690 1397 -1600 828 -1026 578 -415 -788 598 502 -1533 88 -9 -324 512
3197 512 1023 803 686 32 659 1105 80 -979 -397 -4 -914 130 -508 -498 1484 501 65 -577 593
3216 593 64 1464 1750 371 268 1156 -252 -308 120 1187 -71 -154 172 -1590 764 -616 507 800
3234 800 -1473 1108 32 94 1051 214 368 -132 657 -880 -1467 -47 -731 -190 1794 -2273 771 -1040
3252 -1040 -290 802 -233 -523 -158 635 529 352 -62 372 -838 31 -1049 92 354 -812 1226
3269 1226 475 295 651 137 1086 988 -323 834 343 -968 -684 -59 396 210 523 -1379 121 259
$$ packed form
3144D87k054L915k704K30L76M15J67n70q99j490L144m90r97K29j321R14J194j712
3162a166J984m22j688J99J082j22k02J60n88q09K929q80m95j202J378J11J125
3179A394q05l17k78o84K087k997K428j854J604r93l73J386r6k035J621r7l15Q36
3197E12N11k20j17o54O27M46j025j059N82L93r10J044o38J0J982r83m36o42J170
3216E93n29J400K86j379j03Q88j408n6M28J067j258q3L26j762K354j380J123K93
3234H00k273K581j076O2R57q37J54n00P89j537n87J420o84N41J984m067L044j811
3252a040P50J092j035k90L65P93j06j77m14M34j210Q69j080J141K62j166K038
3269A226p51j80L56n14R49r8j311J157m91j311K84O25M55j86L13j902J500J38
$$ plain form
3287 259 157 -1247 -206 -201 21 602 -779 1413 193 -1238 332 851 -202 -348 -489 -612 873 1153
3305 1153 -302 153 564 -1413 333 -87 759 -1123 354 -1173 -391 407 -587 -37 389 -1205 -825
3322 -825 394 -985 937 361 -258 -1221 -1266 998 664 -683 -318 352 -674 201 -986 1811 -802
3339 -802 371 1144 402 472 -907 410 565 -1427 167 325 151 -853 -1295 199 -1149 -632 256 -161
3357 -161 -1874 -345 234 1607 490 216 -63 1023 554 123 521 463 26 -359 1046 -571 -495 -77
3375 -77 -710 -393 -811 1196 1638 1017 -380 -1121 18 229 -1041 9 -196 -484 -741 77 128 107 130 694
3395 694 806 -724 -1555 -874 -633 -198 750 -590 486 73 -717 494 978 -240 -1108 79 621 617 451
3414 451 822 -203 -390 -621 947 885 -280 439 512 72 -386 20 282 -799 -560 -660 -900 -142 -654
$$ packed form
3287B59j02j404J041NK22N81j381K192j220j431J570N19j053j46j41j23J485K80
3305A153j455M55M11j977J746m20Q46j882J477j527P82P98r94N50M26j594L80
3322h25J219j379J922n76o19r63m5K264l34j347L65O70j026Q75j187K797k613
3339h02J173P73p42P0j379J317J55j992J594J58j74j004m42J494j348N17Q88m17
3357a61j713J529N79J373j117k74k79J086m69m31L98n8m37l85J405j617P6M18
3375g7o33L17m18K007M42o21j397p41J139K11j270J050k05k88k57Q18N1k1K3N64
3395F94J12j530q31O81K41M35R48j340J076m13p90J211M84j218q68J187N42mj66
3414D51L71j025j87k31J568o2j165P19P3m40m58M06K62j081K39j00k40P58n12
$$ plain form
3433 -654 464 142 -415 -39 -510 -717 219 -934 -320 -330 220 718 566 672 -467 -101 634 399 177
3452 177 797 -300 24 347 -447 -316 1 495 -218 366 -202 12 153 -375 -782 139 -380 292 441 -147
3472 -147 -142 -420 -802 -471 7 368 210 -494 71 249 -655 -778 -716 143 -759 213 -717 -625 -1142 449 326
3493 326 508 -835 516 638 -839 -1045 41 -460 232 689 -1494 -907 -542 -140 -435 -131 -497 566
3511 566 -1066 -1045 140 849 336 -486 -638 198 764 -97 -639 -318 -672 661 600 1302 -546 291 524
3530 524 -599 -289 -894 -532 -2026 734 242 -251 -16 375 -690 148 -859 38 -213 -124 1144 842
3548 842 343 -481 283 150 315 1673 1109 54 -106 374 -1164 252 -663 -332 -144 -1027 -1294 600
3566 600 1223 -339 1398 50 -154 -752 -569 278 399 -239 -456 50 975 -153 114 955 843 236 1061
$$ packed form
3433f54J118l22n57L76m71k07R36j153O14j0N50M98j52J06j139L66P35k35k22
3452A77O20j097L24L23p94J31L17M94p13N84n68K14J41n28m07R21n19O72J49n88
3472a47Nk78l82L31M78L61j58p04N65J78r04j23O2Q59r02R72r30R2n17J591j23
3493C26J82j343J351J22j477k06J086n01O92M57k183N87L65M02k95L04l66J063
3511E66j632K1J185P09n13q22j52Q36N66q61n42L21l54J333o1P02j848Q37K33
3530E24j123L10o05L62j494K760m92m93K35L91j065Q38j007Q97k51Q9J268l02
3548H42m99q24P64j33J65J358n64j055j60M80j538J416r15L31J88q83k67J894
3566F00O23j562J737j348k04n98J83Q47J21o38k17N06R25j128K67Q41j12o07Q25
$$ plain form
3585 1061 494 379 681 -342 893 288 710 -708 -398 -692 379 627 -35 -296 617 -185 139 12
3603 12 705 110 -87 -20 242 124 25 808 199 -413 15 -2 742 796 -774 95 -117 341 395 389 72 392
3625 392 518 -51 447 8 45 119 444 135 -273 34 -551 -34 -25 36 309 -314 -488 -780 53 31 -18 302
3647 302 -882 201 565 -537 -170 379 83 177 133 -18 71 -302 82 -256 446 540 -554 -162 442 -354
3667 -354 -425 -247 -62 -387 -111 -34 -346 235 274 -511 153 20 401 553 107 514 -627 -391 94 -289 -70
3688 -70 424 689 190 -354 117 -125 1331 237 393 -428 -208 -171 142 860 278 241 112 512 -210 158
3708 158 -1048 -162 151 934 -417 955 -77 146 -297 -588 226 398 307 -247 348 -587 -57 -345 494
3727 494 -329 70 -642 -84 -219 -167 308 -805 59 -639 399 162 296 -73 -141 187 -29 282 -619 492
$$ packed form
3585A061n67j15L02j023J235o05M22j418L10k94J071K48o62k61R13q02L24j27
3603A2O93n95j97O7K62j18r9P83o09o12M28j7P44N4j570Q69k12M58N4ol17L20
3625C92J26n69M98m39L7P4L25l09m08L07n85N17RO1K73o23j74k92Q33k2m9L20
3647C02j184J083L64j102L67N49k96R4m4j51Q9l73L84l38P02R4j094L92O04p96
3667c54p1J78J85l25K76P7l12N81L9p85O64j33L81J52m46M07j141K36M85l83K19
3688g0M94K65m99n44M71k42J456j094J56q21K20L7L13P18n82l7j29M00p22L68
3708A58j206Q86L13P83j351J372j032K23m43k91Q14J72r1n54N95r35N30k88Q39
3727D94q23L99p12N58j35N2M75j113Q64o98J038k37J34l69o8L28k16L11r01J111
$$ plain form
3747 492 -583 526 52 -3 -321 -10 -313 -451 -283 15 -358 425 -294 239 490 -668 -292 -57 -338
3766 -338 289 1028 266 9 -54 -88 338 -68 1109 -485 415 505 -338 1082 -103 234 -46 -206 -146 449
3786 449 124 -155 -360 106 -368 -151 -320 410 -176 44 259 -52 479 313 360 -418 -268 -296 -215 144 66
3807 66 -46 -214 136 180 -122 -72 602 453 -166 -87 75 291 -116 26 -68 202 33 -70 52 204 -66 -81
3829 -81 -16 424 383 -338 237 -549 189 213 -124 -415 -404 80 -615 690 -843 535 -143 333 105 186 433
3850 433 -471 73 -119 -524 101 -26 -341 364 528 346 -167 -532 -439 931 245 704 -140 -306 -60 -395
3870 -395 -238 -800 541 -117 -5 287 -19 189 470 638 104 -76 115 169 -110 -193 -18 -353 -161 -263
3890 -263 152 -141 228 233 271 298 326 232 -51 -421 -95 154 62 -346 75 657 373 618 -251 -95 -255 282
$$ packed form
3747D92j075J109m74n5l18L11l03j38J68K98l73P83p19N33K51j158L76K35k81
3766c38O27P39p62k57o3l4M26m06J177j594R00R0q43J420j185L37k80j60O0N95
3786D49l25k79k05M66m74K17j69P30n86K20K15l11N31j66M7p78J50k8Q1L59p8
3807F6j12j68L50M4l02N0O74j49o19P9J62K16m07J42r4K70j69j03J22J52k70j5
3829h1O5M40m1p21N75p86P38K4l37k91J1M84o95J305j533J378o78M76k28Q1K47
3850D33r04N44j92m05O25j27l15P05J64j82n13l65R3J370o86M59q44j66K46l35
3870c95J57n62J341o58J12K92l06K08K81J68n34j80J91N4k79q3J75l35J92j02
3890b63M15k93L69NL8K7K8r4k83l70L26K49r2m08M21N82k84K45q69J56j60N37
$$ plain form
3912 282 302 -93 68 324 560 -92 188 -75 -212 -183 26 -118 -263 159 -440 -596 254 -459 -315 253 -289
3933 -289 19 40 -330 89 455 197 144 308 -279 277 -152 125 217 -173 -218 -183 -34 -175 244 -167 11 153
3955 153 63 -14 -97 230 421 315 -62 -223 28 -109 51 403 60 -257 -216 -149 262 101 -15 334 200 354
3977 354 -591 -230 118 73 -136 -56 267 -57 516 -13 175 217 59 -127 322 -113 281 137 121 -5 -222
3998 -222 -1 -209 397 3 167 -7 333 -463 306 234 -572 432 -223 286 262 283 41 306 -25 262 87
4019 87 -528 257 -37 -95 -182 351 67 -261 344 261 -186 412 287 -169 232 -539 -541 -191 252 -295 -208 -110 -3
4042 -3 -63 -82 95 -29 594 623 268 275 -156 -143 389 -337 438 -134 -152 80 120 -336 322 567 -117 443 362 268
4066 268 -367 150 -516 313 -1 158 -515 270 197 -442 739 404 501 -579 -195 -930 25 422 126 206
$$ packed form
3912B82K0l95J61K56K36o52K80k63j37K9K09j44j45M22n99j56Q50p13J44N68n42
3933b89L08K1l70M19L66k58n3J64n87N56m29K77R2l90m5L5J49j41M19m11J78J42
3955A53r0p7q3L27J91j06l77j61K51j37J60L52l43l17M1O7M11j61j16L49j34J54
3977C54r45L61L48m5k09Q0L23l24N73n29J88M2j58j86M49m35L94j44j6j26k17
3998b22K21k08O06l94J64j74L40p96P69p2q06J004o55N09k4K1k42K65l31K87j75
4019H7o15P85k94n8q7N33k84l28O05q3m47N98j25m56M01p71kL50M43n47Q7R8J07
4042co0j9J77j24O23K9l55Pm31J3N32p26P75n72j8K32M0m56O58K45o84N60q1r4
4066B68o35N17o66Q29l14J59o73P85p3o39J181l35R7j080L84p35R55L97k96Q0
$$ plain form
4086 206 11 -350 112 -64 -128 569 235 -475 -254 100 488 50 540 -522 70 -94 -305 406 358 12
4106 12 481 264 151 -135 457 628 0 -341 448 189 -126 178 -166 272 -302 147 46 41 -153 88 -98
4127 -98 -116 148 207 11 226 -181 0 144 7 -273 183 -4 64 179 40 -52 -2 -200 193 72 -66 72
4149 72 -323 -33 39 -59 -12 111 -12 -149 -215 413 18 -59 305 -142 -119 68 -47 -38 -12 128 46 167 -7 118
4173 118 247 7 -96 -34 21 -403 -99 45 250 91 -154 -63 -46 -147 -304 -19 91 185 175 -69 -213 -32
4195 -32 322 -137 286 -225 -92 -89 -246 263 157 74 -2 133 79 -92 -184 -45 128 77 -92 150 30 -167 18
4218 18 -220 -39 324 40 124 -215 -162 -76 -31 -28 57 19 -248 60 -262 152 -46 122 309 89 62 -109 40
4241 40 -42 4 -272 67 110 -181 -116 206 -32 -254 -132 205 -157 -101 -163 -49 -256 39 -62 -94 -1 7 -165 45
$$ packed form
4086B06j95l61M62j76o4O97l34p10K21L54L88m38M90j062N92j64k11P11m8l46
4106A2M69k17j13k86N92J71o28l41P89k59l15L04l44M38n74M49j01nj94K41j86
4127i8j8K64N9j96K15m07J81J44j37k80M56j87O8J15j39r2N0j98L93j21j38J38
4149G2l95K90P2r8M7J23j23j37o6O28l95p7L64m47K3J87j15RK6J40q2J21j74J25
4173A18J29k40j03O2N5m24L04J44K05j59k45R1J7j01j57K85J10R4j0k44j44J81
4195c2L54m59M23n11J33Lj57N09j06q3p6J35n4j71r2J39J73n1j69K42j20j97J85
4218A8k38J81L63k84Q4l39N3Q6M5LQ5l8k67L08l22M14j98J68J87k20k7j71J49
4241D0q2M6k76L39M3k91O5L22k38k22J22L37l62N6o2J14k07K95j01l2R3Qj72K10
$$ plain form
4265 45 -36 -66 -29 93 -24 -157 -92 -108 81 -59 -54 -23 49 103 160 -32 -37 -225 133 -39 -171 -269 77 -73 -20
4290 -20 148 -13 102 -36 172 -180 -54 135 -173 278 148 -43 192 136 98 -128 -72 -189 51 -123 -54 -94
4312 -94 -78 -7 -16 92 45 -50 17 80 -96 -8 55 -93 190 -9 -20 203 0 251 227 122 193 -135 -265 -193 -63
4337 -63 129 -172 -174 16 18 115 192 71 -239 112 -40 -31 -82 -186 -111 -184 182 3 1 86 170 -86 -168 -284 25 71
4363 71 370 -155 174 180 22 -78 15 -137 91 65 -152 -65 -47 -95 -110 0 74 -112 23 22 28 -157 171 -13 2
4388 2 -74 -280 -227 113 91 -177 -106 100 163 -78 113 -109 -143 -11 -74 -5 -76 331 -222 -103 -33 -168 -44 -12
4412 -12 -145 -8 -183 -24 2 -151 -80 -34 -76 135 15 22 -68 -39 -263 -179 115 -120 75 260 -126 -61 34 57
4436 57 3 76 180 -163 107 -86 16 216 59 -50 -99 19 -15 72 117 -58 -237 108 90 38 -290 134 -181
$$ packed form
4265D5q1l0L7J22j17j33O5j6J89j40NL1P2N4N7j92nj88L58j72j32r8L46j50N3
4290b0J68j61J15j38K08l52J26J89l08M51j30j91K35n6l8k26N6j17K40j74O9m0
4312i4J6P1rJ08m7r5O7O3j76Q8O3j48K83j99j1K23k03K51k4j05P1l28j30P2J30
4337f3J92l01kJ90KR7P7j21l10L51j52Rn1j04P5p3L66j79kQ5Q4k56q2j16L09M6
4363G1K99n25L29Oj58j00R3j52K28k6k17Q7J8m8j5J10P4j86J35jOj85L28j84J5
4388Bp6k06N3L40k2k68P1K06O3k41J91k22l4J32o3O9p1M07n53J19P0j35J24L2
4412a2j33J37j75J59K6j53P1M6m2K11j20Pr0K9k24Q4K94k35J95J85l86O5R5K3
4436E7n4P3J04l43K70j93J02K00j57j09m9J18l4Q7M5j75j79L45j8n2l28M24l15
$$ plain form
4459 -181 157 -170 82 -4 -32 29 43 65 -126 -16 -40 47 129 -15 -94 -35 -264 95 193 63 151 -5 -122 47
4483 47 132 23 -184 17 344 -4 42 90 70 -9 90 -207 -89 323 101 -132 -6 -303 -88 165 -81 -330
4505 -330 262 -156 187 -200 -551 -349 -860 8 -483 -370 -57 486 -760 6 326 116 708 561 -250 -19
4525 -19 -199 115 -312 -111 -97 -240 105 310 75 307 -112 -103 39 291 -331 -226 -23 416 473 -384 483 -51
4547 -51 -55 54 98 160 -499 -120 174 -252 806 8 412 -289 -153 265 329 -319 11 -359 190 119 -119 100
4569 100 -162 -187 -178 -44 -93 -166 118 174 408 77 371 -164 319 25 -145 -234 -296 -129 386 236 304 -192 -201 192
4593 192 -100 -90 345 373 552 220 -97 -294 -255 209 -420 -229 187 -108 84 239 278 16 -60 -177 -230 298
4615 298 537 280 -287 147 33 85 -23 42 18 397 -216 -118 317 -241 105 708 -253 75 244 45 104 1
$$ packed form
4459a81L38l27K52q6k8O1J4K2j91J10k4Q7Q2j44p9N9k29L59R8j30Q8j56j17J69
4483D7Q5j09k07K01L27l48M6M8k0p9R9k97J18M12k22k33J26k97K15K53k46k49
4505c30N92m18L43l87l51K02n11Q68m91J13L13N43j246P66L20k10N92j47q11K31
4525a9j80L14m27K01J4j43L45K05k35K32m19RJ42K52o22J05K03M39N7q57Q67n34
4547e1mJ09M4O2o59L79K94m26J058p98M04p01J36M18O4o48L30l70N49p1k38K19
4569A00k62k5RJ34m9p3K84N6K34l31K94n35M83k94j70q9o2J67N15j50O8m96rL93
4593A92k92J0M35K8J79l32l17j97L9M64o29J91M16k95J92J55L9k62p6j17n3N28
4615B98K39k57n67M34j14N2j08O5k4L79o13R8M35n58L46O03r61L28J69j99N9j03
$$ plain form
4637 1 138 -320 -135 380 -19 84 -63 175 9 -127 153 52 420 485 -209 -109 -194 -277 136 311 456 30
4659 30 -438 -473 327 -93 -322 90 31 -263 318 356 -59 -215 493 -125 731 -473 -442 -307 -832 -1 -333
4680 -333 -75 230 -509 273 336 242 574 303 -477 -759 6 -577 -265 -5 -255 310 -559 415 -56 319 324
4701 324 -772 51 -195 -52 -8 246 21 1087 -322 143 484 50 98 1110 -23 -338 -200 -325 245
4720 245 457 -140 131 -424 -374 99 -690 132 431 -196 526 -280 -652 236 -1098 791 153 -933 -103
4739 -103 -226 180 -184 -88 372 -511 272 -10 -544 -329 595 664 76 365 376 -197 175 794 17 660 -271
4760 -271 673 79 269 285 -498 148 -428 -421 -1006 -33 -67 -33 -855 884 -119 -116 -137 -1741 343 469 -116
4781 -116 1114 -1245 372 -259 219 276 -707 -128 297 -295 -807 801 338 235 -430 732 -364 217
$$ packed form
4637AJ37m58J85N15l99J03j47K38j66j36K80j01L68O5o94J00q5q3M13J75J45m26
4659C0m68l5Q00m20k29M12n9k94N81L8m15j56P08o18Q56j204L1J35n25Q31l32
4680c33K58L05p39P82O3r4L32k71p80k82P65n83L12K60k50N65q69R74m71L75N
4701C24j096Q23k46J43M4K54k25J066j409M65L41m34M8J012j133l15J38j25N70
4720B45K12n97K71n55N0M73p89Q22K99o27P22q06l72Q88j334J889o38j086Q30
4739a03j23M06l64R6M60q83P83k82n34K15R24O9n88K89J1n73L72O19p77O43r31
4760b71R44n94J90J6p83O46n76Pn85R73l4L4q22J739j003Lk1j604K084J26n85
4781a16J230k359J617o31M78N7r83N79M25n92n12J608m63j03o65J162j096N81
$$ plain form
4799 217 -13 -404 -278 325 11 341 -266 -463 -148 -333 404 -101 617 -257 214 16 222 55 -425 384
4819 384 -607 609 -222 -349 -509 598 -283 -243 157 -235 -312 334 220 764 531 -384 -405 -1067 -692 50
4839 50 68 449 -103 -4 -87 -842 408 546 626 -73 529 -280 -408 444 -327 5 -319 221 23 95 1188
4860 1188 136 -107 302 -388 -518 -605 -142 -374 440 599 -38 -121 -788 -349 -496 596 130 -139 43 -157
4880 -157 -110 249 142 387 568 184 -541 -66 -265 660 925 -587 1372 -67 -57 -159 223 -318 485 1223
4900 1223 -703 -752 -592 36 -494 521 -250 456 234 -353 451 -110 -154 -348 102 -33 606 252 -821
4919 -821 109 -137 162 -867 -1025 -673 90 -210 339 -126 44 455 451 418 287 -271 948 188 -337 141
4939 141 247 -277 1034 131 -543 692 -968 346 -649 548 -1079 39 304 -791 -524 -184 85
$$ packed form
4799B17k30l91J26O03l14L30o07j97L15j85P37n05P18q74M71j98K06j67m80Q09
4819C84r91J216q31j27j60J107q81M0M00l92p7O46j14N44k33r15k1o62L75P42
4839E0J8L81n52R9q3p55J250J38Q0o99O02q09j28Q52p71L32l24N40j98P2J093
4860A188j052k43M09o90j30q7M63k32Q14J59o37q3o67M39j47J092m66k69J82k00
4880a57M7L59j07K45J81l84p25M75j99R25K65j512J959j439J0j02L82n41Q03P38
4900A223j926m9J60O28n30J015p71P06k22n87Q04n61m4j94M50j35O39l54j073
4919h21R30k46K99j029j58L52P63l00N49m65J70M11ml3j31n58J219p60n25M78
4939A41J06n24J311r03o74J235j660J314r95J197j627J118K65j095K67L40K69
$$ plain form
4956 85 -67 -883 -128 -306 -78 1045 -533 82 34 -299 27 -859 -191 526 -374 109 -694 342 604 -167
4976 -167 -421 186 579 203 -317 807 630 205 -408 -355 -81 346 817 68 -277 465 -310 575 -156 -324
4996 -324 -69 250 208 512 110 -218 120 -169 795 587 532 -840 -310 -177 713 -370 300 415 120 136
5016 136 95 386 8 589 423 524 -247 -233 71 149 286 -194 424 148 36 219 -444 870 159 1131 597
5037 597 376 -126 -494 -685 -176 -18 -401 -465 628 -1072 62 241 522 101 -574 215 136 750 -779
5056 -779 846 226 -236 -438 -192 -158 -262 396 -108 -529 192 -718 158 148 -163 49 -483 -466 840 -368
5076 -368 436 -1225 1470 82 748 34 -424 -676 -283 -749 -1134 583 -130 -479 -196 104 -761 -16 13
5095 13 585 271 -224 -95 -13 -134 1440 -319 745 150 -1205 -1235 662 -19 9 -368 -8 279 -220 -3
$$ packed form
4956H5j52q16P55j78K28J123j578O15m8l33L26q86O68P17r00M83q03J036K62p71
4976a67k54O07L93l76n20J124j77m25o13N3K74M27M71p49l45P42p75Q85p31j68
4996c24K55L19m2L04m02l28L38k89R64k08n5j372N30J33Q90j083O70J15k95J6
5016A36m1K91l78N81j66J01p71J4L04P8J37m80O18k76j12J83o63J314p11R72n34
5037E97k21n02l68j91N09J58l83o4J093j700J134J79K81m21o75P89p9O14j529
5056g79J625o20m62k02K46L4j04O58n04m21P21r10Q76j0l11K12n32J7J306j208
5076c68Q04j661K695j388O66p14m58k52L93m66l85J717p13l49K83L00q65P45K9
5095A3N72l14m95J29Q2j21J574j759J064n95j355l0J897o81K8l77L60K87m99K17
$$ plain form
5115 -3 -110 -93 -879 -377 352 -279 684 423 117 137 559 117 -180 -530 205 -982 550 895 160 -147 304
5136 304 -338 167 -578 359 -500 690 -100 145 127 1448 469 -448 -506 -369 90 512 -362 -128 -449 -346
5156 -346 738 219 -137 -343 -546 713 -1112 799 339 267 432 735 853 -69 247 -35 -722 -356 -326
5175 -326 1600 -231 -388 -502 519 -512 -817 -779 118 359 -81 674 557 310 590 -689 -712 484 37
5194 37 -608 -314 375 -209 -46 -585 -394 469 243 -636 -254 -558 132 -676 172 -1778 1035 721 431 278
5214 278 -522 219 214 321 -762 -390 122 -312 437 148 720 416 729 310 948 -300 -232 -433 -904 264
5234 264 58 -675 -976 90 -1178 516 8 -347 -377 -1551 -980 362 160 167 384 184 -1274 215 -362
5253 -362 -562 506 561 -1438 -176 431 -85 252 146 -123 139 -34 133 -408 466 -695 -57 -335 -20
$$ packed form
5115cj07J7p86N02P29o31R63k61l06K0M22m42k97l50P35j187J532L45p35l07M51
5136C04o42N05p45R37q59J190p90K45j8J321r79r17n8J37M59M22q74K34l21J03
5156c46J084n19l56k06k03J259j825J911m60p2J65L03J18r22L16k82o87L66L0
5175c26J926j831j57j14J021j031l05L8Q97K41m40P55j17k47K80j279k3J196m47
5194C7o45K94O89n84J63n39J91Q63k26q79L82l04O90q08Q48j950K813l14k90j53
5214B78q00P41nJ07j083L72N12m34P49k89N72l04L13m19O38j248O8k01m71J168
5234B64k06p33l01J066j268J694n08l55l0j174N71J342k02PK17k00j458J489n77
5253c62k00J068N5j999J262O07n16L37j06k69K62j73J67n41Q74j161O38k78L15
$$ plain form
5272 -20 777 -1407 322 645 646 -568 152 441 216 -599 252 -9 189 306 52 -695 -339 167 306 474
5292 474 -625 -73 563 -538 -498 845 -949 -390 241 -300 121 -569 5 43 127 -154 629 -830 761
5311 761 91 -1000 -520 -205 946 -275 -404 -28 131 -457 -30 908 338 185 -379 80 103 1065 -299
5330 -299 150 -109 -182 143 -106 -376 109 -270 -575 -1032 283 -813 13 511 370 -711 541 -99 749
5349 749 -94 92 -849 -729 251 -229 451 563 460 255 -223 -88 -1011 -198 516 -262 -194 176 5 218
5369 218 655 -688 -508 -93 -230 481 29 -692 -660 38 439 797 560 -190 -10 -259 621 -78 325 -216
5389 -216 84 158 186 -579 18 -207 -569 -135 -169 170 -47 -393 -89 282 -321 -1176 266 -303 -392 -706 292
5410 292 -633 255 -351 -135 -60 -21 -886 88 -19 566 970 -429 -320 -562 73 -272 -343 -640 829 196
$$ packed form
5272b0P97k184J729L23Jj214P20K89k25q15Q51k61J98J17k54p47L56N06J39J68
5292D74j099N52O36j101M0J343j794N59O31n41M21o90N74L8Q4k81P83j459J591
5311G61o70j091M80L15J151j221j29L76J59n88M27R38n70j53n64M59K3R62j364
5330b99M49k59p3L25k49k70M85l79l05m57J315j096Q26M98j41j081J252o40Q48
5349G49q43J86r41J20R80m80O80J12j03k05m78J35r23Q13P14p78O8L70j71K13
5369B18M37j343J80M15j37P11m52p21L2O98M01L58k37p50J80k49Q80o99M03n41
5389b16L00P4K8p65N97k25l62M34l4L39k17l46L04L71o03q55J442n69q9l14R98
5410B92r25Q88o06K16P5L9q65R74j07N85M04j399J09k42O35l45p1k97J469o33
$$ plain form
5430 196 230 465 431 45 581 -787 130 320 -90 -739 -225 -542 179 -111 -402 253 -247 1121 -545 -616
5450 -616 -739 -272 -798 -128 265 -208 -622 -561 62 249 -606 -949 484 -152 335 -1143 306 397 -109 -137
5470 -137 545 792 768 176 780 -672 99 285 -624 629 -190 -287 -128 -310 -254 -525 -74 -116 383 1283 -176
5491 -176 -473 -130 353 596 350 102 38 620 711 -677 164 -215 -569 121 606 273 -629 -697 0 -187 518
5512 518 -692 -588 402 595 950 -125 125 -568 232 -124 629 -574 577 -209 101 -46 752 -147 -310
5531 -310 910 864 -59 -392 578 202 -107 -177 444 520 -291 213 -849 384 541 -802 1255 -518 -494
5550 -494 -261 -125 84 -381 605 656 -494 -5 341 -1217 -665 -623 -479 454 -15 -251 -687 -306 -156 -239
5570 -239 1200 237 44 1726 -462 -193 714 348 309 387 288 201 -336 389 106 449 598 702 664 569 955
$$ packed form
5430A96L4K35l4l86N36j368R17J90m10o49N14l17P21k90k91O55n00J368j666p1
5450f16j23M67n26O70L93m73m14O1O23J87q55l43J433o36M87j478J449R1n06k8
5470a37O82K47k4n92O04j452P71J86r09J253q19r7J59j82N6k71M51m2M99R00j459
5491a76k97L43M83K43k46k48o4N82R1j388Q41l79l54O90M85l33r02o8O97j87P05
5512E18j210J04R90J93L55j075K50o93Q00l56P53j203J151p86L10j47P98q99j63
5531c10J220m6r23l33R70l76l09p0O21P6q11N04j062J233J57j343K057j773K4
5550d94K33J36K09m65R86N1j150M89L46j558N52M2J44R33m69k36m36L81J50q3
5570b39J439r63j93J682k188K69R07l66l9P8r9q7n37P25k83L43J49J04l8r5L86
$$ plain form
5591 955 256 -852 1775 -3 -267 476 -1053 72 -12 1204 614 676 87 646 -322 -461 -435 124 616
5610 616 -658 378 307 1041 518 562 736 -20 630 1808 -371 -67 61 -349 -14 454 2 -930 -860 740
5630 740 381 -563 309 -89 469 188 155 518 450 -241 499 -1217 -369 564 -355 694 -1223 -817 -422 11
5650 11 -363 1499 -319 968 124 -13 165 618 788 936 1003 -431 197 98 156 26 -139 230 434 186
5670 186 337 0 -113 800 925 68 378 669 -1065 -175 146 315 531 -1241 -355 -1442 -126 322 458
5689 458 -337 895 291 521 316 1351 -240 218 -413 -131 1268 -728 -2115 324 -691 624 -326
5706 -326 718 840 -21 1158 409 736 -330 -149 1374 -436 -570 890 77 1013 426 496 -202 740
5724 740 810 -194 90 6 268 893 -417 -4 33 892 -276 168 -664 -586 159 568 520 859 -94 47 -39
$$ packed form
5591I55o99j108K627j778k64P43j529J125q4J216n90O2n89N59r68j39K6N59M92
5610F16j274J036p1P34n23M4J74p56O50J178k179L04J28m10L35M68m52r32P0J600
5630G40l59r44Q72l98N58k81l3L63o8o91P40j716Q48R33r19J049j917M06L95M33
5650A1l74J862j818J287q44j37J78M53J70J48O7j434O28r9N8j30j65L69K04k48
5670A86J51l37j13R13J25q57L10K91j734Q90L21J69K16j772Q86j087J316M48J36
5689D58p95J232o04K30k05J035j591M58o31K82J399j996j387K439j015J315r50
5706c26J044J22q61J179p49L27j066J81J523j810j34J460q13R36n87P0o98R42
5724G40P0j004K84q4K62O25j310M13L7Q59j168M44q32P8P45M09m8L39r53J41q6
$$ plain form
5745 -39 2094 1698 -406 -728 442 119 -606 -307 -658 502 -167 972 124 227 552 430 425 951 -754
5764 -754 -775 -430 441 -74 947 -633 -795 -958 -67 -117 -317 -520 -751 480 -695 -219 266 -359 673
5783 673 333 476 244 702 5 706 -722 -956 312 1030 315 359 79 -499 379 -1096 193 259 -606
5802 -606 396 256 112 -14 -45 -380 41 670 450 -408 629 143 301 428 407 -197 -790 614 -167 -895
5822 -895 -123 -473 318 -387 225 -221 208 177 -26 -104 192 198 -880 -311 -434 -1160 -52 -1750 248 202
5842 202 -1055 -275 1066 1039 308 -558 1279 648 -173 343 -464 279 560 -403 -494 -757 1459 -1122 -294
5861 -294 -228 -1152 364 1017 225 -191 -1032 411 -212 -541 -744 946 861 313 765 -137 -525 1439 739
5880 739 402 -624 200 -16 -54 1136 601 287 616 -28 856 601 -935 -682 -303 -1119 -324 130 -542
$$ packed form
5745c9K133l96k104l22J170l23p25K99l51J160o69J139q48J03L25j22nN26j705
5764g54k1L45Q71n15J021j580j62j63Q91n0k00k03k31J231j175M76M85o25J032
5783F73l40J43k32M58o97P01j428k34J268P18p15M4k80n78Q78j475J289O6q65
5802f06J002j40j44j26l1l35M21O29k20q58J037m86J58J27k1o04n93J404p81p28
5822h95P72l50P91p05O12m46M29l1k03p8K96Oj078N69j23p26J108j698J998m6
5842B02j257P80J341k7p31q66J837o31q21N16q07P43K81r63r1k63K216k581Q28
5861b94O6r24J516O53p92m16q41J443o23l29k03J690q5n48M52r02l88J964p00
5880G39l37j026Q24k16l8J190n35l14L29o44Q84k55j536K53L79q16P95M54o72
$$ plain form
5899 -542 344 1255 -109 561 -160 -1539 220 -681 -209 853 -511 -900 146 320 107 371 -331 298
5917 298 -29 607 6 300 109 -543 101 448 -320 959 331 934 287 -465 1481 -378 521 1 1087
5936 1087 75 -586 -771 -478 1471 -994 -327 -211 652 683 -446 -650 -576 -653 403 -705 -693 236 -1225
5955 -1225 1004 -85 940 -476 -222 -885 -154 -671 90 390 -487 -947 -1325 -164 -306 271 47 220
5973 220 667 796 604 -370 -728 -1106 -699 -576 -100 -426 -746 -74 36 -350 384 -1470 -317 147 -48
5992 -48 246 -52 -67 193 -199 -76 112 389 -616 386 -245 45 -772 -254 -694 -22 153 -9 -618 1033
6012 1033 -614 -104 -29 262 250 263 204 -676 -18 168 -1067 833 -93 93 725 -310 -306 -405 50 352 953
6033 953 -183 -495 402 -205 896 460 155 1242 -194 -1105 106 599 498 17 -501 -525 425 746 117
$$ packed form
5899e42Q86R11j364O70p21j379J759r01M72J062j364l89J046J74k13K64p02O29
5917B98l27O36o01K94j91o52O44L47p68J279o28O03o47p52J946j859Q99n20J086
5936A087j012o61j85K93J949k465O67J16Q63L1j129k04P4p7J056j108J2R29j461
5955a225K229j089J025j416K54o63P31n17P61L00q77m60l78J161j42N77k24J73
5973B20M47J29j92r74l58l78M07J23M76l26l20O72J10l86P34j854J153M64j95
5992d8K94k98j5K60l92J23J88K77j005J002o31K90q17N18m40O72J75j62o09J651
6012A033j647N10P5K91j2J3n9q80O58J86j235J900r26J86O32j035Mr9M55L02O01
6033I53j136l12Q97o07J101m36l05J087j436r11J211M93j01m81n18k4R50L21o29
$$ plain form
6052 117 -117 -476 -87 -373 251 338 -204 -1174 64 -154 -456 -207 -869 -204 -600 1069 -237 797 414
6071 414 -651 701 1157 -467 153 430 -474 -471 -1346 -121 366 -398 506 380 -1040 61 1049 -250
6089 -250 589 468 872 596 -98 -466 25 132 962 -426 -442 -141 834 864 -665 -35 927 1126 1123 437 -1522
6110 -1522 179 -396 -458 -302 -200 -491 999 900 1028 -435 413 1193 523 25 -127 -218 1259 634 -78
6129 -78 145 -187 674 -727 605 -543 -451 -498 8 -906 -772 -571 -505 764 499 408 445 171 494 734 164
6150 164 -444 374 664 712 599 762 900 -1210 793 636 -297 -204 1243 -292 -544 -939 -619 -217 -399
6169 -399 -263 -584 -1194 180 542 322 983 -494 -604 -28 915 -81 -774 -280 -224 -808 -1075 -683 -137 -368
6189 -368 -1060 267 1185 -133 -292 239 565 539 -759 164 473 -8 54 -52 -689 37 -208 -136 111 -207
$$ packed form
6052A17k34l59L89k86O24Q7n42r70J238k18l02K49o62O65l96J669j306J034l83
6071D14j065J352M56j624O20K77r04Lq75J225M87p64R04j26j420J101R88j299
6089b50Q39j21M04k76o94l68M91J07Q30j388j6L01R75L0j529O30R62J99lo86j959
6110a522J701n75o2J56J02k91J490r9J28j463Q48P80o70m98j52r1J477o25p12
6129g8K23l32Q61j401J332j148R2m7N06r14J34K01O6J269k65r1L7k74L23K40n70
6150A64o08Q18K90M8j13J63J38k110K003j57r33R3J447j535k52l95L20M02j82
6169c99J36l21o10J374L62k20O61j477j10N76R43r96o93M94N6n84k67L92N46k31
6189c68o92J327R18j318j59N31L26k6j298R23L09m81O2j06o37P26k45P2K47l18
$$ plain form
6209 -207 -288 -55 -127 819 -496 45 682 -727 434 -362 -229 262 552 208 -892 523 -67 471 216
6228 216 376 124 557 741 -11 -978 489 592 530 155 1099 222 514 -554 -865 1436 687 888 -697
6247 -697 130 274 -1799 -955 -482 -691 576 -438 244 394 327 -904 70 -332 -847 1258 196 -442
6265 -442 140 981 234 255 -643 355 70 246 241 232 -319 -139 -361 237 179 157 452 -362 181 -372 317 431
6287 431 -98 505 411 -352 -704 -1126 748 -13 -313 -384 619 -1 -903 -263 212 -502 301 -215 -526 -505
6307 -505 43 -1279 -311 430 -25 62 -1180 -318 -1098 156 294 328 33 1029 -70 775 383 -1159 192
6326 192 383 -426 558 388 -148 -97 -240 393 -1263 520 -81 882 136 -638 -311 -1613 -82 18 -115
6345 -115 -926 380 748 178 364 23 -998 221 347 -794 3 -529 519 701 -596 428 -916
$$ packed form
6209b07q1K33p2R46j315N41O37j409J161p96J33M91K90l44j100J415n90N38k55
6228B16J60k52M33J84p52r67J467J03o2l75R44q77K92j068l11K301p49K01j585
6247f97Q27J44k073Q44M73k09J267j014O82J50o7j231R74m02n15K105j062o38
6265d42N82Q41p47K1q98R98k85J76nrn51J80k22N98n8k2K95q14N43n53O89J14
6287D31n29O03r4p63l52m22J874p61l00p1J003o20r02O40M75p14Q03n16l11K1
6307e05N48j322R68P41m55Q7j242Q62p80J254J38L4k95R96j099Q45l92j542J351
6326A92J91q09R84j70n36N1j43O33j656J783o01R63p46p74L27j302J531J00j33
6345a15q11J306L68n70J86l41j021J219J26j141P97n32J048J82j297J024j344
$$ plain form
6362 -916 -741 -350 -1108 -608 373 -921 -82 -388 -176 946 1209 202 -189 -96 -808 -182 -530 -40 -27 -127
6382 -127 -629 -513 -945 1133 1336 -82 378 609 -692 -968 -286 -72 732 305 380 -532 -781 -1060 -904
6401 -904 -802 -404 -196 -886 205 -799 72 -850 -478 428 -1319 -399 -477 246 56 438 371 771 528 -409
6421 -409 -474 206 -671 -203 -653 -74 -214 92 -517 -548 220 -535 842 -35 -1122 -284 -327 -63 44 -54 -555
6442 -555 -1035 -211 -859 -1324 -23 -99 -458 -93 1114 266 -507 409 -495 -1261 512 -1028 -1439 240 262
6461 262 -188 -355 -397 -557 0 -668 559 -40 561 460 285 -168 591 -503 -4 -946 -378 -1009 68
6480 68 139 -397 -134 -472 645 1081 -202 1462 695 1033 -974 -600 134 -40 888 762 -1328 604 330
6499 330 -265 488 -821 795 810 -309 -154 197 -55 -30 -226 41 349 -80 -380 -185 77 -1265 34
$$ packed form
6362i16J75L91p58N00R81j294Q39l06K12J122K63j007l91R3p12O26l48M90J3j00
6382a27n02J16m32K078K03j418M60K31j301k76O82K14Q04m27P5r12k49k79J56
6401i04J02L98K08o90J091j004Q71r22L72R06j747R20p8P23j90L82o7M00k43r37
6421d09o5O80q77M68m50N79j40L06o09l1P68p55J377q77j087Q38m3K64J07r8n01
6442e55m80Q24o48m65J301p6l59L65J207q48p73R16r04p66J773j540m11J679K2
6461B62m50j67m2j60N57o68J227n99O01j01j75m53P59j094M99r42N68o31J077
6480F8P1n36K63l38J117M36j283J664p67L38k007L74P34j74R28j26k090J932k74
6499C30n95P53j309J616J5j119J55L51k52K5j96K67L08m29l00J95K62j342J299
$$ plain form
6518 34 -282 -76 79 840 771 0 -1009 -653 -1425 -60 106 178 410 -24 138 1177 -254 -1327 -592
6537 -592 531 626 1422 653 -374 343 -70 1365 216 -332 70 346 253 -233 -765 -198 2 -481 214
6556 214 385 -359 -131 406 1068 -453 156 -979 -759 -305 197 259 852 -600 36 1155 -178 101 527
6575 527 54 -326 29 -279 -338 402 -364 -208 957 -222 -268 -368 -245 -607 -763 363 -1460 -709 477
6594 477 331 241 380 -431 -165 -477 -492 -144 -39 629 429 -3 165 164 -450 -341 -73 -232 -877 273 -315
6615 -315 -121 781 724 -837 -658 753 -831 498 813 -402 -1813 325 -590 -417 -69 -446 -946 -1074
6633 -1074 -145 -652 -731 -639 -347 -5 -903 1123 1028 366 -1343 -509 376 478 -585 217 434 -483 -308 -477
6653 -477 527 -1169 -38 101 560 709 -912 791 -655 -60 854 314 40 -1117 637 -1091 -236
$$ packed form
6518C4l16K06J55P61o9p71j009L56p72J365J66P2K32m34J62J039j431j073P35
6537e92J123R5P96p69j027P17m13J435j149n48M02K76r3m86n32N67K00m83O95
6556B14J71p44K28N37O62j521O09j135K20M54N02O2N93j452O36J119j333K79M26
6575E27m73l80L55l08n9P40p66J56J165j179m6j00J23l62j56J126j823P51J186
6594D77j46r0J39q11K66l12j5L48J05O68k00m32J68jo14J09K68j59o45J150n88
6615c15J94R02n7j561J79J411j584J329L15j215j411K138r15J73L48l77n00j28
6633a074R29n07p9R2K92L42q98K026r5o62j709Q34Q85J02j063Q02K17r17J75j69
6653d77J004j696J131J39M59J49j621J703j446N95R14n40k74j157J754j728Q55
$$ plain form
6670 -236 -1078 813 -854 6 -59 -144 -222 -46 750 -411 346 586 -539 153 -143 -272 -479 -592 -415 100
6690 100 465 -192 568 -766 -133 38 606 148 -378 -4 -548 -775 -840 492 -169 -292 402 695 -861
6709 -861 245 29 762 -382 -310 291 375 -210 1113 833 4 -363 156 -775 66 -389 -331 1424 -561
6728 -561 -954 -118 -633 -581 -1059 -15 133 -609 36 -1081 514 928 -1347 -372 83 168 -222 -192 110 -1143
6748 -1143 -298 539 977 -309 765 -223 -50 994 736 295 -864 -255 -493 -1243 150 629 515 -109
6766 -109 -1012 -27 -399 -843 67 -316 -450 -266 -232 -277 -140 -6 -154 161 203 440 769 -794 257 573
6786 573 916 -772 391 -356 411 801 378 -27 -619 545 99 -19 1085 -1339 -551 131 607 -109
6804 -109 140 209 -359 658 -110 -200 238 -343 -281 -758 -19 -1168 -44 -1115 -600 124 -724 42 400 -393
$$ packed form
6670b36q42J891j667Q60o5q5p8J76P96j161P57K40j125O92k96j29k07j13J77N15
6690A00L65o57P60j334O33J71N68m58n26L74n44k27o5J332o61j23O94K93j556
6709h61J106k16P33j144P2O01Q4n85J323k80q29l67N19r31Q41m55N8J755j985
6728e61l93Q36n15N2m78J044J48p42O45j117J595M14k275R75M55Q5l90L0L02j253
6748a143Q45Q37M38j286J074r88J73J044k58m41j159O09k38p50J393M79j14o24
6766a09r03R85l72m44R10l83j34J84L4m5J37J34j48L15M2K37L29j563J051L16
6786E73L43j688J163p47P67L90m23m05n92J164m46j18J104k424P88O82M76p16
6804a09K49O9n68J017p68r0M38n81O2m77P39j149J124j071N15P24q48P66L58p93
$$ plain form
6824 -393 -243 -111 91 -156 -27 36 -137 -273 -82 623 180 967 699 332 -1621 -653 60 -288 -527 -670
6844 -670 646 81 588 -1398 -1068 -361 -350 -356 1930 334 -281 564 -1004 -1259 -1366 173 646 -123 -260
6863 -260 -119 232 -509 36 -607 206 169 210 247 212 634 681 513 -111 10 -839 -425 -397 171 1083 51 -579
6885 -579 493 -1189 -791 198 -440 -753 -37 459 -155 -387 -103 36 -627 1026 512 403 -513 -260 -537
6904 -537 -59 -88 -263 42 -658 -505 171 -482 -42 -533 -547 586 120 297 -365 -589 1311 638 -1295 432
6924 432 935 1071 628 166 792 663 -794 -403 -812 -315 -252 666 825 -291 -288 100 201 -34 553 -575
6944 -575 -354 395 1139 -220 -720 -398 823 601 -488 -661 -63 92 -539 -29 533 829 -910 -991 411
6963 411 -784 -40 -449 128 0 -903 -250 -369 414 -585 530 -431 -355 21 -925 -449 -916 -407 -1055 506
$$ packed form
6824c93J50J32K02k47J29O3j73j36J91P05m43P87k68l67j953R68P13l48k39j43
6844f70J316n65N07j986L30P07J1oK286j596o15Q45j568k55j07J539M73p69j37
6863b60J41L51p41N45o43Q13l7M1L7l5M22M7j68o24J21q49M14K8N68R12j032o30
6885e79J072j682L98R89o38l13P16M96o14k32K84J39o63J653n14j09r16K53k77
6904e37M78k9j75L05p00J53O76o53M40m91j4J133m66J77o62k24J900o73j933J727
6924D32N03J36m43m62O26j29j457L91m09M97O3R18J59j116LL88J01k35N87j128
6944e75K21P49P44j359n00L22J221k22j089j73N98J55o31N10N62K96j739q1J402
6963D11j195P44m09N77j28r03O53j19P83r99J115r61P6L76r46M76m67N09o48J561
$$ plain form
6983 506 682 -173 -365 38 633 -745 -469 745 599 801 474 41 494 1825 761 177 249 -979 756
7002 756 772 -1234 815 -167 498 715 -32 -375 -436 -548 393 -38 1466 -741 665 61 -56 472 861
7021 861 -184 529 367 -780 501 1247 235 643 -132 -107 483 271 -201 -954 93 334 609 -349 -621
7040 -621 304 403 477 -869 -971 -401 -847 690 1146 1103 654 374 -296 330 109 60 564 -88 -708 -249 -874
7061 -874 56 1002 722 -212 -734 413 568 -24 259 348 -200 -654 1300 1201 639 -591 -29 734 -771
7080 -771 656 -237 -96 280 1106 1600 -217 -299 1176 1098 -94 250 118 1182 313 54 87 560 -121
7099 -121 -1080 -1561 -218 519 -425 444 -1335 -1231 479 313 638 899 -628 -174 291 362 -668 518
7117 518 268 -271 -994 -364 904 383 -1157 -317 -1135 1078 -839 1147 -705 27 322 -547 -188 952
$$ packed form
6983E06J76q55j92M03N95j378K76J214j46K02l27m33M53J331j064n84P2j228J735
7002G56J6k006K049r82O65K17p47l43o1j12R41m31J504k207J406o04j17N28L89
7021H61j045P13j62j147J281P46j012M08p75K5N90k12m72p53J047K41K75r58k72
7040f21R25R9P4j346j02N70m46J537M56m3m49k80o70O26k21m9N04o52o20M59o25
7061h74R30R46k80r34n22J147J55n92K83Q9n48m54J954r9n62j230N62P63j505
7080g71J427q93J41L76Q26M94j817q2J475p8j192L44j32J064q69k59L3M73o81
7099a21r59m81J343P37r44Q69j779J04J710j66L25K61j527M54M65P1j030J186
7117E18k50n39p23O30J268n21j540Q40q18K213j917J986j852P32K95q69L59J140
$$ plain form
7135 952 218 1320 -228 61 -451 -287 -196 -649 -17 301 937 252 263 -894 -1041 686 -682 523 994
7154 994 596 -49 -778 -491 235 121 -907 -1079 1071 196 -1145 1162 503 -1106 18 849 -645 1290
7172 1290 689 -462 1184 -1451 -193 1850 970 -788 -791 1162 910 561 705 628 458 358 -45 830
7190 830 5 -236 -30 689 -156 -1173 281 -337 -338 44 -733 -2 -305 -1376 136 460 778 -182 -99 329
7210 329 -416 -624 -753 -163 -645 -587 64 -1625 94 -93 335 55 -102 861 -196 -629 674 -363 623
7229 623 37 -60 -2071 729 -645 -663 321 -251 1049 -659 313 -324 -337 40 -314 -1116 471 -626 -517
7248 -517 260 -1481 -72 -28 281 83 735 -973 -758 730 1096 18 -233 -239 477 520 66 643 151 -1
7268 -1 -355 -338 222 247 -588 -246 -518 -641 -97 -461 951 346 -628 -386 -73 550 -366 823 321 656 -160
$$ packed form
7135I52p34J102j548K89n12J64R1m53O32L18O36o85J1j157j47J727j368J205M71
7154I94l98o45p29K87P26j14j028j72K150q75j341K307o59j609J124Q31j494J935
7172A290o01j151J646k635J258K043q80j758lJ953k52l49J44p7j70j00m03Q75
7190H30q25k41K06P19q45j017J454o18jL82p77P31l03j071J512L24L18r60Q3M28
7210C29p45k08j29N90m82N8O51j689J719j87M28k80j57R63j057m33J303j037R86
7229F23n86r7k011K800j374j8R84n72J300j708R72o37j3L77l54q02J587j097J09
7248e17P77j741J409M4L09j98O52j708K15J488L66j078k51oP16M3m54N77m92j52
7268al54J7N60K5q35L42k72j23N44l64J412o05r74K42L13O23r16J189n02L35q16
$$ plain form
7289 -160 -377 -1665 717 286 -1033 815 209 236 232 -293 -14 -996 98 -1112 -790 113 -895 -403 -956
7308 -956 -77 -292 -613 -297 -153 -6 -290 542 -665 545 138 -817 394 887 91 -46 -20 -1339 677
7327 677 -312 943 441 -449 536 44 341 -321 -53 -659 -247 307 -650 -698 -1324 -1031 -425 493 556 -522
7347 -522 -55 203 -813 458 412 -152 37 -213 -544 4 -806 -148 -355 -797 433 300 -820 108 182
7366 182 -441 56 562 857 -35 288 -658 -137 1071 706 542 -553 -329 764 447 -397 -622 -389 -19
7385 -19 -16 -146 599 140 -236 306 -556 -515 -198 697 629 190 -66 200 265 -395 30 138 1472 1339 469 738
7407 738 76 -1182 -146 528 -1205 593 -310 548 1209 740 -349 286 680 484 153 -170 684 -136
7425 -136 -262 -471 -140 -66 -1158 335 -88 206 -752 715 712 586 -325 293 11 464 -344 -375 1165 -195
$$ packed form
7289a60k17j288K382m31j319J848o06K7mn25K79r82J094j210L22R03j008M92n53
7308i56Q79k15l21L16J44J47k84Q32j207J210m07r55J211M93p96j37K6j319K016
7327F77r89J255n02q90R85m92K97o62K68o06M12N54r57m8o26K93O06R18O3j078
7347e22M67K58j016J271m6n64J89k50l31N48q10O58k07m42J230j33j120R28P4
7366A82o23M97N06K95q92L23r46N21J208l65j64j095K24J093l17q44k25K33L70
7385a9Lj30P45m59l76N42q62M1L17Q95o8m39k56K66O5o60M25J08J334j33q70K69
7407G38o62j258J036O74j733J798r03Q58O61m69j089O35L94j96l31l23Q54q20
7425a36j26k09L31P4j092J493m23K94r58J467lj26r11O18k82M53q08l1J540j360
$$ plain form
7445 -195 899 -636 -929 -183 -200 -449 -606 -146 419 -17 434 -233 702 -438 176 131 -187 306 540 -343
7465 -343 -661 304 -700 54 130 403 -578 -53 -555 1566 -1151 -358 13 -612 -237 29 -640 798 489
7484 489 745 42 -466 15 1749 629 37 378 -722 -248 682 221 366 688 108 -67 -275 19 -330
7503 -330 -583 -811 -558 -491 1437 -139 -1091 -83 105 520 967 390 265 750 -13 -814 798 -172 85
7522 85 719 851 -913 -162 -711 -80 383 326 51 316 521 1055 102 -371 -1344 691 -397 125 276 803
7542 803 -39 263 -214 -157 -505 -209 1087 1458 81 389 867 458 632 274 136 847 -520 -441 221 -1375
7562 -1375 24 -576 259 436 63 283 -713 263 650 -1056 -365 -1287 429 792 -41 451 -642 503
7580 503 176 -1503 -47 -546 1455 -29 -592 196 -180 754 -503 -30 876 -396 636 -748 -432
$$ packed form
7445a95J094j535k93P46j7k49j57M60N65m36M51o67R35j140O14m5l18M93K34q83
7465c43l18R65j004P54P6K73r81N25n02K121k717P93L71o25L75K66o69J438l09
7484D89K56p03n08M81J734j120n92L41j100M74R30m61J45L22n80j75k08K94l49
7503c30k53k28K53O7J928j576r52J008J88M15M47n77j25M85p63q01J612r70K57
7522H5O34J32j764P51n49O31M63n7k75K65K05N34r53m73r73K035j088N22J51N27
7542H03q42L02m77N7l48K96J296L71j377L08M78m09J74l58j38P11j367P9O62j596
7562a375J399o00Q35J77l73K20r96R76L87j706O91r22J716L63q33M92j093J145
7580E03l27j679J456m99K001j484n63P88l76R34j257M73R06j272J032j384L16
$$ plain form
7597 -432 114 -552 199 -745 -298 373 -298 685 262 88 632 -51 -41 1425 -774 480 1408 -555 593
7616 593 248 -75 -1482 -264 1768 -239 61 1748 -538 353 1350 -535 309 457 -871 -930 -337 642
7634 642 -140 -1013 -302 137 40 186 639 1294 -84 191 154 614 488 85 913 -580 -189 -20 -650 -526
7654 -526 -1094 -176 -638 389 1260 761 -817 -376 -699 1196 992 -1593 -619 432 587 -729 660 1100
7672 1100 308 -455 -333 -481 -777 378 -682 49 -436 484 415 242 93 -607 487 762 -77 441 -550
7691 -550 2012 -122 -909 1343 -394 -205 -1530 501 -548 -792 -58 -1890 444 -745 -997 -342 -735
7708 -735 713 -1238 371 -543 631 -1515 -1 -934 1120 -1111 70 1059 -965 1319 287 221
7724 221 959 -1348 232 688 672 -452 94 -310 -1008 -588 -610 -53 1009 362 893 437 -647 461 -435
$$ packed form
7597d32N46o66P51r44M47O71o71R83m23j74N44o83J0J466k199J254R28j963J148
7616E93l45l23j407J218K032k007L00J687k286Q91R97j885Q44J48j328n9N93R79
7634F42p82q73P11M39r7J46M53O55j378K75l7M60j26m03Q28j493L91J69o30J24
7654e26n68R18m62J027Q71m99j578M41l23J895k04k585R74J051J55j316J389M40
7672A100p92p63J22j48k96J155j060P31m85R20o9j73j49p00J094K75q39N18r91
7691e50K562k134p87K252j737J89j325K031j049k44P34j832K334j189k52O55l93
7708g35J448j951J609r14J174k146J514r33K054k231J181R89k024K284j032o6
7724B21P38k307J580M56j6j124N46m04o98M20k2N57J062o47N31m56j084J108q96
$$ plain form
7743 -435 1167 93 137 -1305 -1191 208 722 377 1043 -421 -303 180 -95 560 -278 -923 276 845
7761 845 -503 318 111 1299 643 -488 908 409 1300 -670 -1174 -229 650 269 -103 -277 475 -1165
7779 -1165 -482 -433 -1434 341 -833 -860 174 -526 423 -109 376 -2 380 -400 -117 -960 -314 -171 -1175
7798 -1175 76 -852 -48 -1029 169 -265 -229 -146 -1754 -270 64 202 -152 1017 880 -108 670 215 -466
7817 -466 -695 -1054 -414 1017 -941 -60 623 -640 -1014 1235 568 -606 1522 117 1182 -214 -1842
7834 -1842 786 497 -128 196 1690 -852 -413 -371 -495 474 -526 -965 165 270 -1303 -1067 58 466
7852 466 652 1463 23 -478 -3 592 -492 769 -653 -388 732 -499 -897 -660 -679 553 877 320
7870 320 73 227 1599 876 -263 99 -66 -443 187 -2083 531 951 656 -213 -632 351 -293 62 572
$$ packed form
7743d35J602j074M4j442J14J399N14l45O66j464J18M83k75O55q38o45J199N69
7761H45j348Q21k07J188o56j131J396m99Q91j970n04R45Q79l81l72j74P52j640
7779a165O83M9j001J775j174k7J034p00R49n32M85l78L82p80K83q43O46J43j004
7798a175J251r28Q04r81J198m34L6Q3j608J484L34J38l54J169j37r88P78m55o81
7817d66k29l59O40J431j958Q81O83j263l74K249o67j174K128j405J065j396j628
7834a842K628k89o25L24J494k542M39M2j24R69j000m39J130J05j573K36J125M08
7852D66J86Q11j440n01M75N95j084J261j422K65J120j231l98K37j9J232L24n57
7870C20k47J54J372p23j139L62j65l77O30k270K614M20k95q69m19R83o44L55N10
$$ plain form
7889 572 -241 1166 -292 -783 -819 -786 1538 72 637 238 -248 29 -409 -267 -883 889 -1204 -316 -1030
7908 -1030 799 -11 -434 430 -227 335 -181 1395 1492 764 873 -533 161 -1530 491 195 1107 559
7926 559 519 -25 1179 1488 676 -714 -285 -1112 -309 620 -305 429 -1686 -413 -966 825 948 538 -320
7945 -320 298 -716 605 -82 -453 390 -12 -706 -56 778 134 422 825 1659 329 536 403 211 -4
7964 -4 752 -521 -1339 25 1462 -489 1682 595 -329 -329 1674 -1133 583 -336 347 -522 551 422
7982 422 233 -425 -111 969 -455 350 -5 294 -76 -396 -94 -1087 -899 -1 -673 -656 1119 540 1209
8001 1209 282 -728 -959 990 337 422 -1284 115 -852 -524 125 -643 -362 -948 674 931 -785 -741
8019 -741 -1394 279 -259 815 -387 -429 430 50 120 611 129 350 -239 -1972 -1149 -1524 -195 -1055 535
$$ packed form
7889E72q13J407j458m91l6L3K324j466N65l99m86K77m38J42o16J772k093Q88p14
7908a030J829q10m23Q64o57N62n16J576R7p28J09j406O94j691K021k96R12n48
7926E59m0n44J204L09q12j390M29q27Q03R29r25P34k115J273n53J791J23m10q58
7945c20O18j014J321o87l71Q43m02o94O50Q34o44K88M03Q34j330K07j33j92k15
7964dP56j273q18J364J437j951K171j087r24%K003k807J716r19O83q69J073j29
7982D22j89o58L14J080j424Q05l55K99l70l20L02r93J88Q98o72J7J775n79O69
8001A209r27j010k31J949o53Q5j706J399r67L28O49p68K81n86J622K57j716M4
8019g41o53J673n38J074j202m2Q59l80P0M91m82K21n89j733Q23l75J329q60J590
$$ plain form
8038 535 630 -63 -248 1690 44 564 -133 -1613 299 -384 -154 1740 -1065 -19 -526 -273 129 -1056
8056 -1056 134 1097 -596 -577 873 -269 -698 619 -105 131 521 -193 637 1312 319 7 -252 -497
8074 -497 303 551 -1473 398 1049 -8 -670 860 -1330 -905 -205 -415 1998 -1674 93 1560 -1030
8091 -1030 -171 1262 496 -106 -785 -99 524 -492 316 -1264 101 -1010 -542 1294 696 -385 -1144
8108 -1144 832 -185 195 413 -756 474 860 396 -639 -883 -1276 -479 1816 -591 845 1019 574
8125 574 -176 -1045 168 -1589 -53 334 1238 870 677 -460 207 1269 176 276 -831 -782 808 -616
8143 -616 2144 -940 19 122 -849 -747 1085 1038 -196 530 -119 -499 480 -17 491 -80 -341 -698 -770
8162 -770 -388 344 524 -843 -422 747 560 25 -142 2119 570 -1393 -1087 -426 1083 725 1033 83
$$ packed form
8038E35R5o93j85J938j646N20o97j480J912o83K30J894k805J046n07K53M02j185
8056a056J190R63j693J9J450j142m29J317p24K36L90p14Q30O75r93l12k59k45
8074d97Q00K48k024J871O51j057o62J530k190M25P00k10K413l672J767J467k590
8091a030Q59J433p66o02o79O86O23j016Q08j580J365j111M68J836n98j081p59
8108a144J976j017L80K18j169J230L86m64j035k44l93P97K295k407J436J74m45
8125E74p50q69J213j757J536L87R04l68j93j137O67J062j093J00j107M9J590j424
8143f16K760l084R59J03r71J02J832m7j234P26o49l80R79m97N08n71k61l57p2
8162g70L82P32J80j367M21J169j87n35j67K261j549j963L06O61J509l58L08r50
$$ plain form
8180 83 905 -127 196 -40 -564 1226 361 -500 130 -549 -517
$$ packed form
8180H3Q22j032L23k36n24J790q65q61O30o79L2
8191e17
$$ Imaginary data points
##PAGE= N=2
##DATA TABLE= (X++(I..I)), XYDATA
$$ plain form
0 0 0 0 0 0 0 0 0 0 0 0 6 -8 8 -8 8 -16 16 -23 24 -32 39 -46 54 -62 73 -86 101 -117 133 -150 171 -195 222
33 222 -251 283 -318 356 -399 445 -495 550 -613 679 -750 829 -915 1009 -1112 1224 -1349
50 -1349 1487 -1638 1807 -1996 2208 -2446 2721 -3038 3409 -3852 4389 -5056 5912 -7049 8641
65 8641 -11030 14997 -22738 43324 -211704 -469913 203563 250026 -89979 26518 145721
76 145721 -101114 -8704 222009 58432 -126158 20362 75697 -27337 -26934 42781 18904
87 18904 -12446 1040 20782 -926 -15555 -25405 -41628 -5241 33860 -64725 -105660 51503
99 51503 80201 -67601 -12006 111214 -87 -49610 80226 45613 -36364 52077 25714
110 25714 -105358 -9084 109659 11142 -58742 -19201 666 47589 66373 -29415 -45026 42623
$$ packed form
0@%%%%%%%%%%Oj4J6j6J6k4L2l9M7n6P1q5J00j16J35j59J87k18K50k83L21l66M17
33B22m73N34o01O74p55Q44r40J045j163J292j429J579j744J924k121K336k573
50a349K836l125L445l803M204m654N167n759O447p261Q241r445J0968j2961J5690
65H641j9671K6027l7735O6062k55028k58209O73476M6463l40005J16497J19203
76A45721k46835R2410K30713j63577j84590J46520N5335j03034M03O9715k3877
87A8904l1350J3486J9742k1708j4629r850j6223L6387L9101r8585m0935J57163
99E1503K8698j47802N5595J23220j11301m9523J29836l4613q1977Q8441k6363
110B5714j31072R6274J18743r8517o9884L9541J9867M6923J8784r5788j5611Q7649
$$ plain form
122 42623 12690 -55450 -4770 22141 -39360 -54906 -23232 -12645 -5634 5178 2851 -20603
134 -20603 -20907 49590 67196 -33675 -41626 69917 39247 -59220 48 51270 -21397 -11644
146 -11644 54450 5764 -31374 20574 25567 -2809 4395 -15364 -43162 -26287 -8940 2105
158 2105 -2894 -53254 -46406 43730 47677 -22733 -10786 31128 10733 -4581 2290 -8212 -741
171 -741 6792 -22097 -27345 -1677 10583 20505 4441 -34261 -6180 43349 7496 -30738 3990
184 3990 11596 -18591 -5602 4857 -5223 5564 4201 -11932 2853 4984 -13244 4547 17233
197 17233 -19326 -18953 9902 -2683 -5677 23130 5550 -27272 -1711 33030 19674 -3621 -7343
210 -7343 14493 22577 -556 -3093 24376 15017 -13830 -1278 4594 -12253 1794 11509 -17390
$$ packed form
122D2623k9933o8140N0680K6911o1501j5546L1674J0587P011J0812k327k3454
134b0603l04P0497J7606j00871p951J11543l0670r8467N9268N1222p2667R753
146a1644O6094m8686l7138N1948M993k8376P204j9759k7798J6875J7347J1045
158B105m999n0360O848R0136L947p0410J1947M1914k0395j5314O871j0502P471
171g41P533k8889n248K5668J2260R922j6064l8702K8081M9529l5853l8234L4728
184C990P606l0187J2989J0459j0080J0787j363j6133J4785K131j8228J7791J2686
197A7233l6559L73K8855j2585k994K8807j7580l2822K5561L4741j3356k3295l722
210g343K1836Q084k3133k537K7469r359k8847J2552N872j6847J4047R715k8899
$$ plain form
223 -17390 -24781 1015 7141 -2270 -8002 -8534 6211 4858 -20776 -8344 22306 1154 -20747
236 -20747 3439 8401 -7521 11700 20541 -1674 -4958 6584 5728 7766 4188 -4412 -3189 -5592
250 -5592 -11433 4797 12991 -12547 -17364 6375 -1241 -17426 -4673 3584 -6657 -11604 -9498 -3148
264 -3148 10025 7065 -1515 3157 813 383 14564 11800 -4487 566 11112 413 -3676 8459
278 8459 10644 1306 -2090 -7788 -1199 5136 -3020 -6577 -3950 -11434 -10409 3878 2957 -5747 -563
293 -563 319 -6710 471 8321 1348 -2426 136 -1743 3154 7689 4007 5240 7601 -1869 -2108 7391
309 7391 6845 1011 -878 -4083 -6067 147 3286 -2901 -4660 -2612 -4870 -5135 -2761 -991 -5 -4044
325 -4044 -7498 -3319 684 2848 4340 524 -2870 -1405 2242 3664 1926 1018 -252 -292 1144 3396
$$ packed form
223a7390p391K5796O126r411n732n32J4745j353k5634J2432L0650k1152k1901
236b0747K4186M962j5922J9221Q841k2215l284J1542q56K038l578q600J223k403
250e592n841J6230Q194k5538m817K3739p616j6185J2753Q257j0241m947K106O350
264c148J3173k960q580M672k344m30J4181k764j6287N053J0546j0699m089J2135
278H459K185r338l396n698O589O335q156l557K627p484J025J4287r21q704N184
293e63Q82p029P181P850o973l774K562j879M897M535l682J233K361r470k39R499
309G391n46n834j889l205j984O214L139o187j759K048k258k65K374J770R86m039
325d044l454M179M003K164J492l816l394J465L647J422j738r08j270m0J436K252
$$ plain form
341 3396 6581 7869 1727 -2579 3587 2084 -1431 273 -670 -8208 -9391 -1806 -830 -1143 1123 -823
357 -823 -4667 -1435 1688 836 87 -2523 -5195 -3485 -1152 -912 2340 5139 3012 -592 5707 8489
373 8489 5775 3479 3413 -2015 -3687 111 1089 -1901 -4368 -3730 -4041 -1966 975 2285 875 -3370
389 -3370 -6068 -2858 547 -649 -3567 -2386 -3842 -1783 1828 6106 6093 4655 4475 6670 9051 6877
405 6877 6475 5446 989 -1175 1656 791 -1864 -2163 -1354 -4532 -5695 -2390 -1908 18 -1638 -6385
421 -6385 -5394 -3862 -5867 -4196 -1157 -4480 -5490 452 2486 6029 8302 6051 3512 5453 4480 3577
437 3577 4834 -1050 -8138 -5351 -2367 -5762 -1948 1457 -4257 -5219 1863 1348 -52 892 -3657 -5553
453 -5553 -3391 -4256 -6055 -719 918 -1836 1854 4161 3708 6561 8293 3364 2516 2586 537 3077
$$ packed form
341C396L185J288o142m306O166j503l515J704r43p538j183P585R76l13K266j946
357h23l844L232L123q52p49k610k672J710K333K40L252K799k127l604O299K782
373H489k714k296o6n428j672L798R78k990k467O38l11K075K941J310j410m245
389c370k698L210L405j196k918J181j456K059L611M278j3j438j80K195K381k174
405F877m02j029m457k164K831q65k655k99Q09l178j163L305M82J926j656m747
421f385R91J532k005J671L039l323j010N942K034L543K273k251k539J941r73r03
437C577J257n884p088K787K984l395L814L405n714r62P082n15j400R44m549j896
453e553K162q65j799N336J637k754L690K307m53K853J732m929q48P0k049K540
$$ plain form
469 3077 2635 -1048 -319 1217 -2385 1893 6863 1071 -2530 147 -1942 -4121 -318 -3699 -7154 -4535
485 -4535 -5696 -5106 1100 1250 -2275 1976 4359 1391 5139 9262 2602 629 4634 1719 -685 4523
501 4523 1286 -926 1365 -2416 -895 4104 1733 -2666 259 80 -3856 -1348 -31 -1383 -2735
516 -2735 -1570 -4843 -389 3564 -682 2513 3047 -957 2259 7610 334 -2620 977 -1887 -2922
531 -2922 1422 229 -1575 2082 455 -95 5533 2154 -2514 2287 1764 -5558 -4367 -1084 -4937 -2870
547 -2870 -1642 -6295 -5374 624 -125 -809 305 -3518 -2050 2734 47 -2088 3563 120 -2762 3135
563 3135 4070 1373 4231 2025 -1415 2536 3134 -1850 -697 1669 -4055 -2827 1121 -2529 -2135 -113
579 -113 -2898 -4233 2343 206 -1971 1897 745 -1298 3438 726 -2483 3870 2137 -577 2144
$$ packed form
469C077m42l683P29J536l602M278M970n792l601K677k089k179L803l381l455K619
485d535j161N90O206J50l525M251K383k968L748M123o660j973M005k915k404N208
501D523l237k212K291l781J521M999k371m399K925j79l936K508J317j352j352
516b735J165l273M454L953m246L195N34m004L216N351p276k954L597k864j035
531b922M344j193j804L657j627n50N628l379m668M801n23p322J191L283l853K067
547b870J228m653R21N998p49o84J114l823J468M784k687k135N651l443k882N897
563C135R35k697K858k206l440L951N98m984J153K366n724J228L948l650L94K022
579a13k785j335O576k137k177L868j152k043M736k712l209O353j733k714K721
$$ plain form
594 2144 2717 -2576 1967 5207 -546 1081 2786 -968 706 5872 -1004 -2851 -721 -2254 -1791 3490
610 3490 -2281 -7200 -1256 -113 -1679 538 -795 -4029 -893 1116 -1690 56 1629 -1709 1913
625 1913 4761 447 2283 4922 1013 2072 4570 -739 -914 1319 -901 -1492 -803 -2730 -3417 1061
641 1061 -1077 -5098 686 190 -4121 -593 997 -2523 10 884 -2222 282 2715 1360 1072 1705
657 1705 -1123 -641 3858 1047 -1755 1832 185 -805 3423 1612 -2002 -772 -771 -1324 882 165 -5059
674 -5059 -1974 553 -2298 -668 711 -1779 -1767 1310 -1027 -1115 767 -753 -534 2291 1100 -157
690 -157 2939 2984 877 3321 3089 -761 1266 2185 -17 -247 462 -2191 -129 498 -2015 -944 -28
707 -28 -2977 -2838 801 -1486 -2054 955 -1393 -677 1810 855 -1409 1078 362 -678 2124 1397 -274
$$ packed form
594B144N73n293M543L240n753J627J705l754J674N166o876j847K130j533M63N281
610C490n771m919N944J143j566K217j333l234L136K009k806J746J573l338L622
625A913K848m314J836K639l909J059K498n309j75K233k220n91O89j927o87M478
641A061k138m021N784m96m311L528J590l520K533Q74l106K504K433j355k88O33
657A705k828M82M499k811k802L587j647r90M228j811l614J230Jn53K206p17n224
674e059L085K527k851J630J379k490J2L077k337q8J882j520K19K825j191j257
690a57L096M5k107K444k32l850K027R19k202k30P09k653K062O27k513J071R16
707b8k949J39L639k287n68L009k348P16K487r55k264K487p16j040K802p27j671
$$ plain form
724 -274 1615 1017 -801 531 2423 437 -644 589 -118 -755 597 -1550 -2538 -666 -1700 -2760
740 -2760 -1499 -1530 -1920 378 -486 -1879 479 756 -551 891 448 -616 762 2071 4 1186 2837
757 2837 234 803 1842 1414 110 1358 -508 -1247 717 -90 -998 865 230 -2338 -135 -502 -2483
774 -2483 194 -289 -1656 -726 647 -651 -872 1656 -441 -177 491 1338 1178 1993 1013 725 1887 2461
792 2461 -147 1745 110 -933 -263 14 -863 -855 -434 -1329 171 -964 -2212 -705 570 -1263 -915
809 -915 -624 -1324 -321 72 -1242 -543 1263 473 1097 2178 698 193 1987 1675 60 1250 964 -1072
827 -1072 -659 13 -918 -482 -428 -1938 -1886 -46 -1862 -1041 -73 -2164 -2716 232 -969 -1512 763 -264
845 -264 -271 379 801 1101 1878 1128 385 1499 1453 -333 474 373 292 -834 -379 13 -179 455 -102 -135 -425
$$ packed form
724b74J889n98j818J332J892j986j081J233p07o37J352k147r88J872j034j060
740b760J261l1l90K298q64j393K358K77j307J442m43j064J378J309k067J182J651
757B837k603N69J039m28j304J248j866p39J964q07r08J863o35k568K203l67j981
774b483K677m83j367R30J373j298k21K528k097K64O68Q47j60Q15r80k88J162N74
792B461k608J892j635j043O70K77q77QM21q95J500j135j248J507J275j833L48
809i15K91p00J003L93j314O99J806p90O24J081j480n05J794l12j615J190k86k036
827a072M13O72r31M36N4j510N2J840j816Q21R68k091n52K948j201n43K275j027
845b64pO50M22L00P77p50p43J114m6j786Q07j01q1j126M55L92j92O34n57l3k90
$$ plain form
866 -425 -1348 -986 -966 -706 -1443 -1399 -620 -574 -148 122 -431 29 -296 301 1399 1549 1382 960 1089 263 699
887 699 1914 78 -546 818 723 920 491 568 -663 -719 -748 -215 -1192 -1192 -1196 -2062 -1236 -1190 -918 333 -1710
908 -1710 -700 161 -346 280 77 682 75 -50 201 604 987 1366 421 408 -433 616 1240 1432 -337
927 -337 -864 -248 -699 -399 -1160 -1162 -967 -1840 -1520 -115 -777 -429 -506 12 246 -1063 250 105 372 316 -327
948 -327 138 1094 527 758 652 617 524 700 -149 331 -96 -827 155 -2046 -477 -480 12 -180 -631 300 -565
969 -565 -106 -615 -396 -241 474 -436 1160 564 -201 728 293 -407 -245 1057 1041 1344 348 259 -118 1143
989 1143 1032 -685 -410 66 -1139 -235 162 -1027 -1109 -953 -849 -431 418 -483 -447 -650 -492 794 8
1008 8 508 199 386 331 612 769 470 774 1138 134 61 425 959 -410 431 -180 -635 -1063 -751 -979 -475
$$ packed form
866d25r23L62K0K60p37M4P79M6M26K70n53M60l25N97J098J50j67m22J29q26M36
887F99J215j836o24J364r5J97m29P7j231n6k9N33r77%mq66Q26M6K72J251k043
908a710J010Q61n07O26k03O05o07j25K51M03L83L79r45j3q41J049O24J92j769
927c37n27O16m51L00p61kJ95q73L20J405o62L48p7N18K34j309J313j45K67n6o43
948c27M65R56n67K31j06l5r3J76q49M80m27p31R82k201J569lM92j92m51R31q65
969e65M59n09K19J55P15r10J596n96p65R29m35p00J62J302j6L03r96q9l77J261
989A143j11j717K75M76j205R04L97j189q2J56J04M18Q49r01L6k03J58J286p86
1008HN00l09J87n5K81J57k99L04L64j004p3L64N34j369Q41o11m55m28L12k28N04
$$ plain form
1029 -475 -954 -1262 -987 -740 -318 -919 -331 -458 -1274 421 465 -423 990 617 -535 1096 501 689 770
1048 770 1070 485 3 826 -535 473 720 -402 -446 -8 -483 -532 -214 -1214 -1518 -524 -355 -169 293
1067 293 -139 -588 -192 -788 -289 247 602 -287 638 476 641 1523 1088 53 197 737 -58 1431 524
1086 524 -480 -552 -565 -786 -459 165 -318 -1224 -211 -268 -184 -506 581 -1006 -500 882 -473 -76 315
1105 315 -277 466 1074 122 917 590 1013 651 -17 -503 -284 208 58 135 7 -567 -947 -871 -1001 -486 -739
1126 -739 -687 -1458 112 596 -580 -620 -949 -126 429 -480 981 -38 772 767 -25 110 350 232 1109 852
1146 852 -306 1223 676 591 404 -591 -472 564 98 -59 -46 -89 -1053 -770 432 741 -766 -1117 -828
1165 -828 -678 200 774 -305 142 1269 529 633 1242 593 366 776 323 1089 1238 5 -196 -284 932
$$ packed form
1029d75m79l08K75K47M22o01N88j27q16J695M4q88J413l73j152J631n95J88Q1
1048G70L00n85m82Q23j361J008K47j122m4M38m75m9L18j000l04R94J69J86M62
1067B93m32m49L96n96M99N36L55q89R25j62J65Q82m35j035J44N40p95J489r07
1086E24j004p2j3k21L27O24m83r06J013n7Q4l22J087j587N06J382j355L97L91
1105C15n92P43O08r52P95l27M23l62o68m86K19M92j50P7j28n74l80P6j30N15k53
1126g39N2p71J570M84j176m0l29Q23N55r09J461j019Q10np92J35K40j18Q77k57
1146H52j158J529n47q5j87r95J19J036m66j57J3m3r64K83J202L09j507l51K89
1165h28J50Q78N74j079M47J127p40J04O09o49k27M10m53P66J49j233k01q8J216
$$ plain form
1184 932 -129 216 149 530 841 -1176 -1321 60 -1068 -435 -1035 -121 -547 -875 -457 -134 -182 300 -405
1203 -405 786 -1 1045 487 404 255 -115 467 529 780 -744 -529 -214 -271 -986 340 -207 -850 -323 250
1223 250 -359 472 -607 -172 -1006 -322 6 -901 139 233 -460 715 991 915 355 557 844 537 -46 370
1243 370 620 -103 -78 -969 -504 -553 -483 -325 1064 -867 -1702 -100 -373 -419 -847 -172 -665 717 607 561
1263 561 -368 -725 184 -736 -1856 1027 959 414 32 150 -95 1065 538 977 1582 -428 254 -929 -181
1282 -181 -890 -336 165 94 -600 -17 -883 -1786 -1109 -310 -285 -329 608 -66 1399 628 -428 423 675 5
1302 5 -318 1091 299 1006 60 -104 76 -1053 287 -252 -698 -714 61 674 -12 -441 -172 -940 -695 -882
1322 -882 -782 -1553 -697 -520 -519 144 -708 -495 673 213 -1047 442 -286 -22 235 -46 -60 -375 1419 904
$$ packed form
1184I32j061L45o7L81L11k017j45J381j128O33o00R14m26l28M18L23m8M82p05
1203d05J191p87J046n58q3j49l70N82O2K51j524K15L15n7p15J326n47o43N27N73
1223B50o09Q31j079M35q34O84L28r07J040R4o93J175K76p6n60K02K87l07n83M16
1243C70K50p23K5q91M65m9P0J58J389j931q35J602k73m6m28O75m93J382j10m6
1263E61r29l57R09r20j120K883o8n45l82J18k45J160n27M39O05k010O82j183P48
1282a81p09N54N01p1o94N83q66r03O77P99K5m4R37o74J465p71j056Q51K52o70
1302El23J409p92P07r46j64J80j129J340n39m46j6P75O13o86m29K69p68K45j87
1322h82J00p71Q56J77JO63q52K13J168m60j260J489p28K64K57k81j4l15J794n15
$$ plain form
1342 904 -1610 -117 425 154 -833 669 -1024 -671 -693 381 144 -61 80 109 -20 -319 -634 -229 -829
1361 -829 -13 -430 -159 656 601 1165 -95 -1515 -440 281 -579 1467 -316 -410 -1186 -193 135 585 -66
1380 -66 190 -679 -295 403 818 481 -258 -61 -1121 -592 1112 -1209 -263 -276 -799 909 963 -111 922
1399 922 6 -357 702 405 1144 -589 1044 798 1437 235 586 -184 -32 1054 -314 -83 52 -134
1417 -134 -2113 -1003 -183 -811 -1694 966 764 -712 -44 1060 1129 999 -251 -779 370 -750 -1297 -779
1435 -779 804 843 -46 347 601 -1167 -626 -1550 797 -318 -528 29 -643 1316 158 -1107 572 278
1453 278 68 -25 -136 -742 438 31 -1062 -452 -383 383 392 191 983 902 806 636 688 352 -726 299 724
1474 724 -136 -286 -1451 -612 -1007 -514 1046 706 189 -1004 -755 -445 708 -849 -1683 -1490 912 305
$$ packed form
1342I04k514J493N42k71r87J502j693L53k2J074k37k05J41K9j29k99l15M05o00
1361h29Q16m17K71Q15n5N64j260j420J075P21q60K046j783r4p76R93L28M50o51
1380f6K56q69L84O98M15l37p39J97j060N29J704k321R46j3n23J708N4j074J033
1399I22r16l63J059k97P39j733J633k46O39j202L51p70J52J086j368K31J35j86
1417a34j979J110Q20o28q83K660k02j476O68J104O9j30j250n28J149j120n47N18
1435g79J583L9q89L93K54j768N41r24K347j115k10N57o72J959j158j265J679k94
1453B78k10r3j11o06J180m07j093O10O9P66Rk01P92q1r6j70N2l36j078J025M25
1474G24q60j50j165Q39l95M93J560l40n17j193K49L10J153j557q34J93K402o07
$$ plain form
1492 305 300 316 -1269 1501 128 309 -81 577 -397 -60 355 -99 352 -481 802 -867 -295 217 -103
1511 -103 -23 936 -43 -132 -582 -1054 191 -153 -1088 304 -251 464 -545 -751 636 -353 -224 -1327 -698
1530 -698 -205 915 222 884 -341 -94 -344 -426 235 341 1031 -1025 239 -163 -558 -514 224 570 -652
1549 -652 1164 -809 -362 -1502 -625 746 -174 -870 -590 771 194 -147 48 283 -106 819 -564 109
1567 109 289 252 920 84 -32 -1451 -422 -377 24 -301 -915 -596 -277 508 -495 -118 -136 -398 -945 345
1587 345 -1197 -758 617 -55 478 142 -154 -218 -240 -397 -125 266 1505 1639 641 1005 42 573 -14 -734
1607 -734 413 -725 -167 -664 -363 -10 -654 -480 -781 -167 -172 265 743 -2401 86 -857 -1102 -1020 1681
1626 1681 399 740 -1139 490 -927 -529 -174 1305 -260 -88 103 594 -735 248 -50 -1178 993
$$ packed form
1492C05nJ6j585K770j373J81l90O58r74L37M15m54M51q33J283j669N72N12l20
1511a03Q0R59r79q9m50m72J245l44r35J392n55P15j009k06J387r89J29j103O29
1530f98M93J120o93O62j225K47k50q2O61J06O90k056J264m02l95M4P38L46j222
1549f52J816j973M47j140Q77J371r20o96K80J361n77l41J95K35l89R25j383O73
1567A09J80l7O68q36j16j419J029M5M01l25o14L19L19P85j003L77j8k62n47J290
1587C45j542M39J375o72N33l36k96o4k2j57K72L91J239J34r98L64r63N31n87p20
1607g34J147j138N58m97L01L53o44J74l01O14nM37M78l144K487r43k45Q2K701
1626A681j282L41j879J629j417L98L55J479j565J72J91M91j329R83k98j128K171
$$ plain form
1643 993 -670 809 885 372 250 -209 436 -334 -422 -224 1128 810 -1720 504 1157 651 -413 148 827
1662 827 1052 -602 1186 179 -21 539 169 348 -1159 238 741 79 1019 -835 163 -1021 200
1679 200 -926 500 -39 -612 -313 -455 2075 637 119 2715 1571 -844 -546 1447 -751 -749 896
1696 896 2013 -587 655 -552 -497 109 647 194 -154 -259 -851 67 -187 248 -1087 497 -273 470
1714 470 -244 721 124 400 680 658 -645 752 -248 1058 -20 1294 289 7 -33 -78 -245 117 660
1733 660 -426 -274 -901 -390 633 803 -76 890 -571 -156 -753 1682 1636 -307 577 77 -1498 269
1751 269 -2046 219 1325 712 258 -133 1593 -630 1303 -274 -493 -146 -23 -246 -753 325 198
1768 198 868 -595 862 543 601 -1559 718 -884 1106 -241 766 595 251 -61 -2226 -1236 -1628
$$ packed form
1643I93j663J479P6n13j22m59O45p70q8J98J352l18k530K224O53n06j064N61O79
1662H27K25j654J788j007k00N60l70J79j507J397N03o62R40j854R98j184J221
1679B00j126J426n39n73K99j42K530j438n18K596j144k415K98J993k198KJ645
1696H96J117k600J242j207N5O06N38m53l48j05n92R18k54M35j335J584p70P43
1714D70p14R65n97K76K80k2j303J397j000J306j078J314j005k82m0m5j67L62N43
1733F60j086J52o27N11J023J70q79R66j461M15n97K435m6j943Q84n00j575J767
1751B69k315K265J106o13m54l91J726k223J933j577k19L47J23k23n07J078j27
1768A98O70j463J457l19N8k160K277j602J990j347J007j71l44l12k165R90l92
$$ plain form
1785 -1628 -320 545 1166 -840 847 254 -215 -412 -286 197 468 -450 943 110 521 858 697 267
1803 267 128 1155 254 797 -450 257 -426 406 720 325 -615 -1566 -514 1173 -121 -901 1183 -266
1821 -266 -125 260 1312 913 -1351 320 440 -184 -226 947 -843 738 353 436 -1095 -407 329 329 1484
1840 1484 -807 1658 -331 1074 478 -38 734 18 -1161 -436 212 -121 669 215 1260 -496 -715
1857 -715 -264 138 1105 833 949 518 2095 147 -550 -851 1303 -511 -955 880 -636 480 853 -1213
1875 -1213 -391 -1519 -853 -981 1258 641 1118 119 287 -811 -334 1172 -773 -1389 140 537 -984
1892 -984 911 935 -506 710 -1405 452 -709 -588 -35 407 -424 650 -1012 333 624 430 -364
1909 -364 785 -46 -1695 831 45 -1167 857 397 691 686 -621 59 1524 1897 1762 1044 719 649 199
$$ packed form
1785a628J308Q65O21k006J687n93m69j97J26M83K71r18J393q33M11L37j61m30
1803B67j39J027r01N43j247P07o83Q32L14l95r40r51J052J687j294p80K084j449
1821b66J41L85J052l99k264J671J20o24m2J173j790J581l85Q3j531O88P36%J155
1840A484k291K465j989J405n96n16P72p16j179P25O48l33P90m54J045j756k19
1857g15M51M02R67k72J16m31J577j948o97l01K154j814m44J835j516J116L73k066
1875a213Q22j128O66j28K239o17M77r99J68j098M77J506j945o16J529L97j521
1892i84J895K4j441J216k115J857j161J21N53M42q31J074j662J345K91j94p94
1909c64J149q31j649K526p86j212K024m60K94nj307O80J465L73j35p18l25p0m50
$$ plain form
1928 199 754 883 985 -825 304 -486 -49 267 892 41 2773 -121 391 -37 -354 1376 321 -288
1946 -288 -286 450 928 546 52 -858 -473 -875 -108 959 -332 -184 793 259 -1046 -416 155 2073 614
1965 614 -540 -678 -818 -641 402 1009 -635 -1274 -619 -989 -621 304 109 132 -1016 434 1291 348 91
1984 91 -334 326 -390 -839 -170 487 -176 -111 1099 -365 338 6 -373 -468 -952 1413 809 1019 1289 -848
2004 -848 -615 326 -361 1009 -946 -1102 -1039 648 887 1140 413 -763 -210 -473 142 -1156 -628 -815 -1446
2023 -1446 -940 -88 -429 -1316 -808 -926 470 -627 1093 -181 72 318 0 133 -1468 680 1049 2243
2041 2243 1406 -627 -1505 539 103 1548 395 -1057 -353 -166 -29 -110 1301 -1402 39 624 -860
2058 -860 662 169 -645 -745 -760 220 884 -1018 134 357 285 -28 7 -545 699 -1143 -12 -979 -1240
$$ packed form
1928A99N55J29J02j810J129p90M37L16O25q51K732k894N12m28l17J730j055o09
1946b88KP36M78l82m94r10L85m02P67J067j291J48R77n34j305O30N71J918j459
1965F14j154j38j40J77J043O07j644o39O55l70L68R25j95K3j148J450Q57r43k57
1984I1m25O60p16m49O69O57o63O5J210j464P03l32l79r5m84K365o04K10K70k137
2004h48K33R41o87J370j955j56O3J687K39K53p27j176N53k63O15j298N28j87o31
2023a446N06Q52l41q87N08j18J396j097J720j274K53K46l18J33j601K148L69J194
2041B243q37k033q78K044m36J445j153j452P04J87J37q1J411k703J441N85j484
2058h60J522m93q14j00j5R80O64j902J152K23p2l13L5n52J244j842J131r67k61
$$ plain form
2077 -1240 -1283 -222 1487 -1507 268 61 -1455 857 300 -801 1716 -569 609 751 1105 267 1033
2094 1033 1533 998 -1065 -1107 538 -11 468 8 -538 -717 -26 689 955 640 874 1878 -182 456 1804
2113 1804 -1261 -324 -84 -791 954 598 -712 537 -916 -47 917 -53 1423 734 132 -563 -613 1821
2131 1821 -46 1160 510 -1335 806 782 115 -81 -1131 -244 555 -251 1568 206 -955 297 180
2148 180 -238 -1186 -1609 1283 -854 672 -21 -1711 1951 810 -86 -43 -73 -1620 -1297 -175 465 43
2166 43 720 -551 -509 248 618 476 1041 733 191 1190 65 -302 -1067 813 518 -274 -83 -476 780
2185 780 205 244 -177 -570 -1041 -1230 -1250 -462 -798 -370 1710 -730 70 -67 -342 569 -1202 463 -14
2204 -14 602 -293 723 624 -432 -531 -286 323 1275 1020 -497 230 643 -205 -101 687 685 87 -926 707
$$ packed form
2077a240m3J061J709k994J775k07j516K312n57j101K517k285J178J42L54q38P66
2094A033N00n35k063m2J645n49M79m60n46j79O91P15K66l15K34J004k060O38J348
2113A804l065R37K40p07J745l56j310J249j453Q69R64r70J476o89o02o95n0K434
2131A821j867J206o50j845K141k4o67j96j050Q87P99q06J819j362j161J252j17
2148A80m18r48m23K892k137J526o93j690L662j141q96M3l0j547L23J122O40m22
2166D3O77j271M2P57L70j42N65l08n42R99j125l67p65J880k95p92J91l93J256
2185G80n75L9m21l93m71j89k0P88l36M28K080k440Q00j37k75R11j771J665m77
2204a4O16q95J016r9j056r9K45O09R52k55j517P27M13q48J04P88kn98j013J633
$$ plain form
2224 707 -930 89 -622 -161 -1031 -892 118 140 -34 -252 1721 -774 -369 876 -390 892 1221 -289
2242 -289 1500 149 -1660 266 -772 607 -513 -717 279 48 -475 441 -561 61 151 984 553 -485
2260 -485 -487 -1144 575 -722 -88 265 -1493 704 -310 -846 -30 35 717 -639 791 550 840 1826 -445
2279 -445 174 954 -221 -231 -1212 -88 1313 -115 -247 562 -1 -281 -1067 -578 -221 -206 97 225 417
2298 417 65 -500 -395 -176 452 -310 -230 144 444 -197 856 480 248 653 -128 -1580 -693 -267 221 -888
2318 -888 -262 -172 14 -532 2 501 1 -526 -431 -282 -732 179 -87 448 1794 990 -33 523 604 398
2338 398 -173 440 227 -39 231 319 -670 94 194 433 35 144 995 40 -441 -231 298 1519 378 538
2358 538 273 613 37 602 152 375 1391 1099 418 -426 72 775 756 -355 431 -835 75 -642 506
$$ packed form
2224G07j637J019p11M61q70J39J010K2j74k18J973k495M05J245j266J282L29j510
2242b89J789j351j809J926j038J379j120k04R96k31n23R16j002O22R0Q33m31j038
2260d85ko57J719j297O34L53j758K197j014n36Q16O5O82j356J430k41K90R86k271
2279d45O19P80j175j0r81J124J401j428j32Q09n63k80p86M89L57J5L03J28J92
2298D17l52n65J05K19O28p62Q0L74L00o41J053l76k32M05p81j452Q87M26M88j109
2318h88O26R0J86n46N34M99n00n27R5J49m50R11k66N35J346q04j023N56Q1k06
2338C98n71O13k13k66K70Q8r89P64J00K39l98J09Q51r55m81K10N29J221j141J60
2358E38k65L40n76N65m50K23J016k92o81q44M98P03j9j111P86j266R10p17J148
$$ plain form
2377 506 631 74 -831 4 -564 -709 798 -686 -146 23 -255 -628 -15 -392 509 250 489 363 373 -295
2397 -295 -51 1113 -3 364 1015 85 -858 -739 803 -46 1003 -32 1020 363 -320 -76 587 60
2415 60 108 -676 404 -633 -547 29 -230 -287 -280 -958 -169 -127 1091 144 606 -433 42 -1000 135 -756
2435 -756 160 1266 -578 -780 864 154 1077 1258 -8 -241 1301 1261 -148 452 -415 277 251 66 88
2454 88 -631 -300 -143 -1248 -834 295 103 187 1008 417 1253 281 264 -842 122 574 -640 -764 34 -268
2474 -268 -811 1134 97 1227 176 748 66 2001 201 -300 -150 -1013 -1276 -217 1157 -227 321
2491 321 142 -41 627 98 47 -1488 -881 1450 -75 -430 -17 -527 -613 744 -130 -491 10 985 -766
2510 -766 -378 -456 -404 -47 217 354 1702 -236 885 -260 1093 -72 1443 -800 -590 -526 346 371 -1379
$$ packed form
2377E06J25n57r05Q35n68j45J507j484N40J69k78l73O13l77R01k59K39j26J0o68
2397b95K44J164j116L67O51r30r43J19J542q49J049j035J052o57o83K44O63n27
2415F0M8p84J080j037Q6N76k59n7Po78P89M2J218r47M62j039M75j042J135q91
2435g56R16J106j844k02J644p10R23J81j266k33J542m0j409O00q67O92k6j85K2
2454H8p19L31J57j105M14J129j92Q4Q21n91Q36r72j7j106R64M52j214j24P98l02
2474b68n43J945j037J130j051N72o82J935j800n01J50q63k63J059J374j384N48
2491C21j79j83O68n29n1j535O07K331j525l55M13n10q6J357q74l61N01R75j751
2510g66L88p8N2L57K64J37J348j938J121j145J353j165J515k243K10O4Q72K5j750
$$ plain form
2529 -1379 -284 1097 -640 -403 -348 318 296 399 -266 497 -9 367 -119 -1147 -162 362 -210 -48 501
2548 501 438 70 -2155 1108 -1398 1594 347 -134 -537 -699 68 175 512 -21 -205 -260 -1478 981
2566 981 463 216 -23 -742 -556 292 857 -237 0 -699 -982 -632 -363 932 -73 76 1210 177
2584 177 -1085 -684 20 -880 -224 74 -3 -1303 355 -259 -676 -267 712 154 1040 585 847 167 -1542
2603 -1542 -47 -650 -808 84 1079 -433 -1397 124 1269 117 151 -1163 -542 -335 -207 -74 128 -80
2621 -80 -196 455 356 965 -678 -726 1482 31 -82 -479 -674 145 -93 -539 -705 487 218 -710 -1885
2640 -1885 215 24 -308 -497 -296 -351 1203 -1543 911 78 -123 398 -337 264 1100 1320 286 -708
2658 -708 -1203 -164 287 704 1172 668 -618 666 -839 -217 159 650 -711 232 492 -268 -490 -52
$$ packed form
2529a379J095J381j737K37N5O66k2J03o65P63n06L76m86j028R85N24n72J62N49
2548E01o3l68k225L263k506K992j247m81m03j62P67J07L37n33j84n5j218K459
2566I81n18k47k39p19J86Q48N65j094K37o99k83L50K69J295j005J49J134j033
2584A77j262M01P04r00O56K98p7j300J658o14m17M09R79n58Q86m55K62o80j709
2603a542J495o03j58Q92R95j512r64J521J145j152L4j314O21K07J28J33K02k08
2621h0j16O51r9O09j643m8K208j451j13l97j95Q19k38m46j66J192k69r28j175
2640a885K100j91l32j89K01n5J554k746K454q33k01N21p35O01Q36K20j034r94
2658g08m95J039M51M17M68n04j286J284j505O22L76M91j361R43K60p60k22M38
$$ plain form
2676 -52 450 684 -659 484 -80 1172 -1037 52 -562 -730 -593 -671 11 20 389 21 464 -232 -41 428
2696 428 335 -451 1150 529 -136 -173 -249 380 -405 -328 -581 172 -507 -232 -262 -16 21 829 678 987 781 -212
2718 -212 -668 625 1227 -659 75 -59 297 -763 -329 -836 990 148 -7 253 -876 -893 254 548
2736 548 -674 -1071 -640 -163 -1199 -627 -70 708 116 -137 405 -77 -462 28 -336 -928 572 932 456
2755 456 892 -31 147 -255 344 3 -387 700 -117 -158 910 -978 -367 -337 1300 1331 554 -242 235 -80
2775 -80 95 347 902 -275 -188 -434 -477 -1116 765 -14 -400 1097 483 -1283 -117 -28 115 37 1082 -1082
2795 -1082 -183 -163 -62 -1088 93 708 -652 1238 -885 776 -30 11 -959 -539 180 290 487 -134
2813 -134 -776 288 122 485 -129 526 -32 -652 -310 -189 -679 -254 -294 569 1177 907 483 -822 -922 1240
$$ packed form
2676e2N02K34j343J143n64J252k209J089o14j68J37p8O82RL69l68M43o96J91M69
2696D28r3p86J601o21o65l7p6O29p85P7k53P53o79K75l0K46L7Q08j51L09k06r93
2718b12m56J293O02j886P34j34L56j060M34n07J826q42j55K60j129j7J147K94
2736E48j222l97M31M77j036N72N57P78n92k53N42m82l85M90l64n92J500L60m76
2755D56M36r23J78m02N99l41l90J087q17m1J068j888O11L0J637L1p77p96M77l15
2775h0J75K52N55j177Q7k46m3o39J881p79l86J497o14j766J166Q9J43p8J045k164
2795a082Q99K0J01j026J181O15j360J890k123J661q06M1r70M20P19J10J97o21
2813a34o42J064j66L63o14O55n58o20L42J21m90M25m0Q63O08k70m24j305j00K162
$$ plain form
2833 1240 -1284 173 94 -984 -80 -76 -515 392 -576 -365 457 -737 -1359 -1676 36 -1169 1052 527
2851 527 -910 -458 505 -285 -575 -206 719 -358 -1266 -377 1255 -72 -304 248 -1161 -235 826 940
2869 940 -2286 20 971 -1294 895 650 -155 -901 1297 -405 -180 940 287 278 0 -233 -1137 -671
2887 -671 343 -665 -1833 -597 110 787 1298 1236 -71 -788 665 99 537 -291 9 489 141 127 253
2906 253 -344 -918 1227 -540 -533 -946 -1507 1351 501 -856 124 -11 -430 243 244 -505 52 375 -227 -643
2926 -643 -317 203 1365 901 100 -153 -1976 -201 798 -498 1727 314 288 -2037 -829 752 379
2943 379 -139 1050 1193 -590 -895 1311 -980 -506 1265 -224 622 -497 139 -656 2091 898 984
2960 984 -1437 -709 -269 -781 -470 -938 1040 -636 425 -528 -473 2015 832 -2490 337 -1790 -25
$$ packed form
2833A240k524J457p9j078R04Mm39R07r68K11Q22j194o22l17J712j205K221n25
2851E27j437M52R63p90k90L69R25j077r08Q89J632j327k32N52j409R26J061J14
2869I40l226K306R51k265K189k45q05p46K198j702K25J120o53rk78k33r04M66
2887f71J014j008j168J236P07O77N11o2j307p17J453n66M38q28L00M80l48j4J26
2906B53n97n74K145j767Pm13n61K858q50j357R80j35m19O73Jp49N57L23o02m16
2926f43L26N20J162m64q01k53j823J775R99j296K225j413k6k325J208J581l73
2943C79n18J189J43j783l05K206k291M74J771j489Q46j119O36p95K747j193Q6
2960I84k421P28M40n12L11m68J978j676J061r53N5K488j183l322K827k127J765
$$ plain form
2977 -25 979 511 -346 215 -213 1523 -379 434 605 -155 -457 -1373 219 -509 0 291 -47 -1302 24
2996 24 16 -56 -364 -283 -527 460 -1375 -761 -732 459 -1310 -741 2356 -516 -881 -834 707 -190 -724 658
3016 658 61 -171 1111 543 540 745 -337 -695 -541 706 41 1066 382 -749 -354 -629 1258 -213
3034 -213 1774 1421 -270 -513 861 1498 683 1197 436 -591 2324 -76 -22 538 54 828 -220 -1198
3052 -1198 1116 -496 647 144 995 -1073 -224 801 1755 -236 -458 -1781 168 -1048 1113 594
3068 594 -16 431 1230 649 54 -1103 -1413 -1120 760 -260 460 -591 637 -140 1329 891 -2108 635
3086 635 -243 2194 762 226 1842 -689 16 -670 1178 1217 805 751 500 1418 -261 331 -576 -1095 -741
3105 -741 335 397 -108 -94 135 1128 -2261 499 1226 -354 498 609 449 29 159 -610 473 115 -9
$$ packed form
2977b5J004m68q57N61m28J736j902Q13J71p60l02r16J592p28N09K91l38j255J326
2996B4qp2l08Q1k44R87j835O14K9J191j769N69L097k872l65M7J541q97n34J382
3016F58n97k32J282n68lK05j082l58J54J247o65J025o84j131L95k75J887j471
3034b13J987l53j691k43J374O37q15N14p61j027K915k400N4N60m84P74j048r78
3052a198K314j612J143n03Q51k068Q49J025R54j991k22j323J949j216K161n19
3068E94o10M47P99n81n95j157l10K93J880j020P20j051J228p77J469m38k999K743
3086F35q78K437j432n36J616k531P05o86J848L9m12n4k51R18j679N92r07n19L54
3105g41J076O2n05J4K29R93l389K760P27j580Q52J11j60m20J30p69J083l58j24
$$ plain form
3124 -9 300 -682 715 -949 -298 -1333 870 1255 347 384 -2688 605 -149 -352 -653 287 716 -197 -263
3143 -263 -432 1449 -417 -371 -388 142 -1216 156 34 -7 505 564 157 640 46 -1223 843 408 -238
3162 -238 1047 -1454 -1829 343 231 -816 695 345 -334 -422 -6 -583 -534 169 -355 -281 -1226 173 1470
3181 1470 -803 -209 717 -499 -1441 747 459 -1525 920 765 1665 -337 -744 359 45 375 -346
3198 -346 663 -520 -161 285 428 250 273 435 1287 616 293 -476 443 633 -275 -920 440 92 -1146
3217 -1146 201 -497 -695 1042 -338 6 -302 -65 -98 -436 -1623 532 898 1060 965 -482 222 -1854
3235 -1854 -1024 99 -1448 232 -1200 -494 -818 8 -502 -1157 685 108 489 720 440 514 614 -2080
3253 -2080 -94 591 -25 448 -442 870 332 -542 -57 82 176 -856 -949 376 -1527 845 78 -117
$$ packed form
3124iL09r82J397j664O51j035K203L85r08L7l072L293p54k03l01R40M29r13o6
3143b63j69J881j866M6j7N30j358J372j22m1N12N9m07M83n94j269K066m35o46
3162b38J285k501l75K172j12j047J511l50o79q8M16n77M9P03n24P4r45J399J297
3181A470k273N94R26j216r42K188k88j984K445j55R00k002m07J103l14L30p21
3198c46J009j183L59M46J43j78K3J62Q52o71l23p69R19J90r08o45J360l48j238
3217a146J347o98j98J737j380L44l08K37l3l38j187K155L66J62r5j447P04k076
3235a854Q30J123j547J680j432P06l24Q26n10o55J842n77L81K31k80P4J00k694
3253b080J986O85o16M73q90J312n38q74M85J39R4j032r3J325j903K372p67j95
$$ plain form
3271 -117 -266 1897 334 374 1665 -592 693 1416 -222 228 -511 1245 565 -7 -354 -644 1441 -107
3289 -107 -118 -880 272 69 -704 -172 -342 -601 1163 -582 -4 -144 -598 741 -261 1036 -199 1001
3307 1001 158 -624 -952 119 -597 -1319 544 939 765 -634 -326 -871 -1494 224 -1996 -279 860
3324 860 -557 1011 -86 82 38 2725 -1057 -1423 1100 -1760 -243 -385 213 1353 190 -235 95
3341 95 2092 729 -310 -1158 -689 -343 -849 -1043 -217 -453 836 -685 -309 242 -575 -315 -14 229 30
3360 30 41 881 361 1036 -977 -284 386 1073 74 -315 1345 1153 1211 -195 849 -132 -325 -867 -301 -1250
3380 -1250 279 -188 906 -490 259 348 937 370 199 573 353 241 394 -890 349 426 184 -584 -188
3399 -188 1118 703 -572 943 -578 194 39 -446 -1028 504 -47 -634 -657 251 276 239 69 447 985
$$ packed form
3271a17j49K163j563M0J291k257J285P23j638M50p39J756o80n72l47k90K085j548
3289a07j1p62J152k03p73N32j70k59J764j745N78j40m54J339j002J297j235J200
3307A001q43p82l28J071p16p22J863L95j74j399L08n45o23J718k220J717J139
3324H60j417J568j097J68m4K687l782l66K523k860J517j42N98J140j163m25L30
3341I5J997j363j039q48M69L46n06j94Q26k36J289j521L76N51q17K60L01K43j99
3360C0J1Q40n20O75k013O93O70O87r99l89J660j92N8j406J044r81j93n42N66r49
3380a250J529m67J094j396P49Q9N89n67j71L74k20j12J53j284J239P7k42p68L96
3399a88J306m15j275J515j521P72j55m85n82J532n51n87k3R08K5l7j70L78N38
$$ plain form
3418 985 -926 -1071 -1036 -387 -881 -1309 -360 -126 607 8 218 75 93 -404 -104 25 -738 614 333 -299
3438 -299 469 -499 -312 806 451 -562 761 -261 -713 -161 917 -118 1 -58 -865 694 447 1386
3456 1386 -1662 -211 -9 556 62 462 549 427 -266 -511 280 530 440 1153 1287 351 530 -1300 1060
3475 1060 -147 -25 1014 1368 732 -760 1738 976 642 1602 -123 -724 -761 780 -556 -926 49 236
3493 236 855 414 -1466 683 159 276 934 1047 408 22 84 524 1471 700 1066 1138 -183 262 -375 -70
3513 -70 -1030 1696 1756 -677 251 657 -211 1005 439 530 -794 -382 1480 -732 857 575 -810 1033
3531 1033 -2 713 -114 -367 363 305 -1026 453 487 -465 -761 -276 74 539 -788 119 324 441 -548
3550 -548 -744 167 216 153 931 -873 -463 412 -434 134 -231 283 2070 561 1012 795 1752 960 559 -595
$$ packed form
3418I85j911j45L5O49m94m28R49K34P33n99K10j43J8m97L00J29p63J352k81o32
3438b99P68r68J87J118l55j013J323j022m52N52J078j035J19n9q07J559k47R39
3456A386l048J451K02N65m94M00Q7j22o93k45P91K50r0P13J34r36J79j830K360
3475A060j207J22J039L54o36j492K498p62l34R60j725o01l7J541j336l70R75J87
3493B36O19m41j880K149n24J17O58J13o39l86O2M40R47p71L66P2j321M45o37L05
3513g0r60K726O0k433R28M06q68J216n66R1j324M12J862k212J589k82j385J843
3531A033j035P15q27k53P30n8j331J479L4r52k96M85L50M65j327R07K05J17r89
3550e48j96R11M9o3P78j804M10Q75q46N68l65N14J787j509M51k17R57p92m01j154
$$ plain form
3570 -595 174 582 433 337 828 1241 -543 -383 -69 -222 -501 52 363 263 534 832 -518 -251 -479 587
3590 587 146 183 173 -223 39 235 242 732 1147 970 -12 -406 -195 702 -1079 -72 96 -2 574 266 -415
3611 -415 -292 444 505 -471 596 145 161 69 -903 -92 -96 -614 -683 -266 44 -353 103 -26 -46 358 166 153
3633 153 168 590 81 -58 -167 -445 -12 521 334 -5 -425 541 634 51 1155 -22 325 865 -382 -144
3653 -144 -353 226 241 96 905 -269 -184 672 -399 -121 131 -141 335 -47 456 -3 -280 -387 252 258 -20
3674 -20 13 -142 824 220 -316 -888 805 34 -368 -593 -142 -208 -511 -1 231 537 -28 -269 370 -97 -700
3695 -700 -295 899 393 559 -643 -766 -412 -195 34 -813 -105 -378 -360 -332 -616 30 -366 -215 -126 -1197
3715 -1197 -434 14 302 1468 872 66 -321 525 -299 -309 -174 724 694 748 -482 300 -545 -15 104 -411
$$ packed form
3570e95P69M08j49r6M91M13j784J60L14j53k79N53L11j00K71K98j350K67k28J066
3590E87m41L7j0l96K62J96PM90M15j77r82l94K11Q97j781J007J68r8N76l08o81
3611d15J23P36O1r76J067m51J6r2r72Q11mn18o9M17L10l97M56j29k0M04j92j3
3633A53J5M22n09j39j09k78M33N33j87l39m20R66R3n83J104j177L47N40j247K38
3653a44k09N79J5j45Q09j174Q5Q56j071K78K52k72M76l82N03m59k77j07O39Ok78
3674b0L3j55R66o04n36n72J693p71m02k25M51o6l03N10K32L06n65k41O39m67o03
3695g00M05J194n06J66j202j23L54K17K29q47P08k73J8K8k84O46l96J51Q9j071
3715a197P63M48K88J166n96q06l87Q46q24j0J35Q98l0N4j230P82q45N30J19n15
$$ plain form
3735 -411 -286 717 -414 -185 -213 684 -662 -620 662 -1209 306 -245 29 -4 -560 -44 33 -91 -112 -836
3755 -836 504 29 -586 -52 -134 -484 -24 -141 364 414 -152 47 117 -39 358 -397 85 -1142 -103 -217
3775 -217 -67 -178 348 -115 285 -30 554 -216 477 -255 -363 -293 -470 142 -882 -347 173 394 447 473 -50
3796 -50 166 -343 -889 -73 92 -612 -185 114 100 -394 -239 -24 135 290 368 -341 -356 103 -500 -216 -54
3817 -54 -157 -24 -233 -154 -41 265 -158 104 505 263 487 618 486 -210 20 72 -147 159 -242 557 176
3838 176 173 -110 -1 400 47 64 282 341 -146 -788 -703 295 -164 -491 -330 -419 410 117 -18 173 399 236
3860 236 166 -662 -19 872 -609 -68 -432 -721 -170 -433 -177 99 127 213 -574 244 -160 -531 -293 377 657
3881 657 -522 110 -181 -6 -376 392 -246 304 -198 101 209 -163 160 413 -378 -286 -96 -218 170 -284
$$ packed form
3735d11J25J003j131K29k8Q97j346M2J282j871J515n51K74l3n56N16P7j24k1p24
3755h36J340m75o15N34q2l50M60j17N05N0n66J99P0j56L97p55M82j227J039j14
3775b17J50j11N26m63M00l15N84p70O93p32j08P0j77O12j024N35N20K21N3K6n23
3796e0K16n09n46Q16J65p04M27K99j4m94J55K15J59J55P8p09j5M59o03K84J62
3817e4j03J33k09P9J13L06m23K62M01k42K24J31j32o96K30N2k19L06m01P99l81
3838A76lk83J09M01l53J7K18N9m87o42Q5R98m59l27J61q9Q29k93j35J91K26j63
3860B36p0q28O43Q91j481N41l64k89N51k63K56K76K8Q6p87Q18m04l71K38O70K80
3881F57j179O32k91J75l70P68o38N50n02K99J08l72L23K53p91R2J90j22L88m54
$$ plain form
3901 -284 -585 161 -382 90 33 178 5 147 17 36 -438 -151 220 101 -254 24 40 -295 452 -45 -334
3922 -334 293 351 47 -43 84 -140 -97 252 -192 -160 -47 -346 -92 133 58 -82 -118 -294 -124 -168 275 -168
3944 -168 36 259 242 -145 -50 255 -278 -56 204 -23 -267 -99 222 380 -37 -225 24 2 50 328 352 276
3966 276 -391 51 -259 288 -89 -342 -254 -167 277 -284 141 85 375 -164 246 -67 -63 -245 173 38 72 35
3988 35 -53 250 215 -243 -58 15 -149 -319 66 35 -347 -271 348 185 474 210 -275 173 -185 -5 131 -543
4010 -543 -7 29 -450 33 -173 122 144 464 -168 -197 -210 -397 -165 338 407 427 17 520 130 -11 53 -263
4032 -263 -55 282 -578 17 -600 26 -73 83 181 -98 392 -799 290 -260 321 369 -166 -218 121 183 -204
4053 -204 -511 -367 -273 95 -678 70 -315 -304 -215 119 185 16 -669 -643 91 -191 576 529 265 -438 -360 -374 -144
$$ packed form
3901b84l01P46n43M72n7J45j73J42j30J9m74K87L71j19l55K78J6l35P47m97k89
3922c34O27N8l04r0J27k24M3L49m44L2J13k99K54K25p5j40l6j76J70m4M43m43
3944a68K04K23j7l87R5L05n33K22K60k27k44J68L21J58m17j88K49k2M8K78K4p6
3966B76o67M42l10N47l77k53Q8Q7M44n61M25n6K90n39M10l13Mj82M18j35L4l7
3988C5q8L03l5m58J85P3j64j70L85l1l82P6O19j63K89k64m85M48l58J80J36o74
4010e43N36L6m79M83k06K95K2L20o32k9j3j87K32N03O9K0m10N03l90j41O4l16
4032b63K08L37q60N95o17O26r9J56R8k79M90j191J089n50N81M8n35n2L39O2l87
4053b04l07J44R4L68p73P48l85J1Q9L34O6j69o85K6P34k82P67m7k64p03P8j4K30
$$ plain form
4076 -144 255 -237 411 410 623 -140 598 316 -50 273 -30 -393 -270 -337 -12 -422 -161 334 55 -915 109
4097 109 -141 577 366 -242 -332 367 -375 -47 -170 -106 -454 77 606 -103 -191 16 186 -516 95 -234 -226 -315
4119 -315 -19 -77 -353 -38 372 350 85 111 -55 52 50 -113 -171 -29 39 -106 -92 -14 202 113 -20 -23 -208 -36
4143 -36 45 113 -142 -103 -143 -13 29 -86 177 -63 63 -95 43 -202 -104 -80 -16 -181 246 -28 77 -90 4
4166 4 37 269 -41 -76 -88 -8 60 167 -16 207 -51 87 -311 91 190 45 -62 -134 -50 3 -105 -292 184 -93
4190 -93 98 168 -22 -18 105 -186 -56 -203 -21 101 -39 -58 87 43 68 14 170 76 163 127 -23 199 -19 -124
4214 -124 58 -114 82 341 49 -57 14 -75 146 -15 71 45 -15 -72 45 -237 28 144 88 -42 -232 32
4236 32 133 117 -88 138 181 -52 113 -3 182 228 27 -66 -62 -193 -3 -297 -43 217 -55 -46 -327 78 265
$$ packed form
4076a44L99m92O48jK13p63P38k82l66L23l03l63J23o7L25m10K61M95k79r70J024
4097A09k50P18k11o08r0O99p42L28j23O4l48N31N29p09q8K07J70p02O11l29Qq9
4119c15K96n8k76L15M10k2k65K6j66J07kj63n8J42O8j45J4P8K16q9j33lj85J72
4143c6Q1O8k55L9m0J30M2j15K63k40J26j58J38k45R8K4O4j65M27k74J05j67R4
4166DL3K32l10l5j2Q0O8J07j83K23k58J38l98M02R9j45j07p2Q4N3j08j87M76k77
4190i3J91P0j90MJ23k91J30j47J82J22j40j9J45m4K5n4J56r4Q7l6j50K22k18j05
4214a24J82j72J96K59k92j06P1q9K21j61Q6k6o0n7J17k82K65J16n6j30j90K64
4236C2J01j6k05K26M3k33J65j16J85M6k01r3Mj31J90k94K54K60k72Rk81M05J87
$$ plain form
4259 265 -144 129 188 -156 -186 106 74 245 91 -108 -202 163 53 -117 -54 -205 185 16 -45 -141 26 -144
4281 -144 -124 93 -29 28 -51 19 36 -30 159 -44 57 110 -183 -158 194 162 68 46 4 143 -225 91 -54 -116
4305 -116 40 -212 257 203 103 -42 -290 -253 -77 -31 -134 -282 -114 166 -24 -284 66 79 -187 -145 40 -207
4327 -207 -181 19 -394 131 -176 -372 98 115 20 60 144 76 53 171 95 253 12 13 119 -74 38 195 23
4350 23 6 103 -254 -102 3 -157 10 -39 77 118 -81 -247 2 51 229 -100 232 -213 50 -125 -97 94
4372 94 -220 -90 102 42 295 -36 24 70 88 -2 -34 -126 7 -73 -80 -68 77 43 -293 -28 -17 -199 -9 -273 373
4397 373 -54 214 5 202 96 267 158 -77 -10 -114 161 -89 110 -154 -8 -94 163 55 119 -206 79
4418 79 -46 -23 -115 -32 33 108 216 -42 34 -78 -40 -100 95 39 57 -22 117 145 2 192 -180 157 -175 -181 107
$$ packed form
4259B65m09K73N9l44l0K92l2J71j54j99r4L65j10j70O3j51L90j69o1r6J67j70
4281a44K0K17j22N7p9P0J7o6J89k03J01N3k93K5L52l2r4k2m2J39l68L16j45o2
4305a16J56k52M69n4j00j45k48L7J76M6j03j48J68K80j90k60L50J3k66M2J85k47
4327b07K6K00m13N25l07j96M70J7r5M0Q4o8k3J18p6J58k41JJ06j93J12J57j72
4350B3j7R7l57J52J05j60J67m9J16M1j99j66K49M9J78l29L32m45K63j75K8J91
4372I4l14J30J92o0K53l31O0M6J8r0l2r2J33q0pJ2J45l4l36K65J1j82J90k64O46
4397C73m27K68k09J97j06J71j09k35O7j04K75k50J99k64J46q6K57j08O4l25K85
4418G9j25K3r2Q3O5P5J08k58P6j12L8o0J95n6J8p9J39K8j43J90l72L37l32oK88
$$ plain form
4443 107 1 -94 123 -123 121 229 132 183 -62 -86 124 233 -132 83 241 86 -236 -21 58 -253 25 -46
4465 -46 -45 -315 117 -219 -47 27 116 37 48 43 170 -21 118 -84 -170 -10 -56 224 -275 -156 -186 -78 239 165
4489 165 -24 120 106 -232 -9 -22 164 217 124 243 -126 29 40 -87 833 83 -317 -24 -350 23 -1144
4510 -1144 -122 -242 33 335 295 -186 382 299 -575 -562 649 385 -259 81 -69 164 -122 381 -282 442
4530 442 461 122 -107 150 5 92 -282 132 123 99 -177 -225 9 111 -100 -231 -87 -302 126 360 24 385
4552 385 -51 -414 -198 -532 -235 -79 167 -20 170 18 16 -24 -180 47 134 53 268 361 338 363 138 -163 -234
4575 -234 -51 85 -136 -66 -135 -465 -223 45 -247 -58 442 103 -232 -47 -246 469 -193 32 116 192 -259
4596 -259 -14 -369 34 -479 134 -177 230 174 -209 -55 77 -95 -347 143 -85 -383 -122 -80 589 15 -13
$$ packed form
4443A07j06r5K17k46K44J08r7N1k45k4K10J09l65K15J58j55l22K15P9l11K78p1
4465d6Jk70M32l36J72P4Q9p9J1nJ27j91J39k02q6J60m6K80m99J19l0J08L17p4
4489A65j89J44j4l38K23j3J86N3r3J19l69J55J1j27R20p50m00K93l26L73j167
4510a144J022j20K75L02m0m81N68q3q74J3J211k64o44L40j50K33k86N03o63P24
4530D42J9l39k29K57j45Q7l74M14rk4k76m8K34J02k11j31J44k15M28K34l36L61
4552C85m36l63K16l34K97J56K46j87J90j52km0j56K27Q7q1K15R3k3K5k25l01p1
4575b34J83J36k21P0o9l30K42K68k92J89N00l39l35J85j99P15o62K25Q4P6m51
4596b59K45l55M03n13O13l11M07n6l83J54J32j72k52M90k28k98K61M2O69n74k8
$$ plain form
4617 -13 176 -279 183 -433 244 124 182 -137 303 239 571 -239 -42 -341 443 220 271 -135 92 258 -168
4638 -168 324 315 -262 -273 428 -62 -931 321 -134 385 18 -255 312 -606 -39 338 73 -322 236 -90 -234
4659 -234 -10 -84 -330 -149 226 -80 780 -160 -384 511 689 400 563 131 327 420 -767 364 -566 86
4679 86 -293 -191 608 -75 448 -320 -133 -341 30 -518 -135 -173 12 -212 645 -141 31 -148 78 400 169
4700 169 446 175 -534 -301 326 -144 220 -26 517 -556 241 -64 3 33 282 672 89 39 503 -15 519
4721 519 525 81 -418 245 364 -178 311 454 312 319 166 143 134 -24 816 280 83 -138 -195 -466 282 276 437
4744 437 -483 -693 217 84 712 -714 -267 62 361 198 -222 -250 -226 -245 -210 173 -486 133 58 -5 1155
4765 1155 -665 -586 -319 337 58 -9 99 -59 361 -252 -160 37 682 400 -333 993 -709 47 433 -598
$$ packed form
4617a3J89m55M62o16O77j20N8l19M40o4L32q10J97k99P84k23N1m06K27J66m26
4638a68M92rn77j1P01m90q69J252m55N19l67k73N67r18N67L77k65l95N58l26j44
4659b34K24p4k46J81L75l06Q60r40k24Q95J78k89J63m32J96R3j187J131r30O52
4679H6l79J02P99o83N23p68J87k08L71n48L83l8J85k24Q57p86J72j79K26L22k31
4700A69K77k71p09K33O27m70L64k46N43j073P97l05O7L0K49L90n83n0M64n18N34
4721E19Om44m99O63J19n42M89J43j42Pj53k3rj58Q40n36j97k21n7k71P48oJ61
4744D37r20k10R10j33O28j426M47L29K99j63m20k8K4j9L5L83o59O19p5o3J160
4765A155j820P9K67O56k79o7J08j58M20o13R2J97O45k82p33J326j702P56L86j031
$$ plain form
4785 -598 345 -734 -39 18 -436 808 182 -178 980 406 -195 -695 102 292 -461 -243 -239 85 -413 -713
4805 -713 6 345 -510 -39 -231 49 573 314 521 -131 438 -378 171 305 -423 400 371 591 1185 -378
4825 -378 542 -30 466 -782 417 -125 217 -556 251 429 -508 627 46 -506 243 187 -104 216 476
4844 476 -277 75 256 -66 -515 214 -839 -354 -1273 75 678 21 586 734 0 -20 -298 208 515 410
4864 410 112 -55 1582 377 226 661 29 143 720 355 -905 501 -262 519 -461 335 197 -159 -245
4883 -245 326 -235 383 318 283 -333 115 329 73 -22 34 -64 689 551 -1452 -746 -664 689 -1625 -461 -494
4904 -494 190 -56 66 195 182 975 -309 -155 821 102 246 -137 -226 292 -478 -285 -491 61 -280 -588
4924 -588 368 492 -48 -708 -236 -358 -220 -178 -406 -580 199 264 -196 -291 -1013 461 214 -62 -920 -490 -221
$$ packed form
4785e98R43j079O95N7m54J244o26l60J158n74o01n00P97J90p53K18ML24m98l00
4805g13P19L39q55M71j92K80N24k59K07o52N69q16N49J34p28Q23k9K20N94j563
4825c78R20n72M96j248J199n42L42p73Q07J78r37J135n81n52P49n6k91L20K60
4844D76p53L52J81l22m49P29j053M85r19J348O03o57N65J48p34k0k78N06L07j05
4864D10k98j67J637j205j51M35o32J14N77l65j260J406p63P81r80P96j38l56q6
4883b45N71n61O18o5l5o16M48K14k56r5N6r8P53j38k003P06Q2J353k314J164l3
4904d94O84k46J22J29j3P93j284J54R76p19J44l83q9N18p70J93k06N52l41l08
4924e88R56J24n40o60M72j22J38M2k28j74P79O5m60r5p22J474k47k76q58M30K69
$$ plain form
4945 -221 162 955 739 -88 -470 596 110 -239 -4 280 -142 -96 593 3 -376 603 -121 -253 -295 -38
4965 -38 132 -20 141 -659 -130 -225 -93 -102 434 484 -224 1 877 -349 -322 685 204 -210 423 -405 511
4986 511 183 -109 -418 369 394 -38 -469 -36 401 125 351 439 -81 -311 85 -640 43 -487 287 -197 -429
5007 -429 -798 225 26 -345 649 -138 34 -91 597 -274 407 -262 846 -79 959 -200 -319 -353 -416
5026 -416 -457 -467 -244 -347 -430 -27 824 -183 722 435 -79 640 731 38 854 -447 725 190 436 -1386
5046 -1386 -401 -462 952 189 443 635 608 540 -247 -549 426 360 251 450 313 502 -247 418 -134 -335 348
5067 348 -968 88 -186 -603 -487 712 -1245 -322 415 -599 449 648 178 113 379 -482 -661 -541
5085 -541 -498 -28 443 -859 -152 200 -650 -658 1176 745 -456 249 -338 -592 -624 952 168 513 133 -909
$$ packed form
4945b21L83P93k16q27l82J066m86l49K35K84m22M6O89n90l79R79p24j32m2K57
4965c8J70j52J61q00N29r5J32rN36N0p08K25Q76j226K7J007m81m14O33q28R16
4986E11l28k92l09P87K5m32m31M33M37k76K26Q8n20k30L96p25O83n30P74m84k32
5007d29l69J023j99l71R94p87J72j25O88q71O81o69J108r25J038j159j19l4o3
5026d16m1j0K23j03q3M03Q51j007R05k87n14P19R1o93Q16j301J172n35K46j822
5046a386R85o1J414p63K54J92k7o8p87l02R75o6j09J99j37J89p49O65n52k01O83
5067C48j316J056k74m17J16J199j957R23P37j014J048J99m70o5K66q61j79J20
5085e41M3M70M71j302P07L52q50qJ834m31j201P05n87k54l2J576p84L45l80j042
$$ plain form
5105 -909 -518 1069 26 -82 -953 -173 -963 273 2 446 -619 718 524 -440 844 -1248 89
5122 89 -93 823 68 -572 -270 885 204 314 85 141 388 -276 -496 -538 276 490 -295 97 393 265 -723
5143 -723 68 -558 491 405 328 350 -348 461 -171 438 1301 708 -598 -50 -338 -116 1132 491 -1066 -106
5163 -106 -711 -706 362 -146 493 747 -1193 -680 -68 -36 -174 -992 120 1416 -872 -87 -652 38 -1321
5182 -1321 425 -466 437 459 -938 25 -1473 -1133 -315 481 157 97 1384 445 -1103 741 448 -141
5200 -141 547 267 -1171 -432 -935 -310 -642 654 29 1142 784 -450 6 1411 -779 313 -113 -667
5218 -667 -394 623 436 40 -290 -642 1044 -360 339 -334 -172 468 680 -540 -567 -594 -76 406 300
5237 300 129 1301 -240 -1302 -957 -83 621 287 -413 -365 -366 17 -314 -548 1192 440 901 1251 228
$$ packed form
5105i09L91J587j043j08q71P80p90J236k71M44j065J337j94r64J284k092J337
5122H9j82R16p55o40L02J155o81J10k29N6K47o64k20m2Q14K14p85L92K96j28r88
5143g23P91o26J049q6p7K2o98Q09o32O09Q63n93j306N48k88K22J248o41j557R60
5163a06o05NJ068n08O39K54j940N13O12L2j38q18J112J296k288P85n65O90j359
5182a321J746q91R03K2j397R63j498L40Q18P96l24o0J287r39j548J844k93n89
5200a41O88k80j438P39n03O25l32J296o25J113l58j234M56J405k190J092m26n54
5218f67K73J017j87l96l30l52J686j404O99o73J62O40K12j220k7k7N18M82j06
5237C00j71J172j541j062L45Q74P04l34p00M8jL83l31k34J740p52M61L50j023
$$ plain form
5256 228 989 556 146 -68 -234 301 11 1705 -603 470 377 335 675 357 311 -269 60 755 340 1115
5276 1115 461 60 381 249 148 857 149 165 -71 914 118 -618 -970 -467 189 -41 -119 -719 116 57 -28
5297 -28 969 -472 -386 179 -119 -304 292 346 -735 -229 270 88 -689 287 273 -545 4 272 1223 -1403
5317 -1403 -245 513 1109 -92 -625 490 162 -137 29 -295 223 516 -560 -100 -604 -10 350 252 12
5336 12 395 -92 607 432 367 -298 -175 454 -278 -887 -109 -789 484 404 577 385 -263 91 -746 -696 94
5357 94 503 554 493 -1 811 331 488 613 -191 804 -114 32 339 -3 -238 51 980 491 -304 725 -562
5378 -562 -547 931 279 384 41 -123 610 722 53 -870 -400 311 105 463 -67 275 -330 237 -290 -903
5398 -903 -1151 185 681 -1029 -93 541 481 215 203 -16 -383 896 -10 -27 -496 -146 -319 801 -9 -40
$$ packed form
5256B28P61m33m10k14j66N35k90J694k308J073r3m2L40l18m6n80L29O95m15P75
5276A115o54m01L21j32j01P09p08J6k36R85p96p36l52N03O56k30p8o00Q35n9q5
5297b8R97j441Q6N65k98j85N96N4j081N06M99j82p77R76j4q18N49K68R51k626
5317a403J158P58N96j201n33J115l28k99J66l24N18K93j076M60n04N94L60r8k40
5336A2L83m87O99j75o5o65J23O29p32o09P78o80J273q0J73j92o48L54q37N0P90
5357I4M09N1o1m94Q12m80J57J25q04R95r18J46L07l42k35K89R29m89p95J029j287
5378e62J5J478o52J05l43j64P33J12o69r23M70P11k06L58n30L42o05N67n27o13
5398i03k48J336M96j710R36O34o0k66j2k19l67J279r06j7m69L50j73J120q10l1
$$ plain form
5418 -40 83 -608 130 -189 -224 -857 280 -377 -459 144 -259 -254 -359 -48 226 -153 930 -752 522 263
5438 263 249 3 -490 -295 665 326 -526 321 -311 998 -1047 -405 488 -568 -43 571 8 291 -85
5457 -85 39 445 382 -102 -826 -107 89 -573 -623 347 -133 450 -194 78 -184 361 171 -235 569 -185 75
5478 75 -400 78 808 -18 -235 101 233 -590 66 500 206 -166 691 282 -638 -167 -127 -844 57 248 -731
5499 -731 195 308 -338 1126 -290 103 93 24 -587 444 -924 -1109 387 -688 -156 417 -4 -210 327
5518 327 586 652 -315 -384 64 145 -694 -537 197 94 -523 387 646 81 1139 164 996 142 313 321 151
$$ packed form
5418d0J23o91P38l19l5o33J137o57q2O03m03Nj05L11K74l79J083j682J274k59
5438B63j4k46m93J95R60l39q52Q47o32J309k045O42Q93j056N25O14n63K83l76
5457h5J24M06o3m84p24P19J96o62n0R70m80N83o44K72k62N45j90m06Q04p54K60
5478G5m75M78P30q26k17L36J32q23O56M34k94l72Q57m09r20M71M0p17R01J91r79
5499g31R26J13o46J464j416L93j0o9o11J031j368j85J496j075N32N73m21k06N37
5518C27K59O6r67o9M48Q1q39J57P34j03o17R10K59n65J058r75Q32q54J71Qj70
$$ [...]
##END NTUPLES=NMR FID
##END=
