##TITLE=1H_Ser 6-6-V-4
 CDCl3
 8 sc, 
 30.06.2022
##JCAMPDX= 6.0         $$ Bruker NMR JCAMP-DX V2.0
##DATA TYPE= NMR FID
##DATA CLASS= NTUPLES
##ORIGIN= UXNMR, Bruker Analytische Messtechnik GmbH
##OWNER= root
$$ XWIN-NMR		Version 3.5
$$ Thu Jun 30 14:50:24 2022 Russian Standard Time (UT+4h)  she@DPX200
##.OBSERVE FREQUENCY= 200.1313499994
##.OBSERVE NUCLEUS= ^1H
##.DELAY= (6, 6)
##.ACQUISITION MODE= SIMULTANEOUS
##.ACQUISITION SCHEME= undefined
##.AVERAGES= 8
##.DIGITISER RES= 18
##SPECTROMETER/DATA SYSTEM= spect
##.PULSE SEQUENCE= zg30
##.SOLVENT NAME= CDCl3
##.SHIFT REFERENCE= (INTERNAL, CDCl3, 0, 15.7039)
##AUDIT TRAIL= $$ (NUMBER, WHEN, WHO, WHERE, WHAT)
$$ ##TITLE= Audit trail, XWIN-NMR		Version 3.5
$$ ##JCAMPDX= 5.01
$$ ##ORIGIN= Bruker BioSpin GmbH
$$ ##OWNER= she
$$ F:/spectra/data/she/nmr/H-F/1/audita.txt
$$ ##AUDIT TRAIL=  $$ (NUMBER, WHEN, WHO, WHERE, WHAT)
(   1,<2022-06-30 14:49:16.23 +0400>,<she>,<DPX200>,
      <created by zg, POWCHK disabled, PULCHK disabled
       configuration hash MD5:
       00 E9 B6 7A A2 85 ED C7 34 08 36 98 17 FE 4E 26
       data hash MD5: 16K
       DB 48 DE 53 11 55 D9 56 9B 2C D8 FA BB B1 3E 64>)
$$ ##END=
$$ 
$$ hash MD5
$$ BB 3D 7F 0B F5 DE 38 B1 5D E5 A2 3F 30 35 90 7D
##$RELAX= 
##$RELAX= 
##$RELAX= 
##$RELAX= 
##$RELAX= 
##$RELAX= 
$$ Bruker specific parameters
$$ --------------------------
##$DU= <F:/spectra>
##$EXPNO= 1
##$NAME= <H-F>
##$PROCNO= 1
##$TYPE= <nmr>
##$USER= <she>
##$AMP= (0..31)
100 100 100 100 100 100 100 100 100 100 100 100 100 100 100 100 100 100 
100 100 100 100 100 100 100 100 100 100 100 100 100 100 
##$AQSEQ= 0
##$AQ_mod= 1
##$AUNM= <au_zg>
##$AUTOPOS= <>
##$BF1= 200.13
##$BF2= 200.13
##$BF3= 200.13
##$BF4= 200.13
##$BF5= 200.13
##$BF6= 200.13
##$BF7= 200.13
##$BF8= 200.13
##$BYTORDA= 1
##$CFDGTYP= 0
##$CFRGTYP= 5
##$CHEMSTR= <none>
##$CNST= (0..31)
1 1 145 1 1 1 1 1 1 1 1 1 1 1 1 1 1 1 1 1 1 1 1 1 1 1 1 1 1 1 1 1 
##$CPDPRG= <>
##$CPDPRG1= <>
##$CPDPRG2= <>
##$CPDPRG3= <>
##$CPDPRG4= <mlev>
##$CPDPRG5= <mlev>
##$CPDPRG6= <mlev>
##$CPDPRG7= <mlev>
##$CPDPRG8= <mlev>
##$CPDPRGB= <>
##$CPDPRGT= <>
##$D= (0..31)
0 1.2 0 0 0 0 0 0 0 0.06 0 0.03 0 0 0 0 0.0002 0 0 0 0 0 0 0 0 0 0 0 0 
0 0 0 
##$DATE= 1656586155
##$DBL= (0..7)
120 120 120 120 120 120 120 120 
##$DBP= (0..7)
150 150 150 150 150 150 150 150 
##$DBP07= 0
##$DBPNAM0= <>
##$DBPNAM1= <>
##$DBPNAM2= <>
##$DBPNAM3= <>
##$DBPNAM4= <>
##$DBPNAM5= <>
##$DBPNAM6= <>
##$DBPNAM7= <>
##$DBPOAL= (0..7)
0.5 0.5 0.5 0.5 0.5 0.5 0.5 0.5 
##$DBPOFFS= (0..7)
0 0 0 0 0 0 0 0 
##$DE= 6
##$DECBNUC= <off>
##$DECIM= 32
##$DECNUC= <off>
##$DECSTAT= 4
##$DIGMOD= 1
##$DIGTYP= 9
##$DL= (0..7)
0 120 120 120 120 120 120 120 
##$DP= (0..7)
150 150 150 150 150 150 150 150 
##$DP07= 0
##$DPNAME0= <>
##$DPNAME1= <>
##$DPNAME2= <>
##$DPNAME3= <>
##$DPNAME4= <>
##$DPNAME5= <>
##$DPNAME6= <>
##$DPNAME7= <>
##$DPOAL= (0..7)
0.5 0.5 0.5 0.5 0.5 0.5 0.5 0.5 
##$DPOFFS= (0..7)
0 0 0 0 0 0 0 0 
##$DQDMODE= 0
##$DR= 18
##$DS= 0
##$DSLIST= <SSSSSSSSSSSSSSS>
$$ [...]
##$SUBNAM2= <"">
##$SUBNAM3= <"">
##$SUBNAM4= <"">
##$SUBNAM5= <"">
##$SUBNAM6= <"">
##$SUBNAM7= <"">
##$SUBNAM8= <"">
##$SUBNAM9= <"">
##$SW= 18.0517283424941
##$SWIBOX= (0..15)
0 0 2 0 0 0 0 0 0 0 0 0 0 0 0 0 
##$SW_h= 3612.71676300578
##$TD= 16384
##$TD0= 1
##$TE= 0
##$TE2= 300
##$TE3= 300
##$TEG= 300
##$TL= (0..7)
0 120 120 120 120 120 120 120 
##$TP= (0..7)
150 150 150 150 150 150 150 150 
##$TP07= 0
##$TPNAME0= <>
##$TPNAME1= <>
##$TPNAME2= <>
##$TPNAME3= <>
##$TPNAME4= <>
##$TPNAME5= <>
##$TPNAME6= <>
##$TPNAME7= <>
##$TPOAL= (0..7)
0.5 0.5 0.5 0.5 0.5 0.5 0.5 0.5 
##$TPOFFS= (0..7)
0 0 0 0 0 0 0 0 
##$TUNHIN= 0
##$TUNHOUT= 0
##$TUNXOUT= 0
##$USERA1= <user>
##$USERA2= <user>
##$USERA3= <user>
##$USERA4= <user>
##$USERA5= <user>
##$V9= 5
##$VALIST= <valist>
##$VCLIST= <CCCCCCCCCCCCCCC>
##$VD= 0
##$VDLIST= <DDDDDDDDDDDDDDD>
##$VPLIST= <PPPPPPPPPPPPPPP>
##$VTLIST= <TTTTTTTTTTTTTTT>
##$WBST= 1024
##$WBSW= 4
##$XGAIN= (0..3)
0 0 0 0 
##$XL= 0
##$YL= 0
##$YMAX_a= 183750
##$YMIN_a= -338484
##$ZGOPTNS= <>
##$ZL1= 120
##$ZL2= 120
##$ZL3= 120
##$ZL4= 120
##$ABSF1= 10
##$ABSF2= 0
##$ABSG= 5
##$ABSL= 3
##$ALPHA= 0
##$AQORDER= 0
##$ASSFAC= 0
##$ASSFACI= 0
##$ASSFACX= 0
##$ASSWID= 0
##$AUNMP= <proc_1d>
##$AZFE= 0.1
##$AZFW= 0.1
##$BCFW= 1
##$BC_mod= 2
##$BYTORDP= 1
##$COROFFS= 0
##$CY= 11.3945322036743
##$DATMOD= 1
##$DC= 2
##$DFILT= <>
##$DTYPP= 0
##$F1P= 2.36226072786647
##$F2P= -0.459571619588291
##$FCOR= 0.5
##$FTSIZE= 0
##$FT_mod= 4
##$GAMMA= 1
##$GB= 0.15
##$INTBC= 1
##$INTSCL= 1
##$ISEN= 128
##$LB= 0.24
##$LEV0= 0
##$LPBIN= 0
##$MAXI= 10000
##$MC2= 0
##$MEAN= 0
##$ME_mod= 0
##$MI= 1.114404
##$NCOEF= 0
##$NC_proc= 0
##$NLEV= 6
##$NOISF1= 3.799351
##$NOISF2= 2.8
##$NSP= 1
##$NTH_PI= 0
##$NZP= 0
##$OFFSET= 15.70392
##$PC= 1
##$PHC0= -18044.54
##$PHC1= 18.00069
##$PH_mod= 1
##$PKNL= yes
##$PPARMOD= 0
##$PSCAL= 0
##$PSIGN= 0
##$REVERSE= no
##$SF= 200.130013532006
##$SI= 16384
##$SIGF1= 3
##$SIGF2= 2
##$SINO= 400
##$SIOLD= 16384
##$SREGLST= <1H.CDCl3>
##$SSB= 0
##$STSI= 0
##$STSR= 0
##$SW_p= 3612.71676300578
##$SYMM= 0
##$S_DEV= 0
##$TDeff= 0
##$TDoff= 0
##$TI= <>
##$TILT= no
##$TM1= 0
##$TM2= 0
##$TOPLEV= 0
##$USERP1= <user>
##$USERP2= <user>
##$USERP3= <user>
##$USERP4= <user>
##$USERP5= <user>
##$WDW= 1
##$XDIM= 8192
##$YMAX_p= 0
##$YMIN_p= 0
$$ End of Bruker specific parameters
$$ ---------------------------------
##NTUPLES= NMR FID
##VAR_NAME=  TIME,          FID/REAL,        FID/IMAG
##SYMBOL=    X,             R,               I
##VAR_TYPE=  INDEPENDENT,   DEPENDENT,       DEPENDENT
##VAR_FORM=  AFFN,          ASDF,            ASDF
##VAR_DIM=   8192,          8192,            8192
##UNITS=     SECONDS,       ARBITRARY UNITS, ARBITRARY UNITS
##FACTOR=    0.0002768,     1,               1
##FIRST=     0,             0,               0
##LAST=      2.2672688,     0,               0
##MIN=       0,             -338484,         0
##MAX=       2.2672688,     183750,          0
$$ Real data points
##PAGE= N=1
##DATA TABLE= (X++(R..R)), XYDATA
$$ [...]
1831c40K74j98J98l97J00N68No75K64J17j29j10P49n88j94L56K2q9K48k32p1K04
$$ -340 -66 -264 -66 -463 -363 205 210 -465 -201 -84 -213 -323 426 -162 -356 0 22 -67 181 -51 -122 82
1853H2j81N0O5J08k90J92J76n62L82P0K9j51n2l20K86J72j25K11j25q5l14N08
$$ 82 -99 -49 16 124 -166 26 202 -360 22 92 121 -30 -82 -402 -116 56 -69 142 17 -68 -382 126
1875A26r1J97N5j11j31K13K04n42L96j15O9J13q9R2l31J88m76Q1M74m04J20R8
$$ 126 35 232 287 176 45 258 462 -80 316 201 270 383 294 386 55 243 -233 -152 322 -82 38 136
1897A36p02LM10O3k40L87l60J92r5K32n2M09k84j64KN20m21L12L55q79K65P5o7
$$ 136 -566 -563 -153 -90 -330 57 -303 -111 -206 26 -26 383 99 -65 -63 457 36 348 703 -176 89 164 97
1920I7J93J5p61K67r7J4K80M9r9k28M8K16l36K28K1l15L87N7p7J83K80n18q8M55
$$ 97 290 305 -456 -189 -286 -272 8 57 -42 -270 -222 -6 -342 -114 -93 -408 -21 36 -41 142 422 -96 -184 271
1944B71j63K06j88J48l23K57l75J91L05m23k17J61R0l08P7J92k23K8k7K53j35
$$ 271 108 314 126 274 -49 208 -167 24 329 -94 -311 -150 -60 -368 -291 -99 -322 -294 -321 -68 -203
1965b03J31K20ol55J69J82p2K91j49k03J27N6J19j50O0Rj98O0j07P3Q1L7q1j40
$$ -203 -72 148 142 -213 -44 138 66 357 208 5 132 188 307 157 217 226 28 88 -19 54 135 172 91 -49
1989d9J31L97q05L45j7o8J5P4l3Qj60j83L08K45J74m55k4P3j16o6N78l80n2K17
$$ -49 82 479 -326 19 2 -66 -51 23 -10 -2 -162 -345 -37 208 382 -73 -97 -24 -140 -206 372 -8 -60 157
2013A57k08J05L59K0m24q5L4Nj71L71j83l37L1K06j16K96r1k32J78M3j44K2L79
$$ 157 -51 54 413 433 9 -76 -42 -37 -208 163 -20 -357 -326 -120 -236 60 -31 -263 -85 -42 -186 -164 215
2036B15k46q1Q5K99l30K82K45k76l32M70l91L48j24j99J07L9j61L26O5j11m45
$$ 215 -31 -112 -27 272 -58 224 469 193 -139 331 -60 288 164 -35 72 111 -50 276 341 230 -215
2057b15j21K65k03OK66k33J55M9O1n9Q0P9l5j66L37j60J16N0P0m23L04j9N4O2
$$ -215 -336 -71 -274 -268 -2 -235 -80 -31 30 -29 51 130 95 -71 266 106 222 272 342 -81 223 204 258 320
2081C20q0j77l59L07j61QM60m92m22K98J00J95j76J75k14k20K54L53j77n3N3o3
$$ 320 240 63 -296 11 -150 -142 318 -174 -596 -298 -198 -3 -179 -4 -218 -438 -184 169 -8 -61 -8 -71
2103g1J32J00j04j9J70l77J75J76O5k68qJ49m88L21L34k87j54J50o8k23M02j47
$$ -71 61 161 57 38 208 -169 6 182 247 -21 -29 120 -368 -47 287 0 -154 -4 -72 -295 107 -40
2125d0M2L5j62k09K00M62j22k35qj77k6K71K80j34o7m6k43L98N5K74o02j20Q5
$$ -40 2 37 -125 -334 -134 328 206 -29 -37 -214 -240 31 311 177 110 64 -179 219 274 548 -54 -174 -89
2148h9K31j2M6n2k17K01k43J91j05O9k80n3j38j07M09M08k03j12K70m06r6P43
$$ -89 142 130 176 124 -93 108 -135 56 -49 20 -260 -313 -451 -558 -149 259 56 -56 214 -192 -288 455
2170D55L8m62r9K05o4M19j39l38j24ll7L30J69n79J89J23k56J58oJ57k95O2k34
$$ 455 493 31 -68 137 73 492 353 15 -109 -112 -149 181 350 -229 -40 83 -173 -15 -21 136 -159 -97 -331
2193c31n1K56K93k66p7l21J76L97j42J26q8R8r8J47P8q8M45l49k12K58r7K3l33
$$ -331 -382 -126 167 -99 -176 -497 -321 76 -66 60 -28 70 -28 119 197 109 554 205 -7 251 154 177 -156
2216a56R9k51m5J50L1M0o7q3o5L04O2J2K31j12l57M71K20l62K47j04k79j11P81
$$ -156 -57 -308 -353 -203 -172 -132 -199 -282 -347 -43 19 31 262 150 -207 264 484 122 369 265 -14 -125 656
2239F56m11J1O2n99N4L31K23l48P9j75l20J09M76m01J53J51l28K1K44j43J99l53
$$ 656 245 256 318 -281 -227 104 327 -21 58 -117 -437 -328 148 -253 -100 51 -277 -256 -12 -155 44 -309
2261c09L55l40M85j59J51l0j16k56J03M70q4J54l84j67K38j30J53R7j5n51M2K46
$$ -309 46 -294 191 32 183 153 37 -219 -116 354 270 424 40 -127 111 -19 134 231 216 -335 -293 -47
2283d7k96K78n4N3k29k4K20K07o2k49l8R7J18l1M37k8o18K39p4J75J73j36j24
$$ -47 -343 -65 -119 -66 -295 -319 -99 108 46 -203 -241 -144 -26 -57 380 352 -266 -27 -101 74 247 111 -13
2306a3k37J13j5M17j47n44J77n9O8%N36m58r2J7K34l2M28m47kL30n1k50L02p7
$$ -13 -250 -137 -152 265 118 -426 -249 -308 -240 -240 296 -162 -254 -237 -3 -35 393 -54 -56 274 223 -27 275 198
2330A98m55L16J08j68M36P3k93k28J97m30QO06j93j76p8k1j00L52mK02l26J1l04
$$ 198 -257 59 167 -1 435 508 215 -13 184 -246 -238 368 175 -1 -79 -100 -200 152 148 350 24 35 -269
2353b69K74J32l66l4J16n2J64K16j92k23M72n37K39K19q9j13j6L2k17K53J08r9
$$ -269 5 137 -229 -263 -147 -199 -35 181 -11 -234 238 -299 -60 159 70 -43 -59 -27 -244 9 117 18
2375A8J36m77j7L40o0k06L92J42o82K33K72j36J42K6m90J73J44J49j03L42l31
$$ 18 154 -323 -340 0 -60 -266 126 268 -414 -181 91 -45 97 123 -367 -194 -50 99 -4 338 7
2396Gj12K09L4j27J75R4n67K20J60j9m0J08m60L02k13J15P4J43l78j22K32r6K60
$$ 7 -105 104 138 11 186 280 -287 -67 93 74 34 142 -318 -16 -229 -114 -40 103 -275 -397 -165 -261 -1
2419aJ60j63j79j2J88m4J01j40k43M28q7j34K88J60m89k1L98j50K05n5ok40j22
$$ -1 159 -4 -183 -195 -7 -51 50 -90 -333 95 8 -126 162 322 -167 -188 210 60 265 210 204 -36 -158
2442a58J53r9L80m86J46Q3l59K2K88K13J1j64Rj50K13L21k36j77J46j02J32J56
$$ -158 -5 -104 276 -210 -64 19 -340 -318 -30 183 194 30 39 -111 102 423 187 10 156 54 186 342
2464C42j24r8K9j92J99M6j29j95J41j02j51K53N4J11l78O4J56k63K22q3P8j44
$$ 342 218 120 149 -43 156 202 73 -122 19 -83 -234 19 73 184 -194 -130 26 -237 -15 -98 -20 -164
2486a64k44L44J89l13L76j83m03K62L48j49J22k01j38k47M68Pr4o4o0k85L40J9
$$ -164 -408 -64 125 -188 188 5 -398 -136 212 63 185 -16 -154 -401 67 74 -20 -84 -144 -429 -89 -70
2508g0K23l97K44k80j52N92l22J10J47r6k46L35N8j47o8m2p0M83k95n7K50Rl22
$$ -70 153 -244 0 -280 -432 160 -162 -52 95 -1 -247 88 146 -1 -69 -111 -181 302 7 -50 200 209 -113
2531a13O5J02L0R5l13M6K99p5m0p9k01N5O7L9j26J10L16m91l03J53J70K17J62
$$ -113 -48 54 84 179 -134 -88 211 136 96 17 -184 -129 -62 -23 -149 -39 277 -214 -517 -364 -194 23 185
2554A85k40k5j91K78j69M78Nk66r4J22j60K53L17m93j66P2K01l48L41j54l9L6
$$ 185 -55 -80 -271 7 -162 316 321 55 -39 83 -77 176 493 0 -166 -94 107 -241 100 -54 -93 -57
2576e7L9l09L59K21n87N9K72k08L24J55n5j76p4J62K97n2j90k32N8P0N9k28K07
$$ -57 -18 -327 32 253 -334 -275 -3 -211 113 268 213 37 -37 125 422 370 180 -52 6 76 135 -93 114
2599A14J12l76j33L42j03o7j16P7K5l0K20l69L64n4l82K89Q1J26p6j19N1nk46
$$ 114 226 -150 -283 59 -44 -111 -227 -150 -125 -155 65 -304 60 6 -376 -87 -6 120 44 -75 -24 -29 -275
2622b75M67M5m0K4k72N7J05J6j34kn8J07k05K2J38R0k74j26j27M21j50p8L26j51
$$ -275 192 237 197 221 -51 6 111 127 -7 -9 -67 40 -165 -143 -5 85 -189 -315 -442 -21 -171 -249 77 -74
2646g4M8J31j15k4jJ85p3K4M2k10K36j52k3L1O2K82l94K8J33m85L46J00k51K69
$$ -74 -26 105 -10 -34 -35 150 77 101 143 -67 169 17 -6 25 87 369 -25 3 136 -349 -3 97 -154 115
2670A15n7k3j76L13j07k6l01R4j93L03N5l9p4r2J71j53K90J38n0l1k13k7K6L21
$$ 115 58 35 -141 172 65 39 -262 -168 -361 -58 -3 -42 -116 -208 -37 -190 100 238 188 157 -56 -83 -57 264
2694B64L7k91J02mj69j2K70J29l32j09R6l8j14m4J49j65L20R6k69J82j70o2M2
$$ 264 301 10 112 108 -61 -73 197 326 -6 -115 -19 -57 -171 -215 -66 -231 89 185 -84 98 -72 -134 -92
2717i2N5o5J97j0m25L87r0l7J50m1rk39K21J87k01K72k25j88J90J24j68M4K80
$$ -92 -37 -102 95 85 -340 47 -43 -80 70 29 20 -219 2 189 -12 260 35 -153 37 161 -7 37 317
2740C17l07l42Q0K03l7J48k07l4R1L0P9K3j19K44j42j44R6p7K36J67j39k69J16
$$ 317 10 -332 -252 -49 -86 62 -145 -179 -88 -58 21 44 -75 169 27 -117 -21 -98 138 305 166 -103 13
2763A3k43K90j65M7j03Ml4J30K56l68L9j56M12R0M9l45K01o1j75P8K09k04jJ26
$$ 13 -230 60 -105 -58 -161 -157 -191 -61 195 -173 -134 -290 122 212 261 -84 117 56 -119 -41 168 -36 -37 89
2787H9P5Q7J73j52k28K15m23kJ97k1j91L4J82o2N7M1m5j81P8K78m23K28q8P5M5
$$ 89 164 251 424 272 44 259 -164 -166 31 10 -181 -147 35 -27 30 71 26 -155 -77 201 -222 6 -82 -7 38
2812C8l2p4K31M2l87L12j67j0K68k82K02k8Q6m68L81k58K45n9J77k42o8L4K39
$$ 38 6 -68 163 205 -182 130 -37 -47 221 -61 141 113 199 -269 112 -146 99 40 217 -25 -93 -59 180
2835A80l32K40k24R6m5j89K66J18j52j66N04k51P0J49l41l04O40k09k1j12L52
$$ 180 -152 88 -136 -40 -85 -274 -8 110 -42 -208 296 45 115 264 -77 -381 259 50 29 -83 269
2856B69o12K90n7J99l4J11l37M1K95N5m44J61K60l06n1j71M46l33K38j4Q8j50
$$ 269 -343 -53 -110 89 55 166 -171 -130 165 220 -224 -63 197 -109 -160 -331 115 -218 20 6 94 -56
2878e6o5L91k75j95K11m2K4r5K40j83m0K92j56j87jp9J65j25L07k39N4n3N4J61
$$ -56 -121 270 -5 -200 11 -31 -7 -102 138 -45 -85 207 51 -136 -137 -216 -51 -176 131 -108 -54 -107 -53 108
2902A08l40J63NO1L6j57L45l38J81q5Q4j74J06k8M9L06k41K1q5J00k63O38j79
$$ 108 -232 -69 -64 -3 33 -124 221 -117 64 -21 63 -111 -5 -33 16 322 81 102 17 117 -146 492 313
2925C13m15K51k62Q8J21l08P1K47k40o0J70j42K54j97l9M13k24j8Mm5j8K18r1
$$ 313 -102 149 -113 -25 96 -212 -141 106 -134 -194 -24 -166 88 -109 -148 265 41 23 27 -18 -36 182 91
2948I1j02Q7n6j04P2k2K13O5j82J01j67J4n7J37n1k94L87O3l37J24r5J73n4k0
$$ 91 -11 76 20 -84 -12 -34 179 244 62 163 -4 10 -47 90 39 -255 132 195 -142 -18 -113 60 6 -14
2972a4lj40J12k3J09N5r6J03l5k8M0r7k70L13k3N2%L5l04J95J29j94J48r4n1n6
$$ -14 -17 -157 -45 -68 41 96 0 103 68 40 80 -17 -287 26 3 55 55 90 -214 -19 110 -84 64 -30 -81 -137
2998a37L29k56k10M07l9j54K66j82J2J41%o7k6J25J3L3k20k90L67j31r3j73J87
$$ -137 192 -64 -274 133 94 -60 206 24 36 177 177 110 84 209 222 255 35 -255 112 -19 -112 -285 -98
3021i8j52L36m8J39r9k31L83j01k31J47k01N8k0mO1J5n1J84K7J7j36j92M20k61
$$ -98 -250 86 38 177 78 -153 230 129 -102 45 -156 -98 -118 -122 -61 -46 -97 87 114 131 -5 -197 223 -38
3045c8O0J02m4Rl04M48J1k14nJ04j59j2R8J27j66J67q6O8k55J4j86k9K16M1J27
$$ -38 22 124 80 89 -215 233 244 30 25 129 -30 -42 56 183 17 184 98 166 -89 -75 -261 -290 -74 -33 94
3070I4j41K3lN7j8J2P4q7l22K63K94j57k79J86r9M7k9O8j62K36j23m1K11j2k42
$$ 94 -47 -24 -27 30 12 24 98 11 -311 -48 246 89 -190 -4 -103 -56 -85 -17 -179 57 -66 -107 104 92 -150
3095a50K7L33j42k40m3K05K80j79J15k55k5r9L70q5j39K4J92m40M82l15M9j34
$$ -150 -123 210 68 -172 -215 -10 270 91 206 -49 -74 -173 197 112 -27 -3 189 -251 231 -84 -35 -169
3117a69K71n9k90J91r5J85M7j59Lj01K58p0P8jl39K91J43k94j2K48k59N9L71m12
$$ -169 102 43 -247 -56 -151 34 81 -78 -75 -176 82 12 90 89 -250 41 184 -110 -122 126 -133 -74 297 -115
3141a15J55MJ8L09l70K72k70M6j46j00K17O6q5j09J73j00l5QJ57k69J70J21j59
$$ -115 40 44 62 371 1 273 3 49 -97 -197 20 86 1 -108 65 -35 -70 -62 95 -174 -4 117 -42
3164d2j12n4J82l1J43j05J14j10L5r0k1J48PJ2L1M6m26K43K2J6l5k7p5j3L90k61
$$ -42 -154 -208 -26 -57 86 -19 95 -15 20 -70 -91 57 64 76 107 153 -273 -30 -8 8 -27 -54 -129 -142 248 -13
3190a3J0j87J25k6n2N9R3j49K31P6k32JQ2J02J68j78q4j04J61L3l1j35p1J80r4
$$ -13 -3 -190 -65 -91 -143 -84 9 -140 91 167 -65 -64 18 120 288 110 26 -78 83 116 85 -50 -121 59 -35
3215c5R5q2j03K24j98K44j48k9o7L13m1l6l0q4j7K4r3j67J45R4M1k48J84J21k18
$$ -35 60 -22 -125 99 -99 145 -3 -32 -99 214 173 137 107 23 6 30 -63 -230 -85 9 50 -198 -14 107 -111
3240a11K08N8l1j63m8j7O1J73q0j66J06j06K76k82J22l9K29k00j46K81j21J18
$$ -111 97 155 124 -39 -87 -104 -43 130 50 -116 -10 -116 160 -122 0 -39 190 -10 -156 125 4 122
3262A22n5jO3k16J26O6j05k08J74J87l07L49r8M2Q8p2k53K13o9J01k52K27q2j60
$$ 122 67 66 129 -87 39 105 0 -208 -34 153 -154 195 97 139 227 155 -98 115 46 147 -105 122 40 -120
3286a20O0Q9j26J25m3J3Q7j80J1N9L01j37j98Q9Q4k22m6M19Rk67P9l2K19k53j62
$$ -120 -60 29 -97 28 -15 -2 85 -95 -84 -25 276 139 -59 30 114 -108 -154 265 274 7 86 54 273 20 -142
3311a42P4J41N9j34J75k48j75q1K54k2J03o2j27k9P1k9m7L14j29J67j67O0r9J65
$$ -142 -68 73 132 -2 173 -75 -250 -331 -77 -99 4 -58 -185 -214 -143 -172 -219 95 -34 133 -34 26 -73 92
3335I2j86j10K53K3j12n0K77k88P2n9J07j0k9J31o7l1ol0L2j17R8q3j00J63jJ62
$$ 92 -94 -204 49 72 -40 -90 187 -101 -29 -88 19 9 -20 111 44 13 7 -23 9 -108 -10 -93 -193 -30 -31 131
3361A31j0r3p7N7M2M8q4J55k1k23L8j3N6j6Q3o1n6J51m62M16j47J25L6lj87J1
$$ 131 121 28 -49 8 50 98 14 169 148 -75 -37 -50 6 -10 73 12 -44 107 -355 61 -86 39 75 72 -115 -104
3387a04K40kk84L99l60j33K09l2J9K27l06L11j97J27J9k96K28m9J30K8k07QR2
$$ -104 136 134 -150 249 -111 -244 -35 -67 -48 179 -127 184 -13 114 133 -163 65 16 146 174 -33 -25 67
3410F7M4k37J13N8KLk24J25j03J88O7j66Q3N9l36J97Q9p4K9J38j69J03j1j09j1
$$ 67 111 -126 -13 45 47 50 -174 -49 -152 36 103 -63 20 79 -257 -60 29 -45 -16 122 -47 56 45 -64 -75
3435g5J9o7J02k10J43K83o6j89q7O2M2q1M6j48L09J32l64K39j47j06L15k65K17
$$ -75 -56 -123 -21 -231 -88 195 129 -60 -147 -85 -43 -124 -78 -226 83 215 -149 90 -57 -163 152 -113 104
3458A04J48m70L94m0j21j43J33J15j36M4j12j63J51K07Oj21p3J07j42K55n0K3
$$ 104 252 -218 176 136 15 -128 5 120 -16 28 -84 -247 -96 111 117 -4 -77 30 -112 143 93 116
3480A16q9l34J45K63j56j26Q9R8j68j36J57J38m6j61N3J42L9ON4M4m1p3k5p8p2
$$ 116 27 -307 -162 101 -55 -181 -92 6 -162 -298 -141 -3 -49 -210 -157 -15 24 30 84 128 87 14 -11 -89 -161
3505a61Q6P6o8Q9J67k05J95J17k41k04k1J08O0K3k44M8L16k87J17J36q7j17J44
$$ -161 -75 1 -67 22 189 -16 179 296 55 -149 -170 -62 -2 21 -223 -175 141 -146 -29 107 20 -97 47
3528D7J7j36L47j41k56m8J71L9N0p3n4k15N07m02J90J0k30J44r2L93j40j47J03
$$ 47 64 -72 275 134 -122 -170 1 40 90 17 -37 -252 255 -147 43 53 -177 -33 -125 268 128 -19 84
3551H4l0j59L7NJ65nJ6j11K15l50O5J93p8q8J68Q4k13j52K1K42j08K86l52J89
$$ 84 54 -105 -68 -63 102 97 113 2 217 -133 -68 125 47 -41 127 211 -2 -154 -133 109 1 287 -65 124
3575A24J39l20J24l40K28J38r4j28m5K72k0M1j78k31N6M19k46K53j76j9r4J90
$$ 124 263 -57 67 -273 -45 93 -1 -129 -174 98 78 119 -59 -290 -234 185 -61 192 16 -3 -97 93
3597I3n6J13j34J88k02L16k91n2J01O3k87J31o1L17j96k73L11j30J72k7m25L87
$$ 93 37 150 16 204 2 318 27 -25 76 139 -148 -17 -78 239 43 -230 81 -49 123 96 -329 58
3619E8Q6l39L49r5k39L52j40j85K00o7j7J31j31N4jr5K71o5k67K87q4j40k7M30
$$ 58 144 -195 154 59 -180 172 32 -153 47 -20 -37 94 -37 17 16 -79 192 127 -140 147 63 -77 -104 326
3643C26n18K17Q8l46J14o4J42K13n51O70k54m2K10l5o4j98n0J97P8j96l8P3R2
$$ 326 -192 25 113 -233 -119 -183 -41 172 -379 291 37 -5 205 170 106 -92 -142 55 133 -63 -101 -28 64
3666F4OK4q1p2K03l46oK44j53K14k07p6J22J18L8m8J20j86K7p5n1K8J80k3n6n0
$$ 64 70 94 13 -59 144 -202 -208 36 -117 97 -110 -186 -64 54 92 44 164 -22 5 -70 -121 -93 87 64 8 -42
3692d2K62%k10l1M0J29j40M4N6k80J70jOJ65j83O4N0p0l35L83m25L22R4k54J21
$$ -42 220 220 10 -21 19 148 8 52 108 -172 -2 -3 3 168 -15 49 99 29 -306 77 -348 -26 68 -186 -65
3717f5k8L6n8k88L47J54j04j04J65K54j55P5j93q6L0N0j8j69J20J51k9J09k91
$$ -65 -93 -57 -115 -403 -56 98 -6 -110 55 309 154 229 36 -50 -20 30 12 -157 -37 114 85 194 -97
3740i7O0j36j6K8J72j83K80j21J01n6J50l9j63J70j84N4L8j81O7l0J75l8j65O
$$ -97 -37 -173 -189 -161 11 -172 108 -13 88 32 182 143 -20 150 -34 20 58 -123 -56 -86 89 51 -114 -108
3764a08J06PM33n81J13J35k73L83l69O1J81j18r8J64p4J64j52L2kr8p4K43j74
$$ -108 -2 5 438 -143 -30 105 -168 215 -154 -93 88 -30 -128 36 -38 126 -26 6 4 -94 -168 75 -99
3787i9L87j35j67k14K16rO3k88K50J00o3L4j98k2R5J65K8j43K5K8l62NJ47K87
$$ -99 288 153 -14 -228 -12 -21 42 -246 4 104 41 75 -123 -145 -50 115 143 0 25 53 -309 -304 -157 130
3811A30j05j80J98j83K71k40K71j88J55p3Q0j07Lj4r1K06l05j19N32j23j07p2
$$ 130 25 -155 43 -140 131 -109 162 -26 129 56 136 29 32 18 -73 133 -172 -291 241 118 11 -61
3833f1L36l38j32J31J19j02j74J64J16q9J69k70j00O1j24N6L19J03j48J12o6o6
$$ -61 275 -63 -195 -64 55 -47 -221 -57 59 -30 139 -131 -231 -170 -294 -238 81 184 36 148 82 16
3855A6R8MN4p5o5j43J06J6L2Pm2K10j36j24k7J63P2j67J06j43K91j28k44N6K30
$$ 16 114 118 172 97 32 -111 -5 11 43 50 8 218 82 -42 -69 94 166 -1 105 -38 253 125 -119 -63 167
3880A67k74J06P9j04J33Mj75J65j20k78J96N8R4l7J35j35j5J34Lj72J79k97QK09
$$ 167 -107 -1 78 -26 107 111 -64 101 -19 -297 -101 -43 51 14 149 14 -1 133 136 -36 143 -154 -146 63
3904F3j55K23j97M5r0Q5K5MoJ6j79J63j18J39L6j51J34J84l76J48m2J00k84L10
$$ 63 -92 131 -66 -21 -111 -26 -1 3 -3 13 -166 -3 -121 18 54 -97 37 221 -155 -7 -49 51 -233 77
3928G7q6r6K41j79J8L0J01j05M8J02O0m93J10Q8J91K6j77n5J44k52L65k58k9K01
$$ 77 -9 -105 136 -43 -25 5 106 1 49 151 211 -282 -172 -84 107 133 -44 -99 45 -207 158 -100 -129 72
3952G2k20J95n2J52J5P2n1L1l24J89k21K56j11J90J9N9k74qKo0K37k17R8j35J55
$$ 72 -148 47 -5 147 162 234 183 214 -110 79 -142 114 3 193 212 271 -3 -11 -9 -69 168 -49 49 -86 69
3977F9j10P6j79M35l44J89k72N08q1j22o3l38J69K57l89K77K10m42K28N4j72k48
$$ 69 -41 35 -144 291 -53 136 -136 372 291 169 106 -232 -63 194 -195 82 292 -150 78 132 -40 -288
3999b88M43k37K30k00L6KP1J9M2j86m7J93j9n9p3P9j45j2L45j46k37J96r8q3J48
$$ -288 155 -82 148 -52 -16 -14 57 76 118 -68 -115 78 59 0 -73 6 -139 -151 194 48 -189 7 -91 -174 -26
4024b6p0R1o7L21m9k39K99k49l7J61k11M2L3j25L78k17k75K47j72J75l8r9J60
$$ -26 -96 -5 -72 249 200 -39 260 11 -26 135 -76 -34 -1 -126 252 35 -240 7 -165 10 -28 -127 33
4047C3J1L3r8n1J85l14K2K3L6k4K5K83o7q3p7j05O5j22J79p7K26l25J27O1P2J53
$$ 33 44 77 -21 -72 113 -201 -179 -156 -120 -144 -119 164 97 14 -63 -168 -103 -225 -46 -123 103 -222 -95 -34 38 191
4073A91k65l7K13j06J69n9j46k2J03L7J74k71J2l1J39k6k49o3K80k4j30J8L9J86
$$ 191 -74 -111 102 -4 165 106 -40 -62 41 78 252 -19 -7 -38 101 75 -174 -237 43 19 -111 -93 -54 132
4097A32m4k44K43j06j30n3K89j87OP9q7K07J95n70L53j61PL32l17K15j49j4l5
$$ 132 88 -156 87 -19 -149 -202 87 -100 -94 -15 -102 105 300 -270 83 -78 -71 261 -56 159 10 -4 -39
4120c9J18K8j7k05K73j34m3p4Q7N7j49K20m9N3j79j35J62M4N4n3R5J57l89K21
$$ -39 79 107 90 -115 158 24 -19 -93 -6 51 -98 122 73 126 -53 -188 -26 18 72 19 114 271 -118 103
4144A03J24o2j36J39j34J09j45J50J80l26N6k45J99j12J47m8p7Q2J77k00j70J89
$$ 103 227 165 29 168 34 143 -2 148 328 2 58 -187 12 -100 47 -1 -78 4 181 -19 -189 0
4166@J50j33J77P6l18R5J43j83p5K31j75J8J54J22l68j61J68P7j82K38j90K86
$$ 0 150 17 194 270 -48 47 190 7 -68 163 -12 6 160 282 -86 -247 -79 -2 -184 54 -136 150
4188A50p3k66L03o5l26K53J62Q9m23J80J36l2j29j05L62p4q0j34J45m4J27j83
$$ 150 77 -189 114 49 -277 -24 138 227 -196 -16 120 88 -41 -146 216 142 62 -72 73 29 156 -27
4210b7L81m58q2J27K22J69k54k16Q4Q7k03P9K14k73j46K74J56k08J05Oq3o3M4
$$ -27 354 -104 -186 -59 163 332 78 -138 -54 33 -170 -91 123 -150 -296 -22 134 -74 31 37 -46 -109 -65
4233f5j31K07l9R4k26N26l36j41k2J12J76j80p6L6n0K23p0M9K1l49O4J00l3J81
$$ -65 -196 11 -28 66 -160 366 30 -111 -133 -21 155 -25 -101 -65 -115 108 38 87 108 -241 -177 -77 -110 71
4257G1k83J90J31p4K44j69J60j80k85N0K24j22J04K46k84J54j81j4j09j4J23j83
$$ 71 -212 -22 109 35 279 110 270 90 -195 -145 79 -43 61 307 23 177 -4 -18 -127 -141 -18 -201
4279b01K08r1J69k06J95j69J99j95J77J2j54n3r0K77k6k06K66j24k6J76j20k19
$$ -201 7 -84 85 -121 74 -95 104 -91 86 98 -56 -109 -199 78 52 -154 112 -12 -38 138 18 -201
4301b01L32j60R5R6j65J29l10J30Q0M1K18l41%J21k24L3m1K37K59m85L79l58J15
$$ -201 131 -29 66 162 -3 126 -184 -54 26 67 285 -56 -56 65 -159 -126 -167 70 329 -156 223 -135 -20
4324b0J7j39L13M9l46r1L04q4N2j3J5M6K00j20j22J08l08m4L92o7k87M3N1J10
$$ -20 -3 -142 171 220 -126 -217 87 3 55 42 57 103 303 183 61 169 -139 -183 209 142 -145 -102 -51 59
4348E9k46M28n51L78P1j81PPj19j8k1J15L0j67J04L4p2J30q8j8K69k70R1J83n9
$$ 59 -187 241 -310 68 139 -42 -35 -28 -147 -165 -186 -71 -41 -208 -104 -70 -142 -12 -100 -118 151 -119 -28 155 96
4373I6j63l03L57o3j85J46NL24j2o9j38n7J47k49P4O4p8K50l48M06j70K7J46j99
$$ 96 -67 -370 -13 -76 -261 -115 -110 214 202 133 -5 -62 85 -164 -90 -26 -104 146 -202 204 34 61 207 8
4397Hr1n6K67J3k55Q8j44J90l41L89qm1R2k96J50J36N7j14RL4j28P1L2q5N4r9
$$ 8 -83 -139 128 141 -114 -26 -170 20 -321 68 60 19 111 -185 -35 101 158 44 53 87 -41 30 62 -23 31 -68
4423f8K79k58m8l5J45J21Q5j64j81J81k05Q9j82L11j7j74P0K23k72J46k6J90j99
$$ -68 211 -47 -95 -130 15 136 221 57 -124 57 -148 -59 -241 70 53 -121 -51 172 -100 46 20 210 11
4446A1K1q6o2J22j28N5k0K46q8K7J8l54K60j4Q0M1k10K72k08m7j47N05l73l0J71
$$ 11 32 -54 -116 6 -122 -67 -87 159 71 98 116 -238 22 8 88 129 -81 191 -17 -64 -211 294 -79 -109 62
4471F2j00l8O9O4N5J8k1m17L53m1L28k32q7m1j07K48j95J77n3j9q1m5O3p0J14
$$ 62 -38 -76 -7 57 112 130 109 -308 45 4 332 100 13 -28 -135 113 -82 95 42 23 -58 -103 -40 -110 4
4496DK50m36J47J29j12MlP1Op5O3l06J25J85j5k12J29j26J1L20l13m0L05l84R1
$$ 4 254 -182 -35 94 -18 -14 -17 54 60 -15 48 -258 -133 52 37 -175 -46 -172 -161 159 -154 -194 111 -273 -182
4521a82j00M31J8o7pk08M6P5J4j77K31j13j69K78j50p8K30r4J73n5k64K57l6O0
$$ -182 -282 149 167 100 93 -115 -69 6 20 -157 74 -39 -208 70 -80 -158 72 -22 151 96 -168 89 53 113
4545A13J0l3k93L3J85n7J24K7r1K8q5J78k69K06P4L4l84J38J22j10L08j18j21
$$ 113 123 90 -203 -170 15 -42 82 109 18 46 -39 139 -130 76 150 184 -200 -62 60 -50 258 140 19
4568A9j1N6Q0l41J63L2J60p8j69K51j38Mp2k5j9j16J67O7l3m6J44j87M47j82j98
$$ 19 8 64 144 -197 -34 -2 158 80 -89 162 24 28 -44 -69 -88 -204 -37 30 -3 -49 95 -92 355 173 -25
4593b5o4P1K1L9K5l32K35n0N0o0J68k48L40K3Ok18J70l41N3q8K32J31j42k2Q0
$$ -25 -89 -18 3 42 67 -265 -30 -80 -30 -90 78 -170 170 193 199 -19 151 -190 -137 -225 7 138 -4 -26 54
4618E4m2pl0l4m9m4N5J1j60M00m6k93J90j00Q6J91%j6k51J85l01M52j10m2k22
$$ 54 12 5 -25 -59 -108 -152 -97 -86 -246 154 108 -185 5 -95 -9 182 182 166 -85 100 -201 251 141 99 -123
4643a23J04jj6J54j02j65no0J77j05j61M62k20K91n20L09n7J30k36K35p4L4n5
$$ -123 -19 -20 -36 118 16 -149 -154 -214 -37 -142 -303 159 -61 230 -290 19 -38 92 -144 91 17 51 -4
4666dJ32j01j17p5J38J12K6j43J26k0k92k4K0J58Q9m6j66j2O8K72j40k40M24k00
$$ -4 128 27 -90 -165 -27 85 111 -32 94 74 -218 -242 -222 -64 25 -21 -187 -199 -131 141 1 -239 185 -15
4690a5m3J63P5n8j87L7k01K67k95M56l8l65o8L96j10k5R4J28m06K08j62J38J04
$$ -15 -58 105 180 122 -65 -28 -229 38 -257 199 161 -204 -272 124 14 -11 83 211 -195 13 -149 -11 93
4713I3j71K04j92P7P5j30q2o3L4L72j01k98J27O6j78K60k3j98L32P3k24l1J75
$$ 93 -78 126 -66 11 86 -44 -126 -189 -155 217 116 -182 -55 11 -167 93 70 -128 204 277 53 22 197
4736A97k62j15K76lk40J4K97j32j03j0J12Kl71M54j99O1j84J00J30J08l27O6O4
$$ 197 -65 -180 96 93 -147 -133 164 32 -71 -81 31 33 -338 116 -83 -22 -206 -106 24 132 -195 -129 -65
4759f5J0O1J79L0j45j26J13j17J55N9k7r5j02K5j12p9M00l07K47n0L9J9j3j26
$$ -65 -55 6 185 215 70 -56 57 -60 95 154 127 32 -70 -45 -157 -236 164 -143 104 54 93 112 99 -27
4783b7j19jK47j39m4N0M9L5j68J47q0K07k79L4K4k03l7L53k14J94o3J10j26J24
$$ -27 -146 -147 100 -39 -83 -33 16 51 -117 30 -50 157 -122 -88 -64 -267 -304 49 -165 29 -34 76 -50 74
4807G4m1MO5l1p8L0J67n7j31o9j27J52K14j02J7J8J08k97o4K44l00K48K48l56
$$ 74 33 37 102 71 -7 23 190 133 2 -67 -194 -42 172 70 87 105 213 -84 -148 96 -204 44 292 -64
4831f4K16j91J3l7L02j91p6P9J85m26J17o8J20n1J80l74L27j07p4J25Q1j40l1
$$ -64 152 -39 -26 -63 239 48 -28 51 236 -190 -73 -141 -21 -72 108 -266 61 -46 -120 5 86 -54 -85
4854h5Q2J84r3k2j12M1J46j33P6L9l14P5K01j75lJ45M3m9j17q6J98k81L97j12
$$ -85 -3 181 88 66 -46 -5 141 8 84 123 -191 -116 85 -90 -93 52 95 46 -71 -157 41 -240 157 45
4878D5K3k1Rm24K56j13L14k6r6N0O9j61K64j56j90m3K85j76q4K66J24k91R5O8
$$ 45 68 47 56 -368 -112 -225 89 63 -33 17 86 -75 189 33 -157 -200 85 -91 -175 91 215 -76 19 87
4902H7O2ok33K57k74O7J24k20K62p6JP7n3k69K04j00J02r3K92j72j08J78k92J52
$$ 87 149 143 -90 167 -107 -40 84 -136 126 50 51 128 75 -194 10 -90 12 -81 211 39 -69 109 -183 -31
4926c1p5R9K11j74m0j21J59j11Q7J3k24J65J84k21j94L02J30J21l64M6M2k19K66
$$ -31 -106 -7 204 30 -10 -131 28 -83 4 17 -207 -42 142 -79 -273 29 159 280 -84 -38 4 -215 51
4949E1k57J64J17j76K2J5R8M6k25K61Q2j58Q0k51J02J6r%lj1J54k93l2K53n8J19
$$ 51 -206 -42 75 -101 -79 -64 34 80 -145 116 198 40 120 -131 -29 -13 -22 -22 -25 -36 118 -175 -207 46 -12 107
4975A07j40lL4J11l72L98j84OK32j02j71m9N07j09q6q6j73P1N4R3j85n4J32m19
$$ 107 -33 -36 -2 109 -263 135 -49 -43 189 87 -84 -133 374 265 179 93 -80 -9 45 138 -47 -101 31 -388
4999c88N43o3k81J60r0J98k5j53J00Kl0j9J15J05J3L3k96K35n7p3l9j08J86J25
$$ -388 155 92 -189 -29 -119 79 54 -99 1 3 -27 -46 69 174 187 220 -76 159 102 29 -10 -118 68 193
5023A93j23J93j47j51O8j25K42j81l5q7K29l40L25l76K59K09j13m8Q3P3k01N5
$$ 193 70 263 116 -35 33 -92 150 -31 -66 -153 76 -264 61 -315 -56 153 40 -8 75 148 -53 2
5045BR8j33m5P5J7j42K50k31J6L05j73j5l63N00k40m9J89r0J74j05q5j94K93j49
$$ 2 100 -33 -78 -3 14 -128 122 -109 -93 212 39 24 -339 161 -79 -128 61 -29 145 40 -45 -239 54 -95
5069i5N2L6o5J1k03qJ90n9ML61k34q3OL71l95K99k20Q9M6J6q6J76j50K8j66k08
$$ -95 -43 -7 -72 -61 -264 -272 -82 -141 -137 224 -10 -93 -87 284 -111 188 -32 57 103 119 33 209 59 87 -79 -287
5095b87K12J33k84J56q5K84l69J2J02L08j35k02J68O8j64P4J8j18J65J3k64L16
$$ -287 -75 58 -226 -70 -155 129 -240 -228 -126 182 47 -155 13 81 -83 -9 9 -109 56 69 -195 121
5117A21k96J40k4L73l86r0L14j44K01m14K07L9M6M1l28L8J53l8Q6p0M5J41K3l05
$$ 121 -175 -35 -59 314 -72 -162 152 8 209 -205 2 41 87 128 -200 -162 -9 -47 39 -31 14 155 178 -127
5141a27J54m8Q1j45K57l47kK54M3KK41m66K84k27k3J33Kp4j13K38j77q4J23P7
$$ -127 27 -21 60 -85 172 -175 -177 77 120 122 363 -103 181 -46 -69 64 66 -8 -121 117 -60 -144 -21 56
5165E6j24J19qn7L9k38K10l8qJK45j45k03O4K8J61j28j24L25k31lJ53l96K94j78
$$ 56 -68 51 43 -14 25 -213 -3 -41 -49 -48 197 52 -151 -87 -59 102 -26 -150 175 -56 -59 94 -302 -8 -186
5190a86K79o2L5Rl2j12R9p0J27k3L9m3K07M9k83N6n9R0j60K27k64L33k3l97n6
$$ -186 93 31 66 75 43 -69 30 -40 87 64 103 60 267 316 33 89 30 120 -40 187 -77 256 233 -164 -220
5215b20K20k1J48r9p9K2r1J27j68J53M9j69K64k63J06j31J73j0o5J67j45J69k23
$$ -220 0 -21 127 28 -51 -29 -120 7 -161 -8 41 -128 136 -127 -21 -152 21 11 -54 113 -32 137 -86
5238h6J42J17k18p1J67j49j10K57J93J14m39Q9KJ30m54K25J84l0l08K43k49K77
$$ -86 56 173 -45 -116 51 -98 -208 49 242 356 -83 6 8 138 -316 -91 93 63 -245 -2 -251 26
5260B6l7K77l8l21P7j56N52M1l47j64N4k17O5N18l58J98j50M77l95J57p03O49
$$ 26 -11 266 228 -93 -16 -172 380 421 74 -90 -36 -253 -188 330 -28 170 20 497 102 259 -444 205
5282B05k79K19L18l70K79j17k5l28m6j7K66N6n8O36q03j57J97J72j73L3k04K7
$$ 205 -74 145 463 93 372 255 230 -98 -144 -161 105 161 103 739 -64 -221 -24 148 -25 8 -196 -169
5304a69K95J84P1J76j90n31M97J41q03K18O7L58m23j11N0K80l34M79m70m78R92
$$ -169 126 310 381 557 367 -164 333 474 -329 -111 -44 314 -109 -220 -170 110 -224 255 -215 -693 299
5325B99k68m11J61O97n47J50L00o87K61J08n45M22O86q06L06j99N71m31J08k70
$$ 299 31 -380 -219 478 -69 81 381 -306 -45 63 -482 -60 626 -180 126 -73 498 67 175 -95
5345i5j22L15J70n08L23o0l2k41R2p5M39j20l96K67J77j39L04r0j19k85L00L4
$$ -95 -217 98 268 -240 83 23 -9 -250 -158 -233 206 86 -310 -43 134 -5 299 209 90 -195 105 139
5367A39o0M5j05k61K23J87j30K87j74j76j07J34JK51n81K01OJ78k72J24n8l92
$$ 139 79 124 19 -242 -19 168 38 325 151 -25 -132 2 3 254 -327 -126 -120 58 -214 -90 -148 -540
5389e40R03n89j04J93J36n07M36L16n34m22Q12l54Q42L05m81J43q08J345j521
$$ -540 363 -226 -330 -137 -1 -508 -72 244 -290 -712 100 -254 588 893 412 555 -253 1092 -429
5408d29k0J8M49m96R21K90n21k10j86j21r1k61J101k76k03L10nLm56M55l83M55
$$ -429 -449 -431 18 -478 443 733 212 2 -184 -305 -396 -657 444 168 -35 275 270 273 -183 272 -111 344
5430C44n83L76K51l78k44P3J38n4K94J0l03L25j68k03J47j13O0M5j44N7K4k99
$$ 344 -239 137 388 10 -234 -161 -23 -77 217 227 -76 249 81 -122 25 -88 -28 17 -127 -70 -46 -345
5452c45J53L98j98j96J23Q7j46L3J07j90L0N9J77j07L26k60k64j0K47l4K18j16
$$ -345 -192 206 8 -188 -65 22 -124 -91 16 -174 -144 -85 92 -15 311 51 -213 -223 24 -10 208 92
5474I2o5j97o1J68P4p6j13K62j71j49L75o4j61j9k95O80m75J41j4L22l30j6j64
$$ 92 27 -170 -231 -63 11 -65 -178 84 -87 -236 139 75 -86 -105 -400 280 -195 -54 -68 254 -76 -92 -256
5497b56K33k66M65q1M1j71L05J36l36J56l41j80K49N1l2J61m5k2N03m61j80K47
$$ -256 -23 -289 176 95 136 -35 270 406 70 226 -115 -295 -46 5 -27 134 89 67 570 109 -71 176
5519A76o3m75N20n22L69Q42p29K88n10M91o52P5n5O38N29p68j27M92k55o07l03
$$ 176 113 -362 158 -364 5 847 118 406 -104 387 -265 -190 -245 393 922 154 27 519 264 -343 -646
5540f46O36O83j103J95m42J564j253R1L27l8O51n02m45M02R8j66J6j45j10j8J20
$$ -646 -10 673 -430 -235 -677 887 -366 -275 52 14 665 163 -282 120 218 52 68 -77 -187 -205 -85
5561h5j55M09j96k09J24J29K1O6J34m11O9K26j73J07j48L5k50L31j05L38k93Q8
$$ -85 -240 169 -27 -236 -112 17 38 104 238 -173 -104 122 -51 56 -92 -57 -307 24 -81 257 -36 52
5583E2j85K15j66m0M2j11J2J07L22j76O2k10RK30k08l10M62M7k39L88k24j47K6
$$ 52 -133 82 -84 -124 -82 -193 -181 -74 248 72 134 -76 -67 163 -45 -355 107 154 -85 303 79 -68 -42
5606d2q1J25K09k61l9l9Q9p7M8K71p9n2j67J44Q4k04J11j05J21J2j63M6J05q2
$$ -42 -123 2 211 -50 -89 -128 -39 -116 -68 203 124 72 -95 49 133 -71 40 -65 56 68 -95 -49 56 -26
5630b6O1o7J80p5k0j73J02N5P1m03M18j5k56J11k7K49k35J00M4RL6j82N5m5j92
$$ -26 35 -32 148 73 53 -120 -18 37 108 -295 123 108 -148 -37 -64 185 -50 50 94 103 139 -43 12 -33 -225
5655b25L10j09j18O0J6o8J45L4k54L96k18J22j16j63J56J99j86J72J42k89j61
$$ -225 85 -24 -142 -82 -66 -134 11 45 -209 187 -31 91 -25 -188 -32 167 -19 153 295 6 -155
5676a55J8J37j82Q0J11l1K8R0j47J83j25J2J81L2j26J72k45l4J45M8k46N6K3R9
$$ -155 -137 0 -182 -102 9 -22 6 96 -51 132 7 19 200 232 106 278 33 -1 144 192 -54 2 25 124
5700A24Nj05K37l63R8j58J23J20J2r9lJ56r4J11q2k14J72j14L1j97J66q4L35l58
$$ 124 129 24 261 -102 -4 -162 -39 81 93 -6 -9 147 53 164 82 -132 40 -74 -43 -240 -74 -158 177 -181
5724a81L03l0j6j03j89K26O0J4j23J93J08m57Q3L71m80J38J54k0k08P3K91j57
$$ -181 122 92 76 -27 -216 10 70 84 -39 154 262 -195 -112 259 -221 -83 71 51 -157 -84 207 50
5746E0k69O3J28R8J2p7j52L63k07J82j62L01m14k01M73j0l14J71P9J96q3k12J
$$ 50 -219 -156 -28 70 82 5 -147 216 9 191 29 330 -84 -285 188 178 -136 35 114 310 227 15 16
5769A6m9K06j31k40K05k5k14J37q9L31m59M12Ml24K93j28k68N22j19q8%m32N07
$$ 16 -33 173 42 -198 7 -18 -232 -95 -184 147 -312 100 104 -220 73 -55 -323 199 80 -8 -8 -440 67
5792F7M7j51K62l04J16J69l16L3R2r5j5pJ38j01p7J86O0k10k1J4J87r4N5J92j57
$$ 67 114 -37 225 -79 37 206 -110 -77 15 -80 -95 -102 36 -65 -142 44 104 -106 -127 -113 74 -20 35 227 70
5817G0j04P9QJ52l58J35Q4P5p2j90K08J10k6l11PL56q5k13j50L39j92P9p7J06
$$ 70 -34 45 53 205 -153 -18 66 141 69 -121 87 197 171 -140 -133 223 138 -75 -225 114 -78 1 -76 30
5841C0j1l3j70m1J99J41l35o8K77J29j87K78j86k6J2M6J62o3j39j39J07J30k69
$$ 30 19 -14 -184 -225 -26 115 -220 -288 -11 118 -69 209 23 -3 9 55 217 154 15 -124 -17 113 -156
5864a56J14J21j59J37m5J39j65j63j80L15l9J48l5j96J87K5j6J78j63k02J76n8
$$ -156 -42 79 -80 57 12 151 -14 -177 -357 -42 -81 67 32 -164 23 48 32 210 47 -155 21 -37
5886c7J6J03J01j57j15K33l32K57J29j66j97J20J12k62M88k41r5j60J69j30J32
$$ -37 -21 82 183 26 -89 144 -188 69 198 32 -165 -45 67 -195 293 52 -43 -203 -34 -164 -32
5907c2r4J75j81N2J23l51L85j2j45M35m05O2Q8j87j13J08L26m17L21O4k03N0j11
$$ -32 -126 49 -132 -80 43 -308 77 65 -80 355 -50 12 100 -87 -200 -92 234 -183 138 202 -1 49 -62
5930f2LM0K09l56P1J2L8n9J35J24k27l3L03k55L1n9N4rJ4M2j39J67l10M40j61
$$ -62 -59 -19 190 -166 -95 -83 -45 -104 31 155 -72 -105 198 -57 -26 -85 -31 -40 -26 16 -123 44 -266 174 13
5955A3R0j10J5Jm8Qp4K51j18J79k92J46j8k13R3K5k0J48l6L06m08M8n9k14M15
$$ 13 103 -7 8 9 -39 -31 -105 146 28 207 -85 61 43 -170 -77 -52 -72 76 40 346 -62 -14 -73 -287 128
5980A28j18q5N9j31R9M56l65Jj25L65k03p5L32o58J45N21n28K86j81K3l2N1rP8
$$ 128 10 -75 -16 -147 -48 408 43 44 -81 284 81 6 338 -320 -175 346 -182 104 -77 -54 -86 -35 -44 34
6004C4O5j45j53j6p7K27N3j5L8j33n5J20n9J52K53k19j00M8j02o7L09j87R9k3
$$ 34 99 -46 -199 -215 -292 -65 -12 -27 11 -122 -177 -57 -116 36 289 70 -30 18 -84 -151 158 -29 70 47
6028D7j77K67mk74j25L17p7O8k00J77N6k21J1J46o5j1j66L32N2q3P7j8J37l15
$$ 47 -130 137 133 -141 -266 51 -26 42 -158 19 75 -146 -135 11 -54 -65 -231 101 153 70 147 129 266 -49
6052d9l2M57l78K84j74j52J08m7j87K00j03N9P6j84j09K75J82k79o9J27p3J46
$$ -49 -81 376 -2 282 108 -44 64 17 -170 30 -73 -14 62 -122 -231 44 226 -53 -122 5 -68 78
6074G8n2J41k08J53r6J77k58%M8M5r9M6m9m0L9j75K85K96k51J20k62J45j03%K30
$$ 78 26 167 -41 112 16 193 -65 -65 -17 28 -71 -25 -74 -114 -75 -250 35 331 80 200 -62 83 -20 -20 210
6099B10l11l0J55k67J33Rj96K18k1K71q1l8L1Q8j09l9rM1j69K08j69l6R8P5m0
$$ 210 -101 -131 24 -243 -110 -101 -297 -79 -100 171 90 52 83 171 62 23 14 55 -114 94 -75 -111 -13 62 22
6124B2j0j20J55j82mJ50Q5N3k42P9m7J77k17K27j45J58q3l35L65K1j33n3M1j63
$$ 22 12 -108 47 -135 -139 11 96 149 -93 -14 -61 116 -101 126 -19 139 56 -279 86 107 -26 -79 -38 -201
6148b01K6J25J45P9K30o99PN95l38n0j4j9L07l06J19k9K48l44Q1M8j2R8j34K71
$$ -201 -175 -50 95 174 404 -295 -288 307 -31 -81 -95 -114 193 -113 6 -23 225 -119 -38 10 -2 96 -38 233
6172B33k01N4o5q9M3L5j45q5N29m43K99j04J38l18J2O1j37M75m18k1K53l66Q1
$$ 233 32 86 21 -68 -25 10 -135 -220 309 -134 165 61 199 -119 -107 -46 -183 292 -126 -147 106 -260 -179
6195a79K85k3J8r8P4j09k54J24P7K21M6j68N7j24Q8N4J84m59J56O7j9o8J0j30
$$ -179 106 83 101 3 77 -32 -286 -162 -85 136 182 14 71 -53 35 89 273 -186 -30 37 18 -50 -40 -170
6219a70K21J20k65J47j51K83j09N0J21m65L44j28r5J98q2k27K81n1K3m3QL9j08
$$ -170 51 171 -94 53 -98 185 76 126 247 -218 126 -2 -97 101 19 -208 73 22 45 2 10 49 -59
6242e9q4J40j23L53j26r4j2K7j72J3J94O3P6k31J28J08j7n04L02p4K11k61L44
$$ -59 -143 -3 -126 227 101 7 -5 22 -150 -137 57 120 196 -35 93 201 184 -320 -18 -92 119 -142 202
6265B02l01l2N1o2K25j4l0j96K23p6J30j38q4k06L38r9J33j82K15j03M6P9l29
$$ 202 -99 -131 -80 -142 83 69 39 -157 66 -10 120 -18 -102 -308 30 -69 64 -118 97 -6 40 119 -210
6288b10K66k34K68q2q4O2J87k33J62j1l04J81Q4lM0J10l61K52l7j25K70l01R7
$$ -210 56 -178 90 8 -76 -14 173 -60 102 91 -213 -32 52 49 89 199 -162 90 53 -72 198 -103 -6
6311fP9J00l33p4J47J93P4o9p8r6L26m02R1J56Q5K1k30J67k31j57K18mQ5J26j54
$$ -6 73 173 -160 -234 -87 106 180 111 33 -63 263 -139 -48 108 193 214 -16 151 -80 -237 -19 -23 62 188 34
6336C4j71K18k4j52K0K93j47r4j8K3j34L90k23ko4J32k8m8On0N9Q0j81o6k2O6
$$ 34 -137 81 57 -95 -75 218 71 -23 -41 -18 -152 238 15 13 -51 81 53 5 11 -39 20 100 -81 -147 -169 -103
6362a03J48j94J15k58J90N5N5K62k86j12L25j57j86Q1j7J01R0j13o7J44Pj90l6
$$ -103 45 -149 -34 -292 -102 -47 8 270 -16 -128 197 40 -146 -65 -82 19 109 -4 -71 73 80 -110 -146
6385a46K81J37l01m6NNK09j8n0k20J15K3r7J45j06J48k63k1J39R0q9R8m5O7j5
$$ -146 135 272 -29 -75 -70 -65 144 126 76 -144 -29 -6 -103 42 -64 84 -179 -200 -61 29 -60 38 -7 60 45
6410D5k23L0j8K25k44m2K18K16k06J92k05O3m0q2J20ML75l01p5k6k39L14lm23
$$ 45 -178 -148 -166 59 -185 -227 -9 207 1 193 -12 51 11 -71 49 53 428 127 52 26 -213 101 98 -325
6434c25K96J51j2j22Q6j74L9M9J59lj29J8q6k90J47M7J47j64O2q5K89n3n6J21
$$ -325 -29 122 110 -12 74 -100 -61 -12 147 144 15 33 -53 -343 -196 -149 -2 -166 -104 -189 100 47 -9 112
6458A12k38L07k63k3m2J71LJ23m37L96Kk29N6K17Q5r1j68K31m39L43j50q9O4P4
$$ 112 -126 181 -82 -105 -147 24 27 150 -287 109 111 -118 -62 155 240 149 -19 212 -227 116 -34 -123 -59 15
6482A5q6N3l6K96l71l1q9J63J52j04P3%K2r2M6j74J54L05k37J71k65k82L82j3
$$ 15 -71 -18 -54 242 -129 -160 -249 -86 66 -38 35 35 57 -35 11 -163 -9 296 59 230 -35 -317 65 52
6506E2k14J71m4N2O3j34l3J0k2K42j0m15L56k39K71j41K4j43M8pJ57j1L9k05J25
$$ 52 -162 9 -35 17 80 -54 -87 -77 -99 143 133 -282 74 -165 106 -35 -11 -154 -106 -113 44 33 72 -133 -8
6531hP3j58J81M5K6k86K28j13P6r3J46k77k14M35lK23n38K32J1O1R3k06K1Q1j09
$$ -8 65 -93 88 133 159 -127 101 -12 64 -29 117 -160 -374 61 58 281 -257 -25 -14 47 140 -66 -45 36 -73
6556g3k3j34N8J99Mp7r0J7J4J65p2o3j1J10kK37k31k12m7K63j53J67Q1j27o3m6
$$ -73 -96 -230 -172 27 31 -46 -136 -119 -105 60 -12 -75 -86 24 22 259 28 -184 -231 32 -121 46 127 0 -63 -109
6582a09N8j28K95l1l3J46l87J33P1pm07N03k7j55K4K48k61K28j34Q4k6JK91o03
$$ -109 -51 -179 116 85 52 198 -189 -56 15 8 -399 104 77 -78 -54 194 -67 161 27 111 85 86 377 -226
6606b26N3K62l18J44o2K20KR2k38j6J80k4M4kP5m68N06j98k21L20j91Q9l7j00
$$ -226 -173 89 -229 -85 -147 73 75 167 -71 -87 93 69 113 111 186 -282 224 26 -195 125 -66 23 -14 -114
6630a14j4K3J97j32Q1j28Rm5M79k54j24n3N6r1J84j28j14K20j32K8r3L17m8j47
$$ -114 -128 -105 92 -40 41 -87 -78 -123 356 102 -22 -75 -19 -110 74 -54 -168 52 -80 -52 -145 172 124 -23
6654b3j28K27j69K83j67K7j60K72j14P6j11Nj00j67K22L91l57O6J15j83J67j34
$$ -23 -151 76 -93 190 23 50 -110 162 48 124 13 18 -82 -249 -27 364 7 73 188 5 172 38
6676C8j29j27J73j11J07O5J90j57J27j48M6k21J98j44n0J55j08k0j09N1j01K25
$$ 38 -91 -218 -45 -156 -49 16 206 49 176 28 74 -147 51 -93 -143 12 -96 -116 -225 -174 -275 -50
6698e0o8J66j90K71o5j51O8K39j92j57M58n8k32m7J64j53n2J62r0J76l11n4L27
$$ -50 -118 48 -142 129 64 -87 -19 220 28 -129 329 271 39 -8 156 3 -49 113 23 199 -112 -166 161
6721A61l9k1P8l0k20J96o1o3M9j33K66j73qK91j26k45QJ63l23M18l02O8R1o0K77
$$ 161 122 101 179 149 -71 125 64 1 50 -83 183 10 2 293 167 -78 -70 93 -230 188 -114 -46 45 -15 262
6746B62j53l7p6l5J63j43K4J58k53J12q7J63rm7r2L2J88k31L6J33L7j63P5k20
$$ 262 109 72 -4 -39 124 -19 5 163 -90 22 -65 98 89 42 -50 -18 170 -61 -25 108 145 -18 57 -163
6770a63N7N4P9R7j81N1k7j48K09j90JJ65j9J50k44J0J6J68k61K07j70j60L10P1
$$ -163 -106 -52 27 124 -57 -6 -33 -181 28 -162 -161 4 -15 135 -109 -99 -83 85 -176 31 -139 -299 11 82
6794H2j50K79p9n0j01L7m9J97k18K28j52K55k78P3j33J27k59NN01l89j19J82m7
$$ 82 -68 211 132 82 -19 18 -31 166 -52 176 24 279 1 74 -59 68 -191 -186 315 -74 -193 -11 -58
6817e8J56k86J3j4J40j21M33k49J9N0k17K64j22j61J40Km6J44l44L26k13K36j61
$$ -58 98 -188 -175 -189 -49 -170 263 14 33 83 -134 130 8 -153 -13 -11 -57 87 -257 69 -144 92 -69
6840f9K68M6l32P2K08k22K31k10n3L04l42Q1K0q4j14K08%j8l2m2k31L70l9j46
$$ -69 199 245 -87 -15 193 -29 202 -8 -61 243 -99 -18 2 -82 -196 12 12 -6 -38 -80 -311 59 20 -126
6864a26K1L79l54l5Km6j51J51K39r5J4p6N5K88n17L88l92R7L93M2l56k63N7J83
$$ -126 -105 274 -80 -115 -113 -159 -310 -159 80 -15 -1 -77 -22 266 -251 137 -255 -158 235 277 -79 -342 -285 -102
6888a02L6k3M43n45L48m18J5M44j337J211M63l72j40q14L85P8K56n13Q36j02m46
$$ -102 -66 -89 354 -191 157 -261 -246 198 -1139 72 535 163 23 -791 -406 -328 -72 -585 251 149 -297
6909b97N21m33M20j84L97n27R05k58r37O72l07k37P29o7o09k13P71n01Q17p92
$$ -297 224 -209 211 27 424 -103 802 544 -393 279 -28 -265 464 397 -212 -425 346 -155 662 -130
6929a30K88O4j71j39O25m18j69k8k0K48l88K45Q5n9n5K70j62k02K7J61j84J05
$$ -130 158 222 51 -88 537 119 -50 -78 -98 150 -238 7 92 33 -22 248 86 -116 -89 72 -112 -7
6951gN7K43l58J00r0M7Rm1JJ30J02L0m27J26J31J01r0l3j08R0Q8k23N1nN7J05
$$ -7 50 293 -65 35 -55 -8 1 -40 -39 91 193 223 -204 -78 53 154 64 31 -77 13 101 -122 -71 -76 -19 86
6977H6M6j50l1J23L9p6j14Q1K5o1L46n27K76M7k45K12j98l8M11k84O0m4j20l7
$$ 86 132 -18 -49 74 113 37 -77 4 29 -32 314 -213 63 110 -135 77 -121 -159 252 -32 28 -16 -136 -173
7001a73K06n7j21K35l28L92k22L5p2J80p5p2J29K42m56L46l88L05j24O6j50K74
$$ -173 33 -24 -145 90 -238 154 -68 -33 -105 75 0 -72 57 299 -157 189 -199 106 -18 48 -102 172
7023A72k11j85J36J40m8J15j37L3l5Lj6m0n8K42j1L8K1l88K61J50Nk19M5K01j76
$$ 172 -39 -224 -88 52 4 119 -18 15 -20 -17 -33 -73 -131 111 100 138 159 -229 32 182 187 -32 13 214 38
7048C8j87P7j4J15n3oj31K31lJ7m9o9o5L8K68q0j74K35k40o8J42k2j35J9J50N7
$$ 38 -149 -72 -86 29 -24 -30 -161 70 67 84 35 -34 -99 -61 207 127 -47 188 -52 -120 22 0 -135 -116 34 91
7074I1j00OO7K55n20J27K54j06j8j89l6L8K41K44k73lP1q5m0O2j48J94M1Q5j17
$$ 91 -9 -3 64 319 -201 -74 180 74 56 -133 -169 -131 110 354 81 78 149 64 24 86 -62 132 173 258 141
7099A41M9m52J61J63j43J12J16J39j40j16J19l11L44j39R6k11j17L27k04L10p7
$$ 141 190 -262 -101 62 -81 31 147 286 146 30 149 -162 182 43 139 -72 -189 138 -66 244 167
7120A67j95J47j7n9k0J4q6k04J54Q7J0j38J60k42M28l82L01j38L8j46J44K10l23
$$ 167 -28 119 102 43 23 37 -49 -253 -99 -12 -2 -140 20 -222 206 -176 125 -13 25 -121 23 233 -90
7143i0K03j70R4n3M3j19j86L85j95J57j69J7KR7P6q2r8K26k26Q4j60K76j54j7
$$ -90 113 -57 37 -16 27 -92 -278 107 -88 69 -100 -83 -81 16 92 10 -88 138 -88 -4 -164 112 -42 -59
7167e9K37k13l0MK21n2j96J93k9l5q4j16K10j83K26l7j15m6J08j52J55q4K94l85
$$ -59 178 -35 -65 -61 160 108 -88 105 76 41 -43 -159 51 -132 94 57 -58 -104 4 -148 7 -77 217 -168
7191a68j12K27K5j0K03K8l88L50j65j51r4J60M32m0r2m73J47J80j25K49J47o61
$$ -168 -280 -53 -28 -38 165 193 -195 155 -10 -161 -255 -95 337 297 205 -268 -121 59 -66 183 330 -331
7213c31N13j24j05Q5n5M2k10K39j31J27k81K94K8j03p1L1k21K43J0P8J24k27j0
$$ -331 182 58 -47 38 -17 25 -185 54 -77 50 -231 63 91 -12 -83 -52 -273 -30 -20 58 182 -45 -55
7236e5j1J42k12J35K2k05K54jMj84J58k3j57K10J04m13J46K00k64K25J58k51m2
$$ -55 -66 76 -136 -1 21 -184 70 69 73 -111 47 24 -133 77 181 -232 -86 114 -150 75 233 -18 -60
7259f0M3M3mL0j54l8P3O9M7J65k46P7J78l53K56k33L3j4L6n7j51K18Pj05L7K81
$$ -60 -17 26 22 52 -102 -140 -67 2 49 214 -32 45 223 -130 126 -107 -74 -88 -52 -109 -260 -42 -35 -140 -103 178
7285A78n6k1r0J99m61J64J16j88J29r6J04r6l3N3k3j58J19R3K62j92j52K01p6
$$ 178 122 101 11 210 -251 -87 29 -159 -30 -126 -22 -118 -151 -98 -121 -279 -160 -67 195 3 -149 52 -24
7308b4M2j09K1R9j17m6J39j74m4M64q5j76P3r1N3p2O1l03K11L21n2m32J16p2K29
$$ -24 18 -91 -70 29 -88 -134 5 -169 -213 251 166 -10 63 -28 25 -47 14 -289 -78 243 191 -241 -125 -197 32
7333C2k38L94l61M03j60l80L33n8J24M1q6Q8j0k16K97m67M28m07K63%o4k2n6J63
$$ 32 -206 188 -173 230 70 -310 23 -35 89 130 44 132 122 -94 203 -264 164 -243 20 20 -44 -66 -122 41
7357D1j4K09k07N4N1l43K74j08M2j50P5K75m89L81Rk8j81K44k67L22L4m21K41
$$ 41 27 236 29 83 134 -209 65 -43 -1 -151 -76 199 -290 91 100 72 -109 135 -132 190 224 -197 44
7380D4m0o8J46R1jq6j29K33k74j07J31L44k09J06n05Q7K73L5n3j89J59K6j09J21
$$ 44 4 -64 82 173 172 86 -43 190 -84 -191 -60 284 75 181 -324 -237 36 71 18 -171 -12 14 -95 26
7404B6l10K51r0N9Q5J29j74j48J88M3q8J26r9Q5j49J42j79J62j98K89j24j83J22
$$ 26 -284 -33 -123 -64 21 150 -24 -172 16 59 -29 97 -2 83 -66 76 -103 59 -139 150 26 -157 -35
7427c5J7p9j71J69K40j41l1j87L70j17r0j15K56j42J40K22k84p6L9K17m00M38
$$ -35 -18 -97 -268 -99 141 0 -31 -218 152 35 -55 -170 86 -56 84 306 22 -54 -15 202 -198 240
7449B40k64Lq4K15l4l24R7m8O7K4K87k29j76J66Q8n5j22L11j91J14k42J75J40
$$ 240 -24 -21 -105 110 76 -248 -151 -199 -132 -108 179 -50 -226 -60 28 -27 -149 162 -29 85 -157 18 158
7472A58j47J24k88K19R5k26L05k13o2l54K64M4K15m00J16J72k14L59j60K4Jp4
$$ 158 11 135 -153 66 161 -65 240 27 -35 -389 -125 -81 134 -266 -150 22 -192 167 7 31 32 -42
7494d2k93K64O7k4j33L09l3l10o7K73N8J63k64O3k1r4P6n9K66k31j97M6j59M70
$$ -42 -335 -71 -4 -28 -161 148 115 -195 -262 11 69 232 -32 31 10 -84 -8 -67 199 -32 -229 -183 -342 128
7518A28j16j08M4j63J86P2k29K95j65r3q5J07M0J31n8j07K19q4j37j56L67l6r2
$$ 128 12 -96 -52 -215 -29 43 -186 109 -56 -149 -234 -127 -87 44 -14 -121 98 14 -123 -279 88 52 -40
7541d0k7J13k9N8q4k01K69j56K01j97m8m2J22J03J14k38J85k06m0N2j36L94j21
$$ -40 -67 46 17 75 -9 -210 59 -97 104 -93 -141 -183 -61 42 156 -82 103 -103 -143 -91 -227 167 46
7564D6M7j59m9m1K69j42m9J33l9R3k93K93k2j93J08J45Q9m59J16J17N7J36n9L1
$$ 46 93 -66 -115 -156 113 -29 -78 55 16 109 -184 109 87 -106 2 147 236 -223 -107 10 67 203 144 175
7588A75j78M6l8P4R9j19j73o8L35k33K17j98l4J00j44J06J60k40M6J3n8R6q0K18
$$ 175 -3 43 5 79 178 59 -114 -182 153 -80 137 -61 -95 5 -139 -33 127 -113 -67 -54 -112 -16 -96 122
7612A22j07j59N9K65j73j02K33j64K38k39p9L7O7%Q7n0o5P3K09j96J74j8j87j77
$$ 122 15 -144 -85 180 7 -95 138 -26 212 -27 -106 -69 -2 -2 85 35 -30 43 252 56 230 212 25 -152
7636a52p1M32p1j92K68l05J85p6K0J9k32J95q3J52r5O3r1M9k65L07J57j17j75
$$ -152 -223 209 138 -54 214 -91 94 18 38 57 -175 20 -63 89 -6 57 -34 15 -250 57 214 97 -78
7659g8j1J00q0k32M90k86N6K44l14L9J41R9j77k8j19K81j82K22j06k10K11r5L3
$$ -78 -89 11 -69 -301 189 -97 -41 203 -111 -72 69 168 -9 -37 -156 125 -57 165 59 -151 60 -35 -2
7682bK0o5K1Lj39J57j7j06L58k03K8j9k54K68J19j77j81L43j77LJ96p0j20k0J86
$$ -2 18 -47 -26 -23 -162 -5 -22 -128 230 27 55 36 -218 50 169 -8 -189 154 -23 -20 176 106 -14 -34 152
7707A52j50k13Q9Q9J35j42j6j2Q5r7oj8J84Q6j52q5J42k99K74r5m0O4J48p0q6
$$ 152 2 -211 -122 -33 102 -40 -56 -68 17 -80 -86 -104 80 166 14 -71 71 -228 46 -49 -89 -25 123 53 -33
7732c3J00j23j11J0K09j41k9j41L15j99m8M19l01J29PM6l6k0k93K22j08J57k21
$$ -33 67 -56 -167 -157 52 -89 -118 -259 56 -143 -191 228 -73 56 63 109 73 53 -240 -18 -126 31 -190
7755a90J87L4k54R8K07o1n6K63j50J86n09K90J21k96R2L16j86k14J48L2k82K16
$$ -190 -3 31 -223 -125 82 21 -35 228 78 264 -245 45 166 -130 -38 278 92 -122 26 58 -224 -8
7777hqo4q8p5R5J19k6q3l0M0K62m6J20m08N91n00K08l8J41j69N2m7O3q8j42P6
$$ -8 -16 -80 -168 -243 -148 -29 -55 -138 -168 -128 134 88 208 -200 391 -109 99 61 202 33 85 38 101 13 -129 -53
7803e3P9P2k80M28q0j96K79k38J29k91j76K35r3r9R7L47k7j01l1p0j06K30O5N0
$$ -53 26 98 -182 246 166 -30 249 11 140 -151 -327 -92 -185 -284 -187 160 133 32 1 -69 -175 55 120 170
7827A70q9k37m5K97o0j22O5J38k5l44kK96j10o3K26r2M9M7j06j11K79k19k01K21
$$ 170 81 -156 -201 96 36 -86 -21 117 92 -252 -254 42 -68 -131 95 3 52 99 -7 -118 161 -58 -259 -38
7851c8k6J84J50k32nN5k14M29l61J70q8j53l9J50J00N3o2l0M9K10k89K19j22l9
$$ -38 -64 120 270 38 33 88 -126 303 -58 112 24 -129 -168 -18 82 135 73 43 92 302 13 232 110 71
7875G1J4m40O6L84J01j92n5p1j43K6K40l6n6j01L18j70K17J31j49l50K68j48J79
$$ 71 85 -355 -289 95 196 4 -51 -122 -265 -239 1 -35 -91 -192 126 -44 173 304 155 -195 73 -75 104
7898A04q1J87m44K09QJ7O7J09l86K26P6o9j2L0mJ15k53j7K53m2M0r4oq0J80p6
$$ 104 23 210 -234 -25 -17 0 67 176 -210 16 92 23 11 41 37 152 -101 -118 135 93 133 39 33 -47 133 57
7924E7j07N5L9J28k78J81P7r7j64N8K1J45j35o2J03J6j3j51K02l17L53j08j11
$$ 57 -50 5 44 172 -106 75 152 55 -109 -51 -30 115 -20 -82 21 37 24 -127 75 -242 111 3 -108
7947a08Nk2Q0p0K03m5m0k27j50M55J13k46J10L2N4k67J12K93l93J67N9k8p9j22
$$ -108 -103 -125 -45 -115 88 43 3 -224 -374 81 194 -52 58 90 144 -123 -11 282 -111 56 115 87 8 -114
7971a14K20m10M12R7j99j12K55l9m4j54J26j42K4J47j54l3P7J13J63o8k25jK30
$$ -114 106 -304 108 205 6 -106 149 110 66 -88 38 -104 -80 67 -87 -120 -43 70 233 165 -60 -61 169
7994A69j06r8j37N8J36K7M3J44p0k2l27K5J46J70j57r7LR2P9j53J19rr2j80O7
$$ 169 63 -35 -172 -114 22 49 92 236 166 144 -183 -158 -12 158 1 -96 -93 -1 78 -75 44 35 -57 -237 -170
8019a70L02K52l37M7j08L6p4K03o4j17j24K83k92L4K00l00n4J48Q2o5R7K07k95
$$ -170 132 384 47 94 -14 22 -52 151 87 -30 -154 129 -163 -129 71 -229 -283 -135 -53 -118 -21 186 -109
8042a09kP4l16M76k50K2M7j21K79j55J69j0k88q4K95o0j29J79O8J91k48n5R3j14
$$ -109 -111 -37 -353 123 -127 -105 -58 -179 100 -55 114 104 -184 -268 27 -33 -162 17 85 276 28 -27 66 -48
8066d8j0K0J22j19q3kLM3M8k74L91r6l8PM0O8lP7Rk13p1J54O7k93L20j05J64o7
$$ -48 -58 -38 84 -35 -118 -120 -117 -74 -26 -300 91 -5 -43 -36 4 72 69 146 155 -58 -129 25 92 -201 119 14 178 111
8094A11r9K6q0K3k1q5M0J25K5m2k2j1o3Q3q0K89l61K41K89j77l15K70j64l6j99
$$ 111 12 38 -42 -19 -40 -125 -85 40 65 23 1 -10 -73 10 -70 219 -142 99 388 211 -104 166 2 -34 -233
8119b33K64M4j0j83J20R9k74L16k32K27m6O7j51M9k3r6j0k26K42J43M9j74J54
$$ -233 31 75 65 -118 2 101 -173 143 -89 138 92 159 8 57 34 -62 -72 -298 -56 87 136 -38 116
8142A16j40j61K65ok08J82K2J43q8k17K52m2K1l37J50j6J23N3j50jL11n7k04J02
$$ 116 -24 -185 80 74 -134 48 70 213 125 -92 160 118 139 -198 -48 -64 59 112 -38 -39 272 215 11 113
8166A13l95J47J43J34j1l28j2L09j6j07K6r0j05K05p2K20j57m1j58J79J0L5J37
$$ 113 -282 -135 8 142 131 -197 -209 100 84 -23 3 -87 -192 13 -59 161 4 -37 -195 -16 -6 29 166
8189A66%j37
$$ 166 166 29
8191B9
$$ Imaginary data points
##PAGE= N=2
##DATA TABLE= (X++(I..I)), XYDATA
0@%%%%%%%%%%%qJ6j6J6j6K4l2L2m0M8n6P2q2R1j07J29j51J71j95K24k56K89l28
$$ 0 0 0 0 0 0 0 0 0 0 0 0 -8 8 -8 8 -8 16 -16 16 -24 24 -32 40 -42 49 -58 71 -80 91 -104 120 -136 153 -175
34a75L71m17M69n24N84o53P28q08Q95r91J097j211J337j476J625j788J970k170
$$ -175 196 -221 248 -276 308 -345 383 -425 470 -521 576 -635 702 -774 851 -937 1033 -1137
52a137K392k640K919l233L590m000M477n043N723o560P618r003J0903j3673J8099
$$ -1137 1255 -1385 1534 -1699 1891 -2109 2368 -2675 3048 -3512 4106 -4897 6006 -7667 10432
67A0432k6265M6074j79484j89241M66958N5276k27145O8867P4609j81618N7566
$$ 10432 -15833 30241 -149243 -338484 128474 183750 -43395 25472 100081 -81537 -23971
78b3971J80530r6191j46935Q1672M6773n7852J029M7884j5370k7716O113K0487
$$ -23971 156559 60368 -86567 -4895 41878 -15974 -14945 32939 17569 -10147 -4034 16453
90A6453r878j6007r825n863K5015K9630n8993l7373R4869L8100r0106J8332P7707
$$ 16453 6575 -9432 -19257 -25120 -105 29525 -29468 -66841 28028 66128 -23978 -5646 72061
103G2061o7114m4030Q6135o500o3349M5005q146q6990N4218R1748n4323o0855
$$ 72061 4947 -39083 47052 40552 -22797 22208 14062 -72928 -18710 73038 18715 -42140
115d2140J4672J3797L6927K6096o1481k8560N5687n552m4440L1535K7095l9345
$$ -42140 -27468 -13671 23256 49352 -12129 -40689 14998 9446 -34994 -3459 23636 -15709
127a5709k1619J7856J5823Q639M775J052j6717j5158M3683L4798o5502l3236P6361
$$ -15709 -37328 -19472 -3649 4990 9765 10817 -5900 -21058 22625 57423 -8079 -41315 35046
140C5046K179q1000K5781N5467m8532j2746N8097k2087m5350L2848K0214k1412
$$ 35046 37225 -43775 -17994 37473 -11059 -23805 34292 12205 -33145 -297 19917 -1495
152a495R14p312k5577N367K3598J6564M5l6249j2615N8751K5634m8057j0704K7823
$$ -1495 -581 -7893 -33470 -28103 -4505 12059 12104 -24145 -36760 21991 47625 -432 -11136 16687
166A6687j2792j7505P274o95K210N976j5086q722J4075J5550J4496q387l6902
$$ 16687 3895 -13610 -6336 -7031 -4821 1155 -13931 -22653 -8578 6972 21468 13081 -23821
179b3821N328M3063j1928l1348K0853R805k2969P534J5022p672O478L509j7820
$$ -23821 -18493 24570 12642 -18706 2147 11952 -11017 -3483 11539 3867 10345 13854 -3966
192c966L819P804j5756P831J8043k3238j4305K2354r32p336K4387k595l3716N203
$$ -3966 -147 7657 -8099 -268 17775 -5463 -19768 2586 1654 -5682 18705 16110 -17606 -12403
206a2403K9506K357j5689q339Q241J0416j3136j0085K0635N536k4777k355R781
$$ -12403 17103 19460 3771 -4568 3673 14089 953 -9132 11503 17039 -7738 -10093 -312
219c12j0661N298J9529j4693j9977J3408J3058l418n002k659O710J383j8907O77
$$ -312 -10973 -5675 13854 -839 -20816 -7408 5650 2232 -2770 -5429 1281 2664 -16243 -15566
233a5566K8145j812k2431Q743R291j2082Q535J7007j3906j4265M410J547K571
$$ -15566 12579 10767 -11664 -2921 6370 -5712 2823 19830 5924 -8341 -3931 -2384 187
246A87L783n037j396m29p704R456J5717j2789j3712J3370J849j5780N969J3642
$$ 187 3970 -1067 -2463 -2892 -10596 -1140 14577 1788 -11924 1446 3295 -12485 -6516 7126
260G126l534o063k723K66J0705N679n910k161l814n717Q594P755j0944l397J0042
$$ 7126 3592 -2471 -5194 -4928 5777 11456 5546 3385 -429 -6146 2448 10203 -741 -4138 5904
275E904n240q801R112P632l752m941p201r13Q785J314k944K724m579o137R804
$$ 5904 664 -8137 975 8607 4855 -86 -7287 -8200 585 1899 -1045 1679 -2900 -9037 767
290G67P814o172o92J643q622j149R345R1m255J219k528j023M959M00J425L070
$$ 767 8581 2409 1717 3360 -5262 -6411 2934 3025 -1230 -11 -2539 -3562 1397 1797 3222 6292
306F292p297p619O053N285j216K76j836n516L047P074j329j679J341l546l887
$$ 6292 -1005 -8624 -2571 2714 1498 1774 -62 -5578 -2531 4543 3214 1535 2876 -670 -4557
321d557P39K721L920r4n760k512L212L216K638N42m732m456J479K616J191K413
$$ -4557 -3818 -1097 2823 2729 -3031 -5543 -2331 885 3523 4065 -667 -5123 -3644 -1028 163 2576
337B576m4k647o46J177L666M498k864o419j52p69k061L735M016m820n247K741
$$ 2576 2532 -115 -761 416 4082 8580 5716 -703 -855 -1624 -3685 50 4066 -754 -6001 -3260
353c260L470R11K580m70n887k905J621K197J673q12j719Q2J199J632L612M775
$$ -3260 210 1121 3701 3231 -2656 -5561 -3940 -1743 -70 -882 -2601 -2519 -1320 312 3924 8699
369H699j103o295j421L423J97j173J229k484n149N45N503J217r41m81k013l101
$$ 8699 7596 1301 -120 3303 3500 2327 3556 1072 -4077 -3532 1971 3188 2247 1766 -247 -3348
385c348Q01L335J016j847m994j117K938K404O03J720q21l038Q34L957K737p54
$$ -3348 -2547 788 1804 -43 -5037 -6154 -3216 -812 -209 1511 690 -2348 -1514 2443 5180 4426
401D426k003j623l32M7n67J296j065m369p32J300j174J593L339j019k632n68Q96
$$ 4426 2423 800 468 515 -52 1244 179 -4190 -4922 -3622 -4796 -3203 136 -883 -3515 -4083 -3187
418c187J867J515k246k540M85j046O54O253K384k720N26J110k75M334J105n154
$$ -3187 -1320 195 -2051 -4591 -4106 -5152 -4498 1755 4139 1419 1945 3055 2780 7114 8219 3065
434C065l241k225k353L022M345m607k033M287k12P24Q005q98q103J77J872k802
$$ 3065 -176 -2401 -4754 -1732 2613 -1994 -4027 260 48 772 8777 7879 -224 -47 1825 -977
450i77R55P45l807K36K261p62K664M400j708j947J173k071j851K312j071k455
$$ -977 -22 723 -3084 -2848 -587 -1349 1315 5715 4007 2060 3233 1162 -689 1623 552 -1903
466a903J37j291O63L593P30R28J656l762k854M888J384m810n35j135m086K537
$$ -1903 -1766 -3057 -2394 1199 1929 2857 4513 751 -2103 2785 4169 -641 -1176 -2311 -6397 -3860
482c860L088j984J919P58m490L451O439l209r35L129m867k382O484j353n248L162
$$ -3860 -772 -2756 -837 -79 -4569 -1118 5321 2112 1177 4306 -561 -2943 3541 2188 -3060 102
498A02o56m326L602L233k499K433K47n301L886L745o326p62M488n022k928M607
$$ 102 -554 -4880 -1278 1955 -544 1889 2136 -3165 721 4466 -1860 -2622 1866 -3156 -6084 -1477
514a477q05q93N617j747m566M141K082k115J809k809o151L070K913k961J812K201
$$ -1477 -2282 -3175 2442 695 -3871 270 2352 237 2046 -763 -6914 -3844 -931 -3892 -2080 121
530A21k441J431M648M20L13Ll324J097J363n684r07N040l045k559K867r20M64
$$ 121 -2320 -889 3759 4179 4492 4495 1171 2268 3631 -2053 -2960 2080 -965 -3524 -657 -1577 -1113
547a113O421j618n084J965K2j239M452j602o136M422K534m529M541N133p347j506
$$ -1113 5308 3690 -1394 571 593 -646 3806 2204 -3932 490 3024 -1505 3036 8169 822 -684
563f84N833l037r77L853n540l857N657j278l798N070k07n418L493K481l709L021
$$ -684 5149 2112 1135 4988 -552 -4409 1248 -30 -3828 1242 1035 -4383 -890 1591 -2118 903
579I03J918n885J376M579l583j109K222l091Q57L295m493j015M425j151n16L857
$$ 903 2821 -3064 -1688 2891 -692 -1801 421 -2670 -1813 1482 -3011 -4026 399 -752 -1268 2589
595B589k349l170M479J031k287K487k533n686M390M343k978n19j465l031N102
$$ 2589 240 -2930 1549 2580 293 2780 247 -5439 -1049 3294 316 -203 -1668 -4699 403
610D03M978n494k913K115k249J244L865l705k653L678m04O03M476k408l797M504
$$ 403 5381 -113 -3026 -911 -3160 -1916 1949 -1756 -4409 -731 -1135 -532 3944 1536 -2261 2243
626B243J58l084K847r88m852M062K632n418J279L830l470O22L299m193p38M105
$$ 2243 2401 -683 2164 1176 -3676 386 3018 -2400 -1121 2709 -761 -139 3160 -1033 -1771 2334
642B334l494k011N809j754m561L413J000j762L541n87n066J954L261j504J147
$$ 2334 -1160 -3171 2638 884 -3677 -264 736 -1026 2515 1928 -3138 -1184 2077 573 1720
657A720l05m184K325M174j192n71N04l776N16M205j147j974j28k491R16N058k491
$$ 1720 1415 -2769 -444 3730 2538 1967 2471 -1305 -789 3416 2269 295 167 -2324 -1408 3650 1159
674A159l908K928k5l171L555P0m306J721J942k163J835J697k850J193L014k765
$$ 1159 -2749 179 154 -3017 538 608 -3698 -1977 -35 -2198 -363 1334 -1516 -323 2691 -74
690g4L03K078l449o47M804j910l672L167j11j315K729r79l406K472M31k869K096
$$ -74 229 2307 -1142 -1789 3015 1105 -2567 600 489 -826 1903 924 -2482 -10 421 -2448 -352
707c52J127l968J186K913k780Q30L468l175j870L593o08q78K272j797j573L397
$$ -352 775 -3193 -2007 906 -1874 -1044 2424 -751 -2621 972 364 -514 1758 -39 -1612 1785
723A785m29j085K774j149l288K152K064l012L29N24k222P52J877k015L31J827
$$ 1785 1356 271 3045 1896 -1392 760 2824 -188 141 665 -1557 -805 1072 -943 -612 1215
739A215j586j09Q52k196N85K786k185j902K195L0n83K539n18j745J588l6j663
$$ 1215 -371 -480 372 -1824 -1239 1547 -638 -2540 -345 -315 -898 1641 1123 -622 966 930 -733
756g33K368J85l218J109J141k194J736J972k947n34J889j563n2K456j819k079
$$ -733 1635 1820 -1398 -289 852 -1342 394 2366 -581 -1115 774 -789 -841 1615 -204 -2283
772b283K009r95n70K762p86l011J671J407j892J680J338k157M11J622j410J048
$$ -2283 -274 -1269 -1839 923 137 -2874 -1203 204 -1688 -8 1330 -827 -416 1206 -204 844
788H44J987k113j404J853j307j10J764j028j721J745j40o32J326J44j575P24o49
$$ 844 2831 718 -686 1167 -140 -250 1514 486 -1235 510 370 -262 1064 1208 -367 357 -292
805b92j238J173O13j689M04P67j282J351J911n16l9J54j432J36J803r48j028J71
$$ -292 -1530 -357 256 -1433 -1029 -262 -1544 -193 1718 1202 1163 1317 -115 21 1824 876 -152 19
823A9o55l47K158N03j123Q64k88j682J401R41j800O5p83k005R99J923j024qR03
$$ 19 -636 -983 1175 1678 555 1419 1131 -551 850 1791 -9 56 -727 -2732 -1733 190 -834 -842 61
842F1j242q0J787M52q62J74j000j253J659R16n91O27p98r92J251J023k1J77p30
$$ 61 -1181 -1261 526 978 116 290 -710 -1963 -304 612 21 648 -150 -1142 109 1132 1111 1288 558
861E58j353J8R17k2l27k67j499m12J269J92N59P07j372n30J050P14J34O63r20
$$ 558 -795 -777 140 118 -209 -476 -1975 -2387 -1118 -926 -367 340 -1032 -1562 -512 202 336 999 79
880G9j696N45J066j94O31J65j166M81J358J59M76K85j615o04rj23J34M38p08j438
$$ 79 -1617 -1072 -6 -200 431 596 -570 -89 1269 1428 1904 2189 574 -30 -39 -162 -28 410 -298 -1736
900a736O95N54P37J053k25j378K45M71J9J90L47j466l58L82P08O86J023j82j113
$$ -1736 -1041 -487 250 1303 1078 -300 -55 416 435 625 972 -494 -852 -470 238 924 1947 1765 652
919F52J71L04N11l4k27j050j162K3M02O99M66o90j149J62O55Q11K7l94p71j312
$$ 652 823 1127 1638 1604 1377 327 -835 -812 -410 289 755 65 -1084 -922 -267 544 571 177 -594 -1906
939a906J29J328N43K27o45j104J94J395J195k45o99n27l30L45Q21J09o21p94l20
$$ -1906 -1777 -449 94 321 -324 -1428 -1234 161 1356 1111 412 -115 -445 -100 721 830 209 -585 -905
958i05k01O49Q86j35j417j57K15K55P11N97n36j100k57K32L61Q25L36r50n77M91
$$ -905 -1106 -457 429 294 -1123 -1280 -1065 -810 -99 498 -38 -1138 -1395 -1163 -802 23 359 -591 -1168 -677
978f77M60J105J056r22p28r67m3J461P09o13j334n29L88J118R18j29j405l9m56
$$ -677 -217 888 1944 1022 294 -673 -716 745 1454 841 -493 -1022 -634 484 1402 1273 -132 -171 -627
997f27K28J714l50j472n11L4r0J294J345j018j116J148l07l52J191M59j050m8
$$ -627 -399 1315 965 -507 -1018 -984 -1074 220 1565 547 -569 579 272 -80 1111 1570 520 472
1015D72k16k99J040N80l83l79n54p07P5J702P7j046j014m25J8J180J138q92j596
$$ 472 256 -43 997 1577 1194 815 261 -446 -371 1331 1408 362 -652 -1077 -1059 121 1259 367 -1229
1034a229j041J342R57L89K60j010j741N80K017N05k87m32j257k00J465Q66o96
$$ -1229 -2270 -928 29 418 678 -332 -2073 -1493 524 1029 742 310 -947 -1147 318 1184 488
1051D88n99q4q55J041M79p02M10K31j645o5J491l96k50M19r12p67L63J121j75
$$ 488 -111 -195 -1050 -9 470 -232 178 409 -1236 -1301 190 -206 -456 -37 -949 -1716 -1353 -232 -407
1070d07J170m48j655R2J342K78N20K54k161P6J620K35q8P58j358j242R12J009
$$ -407 763 315 -1340 -1248 94 372 892 1146 -1015 -939 681 916 828 1586 228 -1014 -102 907
1088I07k31M12j023j633Q58J155l62N24l99r66j93O02M22K84K11n82p46L18O43
$$ 907 676 1088 65 -1568 -710 445 83 607 208 -758 -951 -349 73 357 568 -14 -760 -442 201
1107B01O96N2l67k5o00m43J153J174p17r52Rr35M42K163o03j745m71R0%J673J83
$$ 201 897 949 582 557 -43 -486 667 1841 1124 172 181 -754 -312 1851 1248 -497 -968 -878 -878 795 978
1128I78j731n22J47l50J435J594j733j044R97n17k50K310l54j582M33J05n73J057
$$ 978 -753 -1275 -1128 -1478 -43 1551 -182 -1226 -229 -746 -996 1314 960 -622 -189 -84 -657 400
1146D00J082j185K6l62q24J040R95m63j111o1n66j89J733L32j122q16j13J74R87
$$ 400 1482 297 323 -39 -863 177 1172 709 -402 -463 -1029 -1218 515 847 -275 -1091 -1204 -1030 -43
1165d3L50Ro92r00N33J436L36k14k44p57l19O38J065N0k71j038n48R15M65k61
$$ -43 307 316 -376 -1276 -743 693 1029 815 571 -186 -505 133 1198 1248 977 -61 -609 306 771 510
1185E10M12l48j717M53J640j010m71J275j193j359J182N61o1Q36m72j440L64O41
$$ 510 922 574 -1143 -690 950 -60 -531 744 -449 -1808 -626 -65 -126 710 238 -1202 -838 -197
1203a97O23Q59k53j985k27J227L68L78J88j004q93P19J083l72Lk91r67j3N32M62
$$ -197 426 1285 1032 -953 -1180 47 415 793 981 -23 -916 -197 886 514 517 226 -741 -754 -222 240
1223B40K78o62r06j35O03K41M07M06q19p58M1Q14N41L66n70m27n4J6Q04R55q35
$$ 240 518 -144 -1050 -1185 -582 -341 66 472 -347 -1105 -1064 -250 291 657 87 -340 -394 -378 426 1381 546
1244E46n49k9k38O78P63m01o98n42j57N37Q91p0p72o63P0l81J058R66p24n74l11
$$ 546 -3 -32 -270 408 1171 770 72 -470 -627 -90 801 731 -41 -704 -634 -1015 43 1009 285 -289 -600
1265f00J56Q5J169K6r81j29J43J91J156Ro31l74P6m02P29P31o51p29k05k83K11
$$ -600 -444 -359 810 836 -145 -274 -131 60 1216 1225 594 220 296 -106 623 1354 703 -26 -231 -514 -303
1286c03R23j98l74n84o22K33O66M93J60q72m99O8N32O40p1J95o76l65N25J046
$$ -303 620 422 48 -536 -1158 -925 -259 234 394 -478 -977 -909 -377 263 192 387 -289 -654 -129 917
1306I17Jk24j66j024J83Q11L63j01q69p34O5O18K37P2K1j013o62P57J016j22n8
$$ 917 918 694 528 -496 -313 498 861 760 -109 -843 -778 -160 77 149 170 -843 -1505 -748 268 146 88
1327H8o00n31J23P21O68j09m47m86J45O76J44M39K45j151l94O75L86J42m74r5
$$ 88 -512 -1043 -920 -199 469 360 -87 -573 -428 248 392 831 1076 -75 -469 206 592 734 260 165
1347A65l72m22N74L45L58m47p12O1J57K97P33l12q47j78L26K33O18K52m13m38
$$ 165 -207 -629 -55 290 648 201 -511 -450 -293 4 737 425 -422 -600 -274 -41 577 829 416 -22
1367b2k02N00N70J59o01n92L26NJ43L80L01p82o07K22N21O3O3j26p92m90L16O43
$$ -22 -224 276 846 1005 404 -188 138 143 286 666 967 185 -422 -200 321 384 447 321 -471 -961 -645 -2
1389bK91l38k77l84k22L97Q18J83o63k92j74L54O95J28j64k97m88J01O61L21q6
$$ -2 289 -49 -326 -710 -932 -535 283 466 -197 -489 -663 -309 386 514 350 53 -435 -334 327 648 562
1410E62n14m56j74L85O09p9o11m69L8L3P54j20j97l23l98O2O18N85m0l49l02k0
$$ 562 48 -408 -582 -197 412 333 -278 -747 -709 -676 78 -42 -239 -562 -960 -898 -280 305 265 -84 -386 -406
1432d06M60M15L83l24m60J0O9K41O09j01p05l93p5L14J71J21m28o41p8L43K49
$$ -406 54 469 852 528 68 78 147 388 997 896 191 -202 -277 37 208 329 -99 -740 -818 -475 -226
1453b26L92Q2p43j77M03L09J62M31k77k97k01N28j07N08k2n96q9J13N03r2R6k64
$$ -226 166 248 -495 -672 -269 40 202 633 356 59 -142 386 279 787 765 169 80 193 696 604 700 436
1475D36o36J01K20N6J15j96p01p8J37K37L80j82k46k66K16N64o3P8j84l98o4N12
$$ 436 -200 -99 121 177 292 96 -605 -683 -546 -309 71 -111 -357 -623 -407 157 94 172 -12 -410 -474 38
1497C8M48j70k34J7o78O3J001J84n15j79l99r0M73J50k29J1m26K4J86N19k47l10
$$ 38 486 316 82 99 -579 -516 485 669 154 -25 -424 -514 -41 109 -120 -109 -535 -511 -325 194 -53 -363
1519c63J01k93n5J88P37m6m44N7r8J2L55M13m3m50k88m8Q51P0l16m85L04l19N07
$$ -363 -262 -555 -610 -422 315 269 -175 -118 -216 -204 151 564 521 71 -217 -265 586 656 340 -145 159 -160 347
1542C47M24l75o07p6M25l13J91M02o04m67K39R9K35J50j66J10l16P0J48K45N42
$$ 347 771 396 -211 -287 138 -175 16 418 -186 -653 -414 -315 -80 70 -96 14 -302 -232 -84 161 703
1563G03m71qj25R9k12O25Mo00K38J42j93n8N64l43j000J11M07J44k63K17l87j80
$$ 703 232 224 99 198 -14 611 615 15 253 395 202 144 708 365 -635 -524 -117 27 -236 -19 -406 -586
1585e86J49M25R6J21k59p17M01N80jq9L26m07j93O26R6m26L42R3m42j56J43LM1
$$ -586 -437 -12 84 205 -54 -771 -370 210 209 120 446 39 -154 472 568 142 484 577 135 -21 122 125 166
1608A66K3m48n44M17L50m20L37k40m77M00J95K32k23L68n41m7Q31J81k30L4p7
$$ 166 189 -259 -803 -386 -36 -456 -119 -359 -836 -436 -241 -9 -232 136 -405 -452 379 560 330 364 287
1629B87o16N19K93K71m99k26K5p0L54ql25j83j09o8L32J81n51M3M39n7n19M32
$$ 287 -329 190 483 754 255 29 54 -16 338 330 5 -178 -287 -355 -23 158 -393 -350 89 32 -487 -55
1651e5L24j04l54M12k68k87N50Q03p87m32M83l66L07K40l33k19K44k24j20O74
$$ -55 269 165 -189 223 -45 -332 218 1021 234 -198 285 -81 226 466 133 -86 158 -66 -186 488
1671D88k6r01L39J49m37M86L96o83l80O27m4n51N80j88j66P7K2K26K35J2n02M62
$$ 488 462 -439 -100 49 -388 98 494 -189 -569 58 14 -537 43 -145 -311 -234 -212 14 249 261 -241 221
1693B21p7k71K01L25q9k86J21k51K10J1q8J04k84l96M83N27n98N2K34m26L0J66
$$ 221 144 -127 74 399 310 24 145 -106 104 115 27 131 -153 -549 -66 461 -137 -85 149 -277 -247 -81
1715h1J02r5k53K6J99L58k38L22m97K15j43P10k14m22K90J28j50l7M27l83J91
$$ -81 21 -74 -327 -301 -102 256 18 340 -157 58 -85 625 411 -11 279 407 257 220 647 264 455
1736D55J16m60m06N48l26n5J93k20m62M80k4j16K0m7k09QN86j99J42K38k33N3
$$ 455 571 111 -295 253 -73 -128 65 -155 -617 -137 -161 -277 -257 -304 -513 -505 81 -118 24 262 29 82
1758H2J49L55m72K7j19qJ59q5J39J19l15o57O46l18m7K70Q6k97Q5j82J85J97n5
$$ 82 231 586 114 141 22 14 173 88 227 346 31 -626 20 -298 -345 -75 11 -286 -201 -383 -198 -1 -56
1781e6l13L14nQK82J53k90j89M40j39j91K70J19l83n5N6J89l7k54k04K13o5m3
$$ -56 -369 -55 -60 -52 230 383 93 -96 344 205 14 284 403 20 -35 21 210 173 -81 -285 -72 -137 -180
1804a80J73K49n90K01L2q9P6m3j44J16J3mK64K01o5l13M50L9k70M52m77J19j3
$$ -180 -7 242 -348 -147 -115 -204 -128 -171 -315 -199 -186 -190 74 275 210 -103 347 386 116 568 91 210 197
1827A97k2M9o7O5o5l87K25n9K27l1k98r0K76k37j14O08n76J14M6N3k76N25k21
$$ 197 175 224 157 222 157 -230 -5 -64 163 132 -166 -256 20 -217 -331 277 -299 -185 -139 -86 -362 163 -58
1850e8L33n46k8J77L33j47k42L04j72r0oN85m86j80L27j00p6J67j80j45J67k16
$$ -58 275 -271 -299 -122 211 64 -178 126 -46 -136 -142 443 -43 -223 104 4 -72 95 -85 -230 -63 -279
1872b79q3M25n41J03J36L7k44L65J08m4k7R2j28N2L71j92k8M03l77q9N14j99k21
$$ -279 -362 63 -478 -375 -239 -202 -446 -81 27 -17 -44 48 -80 -28 343 151 123 526 149 60 574 375 154
1895A54K48l00j33K16k9p2j5k41k27K29Q7p2O6j07n0j49K18M1R2J34l33m2M34
$$ 154 402 102 -31 185 156 84 69 -172 -399 -170 -83 -155 -89 -196 -246 -395 -177 -136 -44 90 -243 -285 149
1918A49MJ7QJ94k30J17j30J39J17k80m71M78R0k72J39j96r0L53q7j16k47L96m07
$$ 149 153 170 178 372 142 259 129 268 385 105 -366 112 202 -70 69 -127 -217 136 49 -67 -314 82 -325
1941c25M6K62n2j4N20m18k30L50m8M5j31J05l82L35J96j91J2L16l04n02K95J96
$$ -325 -279 -17 -69 -83 437 19 -211 139 91 136 5 110 -272 63 259 68 80 396 92 -410 -115 81
1963H1k30j67J65N0k6j88K94J7k04j08J07J64pk13L16k54K21J19k36K38J05j37
$$ 81 -149 -316 -151 -101 -127 -315 -21 -4 -208 -316 -209 -45 -52 -265 51 -203 18 137 -99 139 244 107
1985A07j56l9p8L95o7k08l9j2JJ39M80o97Q0j45j24K37K56K22o20j7M33l47J77
$$ 107 -49 -88 -166 229 162 -46 -85 -97 -96 43 523 -174 -94 -239 -363 -126 130 352 -268 -285 148 -199 -22
2008b2L12n31j45N20l6J63P8j07k80J64j68Q2K57l08J18J15J01m51N7K95k09k26
$$ -22 290 -241 -386 134 98 261 339 232 -48 116 -52 30 287 -21 97 212 313 -138 -81 214 5 -221
2030b21M3J15L1M8L7j70l48K7M13j15p4L86l85N5J76J13j19K64k99MO1J92J20
$$ -221 -178 -63 -32 16 53 -117 -465 -438 -25 -140 -214 172 -213 -158 18 131 12 276 -23 -19 42 234 354
2053C54l69J28k97jN72k01q0Ol92k39K55L85j22j97J66k73j47K13kK6R9k7J8R5
$$ 354 -15 113 -184 -185 387 186 106 112 -280 -519 -264 121 -1 -198 -32 -305 -452 -239 -241 -215 -116 -143 -125 -30
2077c0L47k40r2K49q5k07L17R5j91L32l82m34K27M60j28k09O5j72l22L12L93m89
$$ -30 317 77 -15 234 149 -58 259 354 163 495 113 -321 -94 366 238 29 94 -78 -400 -88 305 -184
2099a84l70N50k39K72L42l84k50J68q3P0K38J90l21R9O9KM8QJ06m30J44j70o6
$$ -184 -554 -4 -243 29 371 -13 -263 -95 -178 -108 130 320 -1 98 167 169 217 225 331 -99 45 -125 -191
2122a91K31N7j73K4j97J58n1L84k29k15J26j99K39L02j25l03p7J48J56J21Q4k05
$$ -191 40 97 -76 -52 -249 -91 -142 242 13 -202 -76 -275 -36 266 141 -162 -239 -91 65 186 270 65
2144F5j50O1K23p7J73j57k57m5J42K45m94L36P6m39m8O47m93Q6K32l43N4J20M
$$ 65 -85 -24 199 122 295 138 -119 -164 -22 223 -271 65 141 -298 -346 301 -192 -106 126 -217 -163 -43 -39
2167c9k18K88K7l73O1N4L53K5Nk56L0J88m6K56j09j16l80K39L04j69K90p8j77
$$ -39 -257 31 58 -315 -254 -200 153 178 183 -73 -43 145 99 355 246 130 -250 -11 293 124 414 336 159
2190A59k41J83L4J78l99o0n6J27j30M08l39j79Q9K7j67L88m9j3j03j32Q7K00L46
$$ 159 -82 101 135 313 -86 -146 -202 -75 -205 203 -136 -315 -226 -199 -366 22 -27 -40 -143 -275 -188 12 358
2213C58M6l42L0j57L8L87k6n20K55l77r4M66P0m12k38J97O1J96j8k8l02R2K48
$$ 358 404 62 92 -65 -27 360 334 -186 69 -308 -402 64 134 -278 -516 -319 -258 -62 -80 -108 -410 -318 -70
2236g0J10L49j93j05o7J27J47Q2m8m2k48M25n08K27J96m43k6L6j01J35K41k50
$$ -70 40 389 196 91 24 151 298 380 332 290 42 467 -41 186 382 -61 -87 -51 -152 -17 224 -26
2258b6j7J28k86K4K44M5j8j29J3l21M40k19P8J97m7n21L31J80j90M31j75l96J56
$$ -26 -43 85 -201 -177 67 112 94 -35 -22 -343 97 -122 -44 153 106 -415 -84 96 -94 337 162 -234 -78
2281g8J69J09k33J01j89j94K63K1J11kl10O3L0l2L8M86r4k37j76J89l8M64j47
$$ -78 91 200 -33 68 -121 -315 -52 -31 80 78 -232 -169 -139 -171 -133 353 259 22 -154 35 -3 461 314
2304C14l01m0J75j5k5J17k81J2R4J19L7K41m88n2k22M53j29N7j59k13r5L00r8
$$ 314 13 -27 148 133 108 225 -56 -44 50 169 206 447 -41 -93 -315 138 9 66 -93 -306 -401 -101 -199
2327a99M62l8l56o8q1K03N5L39o06Q5M30m35K47K40l65k4J6Q5J68L05k94N0k32
$$ -199 263 225 -131 -199 -280 -77 -22 317 -289 -204 226 -209 38 278 -87 -111 -95 -10 158 463 169 219 -13
2350a3J94l27L46J1k87R5l0j82R1L78k79O3j40p0r4L94pq7j1j68N7M16k02n0J89
$$ -13 181 -146 200 211 -76 19 -11 -193 -102 276 -3 60 -80 -150 -244 150 143 56 45 -123 -66 350 148 98 287
2375B87l82J49J27J37m20L21j49l57J14M19k84N9j25KM9m2J78o7K2j45l29L15
$$ 287 -95 54 181 318 -102 219 70 -287 -173 246 -38 21 -104 -102 -53 -95 83 16 38 -107 -436 -121
2397a21J05j51K17m1o1R4K78m66M55k53j11K1M47k76J95l2m11j19K44K1M9P7p8
$$ -121 -16 -167 50 9 -52 42 320 -146 309 56 -55 -34 413 137 332 300 -111 -230 14 35 84 161 83
2420H3o78O50k05K44K5j96k52K27K92l80J96K46l85r7L70r6k1L98k62m16L53R8
$$ 83 -595 55 -150 94 119 -77 -329 -102 190 -190 6 252 -133 -230 140 44 23 421 159 -257 96 194
2442A94l04K30J05o39N43l17K23rJ93n80J24R8J51J7j18mO7j54L48lj20M4j68
$$ 194 -110 120 225 -414 129 -188 35 26 219 -361 -237 -139 12 29 -89 -93 -26 -180 168 165 45 89 -79
2465g9K16k11J01J34J23m08L49k54j64N65j21j16j26po6K68j83k3j65Q3j5M3L27
$$ -79 137 -74 27 161 284 -124 225 -29 -193 372 251 135 9 2 -64 204 21 -2 -167 -84 -99 -56 271
2488B71k44k77J8J59r0J49K33k13Q1l9ML00k37j51J22J19m19M00n5j25Q0J7k28
$$ 271 27 -250 -232 -73 -163 -14 219 6 87 48 52 352 115 -36 86 205 -214 186 131 6 86 103 -125
2511a25J07J84j59j48Q2j79q6J77P7o5Q1k32n4M50l4P0k90J84NO1R4l01P9j78
$$ -125 -18 166 7 -141 -59 -238 -324 -147 -70 -135 -54 -286 -340 110 76 146 -144 40 45 106 200 -101 -22 -200
2535b00j30L50J13k6J68K0k52n9L6J5K2Pl26J84M6k00M27j9m29M5l6j14N11k75
$$ -200 -330 20 133 107 275 295 43 -16 20 35 57 64 -262 -78 -32 -232 195 176 -253 -208 -244 -358 153 -122
2559a22k7j54J70P0O3K30k31j28M00l99K79n4rl1j95J34Q1N9j09k6J4j69K25l5
$$ -122 -149 -303 -133 -63 0 230 -1 -129 271 -128 151 97 88 57 -138 -4 77 136 27 1 15 -154 71 36
2583C6J69l01rl04K58K78j95K32j13j12p4L09k%j20K2k22L02R5k10R1K0j77k95
$$ 36 205 -96 -105 -409 -151 127 -68 164 51 -61 -135 174 172 172 52 74 -148 154 249 39 130 150 -27 -322
2607c22M14k60J90m2l7j80J86j13n0k2R4q2j32M52j6j32j22L0J48k38N21j31j83
$$ -322 92 -168 22 -20 -57 -237 -51 -164 -214 -236 -142 -224 -356 96 80 -52 -174 -144 4 -234 287 156 -27
2630b7K0Q4p6K3L53j57m10Q6M4p9K74j7k46K0Q6M7k15K34j16k2j03r7L67j11L1
$$ -27 -7 77 1 24 377 220 -190 -104 -60 -139 135 118 -128 -108 -22 25 -190 44 -72 -94 -197 -294 73 -38 -7
2655gp4o3J91j27K03K8M3Pl45K38k91L56r6j69K01k58mL05rl71J39J30j62J68
$$ -7 -81 -144 47 -80 123 151 194 201 -144 94 -197 159 63 -106 95 -163 -167 138 129 -242 -103 27 -135 33
2679C3L3j14j5%NK49k67K92m04L8K80o3J23j49j28M6J27j01K20j66p9P5o4j21
$$ 33 66 -48 -63 -63 -58 191 -76 216 -188 -150 130 67 190 41 -87 -41 86 -15 205 39 -40 35 -29 -150
2703a50K23o2J24l66J11j26J30j02L32J11m41K03k27J65J77m5J63j27P3j12J88
$$ -150 73 11 135 -231 -120 -246 -116 -218 114 225 -216 -13 -240 -75 102 57 220 93 166 54 242
2724B42O3k81J28k36J26L55j41k80K5J09M5M6k21K03k41K69j77j01l5N9K12j53
$$ 242 305 24 152 -84 42 397 256 -24 1 110 155 201 -20 183 -58 211 34 -67 -102 -43 169 16
2746A6p4j87M22j74m2R1l51M20LJ78J57k93J01j88k62L06j22J80j78j75L8J40
$$ 16 -58 -245 177 3 -39 52 -299 121 124 302 459 166 267 79 -183 123 1 181 3 -172 -134 6
2768FJ69k4k03j47K44j08O6K03j56k98P6N3K0K7P2l67K19J53j2j09L34l39j0K05
$$ 6 175 151 -52 -199 45 -63 3 206 50 -248 -172 -119 -99 -72 0 -367 -148 5 -7 -116 218 -121 -131 74
2792G4j07K0O0o7N0M2J35o0m9j16R3j38R3P0L59l82lk36J34N2m4r5J76j89J61
$$ 74 -33 -13 47 -20 30 72 207 147 98 -18 75 -63 30 100 459 77 74 -162 -28 24 -20 -115 61 -128 33
2817C3k60J95J66j6J28j54R6l57K75k3J48j99j48M7J45P2K3m56K64L3r0J37j96
$$ 33 -227 -32 134 118 246 92 188 -169 106 83 231 32 -116 -69 76 148 171 -285 -21 12 -78 59 -137
2840a37J10J77j30r9k86K44J01l3J21j65k13K87J21k37M4j70L42J44j99l7K58
$$ -137 -27 150 20 -79 -365 -121 -20 -53 68 -97 -310 -23 98 -139 -95 -265 77 221 22 -15 243
2861B43q0j04N2j19j52O9k8N9Q3qk59N9J06O0J75j50n5n5k04Q3K86j6J29Rj19
$$ 243 163 59 111 -8 -160 -91 -119 -60 23 15 -244 -185 -79 -19 156 6 -49 -104 -308 -225 61 45 174 183 64
2886F4l0J12j42O6l2k95M47j49k3J42j7j67j00J52o1j20O7J9j93K13j27J34N9
$$ 64 34 146 4 70 38 -257 190 41 18 160 143 -24 -124 28 -33 -153 -86 -67 -260 -47 -174 -40 19
2909A9m0k35K2n2J74K32l85J80K38l54M18k52J81j54l4K25j15Q9j00j57Q1p4J94
$$ 19 -21 -256 -234 -286 -112 120 -265 -85 153 -201 217 -35 146 -8 -42 183 68 157 57 -100 -19 -93 101
2932A01j93K31j39J6N8j33J18k10J03J36j34j10K29r3J13o2N6j62J66K33l20k44
$$ 101 -92 139 0 16 74 -59 59 -151 -48 88 -46 -156 73 -20 93 31 87 -75 91 324 4 -240
2954b40L90J27j44M3k68N7J40j22j46M07l98J86J9k62K06j15j55O6M42j91k16
$$ -240 150 277 133 176 -92 -35 105 -17 -163 244 -154 32 51 -211 -5 -120 -275 -209 233 42 -174
2975a74l1N12m49L46j80j05K35k84R7J31J43j17j03J21r7p2K16j72m6Q8j94J79
$$ -174 -205 307 -142 204 24 -81 154 -130 -33 98 241 124 21 142 45 -27 189 17 -29 59 -135 44
2997D4J58J9k37J3l49J82K42j38J04O2m0K4j21J05k57M46j28j20p0J71K2j98j23
$$ 44 202 221 -16 -3 -352 -170 72 -66 38 100 60 84 -37 68 -189 257 129 9 -61 110 132 -66 -189
3020a89L28j85L0J07j82r7J98L43j45l54K41k38K05l27K65l43L98l62J95j05J63
$$ -189 139 -46 -16 91 -91 -188 10 353 208 -146 95 -143 62 -265 0 -343 55 -307 -112 -217 -54
3041e4J71j12j56R9J88k22Q7j7K54k00q2j27J69q5K10j91m8o1N7J61r2K55o9j85
$$ -54 117 5 -151 -52 136 -86 1 -16 238 38 -44 -171 -2 -87 123 -68 -116 -177 -120 41 -51 204 135 -50
3065e0J10P8k86K70r2P1k0l17K62K0j12J41j8j14J94Q5j90rk44K58Q2n0j47QK77
$$ -50 60 138 -148 122 30 101 81 -236 26 46 -66 75 57 -57 137 222 32 23 -221 37 119 69 -78 -70 207
3090B07k16j49K02j1k6j88K86k25K09M7J19k65M8l2o2L20m54L47j39O7M6j08l
$$ 207 -9 -158 44 33 7 -181 105 -120 89 136 255 -10 38 6 -56 264 -190 157 18 85 131 23 20
3113B0q4J81o9o3J14j99L91j60k60L7J34j46J97k76Rp5M4J44o0j21J60n2O9k13
$$ 20 -64 117 48 -15 99 -100 291 131 -129 -92 42 -104 93 -183 -174 -249 -205 -61 -121 -242 -82 -134 -65 -278
3137b78J96j12L12k30L23l00j19L00o1N9p3l3R4j52M9j00K91j71j51J56J81R0
$$ -278 -82 -194 118 -112 211 -89 -208 92 31 90 17 -16 78 -74 -25 -125 166 -5 -156 0 181 271
3159B71m00K92j53P8J52l14N8j28nJ87P5k5p3r8l6J49J7q5j23K18j96j26L29j97
$$ 271 -129 163 10 88 240 -74 -16 -144 -149 38 113 88 15 -83 -119 30 47 -38 -161 57 -139 -265 64 -133
3183a33K71j22j85J27K21j56J71l82J64L8r5J39k67j59M10J02m06L76k31K44l72
$$ -133 138 16 -169 -42 179 23 194 -188 -24 14 -81 58 -209 -368 42 144 -262 114 -117 127 -245
3204b45O3J4M2K72j44J69l55J77j55L19n7P0L2m59L01k25M62n27J32J34m5K24
$$ -245 -182 -168 -126 146 2 171 -184 -7 -162 157 100 170 202 -257 44 -181 281 -246 -114 20 -25 199
3226A99k54R8k7j01N3J04j6k68J28J1Q9J41k52J88k98K53Mj64M2J65M5j05k86
$$ 199 -55 43 16 -85 -32 72 56 -212 -84 -73 16 157 -95 93 -205 48 52 -112 -70 95 140 35 -251
3249b51M03M9K3j04m8j39O4j18J14j87l8K13Q6J9j42J83k01J77m51L64q6j88L10
$$ -251 152 201 224 120 72 -67 -3 -121 -7 -194 -232 -19 67 86 -56 127 -74 103 -348 16 -70 -258 52
3272E2J3J54l48r3J44L8lK61j11k47J10K53r5j14K0Mp9L39l19J21j52J65j34n
$$ 52 65 219 -129 -222 -78 -40 -43 218 107 -140 -30 223 128 14 34 38 -41 298 -21 100 -52 113 -21 -26
3296b6m5J6J87j36Km7LM9M1q5Jn4lR3j1N8K17k09o3J40p1p7K55k88n4J7K27lJ35
$$ -26 -71 -55 132 -4 -2 -49 -46 3 44 -41 -40 -94 -97 -4 -15 43 260 51 -12 128 57 -20 235 -53 -107 -90 137 134 269
3325B69l45J76O0k76k51N01q6j96J01J46j23N5J96k56J90j25q2K23k18J11j13
$$ 269 -76 100 160 -116 -367 134 48 -148 -47 99 -24 31 227 -29 161 36 -46 177 -41 70 -43
3346d3L97l62j85J58m7Q1J88k15j46L24l06Q7l6NJ96j65K77l42l86K54L35j52
$$ -43 354 -8 -193 -35 -82 -1 187 -28 -174 150 -156 -69 -105 -100 96 -69 208 -134 -520 -266 69 -83
3368h3L76k74j29J41J77k29R1k98K34K27k24J2K3l5o9J92j7n4p0K4R5j65p4m1
$$ -83 293 19 -110 31 208 -21 70 -228 6 233 9 21 44 9 -60 132 115 61 -9 15 110 -55 -129 -170
3392a70Q6N0n9j32L29M9m55L03N6k7j39L3O1j24K54m6L4j3j15O0L7j65J92q1L6
$$ -170 -84 -34 -93 -225 104 153 -302 1 57 30 -109 -76 -15 -139 115 69 103 90 -25 35 72 -93 99 18 54
3417E4J31k16K6J58q8j36j53K77j30J69l21K13j44J70O5l78M93j85J42j72j95
$$ 54 185 -31 -5 153 65 -71 -224 53 -77 92 -229 -16 -160 10 75 -303 190 5 147 -25 -220
3438b20k4M74k83m5J73j12K45q1m9O8p4j29P4N1J0k48J60n1rL74k58k16R3J03
$$ -220 -244 230 -53 -98 75 -37 208 127 78 146 72 -57 17 68 78 -170 -10 -61 -70 304 46 -170 -77 26
3462B6j85M1p7L23K23l34K3L66m04j29M6J02n1J08l1N8K12k93K4K7l02M40j51
$$ 26 -159 -118 -195 128 351 17 40 406 2 -127 -81 21 -30 78 47 105 317 24 48 75 -227 213 62
3485F2j44L65j09j83NR8k17NJ46j64K81k43P8k7k8J69j84KL5PK36j87k69L60J02
$$ 62 -82 283 174 -9 -4 94 -123 -118 28 -136 145 -98 -20 -47 -75 94 -90 -88 -53 -46 190 3 -266 94 196
3510A96j6m37L57r8n3N6r7K04j49O6r4J03o7l8m6L30l85J69j18J55j35j05M10
$$ 196 180 -257 100 2 -51 5 -92 112 -37 29 -65 38 -29 -67 -113 217 -168 1 -117 38 -97 -202 208
3533B08k73R4J88k13J46j92O4K62k60l18J52J16Kj18K18L3J95m28K52j20j02j0
$$ 208 -65 29 217 4 150 -42 22 284 24 -294 -142 -26 -24 -142 76 109 304 -124 128 8 -94 -104
3555a04K31k29PJ56p3J06j17l00J50L52k15Q3j97P7oK27q3k4J24k77J09N1K8q7
$$ -104 127 -102 -95 61 -12 94 -23 -323 -173 179 -36 47 -150 -73 -79 148 65 41 165 -112 -3 48 76 -11
3579a1j6L3J75j97J20l01J11L76q5k79j3p2J32p1K14j70kN9m3k45K22j94K20N6
$$ -11 -27 6 181 -16 104 -197 -86 290 205 -74 -87 -159 -27 -98 116 -54 -56 3 -40 -285 -63 -257 -37 19
3603A9q6J25oj88J5J01J62m9j55P2j76J1P5P5p9K67n90O08k18j61M49m45J73r0
$$ 19 -67 58 52 -136 -121 -20 142 93 -62 10 -166 -155 -80 -5 -84 183 -407 201 -17 -178 271 -174 -1 -91
3627i1R7r8K85j82m4l6j2K79k44J02K04l02K32m34L80l7o0k1j83L07k98K35J62
$$ -91 6 -92 193 11 -33 -69 -81 198 -46 56 260 -42 190 -244 136 99 39 18 -165 142 -156 79 241
3650B41pl40O4P2k53j10L51l7L9j44J72q8O1K9m8lO3jJ65k02q0m0Q5k39K7L84
$$ 241 234 -106 -42 30 -223 -333 18 -19 20 -124 48 -40 21 50 2 -1 62 61 226 24 -56 -96 -11 -250 -223 161
3676A61p4Q3k87K2l9R9j11L89k61m2o1j59J15J73q7J50j76J72o5j48j9K57lM7
$$ 161 87 170 -117 -95 -134 -35 -146 243 -18 -60 -121 -280 -165 8 -79 71 -105 67 2 -146 -165 92 89 136
3700A36k06O1j53l2J19K47j04O8k70M2R2m5n2k00Q3P3M28n11L94j03j51L5K3J28
$$ 136 -70 -9 -162 -194 -75 172 68 136 -134 -92 0 -45 -97 -297 -214 -141 287 -224 170 67 -84 -49 -26 102
3724A02k59P7R8P0k17K90l50K55J13j86Q9k46M29m24J03J17L1L6j46j83p5L16
$$ 102 -157 -80 18 88 -129 161 -189 66 179 -7 82 -164 265 -159 -56 61 92 128 -18 -201 -276 40
3746D0q8o0J74j02mO3pJ00j33j10K9l3K9NK20r0j93L50m53J90J68k52J06Q4P9
$$ 40 -48 -108 66 -36 -40 23 16 116 -17 -127 -98 -131 -102 -97 123 33 -160 190 -263 -73 95 -157 -51 33 112
3771A12k30r4L49j71O4Lr4J48Q3l16N7L03j36j12k7K35j77O3k81J33k8P7Q8j99
$$ 112 -118 -212 137 -34 30 33 -61 87 170 -146 -89 214 78 -34 -61 174 -3 60 -221 -88 -116 -39 49 -150
3795a50K02k24K15k82M49r7K3j01K19l5r1J3k71J68J13k08J11nr5J72l50K79j17
$$ -150 52 -172 43 -239 210 113 136 35 254 219 128 141 -130 38 151 -57 54 49 -46 126 -224 55 -62
3818f2K44j08k14K32k43pJ08L5J25j01j16k9J70L9J5l8J35k62Kj63P4K05j40J
$$ -62 182 74 -140 92 -151 -158 -50 -15 110 9 -107 -136 34 73 88 50 185 -77 -75 -238 -164 41 -99 -98
3842i8J42kQ8k24K32m00K39M3j13Q5j62L4M15m53K56K12n84L41m2K25r0l07L47
$$ -98 44 42 130 -94 138 -262 -23 20 -93 -8 -170 -136 279 -174 82 294 -290 51 9 234 144 -163 184
3865A84k17l5J58k57J63r1J56k12J76o5j58J9K30l6R7j63J85k46J6R9M6J53k66
$$ 184 -33 -68 90 -167 -4 -95 61 -151 25 -40 -198 -179 51 15 112 -51 134 -112 -96 3 49 202 -64
3888f4J78j97J70k40J13R9m1J1M4O6j27O8l55J36q9L06l0l31L49k81J78J77j03
$$ -64 114 -83 87 -153 -40 59 18 29 73 139 12 80 -275 -139 -228 78 48 -283 66 -215 -37 140 37
3911C7j67n8J5L40j14K11k81j14J92q0O3K1p3J66k28L59q5m28L80r3%k08K09m2
$$ 37 -130 -188 -173 167 53 264 -17 -131 61 -19 44 65 -8 158 -70 289 204 -224 156 63 63 -145 64 22
3935B2P1k33M00k58k16L26k71K72o1k75K21j95J97K1q8K02j52N3k44R9L11l82
$$ 22 93 -140 260 2 -214 112 -159 113 52 -223 -2 -197 0 21 -67 135 -17 36 -208 -109 202 -180
3957a80K70j02j30K10j62L32k04J05j71J35j53P4j87K6J53K5m8k62N45k39kp2
$$ -180 90 -12 -142 68 -94 238 34 139 -32 103 -50 24 -163 -137 16 41 -7 -269 276 37 35 -37
3979c7Q7p7j43J66P4r8r6K44J8k39l3J93J10j05j9J85l06J76j18n0J07LJ7m09
$$ -37 50 -27 -170 -4 70 -28 -124 120 138 -101 -134 59 169 64 45 230 -76 100 -18 -68 39 42 59 -350
4003c50J75K53j46K51N0k96J95m6p5QP6l1j00J33J2j48q9P5o4K65k56p8K60p5
$$ -350 -175 78 -68 183 233 -63 132 86 11 19 95 64 -36 97 109 -39 -128 -53 -117 148 -108 -186 74 -1
4027ap3n9Q7J85j43K1J08q2j85Q9NJ29j75K02po3kk57K0J38J5N9J7N7j6k20K85
$$ -1 -74 -133 -46 139 -4 17 125 43 -142 -53 -48 81 -94 108 101 38 36 -221 -201 -63 -48 11 28 85 69 -151 134
4054A34l10j15L76k57J93n8j13P0j5L75l1k0k2l20J45j17K99j30k02K82k83J48
$$ 134 -176 -291 85 -172 21 -37 -150 -80 -95 280 249 229 207 -113 32 -85 214 84 -118 164 -119 29
4076B9P1k97J51K09j19j91P8Q7L4L0o6p1K32n0K3j47N7j10M5k63K25j72K73R9
$$ 29 100 -197 -46 163 44 -147 -69 18 52 82 16 -55 177 127 150 3 60 -50 -5 -268 -43 -215 58 157
4100A57m9k87J38L4j41J18P1r8J70j20m8L76k68n9o0P2M4J1O8R3k21j25M1K28
$$ 157 108 -179 -41 -7 -148 -30 41 -57 113 -7 -55 321 53 -6 -66 6 50 61 129 222 1 -124 -83 145
4124A45k58J69O4q5o2L3j47M20m14o2J80j35K50o8j53J6J90l20K60k07Q0J10j
$$ 145 -113 56 120 35 -27 6 -141 279 -135 -197 -17 -152 98 30 -123 -107 83 -237 23 -184 -104 6 5
4147EO2j3m6M1n3N3P0O7j35k18L89r0k20K00q2K26k49p2M8m03L73J24O5l1k02
$$ 5 67 54 8 49 -4 49 119 186 51 -167 222 132 -88 112 30 256 7 -65 -17 -420 -47 77 142 111 -91
4172i1L0j5J33o5k55J74R1R1j21j8K22k69J49j34K6K33K5j08r6J85m4r3K17k97
$$ -91 -61 -76 57 -8 -263 -89 2 93 -28 -46 176 -93 56 -78 -52 181 206 98 2 187 143 50 267 -30
4196c0j0k43L62m5K7J05k52K94l65J73j71K96P7k24n1k20M96j86K23m5m3j5k81
$$ -30 -40 -283 79 34 61 166 -86 208 -157 16 -155 141 218 -6 -57 -277 219 33 256 211 168 153 -128
4219a28K41l6J2o4L8o7R0j00J59k59J02L5J06j90J15R0o2Kj70L5Q4L2j79K33j06
$$ -128 113 77 89 25 63 -4 86 -14 145 -114 -12 23 129 -61 54 144 82 84 -86 -51 33 65 -114 119 13
4244A3j38J05o1j78K56n8j45L53k60o1J66P6j82j3J09r9L57k36R7j26M7j8k13
$$ 13 -125 -20 -81 -259 -3 -61 -206 147 -113 -174 -8 68 -114 -127 -18 -117 240 4 101 -25 22 4 -209
4267b09M9J78O2O8N8j40l4J25k70J05r1K13k44k4R4J02M4o5K94k34J78l33J59
$$ -209 -160 18 80 148 206 66 32 157 -113 -8 -99 114 -130 -154 -60 42 86 21 315 81 259 -74 85
4290H5j64J85o3k92K28K52k5p8j85J67j14K4L2m7K56j00O2k20R8j50j76L66j69
$$ 85 -79 106 43 -249 -21 231 206 128 -57 110 -4 20 52 5 261 161 223 3 101 -49 -225 141 -28
4313b8J2m4K60k95M9l0m4j35O20l38k6q9N6n8j36L19k73J75Q4l0r7r0K21j45j06
$$ -28 -16 -60 200 -95 -46 -76 -120 -255 365 27 1 -88 -32 -90 -226 93 -180 -5 79 49 -48 -138 83 -62 -168
4338a68q5L61j22qJ83l22J59o7q0M04l15k4J58k44J33P5j02j13O7K39l11PL56
$$ -168 -253 108 -14 -22 161 -161 -2 -69 -149 255 -60 -84 74 -170 -37 38 -64 -177 -110 129 -182 -175 181
4361A81k65n8J29k53L54k61Q8K4k26L16p5J92j66p9J42l4J04k96j7J73K94k36
$$ 181 -84 -142 -13 -266 88 -173 -85 -61 -287 29 -46 146 -20 -99 43 9 113 -183 -200 -27 267 31
4383C1J04j21j06L53l88J4M9J04j6J3o3K80J1k80Ql6K7j17K13j44o9p8M3K44j75
$$ 31 135 14 -92 261 -127 -113 -64 40 24 37 -26 254 265 -15 -7 -43 -16 -133 80 -64 -133 -211 -168 76 -99
4408i9K58j47j81L15p7R4lj97L0l3K10k05J86Ll03M78k05j03l18K64J27j24j08
$$ -99 159 12 -169 146 69 163 160 -37 -7 -40 170 -35 151 154 -149 329 124 21 -297 -33 94 -30 -138
4431a38o8L43j7n9j82L3l3Q1J1J84j2J8k2k38J55P0j63pJ87j49P9k46J26k6L8
$$ -138 -206 137 120 61 -121 -88 -121 -40 -29 155 143 161 139 -99 56 126 -37 -44 143 -6 73 -173 -47 -73 -35
4456c5J13j25M3J43j33M7J07r8p2j24P1J36k49J81m1J15Nj68J71j40J08J43k96
$$ -35 78 -47 -4 139 6 53 160 62 -10 -134 -63 73 -176 5 -36 79 84 -84 87 -53 55 198 -98
4479i8J77m2L10l81L43k63k38K71j37J80k05o6K25J67k53j69K12j48j5J35k38
$$ -98 79 37 347 -34 309 46 -192 79 -58 122 -83 -149 76 243 -10 -179 33 -115 -130 5 -233
4500b33J33J60r0k01L12j14j75N17m01L69j33j27P1k07Q7P8J44j85j38j5K03j19
$$ -233 -100 60 -30 -231 81 -33 -208 309 -92 277 144 17 88 -119 -32 46 190 5 -133 -148 55 -64
4522f4l8J00n9j84K79J37l09K06j73L29j50n3O1N3q6p2j8Q4M2k93N8J51M4l3j69
$$ -64 -102 -2 -61 -245 34 171 -138 68 -105 224 74 21 82 135 49 -23 -41 43 85 -208 -150 1 45 12 -157
4547a57K36k06M36l25J48k06R9N3j31n6K4J20J0j44l5K14j15k27M11o7j17J99
$$ -157 79 -127 309 -16 132 -74 25 78 -53 -109 -85 35 45 -99 -134 80 -35 -262 149 82 -35 164
4569A64l10K68m3J19l96K99L3k09J93k00P8Q3J4j82J94J48l56L21k90j6P9M8j08
$$ 164 -146 122 79 198 -198 101 134 -75 118 -82 -4 79 93 -89 105 253 -103 218 -72 -88 -9 39 -69
4592f9J42j40K2ok06J0K23O7l0r3RK11k57J96Oo1k54K39k99L97j40k0k0K27k16
$$ -69 73 -67 -45 -51 -257 -247 -24 43 13 -80 -71 140 -117 79 85 24 -230 9 -290 107 -33 -53 -73 154 -62
4617f2O0k2m7J31l25K51m5l07O6L92j49J38J09j41j71K01j43r1N0o7J11O4K11
$$ -62 -2 -24 -71 60 -265 -14 -59 -366 -300 92 -57 81 190 49 -122 79 -64 -155 -105 -172 -61 3 214
4640B14l63M05l10m9k7J86j26j34K12J48j87P4rp9m2j4K20j53J71j14J17j07J11
$$ 214 -149 256 -54 -103 -130 56 -70 -204 8 156 -31 43 34 -45 -87 -101 119 -34 137 23 140 33 144
4663A44N4k41N5o9mM4K00m30Q5J74m37L00L11k97L8J62j02j03N6%p8J70K8o0J05
$$ 144 198 -43 12 -57 -61 -17 183 -247 -162 12 -425 -125 186 -111 -73 89 -13 -116 -60 -60 -138 32 60 0 105
4688A05j13l2J90j67N5J2R2m22J45M5LJ7q4K76l33L33O9l62J29r6P2p6J87N0P4
$$ 105 -8 -40 150 -17 38 50 142 -280 -135 -90 -87 -70 -154 122 -211 122 191 -171 -42 -138 -66 -142 45 95 169
4713A69j26j59J94k75O1K17k38J96k58MJ26J02j3Q4j4j58j3r4J79j74J41j77J96
$$ 169 43 -116 78 -197 -136 81 -157 39 -219 -215 -89 13 0 84 70 -88 -101 -195 -16 -190 -49 -226 -30
4736c0K80m28M90j78k49N8J17O8j57K08k78K91l21O2P6J82k02k15J48R4k55K80
$$ -30 250 -178 312 134 -115 -57 60 128 -29 179 -99 192 -129 -67 9 191 -11 -226 -78 16 -239 41
4758D1p6J08qP6j34r3J18j4j16J4J26J96p4j61n2p9L58q0j66L5j49K34M2p4O7
$$ 41 -35 73 65 141 7 -86 32 18 -98 -84 42 238 164 3 -49 -128 230 150 -16 19 -130 104 146 72 139
4783A39k68J58L8j80K37k58L15j50j92L0K80j20o2N2m3L85k22j32J96j20j56j48
$$ 139 -129 29 67 -113 124 -134 181 31 -161 -131 149 29 -33 19 -24 361 139 7 203 83 -73 -221
4805b21L84o1J26m19K38m0K7l7k8K2j9j3Q0p0K16l40qJ41j06K60j34l95N94j11
$$ -221 163 102 228 -191 47 7 34 -3 -31 -9 -28 -41 39 -31 185 -155 -163 -22 -128 132 -2 -397 197 86
4829H6MJ26q7o7j97J97j89M43m55L04j41j12J03j39qM10j55r0J67m70K36O4j27
$$ 86 90 216 129 62 -135 62 -127 316 -139 165 24 -88 15 -124 -132 278 123 33 200 -270 -34 30 -97
4852i7m8L63Mj86j01qJ91k52L09k51J39J22j26k08k10L97n3R3k3l5Q4N7j08M2
$$ -97 -145 218 222 36 -65 -73 118 -134 175 -76 63 185 59 -149 -359 38 -15 78 55 20 104 161 53 95
4876I5Jk19L22l45J00M62o44O8K05j5J73k43J10k56Q0K65j96j75K04J37j12r8
$$ 95 96 -123 199 -146 -46 416 -228 -160 45 30 203 -40 70 -186 -106 159 -37 -212 -8 129 17 -81
4898h1K45k42J83q6M7rO6j63q0K82k98J57M0k53J61M6o8J52j60j14K64k08J95
$$ -81 164 -78 105 19 66 57 123 -40 -120 162 -136 21 61 -192 -31 15 -53 99 -61 -175 89 -119 76
4921G6l00L23K3k6j50P5K6P1k22J49J37j50L7K49k58Q8r5Oj01j02O0J33o5J75
$$ 76 -224 99 122 96 -54 21 47 118 -104 45 182 32 69 318 60 148 53 59 -42 -144 -84 49 -16 159
4945A59k05j61K47n3L8J0k81M12J30k50j96j22J65P7J7q2l0J50m2K41j83j7l04
$$ 159 -46 -207 40 -13 25 35 -246 166 296 46 -150 -272 -107 -30 -13 -95 -125 25 -17 224 41 24 -280
4968b80K93K17l39K65k27P0N2k01L23k31o7Q3m6P3Q8J00j95JO1j60O4j9J28J64
$$ -280 13 230 -109 156 -71 -1 51 -150 173 -58 -125 -42 -88 -15 73 173 -22 -21 40 -120 -56 -75 53 217
4992B17k72M04k31P7J18j76k82J93L8j67K79j64j37k15M10k7qp3j27J69j28R8
$$ 217 -55 349 118 195 313 137 -145 48 86 -81 198 34 -103 -318 92 65 57 -16 -143 26 -102 -4
5014dj0M3J9Lk4J3L3N6j68J43k13j04J68n5K63j23q1o3K76j13k03j53M31k53o
$$ -4 -14 29 48 51 27 40 73 129 -39 104 -109 -213 -45 -100 163 40 -41 -104 172 59 -144 -297 134 -119 -125
5039a25K47l24L07k03R2lL2N2L9K2j83J17l8J09j70p0P4J48p5l03L46k3j25J00
$$ -125 122 -202 105 -98 -6 -9 23 75 114 136 -47 70 32 141 -29 -99 -25 123 48 -255 91 68 -57 43
5063D3k7J22j15L3j66R9M0J0J84l02j04M54m12L7j02L3P5K41Nk97J93r9k35M53
$$ 43 16 138 23 56 -110 -11 29 39 223 -79 -183 271 -141 -104 -206 -173 -98 143 148 -149 44 -55 -290 163
5087A63L4n87J23K78m9j40N28l27Mj06jO9j93J31J84k48J4J77J28p7k5M7j62o0
$$ 163 197 -390 -267 11 -38 -178 350 23 27 -79 -80 -11 -204 -73 111 -137 -123 54 182 105 80 127 -35 -95
5111i5P6j00J11M0q9r0K76k12K72m36N60j47m87L15NK18j25k13J20k5J07J36j6
$$ -95 -19 -119 -8 32 -57 -147 129 -83 189 -247 313 166 -321 -6 -1 217 92 -121 -1 -26 81 217 201
5134B01m9j79nN3r0K45j46r0K20k69J2j9M5Q7j30K35P7m04O4K88k76K74j81K34
$$ 201 152 -27 -32 21 -69 176 30 -60 160 -109 -97 -116 -71 16 -114 121 198 -206 -142 146 -130 144 -37 197
5158A97j11l4j15j94L07j03j11K42j6q9pJ06l0J05j03q4N0l8O7j20J5m7Q3r2M9
$$ 197 86 52 -63 -257 50 -53 -164 78 62 -27 -34 72 42 147 44 -40 10 -28 39 -81 -66 -113 -30 -122 -73
5183g3J90P2l50K33J90k53j72K51k5J10j72L9p2J82k12L38k06j70qJ023m00m51
$$ -73 117 189 -161 72 262 9 -163 88 63 173 1 40 -32 150 -62 276 70 -100 -108 915 515 64
5205F4J0m17K37j7L00q8o0j11O2J60j11O3j55L2K93m08MJ28J04l0R0o7j06K62
$$ 64 74 -343 -106 -123 177 89 29 -82 -20 140 29 92 -63 -31 262 -146 -142 -14 90 60 150 83 -23 239
5229B39k45k3j76M85l35J6J65l20K90j90K16o2m6j05K13k15J96j76J84k78K77
$$ 239 -6 -29 -205 280 -55 -39 126 -194 96 -94 122 60 14 -91 122 -93 103 -73 111 -167 110
5250A10M8j68j48k7J82K68M6k37l42K20L0J4J35l64k77P44k97l48N54l47M9k27
$$ 110 158 -10 -158 -185 -3 265 311 74 -268 -48 -18 -4 131 -233 -510 234 -63 -411 143 -204 -155 -382
5272c82L12N21L27o32j7m61P19k07k76J48J62P7k3O1n16m5K36l32K89J59j10l58
$$ -382 -70 451 778 146 129 -332 387 180 -96 52 214 291 268 329 -187 -232 4 -328 -39 120 10 -348
5294c48L71L57J61n02J07r1p5Q0L03k79K63m58l2K91n96P36j98L43o12j50P86
$$ -348 23 380 541 39 146 55 -20 60 363 84 347 -111 -143 148 -448 288 90 433 -179 -329 457
5315D57n61M9K75k76N55n58j71L87M00k06o45J112p98k35L93j90N92r74K18L18
$$ 457 -104 -55 220 -56 499 -59 -230 157 557 351 -294 818 20 -215 178 -12 580 -394 -176 142
5335A42P88o14q21L43N11L8J92O0l20l83j46J78J6k96K96J91k86Q1M5J72q9N0
$$ 142 930 316 -505 -162 349 387 579 639 319 -64 -210 -32 -16 -312 -16 175 -111 -30 15 187 98 148
5357A48l03J64J03l17K02J69K2j34M0k68K0J53j90J49J78j00k0R2k85L66l33K81
$$ 148 -155 9 112 -205 -3 166 188 54 94 -174 -154 -1 -191 -42 136 36 16 108 -177 189 -144 137
5379A37o6k34L09K81k69k27M55J19k93k24r9P81n96J0k18M38o87Q32n46n83Q49
$$ 137 71 -163 146 427 158 -69 386 505 212 -12 -111 670 74 84 -134 304 -383 449 -97 -680 169
5400A69l13L86q79O29l45R96n38K1j20P23n56k08l0L96j28L8j37m97O47J021m69
$$ 169 -144 242 -637 -8 -353 643 105 126 6 729 173 -35 -65 331 203 241 104 -393 254 1275 806
5421H06n61J21j14n46j00P17l62Q7j36K90m57Q5J5N70j45l08J23l91J50K90j6
$$ 806 245 366 252 -294 -394 323 -39 48 -88 202 -255 -170 -155 415 270 -38 85 -306 -156 134 118
5442A18j06l0o6l4K93j40k30K15R1j27K4j94K38L0j39P9l74K73P3Nj62R2q1M14
$$ 118 12 -18 -84 -118 175 35 -195 20 111 -16 8 -186 52 82 -57 22 -352 -79 -6 -1 -163 -71 -152 262
5466B62m94K63o5J40J22l98J83k64J01n8J77L5r1J48k22J86K44k41J48m31J55
$$ 262 -232 31 -34 106 228 -170 13 -251 -150 -208 -31 4 -87 61 -161 25 269 28 176 -255 -100
5487a00L5K07k90O4j37N73l44J60L27l80m44O01m4p48M23k0j94K40J33K50K25
$$ -100 -65 142 -148 -84 -221 352 8 168 495 115 -329 272 228 -520 -97 -117 -311 -71 62 312 537
5508E37j066M40RJ05R3L7j33j67p62Q96K3O4J38j62j4L88k88o7r0k11Q6N26o0
$$ 537 -529 -89 -80 25 118 155 22 -145 -907 -11 12 76 214 52 38 426 138 71 -19 -230 -144 382 322
5531C22J26k39q90K69M3M89m48L30j12L48K73k33l22K85j91Q8j17l85L48Q8l09
$$ 322 448 209 -681 -412 -369 120 -328 2 -110 238 511 278 -44 241 50 138 21 -364 -16 72 -237
5552b37L05Rm61L72L89k48P2j84N3j33K34m7k06j32RL9L06l9q5R2p3O1m2P5k60
$$ -237 68 77 -384 -12 377 129 201 17 70 -63 171 124 -82 -214 -205 -166 140 101 16 108 35 96 54 129 -131
5577a31J62k6J49l09J90j34n3L12Ok74J50Q0l2k29J30J01k51r6J15O7J39j60l11
$$ -131 31 5 154 -155 35 -99 -152 160 166 -108 42 122 90 -139 -9 92 -159 -255 -140 -73 66 -94 -405
5600d05M34l84K68mR4j7N7j69J08j50Q9J17j62N12l77Q3l16L93k71K0P7k7o1K50
$$ -405 29 -355 -87 -91 3 -14 43 -126 -18 -168 -79 38 -124 388 11 94 -222 171 -100 -80 -3 -30 -91 159
5624A59m1j55J0j32J76n1N7j00l18L94l6P9j12J18r4j09L44l24M33m08R8k06R0
$$ 159 118 -37 -27 -159 17 -34 23 -77 -395 -1 -37 42 -70 48 -46 -155 189 -135 298 -110 -12 -218 -128
5647a28K03j47K44j74m1K05j52m1n4J34J71l72J21L2j9K87j25k41K36k35J60j81
$$ -128 75 -72 172 -2 -43 162 10 -31 -85 49 220 -152 -31 1 -18 269 144 -97 139 -96 64 -117
5669a17r7M30L3m12K28j49J06K32q4n9k41O7J76k46L03k18j1j45l2K12J72j89
$$ -117 -214 216 249 -163 65 -84 22 254 170 111 -130 -63 113 -133 170 -48 -59 -204 -236 -24 148 -41
5691d1ll1k5J01K2j16Q5j5P0K53l59KJ2l8K37j46O5J6j23J83r8J9r5j4K93q4m61
$$ -41 -44 -75 -100 1 23 -93 -8 -23 47 300 -59 -57 -45 -83 154 8 73 89 -34 149 51 70 -25 -39 254 170 -291
5718b91J84J12k1M7P9q9j25K0Q1J12L7j11j11L24j18q3J37n50N01O1j02J7j97
$$ -291 -107 5 -16 31 110 21 -104 -84 -3 109 146 35 -76 248 130 47 184 -366 135 196 94 111 -86
5741h6R3k23R1K62J30j5K9j84j21J15j15J05n9M7jQ9r4N3q3n8J78k22l5P1j44
$$ -86 7 -216 -125 137 267 252 281 97 -24 91 -24 81 22 69 68 157 63 116 33 -25 153 -69 -104 -33 -177
5766a77K57K29k90J36j55j83M87r7k92p6J46K66k46J00j66l0Q2K21k37j00J38
$$ -177 80 309 19 155 0 -183 304 207 -85 -161 -15 251 5 105 -61 -91 -9 212 -25 -125 13
5787A3k91K74o2J3J30j30R1k6J21o7n8J88j30j45J28k9J28o9j62K7J73m3k97K88
$$ 13 -278 -4 -66 -53 77 -53 38 12 133 66 8 196 66 -79 49 20 148 79 -83 -56 117 74 -223 65
5811F5m2Q7k11K59k61J85k99L37l13J96j76K34n6L4q7o6P2K56p7R3m6j14J83p3
$$ 65 23 110 -101 158 -103 82 -217 120 -193 3 -173 61 5 39 -48 -114 -42 214 137 230 184 70 253 180
5835A80j88j95K41k7qJ17Nk44J24J36m7k77M3K71j06j8RL6j69K55J46k14k4pq9
$$ 180 -8 -203 38 11 3 120 125 -119 5 141 94 -183 -140 131 25 7 16 52 -117 138 284 70 46 39 -50
5860e0J02O1j52m8j44J12o5rL59k59R6O7J30j08j25J13j28P6j28J65j16K29j29
$$ -50 52 113 -39 -87 -231 -119 -184 -193 166 -93 3 70 200 92 -33 80 -48 28 -100 65 -51 178 49
5883D9k02k5J54P3kJ80m8k44Rj08J94N4J18k53l19M47n4o3J4o1kQ4P7o5R1k99
$$ 49 -153 -178 -24 49 47 227 179 -65 -56 -164 30 84 202 -51 -370 77 23 -40 -26 -87 -89 -5 72 7 98 -201
5909b01J40m8R5J15k11K1K7Q5l6Q7p9l9K64k91N2J37Q5k69q4K0J88K8j58K69j91
$$ -201 -61 -109 -14 101 -110 -89 -62 23 -13 74 -5 -44 220 -71 -19 118 203 -66 -150 -130 58 86 -72 197 6
5934FJ5p6J0PJ5M6o6j05Q2q7o9K88j34m7rK09j09J08j91k8L64k67M3j41J42j82
$$ 6 21 -55 -45 -38 -23 23 -43 -148 -66 -153 -222 66 -68 -115 -124 85 -24 84 -107 -135 229 -38 5 -136 6 -176
5960a76J92K70R1j50n0j45n1P8J53l66L88k39K7K7k78J11m5r5N0J15K13lN8j03
$$ -176 16 286 377 227 177 32 -19 59 212 -154 234 -5 22 49 -229 -118 -163 -258 -208 -93 120 117 175 72
5984G2jJ8m33M42k4p5m0k4R3j40N2J5J87k19J03O2Q2j90R2K2l80K44J31K08k35
$$ 72 71 89 -344 98 74 -1 -41 -65 28 -112 -60 -45 142 -77 26 88 170 -20 72 94 -286 -42 89 297 62
6009F2L9Q5m54K48J91J2j44N8k10k7K22N9R8k36J01j09J89n23K21J95m0J26Q1
$$ 62 101 186 -268 -20 171 183 39 97 -113 -140 82 141 239 3 104 -5 184 -339 -118 77 37 163 244
6032B44j98l9K0j66J38R3l03K94m7J13k32O3K2L9J62j03L2j53J92O6l03o4K20
$$ 244 46 7 27 -139 -1 92 -211 83 36 149 -83 -20 2 41 203 100 132 -21 171 237 -66 -130 90
6055I0q5K25j47o5j46J17K01l59K92j9l3l2l22K11j70J40P8N9j4m7pr9QQ7j22
$$ 90 5 230 83 18 -128 -11 190 -169 123 104 71 39 -283 -72 -242 -102 -24 35 21 -26 -33 -132 -124 -37 -159
6080a59J27j97K5O3jl5R3K33j62j26K92R1k33J17k55Q2o1K99j66J57k66m3Q3O
$$ -159 -32 -229 -204 -141 -142 -177 -84 149 -13 -139 153 244 11 128 -127 -45 -106 193 27 184 -82 -125 -42 -36
6104c6l1K06J55l58k1P1j77L50j11m5o0P8Rj35J76l6j59J87j52J29Q0J35j59p2
$$ -36 -67 139 294 -64 -85 -14 -191 159 48 3 -57 21 30 -105 71 35 -124 63 -89 40 120 255 96 24
6128B4k21K89k8n5J0j49K12k08J96j00L7K0m0pJ01k34K4J27n2MO7l6N8R1j3j13
$$ 24 -197 92 64 9 19 -130 82 -126 70 -30 7 27 -13 -20 81 -153 -129 -2 -54 -50 17 -19 39 130 117 4
6154DLK03k32J00k26RK68m61L55j91J43L4K68m27J61M8J1J74k36P3k81J65k37
$$ 4 7 210 -22 78 -148 -139 129 -332 23 -168 -25 9 277 -150 11 59 70 244 8 81 -200 -35 -272
$$ [...]
8191G6
##END NTUPLES=NMR FID
##END=
