##TITLE=1H_Ser 6-6-V-3
 CDCl3
 8 sc, 
 29.06.2022
##JCAMPDX= 6.0         $$ Bruker NMR JCAMP-DX V2.0
##DATA TYPE= NMR FID
##DATA CLASS= NTUPLES
##ORIGIN= UXNMR, Bruker Analytische Messtechnik GmbH
##OWNER= root
$$ XWIN-NMR		Version 3.5
$$ Wed Jun 29 15:21:11 2022 Russian Standard Time (UT+4h)  she@DPX200
##.OBSERVE FREQUENCY= 200.1313499994
##.OBSERVE NUCLEUS= ^1H
##.DELAY= (6, 6)
##.ACQUISITION MODE= SIMULTANEOUS
##.ACQUISITION SCHEME= undefined
##.AVERAGES= 8
##.DIGITISER RES= 18
##SPECTROMETER/DATA SYSTEM= spect
##.PULSE SEQUENCE= zg30
##.SOLVENT NAME= CDCl3
##.SHIFT REFERENCE= (INTERNAL, CDCl3, 0, 15.7039)
##AUDIT TRAIL= $$ (NUMBER, WHEN, WHO, WHERE, WHAT)
$$ ##TITLE= Audit trail, XWIN-NMR		Version 3.5
$$ ##JCAMPDX= 5.01
$$ ##ORIGIN= Bruker BioSpin GmbH
$$ ##OWNER= she
$$ F:/spectra/data/she/nmr/H-F/1/audita.txt
$$ ##AUDIT TRAIL=  $$ (NUMBER, WHEN, WHO, WHERE, WHAT)
(   1,<2022-06-29 15:20:02.46 +0400>,<she>,<DPX200>,
      <created by zg, POWCHK disabled, PULCHK disabled
       configuration hash MD5:
       00 E9 B6 7A A2 85 ED C7 34 08 36 98 17 FE 4E 26
       data hash MD5: 16K
       D1 73 7F 53 A5 B4 A3 B8 0B 60 7A 6B DC 21 50 5C>)
$$ ##END=
$$ 
$$ hash MD5
$$ 1B B3 D1 7E 43 52 21 14 CC FC 7C EF 7C 6D 71 DD
##$RELAX= 
##$RELAX= 
##$RELAX= 
##$RELAX= 
##$RELAX= 
##$RELAX= 
$$ Bruker specific parameters
$$ --------------------------
##$DU= <F:/spectra>
##$EXPNO= 1
##$NAME= <H-F>
##$PROCNO= 1
##$TYPE= <nmr>
##$USER= <she>
##$AMP= (0..31)
100 100 100 100 100 100 100 100 100 100 100 100 100 100 100 100 100 100 
100 100 100 100 100 100 100 100 100 100 100 100 100 100 
##$AQSEQ= 0
##$AQ_mod= 1
##$AUNM= <au_zg>
##$AUTOPOS= <>
##$BF1= 200.13
##$BF2= 200.13
##$BF3= 200.13
##$BF4= 200.13
##$BF5= 200.13
##$BF6= 200.13
##$BF7= 200.13
##$BF8= 200.13
##$BYTORDA= 1
##$CFDGTYP= 0
##$CFRGTYP= 5
##$CHEMSTR= <none>
##$CNST= (0..31)
1 1 145 1 1 1 1 1 1 1 1 1 1 1 1 1 1 1 1 1 1 1 1 1 1 1 1 1 1 1 1 1 
##$CPDPRG= <>
##$CPDPRG1= <>
##$CPDPRG2= <>
##$CPDPRG3= <>
##$CPDPRG4= <mlev>
##$CPDPRG5= <mlev>
##$CPDPRG6= <mlev>
##$CPDPRG7= <mlev>
##$CPDPRG8= <mlev>
##$CPDPRGB= <>
##$CPDPRGT= <>
##$D= (0..31)
0 1.2 0 0 0 0 0 0 0 0.06 0 0.03 0 0 0 0 0.0002 0 0 0 0 0 0 0 0 0 0 0 0 
0 0 0 
##$DATE= 1656501601
##$DBL= (0..7)
120 120 120 120 120 120 120 120 
##$DBP= (0..7)
150 150 150 150 150 150 150 150 
##$DBP07= 0
##$DBPNAM0= <>
##$DBPNAM1= <>
##$DBPNAM2= <>
##$DBPNAM3= <>
##$DBPNAM4= <>
##$DBPNAM5= <>
##$DBPNAM6= <>
##$DBPNAM7= <>
##$DBPOAL= (0..7)
0.5 0.5 0.5 0.5 0.5 0.5 0.5 0.5 
##$DBPOFFS= (0..7)
0 0 0 0 0 0 0 0 
##$DE= 6
##$DECBNUC= <off>
##$DECIM= 32
##$DECNUC= <off>
##$DECSTAT= 4
##$DIGMOD= 1
##$DIGTYP= 9
##$DL= (0..7)
0 120 120 120 120 120 120 120 
##$DP= (0..7)
150 150 150 150 150 150 150 150 
##$DP07= 0
##$DPNAME0= <>
##$DPNAME1= <>
##$DPNAME2= <>
##$DPNAME3= <>
##$DPNAME4= <>
##$DPNAME5= <>
##$DPNAME6= <>
##$DPNAME7= <>
##$DPOAL= (0..7)
0.5 0.5 0.5 0.5 0.5 0.5 0.5 0.5 
##$DPOFFS= (0..7)
0 0 0 0 0 0 0 0 
##$DQDMODE= 0
##$DR= 18
##$DS= 0
##$DSLIST= <SSSSSSSSSSSSSSS>
$$ [...]
##$SUBNAM2= <"">
##$SUBNAM3= <"">
##$SUBNAM4= <"">
##$SUBNAM5= <"">
##$SUBNAM6= <"">
##$SUBNAM7= <"">
##$SUBNAM8= <"">
##$SUBNAM9= <"">
##$SW= 18.0517283424941
##$SWIBOX= (0..15)
0 0 2 0 0 0 0 0 0 0 0 0 0 0 0 0 
##$SW_h= 3612.71676300578
##$TD= 16384
##$TD0= 1
##$TE= 0
##$TE2= 300
##$TE3= 300
##$TEG= 300
##$TL= (0..7)
0 120 120 120 120 120 120 120 
##$TP= (0..7)
150 150 150 150 150 150 150 150 
##$TP07= 0
##$TPNAME0= <>
##$TPNAME1= <>
##$TPNAME2= <>
##$TPNAME3= <>
##$TPNAME4= <>
##$TPNAME5= <>
##$TPNAME6= <>
##$TPNAME7= <>
##$TPOAL= (0..7)
0.5 0.5 0.5 0.5 0.5 0.5 0.5 0.5 
##$TPOFFS= (0..7)
0 0 0 0 0 0 0 0 
##$TUNHIN= 0
##$TUNHOUT= 0
##$TUNXOUT= 0
##$USERA1= <user>
##$USERA2= <user>
##$USERA3= <user>
##$USERA4= <user>
##$USERA5= <user>
##$V9= 5
##$VALIST= <valist>
##$VCLIST= <CCCCCCCCCCCCCCC>
##$VD= 0
##$VDLIST= <DDDDDDDDDDDDDDD>
##$VPLIST= <PPPPPPPPPPPPPPP>
##$VTLIST= <TTTTTTTTTTTTTTT>
##$WBST= 1024
##$WBSW= 4
##$XGAIN= (0..3)
0 0 0 0 
##$XL= 0
##$YL= 0
##$YMAX_a= 70389
##$YMIN_a= -132775
##$ZGOPTNS= <>
##$ZL1= 120
##$ZL2= 120
##$ZL3= 120
##$ZL4= 120
##$ABSF1= 10
##$ABSF2= 0
##$ABSG= 5
##$ABSL= 3
##$ALPHA= 0
##$AQORDER= 0
##$ASSFAC= 0
##$ASSFACI= 0
##$ASSFACX= 0
##$ASSWID= 0
##$AUNMP= <proc_1d>
##$AZFE= 0.1
##$AZFW= 0.1
##$BCFW= 1
##$BC_mod= 2
##$BYTORDP= 1
##$COROFFS= 0
##$CY= 11.3945322036743
##$DATMOD= 1
##$DC= 2
##$DFILT= <>
##$DTYPP= 0
##$F1P= 2.36226072786647
##$F2P= -0.459571619588291
##$FCOR= 0.5
##$FTSIZE= 0
##$FT_mod= 4
##$GAMMA= 1
##$GB= 0.15
##$INTBC= 1
##$INTSCL= 1
##$ISEN= 128
##$LB= 0.24
##$LEV0= 0
##$LPBIN= 0
##$MAXI= 10000
##$MC2= 0
##$MEAN= 0
##$ME_mod= 0
##$MI= 1.114404
##$NCOEF= 0
##$NC_proc= 0
##$NLEV= 6
##$NOISF1= 3.799351
##$NOISF2= 2.8
##$NSP= 1
##$NTH_PI= 0
##$NZP= 0
##$OFFSET= 15.70392
##$PC= 1
##$PHC0= -18041.33
##$PHC1= 9.00069
##$PH_mod= 1
##$PKNL= yes
##$PPARMOD= 0
##$PSCAL= 0
##$PSIGN= 0
##$REVERSE= no
##$SF= 200.130013532006
##$SI= 16384
##$SIGF1= 3
##$SIGF2= 2
##$SINO= 400
##$SIOLD= 16384
##$SREGLST= <1H.CDCl3>
##$SSB= 0
##$STSI= 0
##$STSR= 0
##$SW_p= 3612.71676300578
##$SYMM= 0
##$S_DEV= 0
##$TDeff= 0
##$TDoff= 0
##$TI= <>
##$TILT= no
##$TM1= 0
##$TM2= 0
##$TOPLEV= 0
##$USERP1= <user>
##$USERP2= <user>
##$USERP3= <user>
##$USERP4= <user>
##$USERP5= <user>
##$WDW= 1
##$XDIM= 8192
##$YMAX_p= 0
##$YMIN_p= 0
$$ End of Bruker specific parameters
$$ ---------------------------------
##NTUPLES= NMR FID
##VAR_NAME=  TIME,          FID/REAL,        FID/IMAG
##SYMBOL=    X,             R,               I
##VAR_TYPE=  INDEPENDENT,   DEPENDENT,       DEPENDENT
##VAR_FORM=  AFFN,          ASDF,            ASDF
##VAR_DIM=   8192,          8192,            8192
##UNITS=     SECONDS,       ARBITRARY UNITS, ARBITRARY UNITS
##FACTOR=    0.0002768,     1,               1
##FIRST=     0,             0,               0
##LAST=      2.2672688,     0,               0
##MIN=       0,             -132775,         0
##MAX=       2.2672688,     70389,           0
$$ Real data points
##PAGE= N=1
##DATA TABLE= (X++(R..R)), XYDATA
0 0 0 0 0 0 0 0 0 0 0 0 0 0 0 0 -8 8 -8 8 -8 16 -16 16 -24 24 -32 40 -40 48 -56 64 -75 88 -96 112 -126 142
36 142 -160 179 -200 222 -247 276 -307 339 -376 416 -458 505 -555 613 -674 744 -820 905 -1000
55 -1000 1106 -1227 1366 -1525 1714 -1939 2214 -2558 3003 -3607 4468 -5812 8218 -13877 59540
70 59540 -16165 -77955 70389 51027 -6524 23938 26177 -48013 -18805 32917 3541 -26906
82 -26906 9361 13679 -11667 -14922 5754 5749 -8068 -15355 -7515 -6898 -4745 -4759 -7589 6753 25664
97 25664 1664 -14034 17106 22102 -11552 1823 23386 -10810 -25340 5492 201 -10327 15605
110 15605 2926 -34880 -12830 21663 11849 -2727 -10651 -19533 -1931 15265 -4568 -14210 3806
123 3806 -3146 -19359 -2500 13939 5756 -1731 490 4077 4916 9243 16355 3577 -15560 410
137 410 17313 -9703 -22730 10805 13637 -16572 -5762 13402 -7327 -8804 15198 4688 -16389
150 -16389 -10380 -4291 -4287 4088 5208 -4191 -6994 -1770 11279 20601 4453 -12320 370 9171 -6080
165 -6080 -7493 4296 2039 -3038 -2646 -1971 5414 13689 9940 2072 -2778 -3112 7905 12841 -2942
180 -2942 -8026 5898 2376 -8218 2088 7200 -2793 -3145 -2432 -8869 -4239 1577 -3397 -2447 108
195 108 -8154 -5549 7650 5146 -1759 3216 -868 -7248 3819 10774 832 -4343 306 2912 -486
210 -486 -5072 -1000 4866 -3070 -13801 -6876 555 -2918 -697 2758 -6001 -7761 4300 5076 -720
225 -720 -229 627 -657 -2077 -2191 5233 12027 3320 -4764 3876 8665 2371 4718 7050 -4085 -7216
241 -7216 821 1625 -700 406 -1263 -3140 -1985 -2583 484 2885 -3892 -6158 -353 -1961 -6177 1611
257 1611 7966 595 -3410 169 2498 4661 4420 317 -1110 -1136 -1786 1993 4298 634 -106 2074
273 2074 -1964 -4218 2183 4461 -2329 -5313 -4971 -3070 785 1567 -597 -180 -1685 -3496 767 3174
289 3174 -532 -1557 -75 -2749 -2756 3182 4261 1513 2279 1354 -129 1775 3253 2655 2253 -1876 -3915
306 -3915 96 2951 1361 914 400 -2676 -2533 -128 -616 -1503 -1092 -3256 -5357 -2455 412 2082 2114
323 2114 -761 -2128 268 1332 2193 2150 887 -708 -376 1752 2945 3838 3813 1091 -1019 -559 -162
340 -162 889 -528 -3149 -3421 -3083 -3115 -669 1229 -209 -2805 -2381 -1068 -1350 -184 546 -1152 -2036
357 -2036 -838 362 2310 3504 3270 1811 603 196 1568 2835 1827 -1391 -2633 -975 -989 -520
373 -520 920 -127 -2707 -3177 -1568 -970 -954 -496 -1134 -2936 -1943 341 1391 1379 922 61 749 1043 1806
392 1806 3495 4150 2133 1471 2231 2962 2480 2765 1824 -549 -1397 -1728 -760 937 -27 -1065 -1021 -1232 -537
411 -537 1710 966 -1458 -2942 -2840 -2337 -1704 -460 -685 -1134 -989 -468 1688 3449 1448 -120 -493 -1367
429 -1367 -1894 -201 -819 -1536 -1414 -1263 -327 1843 2019 430 891 20 -2872 -1753 -759 -3602 -3238 -1198
447 -1198 -3092 -3293 117 1139 954 1846 1147 203 1758 2620 1583 1991 1592 -489 961 3022 1652
464 1652 2175 2598 5 -121 1262 585 242 -269 -2429 -2455 -1221 -1789 -1877 -320 -1214 -2602 -287 814
482 814 943 2850 1882 -2 1286 1392 265 1518 1553 -1887 -1321 1593 731 1371 3420 1508 387
499 387 2657 2179 14 550 -1435 -2690 -938 -2453 -3980 -790 -33 -2600 -738 1013 -1660 -912
515 -912 1618 -1278 -2446 -614 -2121 -2299 734 664 -352 1780 1211 386 2667 2406 -300 -452 -900
532 -900 -3161 -2002 -556 -1975 -2022 -1884 -2535 409 2547 -121 -1640 706 -349 327 1900 -341 -1993
549 -1993 128 1083 816 2012 930 -422 2504 2782 973 2784 2478 -934 1989 4079 257 -618
565 -618 1024 -146 317 2290 -172 -2213 134 377 -447 828 -1211 -4068 -1332 -991 -2461 -116
581 -116 -954 -3764 -898 2343 1552 1562 2144 159 571 3406 1929 -7 1200 -1391 -2496 1333 1480
598 1480 -947 2 -1046 -2553 496 799 -2042 -2760 -2490 -2315 -926 -96 -2949 -2245 595 -27 156
615 156 2157 -20 -801 2217 2127 167 654 -398 54 2945 2051 -403 251 432 -191 1869 1578 -2849
633 -2849 -2206 466 -1117 -1201 402 -2061 -2713 -600 -1118 -301 1410 -800 -2021 980 1861 921 2462
650 2462 2384 -151 1820 3046 1190 1747 2035 13 339 1578 -9 -250 1002 -788 -1339 219 -1302
667 -1302 -2786 -1285 -766 -1567 -654 -1536 -2609 347 1082 -736 735 596 -1653 68 2248 740 64
684 64 325 -914 22 2362 1579 -52 366 -995 -928 1445 393 -1750 -287 -756 -1937 -513 313 -1295
702 -1295 -936 -541 -1983 -1094 535 -599 -454 718 -723 -915 1894 1242 465 1827 494 -123 1104
719 1104 1348 251 1114 836 -499 421 905 -389 726 1230 -1422 -1568 28 -750 -623 404 -1241
736 -1241 -2036 -621 -625 -196 619 -327 -1294 -417 173 -302 1243 1513 -543 -210 1116 564 1512 1675 142
755 142 -265 38 -263 587 1271 -430 -1147 -72 -1095 -987 121 -335 -1880 -1127 -1392 -1958 -90 481
773 481 -706 -158 -195 -597 932 2052 754 479 844 164 210 1937 1755 756 1275 229 -136 1264 1621
792 1621 320 12 -980 -1560 -740 -37 -1017 -1241 -1118 -1895 -1206 381 179 -469 92 -1088 -759 879 729
811 729 858 1193 455 -101 772 1453 1350 1690 717 -195 -222 869 321 197 -215 -1951 -1955 -929 -1330 -586
831 -586 -402 -1798 -2171 -1236 -516 -82 742 31 -1075 -573 319 277 1229 1284 37 -88 796 719 1607 1713
851 1713 801 -187 -95 -198 263 760 -220 -1395 -1450 -1399 -694 656 442 -636 -747 -603 -420 494 881 -132
871 -132 -296 -656 -450 906 1740 1500 836 732 566 1029 2151 1781 798 -102 -629 -404 345 698 -13 -523
891 -523 -811 -976 -119 305 166 -203 -926 -1476 -1503 -186 168 -218 -496 -1260 -1082 135 974 1083 843 -34
911 -34 -253 373 945 631 541 -70 -1149 -1068 193 490 221 189 -554 -1033 -611 -159 521 155 -1149 -1514 -1713
932 -1713 -936 -235 139 -348 -843 -969 -85 992 1340 1251 470 -46 221 827 1426 1207 518 -220 13 580
952 580 1003 1540 876 -68 -610 -258 -288 134 -80 -846 -1581 -1499 -776 38 261 324 -61 -608 29 939 1112
973 1112 1310 725 -270 -42 667 1205 1560 1119 364 -342 -88 363 777 390 -294 -1351 -1448 -1061 -594 -388
993 -388 -1121 -1528 -1530 -1030 -470 583 -207 -723 -522 -262 -283 854 1111 441 -390 -26 36 755 1304 735 200
1014 200 -144 -407 13 554 460 -353 -944 -1235 -1429 -734 87 -363 -1203 -988 -990 -305 742 548 503 -685 -844
1035 -844 -67 739 1311 926 729 274 276 1320 1670 1005 680 277 -465 33 476 325 266 -383 -1584 -882
1055 -882 42 138 -416 -390 -857 -1262 -276 -7 174 360 -300 -574 -170 221 971 1308 229 -350 203 503
1075 503 393 491 1112 -238 -441 53 -360 106 356 -302 -1218 -922 -771 -419 600 -345 -1084 -700 -758 -771
1095 -771 255 882 -365 -1203 -274 117 195 1099 617 76 -187 54 717 1716 739 125 -191 -466 308 1005
1115 1005 460 -236 -609 -566 -359 -113 -149 -236 -385 -451 -1327 -377 217 -64 273 -528 -341 -82 481 697 422
1136 422 828 193 -276 500 1162 1067 1352 205 -10 245 651 356 483 -285 -1348 -1009 -179 -568 -312 -490
1156 -490 -1279 -1460 -254 489 -992 -236 -461 -842 137 277 -352 1164 954 -495 297 724 915 440 1310
1175 1310 546 89 170 231 508 235 -343 -691 -368 -1063 7 165 -472 -1014 -873 -1030 -536 255 297 -81
1195 -81 -395 -417 -244 972 942 235 516 278 338 814 1580 480 212 519 -63 98 610 602 -375 -335 -954 -981
1217 -981 -439 -429 -459 -636 -466 -1092 -248 514 -53 -300 -56 -546 -182 547 633 869 128 536 584 609 715 215
1239 215 596 -13 -1231 -76 41 -195 146 -284 -573 -698 -355 -405 -241 -407 -547 -989 -486 -194 339 634
1259 634 -72 -436 507 281 351 699 476 226 150 158 674 816 555 251 -41 -32 17 304 255 -294 -601 -248 -371
1282 -371 -181 33 -90 -705 -672 -409 -124 148 154 -519 -711 29 472 580 926 403 187 325 -178 195 373
1303 373 928 -67 -225 393 -26 409 476 -71 -521 -286 -782 -535 -476 -681 -629 -1136 -939 -346 -64 -85 -119 -528
1325 -528 -397 -127 -258 221 46 593 149 358 938 293 755 988 -23 -72 451 58 713 -185 -211 -432
1345 -432 -609 -727 175 130 -254 -492 -210 -167 -116 376 76 -470 -318 214 257 125 627 236 615 281 308 599
1367 599 697 637 121 -299 -105 240 -18 365 136 -332 67 -157 -476 -177 -562 -424 -707 -575 -289 -258 -82
1388 -82 -358 -78 -93 -277 91 277 310 166 484 168 243 723 572 282 173 -272 -337 115 200 -196 -235 -288 -686
1411 -686 -547 -121 -378 -569 -334 -565 -235 -495 -514 -275 3 93 107 504 500 286 784 621 238 304 519 542
1433 542 470 297 88 471 228 -106 86 28 -350 -166 -212 -401 -337 -94 -411 -260 -283 -242 88 -126 94 145
1455 145 182 514 418 403 463 87 517 183 389 380 517 376 -83 193 -206 14 -214 -441 -210 -516 -247 -340
1477 -340 -88 -541 -576 -619 -405 -304 -130 -288 -182 -177 -35 94 40 422 -15 179 119 319 476 299 428 253
1499 253 -199 -21 -26 459 303 -187 -114 -141 -273 -218 -90 -125 -220 -355 -61 -218 -57 -49 -42 -163 50 123 41 253
1523 253 -78 89 324 202 135 300 558 152 306 211 419 223 380 44 -102 -189 -136 88 -132 -578 -598 -649
1545 -649 -168 -1 -366 -269 -233 -211 -249 -13 13 230 236 260 32 161 679 465 246 445 245 138 607 614 -3
1568 -3 -2 -104 -159 -254 -139 -310 -599 -494 -687 -546 -101 -269 -406 -258 76 -377 80 292 357 243 258 463 573
1591 573 446 705 484 592 229 -3 8 281 -78 -282 -366 -656 -64 -354 -302 -523 -589 -151 -384 -304 138 -19
1613 -19 -11 -243 211 193 311 238 364 415 474 352 197 357 535 296 92 -48 -192 89 326 135 -357 -80
1635 -80 60 -353 -222 -44 -483 -576 -362 -213 -93 64 -198 -113 -208 -64 294 213 218 -88 105 241 211 406 476
1658 476 52 -58 39 -17 -24 244 368 -64 -163 -192 -6 191 -56 -220 -202 -143 -522 -161 87 -153 -42 -20 -207
1681 -207 239 325 389 209 -47 -102 156 557 82 168 334 230 -56 387 199 -186 24 98 -233 -146 60 -70
1703 -70 -282 -488 -688 -369 -394 -352 -391 63 -161 -555 -285 -246 115 399 97 139 160 599 456 470 235 231 314 228
1727 228 392 336 72 -117 -270 -202 -351 -83 12 -434 -733 -314 -236 -166 -58 -320 -392 -163 194 -39 203 379
1749 379 30 218 170 222 472 530 226 327 181 234 446 -118 -29 -65 -318 -143 -510 -154 -554 -632 -256 12
1771 12 -480 -25 -283 -132 17 -179 -259 349 371 218 412 330 286 214 423 608 540 35 98 -255 230 367 -174
1794 -174 -50 -263 -359 -268 -159 -305 -277 -577 -443 -335 -81 -152 101 23 -412 -417 42 218 -45 321 127 77 110
1817 110 95 234 384 25 -140 221 258 80 127 225 19 -201 117 -53 109 222 -108 -342 -233 -247 -87 91
1839 91 -226 -11 -324 -148 84 158 355 319 121 316 132 446 438 267 136 -109 113 114 239 119 -238 -133
1861 -133 -111 109 3 -32 -551 -371 -213 -722 -109 -129 -223 -49 -166 -316 -25 121 54 210 108 -202 24 418
1883 418 284 377 158 348 -337 36 122 135 162 -86 -217 -223 25 -331 -159 -402 -800 -180 -220 -250 -280 -465 -231
1906 -231 -284 29 81 601 113 67 276 361 373 354 407 242 -22 -39 452 91 304 319 -205 -301 -345 -364 352 -51
1930 -51 -100 -524 -62 -58 -460 137 -148 58 -134 -114 71 275 136 -177 74 152 152 41 590 176 270 69 -21
1953 -21 -317 121 410 -55 -122 -353 -586 -404 239 -504 -16 -598 -388 -337 270 313 -207 20 -23 133 165 168 114
1976 114 299 -39 72 579 487 172 472 593 101 -186 180 258 101 -71 -596 -244 -246 17 -392 -462 -190 -815
1998 -815 -370 -88 91 -178 -142 -235 -155 202 347 611 384 196 381 156 402 -98 478 191 -34 140 281
2019 281 282 -27 -235 -136 -222 -376 28 327 -246 -352 -425 -357 338 -145 73 -238 -141 -47 -258 279 265 220 59
2042 59 172 241 278 698 154 328 38 324 96 250 191 -66 -54 -85 -57 -4 -167 -225 -209 -246 -506 -262 -207 -63
2066 -63 -22 66 -205 -127 340 17 -49 -250 -255 -61 202 292 201 161 240 -140 413 61 233 155 82 -120 -66 -117 14
2091 14 62 -2 -127 -12 -315 -329 139 -252 -167 140 -31 -150 307 -159 588 154 -121 98 199 407 466 198
2113 198 108 -160 -54 120 80 -62 -284 27 -82 -117 -251 -518 -722 -210 -523 105 -57 71 -128 -600 233
2134 233 160 200 214 -95 -108 561 378 249 371 246 -161 505 412 -136 -151 241 93 -475 -280 514 124 135
2156 135 -363 -486 -405 -494 -64 -138 -405 -97 26 -298 118 181 386 359 519 -289 336 88 419 105 -55 -171
2178 -171 -78 153 217 -116 -142 -271 -134 -10 -319 -130 27 -239 -520 -366 -178 227 565 153 206 -277 -541
2199 -541 266 292 -43 58 -18 202 233 649 146 -374 342 -219 353 -40 408 -24 -233 -695 -225 -422 -315
2220 -315 -310 10 -122 -649 -40 26 120 -164 -413 -77 -198 210 716 -106 442 154 61 -384 405 -97 205 -289
2242 -289 16 -514 364 33 45 -471 -290 -92 -122 1 -447 148 -611 110 -52 -192 -671 -349 274 183 -50
2263 -50 -358 -20 -352 308 43 532 150 302 674 -109 40 -9 -46 381 -301 63 -150 -111 -247 -5 -504
2284 -504 -93 -28 -276 -22 -352 -530 -358 -217 -117 43 -379 -7 -241 -187 -77 36 299 302 390 67 -48 147
2306 147 470 257 4 179 305 -4 214 19 -149 -128 -151 12 -376 72 -224 -433 63 -48 -141 -79 -375
2327 -375 -145 177 199 230 189 -198 267 349 96 -13 336 418 3 11 278 -139 -286 -173 -90 -13 33 -138 -217 182
2351 182 -305 -276 -291 -186 255 5 -279 113 220 118 126 128 140 -168 317 444 157 72 247 -132 -217 174 84
2374 84 -24 -99 -123 -291 -157 -328 -217 -160 -279 6 -385 -214 -53 -224 108 -154 -144 -74 72 46 -67 25 -128
2397 -128 164 158 34 360 54 77 -88 85 98 154 -80 127 -346 151 -158 -237 92 -432 -169 -265 -165 -22
2419 -22 -14 -257 -64 -287 46 -87 145 -26 63 38 215 17 124 21 -185 -13 314 156 170 258 220 -128 42
2442 42 73 -306 -28 -71 30 117 -313 -187 -133 -208 -231 -222 -60 -183 -115 195 -169 164 140 -54 291 376 257 151
2466 151 302 150 8 46 -51 91 148 26 -360 -146 -51 -246 -47 22 -285 -149 -239 -218 82 -79 -135 -42 17
2489 17 -82 74 251 32 200 42 197 175 329 153 -90 15 106 -82 95 -32 147 -347 -73 -245 74
2510 74 72 -360 99 -122 17 -132 -174 -124 15 -160 85 21 258 313 170 73 318 -169 266 578 424 79 284
2533 284 -76 -156 97 -52 -117 391 -49 -48 -31 -46 56 -122 -204 -266 -178 -214 12 -230 -110 -52 -51 220 -4 110
2557 110 -2 126 193 154 228 -15 192 226 -124 53 78 -264 191 24 118 58 -152 55 -83 73 -398 -489 -491
2580 -491 21 -253 0 -128 -69 35 189 142 27 95 31 48 -37 -79 229 338 59 -25 106 10 55 4 -98 -132
2604 -132 -170 -190 57 -238 -169 8 -141 -98 -66 101 182 -85 273 -77 -99 -63 -13 212 250 240 351 36 175 447
2628 447 287 -102 63 300 304 271 -66 -139 -201 44 -177 31 43 -250 -206 -252 -10 -80 206 -63 -103 13 -8 121
2652 121 100 79 304 78 -183 225 188 -135 186 -37 150 101 -46 79 18 -84 41 -412 -364 19 52 -88
2674 -88 -438 -10 -197 -80 -175 165 114 -57 1 -132 57 15 235 237 216 -127 3 -6 75 200 -91 -104 13 104
2698 104 39 143 -344 -162 -115 -134 -84 -170 -404 -104 -138 37 210 14 -25 48 -10 64 -49 27 137 84 -92 333
2722 333 232 -42 76 -108 148 70 -45 75 -14 -96 -229 62 -129 -220 200 -222 47 111 8 -224 -209 -90
2744 -90 -90 -160 180 128 71 151 200 -26 59 38 -62 125 340 131 149 -25 38 -12 167 216 49 -312 -14 -117 -10
2769 -10 140 -35 -108 -352 -129 -85 -69 -286 -150 195 -54 -23 -11 24 186 226 -133 115 -100 128 -29 -23 81
2792 81 106 -112 189 68 -200 154 -108 -133 -112 -9 -5 -126 -208 -90 -43 96 189 -11 -50 105 73 84 -89 85
2816 85 61 51 -173 163 182 51 -6 103 52 169 -39 150 -16 97 -73 -93 -166 16 86 -247 -108 73 -119
2839 -119 -5 156 -115 -146 -214 35 133 83 331 191 56 -4 -65 353 -30 203 28 235 115 -260 236 3
2861 3 12 -187 -251 -194 55 -124 -121 13 -122 -421 -18 95 9 -163 -132 -46 178 122 201 89 217 -65 32 16 -18
2886 -18 -29 -14 47 -204 -37 211 -37 -262 -278 -104 -136 103 65 15 43 35 -228 -98 204 35 3 58 110 125 -14
2911 -14 -26 19 90 65 279 -50 304 140 201 -212 -240 203 143 -31 -135 10 -195 -160 -139 27 -211 4 -115
2934 -115 -303 -176 85 -52 46 -135 -41 8 126 162 183 130 -50 222 -142 276 25 58 231 -5 254 45
2956 45 -26 -9 -31 -153 -38 28 269 153 -9 12 -214 -208 34 145 -184 -159 46 -110 182 365 65 -94 73
2979 73 114 -24 193 163 -77 -60 -41 -37 -68 -67 -24 -264 -5 -68 -317 -85 -103 -60 -70 -206 -219 -72 124 -186 142
3004 142 -222 17 -150 144 220 155 57 2 79 290 125 66 169 -23 336 185 30 -63 14 -57 -132 -161 149 -106
3028 -106 -36 -231 -103 -173 2 -21 -31 -214 -99 -336 -25 -35 173 114 -54 -30 263 -119 118 5 235 144 -108
3051 -108 55 -7 39 -56 -5 -160 -271 -382 28 141 -81 -258 -166 -100 -106 -179 187 30 -110 -284 100 183 234 109
3075 109 40 80 -131 248 198 280 -146 -37 155 54 113 -51 -165 -118 -185 -309 -74 12 65 -62 -102 -121 35 257
3099 257 114 88 -32 121 84 -4 175 -15 166 95 13 243 214 174 -238 95 -8 -50 8 -270 17 -152 68
3122 68 -45 -28 205 -20 127 140 -36 97 -39 -141 88 -123 166 -9 -16 47 109 -9 -21 -164 61 66 -163
3145 -163 133 -47 -130 -47 -45 45 31 -72 63 -178 -225 -68 84 -53 70 -196 -95 200 52 -50 -134 -71 -142
3168 -142 13 122 342 194 105 -93 106 88 135 -267 -23 -160 -164 20 37 -3 86 -83 -89 -206 -140 -164 70 -93
3192 -93 200 -155 -67 3 96 -99 143 -2 39 235 -60 -42 103 11 75 52 6 7 120 -31 178 -19 -226 33
3216 33 -224 -69 49 -9 -335 -8 67 -200 -65 -179 29 -15 -118 -65 -32 25 214 157 92 0 223 75 70 281
3240 281 270 34 -31 326 -9 57 -108 182 -19 150 27 -426 -277 98 -3 -97 81 -165 159 -234 182
3261 182 160 -155 -72 133 -92 31 -20 -8 261 -31 22 85 24 327 30 76 -42 -191 133 146 146 -431 -42 -74
3285 -74 19 63 36 -195 -371 146 40 -26 321 121 58 48 -25 34 196 171 32 112 -48 -84 -55 -247 0 35 -3
3310 -3 -264 -109 -20 111 -154 -278 -66 -91 -167 67 31 168 -104 37 121 255 212 -107 -20 71 126 131 14 -122
3334 -122 65 55 -89 -35 5 -104 -233 -74 -150 -39 -55 -7 141 -50 -7 177 -126 -134 -219 156 -207 27 -45 -153
3358 -153 -111 69 21 -6 55 286 111 81 -121 52 149 440 -42 27 189 19 176 -324 97 36 -123 -145 -40
3381 -40 -129 64 -161 -280 -176 -30 51 -188 -63 -142 43 59 -172 -17 30 -25 -189 26 51 317 181 122 -21
3404 -21 -61 92 106 193 -105 -77 -240 118 -105 90 86 -147 101 -150 63 -59 -68 146 55 -281 -129 -121 -242 20
3428 20 248 266 106 107 22 11 49 -69 6 163 -321 151 -46 223 -132 -122 -334 3 -73 -91 -100 -15 -90 42 -5
3453 -5 43 194 -57 80 139 75 -146 45 314 -4 201 -143 227 557 -34 154 -29 -323 -44 190 -66 -184
3475 -184 -81 -57 78 116 -93 46 -223 -92 -242 202 -129 161 101 -210 -87 -90 45 54 97 38 1 -74 141 -61
3499 -61 140 10 39 93 33 24 12 -223 -167 18 59 129 185 -116 -232 -31 -52 58 -113 -365 111 117 -37 21 73
3524 73 287 211 -258 67 -29 104 -44 166 21 86 -122 -120 -35 131 -127 81 -39 -9 -261 -51 -197 -181 -70
3547 -70 -152 -119 -79 31 -19 -120 -98 25 55 135 47 33 208 121 30 181 60 113 126 -68 -4 -13 190 -88 144 -94
3573 -94 -347 104 -85 8 -111 -212 168 -15 -43 27 -40 102 -231 -38 -167 -68 325 88 -136 197 337 56
3595 56 280 190 96 -201 21 38 -69 -68 -176 -91 -123 -291 -164 -136 53 88 -135 25 119 -55 37 -25 -122 -189 47
3620 47 179 127 256 -66 -17 82 -80 4 84 102 145 -54 274 113 45 4 -62 -49 73 -66 -4 -72 -84 -53 -6 -32
3646 -32 172 126 62 15 96 -19 149 -67 27 2 47 -17 8 23 -27 -54 76 -165 -98 125 -65 -130 -234 -287 -164
3671 -164 -266 221 -145 -110 -51 -134 105 126 82 6 -27 -22 -52 2 -115 105 178 60 263 -114 12 215 126 194 -100
3696 -100 -1 164 -365 122 13 -172 -200 -175 181 38 -124 -265 10 -171 24 -22 189 -114 133 -17 -28 35
3718 35 225 57 5 -43 17 -61 240 329 -63 -145 121 -70 19 -48 -162 -149 -30 69 195 71 -152 25 -196 -51
3742 -51 -69 -187 -154 219 -144 -116 -94 -30 -71 255 -11 60 -24 -15 -20 -63 142 170 -31 -204 95 -175 27 -267 -134
3767 -134 -272 -48 -194 15 13 -193 -18 -198 175 105 13 176 98 -169 400 318 -14 94 -49 54 -18 -96 206
3790 206 282 -145 205 35 -16 14 -50 55 -72 -49 -136 -25 -12 34 -55 -262 -251 6 -326 -46 61 29 -102 -60
3814 -60 -20 -22 -27 -140 -3 152 118 -151 -213 171 105 -258 -198 26 -123 -63 -247 -321 -133 -224 46 -12 -182 -24 53
3839 53 118 -71 43 -24 -156 -182 -119 139 133 253 116 159 124 -54 109 -121 90 75 -48 -33 -114 5 -72 -231
3863 -231 -66 -345 -138 -70 -174 -233 -191 -72 -26 88 134 32 -57 -275 -4 -5 126 95 -41 186 235 50 -123
3886 -123 50 27 -119 -132 -223 -121 254 158 -162 -180 -188 -448 -195 165 -306 -26 -68 -8 60 -156 103 11 -156 -164
3910 -164 134 -46 -64 86 -112 132 24 64 -174 -29 -126 -143 147 -122 -114 -141 -16 170 -73 -298 2 -140
3932 -140 -137 -43 -257 50 10 4 180 -287 -48 -204 83 267 228 141 -114 -61 -48 136 160 -44 80 19 -22 -21 -2
3957 -2 49 -187 -230 -186 -127 205 1 -40 -155 64 -247 -149 116 -199 23 -154 -20 60 116 268 98 325 -257
3980 -257 -88 -95 79 77 126 61 -47 114 -30 190 -92 -134 -160 74 -265 -193 37 -315 -54 -123 14 -110 -41 -20
4004 -20 -147 -101 68 128 87 85 -2 108 -99 114 51 39 136 119 -49 -106 -80 -97 -220 -268 -482 -45 -122 51 -55
4029 -55 -156 125 -215 -23 -184 -122 42 -111 147 -232 -34 92 -61 67 25 -64 71 1 72 339 16 -192
4051 -192 -245 -48 48 18 139 -39 11 -68 71 102 76 -235 -282 210 107 66 -193 -42 -90 7 323 -49 164 171
4075 171 45 -34 124 131 -89 109 130 -80 3 18 64 -23 -49 170 54 -175 -222 -143 163 160 18 -95 -118 -78 299
4100 299 -61 -10 43 252 162 120 366 81 341 -18 -13 77 263 165 35 38 -40 156 98 -113 -246 -216 -148 115 -57
4125 -57 158 0 -66 -186 -64 8 -80 -208 -7 -2 75 -100 176 -44 285 -47 64 312 19 20 215 149 -143
4148 -143 -282 -325 90 -96 -67 -121 61 -135 -163 -65 -112 -97 -212 -281 -232 186 148 67 -182 117 213 134 39 201 208
4173 208 -170 -21 -10 119 104 270 48 -80 -97 -146 -140 98 -169 -318 -19 -222 6 14 203 178 -13 176 102
4196 102 -246 217 52 83 173 80 123 -105 264 136 -22 48 125 194 -4 -81 147 -88 -45 -337 -220 56 -272
4219 -272 41 25 -339 -116 -78 45 4 167 152 -47 -17 -180 228 61 52 264 67 93 163 94 193 -1 29 62
4243 62 -12 -94 -202 20 -78 -79 247 -7 2 -27 -3 -155 -296 -73 143 84 -99 7 106 128 70 -32 -43 -157 -48
4268 -48 -39 -114 196 105 3 -26 -195 13 57 0 115 -164 -103 314 -43 -159 -61 4 73 -231 -183 177 52 81 163
4293 163 71 -46 101 252 -208 296 206 17 224 298 159 -1 92 74 -92 -60 -159 68 79 -2 -90 26 -152
4316 -152 -233 127 93 -82 -64 402 -116 -66 177 82 -32 -73 60 162 71 58 98 298 317 89 -13 -209 170
4339 170 -18 -92 -181 -9 -222 212 13 -254 -104 -97 -316 25 -82 -98 90 29 -80 -314 85 55 -47 2 -109
4362 -109 157 12 126 -103 36 131 123 117 -164 132 86 -32 -167 48 -313 173 -96 -337 -31 -138 -153 210
4384 210 -29 -215 -267 39 -33 -26 13 34 16 221 -75 64 13 -52 -57 246 171 -87 205 -17 82 -17 61 -4 -126
4409 -126 -16 14 0 63 -306 -228 -178 -154 -2 -237 228 -230 -195 -24 75 -21 -111 -140 12 128 -79 194 -32 -111
4433 -111 99 -65 121 125 8 -48 -57 -23 283 -32 -39 -177 -51 -18 -153 -227 -128 -175 -159 -16 86 -26 -123 -68 220
4458 220 106 -25 -62 90 210 213 -8 148 52 54 -29 334 91 -141 144 -51 -112 -10 -63 -171 -323 -197 -108
4481 -108 195 -16 -281 -318 -126 211 115 295 53 198 -10 267 -167 143 37 150 316 239 119 137 71 156
4503 156 112 85 -10 -149 14 -90 -249 -135 -217 141 23 -31 -265 -162 -42 -133 -62 -29 231 2 -83 -124 31
4526 31 318 75 -69 -64 -158 60 23 -290 -62 104 172 -123 -166 -207 84 18 -69 -182 -323 -78 -326 41 -36 -5
4550 -5 -113 -19 62 -30 -194 -34 83 148 -100 126 -154 256 68 -127 179 79 -134 -83 28 206 -290 -107
4572 -107 -276 7 -308 -297 4 -318 -232 -40 -76 183 -92 -89 275 -118 -123 -10 152 58 220 127 -294 224 85
4595 85 -98 3 -161 -240 -118 -56 39 40 86 -23 -107 -48 -33 144 -58 47 11 131 67 149 -33 -228 -92 271
4619 271 -217 -79 -41 -214 147 -246 159 191 139 -34 180 -165 -70 16 -145 -113 -22 116 -54 -46 -96 -93 -155 -121 -8
4644 -8 214 -110 51 29 -88 -11 -55 -79 -67 98 170 15 20 -71 195 13 -31 269 -112 67 -266 47 59 -86
4668 -86 58 -203 54 -46 -112 -5 66 50 -172 -101 -79 113 125 -5 148 290 -85 99 187 41 -108 -50 45
4691 45 80 38 -6 152 132 97 -176 -70 -99 -18 101 -67 -128 -53 -87 -117 151 -142 -262 -42 -107 134 47 138 4
4716 4 128 84 -41 106 -77 153 113 173 -13 189 210 -2 -210 -69 101 9 225 -1 -72 -218 -51 -197 78
4739 78 -147 -194 -111 -290 25 55 -86 207 -12 89 49 44 15 -395 96 111 16 68 259 200 203 -83 157 26 -9
4764 -9 -99 -3 -56 -191 -45 -206 -229 -148 -31 -54 43 -169 -31 9 -148 -1 195 -55 -279 84 164 105 59 -15 206
4789 206 -164 113 -87 -46 156 -190 -126 20 -137 37 -366 -147 156 -155 -197 -177 113 166 -62 106 41 -35
4811 -35 -217 290 -261 209 -33 253 26 104 -7 -144 78 182 29 32 -22 -153 24 90 121 -100 -46 -170 150
4834 150 -178 -68 -86 -9 95 170 -141 157 15 -67 -17 50 109 144 -25 123 292 197 161 97 137 5 -48 249
4858 249 -117 -39 -196 -209 357 32 100 44 15 39 -97 -170 -106 -96 38 42 -21 112 -197 142 -33 74 8 142
4882 142 -123 96 -24 108 59 -99 39 -46 358 -54 0 28 -11 -94 -130 -14 -16 -178 -52 -273 106 -125 5
4905 5 69 -88 -37 87 219 127 341 -47 68 56 329 150 282 66 2 163 -131 52 -35 79 -140 -63 -10
4928 -10 -150 -65 -184 -176 51 -105 -309 -228 -43 -3 -221 -46 238 69 279 45 -133 178 108 -256 27 322
4950 322 28 2 -42 -274 91 125 57 16 178 -112 96 -103 -214 -140 -82 108 -47 142 -42 -175 -106 -12 -98
4973 -98 49 11 -94 -25 156 -142 -173 332 89 -30 -149 194 100 55 167 -54 -174 -83 -93 92 -103 -101 -71 -101
4997 -101 -42 -298 -178 -139 -97 44 -7 134 21 4 92 -293 42 -42 60 254 149 -128 70 -221 -88 24
5019 24 298 46 -27 35 -28 3 -24 -130 -353 53 -92 69 -97 -10 -103 -69 -105 -36 -176 51 -178 40 40 1 -27
5044 -27 -160 124 152 100 193 117 -57 104 -61 -131 228 14 16 -8 8 -70 27 -49 6 55 -345 12 89 150 -93 88
5070 88 -25 2 -149 142 80 1 146 212 0 237 302 63 56 -216 -13 160 -106 -181 36 14 117 -269 -80
5093 -80 -6 -138 19 -188 -80 -94 -225 -78 7 -135 -103 203 286 -98 148 -43 65 184 159 291 124 -228
5115 -228 -65 69 -145 -164 -60 -113 -132 137 7 -11 164 -27 -175 -1 -67 135 -111 -78 -131 173 -69 48
5137 48 87 29 -26 -225 194 183 -169 161 100 30 -23 64 -178 -54 -131 152 -254 -111 -79 -137 -140 -69 -139 116 -84
5162 -84 -54 -20 -324 238 -73 139 68 -44 -18 -34 266 356 146 108 -102 11 -184 -140 79 -360 -180 -100 -241
5185 -241 -96 -121 80 58 -212 -260 -130 -93 -49 -159 -53 -170 -84 240 -39 24 -86 54 101 109 23 100 -5 149
5209 149 46 160 47 97 -148 -69 -101 15 -51 -344 -245 -280 158 86 -236 19 91 226 3 -174 -2 37 -23
5232 -23 27 25 -38 -9 -87 54 224 2 125 131 117 -108 -16 -31 -87 160 173 -33 60 57 -37 -27 -57 -74 -51 -63 68 -198
5260 -198 -241 262 -6 85 -27 -57 60 34 145 252 150 -264 -19 -18 14 -202 -91 362 -109 -161 -209 -325 -244
5283 -244 -153 116 148 48 -126 -168 -63 -253 -163 88 133 -144 218 17 102 9 -66 47 -133 12 486 213 219
5306 219 -24 29 22 -173 -49 -87 187 -76 158 73 -14 -162 -251 171 -32 -56 -163 82 -152 -142 -40 -78 -232
5329 -232 227 -49 -57 178 86 152 318 187 -188 -101 131 -69 -141 -57 114 171 -212 -166 -213 -99 -110 39 -1 -11
5353 -11 -113 -349 -238 -134 61 168 -20 -99 52 -103 63 176 79 54 -66 194 230 -197 -139 125 72 -197
5375 -197 44 -55 -219 -117 25 17 -44 -47 134 89 -173 -249 -101 17 100 63 -180 94 -58 228 -34 149 -38
5398 -38 -53 -185 -27 44 152 -183 79 -107 -78 -26 146 -80 -198 29 130 90 30 -263 -68 -183 -172 107 -152
5421 -152 66 90 -67 158 -29 117 42 135 -195 -18 -53 156 -113 -123 84 15 86 -5 -192 -83 -158 150 174
5444 174 -138 189 93 -88 -245 83 -95 52 25 -3 -105 -31 65 -47 14 54 202 118 6 -24 169 140 157 -186
5468 -186 5 65 12 108 34 -23 -41 100 -98 -57 -14 114 -226 -137 15 -99 -187 141 112 -11 -81 14 -166 -109 137
5493 137 16 -39 -83 114 70 175 -255 37 91 173 45 -16 -90 132 -36 176 -9 -29 87 -45 -19 -225 -27
5516 -27 52 63 -79 -215 72 101 -111 -36 -38 -78 -8 94 246 115 95 143 241 120 -117 60 -35 20 -195 23 70
5541 70 -19 -312 -248 -118 -113 108 -42 -9 -57 -174 -162 -231 63 78 11 1 -311 -229 42 33 18 249 86 -3 -133 182
5567 182 -158 67 -14 -44 47 -48 -296 27 -284 -79 -126 -79 -19 -65 -43 244 -63 156 7 212 71 20 -7 84
5591 84 9 -184 -44 153 34 -5 199 143 172 170 183 381 -110 145 -66 112 171 -164 98 136 85 -490 -68 -107
5615 -107 -157 -119 63 181 -101 -6 -145 -65 45 98 139 -73 126 -73 -13 152 83 -74 174 4 151 9 -64
5638 -64 -56 60 -82 -46 -10 57 -102 229 -69 -124 151 82 94 231 44 -27 -147 -359 17 41 77 252 50 -185
5662 -185 22 -136 106 233 -97 261 -56 21 -117 226 70 -133 12 4 -52 208 11 -294 188 49 157
5683 157 -54 77 -60 -172 56 138 78 -178 42 28 7 70 189 114 -128 238 -107 65 -30 -54 -302 -43 40
5706 40 81 151 -148 -133 -243 -17 -175 -89 -59 208 98 -68 277 -68 171 428 -48 174 235 195 122 -178 -3
5729 -3 182 -214 -210 142 -269 63 12 -46 -92 -239 -145 -294 56 76 -88 -93 23 -167 58 45 274 -4 38 134 -159
5754 -159 47 344 -170 -296 226 48 -94 179 72 -51 -124 95 46 -249 -136 -104 -21 91 -170 -165 -52 -118
5776 -118 -9 15 -332 -147 37 -51 256 165 -76 -84 179 40 -49 39 -2 30 45 -15 -32 52 105 28 64 -44 54 -70
5802 -70 249 -207 -33 -151 182 -64 -100 -8 102 109 22 -73 80 -35 132 221 101 207 186 -175 -195 30 56 -175
5826 -175 111 -187 -87 -21 -72 -188 -103 214 199 -128 -41 -44 -96 23 65 -377 -100 -55 164 156 -4 199 159 50
5850 50 -222 203 75 -29 -12 28 66 -170 97 347 71 -124 7 110 124 -327 197 -163 -107 -296 -266 -149
5872 -149 -47 -85 13 186 88 -153 -112 303 53 245 126 68 76 -122 209 -166 215 55 203 50 -86 92
5894 92 32 -177 -12 -22 -132 152 -36 72 -69 -237 -150 -13 170 -64 65 256 -62 206 -81 71 103 59
5916 59 -146 7 38 167 159 38 -235 355 -52 -148 -127 -130 -30 -181 151 -192 -2 145 71 -99 66 177 -129
5939 -129 54 58 287 236 -63 -85 -33 -116 119 59 118 203 -10 -12 128 -7 -369 288 -123 62 103 122 -291 -157
5963 -157 3 -125 -222 -211 99 104 -250 -129 7 -23 -156 -125 -142 363 -60 141 24 74 -6 136 -116 78 281
5986 281 15 226 -64 80 95 261 -82 -28 38 -176 12 -36 253 153 -288 -65 -29 33 -112 -80 -61 177 -82
6009 -82 36 -62 204 201 248 11 183 119 -1 144 86 63 156 -25 53 -188 -67 129 51 22 -81 -418 -132 -47
6033 -47 -217 -99 -137 10 63 136 113 75 69 56 -150 50 0 -27 74 39 57 143 -20 48 259 111 -94 -59 -68 -322
6059 -322 21 -138 87 64 -177 246 -69 -119 55 -412 37 -50 -80 -5 158 122 154 -218 31 -26 102 -42 180
6082 180 131 -55 -54 65 -121 -10 -127 82 -44 -18 -177 118 -65 -23 -66 -43 31 -36 18 -17 -10 -76 -63 319 20
6107 20 -44 201 -153 116 42 -14 54 35 -20 -104 194 53 -169 63 -33 -126 231 -12 -120 135 41 131 -204 1
6131 1 34 -32 -50 -41 203 66 -97 51 0 54 -34 299 33 -137 110 292 132 -80 34 3 -125 110 -170 115
6155 115 -243 -33 -222 95 -93 52 -99 222 99 -96 -2 75 -55 -20 50 -79 222 -17 187 -25 34 -32
6177 -32 71 31 -144 -60 -70 -161 123 -210 10 69 -15 -67 -131 -259 -80 -3 -47 -159 -62 -150 50 -19 -339 -204 43
6202 43 -19 -328 -25 32 158 184 -7 79 -8 127 -113 155 261 -37 -79 53 -152 4 -89 22 -112 34 125
6225 125 165 -16 69 -175 63 -39 26 27 -207 -71 -43 -37 -136 -33 133 -15 11 60 103 0 -85 210 127 39 -156
6250 -156 70 56 -65 85 98 -113 -137 -63 -174 -16 36 -113 -19 44 97 179 -8 23 187 125 -104 -31 -129 -138 -89
6275 -89 0 -85 -69 -189 50 44 -93 -280 -101 -42 -161 -105 -312 -139 206 -45 184 -159 -300 -249 -107 -17 108
6298 108 196 155 70 261 -177 195 175 54 137 -83 78 24 160 53 53 -141 153 -136 -239 -73 155 -31 20
6321 20 -26 -109 -139 -56 -155 30 81 -14 -134 -40 129 370 -237 47 -122 89 46 30 -45 44 45 332 237 -222 103
6346 103 -211 150 -67 -31 -199 -134 -212 111 -23 -84 -97 -257 -168 -8 285 -25 70 97 -103 204 -21 2 -13
6369 -13 19 -41 -78 138 -125 -40 -16 -30 -103 96 -203 -318 -34 -231 65 -119 97 -36 -38 -223 -24 49 155 -125
6393 -125 14 -97 -5 65 -211 143 98 -8 -39 64 144 -116 195 254 22 26 -124 -162 -110 86 -42 -259 21
6416 21 76 -182 42 64 170 38 108 38 81 -135 -140 -290 -73 127 107 80 -65 -91 43 124 55 49 167 107 -9
6441 -9 190 16 -44 5 -151 -114 -12 -237 -105 -30 -238 -338 -23 -240 51 -91 -156 59 62 11 208 48 124 -72
6465 -72 6 143 -123 106 122 -60 91 -304 -128 -212 93 -159 159 -27 -87 -69 121 -108 -55 -230 69 29 -61
6488 -61 -122 -37 48 29 36 46 -20 -11 -49 -13 205 159 144 67 179 -73 -186 -53 68 -105 212 -112 75 -87 -341
6513 -341 -134 -195 -4 21 -129 -239 -7 -211 -53 2 28 -51 -26 13 -239 287 -66 133 -174 -20 -83 177 40
6536 40 7 89 -147 -11 0 -52 -153 94 69 98 -32 123 -54 25 -92 168 79 -127 -229 -35 386 144 -120
6559 -120 154 78 56 -42 290 3 203 -73 -25 163 54 91 109 181 -109 -185 250 -133 43 -148 -90 35 -121
6582 -121 22 -54 56 40 -7 -213 -255 -105 127 46 -3 -46 91 168 25 -84 -45 40 159 -2 161 6 123
6605 123 382 -254 -21 112 -123 -268 -24 95 -241 99 -43 -127 -85 -73 -152 -104 4 6 -94 -134 135 11 -105
6628 -105 -81 -63 29 -235 13 -30 -83 55 114 106 -290 -102 172 -138 -47 87 -198 172 -57 -76 77 146 13 -182
6652 -182 60 44 186 -8 197 6 197 -33 -69 37 249 248 -77 -54 -38 9 28 96 -160 276 -38 78 -55
6675 -55 -161 153 137 -1 -11 -567 179 7 -48 -143 -43 88 -35 1 -70 -178 217 -88 84 52 106 154 9
6698 9 92 124 136 -153 -128 -16 175 -256 -149 72 -3 -275 141 12 94 -54 -77 -23 22 81 -144 73 184 -228
6722 -228 -193 173 5 111 111 86 111 -7 11 190 -252 335 -18 -70 88 -64 -278 -95 -86 109 61 -142 -15
6745 -15 -75 -141 -58 -117 -89 115 83 258 -104 1 -99 -16 156 -294 36 236 84 52 -22 -245 86 143 -166 96
6769 96 -221 8 -363 30 160 21 14 -441 52 -57 -38 -70 277 -65 65 157 3 -213 136 100 88 219 179
6792 179 186 -34 282 -144 105 -236 -46 150 -60 90 -181 -160 88 6 -155 -22 -97 -137 102 -51 -10 5 19
6815 19 27 -203 -4 -100 64 -133 -113 -48 -99 -127 181 34 -25 70 -27 -5 -238 -4 101 -348 -98 -27 -51 64 105
6840 105 -72 -248 133 54 -41 -183 -177 80 23 153 -143 2 4 -94 220 313 -119 236 -179 -129 -107 16 -140 56
6864 56 -181 -151 50 181 -159 -47 -88 -112 163 109 2 107 95 -25 -118 -158 -22 41 81 57 -71 50 -38 151
6888 151 61 -50 93 -89 68 76 121 82 -158 -79 29 -132 -20 92 -26 -5 -120 -53 -15 1 8 -142 -29 -2
6912 -2 19 -178 -112 -103 -38 126 2 3 -19 -38 66 73 -45 -108 46 139 111 50 -105 -178 -76 -276 -20 -180 50 14
6938 14 -81 -41 -67 -162 -84 -147 -6 -62 -10 -7 -60 10 266 17 -14 -65 -48 24 54 86 45 10 18 -147 1 -124 -257 85
6966 85 -195 -69 71 134 -165 -55 -17 183 -136 128 -153 -164 198 30 393 114 -24 57 194 7 -169 26
6988 26 306 318 60 402 -114 -108 -3 -100 -24 -65 -54 262 -8 7 39 -144 -93 -123 -235 189 260 -3 191 155 214
7013 214 -50 -120 -226 156 -15 -23 -10 46 35 4 -53 276 118 54 -35 78 46 -150 168 77 -113 275 -31 99
7037 99 -107 -49 -183 123 201 201 -97 -20 -55 98 122 -221 -12 -161 193 -136 153 81 -36 -67 -61 -71 -22 -73 -116
7062 -116 -178 0 -116 85 -127 -46 -113 -45 9 -262 133 -82 129 13 -94 -97 206 92 109 84 -71 131 -63
7085 -63 -92 177 -158 45 152 -22 11 -223 -27 -80 46 8 119 31 139 -1 44 52 60 -73 -154 207 -201 -10
7109 -10 22 -262 53 205 51 85 148 101 60 188 -158 208 74 101 -255 -100 -192 -210 74 -123 20 -16 -58 -43
7133 -43 130 -107 -219 288 40 43 -76 122 -30 62 164 373 -109 -27 90 -77 -37 -171 103 -181 -149 51
7155 51 240 -51 -87 -185 -78 15 -59 -245 -95 196 -210 -125 111 87 -1 -13 -98 -130 116 -108 -133 49 -55 -90
7179 -90 154 164 -105 194 74 -28 -21 -64 250 -32 -120 -97 -11 133 -102 75 -170 -106 146 -139 -200 -11 1 -109
7203 -109 -30 -10 98 75 -77 -299 148 124 -115 -71 -26 -123 99 -58 14 -290 19 2 79 266 -73 -93 -151 -17
7227 -17 32 -56 -224 228 -158 -181 -82 164 89 -25 117 78 -23 20 -61 98 23 -16 81 -242 -46 -212 -321 -205
7251 -205 177 -136 -35 25 -138 -104 15 21 -100 243 -186 177 -34 -206 -152 -65 -135 85 100 96 0 86 0 46 112
7276 112 254 -104 -10 -90 -41 -40 100 234 -280 -9 -97 -126 158 4 -85 12 0 154 248 -68 -113 116 120 -18 -41
7301 -41 65 85 269 56 -159 47 -189 -55 245 -176 -292 21 -1 -118 -54 -217 47 -110 -172 -160 -238 16
7323 16 -241 -69 38 -128 -31 77 108 -1 17 39 104 202 -178 84 112 50 164 -59 -49 64 -74 -41 60 -125
7347 -125 -38 -40 18 -23 -109 -6 -10 -233 208 -40 -68 57 107 -17 -31 96 152 -56 -344 -151 -134 2 -80 157 18
7372 18 -130 -70 166 -150 -68 -57 -145 -44 -199 -176 -215 -20 -318 -97 -34 -48 -85 -36 146 -30 319 -229 167 -162
7396 -162 -176 117 -53 -119 92 -196 -28 185 38 -52 269 -361 -70 -74 -49 43 -251 -102 1 -69 -111 11 181
7419 181 59 132 151 -13 122 -122 -79 -43 12 17 7 -65 129 130 -8 98 -77 8 36 -194 76 -72 34 -43 -70
7444 -70 -21 -161 -65 -21 -135 194 43 -43 37 83 75 -7 119 -181 -111 -29 -29 106 100 9 -94 50 34 -253 29 -51
7470 -51 2 102 72 23 -177 27 70 -11 -77 -127 -87 -5 55 97 -72 75 -158 276 -162 210 105 153 8 14 142
7495 142 -139 31 41 -62 16 -209 -135 -280 16 -50 -149 159 -37 -267 -6 -92 -197 -191 144 -98 -265 -165 -126
7518 -126 -17 -79 -39 -35 37 -139 186 65 103 -184 122 -69 -34 31 -216 74 -144 -315 -168 -147 -98 191 -80
7541 -80 -70 -225 222 42 104 -65 -80 158 -167 148 -27 -217 31 -70 74 104 -50 124 15 80 85 54 11
7564 11 -5 44 157 -24 222 -75 50 -3 74 166 5 20 117 330 27 37 -92 272 -148 38 -88 -258 46
7587 46 -115 241 -208 -70 158 17 39 -11 260 79 -90 166 -122 132 49 2 4 -1 -113 -46 189 -138 56
7610 56 -53 -66 69 199 -66 46 46 9 66 50 30 154 66 -178 -95 -103 60 36 -211 -64 79 14 -45 324 52
7635 52 14 215 157 70 -27 -243 -70 -200 34 26 -76 -68 -80 -97 51 -28 -63 37 82 227 124 -9 148 -186 28
7660 28 -262 -144 376 -92 297 -161 180 224 -198 -6 -115 -98 157 -110 -124 -69 -261 70 156 -49 -23 7 -251
7683 -251 161 96 -278 27 -229 52 -132 -94 -186 -159 -265 -34 -168 -194 36 149 134 89 175 164 -53 -33 -103 -227
7707 -227 -82 179 -118 265 99 127 -138 -23 -219 -138 -170 186 127 85 -133 159 49 -129 -95 129 66 -93
7729 -93 -112 60 248 193 112 68 -246 -94 188 -76 197 228 158 3 141 -68 -122 -128 -42 -138 48 -180 -181 69 -1
7754 -1 -202 -13 -10 51 110 118 -102 49 343 15 -9 -39 -99 84 -83 26 -107 -185 103 -156 -35 69 1 -207
7778 -207 85 152 7 -155 86 238 -33 -51 199 81 21 141 182 27 81 187 115 -76 49 101 83 -256 -102
7801 -102 -301 -293 143 -74 -181 -63 -216 -171 132 -129 -126 -86 43 -200 -136 21 -78 43 47 -102 -17 -67 282 -174
7825 -174 -112 -71 -33 -11 134 -2 -108 56 25 -91 82 -12 62 -6 -122 -71 -62 -64 -115 -198 -53 -194 6 184 -98
7850 -98 209 228 -125 63 229 121 65 -134 24 -141 104 -79 13 235 68 -47 -49 -186 54 -24 -98 130 -54
7873 -54 -117 28 52 -188 -106 -210 -15 179 -156 44 261 -89 21 -139 -114 0 30 -222 -194 9 127 -117
7895 -117 184 -3 59 -81 33 59 95 -330 -378 -309 -171 81 -42 141 90 44 17 178 -171 -5 -26 173 -64
7918 -64 200 7 -47 117 356 69 33 65 -114 -43 6 102 214 -40 -203 -88 -160 -39 -40 -199 -20 50 -223 -47
7942 -47 51 82 163 127 -160 -288 3 -85 93 -151 34 -71 -32 -2 -87 -62 52 153 -212 87 -50 98 -214
7965 -214 -103 -35 6 58 -112 42 127 134 76 77 70 -34 -105 108 -98 137 156 -17 -13 -176 128 -113 -59 -74 153 126
7991 126 -39 43 -247 97 -162 58 -22 -19 -19 -142 -97 -152 -32 -10 5 98 -110 -120 -70 -48 -52 229 -20 119 -19
8016 -19 -223 81 54 251 94 70 -105 -4 29 159 -48 -42 -331 -73 246 375 108 76 -51 -40 220 -171 -128
8039 -128 92 -147 80 -257 201 -27 135 89 226 236 -56 104 -284 8 -9 12 23 80 60 8 -29 -154 -90
8062 -90 47 -82 -48 27 1 -176 -31 -22 -188 -112 -146 -110 -37 34 -19 53 -95 -110 356 159 -209 -146 -28 -4 126
8087 126 -43 -42 11 179 -3 -200 -8 206 -39 -468 18 -73 213 -36 -13 225 73 126 195 79 56 318 41
8110 41 -42 -124 21 39 -45 -300 97 -176 50 -66 -69 -95 52 51 -88 -170 56 11 53 41 39 199 -19 168 0
8135 0 -50 -68 275 106 175 467 -13 10 190 -193 -132 106 0 -68 75 -75 -286 2 34 -54 68 -69 50
8158 50 -185 14 -104 107 24 -52 92 -5 59 98 59 22 103 -50 -9 252 82 -38 -136 128 150 -90 109 135
8182 135 250 87 -54 312 73 79 35 220 135
8191A35
$$ Imaginary data points
##PAGE= N=2
##DATA TABLE= (X++(I..I)), XYDATA
0 0 0 0 0 0 0 0 0 0 0 0 0 0 0 0 0 -8 8 -8 8 -8 10 -16 16 -17 24 -24 32 -34 40 -48 53 -60 68 -77 86 -99 109
37 109 -123 137 -153 169 -190 209 -233 257 -282 312 -344 377 -416 460 -505 559 -616 680 -754
56 -754 839 -937 1049 -1186 1348 -1553 1813 -2157 2637 -3356 4544 -6846 12939 -64015 -132775
71 -132775 51598 68695 -17109 6765 40576 -20723 -3349 55911 22810 -25143 7865 20678
83 20678 -8469 -10688 15503 16383 471 -6347 2805 3132 -2769 -5936 -9542 -5452 6945 -11048
97 -11048 -26453 5647 21880 -8473 -2324 27070 2423 -17565 17194 20328 -4192 10088 6454
110 6454 -28208 -8782 29687 12420 -13519 -11968 -9105 5343 21025 1132 -14578 3238 2532
123 2532 -16659 -4517 10231 -4874 -17651 -11861 -4540 -1228 2499 7871 2505 -9547 5005
136 5005 24082 1522 -16433 11966 17969 -16833 -13367 13003 -1865 -10088 14867 9974 -13099
149 -13099 -4667 7665 2336 1345 -1893 -14214 -15994 -6381 3411 8273 -3604 -15174 1135 16333
163 16333 1928 -4851 6968 2608 -8454 -7861 -5696 -1647 4226 -348 -6962 -5279 717 10542
177 10542 13802 -292 -6867 7494 8406 -4160 3227 11573 727 -1749 3743 76 2113 7850
191 7850 1070 -2943 -388 -5914 -6106 5565 3473 -7661 -3471 -1472 -6489 2549 10087 -1014 -6559
206 -6559 1524 5469 3084 721 4083 8929 1764 -7955 -1610 6958 816 -3924 -1438 -7092 -9382
221 -9382 2122 4519 -4583 -4565 -1364 -3515 -4259 -4128 -492 3352 -4590 -11433 -1067 7134 1605 1880
237 1880 6585 -282 -3667 6470 7727 1392 835 -132 -1878 691 1690 2875 4167 -578 -4510 799
253 799 1199 -5217 -1041 3601 -4370 -9364 -2351 2369 2121 2051 -1207 -2410 37 377 2204 3679 -559
270 -559 -1931 1927 742 -1087 4969 7783 -367 -4135 -771 1067 2347 1452 -2258 -2925 -2352 -2829
286 -2829 926 3611 -962 -3251 -805 -2445 -3572 937 1390 -2884 -3181 -1232 -1556 1233 3768 2138
302 2138 1571 -950 -2475 1997 4814 1829 139 497 -47 322 3749 3680 966 661 -1180 -3538 -1374
319 -1374 1068 -145 -1790 -3922 -3827 -861 993 729 -293 -2113 -3200 -2086 158 1277 1250 1102 37
336 37 -419 2596 4369 4622 3343 338 -486 480 198 985 1823 -793 -2930 -1726 530 474 303 -189
354 -189 -2581 -3713 -2795 -1595 -1007 -615 -1445 -1817 -1492 254 2483 3496 2153 -282 -766 1578 2288
371 2288 1521 1959 764 -1258 -1316 580 1437 534 -564 -1690 -3400 -2829 -607 -474 -1346 -2419 -3401 -2575
389 -2575 -1478 -1353 -364 -809 -2139 -1868 130 1964 2339 2706 2982 1420 1475 2293 2641 2978 1209 -980
407 -980 -621 87 652 2830 2883 419 60 1159 1843 1165 420 -997 -2717 -2824 -1996 -90 1315 555
425 555 -684 1080 1050 1058 2586 906 -986 -1399 -1188 -1480 314 647 -568 853 1583 347 1520 3147
443 3147 468 -1344 6 -1910 -3942 -1767 -1460 -3234 -3116 -2827 -2980 -1171 276 -1221 -796 -59 -1709
460 -1709 -750 2062 687 103 1090 -233 536 2598 2780 2067 1906 681 500 2071 1456 -30 562 -732
478 -732 -3569 -2244 -864 -1958 -1268 -908 -2519 -341 1359 428 1533 1735 -1266 -1256 948 -85 -1317
495 -1317 18 -761 -1436 2292 3619 1676 3299 3203 2112 3205 2132 -706 881 1095 -1947 -1901 595
512 595 -1087 -644 2524 572 -1439 850 115 -1952 -274 -842 -3352 -1540 -796 -1528 1160 2583 306
529 306 839 2274 1150 1072 2090 -195 -1929 -1455 -2353 -861 957 -2084 -3680 -592 -421 -803 486
546 486 -1485 -3071 -907 362 -1125 -1116 -1469 -2832 -506 583 -1728 -479 826 -1511 488 3745
562 3745 550 -1015 2089 1988 1298 2546 761 -1170 1507 2723 1201 2299 1362 -1173 1138 3072
578 3072 -44 141 -479 -3879 -2456 513 -1672 -2779 -1582 -1928 -654 2799 1969 130 1581 843
594 843 -308 2553 2840 -1045 -156 788 -220 2257 3126 193 -685 768 528 525 373 -2824 -3393 -375
612 -375 -1239 -2678 -830 -1799 -2644 903 956 -1542 -1084 -769 -524 1779 1038 -1664 -836 1582 1313 2175
630 2175 2856 -1061 -598 2658 1294 -29 925 -909 -2046 -10 -57 -1328 -174 -1757 -3617 -1306
646 -1306 -150 -2008 -1484 -632 -2282 -921 1830 191 295 2017 60 616 2557 953 569 2343
662 2343 1224 449 2349 1685 -450 1200 1844 -197 -316 -381 -2124 -196 662 -1843 -1580 -342 -1637
679 -1637 -531 2017 464 -1445 -466 -953 -452 2216 984 -1271 -178 533 412 2613 1963 -668 360
696 360 1358 -542 567 1726 -450 -1053 -105 -1131 -347 766 -588 -1592 -592 -1557 -2235 143 69
713 69 -1852 -439 -466 -1217 736 1187 -145 472 682 -449 250 1481 333 842 1581 142 -703 2079
731 2079 1675 461 1325 -433 -1550 119 430 -237 71 -761 -1755 -478 129 -629 -6 -106 -1833 -1820
749 -1820 380 -109 47 916 -364 -430 615 1068 1404 1922 499 -736 722 848 291 1381 1172 -790
767 -790 -387 318 -589 -141 368 -2028 -2020 -1268 -1885 -706 474 -995 -1764 -402 -513 -622 1321 663 -809
786 -809 -562 -132 -290 1570 2131 541 914 1036 483 1790 2442 621 -483 -228 -706 -528 666 82
804 82 -1431 -971 -1238 -1342 235 328 -1003 -760 -997 -1724 -185 1064 579 302 82 -23 932 2139 1990
823 1990 1477 1306 394 -93 1487 1185 309 439 -798 -1618 -741 -109 -438 -551 -1261 -2133 -1113 -320 -444
842 -444 -163 -269 -1614 -1398 115 136 236 960 -353 -503 369 925 1332 1576 843 -575 -133 212 487
861 487 665 -4 -1446 -1501 -537 -380 186 222 -724 -1207 -1073 -665 -52 221 -646 -1325 -1104 -586 187 1209
881 1209 1261 387 108 695 899 1881 1959 804 -33 -120 125 1083 1120 860 285 83 -221 146 1146 783 -412
902 -412 -906 -1230 -925 113 182 -334 -518 -978 -772 535 939 824 491 -26 -394 -304 950 1165 428 46
922 46 -307 -435 473 980 876 378 -523 -830 -488 -44 185 -527 -1324 -1701 -1819 -875 -436 -492 -924 -1353 -1370
943 -1370 -459 215 660 437 -526 -906 -312 376 1038 909 450 163 -212 926 1489 1330 919 171 -572 -611
963 -611 -178 270 -357 -1026 -1484 -1545 -886 360 -47 -204 -416 -1266 -539 328 859 893 493 -14 -113 702 1513
984 1513 1966 1373 691 336 533 1444 1525 981 -42 -840 -517 -483 71 334 -408 -1260 -1347 -739 -643 -66 71
1005 71 -716 -1589 -657 -307 29 748 344 -259 -393 302 1052 1580 1278 390 -57 -63 58 825 856 -8 -1065
1026 -1065 -831 -590 -284 -130 -332 -1142 -1574 -1447 -714 164 -197 -647 -802 -783 -842 232 899 441 -58 -101
1046 -101 101 869 1508 936 733 330 -281 664 1272 976 293 -354 -636 -711 99 499 4 -551 -710 -1076
1066 -1076 -328 364 126 51 -745 -1287 71 585 351 473 832 -183 -292 766 997 778 1061 310 -255
1085 -255 218 -85 332 716 189 -890 -701 -309 -407 223 183 -1127 -1801 -582 35 -128 -389 -549 -1259 -812
1105 -812 -268 243 735 -262 -458 -252 -115 533 953 568 -263 -425 342 487 577 691 194 -112 -331 -596
1125 -596 29 771 -453 -674 -688 -1037 -660 263 -478 -636 -582 -783 -1038 100 986 349 500 38 -299 375
1145 375 1558 802 630 431 -419 386 827 815 385 258 -340 -606 373 408 -613 -929 -1152 -1001 -795 -623
1165 -623 -912 54 -649 -650 -401 -60 480 188 263 110 -297 111 677 1200 1016 1098 183 226 553 892 1105 338
1187 338 -842 -528 -311 -400 -116 -257 -1019 -1807 -991 -588 131 -8 -740 -1168 -802 -143 724 1461 739 12
1207 12 426 332 441 914 988 591 274 436 417 960 670 -584 -356 -194 -802 -320 504 -448 -545 -651 -614 -986
1229 -986 -531 142 -471 -901 -291 -497 -148 625 221 143 286 -168 509 1175 449 3 -85 197 -406 434 408
1250 408 53 -114 -464 -569 -305 311 -333 -66 -605 -1443 -278 157 -622 -184 -387 -904 -154 33 267 176
1270 176 367 -519 -14 436 599 743 895 588 -153 580 272 736 650 -25 -380 -347 -361 128 662 -86 -314
1291 -314 -620 32 -274 -43 -130 -419 -653 -200 -504 -336 329 -7 16 130 165 513 784 1027 369 513 459
1312 459 245 399 449 133 -158 -60 -501 -359 233 144 -574 -293 -691 -701 -17 -933 -918 -665 -573 -601 216 155 -392
1335 -392 -171 336 -46 83 727 110 -166 151 4 143 131 -284 224 -278 -406 -136 -234 -179 266 -556 -286
1356 -286 -799 -527 -45 -23 102 -209 -910 -346 -229 -27 123 204 -225 282 644 795 825 647 885 232 685
1377 685 517 533 687 187 -336 190 -396 -87 -108 -143 -423 -502 -204 -326 -393 137 -321 -307 -85 5 131 225 3
1400 3 276 82 -92 424 614 118 168 277 223 377 246 551 37 -301 -124 50 -511 -185 -584 -699 -908
1421 -908 -564 -442 -196 -347 -498 -410 -592 -233 67 113 -56 66 -8 -280 441 741 345 362 267 229 406 381
1443 381 49 74 -169 -118 -194 -208 -244 -499 -327 -290 -628 -292 -388 -145 -213 -281 -180 -54 166 383 143 304 253
1466 253 293 401 785 458 721 269 508 369 277 240 41 -56 -343 3 -103 -282 -156 -390 -682 -254 -98
1487 -98 -582 -39 -246 -618 -362 -200 -131 -52 -118 1 118 168 239 98 239 30 98 45 260 75 194 273 143
1510 143 -250 -137 -64 -65 -158 -294 -191 -518 -303 -315 -321 -282 -224 -400 -303 -2 -64 -130 -40 253 223 152 569 157 300
1535 300 593 200 300 494 488 407 373 157 -170 75 -27 -117 -428 -272 -593 -220 -91 -84 -247 -404 -504 -430 -199
1558 -199 -12 -165 -125 -166 456 213 618 542 303 374 304 632 397 436 78 193 163 183 84 -56 -87 -471 -668
1581 -668 -392 -752 -723 -311 -512 -774 -417 -66 -373 -4 145 -334 -232 388 245 412 556 105 396 442 166
1602 166 356 377 260 80 -85 -270 -212 -218 -299 -282 -257 -458 -709 -179 -379 -235 -409 -427 -244 76 -133 181 220
1625 220 -55 -200 280 190 264 579 179 190 -12 383 438 185 276 -145 -196 9 35 -411 -93 -85 -424 -458 16
1648 16 -131 -332 -376 -430 -21 -30 -202 -219 384 24 -237 142 426 190 272 468 179 -2 304 373 543 331 55
1671 55 -270 -319 -49 216 134 -402 -76 -244 -246 -41 8 -364 -257 -464 -297 -117 138 25 -74 78 103 -82 470
1694 470 362 107 251 185 186 312 91 185 26 358 -104 34 248 1 -109 -51 -416 -554 -231 -175 -613 -323
1716 -323 -298 -496 -409 -96 96 14 -155 -160 116 273 404 699 582 84 448 581 724 447 93 114 110 -9 66
1739 66 -40 63 -562 -398 -432 -440 -222 -334 -299 -492 -405 -66 -330 -49 65 -171 -184 42 343 258 505 72 302
1762 302 310 153 222 403 567 -131 -85 215 -48 -112 -90 -403 -345 -465 -445 -226 -196 -352 -407 -151 -118 -160 159 425
1786 425 127 -93 -49 236 527 410 350 353 140 219 425 581 199 8 -35 -25 -265 -32 -31 -6 -303 -305 -474 -57
1810 -57 50 -179 -273 -416 -641 -180 41 43 -42 -170 -109 68 112 286 125 150 -74 76 202 -26 118 -15 30
1833 30 -182 65 371 32 14 -85 -506 -69 -149 -112 -124 -268 -320 -264 -156 -11 77 63 -189 -130 95 311 327 500
1857 500 115 73 115 87 -61 428 156 76 -55 -76 -279 219 153 -3 -96 -296 -327 -232 -96 -377 -303 -125 -464
1880 -464 -128 -35 330 -303 -130 121 -59 406 584 240 261 232 63 407 504 432 570 93 -41 -14 12 -35 -124
1903 -124 -453 -64 -698 -186 -388 -283 12 -325 -468 -168 -23 -60 171 -603 -114 -58 473 299 461 143 357
1924 357 163 599 355 317 135 56 134 -175 93 -103 -149 -21 -92 -319 -95 -267 -349 -289 -258 -114 104 -137 -95
1947 -95 126 59 -100 6 103 80 356 499 -25 397 102 206 310 661 -44 368 -110 -381 119 -247 -97
1968 -97 -484 -426 -366 -428 218 47 -391 -515 -75 -139 175 -67 99 -346 -100 -32 311 562 567 255 97 115 344
1991 344 330 96 9 30 21 344 77 -130 -130 -178 -390 -81 -134 237 185 -165 -417 -297 -478 194 242 199 -20 38
2015 38 50 169 470 333 194 373 166 540 345 24 552 155 -236 -35 -63 10 308 10 -313 -326 -122 -41
2037 -41 -25 -195 -147 -63 -40 -114 167 266 96 -27 -65 62 181 254 572 108 352 374 453 -121 291 -451 -7 230
2061 230 -45 198 202 56 -128 -447 -487 47 -93 -53 -290 -316 -119 -62 2 24 -20 -241 27 -57 -188 161 117 138
2085 138 -125 305 225 -63 460 213 -111 68 209 -186 332 244 -155 -190 -330 87 -411 310 68 125 -27
2106 -27 -423 -74 18 226 281 -290 60 291 -57 328 464 -51 -257 51 127 366 -2 426 -44 271 -139
2127 -139 247 -75 -227 -69 -605 -15 -172 -75 -27 421 -349 -420 -88 -17 -141 -186 35 -492 10 284 715 495
2149 495 99 439 167 691 440 320 -227 -359 -179 -234 -425 309 214 -493 -187 -586 -342 -114 -134 216 -281
2170 -281 -103 371 -141 479 -72 207 370 136 17 -165 353 293 -19 292 204 168 -178 99 249 -518 -190
2191 -190 237 -82 114 -84 -145 -581 -516 270 -155 -388 -1175 -511 -337 463 803 -126 -230 -82 97 291 451
2212 451 -142 263 -196 199 118 -4 446 123 -140 -413 376 114 130 89 434 0 -332 -120 -403 -267 633
2233 633 -171 4 -346 -135 -75 40 -34 -126 530 -96 370 384 103 47 0 263 193 404 77 -574 -227 388
2255 388 140 -44 501 -51 -86 -107 431 -36 -147 -49 -251 -31 -242 320 -195 -345 -11 -231 -10 471 10
2276 10 519 144 82 152 420 543 46 403 450 275 227 407 -409 -457 -353 -366 -205 165 -505 -213 -1 -47 -491
2299 -491 157 -146 -329 43 56 280 7 267 248 233 348 10 515 257 -13 364 432 42 450 131 -42
2320 -42 -248 -80 -365 69 -48 -164 -107 -38 162 -2 -78 -243 34 -65 211 10 -175 184 15 294 90 228
2342 228 277 382 62 -42 211 -48 333 392 -134 -209 202 -112 -137 71 -98 91 -234 126 -59 -117 -67 -470
2364 -470 54 282 32 -23 -117 -55 45 115 531 199 -13 244 23 207 80 51 -21 72 -179 -163 243 -338 -118
2387 -118 -38 -28 -377 -196 -271 -331 -35 -153 -51 -37 -163 10 55 -36 -189 -67 -43 98 110 23 -13 -80 119 103
2411 103 118 243 -165 -80 93 68 -46 401 84 -203 -1 138 26 -272 25 43 -317 -102 -304 -294 15 -85
2433 -85 -84 185 35 -142 131 161 343 114 -116 102 93 336 13 239 49 67 14 93 -101 -158 -44 -143 -217 5
2457 5 -206 -122 -87 -282 194 -51 -188 -108 3 -238 -14 298 -203 -51 96 141 75 357 320 77 479 153 -160
2480 -160 25 -4 -228 14 -130 -31 -97 -93 -250 -133 134 21 -190 -197 -78 -13 186 -61 247 255 171 250 64 357
2504 357 69 337 144 155 278 -260 -117 -117 152 -240 -70 -25 -57 -277 -259 -206 -157 5 -63 -109 -169 111 -320 13
2528 13 227 44 199 346 -171 234 273 290 144 157 28 -77 133 22 -189 123 -49 108 -55 -104 -86 -342
2550 -342 -142 -390 6 -244 -21 -63 60 -73 -258 -55 47 -84 -60 65 -166 197 133 -58 177 54 72
2571 72 -155 -10 -32 241 -5 93 -133 83 123 -62 -93 2 -46 -161 -92 -102 -130 -245 -136 31 -71 238 109
2594 109 -77 -49 281 66 222 -13 53 166 -15 143 126 -18 240 159 63 60 56 -142 -67 -290 -219 125 -184 -292
2618 -292 -171 -56 -181 -193 86 -190 139 -12 -145 1 85 -21 -27 440 104 338 31 186 158 136 -154 -121
2640 -121 -32 136 -26 82 64 -202 -71 -133 34 -91 -164 -358 31 -327 -220 64 121 29 88 -91 -1 51 -66
2663 -66 192 150 -60 163 57 130 20 104 150 166 125 -220 8 -358 0 -143 -43 -349 -327 -84 -191 -64 -313
2686 -313 -169 8 -107 139 122 24 14 32 128 364 157 -73 20 196 85 117 155 -281 -138 75 118 139 104 234
2710 234 -23 -56 -333 -124 -64 -226 -23 -49 -184 -37 127 17 139 139 202 224 -81 260 217 239 -87 187 105
2733 105 212 200 -17 270 66 -92 -134 -37 -79 -246 34 112 -237 157 -3 -56 -5 -116 -138 -133 83 34 53 77
2757 77 -263 -120 -198 214 9 157 -98 55 -27 172 -132 -39 -59 -330 -56 -4 87 29 -81 -110 -5 161 197
2780 197 63 -106 -212 54 -135 123 72 -165 10 179 106 -258 -1 43 116 10 -45 111 296 256 -234 -134
2802 -134 172 -104 -197 138 171 28 -210 -32 1 -18 60 -47 50 -203 -127 59 134 -20 -71 66 -171 -130 106
2825 106 44 7 129 7 122 38 168 -53 271 -61 -200 42 88 -41 94 -176 14 -237 -247 73 26 50
2847 50 -167 -90 11 -32 160 34 12 0 161 -80 136 340 142 -183 -350 234 67 253 -113 -100 -263 36
2869 36 -51 -82 -93 -44 -187 -156 -102 3 83 -116 -112 -247 -110 38 229 12 -157 76 24 59 7 133 55 10 311
2894 311 211 92 -118 174 -64 -113 105 -210 63 -208 -167 124 -262 -59 181 -69 236 -96 -77 -78 -190 102
2916 102 184 201 108 -23 -41 -23 203 -28 233 -4 20 104 -81 -108 46 22 66 68 72 40 -26 35 -346 -124 -163 -27
2942 -27 235 -259 -141 -118 4 -64 175 195 -91 -34 277 287 119 55 -92 131 -4 110 177 125 283 66 -95
2965 -95 15 -24 -127 8 -206 -197 -98 97 119 32 -15 15 126 29 -9 332 119 -97 -45 1 -142 81 -113 149
2989 149 -8 29 53 -9 283 91 -56 -37 47 -3 147 71 228 -71 -256 -16 -126 -102 23 -169 -180 -68 55
3012 55 -36 264 82 7 -59 -52 123 137 -48 -6 -133 -100 215 102 28 0 -60 -29 34 -3 -180 -45 -97 62 -10 132
3038 132 -304 -17 179 -60 -121 -5 8 72 -65 -75 49 -118 63 270 179 227 155 176 260 20 45 214 -63
3061 -63 -97 -202 -21 18 41 54 132 143 -76 76 127 -107 -151 -61 -139 82 109 184 146 129 -231 -37 202 382 -204
3086 -204 118 250 60 137 184 -14 -141 77 -253 -68 -97 -220 -273 -128 -304 -27 -21 -261 73 84 -32 -175
3108 -175 -126 224 98 -58 -20 -38 -70 125 164 292 214 -9 20 -39 187 231 49 -213 -97 -151 58 -200 75
3131 75 -71 -96 -462 -139 -25 156 47 -78 -58 -153 -82 113 369 -135 40 88 -123 160 -7 226 228 87 19
3154 19 -39 -286 89 169 -63 -280 -11 117 -55 -8 -97 39 100 -87 120 38 -51 -12 -214 174 -142 -21 13
3177 13 -180 -170 -55 125 20 90 -165 59 -14 87 -39 41 159 -32 -161 -47 -23 73 -39 -139 -358 -31
3199 -31 -325 167 -33 -72 -156 -44 134 160 -45 -71 -86 124 -207 -3 41 53 238 111 195 83 -118 148 -13
3222 -13 -212 6 -266 -88 78 -126 -101 -347 6 -204 -89 263 217 -234 -31 -7 -18 86 -36 67 -46 -80
3244 -80 -150 120 331 134 70 -23 28 10 151 180 -135 -167 -321 11 87 -97 -267 70 -171 -56 110 -52 179
3267 179 -82 -137 54 107 -27 60 231 -85 158 60 -21 228 38 129 48 121 -167 -129 -81 -3 -153 -72 77 -74
3291 -74 -56 -52 -81 -250 92 144 9 -77 -56 -169 45 -59 -106 -70 179 -194 10 175 -97 197 83 57 -70 -96
3315 -96 -13 -72 -220 -72 -109 46 -323 131 104 71 -209 108 -142 -163 -36 132 58 -22 251 -21 179 96 24 142
3339 142 148 30 -27 133 64 -92 116 -80 101 149 214 -223 -5 36 183 -16 -96 66 -146 -212 -78 -14 173
3362 173 -19 141 -18 -247 27 17 110 227 -53 6 -110 241 -131 69 218 200 -27 58 291 83 -76 -173
3384 -173 55 -83 78 -223 -131 66 190 42 -115 -236 -13 -353 -84 181 -23 252 179 199 60 -163 -188
3405 -188 -94 73 -89 209 23 -136 137 -164 116 -325 44 -180 -13 -13 9 -138 22 90 18 -7 -81 -127 36
3428 36 12 154 -62 -7 -116 101 158 164 147 -149 139 211 56 50 90 106 87 105 38 -121 -164 -203 14 64 10 -76 84
3455 84 74 -142 -171 -69 -215 57 241 -238 -42 -151 31 96 115 -24 86 110 0 -104 -118 213 89 156 -28
3478 -28 -222 -182 -189 -50 -73 -17 87 -103 59 156 -217 -300 79 -185 270 218 -122 252 -91 -172 -67 87 166 70
3502 70 300 -104 259 -142 -32 43 -259 -101 91 -39 -200 -249 25 -88 -94 -269 13 -248 -108 -44 -49 24 -25
3525 -25 107 41 51 -17 -80 104 -95 32 152 38 -14 96 38 -239 12 58 209 102 37 99 116 83 -116 -39
3549 -39 -47 -55 94 -43 70 157 2 21 -8 -13 -115 243 3 5 -102 292 146 -115 265 74 -31 -142 94 43
3573 43 16 27 121 20 -133 -263 -63 58 -121 -260 161 -175 -200 21 -307 69 190 -227 -13 91 16 134
3595 134 -56 46 -46 -16 100 83 215 -92 266 -223 23 -84 -242 151 -104 -123 -128 57 -182 -243 92 -52
3617 -52 -211 -223 -151 -124 -165 -73 28 12 91 -44 59 -145 -116 353 -5 -168 -114 -60 94 132 28 -62 212 -55
3641 -55 -118 -44 31 -237 58 -203 -105 -83 -229 -258 -89 -138 -36 -189 -14 167 -127 253 93 220 8 -81 70
3664 70 79 116 10 -185 -9 129 -65 -124 -148 -152 -40 -337 -59 11 -22 -256 -237 -43 -42 -143 224 -149 -122 -87 227
3689 227 268 -5 -8 115 92 184 -1 59 73 -251 -36 9 -12 -131 -169 -164 29 5 -237 -75 111 -60 -50 -122 -189
3714 -189 -86 -10 53 186 -85 -89 27 150 68 150 156 63 39 -290 222 137 200 52 136 -99 -76 -42 88 133 -125
3739 -125 139 -121 143 -113 -16 -117 -325 95 99 131 94 85 -83 -30 53 -25 5 43 -138 56 -64 101 154 287
3763 287 243 -157 -201 -17 22 -120 -40 -64 -294 99 -29 -126 -93 -206 -203 -126 110 -29 -79 176 71 -73 -96 153
3787 153 -33 -92 -140 261 -93 94 153 151 190 -64 41 98 -123 272 -19 -88 -153 -135 -209 -8 79 -140 -194 190
3811 190 -383 -203 -27 -12 -251 -319 -188 59 180 222 101 198 187 197 69 246 150 57 36 -50 203 43 193
3834 193 -104 -164 -130 -79 -28 80 -39 -218 -274 -238 25 -90 46 126 -159 18 58 98 123 101 300 26 65 215
3858 215 -154 -84 -83 -106 -45 -45 -10 -41 2 -208 -100 58 62 -38 -29 -167 -44 34 -35 70 -73 -14 64 27 70 -45 36
3885 36 -19 -33 -91 -17 -44 170 102 168 -69 -227 -13 -31 18 80 282 -54 -300 -195 108 -136 -8 -67 -120 -426
3909 -426 -16 88 -130 11 -111 -31 160 -12 99 -63 -53 151 90 265 -90 -73 88 69 -96 63 -34 -128
3931 -128 104 -72 -85 -195 -65 60 -11 -130 -210 -67 -237 192 149 133 -49 2 148 134 257 365 53 81 33
3954 33 -60 180 215 114 180 -131 24 111 -17 106 -125 80 -144 -230 -93 -41 58 -216 -267 69 41 72 -217 241
3978 241 7 -15 -67 255 121 63 8 232 196 170 392 112 -6 58 -208 -2 133 -24 -34 -137 -132 10 -205
4001 -205 -201 -176 62 -165 8 53 -246 -195 56 -70 78 250 32 14 319 -14 111 276 76 290 114 -3
4023 -3 36 -22 33 -166 -101 101 -149 111 -170 -76 -94 -269 82 0 -65 65 0 177 -58 -12 20 27 173 99 54 18
4049 18 -13 288 64 194 56 -41 107 -20 20 -128 54 49 49 -126 -57 232 -28 -197 4 80 114 229 -88 -85
4073 -85 180 207 87 -32 277 75 275 146 -200 41 253 399 -57 -28 213 -137 77 58 -163 -26 80
4094 80 -135 -471 -232 -228 229 3 -106 -150 250 50 -151 169 28 29 84 156 186 191 134 97 -134 116 163 199 68
4119 68 175 171 148 95 -7 -107 32 -146 -261 -94 -11 52 -264 -41 -164 -207 52 -60 123 -180 -95 202 141
4142 141 72 145 138 -87 -101 -57 -246 54 -82 127 257 69 102 21 -1 -145 57 -12 -177 -139 -49 -105 127 -133
4166 -133 -216 -6 -12 50 42 112 -66 26 -162 -221 213 153 -140 -37 185 -6 111 214 -101 29 66 131 -392 -255
4190 -255 -199 -145 66 146 -94 -27 -81 -67 -160 -32 -272 117 -121 -78 36 -170 187 70 72 223 49 -223 -116
4213 -116 11 -41 161 71 -2 100 17 -145 -153 174 -106 -235 -111 96 -97 -65 -179 -237 -78 -48 109 -147 -32
4236 -32 164 86 -18 -139 26 -15 -111 86 207 17 102 -131 132 56 -100 -139 -100 -64 -205 -49 -162 189 -22
4259 -22 -186 -1 -92 -324 -48 -44 49 -103 -206 -244 -160 85 65 1 48 59 122 94 30 1 69 255 189 -1 77 -15
4285 -15 -193 202 -88 -330 13 -191 -120 -82 236 -160 5 -34 -13 -27 -143 107 117 22 210 195 -43 130 -222
4308 -222 -80 -21 94 83 8 86 88 -92 113 173 20 132 -6 -36 -206 146 91 97 49 30 -108 -3 175 -299
4332 -299 -134 -49 28 -8 252 64 374 232 124 -10 -101 231 -51 123 -35 97 -108 267 -31 -35 -93 -20 -284
4355 -284 -108 -110 -217 48 -97 -145 -84 114 -77 -156 -83 -188 174 -70 253 232 175 178 29 -64 52 10 91 139 -196
4380 -196 13 -147 -166 -68 -35 161 11 -312 32 -76 -62 23 -190 -285 -291 70 -127 -133 171 211 41 0 253 232
4404 232 67 -251 137 120 -27 219 14 -160 -379 83 -33 72 -70 -8 -49 91 105 -169 -59 95 -21
4425 -21 139 -170 -143 -128 -303 -22 193 234 205 162 68 273 32 56 388 213 155 227 170 50 -395 -28 77 -317
4449 -317 117 -257 -130 141 -201 -67 -156 -307 -29 -77 -193 13 -133 111 57 62 256 98 59 -3 -36 203 82
4472 82 -5 -152 44 122 130 -42 10 36 -45 74 -173 56 113 -350 -110 -77 -154 154 33 64 116 -102 89 -171
4496 -171 68 40 7 263 -88 -24 -248 25 234 34 -12 -150 -135 27 54 27 146 54 -77 20 -141 114 -28
4519 -28 13 -202 -39 4 -168 37 -178 -45 26 -52 -5 82 220 -40 -67 -88 6 -99 98 95 -126 86 21 -81
4543 -81 98 84 70 -144 -4 88 -50 -14 -38 19 -246 -117 109 -162 -246 253 -25 90 -33 33 131 14 -27 -186
4567 -186 141 -3 -86 102 45 -102 45 181 -248 212 -45 21 -54 160 -65 -84 24 -440 11 -149 -43 80
4589 80 -17 -15 -77 -88 8 19 106 235 89 66 9 118 98 230 -88 5 93 -11 17 -228 -114 -94 -95 -240 -106 -58
4615 -58 -194 -38 234 -46 -42 -77 -57 -48 32 -304 339 84 34 108 17 30 58 55 72 12 -88 218 -28 93 271 145
4641 145 -28 78 -120 -224 -181 -55 9 -73 22 178 -150 111 21 -41 -152 -38 39 45 70 3 -112 -146 82 94
4665 94 404 150 95 -119 12 44 139 -82 47 -206 -152 -107 -98 -177 124 100 -11 -212 259 -40 63 9 -51 -9
4689 -9 127 39 -33 30 -37 -15 24 133 51 128 -183 3 -110 252 -117 27 -101 -40 -159 45 -159 21 -241 -246
4713 -246 -126 -298 -310 263 67 1 -44 83 125 58 188 -100 -6 135 106 154 289 -60 24 -46 -70 -28 -27 -49 133
4738 133 112 1 -126 -36 -13 -22 -81 -221 -98 8 -131 9 -116 47 -179 -156 -125 111 198 -47 235 150 100 -155
4762 -155 135 302 75 11 -178 182 -142 10 -118 -39 -150 -134 21 60 16 -206 151 234 14 -5 226 5
4784 5 -55 -208 37 65 -140 136 2 78 -13 -11 83 -64 13 -51 -5 -86 115 -72 -73 -55 75 -212 -303 143 -124 -122
4810 -122 -77 -82 210 109 10 -114 -133 -119 -21 136 201 126 332 104 132 122 20 40 -62 -52 105 176 -153 185 -11
4835 -11 -112 -137 -47 33 -303 -79 -11 297 5 -16 -158 39 -22 54 -10 -245 -55 72 125 5 -59 308 -40 -104
4859 -104 27 -141 83 131 -12 -16 -200 -36 -254 -133 -57 -88 157 102 -218 174 -202 -169 -18 -22 282 -17 -23 148
4883 148 66 -249 -25 -72 10 -43 -13 -177 126 256 77 107 145 -52 183 -122 -287 -43 -222 105 93 -163 -27
4906 -27 -92 -105 -112 -37 46 -48 -10 -31 10 -112 -42 217 166 5 113 33 102 133 193 300 89 150 49 119 62 138 -26
4933 -26 153 17 -87 -9 -160 -399 -41 -176 -1 -80 -123 -25 -102 68 33 56 391 -61 222 176 220 -57 25 351
4957 351 67 102 153 80 38 59 -384 48 -18 -145 -159 64 -388 -57 -92 247 -201 92 -13 -183 57 265 170
4980 170 -131 195 -244 -3 -209 -72 46 276 194 321 5 76 259 -99 61 -98 -2 -184 103 -12 -51
5001 -51 5 -75 -48 -205 163 138 -195 -31 5 2 -12 112 147 101 1 37 -8 99 101 -126 20 221 173 49 15 167
5027 167 -90 105 -190 -56 -79 -269 -117 -133 -48 -86 69 -149 -149 122 -166 -68 75 103 -91 -156 -137 143 105 101
5051 101 -66 134 176 54 95 189 71 -108 96 35 -28 94 -170 -114 -14 12 -208 -170 -164 -100 99 -487 -20 -18
5075 -18 28 -159 -47 -71 -75 278 132 227 14 220 300 47 90 158 51 300 40 132 -154 48 173 -158 118
5098 118 -185 -107 -22 -85 -279 -179 -159 -62 82 237 -89 20 -81 122 -229 77 -187 182 88 5 7 37 -98
5121 -98 166 -110 139 184 174 -77 -194 -257 -346 151 -181 -199 -230 -168 -298 142 -139 -50 -21 144 -11 191 239 -77
5145 -77 -112 -50 157 -197 -82 75 183 227 86 -32 32 260 -184 126 -28 9 -95 49 10 -256 -134 -8
5167 -8 -100 -95 -11 1 -59 236 -4 -5 -124 27 103 -104 15 133 21 30 21 110 32 -18 -107 159 122 -174 161 75 -10
5194 -10 -35 -173 -49 -12 -265 -267 -151 -44 118 -140 101 17 -40 -271 -128 169 188 125 -151 -169 -22 -124 -113 66
5218 66 34 91 63 -29 33 -35 98 -53 -216 -156 -60 -39 -23 -96 -13 163 -258 59 -116 -67 10 184 -26 142 74
5243 74 -4 77 -150 241 149 56 -138 16 33 322 46 -196 1 25 77 97 -56 -134 -161 153 -72 -123 -61 -287
5267 -287 -180 48 -213 16 -62 186 -28 -65 127 27 46 -71 -11 -176 68 -22 176 -4 144 -7 176 -183
5289 -183 -224 -113 49 -13 -112 -77 -42 -60 88 77 -15 -70 -188 -136 142 -13 219 229 132 244 171 18 193 94 -10
5314 -10 31 -256 -27 -284 23 -207 75 -126 -174 149 -106 -16 -2 -181 -279 -249 25 -76 -61 94 -64 64 62
5337 62 -117 138 47 139 226 50 6 11 42 109 192 197 -133 171 75 -145 -71 -25 -159 -210 37 -293 -192 -274 -389 0
5363 0 174 -148 262 94 10 -173 157 -232 -83 -97 292 15 153 63 10 -186 37 -76 138 44 10 211 -109
5386 -109 128 205 -192 -11 -305 -196 -41 122 81 70 227 39 127 138 -59 187 415 -60 -35 -120 253 -5
5408 -5 137 76 196 224 -199 75 -50 61 -107 -8 1 129 -185 64 -229 8 -62 62 -127 12 94 8 -5 -113
5432 -113 -58 -41 14 181 -3 -128 228 316 33 4 -14 -66 53 -18 -154 -186 -9 -31 184 24 -29 -138 -52 167
5456 167 150 -46 -125 -186 -8 -305 -95 92 178 -180 41 -104 216 123 205 191 -37 -91 52 -48 114 -36 228
5479 228 -106 69 55 -203 144 -28 -334 -104 4 -53 -37 48 47 -108 -28 115 -189 84 -161 177 50 -12 61
5502 61 -111 166 -121 133 81 89 -5 48 75 154 197 209 11 -234 47 -8 119 -310 0 93 -275 41 2 50 95
5527 95 -74 42 -80 32 222 156 -56 170 185 -115 293 1 -182 -69 169 -68 10 -91 -79 -39 203 -239
5549 -239 31 -71 6 96 231 -7 -66 -22 -140 191 127 76 150 -266 189 85 3 -53 314 63 206 -2 -145
5572 -145 331 -42 71 2 182 312 -195 -98 120 -11 -254 3 -2 75 -83 113 94 -2 -301 -21 -107 -165 92
5595 92 109 -152 -33 -54 -129 107 -31 63 57 185 90 313 -6 106 17 140 -12 -298 121 -213 -139 11 -112
5618 -112 70 -183 28 -30 49 -130 -65 -54 22 20 62 270 41 210 146 -22 -36 133 -93 -19 -36 75 -111 3
5642 3 75 90 12 -84 2 -294 81 -188 -345 -258 -53 -17 -196 206 188 161 -77 27 85 97 136 -51 4 372 -44
5667 -44 189 0 254 55 115 189 -32 125 49 31 8 -124 -226 49 -306 92 -48 -51 -89 79 183 -60 9
5690 9 29 113 76 4 113 125 150 57 -116 212 273 218 76 -122 7 -110 41 52 -88 -93 76 109 155 -280 -226 9
5716 9 -152 136 -81 133 118 71 -214 -46 242 21 4 -53 5 188 -148 -202 312 -372 406 35 126 63 33 -196
5740 -196 -184 88 48 -186 -210 -165 -132 77 154 -112 -164 -187 0 -112 41 80 -74 48 -25 291 57 -8 -88 59
5764 59 97 304 61 -140 9 202 -164 -4 163 44 -257 73 44 -39 -102 -43 58 -276 -213 350 11 140
5786 140 95 -137 94 -190 178 -15 181 -62 118 -77 -102 171 72 -92 185 -48 200 40 120 137 -45 -92
5808 -92 -136 -99 -95 8 -109 -10 -255 123 -35 162 -179 -98 -114 -6 40 103 437 -166 114 164 -87 -84 -124 147 117
5833 117 -8 228 -165 -30 23 -60 11 -106 4 -437 63 -76 102 -123 149 68 -11 -22 -93 373 165 7
5855 7 -38 205 -208 -67 88 183 -92 40 -1 -67 130 -266 -57 -68 142 46 -117 -147 97 -181 21 -156 -251
5878 -251 -12 264 -67 -57 154 95 105 -117 -137 -57 -118 -67 105 34 -133 177 -168 -14 312 22 39 5 -116
5901 -116 -10 117 -1 -25 75 72 -174 73 17 155 -104 -18 20 29 100 -142 41 45 201 -64 6 -53 229 32
5925 32 54 144 -79 49 85 -99 117 74 139 -8 -297 38 -50 9 -1 136 -65 180 101 -150 -205 -38 -55 -181
5949 -181 -67 189 -85 -145 76 -4 9 -97 57 25 -236 136 -45 270 -84 6 -86 379 95 -40 104 110 90
5972 90 -230 2 -45 90 -1 -19 -123 137 -30 -146 -154 7 -19 -79 128 384 104 84 63 138 116 -84 93 -83
5996 -83 26 212 69 111 -129 44 99 -121 353 -198 -76 -144 -102 346 -111 -15 -24 32 -202 -227 50 1 24 -20
6020 -20 67 71 -3 103 68 137 219 28 132 -263 3 199 -154 -126 -166 -45 157 -48 -124 -27 87 165 9 -75 62
6045 62 15 49 -291 -287 -228 61 311 -46 -20 116 -19 -5 319 -59 -8 259 47 -25 -48 -320 -8 -70 -46 -122 19
6070 19 83 -244 -86 109 -117 -237 -88 10 46 23 -150 -170 -27 -1 199 -129 -128 92 -33 106 107 29 -7 80 -50
6095 -50 -206 -104 143 -362 31 13 -184 -99 -309 -40 -229 -200 38 -66 82 109 104 125 -303 -135 -12 87 70
6118 70 -13 -203 254 222 148 -78 -214 79 105 162 -130 -54 54 121 -25 0 204 102 -17 -116 165 -50 -53 -74
6142 -74 103 -299 161 201 -148 -45 -23 15 -20 182 221 11 22 111 106 134 62 -154 -73 58 63 69 -104 -98 -136 -86 225
6169 225 -53 15 52 -207 22 -164 -141 -88 -6 -12 107 155 115 69 3 -75 -237 427 -83 -75 47 16 93 65 67 -92
6195 -92 63 30 -135 -137 138 -76 3 -34 345 13 -105 73 -31 -38 -40 -151 154 -143 -37 155 217 122 -27 -222
6219 -222 144 76 -77 -75 16 -4 -22 -143 45 -156 -384 -195 -1 52 165 -57 39 99 -80 22 -135 -115 -56 195
6243 195 -50 -86 57 149 58 127 65 109 38 353 171 187 92 221 -132 -51 -101 146 -118 -32 -38 -186 77 -54 50
6268 50 77 16 164 -157 -167 21 112 56 210 223 236 235 -157 101 42 141 -32 -116 -15 171 -130 97 89 315 -368
6293 -368 -140 -195 -69 -97 -12 -39 -32 -146 22 38 95 -223 39 164 82 239 65 223 -86 -36 -79 47 58 -92
6317 -92 -57 168 -2 231 389 -29 79 95 -8 253 -194 -22 -251 -60 86 -73 -251 -3 -7 49 -136 -48
6339 -48 33 86 240 84 167 212 77 126 117 60 49 -81 -1 113 84 186 71 -85 9 73 -93 -254 113 140 228
6364 228 -150 -159 -359 -207 248 -86 37 266 -152 -305 35 20 -30 240 15 -67 -12 5 -25 -25 -108 -81 57 195
6388 195 -161 -240 -26 173 -31 -4 -26 55 -112 -160 -153 -3 -2 5 100 -178 -112 227 44 -9 165 140 -74 278 24
6413 24 158 52 31 48 247 26 114 252 -117 -74 -53 -155 -44 -205 73 -140 88 125 102 26 138 52 -271
6436 -271 -95 -182 -118 231 93 -61 178 58 -215 -110 -13 78 154 -271 -75 -78 13 -41 -187 -299 -148 -39 -76
6459 -76 38 188 107 -179 25 11 19 -66 -202 267 23 102 129 -32 185 -138 -89 -92 37 4 -14 -91 -36 185 -91
6484 -91 89 -280 -1 80 309 -164 -256 87 46 -46 -141 159 -76 -116 -157 -7 74 33 164 122 33 97 -58 2 -18
6509 -18 -53 -107 80 38 -192 -107 -126 -120 -119 124 -319 -71 16 -124 -61 -41 166 7 43 -85 60 -85 79 4 -77
6534 -77 -21 96 44 192 -79 15 258 -29 -71 48 -169 224 78 -87 9 -91 -255 -114 145 103 -201 -185 -178
6557 -178 149 -57 -83 -44 -126 -108 -81 -163 -119 139 -10 88 -26 -59 18 -35 20 59 -13 -171 1 226 22 -158 66
6582 66 93 -319 -120 81 119 -24 -28 -185 -248 -103 -28 -58 -24 -44 67 -49 -54 116 53 82 -98 -261 114 7 177
6607 177 -276 46 197 24 -164 -32 184 -42 234 181 -19 -127 -128 51 56 1 31 103 179 -31 241 155 -60
6630 -60 169 -25 136 -37 201 108 -200 210 161 44 207 -87 -137 18 -209 -30 75 234 -1 8 -3 -191
6652 -191 -147 180 -105 18 -63 9 -26 -207 30 75 -1 70 145 37 202 131 13 153 294 -36 -63 -36 -10 69
6676 69 12 -28 90 64 -138 -243 58 342 16 -298 46 -321 -256 -128 -82 -74 64 27 -143 -13 -23 313 -63
6699 -63 -167 215 -75 -10 -42 174 73 -58 259 173 209 -211 -102 -194 -82 -41 -39 116 63 -89 154 -8 -194
6722 -194 -75 -195 5 -30 -377 -30 -199 113 168 -103 -123 -171 -7 29 179 37 -64 -112 70 240 -56 -34
6744 -34 -35 130 27 -131 -22 -24 -56 -56 -67 -3 61 22 -210 -192 51 151 -141 -72 -30 -76 210 233 8 132 -38 -46
6770 -46 145 -21 -223 -120 347 -23 -113 147 -53 28 6 -74 -195 -21 -322 -118 261 94 -96 -120 275 96
6792 96 71 130 -168 171 128 -23 97 56 -118 161 -196 121 -55 -139 209 117 -85 -99 153 -249 -177 112 -79
6815 -79 -73 -107 184 -184 -126 -186 -143 -69 58 231 3 -58 -219 195 240 -72 -21 -114 114 84 -23 -179 98 -123
6839 -123 209 -97 -2 117 -74 -42 -24 -74 -110 -114 177 41 -1 -93 -107 -76 133 40 -15 140 -150 -229 16 146 -15
6864 -15 124 96 -114 217 33 54 -40 -52 -83 60 22 -119 -175 -131 -38 -29 -233 -169 -81 140 -93 -187 -307 156 43
6889 43 -82 190 145 108 -142 164 257 66 225 -140 -11 90 105 -125 -39 -250 -48 10 -76 -82 -84 -26 -279 175
6913 175 -75 -38 236 -310 -347 31 122 1 -170 4 -41 -166 38 1 309 -55 41 134 -24 -112 34 3 -33
6936 -33 -143 -287 59 3 -112 -188 11 -16 -3 89 -182 116 -39 170 -185 152 19 47 314 213 -54 -33 23
6959 23 66 -186 117 -54 122 137 59 211 101 13 168 -349 -249 -88 -133 -149 -91 6 155 -31 3 322 167
6982 167 -19 162 111 -92 1 28 208 -4 -36 84 -45 -78 33 80 102 16 1 15 50 -192 -111 30 91 -92
7006 -92 -40 161 -65 -222 -113 404 271 -111 -10 125 -79 -96 246 169 54 -153 -105 -195 -215 -55 142 19
7028 19 -51 -228 129 -83 -181 90 -143 17 235 -28 -21 89 -200 133 19 -101 -23 -47 28 41 -91 269 -88
7051 -88 105 190 92 -50 -60 -31 169 39 199 14 -69 209 -109 58 156 -393 -127 -124 14 -21 -262 6 -79 -63
7075 -63 217 -180 -93 187 -33 27 -27 11 93 1 -128 -144 -86 181 -20 -220 70 -171 2 111 -75 61 -102
7098 -102 130 32 -64 -299 41 -175 -31 169 243 -152 -109 -134 50 31 -231 -146 -72 123 146 39 50 -84 5 -233
7122 -233 200 132 63 94 37 -30 27 16 -68 63 10 63 13 7 -113 -20 3 -69 -41 119 -159 -85 -83 87 -180 8 -40
7149 -40 127 92 -36 -21 221 -7 53 36 -142 82 199 67 -160 238 -53 -120 -6 100 -82 8 33 -44 -265
7172 -265 162 -254 31 -82 20 198 -308 31 -88 299 101 28 -120 -403 -136 133 10 159 75 -153 -140
7193 -140 48 161 -13 -174 69 76 -127 7 237 115 -350 -247 112 23 131 173 -278 71 -40 70 248
7214 248 102 5 134 -10 -76 115 -156 54 -161 -107 82 348 167 -108 87 36 138 17 190 94 60 48
7236 48 4 -170 -119 -24 180 -35 66 -159 -67 217 269 155 167 155 55 288 -42 68 -130 12 178 -146 -86
7259 -86 251 61 67 -202 -26 2 -169 91 108 -240 -71 -77 2 -110 -170 93 -68 45 36 -95 169 209 38 260
7283 260 15 91 -49 90 69 -99 -24 -7 -35 44 -181 -111 57 175 9 -220 66 -170 78 -23 240 -20
7305 -20 26 59 -24 131 147 197 -101 89 -139 75 -14 -261 -108 68 330 54 -47 -202 53 184 49 -39 -69
7328 -69 195 -98 115 103 -39 -12 244 25 -106 42 54 -148 -161 -90 285 103 56 262 -76 -92 21 123 -108
7351 -108 -62 -95 -17 -53 -48 -309 -25 96 -128 295 -102 103 98 -132 -103 10 98 25 -38 70 1 8 -70 8 169 98
7377 98 -241 -57 173 22 31 -54 -134 -26 121 -19 46 -36 -110 -97 47 -224 166 -399 -311 -85 -264 -24 57 80
7401 80 -115 -52 189 125 -38 75 -90 -124 57 37 75 -164 270 45 229 -42 -33 97 -139 -6 74 -64 368
7424 368 224 -106 -83 41 88 -32 -38 204 -343 180 -195 63 -11 -129 -57 94 268 -43 29 34 -81 13 94 391
7448 391 -85 82 26 204 320 123 -135 -72 -155 115 -248 -150 -141 142 -149 16 47 61 154 165 -39 -169 -51
7471 -51 216 46 -198 78 165 -298 57 -88 -28 -5 95 222 -91 -93 -117 96 128 -3 358 -80 -73 -42 -210 -262
7495 -262 125 -29 -141 -173 130 24 30 -135 -29 4 -119 -5 134 -209 -204 76 -138 12 -110 -138 96 -89
7517 -89 -145 23 152 -141 71 -53 75 53 -126 55 -5 -12 -49 227 -102 -22 115 119 -50 -27 -90 296 -14 -7 -56
7542 -56 -147 253 -26 -126 -8 -88 214 58 -80 405 77 100 227 88 73 249 -22 7 186 -79 120 109
7564 109 159 178 -82 -30 -19 -246 153 -303 83 -61 -222 -147 -264 109 -131 79 155 -171 -90 -118 -264 -59 18
7587 18 -4 -180 2 17 -19 -75 160 93 -104 -244 -139 -20 26 -62 -183 227 9 163 139 83 -70 -221 -230 74
7611 74 -141 -162 13 43 -129 22 -17 -61 -284 -64 -15 128 101 -38 -277 -41 160 -88 -114 -158 66 36 -89
7634 -89 95 -162 -7 13 -63 311 91 177 133 -77 -202 339 25 99 71 94 -3 10 -201 105 -90 -137 59 81
7658 81 37 -119 275 123 -24 335 247 -161 251 33 127 190 -55 397 -52 -59 -49 122 -61 0 -170 184 -76
7681 -76 -19 39 72 175 -46 86 58 -10 -24 367 51 -2 -127 121 168 -178 -53 199 -105 22 -450 -312 180
7704 180 149 -21 -51 299 -55 90 -260 -160 -42 -188 -67 1 -25 -95 -4 57 -16 -82 -182 -218 -60 55 -66
7727 -66 -35 -93 199 149 85 3 89 -197 -31 62 -23 106 74 232 70 122 41 36 -162 -53 -11 -221 161 -34 -177
7752 -177 -115 76 -33 -192 82 -3 79 229 -169 -32 -82 144 -143 -147 156 142 346 113 -81 134 -17 89
7774 89 -218 -212 199 154 20 109 -282 -13 -19 -26 -13 -77 60 -71 11 186 -40 122 -331 -7 -85 -19 19 4 -46 4
7800 4 -104 -253 97 -174 280 -292 -95 35 -266 171 -92 -155 -97 14 193 -43 146 87 -37 43 125 -164
7822 -164 169 99 -54 101 101 72 -105 -71 -46 -60 -53 222 -57 -121 178 -31 141 -188 28 -56 -121 -79 -54 29 -76
7847 -76 45 72 52 -200 316 170 -8 -175 -133 -308 -86 -178 130 -50 71 225 168 5 241 11 -35 -261
7869 -261 59 96 84 53 -142 -145 242 191 106 -172 -195 3 -102 76 85 298 110 -181 -158 -21 -188 -175 19 -11
7893 -11 -197 94 138 -98 -48 -13 -211 -57 86 -65 -164 -185 -102 35 73 -49 79 0 58 -97 70 -40 316
7916 316 -36 -75 199 118 7 -122 -29 -220 32 -26 -96 -115 10 -91 144 -14 155 -20 86 -125 -28 -10 -30
7939 -30 -87 38 -20 90 213 75 132 -185 10 -182 -21 22 -113 263 78 -165 208 -114 -102 50 6 -21 334
7962 334 -477 106 268 15 -167 -113 -27 56 133 -121 -113 281 -16 61 316 54 -123 131 -138 -79 -103 177 0
7985 0 -118 9 101 -104 -139 71 -25 315 -57 267 -226 -192 334 -277 -253 102 93 -256 -89 250 -141 6 -52
8008 -52 -57 120 27 -12 -64 49 -366 -177 -24 -96 105 -169 233 -36 -191 -104 57 -79 73 -368 114 132 -103
8031 -103 -114 -21 46 49 282 -11 -191 -84 -56 -141 -89 37 178 152 6 -189 -75 -22 160 -101 259 36 135 70
8055 70 72 95 -69 126 -102 -172 -123 127 -201 109 176 171 -11 -49 145 45 -36 -95 -62 101 -92 294 -83 -44 -52
8080 -52 -67 254 87 -1 -73 136 -24 457 -91 69 114 -170 -49 140 -11 180 -129 89 -117 -238 -66 85
8102 85 62 4 -96 -68 -59 -103 -90 56 -134 -59 -218 -20 229 -101 -145 158 -44 3 17 14 -136 -71 281 -154 -199
8127 -199 113 78 -33 -183 -168 80 -70 104 122 -120 -45 96 -112 126 -106 -21 158 -4 86 204 164 93 25
8150 25 190 94 -78 137 -107 164 128 76 158 -136 -287 145 -116 -95 -51 238 -63 -109 -244 -100 -218 -20 121
8173 121 2 -137 257 -35 45 222 -227 103 -33 189 98 133 214 -42 -107 52 -243 -95
8191i5
##END NTUPLES=NMR FID
##END=
