##TITLE=1H_Ser 6-6-V-2
 CDCl3
 8 sc, 
 28.06.2022
##JCAMPDX= 6.0         $$ Bruker NMR JCAMP-DX V2.0
##DATA TYPE= NMR FID
##DATA CLASS= NTUPLES
##ORIGIN= UXNMR, Bruker Analytische Messtechnik GmbH
##OWNER= root
$$ XWIN-NMR		Version 3.5
$$ Tue Jun 28 14:45:40 2022 Russian Standard Time (UT+4h)  she@DPX200
##.OBSERVE FREQUENCY= 200.1313499994
##.OBSERVE NUCLEUS= ^1H
##.DELAY= (6, 6)
##.ACQUISITION MODE= SIMULTANEOUS
##.ACQUISITION SCHEME= undefined
##.AVERAGES= 8
##.DIGITISER RES= 18
##SPECTROMETER/DATA SYSTEM= spect
##.PULSE SEQUENCE= zg30
##.SOLVENT NAME= CDCl3
##.SHIFT REFERENCE= (INTERNAL, CDCl3, 0, 15.7039)
##AUDIT TRAIL= $$ (NUMBER, WHEN, WHO, WHERE, WHAT)
$$ ##TITLE= Audit trail, XWIN-NMR		Version 3.5
$$ ##JCAMPDX= 5.01
$$ ##ORIGIN= Bruker BioSpin GmbH
$$ ##OWNER= she
$$ F:/spectra/data/she/nmr/H-F/1/audita.txt
$$ ##AUDIT TRAIL=  $$ (NUMBER, WHEN, WHO, WHERE, WHAT)
(   1,<2022-06-28 14:44:27.21 +0400>,<she>,<DPX200>,
      <created by zg, POWCHK disabled, PULCHK disabled
       configuration hash MD5:
       00 E9 B6 7A A2 85 ED C7 34 08 36 98 17 FE 4E 26
       data hash MD5: 16K
       6A A1 D2 D7 2B AD C2 1B 8B B7 53 41 23 D7 4C C0>)
$$ ##END=
$$ 
$$ hash MD5
$$ 0D C1 2D 32 2C F2 5F 33 65 38 C9 59 32 6E 0A F7
##$RELAX= 
##$RELAX= 
##$RELAX= 
##$RELAX= 
##$RELAX= 
##$RELAX= 
$$ Bruker specific parameters
$$ --------------------------
##$DU= <F:/spectra>
##$EXPNO= 1
##$NAME= <H-F>
##$PROCNO= 1
##$TYPE= <nmr>
##$USER= <she>
##$AMP= (0..31)
100 100 100 100 100 100 100 100 100 100 100 100 100 100 100 100 100 100 
100 100 100 100 100 100 100 100 100 100 100 100 100 100 
##$AQSEQ= 0
##$AQ_mod= 1
##$AUNM= <au_zg>
##$AUTOPOS= <>
##$BF1= 200.13
##$BF2= 200.13
##$BF3= 200.13
##$BF4= 200.13
##$BF5= 200.13
##$BF6= 200.13
##$BF7= 200.13
##$BF8= 200.13
##$BYTORDA= 1
##$CFDGTYP= 0
##$CFRGTYP= 5
##$CHEMSTR= <none>
##$CNST= (0..31)
1 1 145 1 1 1 1 1 1 1 1 1 1 1 1 1 1 1 1 1 1 1 1 1 1 1 1 1 1 1 1 1 
##$CPDPRG= <>
##$CPDPRG1= <>
##$CPDPRG2= <>
##$CPDPRG3= <>
##$CPDPRG4= <mlev>
##$CPDPRG5= <mlev>
##$CPDPRG6= <mlev>
##$CPDPRG7= <mlev>
##$CPDPRG8= <mlev>
##$CPDPRGB= <>
##$CPDPRGT= <>
##$D= (0..31)
0 1.2 0 0 0 0 0 0 0 0.06 0 0.03 0 0 0 0 0.0002 0 0 0 0 0 0 0 0 0 0 0 0 
0 0 0 
##$DATE= 1656413066
##$DBL= (0..7)
120 120 120 120 120 120 120 120 
##$DBP= (0..7)
150 150 150 150 150 150 150 150 
##$DBP07= 0
##$DBPNAM0= <>
##$DBPNAM1= <>
##$DBPNAM2= <>
##$DBPNAM3= <>
##$DBPNAM4= <>
##$DBPNAM5= <>
##$DBPNAM6= <>
##$DBPNAM7= <>
##$DBPOAL= (0..7)
0.5 0.5 0.5 0.5 0.5 0.5 0.5 0.5 
##$DBPOFFS= (0..7)
0 0 0 0 0 0 0 0 
##$DE= 6
##$DECBNUC= <off>
##$DECIM= 32
##$DECNUC= <off>
##$DECSTAT= 4
##$DIGMOD= 1
##$DIGTYP= 9
##$DL= (0..7)
0 120 120 120 120 120 120 120 
##$DP= (0..7)
150 150 150 150 150 150 150 150 
##$DP07= 0
##$DPNAME0= <>
##$DPNAME1= <>
##$DPNAME2= <>
##$DPNAME3= <>
##$DPNAME4= <>
##$DPNAME5= <>
##$DPNAME6= <>
##$DPNAME7= <>
##$DPOAL= (0..7)
0.5 0.5 0.5 0.5 0.5 0.5 0.5 0.5 
##$DPOFFS= (0..7)
0 0 0 0 0 0 0 0 
##$DQDMODE= 0
##$DR= 18
##$DS= 0
##$DSLIST= <SSSSSSSSSSSSSSS>
$$ [...]
##$SUBNAM2= <"">
##$SUBNAM3= <"">
##$SUBNAM4= <"">
##$SUBNAM5= <"">
##$SUBNAM6= <"">
##$SUBNAM7= <"">
##$SUBNAM8= <"">
##$SUBNAM9= <"">
##$SW= 18.0517283424941
##$SWIBOX= (0..15)
0 0 2 0 0 0 0 0 0 0 0 0 0 0 0 0 
##$SW_h= 3612.71676300578
##$TD= 16384
##$TD0= 1
##$TE= 0
##$TE2= 300
##$TE3= 300
##$TEG= 300
##$TL= (0..7)
0 120 120 120 120 120 120 120 
##$TP= (0..7)
150 150 150 150 150 150 150 150 
##$TP07= 0
##$TPNAME0= <>
##$TPNAME1= <>
##$TPNAME2= <>
##$TPNAME3= <>
##$TPNAME4= <>
##$TPNAME5= <>
##$TPNAME6= <>
##$TPNAME7= <>
##$TPOAL= (0..7)
0.5 0.5 0.5 0.5 0.5 0.5 0.5 0.5 
##$TPOFFS= (0..7)
0 0 0 0 0 0 0 0 
##$TUNHIN= 0
##$TUNHOUT= 0
##$TUNXOUT= 0
##$USERA1= <user>
##$USERA2= <user>
##$USERA3= <user>
##$USERA4= <user>
##$USERA5= <user>
##$V9= 5
##$VALIST= <valist>
##$VCLIST= <CCCCCCCCCCCCCCC>
##$VD= 0
##$VDLIST= <DDDDDDDDDDDDDDD>
##$VPLIST= <PPPPPPPPPPPPPPP>
##$VTLIST= <TTTTTTTTTTTTTTT>
##$WBST= 1024
##$WBSW= 4
##$XGAIN= (0..3)
0 0 0 0 
##$XL= 0
##$YL= 0
##$YMAX_a= 162097
##$YMIN_a= -280969
##$ZGOPTNS= <>
##$ZL1= 120
##$ZL2= 120
##$ZL3= 120
##$ZL4= 120
##$ABSF1= 10
##$ABSF2= 0
##$ABSG= 5
##$ABSL= 3
##$ALPHA= 0
##$AQORDER= 0
##$ASSFAC= 0
##$ASSFACI= 0
##$ASSFACX= 0
##$ASSWID= 0
##$AUNMP= <proc_1d>
##$AZFE= 0.1
##$AZFW= 0.1
##$BCFW= 1
##$BC_mod= 2
##$BYTORDP= 1
##$COROFFS= 0
##$CY= 11.3945322036743
##$DATMOD= 1
##$DC= 2
##$DFILT= <>
##$DTYPP= 0
##$F1P= 2.36226072786647
##$F2P= -0.459571619588291
##$FCOR= 0.5
##$FTSIZE= 0
##$FT_mod= 4
##$GAMMA= 1
##$GB= 0.15
##$INTBC= 1
##$INTSCL= 1
##$ISEN= 128
##$LB= 0.24
##$LEV0= 0
##$LPBIN= 0
##$MAXI= 10000
##$MC2= 0
##$MEAN= 0
##$ME_mod= 0
##$MI= 1.114404
##$NCOEF= 0
##$NC_proc= 0
##$NLEV= 6
##$NOISF1= 3.799351
##$NOISF2= 2.8
##$NSP= 1
##$NTH_PI= 0
##$NZP= 0
##$OFFSET= 15.70392
##$PC= 1
##$PHC0= -18062.42
##$PHC1= 19.20069
##$PH_mod= 1
##$PKNL= yes
##$PPARMOD= 0
##$PSCAL= 0
##$PSIGN= 0
##$REVERSE= no
##$SF= 200.130013532006
##$SI= 16384
##$SIGF1= 3
##$SIGF2= 2
##$SINO= 400
##$SIOLD= 16384
##$SREGLST= <1H.CDCl3>
##$SSB= 0
##$STSI= 0
##$STSR= 0
##$SW_p= 3612.71676300578
##$SYMM= 0
##$S_DEV= 0
##$TDeff= 0
##$TDoff= 0
##$TI= <>
##$TILT= no
##$TM1= 0
##$TM2= 0
##$TOPLEV= 0
##$USERP1= <user>
##$USERP2= <user>
##$USERP3= <user>
##$USERP4= <user>
##$USERP5= <user>
##$WDW= 1
##$XDIM= 8192
##$YMAX_p= 0
##$YMIN_p= 0
$$ End of Bruker specific parameters
$$ ---------------------------------
##NTUPLES= NMR FID
##VAR_NAME=  TIME,          FID/REAL,        FID/IMAG
##SYMBOL=    X,             R,               I
##VAR_TYPE=  INDEPENDENT,   DEPENDENT,       DEPENDENT
##VAR_FORM=  AFFN,          ASDF,            ASDF
##VAR_DIM=   8192,          8192,            8192
##UNITS=     SECONDS,       ARBITRARY UNITS, ARBITRARY UNITS
##FACTOR=    0.0002768,     1,               1
##FIRST=     0,             0,               0
##LAST=      2.2672688,     0,               0
##MIN=       0,             -280969,         0
##MAX=       2.2672688,     162097,          0
$$ Real data points
##PAGE= N=1
##DATA TABLE= (X++(R..R)), XYDATA
0 0 0 0 0 0 0 0 0 0 0 0 0 0 -8 8 -8 8 -16 16 -16 24 -24 32 -40 48 -56 64 -72 87 -96 112 -128 148 -168 191
34 191 -215 244 -274 307 -342 382 -427 475 -524 582 -644 712 -787 869 -958 1055 -1160 1278
52 1278 -1410 1554 -1717 1899 -2105 2342 -2615 2936 -3317 3783 -4362 5107 -6104 7519 -9692
67 -9692 13496 -22082 86079 -92456 -133533 162097 68440 -5123 115190 68188 -121612
78 -121612 -36296 78579 9255 -42439 28528 29070 -15950 -12188 29275 19651 -19875 -30002 -6877
91 -6877 -13580 -15165 -4946 -5551 13093 36718 -4422 -9988 54092 37720 -24828 20606 39491
104 39491 -44794 -44363 19088 -9735 -16788 25130 -33518 -83103 2382 53923 8155 -19244 -36013
117 -36013 -42190 17355 43079 -12697 -26558 -939 -26476 -29305 23267 32494 -7386 -23492 -9832
130 -9832 12943 26288 31892 27773 -13965 -38784 17827 42982 -29968 -38189 24658 -6180 -50365
143 -50365 13791 36743 -23333 -6229 37297 -6625 -35803 -3881 2796 -8819 -4471 -12681 -24190
156 -24190 -15216 10176 42191 35527 -18979 -24585 25139 21865 -13196 -2630 -1011 -29413 -24576
169 -24576 -1578 5897 17690 18585 -858 -8948 136 22538 43373 14347 -33902 -15095 22768
182 22768 8338 5186 26479 2530 -18945 8333 17754 3801 7875 -397 -18018 -8836 -2911
195 -2911 -7571 9614 14047 -10343 -9029 6711 -1266 6048 26143 4798 -23205 -9791 11844
208 11844 14057 2694 -7968 -3278 -2938 -19753 -14614 8198 -2533 -23574 -14930 -12473 -18918 5267
222 5267 22168 -3475 -19534 -6566 3690 6596 2732 -2027 2652 -3020 -15679 4692 28731
235 28731 11729 -3930 6068 -1296 -11297 9643 15836 -7538 -16309 -11797 -7599 5165 12101
248 12101 5717 1880 -6017 -10439 9755 19523 -2107 -9726 3188 -2751 -8980 9762 18648 7971
262 7971 716 -4144 -3587 6567 9624 3629 -4039 -15773 -13477 5292 9630 -1233 62 2144
276 2144 -8407 -7685 5252 6587 1414 -4798 -12933 -7585 5841 7349 7509 6966 -7116 -11592 3238
291 3238 7361 -526 -1751 -6864 -16225 -7252 8166 6673 2437 533 -4083 -2980 3121 4945 5456
306 5456 2683 -7413 -8434 1040 7890 10272 8213 -1414 -7057 67 5220 2018 120 -3385 -9796
321 -9796 -8872 -3016 3022 7813 3638 -4332 -4471 -376 3293 7755 6371 -2755 -6775 -315 6138 8713
337 8713 10219 5897 -1322 -3528 -553 4301 4290 -4068 -9482 -8009 -7398 -3714 4579 5881 -3065 -7849
353 -7849 -4474 -113 2403 3746 -563 -7435 -6601 143 7405 10073 6787 2467 1016 1377 3447 6184
369 6184 5283 -2934 -10195 -7733 -1783 290 1681 1298 -4894 -8325 -3382 2205 1417 -1546 -4827 -8404
385 -8404 -7972 -1908 3374 4459 500 -4646 -3269 1357 3469 5279 3693 -3037 -7274 -3149 3332
400 3332 5386 2054 -2510 -5863 -4367 -739 2577 3718 -1973 -6753 -2552 2739 3760 6127 5211
415 5211 -430 -2091 575 3204 5240 3925 5 224 4104 4837 7389 11755 7632 2167 2891 882
431 882 -1054 2064 913 -3336 -3510 -3913 -2582 5985 9218 2967 114 302 -4285 -1762 5155 -1557
447 -1557 -11112 -10155 -7879 -3253 3555 2634 -2764 -3669 -3374 -1672 3784 2023 -7070 -8981 -6850 -5969
463 -5969 91 4643 -24 -2285 121 1652 5272 6407 -488 -3121 -2577 -6955 -5716 215 -2691
478 -2691 -6600 -2849 -2839 -3988 2685 3764 -80 2975 2131 -2984 3015 6619 1559 3133 3946 -3704
494 -3704 -1983 6608 4442 749 2257 -2218 -3563 3388 3411 -68 366 -6477 -9881 491 2534 -3789
510 -3789 -1198 42 -3754 3119 11160 5543 2883 5441 1419 98 3651 752 -923 1818 -3062
525 -3062 -3673 5660 6199 3002 6743 4633 -701 2558 3318 -730 -894 -3093 -7186 -2006 1462 -2061
541 -2061 1611 4594 -984 -9 3529 -2068 -2153 1967 -3895 -7417 -3869 -4763 -1847 5327 -438 -6384
557 -6384 1055 2084 -3118 2469 1469 -10032 -7943 -1958 -5386 -2578 506 -6252 -6350 621 -118 1116
573 1116 4828 -1620 -4718 2136 1215 -749 5192 1266 -6387 -766 2671 224 3680 1602 -5198
588 -5198 -430 4680 1489 3276 4258 -2464 -398 5943 1835 79 4449 76 -1247 6220 4099
603 4099 -308 3954 2886 711 3850 -497 -5862 -905 1053 -3661 -2265 -2019 -5418 914 6655
618 6655 1216 161 2695 -1445 1341 6713 -392 -3287 1289 -1969 -2556 5987 3397 -3603 618
633 618 1922 -2321 1777 2497 -4703 -3962 -2261 -5576 -513 3150 -4242 -4051 1591 -584 244 3904
649 3904 -1374 -4756 596 1122 -784 1120 -1380 -2157 4274 2150 -3300 1453 1947 -2716 818 1905
665 1905 -4614 -3110 1009 -762 85 221 -5278 -3130 2658 -699 -1722 1239 -3759 -5055 3796 3940
681 3940 -624 1677 616 -1207 3761 4185 794 1905 5 -3983 2452 6737 -481 -1048 2963 -1800
697 -1800 -1215 5352 926 -3624 -120 -1558 -2701 2059 1038 -1894 797 131 -2271 3167 3366 -2873
713 -2873 -885 2117 -1538 -749 2341 -385 84 2453 -431 -225 1968 -286 -17 2299 -1945 -3970
729 -3970 835 341 -1983 1329 -88 -4355 -919 1224 -885 -239 -1417 -4350 -698 1551 -1496 335
745 335 2394 -1596 -1294 2816 1395 324 2575 -498 -2540 1419 1379 441 2304 -177 -1955 2496
761 2496 2455 -1241 1784 1570 -3043 -1273 1488 -895 -55 1679 -1791 -1504 2084 -379 -419 3090 -253
778 -253 -2791 826 720 -204 2530 1489 -1813 22 1538 634 2155 1561 -2190 -1082 751 -1106
794 -1106 720 2392 -2146 -3359 -842 -1215 -440 520 -2857 -3826 -1329 -1431 -1262 1796 444 -3135 -529
811 -529 912 -500 1575 1826 -2057 -1755 -135 -175 1649 2085 -431 -722 1063 -278 579 2856 -111
828 -111 -3008 -1223 -780 -1368 737 370 -1550 -52 94 -189 2165 2326 -313 244 526 -1150 992
845 992 3123 723 -496 1112 746 1307 3686 2581 1078 920 -405 -29 2160 915 -826 -458 -1334
862 -1334 -2020 575 1901 66 -977 -693 -1340 54 1569 530 -235 -891 -2265 -820 1903 908 -118
879 -118 319 -568 -898 1686 3113 1074 -382 -1297 -1771 -108 384 -583 -1441 -2920 -3733 -1499 947 -189
897 -189 -554 -1050 -2216 -1974 -87 344 -626 -1450 -2870 -2644 -237 1117 525 842 -238 -1276 326 2330
915 2330 1609 749 -905 -1948 -1534 -105 908 662 -282 -1315 -975 945 2006 1813 925 -732 -1354
932 -1354 -560 540 1385 829 -967 -1116 442 1818 2461 2531 1940 178 321 1531 1907 1575 1206 184
950 184 -574 -1 1477 2285 2141 723 -584 -579 682 1525 523 517 -1337 -2943 -1781 589 527 -343 -803
969 -803 -1676 -2110 370 2599 1696 -68 -1098 -1882 -840 1092 1291 103 -1938 -2986 -347 1215 1439
986 1439 385 -626 -1964 -2106 -263 490 -572 -1910 -2883 -2895 -968 -515 -217 649 -1293 -2555 -328
1003 -328 1093 308 754 807 -1534 -2281 -112 1525 1458 865 -304 -975 342 1691 2380 2591 -77 -2285
1021 -2285 -800 784 1395 1129 -378 -2251 -2010 328 2106 2108 112 -1551 -244 504 656 2045 1926
1038 1926 -1072 -1163 1097 1267 1845 2814 1024 -492 643 1047 1147 1961 1022 -1136 -691 -718 -1065 938
1056 938 1517 -1329 -1435 -930 -1739 -4 2226 -143 -1813 -1595 -1700 -482 1776 1119 -1423 -1478 -1442 -627
1074 -627 2339 1987 -905 -985 -914 -1203 1379 2451 -445 -1982 -1783 -1856 -365 1733 333 -1793 -1807 -1811 -694
1093 -694 1432 554 -1139 -1130 -1811 -1433 1249 1629 127 -83 -993 -1060 1387 2510 1557 869 -468 -1554
1111 -1554 738 2784 839 339 272 -2495 -1035 2515 1574 -313 -203 -1380 -1820 632 1385 443 406
1128 406 -1248 -2413 705 1935 174 1106 947 -2131 -722 2706 1360 556 954 -808 -1176 787
1144 787 1613 1120 1025 -1240 -1955 134 925 -505 850 -161 -3156 -1550 545 201 224 -161 -2066 -1500
1162 -1500 -242 402 1225 1038 -1536 -1830 376 217 923 2218 -62 -2009 -107 697 1039 2075 564
1179 564 -1721 -581 -184 -504 1772 1122 -1832 -1593 -131 -1008 427 2611 -739 -2788 -781 -437 378
1196 378 2135 327 -1701 -656 142 788 2394 1455 -970 -556 564 0 1915 2561 -575 -1193 59
1213 59 -469 732 1941 -68 -1493 -1063 -1482 -542 1638 323 -1630 -1156 -1095 -1049 1275 1150 -625 -518
1231 -518 -727 -1047 1223 2066 298 30 -391 -1135 629 2176 312 -581 -318 -1818 -964 1407 716 -617
1249 -617 -268 -1375 -1677 968 1331 -602 -481 -940 -1779 57 1246 200 193 61 -1282 -273 1963 990
1267 990 505 731 -839 -979 1262 1710 998 741 -568 -1013 478 1251 1044 1126 -557 -2265 -181 1193
1285 1193 503 416 202 -1846 -1189 735 506 742 723 -1266 -1301 535 634 1180 1447 -414 -1730 292 1192
1304 1192 490 897 674 -1796 -902 502 578 1075 232 -1626 -1205 -189 -475 288 658 -1645 -2260 -769
1322 -769 -458 -141 925 -274 -1836 -1018 93 518 1187 351 -1100 -653 -265 -58 1486 1515 -307 -883
1340 -883 214 273 452 1209 -282 -1233 -908 -1125 -165 1095 -147 -1241 -684 -749 -661 1089 928 -781 -563
1359 -563 73 -141 1061 1948 612 87 287 -286 1074 2280 1232 -19 147 -307 57 1458 1266 -116
1377 -116 -778 -939 -811 893 933 -111 -225 -671 -1113 466 1504 390 196 -4 -772 311 1374 886
1395 886 175 -211 -845 -717 1064 895 48 -148 -710 -1132 269 748 174 -558 -1470 -1612 -557 382 -248
1414 -248 -401 -770 -1448 -921 345 517 -234 -585 -1256 -1110 151 519 335 379 -655 -730 67 577 377 537
1434 537 -258 -1103 -361 632 786 495 299 -598 -465 202 368 708 415 -794 -878 -181 185 491 767 -278
1454 -278 -875 -242 500 464 823 477 -529 -445 495 795 1280 920 -14 -197 469 499 909 973 431 -501 -627
1475 -627 184 239 523 94 -562 -1112 -600 95 332 1 -696 -926 -591 20 555 682 255 -197 -360 492
1495 492 1170 1082 389 12 -331 -399 383 915 147 -463 -805 -494 -538 61 -165 -953 -1253 -983 -810 -488 -221
1516 -221 -418 -575 -515 -219 -104 617 430 36 -335 -269 -117 772 811 333 -206 94 -1 -41 343 -106 -617 -639
1538 -639 55 -110 462 616 -70 -273 -354 -129 665 636 55 -540 38 517 273 945 722 -256 160 445 222
1559 222 893 971 284 -99 -232 197 -268 1334 1051 -605 -438 -215 -912 173 -339 -770 -240 -401 -63
1578 -63 854 1305 461 -873 -167 -489 -438 403 300 -586 -459 -661 70 967 127 -228 168 -42 -113 746 798
1599 798 71 -206 -115 -99 278 337 -115 -88 41 -696 -205 341 -185 -667 -272 -693 -658 174 342 -77 -359 -25
1621 -25 -94 658 804 121 491 355 -153 477 969 305 16 154 -18 -94 436 84 -354 -335 -731 -705 -12 -74
1643 -74 -413 -152 -552 -657 123 284 -76 195 -84 -563 -818 -438 352 343 -23 -528 673 853 244 405 481
1664 481 -134 -541 575 -110 -96 350 -546 -713 -305 -4 -791 15 -330 -833 59 508 513 167 640 -546
1684 -546 90 658 565 71 624 -155 -54 614 242 -85 342 -234 -712 63 118 212 312 533 -567 -1067 323
1705 323 45 862 -309 -76 -1098 65 709 124 146 -51 -147 -329 -283 122 680 -196 -420 43 33 463
1725 463 571 467 -475 -584 900 -450 134 219 -269 185 73 -512 66 239 -443 -690 145 -288 -466 31
1745 31 -67 -756 -25 -33 -187 238 -56 -299 325 41 -315 133 415 -219 -186 273 -174 -222 420 19 -426 -330
1767 -330 -371 -578 -76 -412 -805 -335 -412 -676 19 424 -338 -294 62 -38 -16 563 -10 519 366 205 431
1788 431 531 507 734 971 338 -44 300 572 -170 209 -336 -290 70 60 -959 -428 -456 -928 208 577 -131
1809 -131 -113 267 -161 160 713 377 -77 695 22 -105 580 348 -156 -112 155 -578 174 -302 -253 -16 912
1830 912 -962 -1113 135 272 -351 545 -777 150 599 -82 266 472 53 -534 464 253 -256 311 119
1849 119 -349 -12 375 -47 245 -102 -390 -57 336 -260 -204 81 -249 -384 65 -194 -116 -78 -261 -434 -64
1870 -64 -89 -363 80 -258 -493 -54 266 -142 78 -40 -383 93 357 -153 472 294 249 206 609 216 691
1891 691 749 148 -175 193 320 117 657 158 -206 -1 -52 130 113 204 -571 -323 -190 -383 -81 277 -97
1912 -97 100 291 171 278 751 -150 -349 97 137 223 318 145 -292 -156 -331 41 -126 -119 -624 -649 -366 -652
1934 -652 6 -65 -480 -500 -234 -119 -30 552 -159 -95 79 260 161 558 442 73 230 387 98 564 433 -4
1956 -4 -85 71 -225 250 98 -268 -265 -170 -292 -217 159 43 -381 -363 -44 178 337 167 -77 122 -134 93 325
1979 325 565 321 59 14 -142 171 310 246 94 -45 -151 -283 364 -74 -12 -78 -167 -319 278 53 144 126
2001 126 -67 -361 145 388 128 82 -130 -213 -35 287 201 179 -49 -103 -119 517 444 145 -22 -71 -149 -17 321
2024 321 -14 -36 50 -446 -300 273 304 117 -578 -374 -424 111 121 86 42 -536 -113 150 233 339 124 -115 -112
2047 -112 71 95 294 332 -151 -130 183 117 120 149 -40 -560 -166 -325 -44 -4 -50 -281 -543 -134 271 108 21
2070 21 -32 -471 38 29 182 291 259 219 142 393 -8 252 447 88 -369 -372 65 238 181 -187 -179 -369 -177 -19
2094 -19 178 -134 -315 -744 -211 2 -135 78 71 -480 -467 160 458 370 224 -95 -241 -12 326 400 189 219
2116 219 -464 -114 278 -24 106 -160 -562 -79 177 -12 296 162 -88 -354 -21 210 264 227 -115 -324 -7
2137 -7 116 534 541 0 51 -21 418 439 264 202 -153 -237 0 115 250 -2 -261 -292 -178 -145 -13 13 -394 -527
2161 -527 -496 -304 -81 42 -240 -53 -130 66 59 496 325 -89 -73 329 -45 -20 519 82 -178 -347 -80 -7
2183 -7 206 -150 -157 -126 -346 -106 162 281 -72 -358 -259 -290 344 444 -182 -262 -522 -411 -1 377 318 -67 -100
2206 -100 -40 -128 390 269 5 -6 -438 -112 161 411 101 -78 -491 -309 -1 400 156 -234 -449 -629 -166
2227 -166 227 121 38 174 -340 -30 533 537 191 376 79 -10 542 310 132 244 16 -317 38 369 129
2248 129 69 -48 -364 -129 350 90 -94 24 -449 -290 -26 -3 69 50 -123 -403 39 138 -51 131 -157 -235
2270 -235 -36 0 127 -90 -116 -347 -204 182 27 325 203 -120 -268 -242 -81 30 151 -319 -395 -409 -208 136
2292 136 246 175 -319 -145 350 164 358 426 -179 -142 112 -110 467 584 170 -95 228 59 223 278 63
2313 63 -85 -39 -90 -27 414 62 -437 -272 -255 -48 247 175 117 -104 -305 155 288 256 63 63 51 -124 78 570
2337 570 321 -142 -211 -174 107 372 200 -28 -66 -116 -2 44 441 120 -280 -466 -458 -167 67 227 -162 -333
2359 -333 -243 -29 409 215 -315 -1 -374 -383 157 449 139 136 162 -246 209 389 90 94 -145 -383 -208 158 64
2382 64 -11 -238 -472 -340 12 44 83 145 -515 -591 -7 73 90 255 -114 -139 27 403 325 380 165 -153 63 387
2406 387 276 190 239 -3 -128 25 12 259 127 -179 -409 -46 -57 180 156 -128 -333 -191 32 -8 227 78
2428 78 -277 -220 83 166 138 254 -196 -143 275 16 259 202 -97 -293 33 -190 -172 303 261 -262 -472 -3 -154
2451 -154 -62 200 -342 -483 -271 14 -27 267 -119 -150 139 -54 323 368 130 -41 -101 -239 -58 357 -122 -149
2473 -149 -354 -30 434 -308 -221 198 580 -284 -457 33 38 -59 -206 -107 -807 -224 271 -164 177 44 11 -75
2495 -75 431 457 30 117 -97 -166 188 479 90 266 145 -326 -75 237 146 -137 297 83 -432 136 193 -212
2517 -212 39 377 -744 -525 455 173 -52 -63 -376 -58 272 47 240 -49 -108 -191 108 281 251 -117 -104
2538 -104 -91 16 66 124 41 -220 -641 -161 -160 54 341 -132 -369 -263 81 -37 38 -152 -6 -267 110 57 22
2561 22 126 -13 116 77 193 244 280 32 -26 -88 356 7 5 0 -185 -265 -194 58 53 189 -114 -185 20 116 268
2586 268 68 -30 -165 -22 198 161 122 114 16 -22 -222 86 348 140 143 -237 -306 10 275 111 -10 -129 -217 -4
2610 -4 161 270 -114 -97 -45 -209 66 104 -306 -80 -397 -270 -93 149 50 -2 -57 -43 -36 117 125 140 -95 -72 -259
2635 -259 17 62 -13 -28 -63 -120 194 -122 67 -146 -29 76 -63 59 69 73 -93 9 -66 98 15 39 175 -117
2659 -117 -215 -37 141 79 204 -158 -135 190 -19 -33 17 82 -71 -107 81 102 190 -65 -303 -169 -318 75 -87
2682 -87 -413 -128 -206 -216 -110 93 172 210 -23 -96 -73 -144 364 345 325 2 141 -10 99 -18 26 -170 -188 -68
2706 -68 109 -192 -235 -293 -310 -510 -160 -33 -43 -149 -460 -224 73 278 262 95 286 -183 -111 299 201 83 96
2729 96 2 1 218 167 37 -50 -253 -249 -94 134 4 -274 -196 181 90 150 -165 -202 107 -110 -84 149 90 386 229
2754 229 94 172 334 -32 5 118 51 -41 183 138 269 30 106 -366 -12 318 -25 -12 -165 14 -325 -56
2776 -56 30 -196 -44 -166 125 162 49 -62 -36 99 -179 -237 192 12 -114 86 -141 -126 244 -63 18 176
2798 176 -218 32 -116 -325 -209 -101 -99 -171 -123 -244 99 54 28 -187 -184 29 65 -14 98 274 123 214 57 -64
2822 -64 82 -29 29 134 23 154 138 95 175 95 -19 -47 65 -50 -93 -55 111 75 102 101 -107 -311 94 -85
2846 -85 -18 24 95 -217 1 -117 188 326 168 63 245 -218 -98 -19 56 151 56 -75 -142 122 47 19 -142 82
2870 82 -113 -11 -200 1 3 -30 -161 -28 -37 33 107 59 -77 -116 -65 145 24 -22 131 -264 155 -58 25 184
2894 184 -26 -204 -40 201 31 71 23 -126 -51 25 -249 -224 54 110 -75 185 115 -84 -9 -143 -32 85 85
2917 85 13 -4 86 -175 24 30 179 16 181 -2 -211 -13 68 97 3 192 -265 -140 -53 -218 21 -117 -172 203
2941 203 157 -119 55 42 80 64 -102 30 -82 298 -29 225 186 156 122 99 58 12 244 -8 -69 -250 -31 -198
2965 -198 48 -246 57 -77 296 -292 -1 -136 -267 -47 -78 192 -214 -34 -201 30 107 154 3 -227 69
2986 69 -120 194 -25 -44 126 42 0 10 -34 -297 -331 209 -190 -314 -44 90 -166 -149 -51 98 56 297 90
3009 90 173 -15 64 76 121 -17 -27 49 130 162 -20 183 96 194 24 72 -78 -237 -96 24 -80 -113 -221 42
3033 42 -135 -45 -121 77 47 -208 -23 -151 -134 -59 174 103 -97 -188 -31 157 126 -49 212 -178 -37 113 -93
3056 -93 -78 92 -28 244 -95 -180 10 -20 115 -209 46 -35 186 -135 130 -21 21 54 -50 141 86 -154 -62
3079 -62 162 31 69 75 105 106 -39 147 262 -50 145 -171 -183 -203 51 -138 -86 130 -179 -257 -147 264 -207 88
3103 88 99 -44 35 -88 -219 31 33 140 -24 154 107 155 -33 231 120 -65 106 235 96 -179 4 -98
3125 -98 16 4 105 -44 -117 -222 19 18 -325 -24 -168 -262 -22 -72 4 16 -153 -27 78 109 155 24 209 58
3149 58 -33 -49 191 -14 8 -54 -167 -24 97 10 322 -115 -49 11 -77 108 142 187 -248 83 99 81 10 -57 159
3174 159 65 16 106 142 261 -38 63 30 -93 58 208 77 -95 -166 -140 18 -30 35 57 -339 -240 -182 -3 -143
3198 -143 146 35 101 0 -57 -60 -92 64 -127 -37 216 83 199 23 -92 -136 16 -43 -47 -64 102 19 -23 -30 -91
3223 -91 209 -55 -252 -34 -16 -265 103 -6 -192 -26 -72 69 84 12 -29 33 -89 51 47 206 19 -89 72
3246 72 -43 376 -93 157 108 -100 64 -11 240 22 -116 -6 -56 359 267 -55 105 -110 105 81 -17 -20 -214
3269 -214 70 -297 -22 38 356 -10 57 -270 -33 -62 266 31 -257 -25 -16 -201 -117 179 79 -52 100 -156
3291 -156 -13 -175 78 -116 72 -157 -185 15 27 -138 102 -71 -270 138 186 3 163 63 -197 63 170
3312 170 111 74 -12 -163 33 -87 -20 -133 -137 -263 49 10 189 -22 11 -225 -281 2 -201 -47 39 5 -244 49
3336 49 -152 -56 -26 -158 -120 140 100 117 24 -95 -282 -96 14 327 19 -136 161 -293 69 -2 9 -120 -21
3359 -21 -155 110 -268 105 35 -3 124 160 120 160 300 322 15 35 74 76 225 97 45 -131 -71 71 19 22 76 -143
3385 -143 -254 -107 -40 -45 85 -144 39 -147 -62 -42 82 86 -214 -42 109 208 180 -73 185 -194 50 -79 22
3408 22 -86 90 -165 -133 -3 -101 215 -178 -187 104 -105 -120 -55 50 20 -88 -231 -109 50 141 105 106 -26 -111
3432 -111 285 89 -147 -150 -206 -85 196 236 57 6 -29 -58 -45 238 56 -91 -258 -172 -100 68 139 -110 -188 34
3456 34 -285 -61 133 -1 -106 37 35 -64 74 230 6 -5 46 -21 -71 112 242 -68 20 -5 161 42 76 45
3480 45 -124 -294 141 51 14 -128 33 -52 -67 -214 73 54 58 -115 86 114 116 33 -49 -96 -142 169 182 104 -122 75
3506 75 -118 -142 54 28 20 12 -167 -113 -212 245 -70 6 -136 -226 155 -17 -174 102 -146 -67 -170 183 36 -13
3530 -13 -103 -227 185 60 108 230 49 93 -13 -50 87 49 -137 -181 -22 -31 -28 122 145 67 -154 -54 13 279 -73
3555 -73 2 4 110 1 -21 0 -52 -42 -162 104 39 -16 200 -36 -39 22 -6 80 28 69 -108 25 -38 -110 62 118 -191
3582 -191 -185 116 5 -145 20 -91 6 1 -33 36 192 26 -18 -19 -308 85 93 98 -28 -98 -179 -52 97 -50 104
3607 104 -104 -20 116 -207 -43 -127 -1 -57 -203 162 182 8 84 -94 80 -213 113 94 -65 47 56 174 -45
3630 -45 -9 46 28 -111 -139 45 147 -94 -69 -105 -27 -182 -88 152 82 63 -37 -97 102 47 -155 -31 30 4 -147
3655 -147 63 71 74 67 -64 32 57 158 178 225 -230 170 157 -62 79 185 -243 -258 80 -13 -123 -13 -155 -252 -13
3680 -13 225 -206 183 -108 -180 122 206 228 119 -126 -223 -70 61 170 155 -93 230 -235 -33 92 117 79 -104
3703 -104 -52 4 -57 -109 -125 -36 -17 -107 -34 45 -145 -101 146 131 -21 4 138 -134 178 -121 268 -60 86 286
3727 286 40 104 -100 -63 12 169 102 7 55 -37 -112 -82 213 -54 58 -138 98 169 157 -313 -111 24 -165 -65
3751 -65 282 -179 50 -155 44 228 -100 118 -84 -94 -70 164 18 -15 44 -36 -62 -154 -7 37 1 -296 -135
3774 -135 28 13 -156 117 -67 49 -57 34 -3 65 -122 4 -299 23 110 87 127 381 -109 88 146 -15 31
3797 31 -20 257 224 -20 39 -96 146 -100 139 15 -95 -223 270 -8 -3 -196 38 35 2 16 -35 67 -18 131
3821 131 8 7 68 67 -188 -270 -149 -232 318 61 -33 -21 -39 136 161 105 -133 -56 5 174 -122 -121 96 -122 -149 -61
3847 -61 88 19 40 162 232 118 69 -16 -234 -124 -80 19 -29 -96 61 157 123 55 167 -11 86 183 12 -158 -184
3872 -184 -91 -16 66 -111 -98 -16 96 -19 -129 -116 -23 -318 150 95 48 7 109 82 -114 -120 55 27 -203 136 -37
3897 -37 -9 34 -146 -20 2 -75 47 -130 -45 17 -52 123 -84 11 36 128 236 75 43 -31 75 6 159 -140 91
3922 91 81 94 -46 8 -11 20 103 -115 18 -29 104 84 -119 -103 -42 19 31 -44 95 62 83 -183 -215 243 98 156
3948 156 225 8 166 -473 -137 287 17 -740 192 17 -332 410 -207 474 -148 324 -288 206 166 -459 131
3969 131 -118 74 23 -656 223 180 -316 -233 -120 348 -179 -194 -64 208 -13 306 72 -105 104 101 14 1 50
3992 50 -585 208 -40 285 -247 95 -8 -121 -391 -306 -464 445 527 667 -87 239 51 -511 167 -92 -541
4013 -541 -510 91 -333 -114 239 19 -161 8 29 33 -46 -87 -99 -121 58 -32 -47 98 112 -62 -108 -184 177 22
4037 22 33 35 -10 -38 -5 53 261 -228 -57 -22 -81 138 26 97 5 -215 229 7 -18 3 53 25 215 65 101 181
4063 181 50 62 47 88 84 195 -40 90 -39 136 -88 -3 12 145 118 -173 -93 -70 68 -26 93 -173 130 -53
4087 -53 -37 187 163 -8 -177 51 27 155 -133 -95 50 -86 95 -16 13 95 48 -89 -1 20 -72 141 -88 16
4111 16 121 46 164 38 -222 -70 -49 19 51 -29 15 38 314 -25 126 -58 -206 135 -107 48 186 25 233
4134 233 130 -180 41 38 -85 30 159 -125 -71 127 262 164 53 186 140 119 13 234 311 -222 -518 337
4156 337 528 174 -420 -491 351 329 226 -152 -145 -48 16 172 276 282 -77 278 529 48 -45 -134 148 14 -175
4179 -175 216 86 -7 120 24 -249 -180 -209 117 -60 -70 19 -15 -189 -156 -29 155 -84 -222 100 -200 -40 75
4202 75 112 46 169 -6 1 -8 -115 44 26 61 -244 302 262 73 184 198 -258 -257 603 92 153 -15 -288 442 655
4227 655 852 647 -382 372 266 460 183 324 -337 -164 -113 -120 -28 123 126 -3 327 7 56 132 173 18 102
4250 102 38 124 132 -21 9 115 35 108 -322 -146 -66 -30 -78 -215 -2 171 -83 -188 -44 -61 -171 -68 63 -76
4274 -76 -188 -232 128 19 -82 82 -270 -80 343 82 136 191 -218 51 -294 118 -109 79 21 -145 100 98
4296 98 46 230 -27 132 22 72 -86 25 -37 -41 -17 72 -182 0 141 -12 -87 -31 43 -245 41 -78 475 -25
4320 -25 119 15 -30 32 0 41 -176 39 38 -66 -109 -24 -55 159 -39 -60 10 332 34 67 183 -117 16 289
4344 289 -144 -253 19 -194 152 21 -196 -8 -10 -257 165 -5 -76 -203 180 -303 102 -37 -160 69 -177
4365 -177 191 -72 301 187 -77 48 -33 -197 41 -4 53 7 63 -76 172 110 86 -15 182 -122 -173 -119 45
4388 45 -4 -80 -103 -7 -22 -164 -83 -324 -138 88 22 243 150 90 137 -31 -20 113 10 134 116 87 199 257 150
4413 150 -122 -92 120 -148 57 149 -15 242 -150 -68 -10 -69 -41 -166 179 -117 67 -279 -151 -126 79 -53
4435 -53 12 166 230 80 130 45 371 -274 -105 -181 -56 -50 -51 -121 -103 -110 80 61 35 -136 27 -11 97 117 -18 210
4461 210 -132 106 4 11 16 -52 -40 -273 118 -4 -6 -15 -203 -140 96 -15 -172 59 142 125 23 191 -80 22
4485 22 98 182 71 149 242 -117 -140 115 -36 138 4 -68 18 -142 138 82 27 -144 277 -119 -96 -56 1 181
4509 181 44 133 -40 230 -13 -70 53 -6 234 -117 -246 254 -3 -69 37 46 12 -213 39 147 -48 7 -85
4532 -85 148 -86 199 158 -3 -156 54 -150 180 -138 9 46 -189 82 50 -68 -37 -36 0 50 -43 30 -15 120
4556 120 -17 145 116 14 -99 112 167 -50 12 8 135 24 3 -24 43 -70 -31 -61 -7 -51 -36 -75 142 12 18
4581 18 -192 61 -26 -50 -16 195 -16 -76 -21 55 249 122 -126 -113 -125 12 117 102 295 -54 -63 -144 49 139 198
4606 198 21 -45 77 -37 -32 209 14 -70 -157 161 -30 -57 105 -97 -239 59 43 -125 -64 -27 -189 -113 -202 156
4630 156 31 87 31 217 -3 216 446 -36 -92 -44 -72 269 79 3 -316 67 -189 103 -75 -285 -38 17
4652 17 329 -141 -163 -248 -57 -104 104 120 -11 225 27 375 255 -146 -20 47 -31 -46 95 21 -193 24 227
4675 227 -138 -114 -315 -60 17 60 -65 -47 82 -222 5 -80 -121 -38 178 -22 -120 -41 71 -62 136 85 -18
4698 -18 94 -139 38 16 314 -87 20 -46 -79 -284 -90 131 -111 -4 55 24 28 55 -80 -146 -104 -107 85 -114
4722 -114 -168 -45 -130 -185 -87 336 134 49 217 135 57 168 106 -96 15 26 254 142 -34 -137 -11 -114 -134
4745 -134 -99 -37 -164 -170 -4 -135 -21 87 61 -208 121 -16 32 18 5 17 -22 125 -30 -110 -114 37 -50 33 -105
4770 -105 52 89 -38 -29 -88 1 -4 106 156 112 -67 -193 146 -116 -115 53 96 -206 33 -93 -8 -43 90 149 109
4795 109 4 84 96 255 -160 35 163 25 164 31 96 -57 -100 -6 109 25 -138 159 53 52 -67 92 -62
4818 -62 64 -40 -5 70 86 -24 126 -117 116 36 -275 -8 124 -148 22 121 -121 230 100 -3 -32 173
4840 173 114 -104 -26 137 86 133 -64 -115 217 2 -75 -176 41 55 22 49 118 -179 -34 294 -45 -69 216 -61
4864 -61 -11 -25 -62 33 -229 -133 38 -16 58 152 -35 83 -65 -124 -107 -106 30 -155 -132 -219 -209 22 -1 -106 72 32
4890 32 -119 -362 43 62 -84 97 -108 71 24 -5 -4 29 55 -62 -108 -125 -61 -49 59 64 -60 -64 -165 -113 -45 10
4916 10 26 73 11 -42 -115 8 -105 77 232 162 -106 -3 -144 82 99 97 -160 35 -21 24 -86 -247 149 106
4940 106 -25 -42 -61 -76 -280 4 67 -164 276 24 -192 -83 -2 -137 167 249 12 147 99 52 152 194 -149
4963 -149 -33 -9 217 -118 132 -190 49 156 215 -188 -95 -120 -54 -125 35 46 -223 -444 554 64 -246 -576
4985 -576 -362 400 -164 -123 -830 -344 240 367 25 -307 -12 0 87 -515 320 -671 -94 -34 -181 78 -201
5006 -201 129 50 221 10 170 -216 83 -205 47 9 375 -48 2 64 -81 38 -166 17 -50 -86 5 2 -85
5029 -85 180 61 4 -38 -310 160 -166 -131 -58 -196 -31 157 7 49 51 262 -373 -442 183 -385 -182 -69 27
5052 27 -10 -32 -104 19 -217 -111 -65 333 260 41 68 70 -335 515 81 -442 173 425 -410 -32 6 -59 -153 -63
5076 -63 91 198 -10 -47 -7 73 -60 -200 57 -55 -112 -162 107 84 230 72 18 -57 132 49 -183 96 89 36
5100 36 67 41 50 -74 -73 64 -43 162 -89 101 13 -19 -42 71 70 6 -100 3 -2 37 -11 -92 434 340 399 257 45
5127 45 -238 35 175 -221 -134 28 164 71 -40 -705 31 -60 209 459 117 729 17 -92 262 194 -61 182
5149 182 526 -310 191 -58 199 -904 -391 144 205 -107 751 -353 -263 149 344 280 255 691 134 303 193
5170 193 -639 -107 328 1066 -335 199 -376 755 746 -568 -219 20 16 -54 134 106 176 -36 75 57 -8 -146
5192 -146 -10 151 -165 -131 99 -106 -10 65 75 -144 -131 -96 149 -35 160 -74 13 -1 48 72 108 -8 115 -6
5216 -6 142 -193 -270 -44 88 -10 277 -35 38 49 194 101 -54 -87 -245 202 -140 -77 18 -35 249 29 26 40 -105
5241 -105 217 50 -74 10 203 53 -94 21 1 3 -58 7 134 -75 -111 43 -57 -132 113 -156 -94 214 -103
5264 -103 -84 -28 -231 181 -146 -40 60 -10 -195 -45 249 80 69 -42 37 -84 60 47 87 -10 119 -182 -155
5287 -155 24 66 -233 -123 63 -80 -162 -37 101 157 70 -102 -143 186 92 28 32 -126 35 -207 -118 -260 125
5310 125 109 14 -93 282 -108 -73 177 39 127 -71 22 195 -32 -106 87 31 -220 36 85 172 23 -11 -191
5333 -191 -13 179 57 -118 213 30 -64 68 -136 150 189 -74 -92 93 -54 -146 -96 172 -8 77 157 -527
5355 -527 -452 -129 -51 158 -318 -133 -5 233 -413 -542 15 148 -232 197 2 100 -171 -91 -98 -209 -528 320
5377 320 -618 -653 -511 -493 -692 718 126 -699 328 -130 -573 120 16 221 -7 -121 -211 69 -32 111
5397 111 69 -80 -31 226 153 -222 -172 -47 -28 50 -72 -83 83 137 -24 126 43 136 -286 -184 -31 64 38 -177
5421 -177 -10 69 88 -123 16 7 30 123 -5 25 0 -28 -130 -31 92 -53 -53 34 21 -115 -126 136 170 206 12 227
5447 227 1 258 -61 -79 53 11 256 14 -56 55 44 35 -176 -15 -34 -9 90 -58 41 187 -5 -38 -32 50 159
5472 159 -25 145 93 -136 11 219 -183 261 84 -26 177 -170 -8 67 -131 95 -4 -41 112 -63 150
5493 150 -28 -93 128 -30 -27 -129 -101 -198 -1 -148 -268 -154 114 -395 -467 248 449 -94 46 -38 -78 -86 302
5516 302 -69 -133 122 -210 198 -43 195 -174 21 -56 -24 -77 100 166 25 181 -29 -45 147 54 226 -6
5538 -6 -15 39 1 -13 30 51 172 84 13 -107 -34 -43 -17 110 -8 -70 83 -154 -68 -80 109 56 -131 68 -153 -51
5564 -51 100 -128 156 144 26 -31 -124 81 44 37 19 -149 -250 -232 155 152 36 -12 -19 -43 -39 139 31 162 -131 -22
5590 -22 -134 -55 86 41 -49 42 31 -106 1 250 -189 3 26 -39 141 -69 -57 -1 158 -49 18 200 10 -239
5614 -239 94 -2 74 212 266 47 14 -149 -51 64 264 58 -56 -121 -103 -210 -155 -46 100 -245 27 77 -232
5637 -232 -10 158 -27 -186 125 -47 -92 283 -337 565 -522 417 314 376 952 80 102 -613 742 -252
5657 -252 -111 -276 802 -19 -1235 -112 266 126 -465 -295 239 -123 353 146 -47 167 -137 38 -119
5676 -119 5 -114 -101 -25 -84 131 -303 -340 73 30 111 -13 -163 264 -426 -127 257 31 -433 186 -249 9
5698 9 73 116 852 -497 -201 267 71 331 -509 386 4 -245 -42 185 114 180 -130 -501 -146 -154 354 115
5720 115 -856 109 -134 -50 -57 9 119 -59 -147 103 -98 -133 31 10 117 -163 16 156 -35 -33 -62 249 78
5743 78 -194 114 -91 63 -357 85 2 -64 260 182 -20 -92 -94 61 -42 86 123 1 -43 -143 87 175 -8
5766 -8 -94 -32 -17 48 -122 204 -212 -102 -29 16 317 694 -318 3 -110 -84 172 294 -531 54 -230 149 -126
5789 -126 -490 700 -14 -314 140 14 -86 -938 -658 -481 -371 339 516 370 3 -469 -98 650 -259 273
5809 273 -159 334 -201 464 -216 110 -85 -34 -12 24 -92 -152 191 32 -115 39 110 -50 39 157 -102 48
5831 48 -155 111 268 -13 4 -128 67 -2 24 -159 7 137 -107 101 -172 -82 -133 -30 -75 89 -127 72
5853 72 197 169 -38 -276 60 -58 -34 -217 280 -133 -126 27 -280 17 146 -167 39 -136 -67 30 -18 -118 -428
5876 -428 -121 -79 -4 -294 49 -227 -72 141 -33 220 197 -48 83 123 -144 105 -71 -106 15 -49 -36 144
5898 144 226 1 194 292 153 -666 161 290 -387 123 102 603 52 328 -365 -237 -367 0 -39 -25 204 -151
5920 -151 -441 -124 14 190 207 -186 174 -366 206 -97 135 240 -436 122 144 313 -494 46 -168 361 301
5941 301 440 206 -250 -345 -315 -340 -167 -236 220 -344 -131 263 -53 66 -104 -98 125 243 14 79 180 14
5963 14 -40 98 -96 239 -16 -10 -105 24 -172 15 96 -165 -218 -82 -2 71 65 -185 -111 259 -78 15 6 -79 178
5988 178 254 132 -128 -24 -50 -85 11 2 -56 6 54 -103 109 -2 10 -58 15 45 7 204 119 -184 -83 8 -26 -19
6014 -19 15 -48 68 140 -2 -3 146 84 -63 153 -100 116 175 -223 234 43 -134 121 131 3 -60 86 0 -72
6038 -72 17 41 71 -40 103 -17 -314 -32 16 80 -19 -177 50 -59 59 3 34 22 -44 0 -134 30 -8 128
6062 128 -293 51 -55 -118 21 -38 -3 -66 -83 89 14 253 145 -54 -14 79 -187 79 216 49 -49 31 15 -37
6086 -37 -90 -50 92 53 112 -15 148 15 22 99 50 33 198 -98 179 -165 97 80 3 210 -138 -122 31 280
6110 280 -230 123 -321 136 152 121 -11 41 31 40 -213 -199 153 70 21 161 0 -238 -139 -66 -281 -79 -65 -41
6134 -41 168 85 9 61 -59 82 -8 103 -79 -130 60 48 -54 17 -24 -5 8 -129 -95 -33 -71 -124 -38 -35 72 112
6160 112 -129 116 50 233 -121 10 131 42 -192 -70 110 -63 132 -99 130 -101 -53 -126 -46 80 188 101
6182 101 -214 4 226 101 112 76 -145 134 50 -27 286 -193 49 -78 -54 89 140 -287 5 35 122 -147 28
6205 28 -246 -44 -195 134 -21 226 211 -52 -33 -143 9 5 -234 -33 -98 -126 -128 88 -4 154 -51 39 -67 -127
6229 -127 213 69 -19 294 -306 76 -352 510 71 218 620 -361 527 428 -442 -136 102 746 608 403 -62
6250 -62 447 -1429 -163 153 336 217 -209 467 -583 -291 -691 -358 189 -382 -625 -135 -1000 -1469 -781
6269 -781 -1432 20 -139 443 89 -712 -241 -227 249 -551 -161 -414 -224 -235 -319 -237 118 -382 -35 119 -481
6290 -481 -474 211 8 440 7 -330 -404 -135 -406 -239 157 473 -20 -309 -73 -94 172 164 -127 -31 40 -206 85
6313 85 -193 -13 244 -84 -250 69 107 -153 -70 -173 -16 205 -3 8 -149 -60 -118 111 -201 -56 56 27
6335 27 76 -16 -104 249 -210 76 54 170 -64 180 -155 109 154 167 -238 34 -13 -13 -43 153 -35 -41 28 17 86
6360 86 116 -10 69 26 -253 106 -61 92 135 7 -93 -39 -108 217 -223 60 280 630 73 562 69 32 265
6383 265 -613 -452 311 -59 62 30 13 -146 6 52 140 35 235 -90 -281 -272 285 -362 -89 -167 92 -725
6405 -725 581 120 -108 511 221 421 -219 -890 -381 -288 220 -286 -114 -102 180 -188 166 4 -105 -248
6425 -248 86 -263 72 -637 249 -476 -169 301 -337 307 168 -346 -268 61 -495 489 311 -78 -552 -45
6445 -45 -132 -106 430 115 323 -906 453 -410 900 43 -120 -133 -13 -192 223 -307 -415 -320 -115 -20 -83
6466 -83 14 201 121 80 -170 -68 210 -148 251 20 -222 179 -220 -62 -155 75 -87 -18 51 139 -68 -53 80
6489 80 -85 -113 87 321 -353 185 -149 200 141 263 30 308 -51 -96 -291 -64 -25 -149 -256 -150 -73 -244
6511 -244 -570 31 242 414 361 -222 120 105 16 8 375 117 -511 40 310 250 174 -426 -725 121 21 357
6533 357 428 -635 -75 487 -462 16 206 -24 -255 230 443 247 -25 -109 -173 371 113 83 25 -35 20 -75
6555 -75 -136 -189 -63 -166 -91 -157 -42 -7 34 131 48 122 -24 86 -75 -7 -7 187 217 -197 105 -13 14 -6 250
6580 250 4 39 106 -79 14 237 -294 182 -35 -34 -127 -64 58 73 -34 77 -180 -2 -101 60 126 -129 23
6603 23 153 259 -28 -210 98 106 -255 7 -96 -149 -70 32 -121 -82 -244 -92 223 47 -54 -73 -14 121 -36
6626 -36 211 62 -70 34 14 49 -183 162 201 91 151 -33 159 -1 79 125 74 143 -40 -136 -62 27 -71 -86 -59
6651 -59 31 -89 177 80 -73 -75 36 -4 -87 -20 134 232 -96 173 115 -97 234 160 -56 -18 17 9 -240 -71 93
6676 93 -91 -214 -30 155 58 -38 43 -153 25 95 102 -76 -221 -139 -145 -69 -15 63 127 -132 153 110 -45 87 39
6701 39 0 168 121 111 -110 -57 -4 -41 114 24 74 189 -95 -78 -121 -92 -74 -138 -163 -66 33 -71 198 185 -9 -87
6727 -87 138 -131 87 -188 -52 47 54 107 188 180 -5 -127 158 -254 18 169 -22 62 74 77 -63 -90 145 61 82
6752 82 227 268 -23 7 -8 11 72 -64 -44 -263 22 156 104 -111 227 -38 -41 -112 -249 173 147 47 -152 -26
6776 -26 -99 12 -79 -38 72 -43 -103 13 -145 -32 -83 -102 -69 -45 -110 -119 251 64 -186 -35 -27 -151 38 369 23
6801 23 44 -222 196 -5 14 134 -180 -86 -36 -24 76 23 10 7 -16 -9 37 115 -33 -93 46 128 -122 -37 -53 -1 -75
6828 -75 -99 -54 23 250 -40 155 -69 -51 -19 135 214 310 192 -90 -55 -135 -151 213 -60 155 -209 -49 -100 -142
6852 -142 -79 138 175 156 66 3 -147 264 -31 15 9 139 199 43 -179 -15 74 -154 -225 -202 -20 -168 -18 87
6876 87 -73 96 48 -150 -121 16 -157 -134 145 -198 2 -102 16 75 137 187 6 -4 176 60 -112 111 340
6899 340 -252 -333 92 14 112 -48 -1 -61 46 87 -69 -17 169 -119 28 -4 115 -63 111 -152 -110 -58 18 -221
6923 -221 135 25 -65 -34 -68 28 90 171 -63 13 202 -71 102 17 -24 -9 218 -92 93 77 -90 0 39 -180
6947 -180 -444 -182 477 159 -146 -58 -57 30 104 318 61 -75 -187 -139 231 86 34 36 -126 -136 5 -291 -47
6970 -47 -157 104 469 198 -102 225 -628 264 -645 245 -245 -247 108 -73 146 -708 147 485 -28 352 -549
6991 -549 165 445 65 174 -440 -42 -268 236 362 475 144 109 -646 -78 -186 -168 -233 19 -121 -179 131
7012 131 -274 -274 280 305 120 -88 488 138 26 259 139 531 -69 159 -136 -80 45 319 327 -3 39 -131
7034 -131 536 19 -274 11 -11 256 56 -52 -59 -10 -43 -41 -307 5 -60 93 -163 -95 191 93 -75 -34 -57 -19
7058 -19 -62 233 39 15 -170 -42 139 -106 -17 -67 251 7 -88 -46 7 168 -158 160 -153 -178 48 -117 142
7081 142 80 -10 75 -19 21 -204 142 -101 56 6 33 3 -173 -84 -66 -29 231 12 -27 85 -43 54 107 -165 213
7106 213 -20 -247 -92 -206 -24 229 20 -49 -39 -13 -143 54 -13 -119 31 -42 -20 152 -195 -194 113 -77 -118
7129 -118 228 -141 84 -81 -76 -69 -76 -13 39 -50 71 -129 -32 98 -70 25 -251 69 -224 66 -101 20 -17 79
7153 79 -9 -61 -184 -84 9 277 91 24 -28 47 -14 11 -53 -108 -80 -28 2 -22 -147 0 169 82 175 29 -162 -50
7179 -50 -24 68 -10 42 47 95 -107 -63 22 145 -52 -7 33 190 4 -132 162 60 -98 97 47 -66 88 -34
7203 -34 36 245 79 -52 54 60 -103 -55 29 35 47 0 140 -146 -48 -1 88 -30 -72 -132 -36 -120 108 -146 -139 109
7229 109 -72 198 138 42 -80 85 -9 -35 158 86 -25 8 -236 75 54 -169 -254 -18 -273 209 -17 7 64
7252 64 77 13 -38 -87 58 67 120 47 68 -82 -139 -143 36 258 141 -77 63 153 -72 -25 60 -143 -164 -16 -2 -31
7278 -31 -23 153 183 -31 -17 -30 -49 181 -80 107 -115 -34 127 145 152 172 287 66 140 -4 -42 30 -24 77 -62
7303 -62 224 -181 59 -38 91 -234 -102 42 68 -69 7 -64 110 -168 -154 -98 -53 -41 -143 223 62 45 129 -32
7327 -32 -267 -108 14 16 -123 -211 28 -173 -46 74 11 -63 95 -192 -123 -181 0 -25 111 41 11 52 138 125 -167
7352 -167 -45 136 10 -22 99 -41 109 -55 103 -229 308 37 29 -48 79 -159 272 -12 -99 -44 -172 232
7374 232 -110 115 -179 -98 169 23 -2 25 70 -16 -152 263 108 147 70 -22 -19 -98 35 -181 94 142 -155 -83
7398 -83 -144 -124 52 -110 -161 -71 -173 -122 18 150 -95 -50 29 111 69 -42 129 19 -143 0 -58 81 -64 95
7422 95 -188 -20 28 25 13 4 178 94 391 -225 128 140 -81 -71 -230 173 13 -75 -28 -42 -262 95 -22 111
7446 111 -23 21 -72 -264 67 -175 -87 -3 -26 -144 -60 -143 -137 -87 -100 105 -28 -94 104 48 36 138 -63 183 71
7471 71 154 -21 -85 109 -144 -67 -87 -77 114 -63 79 -113 71 -127 -70 72 -322 172 -2 69 26 -52 -174
7494 -174 86 -14 -153 -35 151 -36 -153 25 -15 -75 7 -194 -63 208 -192 62 147 56 63 180 225 -208 108
7517 108 136 -140 -210 10 -171 -26 -80 -6 -129 -157 101 92 -20 -166 71 88 18 18 87 165 -33 -82 192 87 268
7542 268 160 93 -106 34 -23 -49 -97 -60 229 -105 -48 -63 -20 41 160 -182 -44 -57 137 -91 -61 -43 60 -90
7566 -90 77 -17 -173 138 45 22 -205 208 -151 -26 112 35 -113 -22 -111 -76 11 5 43 -98 -104 -215 66 -142 -18
7591 -18 -29 92 191 344 -9 61 28 -24 67 20 -179 -54 -82 40 -181 102 168 -245 -178 -69 -246 41 -39 -64
7615 -64 1 -28 76 21 -226 109 77 -14 136 135 -28 252 37 3 -9 -86 49 -28 -189 -44 115 -95 55 92
7639 92 -50 215 176 -250 -99 -75 -107 40 -56 -185 73 28 1 82 -87 -47 -250 110 -28 20 169 34 -97
7662 -97 -77 -52 -81 290 124 45 8 -90 148 -33 -17 -211 -75 -109 36 -70 -18 105 -13 57 -116 6 19 153
7686 153 -9 47 -52 -39 163 -118 95 -143 -3 32 -121 -1 -234 -102 -138 103 168 -61 -103 0 67 73 13 103
7710 103 -31 -89 1 78 255 -96 46 -123 194 88 -95 -71 -113 188 -8 85 -36 -60 96 27 77 -24 68
7733 68 -18 72 -99 -52 66 -109 -34 -160 -27 207 49 77 -30 -64 106 -31 -40 -74 57 69 -173 57 64 69 65 -116
7759 -116 208 -37 -59 56 -86 262 76 183 -131 311 131 35 -158 162 107 -90 -213 137 6 89 -21
7780 -21 58 -10 55 -72 -2 -38 32 -177 -318 -27 119 271 -17 -141 249 44 177 161 -351 -137 25 -107 25
7803 25 -166 226 55 -144 -81 -108 87 -99 -54 -30 -99 69 -104 -188 -182 62 -2 118 98 47 -15 113 -102 -50 0
7828 0 -26 30 -99 -36 47 -143 -3 -52 -29 34 -80 -52 -52 -132 137 151 -145 -65 137 3 99 100 266 1 -74 4 156
7855 156 0 -130 250 7 105 218 -80 -200 237 200 88 96 107 -95 -129 123 -229 -67 26 -78 170 -184
7877 -184 -225 -119 -47 -119 -552 -159 201 -126 210 -150 -993 -449 274 -610 494 -216 476 288 725 -120 739
7898 739 381 748 -961 -884 39 -66 147 342 53 154 437 39 -281 228 -428 -24 386 -199 -35 260
7918 260 -66 13 99 -17 -9 -63 123 76 -148 338 -123 -698 -146 19 346 -185 73 -196 -170 276 -224 245
7940 245 -150 108 393 289 -85 -312 -121 -181 56 -198 108 -152 31 25 -120 -303 -233 271 413 -162 278
7961 278 129 -633 -416 -157 238 -79 439 11 -476 279 114 -374 -548 -192 602 -68 -209 -185 545 -315
7981 -315 228 -375 -386 925 -668 -268 545 477 22 103 1003 428 -268 275 439 -3 -167 -489 -17 -35 -39
8002 -39 -4 -292 -322 -417 -111 36 229 -7 -81 177 3 195 57 -54 -247 -88 -69 31 -5 73 232 85 26
8025 26 -147 -208 44 -141 -42 226 183 -366 -256 0 811 -64 -280 -375 460 963 -254 -235 283 -31 -172 -234
8047 -234 -601 316 332 -29 -43 -107 -83 419 295 21 -20 164 -127 -49 252 -69 -26 145 121 -58 -199 -87 55
8070 55 152 -36 155 -115 65 -95 304 44 10 -172 70 52 79 156 14 53 37 -146 -304 -172 -74 72 -42
8093 -42 -72 24 131 87 227 -9 97 -12 105 -19 31 -156 77 -149 -116 -209 -43 -24 102 121 -36 -117 75
8116 75 -321 -151 109 -128 -41 -125 -22 -104 -14 -78 107 89 -228 -455 -194 94 -28 -148 42 225 27 -261
8138 -261 20 71 -15 98 224 -63 -61 28 161 152 121 -78 70 29 102 -156 216 14 -22 146 -141 -88 -30 196
8162 196 29 82 43 -58 -39 65 -101 174 -24 -67 -46 130 -106 144 82 87 88 -156 -42 -121 -41 -48 90 -97 118
8187 118 133 215 26 -81
8191h1
$$ Imaginary data points
##PAGE= N=2
##DATA TABLE= (X++(I..I)), XYDATA
0 0 0 0 0 0 0 0 0 0 0 0 0 -8 8 -8 8 -16 16 -16 24 -24 32 -40 48 -56 64 -72 85 -96 112 -128 146 -168 190
33 190 -215 242 -273 307 -342 382 -427 475 -526 584 -646 714 -788 871 -958 1057 -1165 1284
51 1284 -1412 1558 -1721 1903 -2110 2341 -2613 2928 -3302 3755 -4312 5022 -5959 7259 -9181
66 -9181 12322 -18325 33870 -161797 -280969 126523 91345 -45205 60761 84471 -91303
77 -91303 -11878 129696 46218 -52961 17104 31355 -19864 -14329 37259 31942 -3099 -8089 22823
90 22823 15760 -3844 -4349 -9766 -13299 1644 -25325 -34309 29616 37035 -22006 15282 60173 -7082
104 -7082 -18220 59053 37747 -6322 24390 -8171 -58225 20933 72792 -781 -42467 -28622
116 -28622 -18286 26227 45683 -17288 -41241 71 -4976 -16530 23977 24847 -28645 -44620 -18319
129 -18319 5770 11412 4453 -1990 -20851 -25781 29845 61063 -5395 -30801 33805 17610 -42407
142 -42407 3929 37112 -28205 -27735 29863 1633 -30653 13144 29189 2668 -3588 -10719 -25737
155 -25737 -18074 -236 10849 -2241 -41198 -33545 29411 37660 -4113 1214 14626 -13186 -16493
168 -16493 5092 914 -8147 -13095 -28706 -27352 -3996 17215 26246 1079 -36890 -13575 31538
181 31538 13134 -9990 7221 -4268 -24472 8269 29047 10020 8797 10376 -4753 2039 12808
194 12808 1548 4159 6758 -17211 -17909 7050 5904 3835 20088 3640 -21113 -1573 24644
207 24644 19098 2654 -4598 2550 11254 2894 5324 24530 13366 -14078 -8172 1431 -9088 610
221 610 11137 -16054 -31495 -8445 7673 4993 -1313 -7949 -5822 -6627 -16313 -3034 16789 -1645
235 -1645 -21091 -3717 4522 -1989 15261 22850 -3173 -13998 -2168 1203 4057 4576 -7466 -12516
249 -12516 -10745 -8286 9598 18762 -3052 -14078 1831 885 -9666 3334 10659 -4472 -11149
262 -11149 -5432 2074 13864 16971 6761 -961 -6115 -3244 11324 11447 -5494 -8207 -1103 -5630
276 -5630 -3063 11550 11372 624 -5067 -9035 -4058 7614 4975 -2993 -3719 -9200 -8121 10032 16556
291 16556 4042 -794 -2041 -8385 -2538 8879 1470 -9704 -9168 -8193 -3694 4620 5951 3157 -223
306 -223 -7848 -7541 2191 6029 1826 -2171 -7296 -6967 4500 12427 7965 3438 1240 -3639 -3159 1802
322 1802 2767 969 -4975 -11324 -7701 931 4466 5301 2287 -6276 -9049 -1279 4637 3072 876 -1686
338 -1686 -4668 -510 7636 12980 11856 3662 -2039 314 1813 1570 4037 1499 -7759 -10510 -2232
353 -2232 4902 5137 3259 -2235 -8650 -7132 -716 2175 -257 -5675 -7844 -4079 2083 7416 10419
368 10419 9121 2932 -1905 2212 7570 5707 1413 -1008 -5152 -5955 1665 7713 5173 -70 -2275
383 -2275 -3759 -3174 739 2060 -1661 -6857 -10028 -5866 891 3052 2291 487 -4095 -5473 -339 5623
399 5623 4192 -1415 -5636 -5691 -1436 2474 3285 1478 -4328 -8964 -4533 607 -852 -2014 -2995 -6647
415 -6647 -6044 -496 2761 2296 -601 -5026 -5532 -1738 -926 -622 2610 851 -2223 3063 6697 6595 9449
432 9449 8183 1683 -419 -385 -685 3185 4922 -1982 -3500 3155 4737 8024 14530 8370 -2333 -734
448 -734 2875 2432 3129 -969 -7778 -6006 -652 3178 7814 6281 -2305 -3692 805 132 -194 158 -7297
465 -7297 -10852 -5206 -1313 2337 4778 1063 143 4092 2658 1525 5053 822 -7019 -4811 -3765
480 -3765 -6482 -2470 -649 -5926 -4375 -2134 -6068 -1842 3545 -2088 -3333 -99 -4300 -3124 6134
495 6134 4548 -2000 -536 -677 -1748 5069 6243 267 347 -1662 -4177 4212 6527 -4580 -6532 -3439
511 -3439 -7733 -4839 2579 -3192 -7043 -522 765 477 5952 4927 646 2044 -1223 -4600 2120
526 2120 1760 -4272 -951 1451 -966 4487 9477 5800 4605 4484 767 2106 4052 -2000 -2650 1449
542 1449 -2230 -1556 5398 3415 2882 8511 4193 -1651 1915 1445 -655 2833 -2203 -8956 -123 5460
558 5460 320 4457 6919 -2518 -1985 6432 1725 -2026 -4 -6800 -9088 -1296 -1073 -3065 -225 -4057
574 -4057 -7370 506 2081 -2888 724 -929 -8561 -3081 3306 -1044 -465 -191 -7070 -3488 3438 -1075
590 -1075 -3001 -766 -5260 -4213 3923 1121 -2951 1362 -475 -3456 3204 2991 -3464 606 3223
605 3223 555 3883 3851 -476 4100 7369 826 -1105 260 -4003 -1764 2986 -3277 -5877 -146 -685
621 -685 830 6830 1842 -2954 2790 1636 -1669 4319 2705 -5654 -1280 4435 1089 3611 6434
636 6434 308 -191 3685 310 777 3332 -4139 -6435 603 51 -1975 2455 -389 -3922 1760 3128
652 3128 -1214 -656 -1575 -3475 1054 1328 -4308 172 4219 -416 1504 4146 -1719 -1999 3507 922
668 922 -1138 -540 -3440 -2661 3757 1285 -2889 117 -2716 -5520 1675 2134 -5870 -4617 -1902 -3150
684 -3150 1134 3071 -1282 -747 456 -2438 2015 5689 -1967 -4458 2111 -8 -1127 5584 2902
699 2902 -2853 1558 2357 -495 2352 1406 -3407 -1470 -276 -2459 1499 3175 -2841 -1215 3853 259
715 259 -1178 2125 -738 -2076 1058 -798 -1463 2193 1102 576 3697 1004 -1731 2646 3009 -1123
731 -1123 180 556 -3288 -354 3367 331 -46 12 -2476 -121 1854 -1850 -2513 -337 -3435 -3614 1277
748 1277 776 -1314 1016 -170 -2298 1533 1881 -1086 -225 -1295 -3441 1189 2809 -1063 835 2693
764 2693 -1364 -205 3518 425 -1106 917 -1777 -2781 1656 492 -1183 1922 329 -2742 945
779 945 2246 -757 460 354 -2965 -1083 1989 905 1162 1982 -667 271 3078 1572 1125 2939 -666
796 -666 -2403 1754 2208 1509 1986 -86 -2001 846 951 -965 347 -908 -4636 -2238 733 -1032
812 -1032 151 1173 -1993 -1986 622 296 -89 232 -2439 -3065 135 183 359 2618 806 -1728 522 1729
830 1729 13 556 -324 -3274 -2326 -976 -1376 228 613 -1816 -1355 472 -432 219 1365 -1336 -3404
847 -3404 -1454 -594 -710 1309 1072 -521 475 1167 1813 3351 2110 -307 195 467 -98 1421 2555
864 2555 29 -1190 194 394 838 2032 703 -946 -978 -1178 -63 2105 970 -1052 -524 -494 -702
881 -702 1572 2606 671 -618 -38 756 2165 3306 2066 744 -336 -820 1077 2261 351 -1380
897 -1380 -1506 -1810 -867 1196 1624 -134 -1057 -1754 -1493 66 353 -1563 -2745 -3069 -3165 -766 1509 801
915 801 -381 -675 -650 181 1142 1297 -631 -2539 -2836 -2156 -177 808 95 -815 -1086 -618 665 1453 993
934 993 -440 -2784 -3067 -1249 -65 -451 -295 -942 -1440 -489 1615 1927 784 238 -451 -826 94 1536
952 1536 1793 638 223 -99 543 2508 3110 2134 1100 333 -553 687 2693 1679 -82 -665 -1166 -843
970 -843 972 2396 589 -1592 -1300 -622 1128 2517 2151 289 -1294 -1121 1054 2655 1412 -273
986 -273 -900 -1036 171 2038 2348 1185 -302 -960 -522 734 752 -685 -1201 -2609 -3474 -953 1011 -511
1004 -511 -682 -566 -1766 -2242 428 1047 -696 -1721 -2602 -2717 -375 814 765 599 -961 -2006 453
1021 453 2385 1751 90 -1207 -2506 -1645 263 1644 368 -1768 -2387 -699 1124 334 563 211 -2512
1038 -2512 -2745 490 714 242 767 -275 -1137 807 1746 1718 1612 1367 -446 248 1422 706 2219 2387
1056 2387 -6 -942 895 450 1301 2296 -141 -2190 -1018 63 546 2009 740 -2352 -1597 -96
1072 -96 421 2109 1047 -1973 -1701 -191 41 2004 2806 -87 -1837 -92 693 1168 2174 308 -2362
1089 -2362 -1416 -477 83 1714 399 -1702 -1459 -747 -911 1011 650 -1972 -2210 -1970 -1579 373 1344 -601
1107 -601 -1093 -1000 -1348 849 2592 393 -1389 -389 -1681 -843 2828 1859 -1275 -467 -476 -673 1423 1798
1125 1798 -267 -1060 -1364 -2221 354 2154 -245 -655 -59 -2265 -996 2586 1269 -1290 -606 -1011 -1310
1142 -1310 1287 2258 837 395 -539 -1013 1669 2575 372 363 385 -1697 -347 2337 1351 -29 -132 -1305
1160 -1305 -815 577 1017 615 -238 -2273 -2236 238 593 -137 815 -598 -2396 -40 1452 459 1091 -72
1178 -72 -2352 -369 1229 515 1570 1660 -1499 -1248 1090 474 515 1803 -921 -3426 -518 553 480 1176
1196 1176 -426 -2945 -1130 560 445 1155 79 -2811 -1577 594 528 1522 1693 -782 -1265 1124 1308
1213 1308 1089 2123 25 -1298 -125 271 817 2004 676 -1492 -840 -83 -83 1036 648 -1988 -1674
1230 -1674 -502 -618 655 1481 -816 -1148 -84 -450 787 2215 296 -1191 -268 -270 -127 1886 1280
1247 1280 -1047 -396 -139 -1009 1297 1696 -890 -1722 -985 -1239 -39 1372 -586 -1278 -729 -1532 -606 1367
1265 1367 452 -1442 -867 -1022 -1368 1136 1621 -323 -387 -748 -776 1068 1554 403 107 -552 -1663 325
1283 325 2426 806 -111 288 -1191 -821 1525 1028 -202 -489 -1571 -1245 1059 1069 460 520 -615 -1527
1301 -1527 708 2024 582 316 90 -1284 -393 1930 1255 910 333 -695 44 1461 1354 1099 758
1318 758 -812 -1568 298 942 -1 341 -395 -2059 -1033 510 206 225 -679 -2155 -1010 240 260 657
1336 657 891 -1077 -1266 386 728 317 910 21 -1302 12 656 834 1193 -98 -1637 -510 -6 -486
1354 -486 382 -198 -2032 -1851 -734 -624 72 551 -961 -1346 -451 -220 465 1388 -7 -1105 -261 151
1372 151 427 1475 1220 -169 -641 -52 467 1382 848 -377 -976 -527 -397 306 1338 7 -861 -679
1390 -679 -211 319 1306 411 -462 -554 -436 285 1937 1418 173 155 431 193 1442 1729 247 -242 -461
1409 -461 -205 747 1452 455 -281 -575 -877 -62 795 693 -546 -953 -874 -697 518 661 -78 -547 -1007 -1020
1429 -1020 371 250 99 -648 -815 -1224 -438 565 552 -103 -163 -631 -548 586 238 82 0 -819 -610 414
1449 414 287 437 355 -280 -1252 -182 503 -91 -416 -542 -1006 -779 148 326 162 -59 -1009 -516 496 538
1469 538 466 681 87 -522 156 844 1164 903 384 110 -191 289 712 749 -103 -931 -724 -101 171 367 -22
1490 -22 -538 -834 -634 376 879 307 -152 -186 -246 478 945 1358 593 -52 316 765 891 1175 537 -258 -449
1511 -449 -175 466 576 6 -514 -746 -474 -605 84 -57 -343 -723 -781 -439 -142 473 162 -137 -608 -427
1531 -427 84 384 413 -202 422 -560 -445 458 210 -138 -734 -569 -37 -69 141 -40 -544 -908 -637 -28 59
1552 59 106 120 -447 -543 167 436 505 398 -96 -244 -105 303 666 426 585 80 -21 288 339 680 306 -351
1574 -351 -910 135 522 305 201 -72 -724 745 417 426 480 -44 -957 -166 -739 440 573 -56 -700 -331
1594 -331 21 -56 366 449 -359 -362 -156 37 605 661 159 17 188 -18 200 1049 336 -596 -231 -139 -358 6
1616 6 -37 -346 -518 -634 -415 160 11 -716 -239 -78 -388 -210 613 253 -100 282 152 490 476 709 210
1637 210 350 143 70 413 459 50 -71 272 -249 177 -126 -495 -353 -692 -450 -1034 125 -105 97 858
1657 858 -545 182 904 986 341 211 -551 190 459 28 35 437 579 -133 270 462 135 -381 81 -634 93
1678 93 190 -702 -319 38 -557 -299 692 -197 -466 -13 -291 -527 89 463 553 540 322 4 -34 986 287
1699 287 284 159 -1163 -1251 468 -1047 -397 40 -515 -259 182 -129 -463 331 -395 -711 -264 114 -231 83
1719 83 -369 -189 -134 428 -506 -113 -416 -205 1458 -19 542 319 408 245 160 386 596 385 979 -291
1739 -291 -282 736 357 -343 339 397 -560 -74 145 -43 -114 -10 -509 -148 123 -422 -104 442 -126 -283 530
1760 530 54 -232 517 170 -95 47 22 123 421 44 -300 54 -21 -654 -261 -139 -743 -704 -369 -511 -577
1781 -577 -103 -678 -512 -308 -318 -388 310 -534 -135 -95 -78 290 411 523 -207 404 87 -210 335 263 -55 203
1803 203 29 -88 -34 178 -793 -85 376 -512 -374 185 281 61 -236 -579 -124 410 397 -306 175 677 317
1824 317 -56 776 -139 454 208 -388 277 828 -694 -236 -2 -1020 -697 769 -401 -438 -7 136 -141
1843 -141 503 249 -432 341 -298 -132 -103 436 -253 -68 68 -258 40 444 -26 -250 234 -331 34 415
1863 415 130 -231 174 -108 -314 80 98 -125 43 125 -730 -211 409 -474 -341 -343 -655 -416 33 -320 -312 -157
1885 -157 -732 -347 -110 -6 -264 135 -4 -239 393 569 151 604 265 -277 93 278 99 301 318 -412
1905 -412 -140 153 70 -116 125 -213 -434 188 284 -3 304 -166 -167 151 384 471 625 139 -122 586 578 278
1927 278 562 160 -594 -251 297 24 79 223 -383 -657 -107 -88 -391 23 -359 -994 -433 -95 -333 82 -19
1948 -19 -411 -376 36 336 97 126 -58 -27 0 175 174 292 -78 -78 48 -51 -232 10 -243 -234 61 -13 -200 4
1972 4 -130 -402 -217 -327 -23 64 125 32 -107 -128 -45 146 234 39 -167 -57 196 224 277 165 -286 -84 -315
1995 -315 -387 349 92 -26 -109 -310 -393 91 463 132 -87 -54 -92 83 388 359 -252 -206 -313 -66 250 390
2017 390 -24 160 -30 86 366 406 232 56 -29 -352 417 323 285 -123 -286 -268 -108 279 372 -164 -416 -515
2039 -515 -209 -53 -70 -130 -212 -390 -287 -139 168 -18 -15 -179 -210 59 449 63 155 -130 -348 -35 154 320
2061 320 117 -97 -341 -327 138 81 120 -47 -511 -598 -171 -175 -95 49 85 -414 -160 -33 292 244 71 131 -69
2084 -69 117 504 539 475 506 -40 104 247 399 326 -95 -165 -303 -330 255 -59 -144 -205 -402 -497 104 179 -123 -194
2108 -194 -359 -373 238 135 57 66 68 16 192 355 474 8 -139 -189 -180 186 149 238 -102 -242 -154 -107 133 -33 -114
2133 -114 -481 -658 -168 -133 144 24 -127 -220 -255 110 285 259 8 -322 -175 376 243 439 179 318 -12
2154 -12 274 388 311 213 -100 -368 -107 201 165 130 -140 -352 -143 -229 9 208 -127 -366 -531 123 34 -17 493
2177 493 -118 -211 -106 154 264 440 -171 -227 -34 -149 278 374 159 -284 -302 86 152 384 124 -185 -335 -147
2199 -147 -29 118 114 -85 -277 -106 4 34 274 -88 -129 -242 -115 -82 317 334 58 -95 -110 -24 166 333 -13
2222 -13 -151 -86 -271 165 165 70 -326 -509 -403 -135 49 -164 -563 -261 -292 -134 313 374 26 82 -67 -127 384
2245 384 593 35 -193 213 114 -60 535 328 86 42 23 -165 299 232 275 -27 8 -119 41 333 122 387
2267 387 19 -319 -45 425 -21 75 -94 -364 -156 5 -38 88 64 -383 -233 226 238 115 239 -235 -386
2288 -386 -137 261 75 -10 -185 -617 -402 186 -217 76 -178 -516 -424 -143 47 -24 211 -367 -343 105 85 280
2310 280 407 37 -375 -254 362 179 407 257 -148 -57 -63 183 260 318 -59 -384 128 -93 248 371 -40 -499
2332 -499 -289 -52 -142 236 57 -314 -239 -201 71 394 62 -212 -122 -200 -44 286 321 20 -248 -11 160 60
2354 60 496 84 -244 -61 -302 -152 155 -28 -76 -100 25 -188 322 330 -245 -60 -85 -161 322 257 14 50 -110
2377 -110 28 220 461 49 82 -41 -132 -222 26 330 -15 -242 -317 -244 2 80 3 -113 -374 -709 -151 94
2399 94 184 -226 -135 -424 -325 293 450 172 77 82 -243 278 362 189 158 -273 -179 -81 90 171 -97 -184 -358 -74
2423 -74 378 187 97 -205 -367 -403 214 155 -338 103 -224 -198 196 415 77 214 -131 -293 0 262 541 211
2445 211 133 -222 -166 122 46 71 77 -62 -179 24 202 -274 -78 -186 -406 65 138 -104 206 -76 -320 -81
2467 -81 211 54 197 150 -324 -506 711 231 520 -104 -486 332 -405 760 262 655 -446 -816 -350 -322
2487 -322 -361 -51 369 -354 -235 -124 100 228 253 24 -439 -2 -76 65 246 31 -86 -84 34 -129 255 320
2509 320 -201 104 633 397 713 58 -169 -529 918 -590 207 374 -474 -338 -578 -323 -161 119 44 -130
2529 -130 -245 -107 -141 79 86 221 173 -63 -99 476 237 134 139 -22 -80 42 198 257 -87 -228 -177 20 25 -75
2553 -75 121 -241 -274 -289 -16 -75 -46 -125 -217 -125 -88 294 138 78 -138 -199 -611 52 295 -51 -258 -407 -222 115
2577 115 228 -73 -17 -119 -452 16 57 33 94 -72 -240 -335 -13 102 261 -13 -60 -242 59 62 146 -10 328
2600 328 -292 29 7 51 -64 -67 19 -30 152 267 205 66 -22 -122 -112 15 180 -54 -86 -207 -92 239 218 81
2624 81 -337 -265 5 -33 123 248 62 -103 -310 66 70 35 -20 -135 -156 294 -67 267 308 -90 -292 41 127
2647 127 71 36 -51 87 74 -204 14 -179 -21 -140 -433 206 -79 230 289 69 -140 -310 110 167 -228 182
2669 182 72 -222 -44 74 319 -44 95 -233 36 306 -170 104 75 -242 -117 -124 239 81 -11 -369 -143
2690 -143 -41 -177 140 34 -82 -230 90 257 158 241 125 112 -43 209 42 448 252 -90 85 -26 -96
2711 -96 214 230 -43 -190 -177 -224 137 -104 -96 -154 90 -139 -257 224 112 -76 44 180 68 -32 -120 169 162
2734 162 -16 57 233 127 168 28 -374 -230 -136 78 -170 -39 -117 -385 1 -53 117 15 -3 -25 30 -7 -106
2757 -106 16 104 260 -30 159 153 6 45 249 295 236 231 165 373 140 -56 32 -111 200 -91 109 34 -55 -102
2781 -102 17 -55 80 -211 -95 152 121 131 204 56 -282 -90 60 21 86 63 261 21 109 85 114 348 5
2804 5 -28 67 -49 -13 -19 -170 -152 -287 101 -190 100 3 -153 -100 -141 -86 -165 117 -26 -22 -53 218 92 25 -115 -28
2830 -28 -205 212 207 201 -67 -277 174 124 -9 -7 45 74 -54 -8 -60 70 8 -250 -69 -22 65 -51 -146 33 -116
2855 -116 95 197 -171 -109 -76 -68 98 -125 -23 230 59 164 202 16 -104 124 122 86 -19 176 -200 39 163
2878 163 147 141 -12 -79 103 -48 -42 99 -2 20 96 -13 9 40 7 -25 115 -142 39 77 -60 185 21 -5 -75
2903 -75 300 10 47 -301 59 -50 -18 24 -5 -3 -306 -2 228 -81 -212 -95 -263 -133 -26 2 -107 -84 -37
2926 -37 -55 52 135 229 125 1 -16 120 126 -18 -299 -290 -231 -71 107 -72 -190 -61 -259 -72 -45 -115 -71 -129 -303
2951 -303 -50 -3 159 79 -50 366 146 100 41 222 27 268 21 296 48 114 132 65 35 -35 -43 -42 32 -192 68
2976 68 -53 223 133 -183 -138 -76 -163 95 -32 -151 -161 148 -37 -62 310 142 -61 -15 194 16 264 -63 -160
2999 -160 -88 -211 -137 114 -50 -87 -191 -46 -85 -233 180 -276 -12 350 8 -159 140 55 214 -99 192 -173
3021 -173 141 55 60 115 91 24 -1 -24 38 67 -73 -51 -130 -96 -203 109 -57 -41 -260 129 -39 -284 161 -275 -193
3046 -193 -12 -134 23 71 -39 -19 66 155 306 212 170 -93 32 -67 -130 15 -3 -145 111 -29 -64 -54 -13 -97
3070 -97 7 97 -305 -13 5 -133 -151 -50 74 -4 -329 48 -177 -88 124 -110 172 266 90 3 7 275 92
3093 92 -51 9 -19 -106 114 -91 230 -91 -66 -21 -269 147 72 -108 178 -5 -187 -267 136 94 18 136 77 -92
3117 -92 142 250 387 148 135 259 9 -8 144 -54 127 -1 -83 237 110 -146 -51 -270 -76 -33 36 -112
3139 -112 -105 -141 -149 -22 127 132 -5 126 -29 -6 -18 179 198 0 237 -239 100 76 -173 180 -11 -11 -256 -86
3163 -86 166 83 -64 204 -252 47 67 74 4 -53 -181 -252 31 -105 -47 -208 -14 -175 183 260 -314 71 -49
3186 -49 62 68 -112 265 -90 39 -113 146 -63 52 38 -63 69 -189 -113 -61 -130 -8 -74 -111 10 -63 252
3209 252 155 79 -107 32 -91 290 40 -42 115 16 312 -14 216 -76 59 -151 -210 -11 -35 -67 65 -274
3231 -274 -127 85 -15 0 -105 -122 -99 -46 -66 -108 -82 -249 -39 88 -67 209 -100 -195 -38 -58 73 42 247
3254 247 -41 75 -83 -38 121 -211 132 -122 -165 44 73 56 -17 -50 -53 -25 98 -71 401 -191 -49 23 30 129
3278 129 63 10 -264 -84 206 -7 88 400 -181 42 -152 40 172 133 65 12 93 -220 72 183 228 -178 -231
3301 -231 -48 118 63 -1 -8 3 -96 -27 -156 167 134 169 -59 -60 -138 17 71 -248 52 20 183 173 80 -44 68
3326 68 -220 145 104 -55 140 -131 19 -2 -62 34 -165 -264 -82 -108 -30 -101 1 -5 -52 -70 0 196 52 231 -106
3351 -106 78 -165 -98 203 139 -160 55 -128 74 46 52 -71 -176 -87 -164 -157 87 -6 62 22 -83 -70 206 148 35
3376 35 123 -140 -130 72 35 146 136 -83 -111 -172 110 170 368 22 8 124 62 9 -175 17 -310 -90 -80 -109
3400 -109 -104 -130 29 129 261 -117 214 136 -186 -18 39 178 97 101 46 95 -199 90 20 -38 85 144 61 141 -5
3425 -5 87 124 -210 92 -71 -146 84 -57 -240 -328 -203 -152 -42 84 -90 -217 -151 111 -174 226 -78 -101 7
3448 7 116 96 127 345 110 -50 226 165 -2 165 72 4 -294 33 7 277 2 -199 -41 19 -43 136 234 -35
3472 -35 -68 69 0 29 15 -2 109 -162 72 -50 -13 163 140 -80 -23 113 -148 -150 -36 -49 -208 -52 75 -37
3496 -37 14 -293 66 -76 -87 160 113 -169 -110 -31 116 110 75 104 -128 -134 144 135 -4 68 47 -8 108 -173 90 -59
3522 -59 -25 -77 -135 27 150 -136 9 -67 4 42 -80 273 -96 -24 163 -104 187 281 122 140 -147 76 17 -79
3546 -79 -57 -148 -120 -86 -40 118 213 114 -177 -66 32 -15 197 17 -59 -299 -26 115 106 -21 -20 -44 -144 92 110 74
3572 74 106 253 -179 -64 177 163 -107 -232 20 -135 -84 -56 -87 -41 55 -310 -24 -169 50 26 67 -207 -233 -41
3596 -41 111 -92 179 -21 19 130 -117 194 174 206 65 -63 -70 108 291 80 247 44 -68 -66 -5 137 -108
3619 -108 141 -240 -175 -138 5 65 -11 -99 100 166 -168 74 188 -158 -74 -26 436 27 47 87 -107 54 73 140
3643 140 184 -34 -196 -135 78 142 138 14 80 -41 -11 -151 -58 -62 -116 -77 -15 -9 -22 111 -151 -324 330 -107 -26 61
3669 61 -219 -56 168 54 40 -37 -33 -132 58 57 85 -214 -209 -134 -300 -209 -236 66 -120 72 -299 58 -74 -251 254
3694 254 101 -167 -210 -93 114 38 201 -3 -38 118 167 -58 276 181 -104 68 102 204 37 40 -47 -116 -133 -18
3718 -18 23 -16 246 -236 -138 314 298 -60 23 112 46 -6 77 98 2 303 -205 39 -75 167 42 49 105 -87 35
3743 35 100 -10 97 4 -1 4 65 95 -90 -126 -181 -66 215 131 88 -140 -42 -80 30 130 -121 -91 120 47 -57 149
3769 149 56 170 155 177 -18 118 88 -47 -16 -68 -116 -55 -32 70 70 90 -113 -17 -1 -80 -25 131 -143 275 -36
3794 -36 -30 83 154 -47 37 -56 -37 158 128 63 -21 137 38 -51 100 88 30 -89 -41 119 323 -109 77 -217 116
3819 116 40 -130 -132 -87 -42 -259 -107 169 215 -19 -129 -108 -14 -194 162 -111 87 -83 48 278 204 -10 74
3842 74 50 124 41 92 4 -270 9 -122 -257 -139 204 -46 133 -256 202 74 3 -106 79 -19 -40 -210 67
3865 67 -226 77 -174 -48 85 136 -146 204 -86 84 -40 -263 35 -140 -232 -46 15 -272 2 -121 175
3886 175 4 -73 17 115 -9 -38 51 -26 -10 87 136 142 59 -103 67 214 72 120 298 159 -167 42 -109 -147 -96
3911 -96 -96 -99 5 -140 14 -373 -214 58 -77 81 -74 -34 -14 -117 -122 -83 -16 87 -41 -47 103 156 225 381 114
3936 114 -176 -80 13 -71 4 -23 210 -87 123 -131 -85 -211 212 -67 -728 -132 202 270 -343 1027 -148 -80
3958 -80 -22 -377 612 -410 -104 -350 -527 391 462 266 369 19 549 -315 375 163 897 95 14 104 -204
3979 -204 81 346 166 -441 -165 307 -85 -98 100 199 -133 62 -69 493 143 -67 -127 48 308 57 -39
4000 -39 272 161 57 82 411 -379 142 46 97 215 -21 -114 773 824 48 582 190 52 79 60 -75 76 -74
4023 -74 105 -8 0 -19 61 -90 184 -48 53 32 -44 -112 39 -94 148 52 126 26 -198 12 -43 -111 -72 -220
4047 -220 -18 4 146 -135 -101 -146 -78 22 -180 -46 -3 -195 -12 93 109 -4 66 117 -93 -15 -144 158 -163
4070 -163 17 -123 14 -87 -98 -72 -191 -70 26 116 -272 -228 -21 125 22 166 -132 144 -36 -47 127 74
4092 74 -282 -97 -37 -62 -86 92 -4 65 -26 -209 44 51 -88 -89 12 -69 26 -236 13 -32 -103 -48 -53 -46 82 130 99
4119 99 43 -71 176 -56 137 57 -19 56 -118 42 49 -169 -226 35 20 -34 372 -89 -12 -149 -156 -94 20 -107 -52
4144 -52 142 24 66 98 -98 46 99 37 174 -328 -435 578 -265 3 457 414 -5 18 -416 387 254 409
4166 409 115 676 -59 -402 212 -34 -137 -296 24 193 -368 -211 -27 55 115 87 74 -198 148 -29 95
4187 95 -23 250 240 -239 -4 72 -35 188 9 294 -295 -21 170 103 -113 -205 0 -250 137 -193 -126 162
4209 162 35 -124 -226 -303 309 -304 154 90 133 126 490 97 -195 109 650 198 26 -59 -323 -289 -359 349 -1030
4232 -1030 -5 -65 -145 -167 -109 28 -39 217 98 -109 -60 -216 -25 0 -295 -70 -150 49 183 -101 -213 -105
4254 -105 -112 133 -90 88 89 22 -70 -50 5 103 6 187 -247 -94 129 -41 -71 28 -305 -141 -294 67 -175 135
4278 135 -6 287 229 -289 129 108 197 245 154 -915 29 -20 4 -27 146 60 131 4 162 61 225 221 60 -69
4302 -69 -79 -75 -228 158 -115 29 -25 178 158 32 53 -49 -3 -19 -146 228 85 -106 54 -30 58 270 53 -20
4326 -20 100 126 223 136 19 -15 130 5 -125 61 6 8 -13 64 -80 -69 -173 109 18 239 120 -52 53 144
4350 144 -35 -290 2 70 125 -40 -62 -135 -102 70 347 38 57 -43 76 -91 37 -55 42 -75 -36 57 15 -137
4374 -137 253 -219 27 -45 314 131 -56 40 16 -100 44 -186 76 -130 94 -145 42 -105 39 77 101 80
4396 80 -166 7 -23 114 178 -109 -2 -30 -93 36 173 1 14 52 -33 279 314 4 135 0 86 -97 21
4419 21 101 -20 25 163 -108 -23 10 -7 -19 -15 -108 22 -179 -58 20 -4 27 -321 75 34 57 -21 256 -78 -86 59
4445 59 287 -62 -165 286 -12 -107 -218 -39 112 -263 7 -194 -77 39 -96 -186 15 35 -79 -16 -8 -192
4467 -192 -131 56 -159 56 -35 -58 4 -269 -66 42 66 -227 2 -191 -37 52 16 152 114 -113 97 -49 16
4490 16 -168 -2 -95 85 -93 40 9 -232 243 46 27 -40 -222 16 -53 -61 9 5 -45 -117 86 -56 47 76 29
4515 29 8 -117 174 108 -190 20 35 75 113 -95 1 -237 59 -162 -83 111 -36 -37 -28 187 -98 -154 16 46 51
4540 51 -33 140 -41 -170 -1 -46 21 -135 -154 -54 254 -110 122 -115 33 -184 -108 66 77 69 -161 146 112
4563 112 -77 -25 142 -26 -55 83 -24 -2 379 1 -28 244 -35 -68 132 106 38 -38 1 108 252 97 64
4586 64 -70 67 -73 -102 138 115 -18 -237 -127 48 -126 -213 -203 -100 88 103 -92 -37 6 -15 -16 169 76 -8
4610 -8 -20 -152 -52 -67 -40 -133 114 -69 128 -68 21 0 2 9 -214 7 -119 -88 -162 75 -112 142 -37 -156 -5
4635 -5 263 73 -80 -57 71 -109 -116 -65 151 100 114 167 39 23 -96 28 -23 71 147 -68 -77 -201 72 343 -30
4660 -30 -75 -39 15 -202 50 -118 63 -45 114 -188 -59 -69 170 -47 54 90 -7 -209 -341 237 149 57 -72
4683 -72 -46 -50 142 -35 -11 -112 -173 -194 -34 -63 42 2 -241 -236 -96 182 -183 -170 -234 -194 170 52 105 26 -73 -189
4709 -189 -34 240 -48 138 21 165 -184 -210 92 -70 143 -233 -206 -159 57 -137 99 29 14 92 -94 -6
4731 -6 54 29 219 -76 27 23 -154 52 -98 173 -28 -29 -67 160 5 -94 -107 -55 156 6 193 -162 -4 -34
4755 -34 133 2 94 57 108 -291 -26 29 -78 6 -121 104 -175 18 -61 7 -97 130 -168 -224 184 -133 139
4778 139 96 -8 241 -57 166 294 64 -122 37 152 -41 -182 -83 -67 -7 -53 -159 -50 94 -23 -23 33 28
4801 28 219 37 -125 174 -35 76 -131 -90 119 32 145 -148 -18 -47 -78 241 -49 -62 49 -155 -43 -222
4823 -222 -54 12 47 -94 31 226 0 -22 -108 158 -11 82 -36 18 215 -89 220 -76 178 235 248 18 216
4846 216 66 32 -278 -201 -136 -99 -25 -309 -76 -34 -40 -106 112 52 -180 -101 -63 -5 151 216 10 -170 20 149 77
4871 77 118 64 -23 87 -2 181 -33 49 -2 62 -33 59 -220 -158 -270 68 -153 159 24 -76 -82 -154 78 -139 -20
4896 -20 -141 -5 -107 59 21 76 -82 -191 145 101 75 -88 31 8 141 -20 191 -46 -146 231 177 64
4918 64 -255 -9 4 -124 -71 -223 50 -85 -31 -69 -12 -94 -25 229 198 2 -87 45 -14 -138 105 -209 15 -109
4942 -109 16 33 -38 36 -50 20 -46 -16 -12 -74 208 111 177 -37 -142 -254 13 85 143 241 -93 71 -35 -21 93
4967 93 118 -100 103 46 -338 -29 -28 74 191 -251 99 305 106 -216 316 -165 184 -843 -360 -19 123
4988 123 -433 365 -656 -512 -503 161 486 51 -130 390 419 282 -585 -2 203 11 289 -126 47 57 -130
5009 -130 -180 28 -77 170 -167 -51 -43 42 26 61 11 -13 31 2 97 -54 190 51 -57 -23 37 69 182 -160 60
5034 60 -36 17 -147 -206 -25 -145 134 -60 -133 52 115 -102 38 468 255 185 -7 -197 -95 66 124 -185 -59
5057 -59 143 421 -207 108 -143 -56 43 55 133 -671 -438 -43 -446 -50 315 -8 -135 -16 101 43 77 67 109
5080 109 -116 107 110 74 39 -237 -163 5 127 27 120 -55 91 103 -89 43 -99 71 -120 202 -52 -136 -91
5103 -91 -59 -119 -144 -112 128 -11 -3 -9 -12 66 47 3 86 105 -196 -71 -290 128 364 -128 -6 -265 -3 296 -47
5128 -47 91 299 144 282 2 60 113 194 353 121 -18 -772 623 579 222 -377 -68 333 654 611 342 141
5150 141 1168 -1093 -203 224 -682 -423 -845 -18 -112 1 -688 -65 340 516 -47 524 198 230 -86 796
5170 796 124 337 704 924 687 521 373 -167 -347 -281 -32 -257 -119 31 -434 -217 188 -71 121 101 -322
5191 -322 87 -160 67 46 -11 -59 35 203 -62 -23 -52 -273 -8 -10 173 -91 76 -44 28 132 -60 151 116
5214 116 -338 -13 -32 -60 0 77 142 -55 117 8 217 -23 88 11 138 -36 152 -133 -8 10 37 -62 -38
5237 -38 22 180 81 -157 -65 -146 -7 -37 197 -52 -17 -133 20 17 -205 11 48 140 201 97 -95 20 -124 -42
5261 -42 -156 -184 -1 167 153 149 95 -30 226 -100 5 246 -110 -187 -92 -103 -194 88 75 -144 140 -192 -23 111
5285 111 -43 33 150 -63 -129 10 -172 22 235 -64 20 293 -101 70 90 102 81 -100 76 -104 -63 -56 219
5308 219 3 -42 -111 -121 86 33 8 118 -356 11 24 -81 38 -182 29 103 45 -63 17 37 -42 -107 50 14
5332 14 -39 -72 128 -88 -133 121 -90 192 55 -193 79 149 -61 -241 -266 155 236 31 86 -30 -8 151 -318
5355 -318 3 -186 172 -120 -339 249 -148 210 637 -183 214 -551 511 -6 140 348 -352 -421 43 -498
5375 -498 118 200 12 -30 318 -248 -363 177 -745 -111 -380 178 -535 312 230 -156 -276 -18 -345 5 26
5396 26 -74 -168 13 -265 37 65 -105 -46 -10 44 59 -103 34 -222 -8 -144 134 -4 -152 262 74 -28
5418 -28 158 -162 -42 71 154 120 -27 -270 111 -78 6 -246 -57 -12 -91 82 16 -52 -32 -156 -247 -59 -61 35
5442 35 -41 -80 148 -165 -11 -68 14 -102 32 -57 188 -45 -43 -208 -85 43 192 -107 -37 201 -11 215 -191
5465 -191 71 -39 -211 -27 102 -3 -34 3 -37 -113 177 87 24 -168 -101 88 35 -84 85 47 53 -42 -194 69
5489 69 -134 -137 43 -82 14 -75 -5 134 4 -141 -131 189 35 -66 -85 81 -95 -440 154 -20 -395 -478 -421
5512 -421 268 181 -108 -103 93 23 -12 27 41 87 105 -66 -308 -32 31 78 12 -246 -199 -49 -26 20 -57 188 -73
5537 -73 -17 119 -50 240 28 -91 143 28 -139 23 -84 167 55 171 -8 120 185 179 165 79 138 -32 20
5560 20 3 -218 32 105 56 26 -35 15 -73 -148 174 -63 2 184 4 10 -37 -34 37 47 -102 94 52 -206 50 32
5586 32 -139 -136 237 98 32 99 -91 -18 98 73 -40 114 -19 -234 29 -94 -61 23 -32 -278 48 -39 -101 125
5610 125 66 -161 -41 -50 -22 -263 123 66 -70 -107 -117 188 -134 24 196 65 -9 56 -65 15 -2 -119 -25 -30 275
5635 275 -15 271 -61 -222 243 -17 -351 233 -65 229 700 -301 -112 95 -711 -1216 562 -602 413
5654 413 -127 -121 768 163 -546 -354 -103 -110 -277 415 542 7 -216 -346 554 -973 253 -9 -87 83 18
5675 18 -65 55 221 164 -199 -326 315 -159 -206 -322 438 -360 -70 113 -160 139 255 219 488 267 -596 693
5697 693 -18 -305 -207 -157 18 668 211 -659 -390 -236 -809 -607 -237 -29 -709 -596 -96 -129 63 103 177 -226
5719 -226 526 -213 73 -96 -82 -111 -181 89 -206 -95 -105 -99 149 114 156 119 74 -29 -23 -116 22 156 -87 167
5743 167 -103 27 97 -51 118 -138 134 -129 199 4 71 -13 -90 -279 51 40 -143 8 39 -82 -87 -184 -317
5766 -317 -209 51 -134 243 88 78 -21 -233 -232 -167 158 -835 -407 243 -214 463 64 536 -91 17 -157 94
5788 94 147 352 -245 -744 -399 69 -72 176 197 -241 -648 106 770 86 -121 -452 -302 -323 -267 -422 -575 384
5810 384 -136 -44 272 -8 -6 193 37 -254 -37 11 92 -4 11 94 -353 2 -40 -36 76 -4 17 -37 25 -184 -90
5835 -90 192 146 120 -96 -108 -40 9 62 -93 -77 141 29 -43 13 -38 24 -216 -16 -85 -120 13 -155 95 -68 -145
5860 -145 201 115 -73 -60 100 -1 -122 -61 -66 -157 140 -162 36 164 69 43 93 -110 70 -59 77 -31 -157
5883 -157 98 47 63 -101 149 55 -26 -42 -102 23 135 84 -28 17 58 -201 -8 -253 -108 -182 -158 -220 -308 197
5907 197 -201 -169 268 479 -436 217 338 -93 -196 116 145 -57 44 -182 53 -184 57 -103 310 162 -126
5928 -126 149 -455 26 -42 -67 45 -179 -137 321 -87 -572 -391 -478 -486 271 167 362 335 183 -30 338 510
5950 510 36 500 184 -110 38 49 61 -133 68 -72 49 84 77 -39 -155 219 13 15 54 -14 53 21 113 99
5974 99 -50 60 -130 -14 8 184 184 93 39 -133 -12 -4 123 32 46 -50 73 9 -149 -201 -23 115 -28 116
5998 116 -52 -81 -246 -10 -263 -130 26 153 -100 116 79 -89 27 137 150 -173 -101 -21 -107 136 127 154 5
6021 5 109 93 69 122 -36 50 -49 34 -68 144 52 -161 34 133 -18 -35 -35 379 53 -21 69 68 -25 -108 -207 -54 223
6048 223 -41 -102 -129 110 20 114 133 122 59 -104 -203 71 -54 -117 -21 101 -99 -34 -139 130 42 -93 -114 118
6072 118 -148 -60 152 6 257 115 -108 -50 66 -7 -5 -13 -25 -144 54 47 62 -96 -24 -55 -16 -2 1 105 29 169
6098 169 73 -70 -44 -99 252 238 -131 -55 64 65 -39 185 4 -22 84 165 125 32 -57 -267 -83 -60 -173 62
6122 62 -102 -94 129 -110 39 -71 202 -133 21 -268 81 120 -22 9 73 -179 131 -44 25 108 120 8 -134
6145 -134 -229 -17 -182 -29 9 -84 -201 25 -102 -1 78 43 -64 212 -97 39 118 162 -247 24 239 -83
6167 -83 -187 -46 -63 -162 -158 75 109 60 126 -5 90 0 -12 41 2 -60 -59 47 151 42 167 20 141 -25 -90 54
6193 54 112 -17 93 46 81 -241 55 93 116 -174 187 -27 209 -142 68 -44 44 12 -235 59 60 293 -75
6216 -75 85 -59 89 106 131 -33 8 54 177 119 -78 -53 -105 32 -83 -68 62 -52 9 -223 -87 -333 -548
6239 -548 372 -93 754 29 664 174 -29 278 -231 -402 206 289 345 239 25 130 -688 645 398 102
6259 102 766 -225 113 516 -687 104 -29 314 -245 -68 -62 342 722 -162 -887 325 60 -41 -238 -383
6279 -383 -13 -315 297 162 26 -392 329 46 -542 226 -303 50 -208 -119 48 129 -459 -39 404 66 343
6300 343 142 -93 102 -265 -381 108 8 -253 -404 21 120 385 97 119 98 -85 -166 -73 24 -183 323 59
6322 59 105 68 47 -37 -21 24 88 103 126 -2 -25 158 -29 -39 -69 25 98 204 -17 -79 20 -107 -59 109 -69 180
6348 180 -51 279 -30 -130 202 87 46 -40 12 -164 -111 -59 44 163 68 0 -204 55 66 -101 -208 -329 -39
6371 -39 -320 273 -363 223 212 -638 220 -218 -64 80 -399 33 -186 -185 244 438 47 26 -90 -173 -238 214
6393 214 15 265 -191 -77 36 21 -305 -1073 -4 -22 263 -659 -115 -25 90 -211 31 -274 -372 93 -128
6414 -128 -273 -96 57 39 -120 99 -207 66 -119 162 -132 -110 -135 224 245 194 -57 -15 211 -782 -62 306
6436 306 16 522 -71 373 337 437 -389 -188 262 196 614 -349 259 -774 1248 510 -83 -191 81 -336
6456 -336 -332 -415 -191 -106 -170 -387 -63 51 134 152 -250 -58 75 95 72 -250 -105 -54 -95 -29 -43 172 -27 335
6480 335 -107 169 63 -43 33 107 78 117 31 82 -42 -235 -25 83 -23 -180 280 -192 -162 -163 -214 -247 -35 -137
6504 -137 175 321 -291 -591 260 256 115 508 37 49 100 -88 259 244 262 49 114 -160 343 -223 447 -268
6526 -268 -57 77 478 -128 495 77 -797 -394 -805 276 -252 -362 60 21 334 574 -251 91 55 -56
6546 -56 337 -126 -106 305 -96 74 -113 129 -69 -49 -32 -12 117 75 86 151 -85 78 201 134 87 -49 132
6569 132 112 -208 75 -80 -20 185 0 -27 63 -108 -23 109 94 -21 -71 220 83 -294 -97 114 -80 43
6591 43 -149 -168 17 102 -165 -209 -83 49 -58 26 -2 257 -92 37 -27 -185 36 -230 56 117 39 -74 -43
6614 -43 194 -68 -84 -103 -82 -207 -68 53 106 -220 33 -230 -130 -134 4 -112 44 -42 298 96 -86 49 -286
6637 -286 -34 -5 0 -177 186 16 -133 -17 56 130 142 80 45 82 -44 -94 -233 4 13 -62 95 -141 -11 -196
6661 -196 -88 -74 -72 57 110 -296 -67 -34 -57 -27 41 43 269 -113 -165 59 -117 20 -178 81 -87 -102 -3 59 88
6686 88 91 87 -147 91 316 -152 -70 62 -112 52 63 -13 -144 -42 71 -31 -318 32 37 -28 -78 -25 -8 -32 121
6711 121 -215 76 57 -164 -360 63 19 -82 103 111 -16 117 11 79 129 -102 -24 104 80 118 -56 -154 129
6734 129 132 153 -47 -153 -412 -183 18 -192 81 -2 70 62 -32 98 50 63 23 -173 -29 116 -16 -190 79 -147
6758 -147 -195 -120 55 -87 77 51 19 -32 88 1 -204 22 -37 -186 49 27 36 132 -64 -5 52 -74 65 -68
6782 -68 286 75 -157 31 -150 -228 112 -64 97 -14 54 368 -105 -198 83 -332 -34 62 -81 77 61 39
6804 39 -3 -103 -22 -3 136 -195 -37 -183 79 -110 127 -201 -87 -144 -47 83 3 18 -11 261 70 -151 135
6827 135 148 -41 -166 -32 -52 -108 -193 -145 -76 -38 -55 119 218 -136 -125 20 -91 83 -55 255 26 -130 -65 -178
6851 -178 -287 82 29 -21 265 94 -8 101 59 -103 64 -64 -115 -4 24 78 -61 -68 21 -72 117 119 -94 -62
6875 -62 -294 -15 -74 -116 -32 70 -136 -32 98 -159 126 112 190 177 -119 49 146 -17 -67 99 -7 -62 118
6898 118 88 53 14 97 23 -170 286 42 -239 -72 156 87 162 -176 -98 -13 83 207 -61 -72 181 49 87 351
6922 351 117 103 -103 -30 62 -7 176 -60 -36 -109 -241 49 -125 -212 -8 110 -35 89 90 166 -65 -1 -27 -37
6946 -37 490 167 -3 -83 -109 91 111 -21 -428 -88 -202 82 -254 -139 -306 121 392 -91 -117 -14 -146 -103
6968 -103 -489 -471 6 -42 -87 -37 273 -351 72 -115 -278 -119 280 -6 -232 -40 381 340 105 -332 131 0
6990 0 -11 -806 -182 20 -173 -330 17 -119 440 295 -544 -268 -126 65 121 -142 14 -259 -242 232 -29 -258
7012 -258 -205 -35 73 371 28 -82 -96 -10 -167 465 -564 -491 -18 -200 565 -663 -92 581 60 122 250
7033 250 -21 0 -291 192 -253 -74 -76 129 -130 -20 77 312 -55 23 21 -68 105 -116 -149 172 63 14 34 70
7057 70 -205 6 169 95 58 -169 -85 141 2 185 -49 -43 34 -175 60 49 149 94 -160 10 126 -67 225
7080 225 -237 89 83 -57 14 -326 102 0 88 36 -129 -59 -6 -56 55 126 164 -258 -156 -60 -53 19 9 36 -22 -183
7106 -183 -21 -60 135 -23 33 -71 -99 -74 52 7 -6 -202 57 -35 80 43 -52 13 33 84 49 -28 -167 -107 -99 -56
7132 -56 7 -97 -44 36 -33 73 -24 302 19 -100 2 103 164 -38 143 90 87 197 -79 121 0 -191 184
7155 184 208 -66 -160 -132 -86 -146 -22 -45 32 -78 -68 -47 -14 60 204 88 41 -148 21 34 72 93 -36 104 -311
7180 -311 -134 -33 20 13 37 44 196 -152 -14 81 -11 -121 49 127 53 -37 113 30 215 -40 41 86 -31 79 9
7205 9 -179 -4 65 -55 99 -2 -99 -174 -161 -44 -74 -278 -183 308 160 -235 -68 -9 -12 -127 -99 -2 -34 205 -127
7230 -127 -163 -166 -134 61 -122 109 -43 84 120 -133 55 82 -39 -209 133 68 82 29 21 119 -28 110 -69 -36
7254 -36 174 187 -164 -17 69 -70 -79 167 -115 141 121 -98 -98 78 -105 -15 -127 53 41 168 -12 105 44 -87
7278 -87 153 -60 111 -150 59 113 11 -259 -134 149 -209 -140 107 163 196 31 -94 130 82 89 74 13 21 -96
7302 -96 -12 -195 138 -128 -8 -79 -154 -129 44 57 -25 178 -66 -118 -74 167 -160 -106 180 -69 -226 61 163
7325 163 74 123 47 119 156 209 -58 -182 125 -97 117 168 148 -96 -95 27 194 -201 284 -46 -7 56 -46 -118
7349 -118 -109 13 15 -119 2 123 -310 -35 -54 -78 114 160 398 -142 4 155 -172 53 24 61 -91 99 45
7372 45 -77 47 -53 -132 -36 60 -122 112 -126 -16 84 -49 99 -2 4 -140 -91 -131 82 -22 -43 -228 83
7395 83 151 -73 118 -68 -41 -217 -136 54 -97 -11 39 -190 56 285 26 -2 -35 -274 -230 114 -6 -30 -271
7418 -271 169 151 77 -35 -77 0 38 -47 -44 -17 154 44 -10 131 25 -28 200 -40 37 24 0 253 250 -44 -113 -90
7444 -90 64 -84 -101 60 6 30 -148 -6 209 -23 -25 163 -83 -48 97 -132 -122 96 112 27 113 -102 19 110
7468 110 -137 52 -63 88 114 136 14 23 84 169 164 113 107 -94 4 12 146 106 -114 64 6 -6 -20 -46 2 -134 -84
7495 -84 64 -227 -175 94 129 15 78 161 -100 76 -78 151 -268 172 216 -137 1 -468 -70 217 -261 -121
7517 -121 304 -72 -14 110 -132 44 -90 -29 -208 58 -193 -65 -145 -91 189 -59 -10 -37 -180 117 51 104 -22
7540 -22 -171 14 287 8 -63 13 -423 -185 -186 67 -77 56 -39 -148 -23 -95 88 -193 -289 26 92 126 31 -59
7564 -59 93 -180 158 144 192 311 -54 17 -137 -53 -184 38 89 -63 -5 -221 136 34 -242 -9 -22 25 122
7587 122 -411 -140 -88 100 -140 381 -106 -144 121 58 164 -323 -43 111 -11 81 80 127 -93 22 86 126 -78
7610 -78 -52 18 55 12 -125 -93 60 -75 -99 -18 -8 4 -60 -49 64 69 -198 -32 -16 -14 -120 -155 -2 54 -123 118
7636 118 -117 -11 -56 -43 -118 -1 126 4 18 57 -21 -156 99 107 -81 187 -245 133 132 -359 183 -82 -241
7659 -241 -9 -158 -81 191 71 -48 -47 87 19 214 -14 107 -146 155 -140 -39 81 111 86 182 167 -86 -98
7682 -98 -133 -178 84 59 -245 138 -198 -31 -35 -222 -20 28 -2 -6 0 220 52 90 162 -45 125 -43 -70 153 85
7707 85 -206 -96 -221 32 -5 250 -66 34 -102 121 45 173 104 -110 -85 -196 99 -95 -30 -212 122 -10
7729 -10 -143 -47 -106 -52 49 -299 -269 18 -106 -172 -133 110 -62 280 -146 -121 192 -120 -47 -40 -60 115 18 -42 -11
7754 -11 85 -57 -25 -13 -24 18 -53 -31 92 -152 -51 11 83 -75 22 -100 -140 95 -233 -27 28 24 -56 -97 -11 -93
7780 -93 -98 286 -32 -155 -76 127 17 -29 -8 -334 -97 78 165 -117 25 73 -189 -169 220 -9 79 -112 93
7803 93 -124 16 -161 135 29 -106 88 116 33 21 -234 27 -88 54 -47 -154 -62 -76 99 -86 -89 77 144
7826 144 31 -132 -204 -73 48 46 -146 153 -102 72 1 -57 31 23 -69 240 50 116 -89 70 -187 -165 -40 25
7850 25 59 -3 151 -77 -25 53 180 -342 -473 -372 -323 -72 -352 -259 96 86 38 -161 75 141 234 313 -149 -162
7874 -162 -119 459 266 189 169 -92 644 -320 296 191 229 209 409 503 86 1082 140 -70 120 -167 -6 193
7896 193 -134 -138 -58 387 121 469 -150 80 167 -448 -48 94 135 -144 28 -781 -183 -136 268 180 -240 -85
7918 -85 -179 51 -2 -132 65 -47 14 -102 -157 -99 128 104 -408 110 -236 272 573 -413 -388 -398 47 -232 -300
7941 -300 -86 251 -33 18 389 158 12 -114 518 121 -111 -188 -583 247 242 -142 53 -26 -260 -374 -53 -160
7963 -160 -306 -104 37 513 -487 636 -63 276 -34 681 -423 -357 119 231 477 -343 -238 259 -114
7982 -114 -656 -94 -135 254 -525 464 -350 -253 -263 471 59 75 59 39 -24 -583 -259 -153 -27 205 62 -466
8004 -466 -35 -161 -170 -5 215 -40 -204 -278 -31 174 -146 258 181 -276 175 -19 -364 128 -69 -27 -116 297
8026 297 243 36 -537 -124 386 398 23 -488 -322 -283 -32 -344 -128 265 -220 33 -438 192 495 -306 -285
8047 -285 -226 253 600 -176 287 -56 -264 149 -72 85 15 38 -29 64 21 -14 -29 -295 -2 126 -81 78 80
8070 80 -68 94 178 10 -23 145 31 57 -201 -5 182 19 -102 20 30 -51 -128 -84 -23 -71 75 -36 170
8093 170 95 19 -153 60 -40 189 39 96 -179 -55 -51 73 37 61 -83 11 -80 -243 108 -175 77 38 208
8116 208 -27 -81 -193 -47 45 -61 70 141 125 38 28 26 -20 -127 -283 -42 -59 -33 48 159 219 28 -26 -136 -96
8141 -96 61 99 -85 -35 36 64 -138 185 72 -82 -141 264 99 -206 47 -243 63 -131 90 -104 62 47
8163 47 -117 78 57 -32 195 -167 99 67 115 113 -137 -62 28 -87 87 -169 15 10 186 -40 31 -28 -152 145
8187 145 -4 -135 94 -78
8191g8
##END NTUPLES=NMR FID
##END=
