##TITLE=1H_Ser 6-5-k-2
 CDCl3
 8 sc, 
 26.09.2022
##JCAMPDX= 6.0         $$ Bruker NMR JCAMP-DX V2.0
##DATA TYPE= NMR FID
##DATA CLASS= NTUPLES
##ORIGIN= UXNMR, Bruker Analytische Messtechnik GmbH
##OWNER= root
$$ XWIN-NMR		Version 3.5
$$ Mon Sep 26 15:33:34 2022 Russian Standard Time (UT+4h)  she@DPX200
##.OBSERVE FREQUENCY= 200.1313499994
##.OBSERVE NUCLEUS= ^1H
##.DELAY= (6, 6)
##.ACQUISITION MODE= SIMULTANEOUS
##.ACQUISITION SCHEME= undefined
##.AVERAGES= 8
##.DIGITISER RES= 18
##SPECTROMETER/DATA SYSTEM= spect
##.PULSE SEQUENCE= zg30
##.SOLVENT NAME= CDCl3
##.SHIFT REFERENCE= (INTERNAL, CDCl3, 0, 15.7039)
##AUDIT TRAIL= $$ (NUMBER, WHEN, WHO, WHERE, WHAT)
$$ ##TITLE= Audit trail, XWIN-NMR		Version 3.5
$$ ##JCAMPDX= 5.01
$$ ##ORIGIN= Bruker BioSpin GmbH
$$ ##OWNER= she
$$ F:/spectra/data/she/nmr/H-F/1/audita.txt
$$ ##AUDIT TRAIL=  $$ (NUMBER, WHEN, WHO, WHERE, WHAT)
(   1,<2022-09-26 15:32:26.76 +0400>,<she>,<DPX200>,
      <created by zg, POWCHK disabled, PULCHK disabled
       configuration hash MD5:
       00 E9 B6 7A A2 85 ED C7 34 08 36 98 17 FE 4E 26
       data hash MD5: 16K
       6F 3C 88 FE FB 5B 27 E1 D2 16 73 FC 1D 2C 06 CE>)
$$ ##END=
$$ 
$$ hash MD5
$$ E8 9F 8A 7F CC AF B1 D6 83 A1 0E C3 FB 77 CE 83
##$RELAX= 
##$RELAX= 
##$RELAX= 
##$RELAX= 
##$RELAX= 
##$RELAX= 
$$ Bruker specific parameters
$$ --------------------------
##$DU= <F:/spectra>
##$EXPNO= 1
##$NAME= <H-F>
##$PROCNO= 1
##$TYPE= <nmr>
##$USER= <she>
##$AMP= (0..31)
100 100 100 100 100 100 100 100 100 100 100 100 100 100 100 100 100 100 
100 100 100 100 100 100 100 100 100 100 100 100 100 100 
##$AQSEQ= 0
##$AQ_mod= 1
##$AUNM= <au_zg>
##$AUTOPOS= <>
##$BF1= 200.13
##$BF2= 200.13
##$BF3= 200.13
##$BF4= 200.13
##$BF5= 200.13
##$BF6= 200.13
##$BF7= 200.13
##$BF8= 200.13
##$BYTORDA= 1
##$CFDGTYP= 0
##$CFRGTYP= 5
##$CHEMSTR= <none>
##$CNST= (0..31)
1 1 145 1 1 1 1 1 1 1 1 1 1 1 1 1 1 1 1 1 1 1 1 1 1 1 1 1 1 1 1 1 
##$CPDPRG= <>
##$CPDPRG1= <>
##$CPDPRG2= <>
##$CPDPRG3= <>
##$CPDPRG4= <mlev>
##$CPDPRG5= <mlev>
##$CPDPRG6= <mlev>
##$CPDPRG7= <mlev>
##$CPDPRG8= <mlev>
##$CPDPRGB= <>
##$CPDPRGT= <>
##$D= (0..31)
0 1.2 0 0 0 0 0 0 0 0.06 0 0.03 0 0 0 0 0.0002 0 0 0 0 0 0 0 0 0 0 0 0 
0 0 0 
##$DATE= 1664191946
##$DBL= (0..7)
120 120 120 120 120 120 120 120 
##$DBP= (0..7)
150 150 150 150 150 150 150 150 
##$DBP07= 0
##$DBPNAM0= <>
##$DBPNAM1= <>
##$DBPNAM2= <>
##$DBPNAM3= <>
##$DBPNAM4= <>
##$DBPNAM5= <>
##$DBPNAM6= <>
##$DBPNAM7= <>
##$DBPOAL= (0..7)
0.5 0.5 0.5 0.5 0.5 0.5 0.5 0.5 
##$DBPOFFS= (0..7)
0 0 0 0 0 0 0 0 
##$DE= 6
##$DECBNUC= <off>
##$DECIM= 32
##$DECNUC= <off>
##$DECSTAT= 4
##$DIGMOD= 1
##$DIGTYP= 9
##$DL= (0..7)
0 120 120 120 120 120 120 120 
##$DP= (0..7)
150 150 150 150 150 150 150 150 
##$DP07= 0
##$DPNAME0= <>
##$DPNAME1= <>
##$DPNAME2= <>
##$DPNAME3= <>
##$DPNAME4= <>
##$DPNAME5= <>
##$DPNAME6= <>
##$DPNAME7= <>
##$DPOAL= (0..7)
0.5 0.5 0.5 0.5 0.5 0.5 0.5 0.5 
##$DPOFFS= (0..7)
0 0 0 0 0 0 0 0 
##$DQDMODE= 0
##$DR= 18
##$DS= 0
##$DSLIST= <SSSSSSSSSSSSSSS>
$$ [...]
##$SUBNAM2= <"">
##$SUBNAM3= <"">
##$SUBNAM4= <"">
##$SUBNAM5= <"">
##$SUBNAM6= <"">
##$SUBNAM7= <"">
##$SUBNAM8= <"">
##$SUBNAM9= <"">
##$SW= 18.0517283424941
##$SWIBOX= (0..15)
0 0 2 0 0 0 0 0 0 0 0 0 0 0 0 0 
##$SW_h= 3612.71676300578
##$TD= 16384
##$TD0= 1
##$TE= 0
##$TE2= 300
##$TE3= 300
##$TEG= 300
##$TL= (0..7)
0 120 120 120 120 120 120 120 
##$TP= (0..7)
150 150 150 150 150 150 150 150 
##$TP07= 0
##$TPNAME0= <>
##$TPNAME1= <>
##$TPNAME2= <>
##$TPNAME3= <>
##$TPNAME4= <>
##$TPNAME5= <>
##$TPNAME6= <>
##$TPNAME7= <>
##$TPOAL= (0..7)
0.5 0.5 0.5 0.5 0.5 0.5 0.5 0.5 
##$TPOFFS= (0..7)
0 0 0 0 0 0 0 0 
##$TUNHIN= 0
##$TUNHOUT= 0
##$TUNXOUT= 0
##$USERA1= <user>
##$USERA2= <user>
##$USERA3= <user>
##$USERA4= <user>
##$USERA5= <user>
##$V9= 5
##$VALIST= <valist>
##$VCLIST= <CCCCCCCCCCCCCCC>
##$VD= 0
##$VDLIST= <DDDDDDDDDDDDDDD>
##$VPLIST= <PPPPPPPPPPPPPPP>
##$VTLIST= <TTTTTTTTTTTTTTT>
##$WBST= 1024
##$WBSW= 4
##$XGAIN= (0..3)
0 0 0 0 
##$XL= 0
##$YL= 0
##$YMAX_a= 474841
##$YMIN_a= -1003320
##$ZGOPTNS= <>
##$ZL1= 120
##$ZL2= 120
##$ZL3= 120
##$ZL4= 120
##$ABSF1= 10
##$ABSF2= 0
##$ABSG= 5
##$ABSL= 3
##$ALPHA= 0
##$AQORDER= 0
##$ASSFAC= 0
##$ASSFACI= 0
##$ASSFACX= 0
##$ASSWID= 0
##$AUNMP= <proc_1d>
##$AZFE= 0.1
##$AZFW= 0.1
##$BCFW= 1
##$BC_mod= 2
##$BYTORDP= 1
##$COROFFS= 0
##$CY= 11.3945322036743
##$DATMOD= 1
##$DC= 2
##$DFILT= <>
##$DTYPP= 0
##$F1P= 2.36226072786647
##$F2P= -0.459571619588291
##$FCOR= 0.5
##$FTSIZE= 0
##$FT_mod= 4
##$GAMMA= 1
##$GB= 0.15
##$INTBC= 1
##$INTSCL= 1
##$ISEN= 128
##$LB= 0.24
##$LEV0= 0
##$LPBIN= 0
##$MAXI= 10000
##$MC2= 0
##$MEAN= 0
##$ME_mod= 0
##$MI= 1.114404
##$NCOEF= 0
##$NC_proc= 0
##$NLEV= 6
##$NOISF1= 3.799351
##$NOISF2= 2.8
##$NSP= 1
##$NTH_PI= 0
##$NZP= 0
##$OFFSET= 15.70392
##$PC= 1
##$PHC0= -18039.97
##$PHC1= 22.60069
##$PH_mod= 1
##$PKNL= yes
##$PPARMOD= 0
##$PSCAL= 0
##$PSIGN= 0
##$REVERSE= no
##$SF= 200.130013532006
##$SI= 16384
##$SIGF1= 3
##$SIGF2= 2
##$SINO= 400
##$SIOLD= 16384
##$SREGLST= <1H.CDCl3>
##$SSB= 0
##$STSI= 0
##$STSR= 0
##$SW_p= 3612.71676300578
##$SYMM= 0
##$S_DEV= 0
##$TDeff= 0
##$TDoff= 0
##$TI= <>
##$TILT= no
##$TM1= 0
##$TM2= 0
##$TOPLEV= 0
##$USERP1= <user>
##$USERP2= <user>
##$USERP3= <user>
##$USERP4= <user>
##$USERP5= <user>
##$WDW= 1
##$XDIM= 8192
##$YMAX_p= 0
##$YMIN_p= 0
$$ End of Bruker specific parameters
$$ ---------------------------------
##NTUPLES= NMR FID
##VAR_NAME=  TIME,          FID/REAL,        FID/IMAG
##SYMBOL=    X,             R,               I
##VAR_TYPE=  INDEPENDENT,   DEPENDENT,       DEPENDENT
##VAR_FORM=  AFFN,          ASDF,            ASDF
##VAR_DIM=   8192,          8192,            8192
##UNITS=     SECONDS,       ARBITRARY UNITS, ARBITRARY UNITS
##FACTOR=    0.0002768,     1,               1
##FIRST=     0,             0,               0
##LAST=      2.2672688,     0,               0
##MIN=       0,             -1003320,        0
##MAX=       2.2672688,     474841,          0
$$ Real data points
##PAGE= N=1
##DATA TABLE= (X++(R..R)), XYDATA
0@%%%%%%qJ6j6J6k4L2m0N6o4Q0j04J28j60J92k24K66l22L84m48N22o10P09q21
29d40R44j080J232j405J594j802K034k287K566k872L207l573L974m413M892n414
45b843N982o604P289q038Q852r750J0744j1841J3059j4419J5944j7672J9648k1928
59a1577K4598k7771L1617l6396M2520n0690O2206p9782J10223j77624N87517j80485
71B94356p42198P76950O5163k43148J54427k3806o29724J01589M83432o3579k65103
82i1641J61019q997j35958J03113J54855q5869n2967m5421k1639R8793M9179j49404
94b4937L6859J55918r4565q1875K40310L8143k61371M172J87673r1851r9992P0932
106G9416o6403q9476J39530N829j99667P1723K57580k7744j91931o2465N1313
$$ plain form
0 0 0 0 0 0 0 0 -8 8 -8 8 -16 16 -24 32 -32 48 -56 72 -88 104 -120 146 -176 208 -240 282 -328 381 -440
29 -440 504 -576 656 -749 845 -957 1077 -1210 1356 -1516 1691 -1882 2092 -2321 2571 -2843
45 -2843 3139 -3465 3824 -4214 4638 -5112 5632 -6209 6850 -7569 8375 -9297 10351 -11577
59 -11577 13021 -14750 16867 -19529 22991 -27699 34507 -45275 64948 -112676 474841 294356
71 294356 -447842 329108 394271 151123 305550 281744 -347980 -246391 237041 173462 -91641
82 -91641 69378 60381 -75577 27536 182391 96522 43555 -1866 -23505 75288 124467 -24937
94 -24937 11922 167840 73275 -8600 231710 269853 8482 12654 200327 108476 8484 79416
106 79416 13013 -76463 63067 68896 -130771 -59048 198532 170788 -21143 -83608 -32295
117c2295J26267Q8842j12334j49006k0603m096O1090J88135O343k26773n4581
128a29011J36732M5628N2576R1979j48263k21757J06219K01065o6088j13383L9509
139d794j411o0441O8757J06935m7520j17396p500J05930N2244j14336j13108O9465
151f3175P3887o4985q423O3921n4554k5688J38446J0491j35041P8893J39837j37666
163A5943j17025J40107M8206j24469K062O1540m9591j0154N2816l7869l2674P2812
175B1704K0823o7479k4136O294k214L5315K7126l4905l9236r835K6557Q2240L5423
188G7677q9472m7597Q5175K5879p1749J3272M7981n2972l1686M3414k5515m0117
200f5710P7575M3628r2684l9011P8421K7371m4371r671K0917J268k5263k5690
$$ plain form
117 -32295 93972 182814 70480 -78526 -99129 -103225 -42135 146000 152343 -74430 -129011
128 -129011 7721 53349 105925 197904 49641 -172116 -65897 135168 69080 -44303 -4794
139 -4794 -6205 -66646 2111 109046 61526 -55870 -63370 42560 94804 -19532 -132640 -63175
151 -63175 10712 -54273 -62696 1225 -53329 -79017 59429 69920 -65121 13772 153609 15943
163 15943 -101082 39025 87231 -37238 -35176 26364 -23227 -33381 19435 -18434 -51108 21704
175 21704 42527 -24952 -49088 -42794 -45008 -9693 17433 -17472 -56708 -66543 -39986 42254 77677
188 77677 -11795 -59392 25783 51662 -20087 -6815 41166 -11806 -43492 -78 -25593 -65710
200 -65710 11865 55493 -37191 -76202 2219 29590 -14781 -24452 -3535 -2267 -27530 -53220
212e3220K6182M5460k6522l7582L3729P163m6139L9851P4807n9216q6578M3046
224c9019N3881k1460Q970J2331p1174l4260Q8460O3830m5125n4541j1864N772
236d4199L0096M3427L553m4518n9476j9208O6883Q1074j8904q3599l8074J9844
248f3101N2859O1948p642q6921l7493M9441L5232Q698J6793l4376o7595J6774
260e5383O9486N288k7892J521j3197k9440K1539M2814l640k1790n973j0506q272
273c5445J5847K9155J2407k5934m2733N0L9883J6697m816J0218j9212o4205L199
286f4889R3739L7999o1921n5337o652J6030N2231N4445l1154r1737k9737O0303
298b6680O9810J5404m5541o1554j5869L8469N5331K8618l6801p7101j8093O3858
$$ plain form
212 -53220 -27038 18422 -8100 -45682 -11953 -4790 -50929 -11078 63729 4513 -82065 -39019
224 -39019 14862 -6598 2372 14703 -56471 -90731 -2271 61559 16434 -38107 -49971 -44199
236 -44199 -14103 29324 32877 -11641 -71117 -90325 -23442 57632 38728 -44871 -82945 -63101
248 -63101 -10242 51706 44064 -42857 -80350 -30909 4323 13021 29814 -4562 -72157 -55383
260 -55383 14103 19391 -8501 -6980 -20177 -49617 -28078 14736 11096 -10694 -16667 -27173 -35445
273 -35445 -19598 9557 21964 -3970 -46703 -46653 -6770 9927 5111 15329 -3883 -68088 -64889
286 -64889 28850 66849 4928 -50409 -57061 -41031 11200 65645 34491 -57246 -86983 -26680
298 -26680 43130 58534 12993 -48561 -64430 -25961 29370 57988 21187 -55914 -74007 -10149
310a0149N1181j1502k9778k6183k0445K0272N2581J3866l5336l3360n438K1608
322a2683L1552L049k3482r969L583n103N863K3520O51j8988j785q35j2109J1619
336e117L0637j04l0727k1158N596K3737K2527k026k3293k0517p015J8478M2192
349C3210R219m8498l2497K3722K8704Q317N727j4685l8603m889M1456K6211j2624
362B4770k5480j8358N318K7704J4482r373j4625j5030l488K4212J8264j9554j9019
375a0177R346L345o186J1954P424j3971l967Q657k21o81L909m464L05R413p360
390G326j4986J2613J4863j0188j215R705j2904j1229J8880J4000r376j0220r138
403a869o317J1304J3121l982n297p862j7789J0924L5889j261k6136L430L715j4466
$$ plain form
310 -10149 41032 29530 -248 -26431 -46876 -26604 25977 39843 4507 -28853 -34291 -12683
322 -12683 18869 21918 -1564 -11533 -7950 -13053 -7190 16330 16981 -2007 -3792 -4627 -16736 -5117
336 -5117 25520 25416 -5311 -26469 -20873 2864 25391 23365 72 -20445 -27460 -8982 33210
349 33210 42429 -6069 -38566 -14844 13860 22177 27904 13219 -25384 -30273 11183 37394 24770
362 24770 -710 -19068 -13750 13954 28436 19063 4438 -10592 -14080 10132 28396 8842 -10177
375 -10177 -831 2514 -3672 8282 15706 1735 -2232 6425 6204 5523 9432 4968 5273 14686 7326
390 7326 -7660 4953 19816 9628 8413 18118 5214 -6015 12865 26865 17489 7269 -1869
403 -1869 -8186 3118 16239 12257 6960 -902 -18691 -7767 28122 26861 725 4155 7870 -6596
417f596J5661L1139j5245l2881K646J5669P677J1002l655j8166k809M827L411
430A2680J7352M28l5170j0558K7360J688j4730J6802L544l1957K371L6109K241
443B8160j0488P883j1123k0268J2181J9995M147L32j8794l1570J3245M0654L557
456C7911p436R22l5290k7451M6639M6554k0830l3014j8276k0138K1151N5987O591
469E3320m0249k5942r651J6587N4255J4303n4112l0354J3178O456K2142K9311
481D9244l5141n3207K2374M4150o74r73l185l4253k475M2589O376k0448k057k1676
495i356k5140L4940L2141k8555j4767J2489k4287j0071M8157J5354l2404p047
507h546o939k7110K0853M5934n763k2789r253k4873M681O2233K2184m1127j9290
$$ plain form
417 -6596 9065 40204 24959 -7922 -5276 10393 18070 29072 25417 7251 4442 9269 12680
430 12680 30032 30460 -4710 -15268 12092 13780 -950 15852 19396 -12561 -10190 25919 28160
443 28160 17672 25555 14432 -5836 6345 26340 30487 30819 12025 -19545 -6300 34354 37911
456 37911 30475 31397 -3893 -31344 15295 61849 41019 8005 -10271 -30409 -9258 46729 53320
469 53320 13071 -12871 -22522 -5935 48320 62623 8511 -21843 -8665 -2209 19933 49244
481 49244 14103 -39104 -16730 27420 26746 25773 22588 -11665 -14140 28449 34825 14377 12320 -9356
495 -9356 -34496 444 32585 4030 -10737 1752 -22535 -32606 15551 30905 -1499 -8546
507 -8546 -15485 -42595 -21742 24192 18429 -4360 -13613 -38486 -33805 28428 50612 9485 -9805
520i805r905k3512L3458N6895k7404o0522n561J0412J1017L7798N268m8283j5532
533d5676K4763R573J4412J1167m1285k7737M2061K4265k3648j071K241k7841J3907
546b4869N1462p553l9492l89L266m693K4983J2341k7240j3796j07j0334K0822
559a5599L5630j6295k5722J3357p358k0772L8001L2748l7767k5207J2659j2123
571b8448j198L9918O385k9941j173J293j1936K7413L1277k3693j8804J0452j7864
584a6319n400M4589N074m5452K245K5455j7724j235L0178j2997k5862K0111Q803
597A1466k3632K932R192j5296J0020K1661k0233j4217K2498J077j0212K3874P598
610B6728k9083M76J5100j5276J219K4691j1847k1210J0637q74j1621K0867J1833
$$ plain form
520 -9805 -19710 -43222 -9764 47131 19727 -40795 -46356 -35944 -24927 12871 18139 -30144 -45676
533 -45676 -20913 -11340 3072 14239 -27046 -54783 -12722 11543 -12105 -13176 -10935 -38776 -24869
546 -24869 26593 19040 -20452 -20841 -17575 -22268 2715 15056 -12184 -25980 -26087 -36421 -15599
559 -15599 20031 3736 -21986 -8629 -15987 -36759 1242 33990 -3777 -28984 -16325 -28448
571 -28448 -29646 10272 16657 -13284 -14457 -13164 -25100 2313 33590 9897 -8907 1545 -16319
584 -16319 -21719 22870 27944 -17508 -15263 10192 -7532 -8767 21411 8414 -17448 2663 11466
597 11466 -12166 -9234 -42 -15338 -5318 16343 -3890 -18107 4391 5468 -4744 19130 26728
610 26728 -2355 -1879 13221 -2055 -836 23855 12008 -9202 1435 561 -11060 9807 21640
623B1640k2662M76J2163k3830q405L3440N514k0711M377l429k4869J3058L7064
636B3826J795j5712j1055j8574L356L6723J2546k3147j3050j0103j1321K6604
648A888L2543j9490k9460O139N255r13J9980O417k8576j1518J6251M215r76L352
662E107j1793q366J3584N201n769P861j063k0025M459K3799l871j2911P451l322
676C42j6203R585J9922k319p819l730j1827k224J8744J3123l516j1136k0591j2490
690c0139K4244L1751n636k2292j4730j2421J0051M1294J6123l4745l3660L343
702b6817K2291K3790J0064k2365l0727p94K1088K1111P874k0258k8542K700K4827
715D242J1303k340p217j7598r359J9375K0180o914j5149n877k563N801J2451M572
$$ plain form
623 21640 -1022 -546 11617 -12213 -20618 12822 18336 -2375 2002 -1427 -26296 -13238 23826
636 23826 25621 9909 -1146 -19720 -16364 20359 32905 9758 -3292 -13395 -24716 1888
648 1888 34431 14941 -14519 -8380 -3125 -4038 15942 22359 -6217 -17735 -1484 2731 1755 5107
662 5107 -6686 -15052 -1468 3733 -2036 5825 4762 -15263 -10804 12995 9124 -3787 3664 342
676 342 -15861 -6276 13646 11327 3508 -222 -12049 -14273 4471 17594 14078 2942 -17649 -30139
690 -30139 -5895 25856 20220 -2072 -16802 -29223 -19172 22122 38245 3500 -30160 -26817
702 -26817 -4526 19264 29328 6963 -23764 -24558 -3470 17641 25515 5257 -23285 -20585 4242
715 4242 15545 13205 5988 -11610 -20969 -1594 18586 11672 -3477 -9354 -11917 -6116 6335 10907
729A0907q779r379l785K409J0006P450k814n503m044p135P53J5849J1478q611
743H802j5981q846M084J6070J5763m424k0377j5305M789K0438J7897n946k5913
756h949j5733R049K0683J2363l764j9680j7874P027K7147J2972j3217j9156o681
769a5813P100J3345J0625m514j8499j0985J0244J6716M378q978q995M01L623K908
783A556N484J446r337p427O010N775m605l42O107k998p920K206N975J022o25J177
799C504k978o363j337P167Q047k610j0477l568O995N095K475L274l977j1645l59
814f757J3783N738q313p164j414j88L591O146j62n974l774J135N404M103k919
829C235l645J257j826l224L766M706l685l169L582P58l712K646N752N58l697m860
$$ plain form
729 10907 2128 -7251 -11036 -8627 1379 8829 6015 512 -3532 -10667 -9914 5935 17413 8802
743 8802 -7179 -16025 -11941 4129 19892 15468 -4909 -20214 -15425 5013 22910 16964 -8949
756 -8949 -24682 -15633 5050 17413 13649 -6031 -23905 -16878 10269 23241 10024 -9132 -15813
769 -15813 -8713 4632 15257 10743 -7756 -18741 -8497 8219 12597 3619 -5376 -4975 -1352 1556
783 1556 7040 8486 -851 -8278 -2268 3507 -1098 -1440 4667 1669 -6251 -4045 1930 2952 2327 3504
799 3504 526 -5837 -7174 -7 8040 5430 -5047 -8615 -1620 3475 5950 9224 5247 -6398 -6757
814 -6757 7026 12764 4451 -2713 -4127 -4315 -724 5422 5260 -714 -4488 -3353 2051 6154 3235
829 3235 -410 847 -979 -4203 -437 4269 584 -2585 997 1755 -1957 689 6441 6999 3302 -1558
845a558k128L140L976J259j893n587o176J886J1521O600p235r848k861L694Q370
860C160P215m245j3072q578N353J3288P824n468j3005o777N366J1979R698k784
874I954j5421j1962O684J5524O754p164j2424p465K457J2227J0547k316j3900
887f505j0102N400J2687N307l867p850p366k182P450R832K264q471q993nN830
902f571N378N295J050q995j2135J817J3635N291k485m586q899p156Q587J7025
916G251M835j2418j5618l408J1486J4810K227r338j3370r903R103K4088N883j9825
930d197j5278L382R591J2761R884j1431k3419k347J9029J4062N67j1307j6562
943a5265l141J4855J2909K542o914j6310q247J5528J6037m323p198k092q912j645
$$ plain form
845 -1558 -3686 -546 3430 4689 2796 -2791 -8967 -7081 4440 11040 3805 -6043 -8904 -5210 3160
860 3160 10375 6130 -6942 -15520 -10167 3121 10945 5477 -7528 -14305 -8939 3040 12738 9954
874 9954 -5467 -17429 -10745 4779 11533 4369 -8055 -15520 -13063 -836 9711 7395 -6505
887 -6505 -16607 -11207 1480 6787 2920 -4930 -12296 -14478 -7028 2804 5068 -3403 -12396 -12401 -6571
902 -6571 -1193 4102 5152 -3843 -15978 -14161 -526 4765 2280 -2306 -11205 -18361 -9774 7251
916 7251 12086 -332 -15950 -19358 -7872 6938 9165 -173 -13543 -23446 -14343 9745 15628 -4197
930 -4197 -19475 -16093 -6502 6259 16143 4712 -18707 -21054 -2025 12037 12604 1297 -15265
943 -15265 -18406 -3551 9358 11900 4986 -11324 -19571 -4043 11994 7671 473 -1619 -10531 -12176
957a2176J5869O845p690k292j608p665M757J2508K22l398o34j0016n227J5145
971D640Q823q315l025k672r833P586J8511l153j4176j457M36K008J3827K137j7987
986b650n696R671K097N932P337j6872j6348J5391J6252m626k012l515j6413J724
1000i728K3368M089j1661m295o628m809J5830J1004j0506l754J196r884K091J7093
1014A3406k855j2137P427N25j5321L911J3995m356l066O287q705r899J1147P981
1028H340l063L932m182j5917M510J6409m291n727P177p725j0608J3885R297j3421
1042a384j876Q692o156l092R405n223q759Q857M004p080M722mj3635M979J6188
1057I638n523p833P853n485j2515J2238J2747j0637l038N644r761m272J3181K551
$$ plain form
957 -12176 3693 10538 2848 556 -1052 -8717 -3960 8548 8770 5372 4738 -5278 -10505 4640
971 4640 13463 5148 2123 -549 -10382 -2796 15715 12562 -1614 -3071 -2635 -627 13200 15337 -2650
986 -2650 -8346 1325 3422 9354 16691 -181 -16529 -1138 15114 10488 8476 4961 -11452 -9728
1000 -9728 13640 17729 6068 1773 -4855 -9664 6166 17170 6664 2910 4106 -5778 -3687 13406
1014 13406 10551 -1586 5841 6366 -8955 -5044 8951 4595 1529 7816 -889 -10788 359 8340
1028 8340 5277 9209 5027 -10890 -6380 10029 5738 11 7188 -537 -11145 2740 12037 -1384
1042 -1384 -3260 5432 -724 -3816 5589 366 -8393 464 4468 -2612 2110 2106 -11529 -6550 9638
1057 9638 4115 -3718 4135 -1350 -13865 -1627 11120 483 -2555 3089 -6672 -10944 2237 4788
1071D788l906N131n137j4178N835J2010k362L145L771j9057j1046J8808J0293
1084H095n016L586m924k0291L387K1814L126o020q46j2654q196J8499J2154r840
1098B874l528j244r433P190J7579o794j4324M380K885k638R717J530j7509j742
1112a1057J3532N20l04M657j2030j1499J3913J1568o218K93l86j5141j350J9129
1126E627N215p484K41o491j0684Q702J4295o0k720l681j3822j369J7583O532o089
1141E795k56q385j4532J0757K0563l193j0493k100p674k420J7333R813j2051r839
1155f682j83M43J0224R764r632j2239L423M287M218R164n418j8059K14J6149L683
1170I356l069j893j0203p259J2973J2095m395p027n356o123O140J3380k91p511
$$ plain form
1071 4788 882 6013 876 -13302 -7467 4543 2181 5326 9097 -9960 -21006 -2198 8095
1084 8095 3079 6665 1741 -18550 -15163 6651 9777 3757 2911 -9743 -17939 560 12714 2874
1098 2874 -654 -1898 -11331 -4141 13438 6644 -7680 -3300 -415 -3053 6664 8194 -9315 -11057
1112 -11057 2475 2995 2691 7348 -4682 -16181 -2268 9300 3082 3375 2989 -12152 -13502 5627
1126 5627 10842 3358 3599 -2892 -13576 -4874 9421 9361 6641 2960 -10862 -12231 5352 11884 5795
1141 5795 5539 -2846 -17378 -6621 13942 10749 256 -1844 -9518 -11938 5395 15208 3157 -6682
1155 -6682 -6865 -6422 3802 13566 3934 -8305 -4882 -595 3623 12787 7369 -10690 -10476 5673 9356
1170 9356 6287 4394 -5809 -13068 -95 12000 7605 578 -4778 -10901 -4761 8619 8328 817
1184H17k261m128k603J0837Q086p135m521J003m792p8J0496L506o892k969j817
1199b451k754N889P577l411m672j560m538J833J0963J351j0066k503J785m44N426
1214B425O159o890q934L084N894J702J545l808p422J238P733K140p44k463n926
1229d267r75Q598M509n287l119m56j963K235N189j391m234p64k93j22K983M13
1245A056k331L69J522l184j057M141O94j829J631p14m408P82N022K261j860k942
1261h47l080O72M258K498q58k600n470j400O780N011m123m336p67m96J651N617
1277B510J625o036m790J419M406K452l32k613k436r19J796M312K515m370m336
1292d797J292J978K93J940J947m250m529K048L627J732rj496l392k045J591M621
$$ plain form
1184 817 -1444 -5572 -8175 2662 10748 3613 -908 95 -4697 -4775 5721 9227 2335 -634 -2451
1199 -2451 -5205 684 8261 4850 178 -1382 -5920 -4087 6876 8227 -1839 -4342 -2557 -3001 2425
1214 2425 8584 1694 -7240 -4156 1738 3440 4985 1177 -6245 -5007 2726 4866 4122 1659 -4267
1229 -4267 -5242 3356 7865 2578 -541 -997 -2960 -725 4464 3073 -1161 -1925 -2218 -2340 643 1056
1245 1056 -1275 -906 616 -2568 -3625 516 1210 -619 1012 298 -4110 -3328 1694 3955 2095 -847
1261 -847 -3927 -3255 1003 3501 2643 43 -5427 -6827 -47 4964 841 -3495 -4262 -4758 -3107 2510
1277 2510 4135 -1901 -6691 -5272 -866 1586 1254 -1359 -3795 -4714 -2918 1394 3909 -461 -4797
1292 -4797 -3505 -1527 -1234 706 2653 -1597 -6126 -4078 -451 1281 1272 -224 -3616 -5661 -4070 551
1308E51L885l232o316k215L550L971L288k96n858o310K473Q286M203j517o313
1323a850n619J479P406O265j151p726p028J153R118P030k875p832m961K58O880
1338E47P610m39q537o510J400P085N824k79o647n222N30N109N602J562m552o683
1354c600j54N224L832J030j267m681l592K404N800J957j914l514l370j01L733
1369A787M356Q42l529n983k039N150O831p2m146m044l402K009Q232M957o290p682
1385c023j833M190O624L978l603q374l596M250P082M607m396r022k931N610N135
1400D698J887o44o580o924M598Q287j73m005k164k509m46N239L086k334k484j760
1416b228p04L283K532k323j424J674k561k325N190K065m514j46J808l383l26N900
$$ plain form
1308 551 4436 1204 -5112 -7327 -3777 194 3482 3186 -2672 -8982 -6509 1777 5980 4463 -1850
1323 -1850 -7469 -5990 1416 7681 6530 -1196 -8224 -7071 2047 9077 6202 -1630 -6591 -6333 547
1338 547 8157 7718 -819 -7329 -5929 1156 6980 6701 54 -5168 -4638 471 6073 7635 3083 -3600
1354 -3600 -3754 1470 5302 6332 5065 384 -3208 -804 4996 6953 5039 1525 -1845 -1946 1787
1369 1787 6143 6985 3456 -2527 -4566 584 7415 7343 3197 -847 -4249 -2240 5992 10949 4659 -3023
1385 -3023 -4856 -666 5958 9936 6333 -2041 -5637 -1387 5695 10302 5906 -3116 -6047 -437 4698
1400 4698 6585 5941 -639 -7563 -2965 5322 5149 1144 -1020 -3529 -3975 1264 4350 2016 -468 -2228
1416 -2228 -2932 351 2883 560 -864 810 -1751 -4076 1114 3179 -1335 -1481 327 -3056 -3382 2518
1432B518M1n045o59K60q30L989K438m598l064J197k70K707N598l814p964J912
1448e584M573k13K490J968p633l780O365L026j266J653k452n527K391M783j335
1463e41k61K048m182l331N180J181l815L670J743o215r17M886r95n09M806k713
1479C5n988K825L475k202L334K302p994j851Q072l53l285L452j165o274M435N990
1495D808m722k520K029k831K82P922j839p945J362K209j988O502M255j0608n265
1510h349O888J611m19P007k347j1818N72Q286L06K024K829q554o255O607L611
1525A999r70N312k782j1391J104Q657j229k5N520p037r116P385N988l739K207
1540A883J450q764j187Q842K33l128L130l942n491P993N215p645j013L212m585
$$ plain form
1432 2518 2559 -2486 -3145 -2885 -3715 274 2712 -1886 -4950 -3753 -4023 -1316 4282 468 -7496 -5584
1448 -5584 -1011 -1224 1266 3234 -4399 -8179 -1814 1212 -54 1599 -853 -6380 -3989 794 -541
1463 -541 -802 1246 -2936 -6267 -1087 94 -3721 -51 1692 -4523 -5440 -554 -1549 -2058 2748 35
1479 35 -5953 -3128 347 -1855 1479 3781 -4213 -6064 2008 1655 -1630 1822 657 -5617 -1182 4808
1495 4808 86 -2434 -405 -3236 -2954 4968 3129 -4816 -3454 -1245 -3233 3269 7524 -3084 -8349
1510 -8349 -1461 150 -269 6738 4391 -7427 -6855 1431 1737 3761 6590 -1964 -8219 -1612 1999
1525 1999 1029 6341 3559 -7832 -6728 1929 700 675 6195 -842 -9958 -2573 3415 -324 1883
1540 1883 3333 -5431 -6618 2224 2457 -671 2459 -1483 -6974 1019 6234 -1411 -2424 788 -3797
1555c797J228J0143l768j1211K414M522p21N549K896j1955o210P838M286J447
1569B661M703p291j2236L957J0276P49J629K07j1514n286J1597N822l187J389
1583C476k930r631L005J0241q99k927K398n880n145Q202M165n469J298J677p087
1598e506K06Q190j712m715L667r39m436N060M079o850j039M659k478O81O484m287
1614A064q074M262M749k251L483J505j0115l762R240M154j895J265m687q538M890
1629d710R043j040j122j531p760r76J0030K852m769P68j063o651L805Q228l028
1644B076l684L137k182m219N095K693l819J291J975m967n7M567j827j703M794
1659C170k420n517M453L245n160M11M056l815j566N267o42m963K629K021k075
$$ plain form
1555 -3797 -2569 7574 3806 -7405 -4991 -469 -1190 4359 7255 -4700 -10910 -3072 1214 2661
1569 2661 7364 73 -12163 -8206 2070 2819 4448 4655 -6859 -12145 -548 5274 2087 3476
1583 3476 546 -9085 -6080 4161 3262 335 2733 -3147 -8292 -90 4075 -1394 -96 1581 -5506
1598 -5506 -5300 2890 1178 -3537 130 -809 -5245 -185 3894 -2956 -3995 664 -1814 -1133 5351 1064
1614 1064 -7010 -2748 2001 -250 3233 4738 -5377 -9139 101 4255 2360 3625 -1062 -9600 -4710
1629 -4710 4333 3293 2171 640 -7120 -8096 1934 4786 17 785 -278 -6929 -3124 5104 2076
1644 2076 -1608 1529 -653 -4872 223 2916 -903 388 2363 -2604 -2661 1906 79 -1624 3170
1659 3170 750 -4767 -314 2931 -2229 -1818 2238 -1577 -3143 2124 1482 -3481 -852 1169 -906
1674i06K268J656n255j503M932J81p99K937l031n563L770M926k116k31J547m822
1690b009k225N469J918k830J057m24m356J270M226j452r8K390l283l362L728K412
1706B431j789J628M74n436m56N032R42j004J264k946l507L751L982j768j198j62
1722A238l911J021N552j22m241m05L95j157L740K975l621l898J333J097J827K903
1738D726k350m776K81K997J133J961L46m882k619M276K595m86M27j751m626N88
1754b160M455J022m26j414k756r39K671K819k88k25k635l370K276M482qk180o82
1771F42k252j229M282L686j766l505j492R5K348L671l07l910k576o04K697M494
1787D274J2m367l078P28K064K689J922l228n327J82L950K507K86k029l580j129
$$ plain form
1674 -906 1362 3018 -2237 -3740 1192 1373 574 3511 480 -5083 -1313 3613 1497 1266 2813 -2009
1690 -2009 -4234 1235 3153 323 1380 956 -3400 -2130 2096 644 546 2936 -347 -3709 19 2431
1706 2431 642 2270 2744 -2692 -3148 1884 2826 1822 3086 140 -3367 384 4366 2598 1400 1238
1722 1238 -2673 -1652 3900 3778 -463 -868 -473 -1630 2110 5085 1464 -2434 -1101 -4 1823 4726
1738 4726 2376 -2400 -2119 878 2011 3972 4318 -564 -3183 1093 3688 3202 3629 1878 -2748 -2160
1754 -2160 2295 3317 2891 1477 -1279 -2218 453 3272 2984 2759 124 -3246 -970 3512 3504 1324 642
1771 642 -1610 -2839 1443 5129 3363 -142 -1634 -1539 809 4480 4173 263 -2313 -2917 -220 4274
1787 4274 4286 -81 -3159 -2431 -367 2322 4244 1016 -4311 -4129 -179 2328 2614 585 -2995 -4124
1803d124K924L338J094j935l496j387K502L100K23j744k025j836M75L476J374
1818A959j707j772r88m51J787K273p8k175k067m44J278K392N84j766j710p75Q11
1835b849K103K359j317k879j386J345K069K036r03k887j726P46K218K097P0k830
1851a734k571Q97K523J545k79j904k427j59K973J839p91j496j378J25J092J923
1867A78K00j184j386k95J294J746m55j239K1n0n52P30J439k13j149p6L11n47P28
1886d99J022o72q23p67j12J002J328n05p62k95j057O36K811P10k624j125J101
1903f31j19R55K129r62k803l44J590J064R07o15j640j005J179K51M79J409j807
1920C7k068J117J373p40N84J061k208j450J969J001p32R01l53k199Q16J759l09
$$ plain form
1803 -4124 -1200 2138 3232 1297 -2199 -3586 -1084 2016 2239 495 -1530 -3366 -2891 585 1959
1818 1959 252 -1520 -2508 -2959 -1172 1101 1023 -1152 -3219 -3663 -2385 7 591 -1175 -2885 -3660 -2849
1835 -2849 -746 1613 296 -2583 -3969 -2624 -555 1481 578 -2309 -4035 -3289 -1071 1026 1096 -1734
1851 -1734 -4305 -3408 -885 660 381 -1523 -3950 -4109 -1136 703 -88 -1584 -2962 -2837 -1745 178
1867 178 378 -806 -2192 -2487 -1193 553 98 -1141 -1120 -1170 -1722 -992 447 234 -915 -991 -680 -1227 -499
1886 -499 523 -149 -972 -1739 -1851 -849 479 -26 -788 -1083 -2140 -1504 1307 2017 -607 -1732 -631
1903 -631 -750 205 2334 1372 -1431 -1775 -185 879 1786 1171 -469 -1474 -295 -44 435 1844 37
1920 37 -2031 -914 459 -281 303 1364 -844 -2294 -325 676 -56 845 492 -1707 -891 868 559
1937E59L72L53k668o33K980Q01j477J83r21k303J478L783r74k491l35j302Q8M129
1955A622J438l677j972P2J58K750L497k969m155K11J513Q85L101M58n233j673
1971c974K713J435J018J477k558l702J461K463l47J309M74m354j071M002O11j647
1987f90J241r21k714J583L137j550q28P92k214k47M026K77k856O44o01j776L471
2004G74L276l413l149J774o10M36M344K19n649j637K258N78K715K578m231m640
2020d377K045J880P07L438o82o290q95M463O38N95K040l436m298L233L409j768
2036G02N80P36l491n98L768k12j779J576p02k301K242J962l405l65K955k039p24
2053a095L400j023l543J715J486j641J781K240l807k007K631J89k34L329r64n369
$$ plain form
1937 559 931 1284 -1384 -2017 963 1764 287 470 -451 -2754 -1276 2507 1533 -958 -1293 -2595 -2507 1622
1955 1622 3060 -617 -2589 -2517 -2359 391 3888 919 -3236 -3025 -1512 -627 2474 2932 -2301 -3974
1971 -3974 -1261 174 1192 2669 111 -3591 -2130 333 -14 1295 1769 -2585 -3656 346 957 -690
1987 -690 551 -370 -3084 -1501 1636 86 -742 50 -2164 -2411 1615 1892 -964 -320 -921 -2697 774
2004 774 4050 637 -2512 -738 -1348 -912 3432 3651 -1998 -3635 -1377 -799 1916 4494 263 -4377
2020 -4377 -2332 -452 255 3693 3011 -3279 -4174 289 927 1522 3562 126 -4172 -939 2470 702
2036 702 1282 2018 -1473 -2071 1697 1485 -294 1282 580 -1721 521 2483 -922 -1287 1668 -371 -1095
2053 -1095 2305 1282 -2261 -546 940 -701 1080 3320 -487 -2494 137 326 92 3421 2457 -2912
2069b912R94K712k9J245K282m225l966L051K283p32K090n52n061J00L739k33l3
2086G53K039k964l476L356J806k039J273J490l275o20L109r65j324L249m38l511
2102a537J582J329k366R91K936k635j296K450j251k047K804Q83l097J037K032
2117A815k456j327K836k59j209K442j23l556O86J680j127J702K139l402k200K291
2133f8R29p54K831q4m747m33L262o50L34K268k429l391J672J606n52J765N03l725
2151a663j078K758r2k89K837j878l434J915K331j374N50J446k565j660K729R11
2167A444j703J179j63k472R27K527j977j002J313j560j00L288n3l695O43J402
2183bj231J283K231k535k709J506R04O00J979n52l639m07K331N49P31J512l262
$$ plain form
2069 -2912 -1918 794 765 2010 4292 67 -3899 -848 1435 703 2793 2241 -2820 -2720 1019 786 753
2086 753 2792 -172 -3648 -292 1514 -525 748 2238 -1037 -1657 1452 487 -837 2412 1974 -1537
2102 -1537 45 1374 -992 -1 2935 300 -996 1454 203 -1844 960 1843 -1254 -217 1815
2117 1815 -641 -1968 868 609 -600 1842 1719 -1837 -1151 529 -598 1104 3243 -159 -2359 -68
2133 -68 861 107 2938 2854 -1893 -2326 936 286 620 2888 459 -2932 -1260 346 -206 1559 2062 -1663
2151 -1663 -2741 17 -75 -364 2473 595 -2839 -924 1407 33 583 2029 -536 -2196 533 1444
2167 1444 -259 920 757 -1715 -788 1739 -238 -1240 73 -1487 -1587 1701 1648 -2047 -1404 -2
2183 -2 -1233 50 2281 -254 -2963 -1457 -553 47 2026 1474 -2165 -2572 -241 308 1039 2551 -711
2200g11k740J882K080k42J248p16l620K1K927Q68m10J66j976j878K221J700p45
2217G5j36j92j944K09K679L02j761K12Rr79J488J884j627j398J99j03O85K027
2235A629o72j899l50M63L42J267J139k188k066J133R76L28J047r07k331l51K182
2252b58J015L70k12j799q50J404J330L35lj447j620Q81K168k0r90m02n92n41J657
2271D26J074p07p87o27mN26Q40K38j024m54k35O03Q83K67q78k56K98m53L38J290
2291A358p1j605k23N93J27R12K80p41j156M99L44M23M61p86j049L47M69M14L32
2310I28l54o67o29Q36K90J21J26m78j72k32Q62M10m25k52l60jM16L57j37m09m0
2331A90k62l1O61K40m67k15m18k8K1O30j7j34m83k45L54N26J19k08n54k33j76
$$ plain form
2200 -711 -3451 -1569 511 269 1517 801 -2819 -2798 129 997 587 753 -1223 -3101 -880 820 75
2217 75 -61 -253 -2197 -1988 691 993 -768 -556 -547 -1526 -38 1846 219 -1179 -980 -1083 -398 1629
2235 1629 957 -942 -1292 -829 -487 780 1919 -269 -2335 -1202 -226 102 1149 242 -2089 -2440 -258
2252 -258 757 1127 915 -884 -1734 -330 1000 1335 1332 -115 -1735 -854 1314 1294 304 -98 -690 -1231 426
2271 426 1500 793 6 -621 -625 -99 741 979 -45 -499 -734 -131 752 1019 141 -115 183 -270 68 1358
2291 1358 1287 -318 -541 52 179 1091 1371 630 -526 -27 317 740 1201 415 -634 -287 182 596 928
2310 928 574 -93 -722 114 404 525 651 173 1 -231 631 1041 616 364 4 3 419 776 639 230 190
2331 190 -72 -103 558 798 331 116 -302 -330 -309 321 304 170 -313 -558 -204 322 441 233 -321 -554 -730
2352g30O05J020k64j260j88L11N99N59J04p70o16l72J025P60j58r26n53j2O11
2371b55M54K71l19j375j0P78Q74j13n5r14o43O06R57M10k95r93j58L2J103M65
2391H20k31o00q63k15J093R19k17o48o95l63M29J302M32j118q82m82Q06Q94Q35
2410A216p39j109l38R8J020J134n76j436k55O73M31R64L26j352j184O64Q42M07
2428G86K39n42j629O04J125K52J44o23r71n55J284J226q02l82n17o15M26J599
2446A049N4j169j28o88L60J315O89j284n78r1J37P36J083o09j332q6M9M80J324
2465A311K17j446j270N07L46Q15P85p53j489K18O91j39J172J76j676p63J147K76
2483A25k7O55n57j012N74Q02j16n53P38q82m02J413k13j017M99j87o00O63J220
$$ plain form
2352 -730 -125 895 631 -629 -817 -506 93 652 756 -14 -630 -1002 23 783 625 -301 -854 -866 -255
2371 -255 199 470 151 -1224 -1234 -456 418 305 250 -664 -1307 -701 256 666 371 -622 -780 -748 355 820
2391 820 589 -11 -874 -1089 4 923 706 58 -637 -1000 -571 731 1163 45 -837 -1319 -513 381 1216
2410 1216 477 -632 -970 -872 148 1282 706 -730 -985 -312 119 1083 1409 57 -1127 -463 379 786
2428 786 1025 483 -1146 -542 583 835 979 356 -615 -1170 114 1340 538 156 -361 -976 -550 1049
2446 1049 1103 -66 -194 -882 -522 793 1482 198 -380 -471 -334 402 1485 876 -456 -542 -493 -13 1311
2465 1311 1528 82 -1188 -681 -335 480 1265 512 -977 -759 -68 -207 965 1141 -535 -1298 -151 125
2483 125 98 753 196 -816 -242 560 444 -109 629 -253 -655 758 545 -472 27 -160 -760 -97 1123
2502A123j145q77N86J5l87J366L79j844j12N90m20O66J184q32j054J98L08j76
2520d32J473M7j588l16R43o78J49J680p31j609N96L08n16Q65J219j418q73O87
2538a94m12O5J537m65j207N1Q90o73R3J489j047q05J178k92j063J257L43j280
2556e35M91R94j413m09J064n76j23R46J35j440N85M92q86P50J053j190q33N36
2574c59R5n70J690N50k071j55P11q07Q69J599p90j531J81L40n32J861P62k062
2592b19p42O60k60K97J665p65j983N83O13o13J063R96j849n25J337j28n37J410
2610A003l31j758Q15J498j113l01P90p75p34J573J62j405L70L33q07O87J454j745
2628b84m96O14m71KJ784L34k079j8O29r05J072J498j078j541M16N00k93J534L26
$$ plain form
2502 1123 -22 -899 -313 -298 -685 681 1060 -784 -896 -306 -726 -60 1124 292 -762 -564 -256 -432
2520 -432 1041 1088 -500 -816 127 -551 -402 1278 547 -1062 -466 -158 -674 191 1410 -8 -881 -194
2538 -194 -606 -541 996 531 -676 -625 265 -408 -315 1174 127 -678 500 208 -855 402 745 -535
2556 -535 -44 950 -463 -872 192 -384 -507 439 574 -866 -281 211 -675 75 1128 -62 -895 -359
2574 -359 -264 -834 856 1406 -665 -820 -109 -916 -47 1552 762 -769 -588 -248 -780 1081 1843 -219
2592 -219 -961 -301 -561 -264 1401 636 -1347 -764 -151 -764 299 1295 -554 -1079 258 130 -407 1003
2610 1003 672 -1086 -271 1227 114 -187 603 -172 -906 667 829 -576 -206 127 -680 7 1461 -284
2628 -284 -780 -166 -637 -635 1149 1483 -596 -614 15 -890 182 1680 602 -939 -523 -23 -316 1218 1544
2647A544k056k63O55k43Q59J378j090j993Q67Q36l50M64N04j497n34J388N0o67
2665a48O74n07q44J017P77r65k08N71n87q8J445l99j430O43N38p29P80O65r50
2684B55p84O05k63J14J381m45j528J93O82k76M99Q32j206j002Q07J52k01Q89K2
2703G26j240j53R76j60J55L64m41j031O75P46p66P32N1j073l32J557n84n90O11
2722B23m00l94N57N02q38K28L16o56J24R47n75m52M45Q3m30O11L7n72k03M14j68
2743b01k14N88K09p88Q5L34l40K71L91k99k35q0m1J28O81k99p37P5L48l14N62
2764A24K16l50p15L80L58j55K81j65k87k55N04L2K39M6m74k21L38L67j12lj97
2785d9n78J50O93J94l22J09m99j06M61p4K05l22j82r4L71L28Lj18j22o07L97J90
$$ plain form
2647 1544 -512 -775 -120 -363 496 1874 784 -1209 -342 494 144 608 1112 -385 -919 469 519 -148
2665 -148 526 19 -825 192 969 4 -204 367 -220 -308 1137 738 -692 -49 489 -240 540 1205 255
2684 255 -529 76 -187 -73 1308 863 -665 -472 210 -66 433 1265 59 -943 -136 16 -185 704 726
2703 726 -514 -667 309 149 304 668 227 -804 -129 617 -149 583 634 -439 -771 786 202 -388 223
2722 223 -177 -571 -14 488 -350 -122 194 -462 -338 609 34 -418 27 110 -320 291 328 -244 -447 -33 -201
2743 -201 -415 173 382 -406 -321 13 -327 -56 335 36 -199 -279 -320 -192 489 190 -547 -472 -124 -438 124
2764 124 340 -10 -725 -345 13 -142 139 -26 -313 -568 -64 -32 207 253 -221 -442 -104 263 151 148 -49
2785 -49 -627 -477 216 410 88 197 -302 -408 53 -21 184 -138 -320 -414 -43 285 288 170 48 -559 -162 28
2807B8M13J1n10m27L05K53L57R5m61l82j81L57M71J52l87m33J29Q5M27J30m27
2828Eo27K22K37N27K66o53j5l30N01K43N1j0n07l40K51M60J8J75l03n73L37J48
2850H3M51l05k16m26L20Q9M12J65m44n25QK40K29M59n49l63m0M35J96K68j03n85
2872b01l60L86L97p0L7q3k22l84M71L94q2l46j39j6J88l0L58r6o86l7M82M42L
2895D06m12l49R5l9O32J76k25n52j06j0N48L73m96j81N5l45P24O8m99j8j29K85
2917Aj16L76m1l36j36K45k7l5M77k64n07K87N7r9K66K33o68O9M35k17M62j27j87
2940A48m49L03K51Jl01J96m36N0O25j57l9k90Rj56L45J60k06k92M18k29l07L99
2962D3K33k53j00o3k17K48N58n4l46j8m0l09N55K05m83o9j23O0r6M91J46m74N9
$$ plain form
2807 28 441 452 -58 -485 -180 73 430 525 64 -318 -499 -142 329 481 94 -339 -210 -125 302 432 5
2828 5 -622 -400 -163 364 630 -23 -38 -368 133 376 427 417 -90 -430 -179 281 299 474 171 -402 -65 83
2850 83 534 229 13 -413 -93 -4 408 573 129 -396 -388 -148 81 540 -9 -372 -412 23 219 487 384 -201
2872 -201 -561 -175 222 152 189 106 -116 -500 -29 365 283 -63 -202 -218 -30 -60 298 202 -484 -521 -39 403 406
2895 406 -6 -355 -260 -299 333 509 284 -268 -374 -384 164 537 41 -140 -85 -430 294 362 -137 -155 -284 1
2917 1 -115 261 220 -116 -252 -7 -34 -69 408 144 -363 -76 -19 -118 148 381 -287 -218 217 0 462 335 148
2940 148 -301 2 253 254 -47 149 -287 -237 388 231 192 -98 -89 -245 100 260 54 -238 180 -49 -356 43
2962 43 276 23 -77 -140 -357 -109 449 395 49 31 -9 -318 237 442 -41 -110 -233 -173 -269 222 368 -106 -47
2985d7k25P8R2L73k34n89N09k34O5M33L97r71K31K73l08L02J54m81j55P86j79
3006B70k37J80j5q25O87O06o47K27J98p91j33O98K57o74L31j81q39O34Q21k62
3026C05n77M0l20K4R23K96m76k03j23j33q4J149m26p72N59j50l81N93M69p05m89
3047d81O95m14J05M78k80m79L02M95n88K20J01k43l10R87n51l20K94j7m35L35
3067a06Q34n38m34M22m72%Q04N2r90M21J65r23O76J156o38p72K61l34j76J227
3087F35p7n94j53R4k59J23J139l05r13L45q2n25Q17L00q04k37P27l01j16P15k41
3108B88q74O34M39n80jN83p85j63R17m45l23L03j31p5M14J91o46j10K40j47K35
3129c6M27j40r04M55K71n72K92P84n31n94N22j98k17O79K96r52K51J3k82M27N59
$$ plain form
2985 -47 -272 -194 -102 271 37 -552 -43 -277 -212 221 618 -353 -122 151 -157 145 299 -182 -337 449 270
3006 270 33 213 198 -627 60 666 19 246 444 -347 -480 218 475 -199 132 -49 -888 -254 567 305
3026 305 -272 -232 -552 -528 395 691 215 12 -111 -244 -328 821 395 -377 182 32 -349 244 713 8 -481
3047 -481 214 -200 -95 383 103 -376 -74 421 -167 53 154 -89 -399 588 37 -283 11 -6 -441 -106
3067 -106 728 190 -244 178 -294 -294 510 562 -428 -7 158 -765 -89 1067 429 -343 -82 -416 -592 635
3087 635 558 -36 -189 -95 -354 -231 908 603 -310 35 -47 -572 245 545 -259 -496 231 -70 -186 529 288
3108 288 -586 48 487 -93 -94 489 -296 -459 458 13 -310 -7 -138 -213 201 392 -254 -364 -124 -271 -36
3129 -36 391 251 -653 -198 73 -499 -207 577 46 -548 -26 -224 -441 238 534 -418 -167 -154 -436 -9 550
3150E50m73o74M43K21l42M04L19q45J33N41m67j3O12m45l15M02J07o94N37L91
3170C92n76R3L30m24k70N41j01k45L18P7m35J3L42j02k54N99l75j95J95K55n82
3191d04M31M37m34k40N41o47O9O83j35l27k03L20l70L86M01k49m01K70p9j15L72
3212C06J15p34K8L94l30M61K44m49j22l7j18J26L67J08m96J03j7J01Q8K71m34
3233b5m53O40k95Q0m8j07r9J43N01l8l39R2l5k62N42j24k03j33J60k97J26L43
3255A69J00n67K59O6j28J45K90j30k61k0j51L78K29n5m44Q6j97J05M87j09n02
3276b50M4O8j4K33K28j44n09K66N7J17OJ09n36P7L50n2M3j84l7k53N86OJ7n01
3300b73M04j97p9J09L00m41L98l66j27M05j56J82k79j51M0K32J77l7j43j17J4
$$ plain form
3150 550 77 -597 -154 67 -275 129 448 -397 -264 277 -190 -203 409 -36 -351 51 158 -536 1 392
3170 392 -184 -91 239 -185 -455 86 -15 -260 58 135 -300 -287 55 -47 -301 298 -77 -272 -77 178 -404
3191 -404 27 464 30 -210 331 -316 -247 436 301 -26 -229 91 -279 107 508 259 -142 128 49 -66 306
3212 306 421 -313 -285 109 -221 240 484 35 -87 -124 -242 -116 251 359 -137 -34 -51 50 138 409 -25
3233 -25 -478 162 -133 -53 -101 -208 -307 -164 337 299 -40 52 17 -245 297 173 -30 -163 -3 -300 -174 169
3255 169 269 -298 -39 27 -101 44 334 204 -57 -77 -228 150 379 324 -120 -34 -231 -126 361 252 -250
3276 -250 -206 -138 -152 81 309 165 -344 -78 -21 96 102 211 -325 -248 102 50 93 -91 -128 -381 205 211 228 -273
3300 -273 131 -66 -145 -36 264 -177 221 -145 -272 133 -23 159 -120 -271 -231 1 178 141 -2 -119 -105
3321a05J89q6L49j97l44J93k07L61P7n0l17K24k17N76j45l84J92l66M50q5O8k78
3343a02L27n18K00L54k6L5l31j91R9J04Q1J01q6j04R8q0L61j89n2qk01L1k36L50
3367A7J28k20k4K79j31K00p7p1m7m83M80P2j99J5N4J8p8o3J50K06m87K81q5nJ88
3392A18n4P1k27k01K73K88l15J89k22k71L88l45M14q1j15Pl21M42K45l11J85j69
3414a2q1J66O8p2j85J59J8k58K58K7q5J83m36J17J66K58m77n8M63l58K91J7j93
3437b4m8QN2j23L02L2k78m81M42j75K45o3L27j93k29J08p2K41m5p9O0j36K1L05
3461A97j86m9L0l4PL05l19J83n65K53K24Oj44o1j42K32J25L87k49r0n8m11K97
3484f2P3L04p7m30R8q3J29M85k78l39K69M4l7O0J89n93l7K87j99L44J34n34R5
$$ plain form
3321 -105 84 -2 347 150 -194 -1 -208 153 230 180 -137 87 -130 446 301 -83 109 -257 193 108 176 -102
3343 -102 225 -293 -93 261 235 270 -61 -252 -153 -49 32 133 47 -57 41 -39 322 133 81 73 -128 -97 -333 17
3367 17 145 -75 -99 180 49 249 172 101 54 -429 51 123 -76 -61 -7 11 -67 -130 20 226 -261 20 -65 -70 118
3392 118 64 135 -92 -293 -20 268 -47 142 -80 -351 37 -308 106 25 -90 -83 -404 38 283 -28 157 -12
3414 -12 -93 73 141 69 -116 43 61 -197 61 88 3 186 -250 -133 33 291 -186 -244 219 -139 152 169 -24
3437 -24 -72 -64 -12 -135 167 199 -79 -560 -118 -293 -48 -111 216 23 -206 -98 -170 71 26 -53 7 -129 -108 197
3461 197 11 -38 -8 -42 -35 270 -49 134 -431 -178 46 52 -92 -153 -295 -63 62 449 200 110 52 -359 -62
3484 -62 11 315 238 -192 -94 -177 -48 437 159 -180 89 133 96 156 345 -248 -285 2 -197 147 281 -253 -158
3507a58j31M31n9O4j78k36J93L46R8l68R4l35Q6L59J09m9p9j81m54K25K63K04
3529B44P7k90o6l22J56N01l17j02K36m43O6J65M04p59M31L3o3l7K70l98l85P85
3551A86j06l90M56j92j71K09K35m52K82Qj61k21M20J15j82K16j52k21L46j08N8
3572A75k66N3k68j01K08N63k84k81K60l53O9J70L67m50J91j45k26J92M13j55k71
3593a39L01k40k49M72N1l27J28J6k85J6N14Lj38N5o2M3j36K00m58K68R9k30m6
3616a44M39k25O5M5J97l91R1J02j81j47L32n7l32J28o2k63M82J08k04L1J3j21
3638i4k44Q39j51n53L72K65p76J77K10q2L72l56J9k43M25Q0l62rJ71l62jM55k51
3661i9O4o7K22o73O93J42j65k84J99m73L23L14j88m4j34J56j41M28k43l26KM41
$$ plain form
3507 -158 -289 142 83 147 -31 -267 -74 272 370 2 96 -239 -153 206 315 266 187 6 -448 -223 40 244
3529 244 321 31 -35 -357 -201 300 -17 -119 117 -326 -260 -95 309 -450 -19 14 -49 -86 184 -214 -599 186
3551 186 80 -310 146 -46 -217 -8 227 -225 57 65 -96 -317 103 218 36 252 100 -121 225 117 175
3572 175 -91 -38 -306 -407 -199 364 80 -201 59 -294 -225 -55 312 -138 53 -92 -318 -126 287 132 -139
3593 -139 162 -78 -327 145 196 -131 -3 13 -272 -256 258 261 123 178 116 159 23 223 -235 33 132 -98 -144
3616 -144 295 70 135 180 377 -14 77 179 -2 -149 183 126 -206 -78 -140 -403 79 187 -17 14 27 -94
3638 -94 -338 501 350 -203 169 434 -342 -165 45 -37 335 -21 -2 -245 180 260 -102 -111 60 -302 -303 152 -99
3661 -99 -35 -102 120 -553 140 282 117 -167 32 -441 -118 196 8 -36 -170 -14 -155 273 30 -296 -294 147
3683A47k62J4L51k46j16n5L30k0j91L97n86P7K45J90j84j83l7j30K81L32m04m7
3705i7mk70K34J22K49l00n4R5r2R8L62j16j64k26K68K7k3l3j60n3R4P6j16K66
3729A83K2l68K84m4j26M82k05l11J62K21j34k26M66m63j24L37k9j10l5j50j06
3750b74J76K79j79k17K27l96K96K84q9k17N9L8J80j52j2J72k73N5l0l00N47j70
3772Dm3mJ27k92N1J41K18k66j93J99o7M39q3m55j23K78k23M26M4j15j49q1K70
3795A03L8m13K85k00J1J57q9M43l54K64m38L26k01K30k71K19k06j2N3L04k00p2
3817b3J60j95N6J69R9j90j43Q5j9r9J7J26l57J87J7J96K9j78k74M36j31K6Q6k32
3841a52L54k49J47M9k31M4nR6l19R9J42R9k04p0K86l4k17P5K15k98lj37K95k2
$$ plain form
3683 147 -115 -101 250 4 -112 -167 163 143 -48 349 -237 -160 85 275 91 -92 -129 -259 22 354 -50 -97
3705 -97 -101 -371 -137 -15 234 -66 -120 -25 -117 -19 343 227 63 -163 105 132 109 76 -84 -137 -43 33 -83 183
3729 183 205 -163 121 77 -49 433 228 -83 79 300 166 -60 406 -57 -181 156 127 17 -18 -168 -274
3750 -274 -98 181 2 -215 12 -384 -88 196 107 -110 -51 -13 167 15 3 175 -98 -43 -73 -373 174 4
3772 4 -39 -43 84 -208 -157 -16 202 -64 -257 -58 -125 314 231 -224 -347 -69 -292 134 178 63 -86 -167 103
3795 103 141 -272 13 -187 -176 -19 -108 335 -19 245 -193 133 -68 162 -109 110 -96 -108 -55 249 49 -23
3817 -23 137 -58 -2 167 266 76 -67 18 -1 -100 -83 43 -314 -127 -110 86 115 -63 -337 99 -32 -6 80 -152
3841 -152 202 -47 100 149 -82 -38 -43 53 -266 -167 -25 74 -130 -200 86 52 -165 -90 125 -173 -176 -313 -18 -40
3865d0j1j87L38N4k53K71k47K25J9J2l07L13Q6j55l91K39J53j69NK6k07J69L5
3888b2K55j96J32j37m8k25K03J59J22l0k25R6j68K44J7j61j71K28k51J06N9M4
3910C1j5q0J60j01L1J40k50j28P1RN3K06M1p4m22L86o4m4P2j57J18J14k26L07
3934A78j22k31j09P3K11k66J42L62j01j34L6O1j9j20Q4L59m64J74Ql56J33p1L85
3957B13kJ45l77O1Q0J3J28l14K20j85l8jK59l46K85k67j2j52M20k0pl38n4K99
3981A0J56J04m11J78n0jl14M01K21l71J31Nj71r2K00j19j00L24l3j42K22P3k11
4004A0j48K12j85K01j67m1nL32j79K0J7P9m31L7P5K5K28p9k66J01L27j16j35K65
4028A77r4j58R7K24m68J36N9J7jR2J5l65K56J55m61k1M17%m38K91N2j11J90J07
$$ plain form
3865 -40 -51 -238 100 154 -99 172 -75 150 169 181 -126 187 273 118 -273 -34 119 -50 -45 -19 -226 -57 -22
3888 -22 233 37 169 32 -16 -241 -38 121 243 213 -12 84 -84 160 177 16 -155 73 -178 -72 -13 31
3910 31 16 -64 96 -5 26 166 -84 -212 -141 -132 -79 127 168 94 -328 58 -6 -50 22 -135 -17 97 -129 178
3934 178 56 -175 -284 -211 0 -266 -124 238 137 3 39 100 81 -39 45 404 -60 114 122 -234 -101 -172 213
3957 213 211 356 -21 40 120 133 261 -53 167 -18 -56 -57 202 -144 141 -126 -138 -290 130 110 103 -235 -289 10
3981 10 166 270 -141 37 -13 -14 -328 73 294 -77 54 59 -112 -204 -4 -123 -223 101 68 -74 148 221 10
4004 10 -138 74 -111 90 -77 -118 -123 209 30 50 67 146 -285 -248 -173 -148 80 1 -265 -164 163 47 -88 177
4028 177 83 -75 22 246 -222 -86 -27 -10 -11 81 96 -269 -13 142 -319 -340 77 77 -361 -70 -18 -129 61 168
4052A68m07L72J17k58J2p7R1j60K16j78j97M39M0j86J48n8j51m6L70k79n1Q0K35
4075B40j52k9n0k02L13j71K23l16M49k92j37o3J76k13K16K2j47k6L77k4j01j68
4097g5J28j74j6J77r0K38K2l01l5Q3K57k83P5j6j72J12M27m07m9N94m92p0L97
4120C30k36k91nJ30J8q6K20J99n32J90K43l47K3M37l66j10L56l55K06M4Q9l78
4142b21L08j55k4rL01j49j87J19k16K43L32l03q9K15m8%p5J23k28j25K36O4l11
4165a99K12R2j17j03M08k32R8k09K80m76L48j04o8L39k60J64l80J76j09l0K73
4186A03J96m42K93o5j73qK25M5k07K82k00j19j1O06m68k29J37J35Or7n7J4r4K2
4210a06Qk60O90j85j14R3m09K14J61O6k02Pj55n2L63j03O3r6R8l7j29L7J74j99
$$ plain form
4052 168 -239 133 250 -8 4 -73 18 -142 74 -104 -301 138 178 -8 140 82 -69 -115 255 -24 -75 5 240
4075 240 88 59 9 -193 120 -51 172 -144 305 13 -124 -187 -11 -224 -8 14 -133 -159 218 194 93 -75
4097 -75 53 -121 -137 40 -50 188 210 -91 -126 -43 214 -69 6 -10 -182 -70 357 -50 -99 495 3 -67 330
4120 330 94 -197 -202 -72 -54 -140 80 279 -253 -63 180 -167 -144 293 -73 -183 173 -182 24 68 157 -221
4142 -221 87 -68 -92 -101 200 51 -136 -17 -233 10 342 39 -50 165 117 117 42 165 -63 -188 48 112 -199
4165 -199 13 105 -12 -115 293 61 159 -50 230 -246 102 -2 -70 269 9 173 -207 -31 -140 -170 103
4186 103 299 -143 150 85 -88 -96 129 174 -33 249 49 -70 -81 525 57 -172 -35 100 106 9 -48 -34 -128 -106
4210 -106 -98 -358 332 147 33 126 -283 -69 92 158 -44 -37 -192 -244 119 16 79 -17 81 44 -85 -48 126 -73
4234g3K1j17R4J71L9k95m6K29Qj30k0K9K22k18L32k44J62l91R7%J61n8P0j0j6
4259A7n0O3j11J02O1J06J18k46j03K43k45R3j71m5L23j41j02J16J39L0m25L01
4281G3k16J33j35Q3j06N6j2K28J05j49R7J48m65J51q9N9K10k68j77M79r9J24l35
4304a05k63N07M4l2k95J63M4r1J07j02jr9k77M90p4J42r6k36n1K07J85O0j59K3
4328I1K9k08j30L01j47J23k13J02mL07j66k07j3k05K40n0K01j9j00r2L11J14j48
4351A17j15K7j16q8K93J59r7k47J74j55O8J6Jj57K13N8l22j07J67o3K91j54j45
4374a82J13l4j20L15l9k61K72o1J06j84J35k77L46mj56%J01j0p6L64l36o5j67
4397b20J38K12Q5k30q8J30L0rl9J27l9j09P9m6J69l11O7Np3J25ok8M1k4k57M92
$$ plain form
4234 -73 -52 -169 -75 96 135 -160 -206 23 31 -99 -119 -90 132 -86 246 2 164 -227 -130 -130 31 -27 43 33 17
4259 17 -33 30 -81 21 82 188 306 60 -43 200 -45 48 -123 -168 155 14 -88 28 167 197 -228 73
4281 73 -143 -10 -145 -62 -168 -112 -124 104 209 60 157 305 -160 -9 -98 -39 171 -97 -274 205 106 230 -105
4304 -105 -368 139 183 151 -144 19 63 -28 79 -23 -24 -123 -400 90 16 158 62 -174 -225 -18 167 227 68 91
4328 91 120 -88 -218 83 -64 59 -154 -52 -56 251 85 -122 -135 -340 -100 -150 51 32 -68 -160 151 265 117
4351 117 2 29 -87 -175 118 277 180 -67 107 -48 20 36 37 -120 93 151 -171 -278 -111 -174 117 -37 -182
4374 -182 -69 -103 -223 92 53 -208 64 3 109 -75 60 -217 129 125 -31 -31 70 60 -16 348 12 -53 -220
4397 -220 -82 130 215 -15 -103 27 57 48 9 136 97 -12 67 21 190 -121 -54 -49 -122 3 -3 -31 10 -14 -271 221
4423B21p1k4j44J21l09J76j44L01l2L2j75K25j65L2j45Q7J11j13j99J43L92l78
4445e8K07k51M90n02L9J99P9k19K2j69l8K43o2R7j4m41K81J86k70L22l88L60l57
4468b44K07K27l33K04j32J30j73K61j28p2j47L59l29J38J17j41K3l3l1L8L24k02
4490F3J10J2p0j95R1O7q0r6L12j82Np3onj49L58k51k1K58l23J15R8P3k15j72M07
4516A31o8r0J41j85o6J13j32qj3M02m31J70Nn8J58J73Q8o31J98K93l67K56K98
4539C77m24q1L3m4m5L69k26q2Q1L2n6r7J55P3K62l10o0K66m9m0j04l78O99o51
4563c00L01L55m13J21m9r1j70M28q3N8n3q3k23J32K4N6K4k6Nk72K56J27j67l7
4587h0K27k38p1l7K95k08K09M6j97k5o2K25q6J03j85Q3J8Q7k04j09K08j39K01
$$ plain form
4423 221 150 126 -18 103 -206 -30 -174 127 95 127 -48 177 12 44 -101 -14 97 -16 -215 -72 320 -58
4445 -58 149 -102 388 -114 -75 124 203 -16 6 -163 -201 42 -20 77 63 -378 -97 89 -181 141 -247 113 -244
4468 -244 -37 190 -143 61 -71 59 -114 147 19 -53 -200 159 -170 -32 85 -56 -33 -66 -97 -59 265 63
4490 63 173 185 115 -80 11 78 -2 -98 214 32 37 -36 -42 -47 -196 162 -89 -110 148 -175 -60 38 111 -104 -276 131
4516 131 63 -27 114 -71 -137 -24 -156 -164 -177 225 -206 -36 -31 -89 69 242 330 -301 -103 190 -177 79 377
4539 377 -47 -128 -95 -139 -184 185 -41 -123 -42 -10 -66 -163 -8 65 327 17 -43 223 174 134 30 -348 351 -300
4563 -300 1 356 -57 64 15 -76 -246 182 99 157 104 21 -202 -70 -46 10 34 8 13 -259 -3 124 -43 -80
4587 -80 147 -91 -162 -199 96 -112 97 143 -54 -79 -141 84 -2 101 -84 -1 17 104 -100 -209 -1 -140 61
4610F1J7j22k45K74J7k77K94j45P5K70k69r8J43j05J54j55K58r6J29M0j89K6k83
4633b26N01k73l12L11k3K08k15K16l2o0n5j45O3J18n2k51M21j85k31M05Q8m44
4655a73K6L34j62k9N8l00K10n7Q5k4o7J83k31l0L56q0j80j27L56n8O1j35j05O2
4679b7N2j12m3J98r2R8k3J4l70J13J16J94Rm0J26l38J49l0J30j89Q4M5k16n4K04
4704bR2j80j33rK71K29l41q3M23l46N7j14L31k04l2J94j62j39K96Pl06K63m4j65
4728i7K84j49J03j28J37l26L62l1j38p8n2J25L5R8j89P8P5j54k02L23j90J63n1
4751bJ11r3m8j13J78J25L5p7P6j71m5n3k81J06M41k77Q0J29j02P9J11jk51N6q7
4776g4J18j16jL11l21K13j4j03r1j42L65l27M15k65q2J75l2r5J28r5l0M78m26
$$ plain form
4610 61 78 -44 -289 -15 2 -275 19 -126 -51 219 -50 -148 -5 -110 44 -111 147 51 180 220 31 57 -226
4633 -226 275 2 -310 1 -22 186 -29 187 155 95 40 -105 -42 76 24 -227 194 9 -222 183 271 -173
4655 -173 -147 187 25 -4 54 -246 -36 -93 -8 -32 -99 84 -147 -177 179 99 -81 -208 148 90 151 16 -89 -27
4679 -27 25 -87 -130 68 -24 74 51 65 -305 -192 -76 118 127 87 213 -125 24 -6 124 -65 19 64 -152 -206 -2
4704 -2 90 -90 -223 -232 39 268 -73 -156 267 -79 -22 -136 195 -9 -41 153 -9 -148 148 155 -151 112 68 -97
4728 -97 187 38 141 13 150 -176 186 155 17 -61 -113 12 47 145 -44 34 109 -45 -247 76 -114 49 -2
4751 -2 109 16 -32 -145 33 158 193 116 192 21 -24 -77 -358 -252 189 -88 -8 121 19 98 209 208 -43 13 -74
4776 -74 44 -72 -73 238 -83 130 116 13 -78 -220 145 -182 233 -32 -114 61 29 -66 62 -33 -63 415 -11
4799a1J80p7k27J68oJ7j00J81m60N47k81k02K49J66j60j92M12J32k06m25M06o7
4821D4K6q5m5R6Kr1K09o8p5J59m10J6K24j7K24nr1l71L66q3J2Q6j74J70j97j31
4847b09R4J17j64K76m6R6n9J35k84o4J7J41r6j78K3K37o3j3K93j58l7j56q8K00
4871A4M5J37j19j49q1r0M82k79OL9r3O2J04pJ4NJ70k64j72L94k33p3m4m9L08n7
4897G0j8k4k54L86k24j68L09M6rl1j26n0J93j76J14J99k22JJ07J83j54Qj88L9
4921A1J24k08K10k69L6L20L5l35K76m41K52j85J11O9J50k12m5l74L86m3K91m9
4943A10P4j1k06j20J38J04k21O7o7J47j55J24j56K90k06J52l30N0M0j12J32P7
4965g9Q2Q9k31J40K8oL01k68n4k00J95k13J93M8p8J06q3o9J92r9k4%R2m6J86m41
$$ plain form
4799 -11 169 92 -135 33 27 44 -56 125 -335 212 -69 -271 -22 144 -16 -208 204 336 130 -295 111 44
4821 44 70 -15 -60 36 38 -53 156 88 13 172 -238 -222 2 -15 209 204 113 -258 108 25 37 123 -51 119 -78 -209
4847 -209 -115 2 -162 114 68 164 105 240 -44 -108 -91 50 -46 -224 -201 36 -27 -40 253 95 58 -98 -186 14
4871 14 59 196 77 -72 -153 -243 239 -40 -34 5 -88 -26 78 71 85 90 260 -4 -176 218 -15 -88 -132 -181 127 70
4897 70 52 28 -226 160 -64 -232 77 123 114 83 -43 -93 100 -76 38 237 15 16 123 306 152 160 -28 11
4921 11 135 -73 137 -132 -96 224 259 -76 200 -241 11 -174 -63 6 156 -56 -101 -475 -89 -132 159 110
4943 110 184 173 -33 -153 -15 89 -132 -65 -132 15 -140 -16 -172 118 -88 64 -266 -216 -176 -288 -156 -79
4965 -79 3 92 -139 1 29 23 324 56 2 -198 -3 -216 -23 25 -53 53 -30 -99 93 -6 -30 -30 62 16 202 -239
4991b39K13J38j33j20J71oJ35j48l4mK9J80j90j30M7j66K73K03l18k2j59J64m6
5014a62M2J71m0n2J35n0q2R3J36o8q8Q7j63J58j52L80m31J62J48l69K77K47n1
5037C28j93q8j09o6K88j11k52r9L69l01L93j01K73m20J4K02l13M05r6l35J63J54
5059A05l74O9j89M46q7O4J33k68J24K90n01L89q0k60j29N15j94j13J05oj65J92
5081F6j10k4P8K57k77k00L56K9j38P4n3j98K7K4L1pN3K56k50O9L6r4qj25J36j6
5107hL30k68k43L48N7k60LJ07K4j13J13l79L22N3j25k81L89qK3j33O2k01K61m0
5131C3o3n5k50L54k58K26Q7k19J63J81j06qj88J24m54N16k7j97r2J61nJ03J46
5154A72l32kL7J92lN8j97J23l20L78j28q5P9J60n43K65K91l42M5L27r2j54K79
$$ plain form
4991 -239 -26 112 -21 -141 30 24 159 11 -23 -27 2 182 -8 -138 -91 -257 16 219 -99 -121 -280 -116 -162
5014 -162 -120 51 11 -41 94 44 -38 55 191 123 35 122 -41 117 -35 345 -86 76 224 -145 132 379 328
5037 328 135 47 -62 -128 160 49 -203 -302 67 -234 159 58 331 -89 -75 127 -186 219 123 -212 -49 105
5059 105 -269 -200 -389 57 -30 34 167 -101 23 313 -188 201 121 -139 -268 247 53 -60 45 39 -126 66
5081 66 -44 -68 10 267 -10 -210 146 175 37 111 58 -140 -113 -89 -58 -65 -12 244 -6 63 99 5 -3 -128 8 -8
5107 -8 322 54 -189 159 216 -44 -41 66 90 -23 90 -289 33 86 -39 -320 69 61 84 -49 13 -188 73 33
5131 33 -30 -85 -335 19 -239 -13 74 -145 18 199 93 85 -103 21 -433 83 56 -141 -233 -72 -77 26 172
5154 172 -160 -162 -125 67 64 122 -75 48 -272 106 -22 -107 -28 132 -411 -146 145 -197 -152 175 83 -71 208
5177B08j12j74J32R9j7l5k14j39K20j23N8jK5K35O2k64K6K6o0M0K4j34J19J78
5201A79l68J0K05j35K07j65O7Q6j44J58j59L23j29k55O6K77k55j50K00j41J1L65
5223B53N7m91K68k0j39K51l07r5K0L08k47J55J53k47l10M28oJ05k10P9j36J12
5245a9J56l18J3J06L14k1q2r1k3k96K69j13l07M11N5k20J25J87k68K62L5m8l06
5268a79P4K16j63J44J4j51l5O3j15P9O5R6l70l3L56k21RK85j78O4k63R8L13j14
5292E4m9M6rQ8Q1R4m70K6J15R2P2k32J87J00k59J6j3J68k91R7o0R0NJ78j82r1
5318a47K15O3k86M12o1l52L3MK54j56KN6j92J93M6j69RK6r1Q2M0k3L7J01m20L06
5344a8j23K96j70K10l46M1K11k35K02j94J15K27l77J72K60l30m4K76k01k49L24
$$ plain form
5177 208 96 -78 54 153 136 101 -113 -252 -32 -155 -97 -98 -73 162 224 -40 -14 12 -48 -8 16 -118 1 179
5201 179 -189 -179 26 -109 98 -67 0 86 -58 100 -59 264 135 -120 -54 223 -32 -182 18 -123 -112 253
5223 253 310 -181 87 67 -72 179 -128 -223 -203 105 -142 13 166 -81 -391 37 31 136 -74 5 -131 -19
5245 -19 137 -181 -168 -62 252 231 149 58 35 -261 8 -105 -412 -1 54 -166 -41 146 -122 140 175 127 -179
5268 -179 -105 111 -52 92 106 -45 -80 -17 -132 -53 12 108 -262 -295 61 -160 -151 134 -44 20 -243 -145 168 54
5292 54 5 51 42 130 211 305 -165 -139 -24 68 140 -92 95 195 -64 -48 -61 107 -184 -87 -147 -57 -52 126 -56 -147
5318 -147 68 131 -155 257 196 -156 -123 -119 135 -21 -19 37 -155 38 84 -85 -76 -50 -141 -59 -19 -42 -5 96 -324 -18
5344 -18 -141 155 -15 195 -151 -110 101 -134 68 -126 -11 216 -161 11 271 -59 -103 173 -28 -277 47
5365D7N9k24J80k14M12l36J31k42K35k86J82J15nk28J24J16l37K89J83m9k71J85
5387F6l11M97k65J25k19j43N12k74J74q7q2o7P0r6M26l76N5q8j21K77j47K88l79
5410a65j46N63l29M8N2j12K10n1r8J69J30l47J7L5J25j61L40j61J63l31o3M05
5432B93k19r9r6L61k73n0j91J92k10N03j95K31P0l58L58m09j33K35R3l10K02J85
5454A80l72J55Nk1R6j05k13L25r1q3J28LK6j07K23l32J16K17J22k46J92j97l2
5477a1K69m20L3Q4J01k26K74k91K64K5j83L39Ol35K3k1M3M2j0LR0j37K00k20J41
5502H3j36r7Rj5L95m14J28j41n0J09L08k05J42M5k12k07K86Nl02J66L63m46M8
5525a38M11j81M8j79J39k32K15N5p8k09K97l50P7L3K15k30l28M71j62P8K20k39
$$ plain form
5365 47 106 -118 62 -152 260 -76 55 -187 48 -238 -56 59 54 -174 -50 66 -271 18 201 152 -119 66
5387 66 -245 252 -13 112 -107 -250 262 -12 162 75 -7 -74 -4 -100 326 -50 5 -83 -204 73 -74 214 -165
5410 -165 -311 252 -77 -29 23 -89 121 70 -28 141 271 -76 -59 -24 101 -60 280 119 282 -49 -112 293
5432 293 74 -25 -121 240 -33 -83 -274 -82 -292 211 16 247 317 -41 317 -92 -225 10 103 -207 -5 180
5454 180 -192 -37 -32 -53 43 -62 -275 50 -41 -124 4 7 33 -74 149 -183 -67 150 272 26 218 21 -11
5477 -11 258 -162 -129 -45 56 -170 104 -187 77 102 -81 258 264 -71 -48 -69 -26 16 6 9 99 -38 162 -58 83
5502 83 -53 -150 -141 -156 239 -175 -47 -188 -238 -129 179 -26 116 161 -51 -258 28 33 -269 -103 260 -186 -138
5525 -138 273 92 140 -39 100 -132 83 138 60 -149 148 -202 -125 -92 123 -107 -435 36 -126 -48 172 -67
5547f7O1k6r2k34N75k42nJ85O9j26n9J47j21k47J45P1o6O8J3j03r3M9K10k40K82
5572A54k32k74M09j2q1J18Rk09J9M91l52J29l44J89j09k3J01j58L54j30o5k30
5594b46K42K63n08K33K01l65L61Q1l74L8J40j68j73L21j5j21K72jk38L50k11j21
5616c9L4J82j36l16J79K91j40k40L37J71n32J54J21k41J33L8q7Q3j33j24L58j04
5638a1K1m0J24R7k72L23M0l29Q8K4j63L9J41n9j87K30J39l85J21J96k84p0K25
5661HJ14m93N06l35J96j03M7n9R0K21p4m12L97q4k95K70P1o1q9J87k36m8L62j1
5685A69m33J71K43j03J71k86K80k59K93k84j33J44K7M1k53L86k24J81p8j00k19
5706b66J96K01k16K77j45k90K49L26l09j51K36j16q9J46l8l30L06R5q5j67L86
$$ plain form
5547 -67 -6 -32 -124 -358 217 -25 -30 155 224 98 39 186 65 -182 -37 34 -32 36 49 -54 -147 -98 112 -128 154
5572 154 -78 -352 57 45 -36 82 91 -118 -99 392 40 169 -175 14 -95 -118 -17 -175 179 49 -16 -246
5594 -246 -4 259 -249 -16 185 -180 181 262 -112 -74 66 -102 -275 46 31 -90 182 181 -57 293 82 -39
5616 -39 -5 177 41 -275 -96 195 55 -185 152 323 -209 -55 66 -175 -42 -4 -91 -8 -141 -265 93 -11
5638 -11 10 -30 94 191 -81 242 282 -47 41 65 -98 -59 82 23 -164 66 205 -180 -59 137 -147 -217 8
5661 8 122 -371 135 -200 -4 -107 -60 -119 -29 192 118 -294 103 19 -276 -6 65 4 -85 102 -134 -182 180 169
5685 169 -264 -93 150 47 218 -68 212 -47 246 -38 -171 -27 0 41 -212 174 -50 131 53 -47 -266
5706 -266 -70 131 -85 192 47 -243 6 332 23 -128 108 -8 -97 49 11 -319 -13 82 -3 -170 216
5727B16P8j46j55kj76K54j14j82K94j7j92K13K3l36K02J27kk79J88J17j78r7L12
5750A48k50l5o2N31m64K48r1j37L3j43M87l17K18l96K16J27j9j22LK47m96M73
5772A99k39K23k48K36j11j11j04L09l06p1J18j10J61J6j26J55oJ5p0K49j72k40
5794b33L5N10L4m49K43l97K09J2j55j7L2J27J15J03K20k70k76J95L13n75Q5K78
5816A39k97K41M7k7n8j04jm0o2L80j67m5r7J2L12j37okq8J48j74j52K28j25N7
5841a8J12j3K00k93m7K89j77j7J42j22Q2j08J86k02k48L59M2j67n8l39N6M81q3
5864E7j70J87l26J82M4J77l2K4J60l94K67o9j31Q7Kj43NJ45J1l5K7l17K30K29
5888B17l63L87k36j53J61j13L27k69j58K87j45R5oo8j9M9J13J0n7JQ5k11L03l35
$$ plain form
5727 216 294 148 -7 -9 -185 69 -45 -227 67 50 -142 71 94 -242 -40 87 85 -194 -6 111 -67 -164 148
5750 148 -102 -137 -199 332 -132 116 25 -112 -79 -222 265 -52 166 -230 -14 113 94 -28 -25 222 -274 199
5772 199 -40 183 -65 171 60 -51 -155 154 -152 -223 -105 -215 -54 -38 -164 -9 -15 0 -70 179 7 -233
5794 -233 -198 312 346 -103 140 -257 -48 -36 -191 -208 -176 -49 66 169 389 119 -157 38 351 -224 -139 139
5816 139 -158 83 130 103 45 -59 -60 -100 -162 218 51 6 -91 -79 233 96 90 88 0 148 -26 -178 50 -75 -18
5841 -18 94 81 281 -12 -59 230 53 36 178 56 138 30 216 14 -234 125 167 0 -58 -397 -341 140 57
5864 57 -113 74 -252 -70 -26 151 119 143 303 -91 176 107 -24 63 65 -78 -73 72 83 48 75 -242 -12 217
5888 217 -146 241 5 -148 13 -100 227 -42 -200 87 -58 37 31 -37 -56 -7 106 116 59 60 145 -66 237 -98
5912i8J42J85k61K6J55m43K92J1J09l4k12M61l17r0K50l75K04N5k82K78r1J55
5934A20k21K44k85R9J57k32J43%o5K79j85J6q0j7R0l7q4o5J77j3J91m28J28K06
5958A38j98PL84m58K83k81M4k20K60O1n0J81l66K77J43j43j26J44k65L6J58j15
5980a06Pj8J40N2M7n4L00m01J82j51K0j53R4K10m49J64K17j61J8K25P8k80L36
6003C17m26J70%J5l5Q9k14J45q3pp3L06j97M5K3J6R8m91K46J87n3n3j36J11j49
6028a49j71M31l66K43j89L06PR3k10J40j07j47J00j54QJ95L8q0O8l8J93J48m47
6051h8L18l09k1k03O86l89j36K85l05K05k61L03j75J79q4o7J76J36l00N9R0k6
6073G3L3l11M34m90L10J99l14j42K21j4j16J62M81l93n09M48Q1q6o6j1rk08N02
$$ plain form
5912 -98 44 229 -32 -6 149 -294 -2 9 118 84 -128 333 16 -74 176 -199 5 60 -222 56 -35 120
5934 120 -101 143 -142 -43 114 -118 25 25 -40 239 54 70 -10 -27 63 26 -58 -123 54 41 232 -196 -68 138
5958 138 -60 -53 331 -127 156 -125 -81 -301 -41 20 -30 151 -215 62 205 62 -64 80 -185 -149 9 -106
5980 -106 -99 -117 23 75 122 68 368 -33 149 -2 18 -135 -41 169 -280 -116 101 -60 -42 183 261 -19 317
6003 317 -109 61 61 76 41 130 -84 61 -22 -29 -102 204 7 52 75 91 189 -302 -56 131 78 25 -111 0 -149
6028 -149 -320 111 -255 -12 -201 105 112 205 -5 135 28 -119 -19 -173 -165 30 68 -12 56 18 211 359 -88
6051 -88 230 -79 -100 -303 383 -6 -142 143 -162 43 -218 85 -90 89 5 -62 114 250 -50 9 99 73
6073 73 106 -205 229 -261 49 248 -66 -208 13 -1 -117 45 526 133 -376 72 153 67 1 -10 -19 -227 275
6096B75k75N2R8j03l1J95J52k37j13L49k65k94J83M9l4P5j61K89k75j34J7L46
6118A58j68o6l4J42j91p7K22J2J09r6L1Q9k30j73M8J06L88k63j9J08j64Q3J98
6141B13o4J66n03n1k4M30k24K41l57L97j80l10M98k59K02l10L34m01J8O37j90
6162B63j87k30K97k58j43M23o6p1K63m59m3l3J59j20J39K73j96J31l53J81J49
6183A19O9k43q8K98j33q7j58J33N6l44M46P1n4N2Kj73j3J96j47LJ66K1o7K30k70
6208H5l56P6K65j21j24L46m46O3L44l07J13q5q0n4K42J10l4j5J16k77NJ50Q6O5
6232A67l18J53j50j5J78K08j91L4m6j12k15N65o29K70L12k24L5j56J87m3L8K8
6254G6o7j23J78r5mo7L14j64L2j02N9k6K0J2M1j70j33K55%o8l9K6r5j08L64Mp3
$$ plain form
6096 275 0 52 150 47 16 211 363 126 13 362 97 -197 -14 35 1 76 -85 204 -71 -205 -188 158
6118 158 -10 -76 -110 32 -159 -236 -14 -2 107 11 42 131 -99 -272 -224 -118 270 7 -12 96 -68 15 213
6141 213 149 315 -188 -239 -263 167 -57 184 -173 224 44 -266 232 -27 175 -135 199 -202 -184 453 263
6162 263 76 -154 143 -115 -258 165 99 28 291 -168 -211 -244 -85 -205 -66 207 11 142 -211 -30 119
6183 119 188 -55 -143 155 22 -65 -223 -90 -34 -378 68 139 85 137 139 -34 -47 149 2 5 171 192 125 355 85
6208 85 -271 -195 70 -51 -175 171 -275 -212 132 -175 -62 -147 -227 -281 -39 71 37 22 138 -139 -134 16 102 167
6232 167 -151 2 -148 -163 15 223 32 66 20 -92 -307 258 -371 -101 211 -13 22 -134 53 10 48 76
6254 76 9 -114 64 -31 -35 -102 212 48 80 -22 37 11 31 43 84 -86 -219 36 36 -32 -71 -45 -140 -248 116 120 47
6281D7J4j0J35j88p5n4k6K74L6l4k14K86Q9n04J84M8l29N04K9k25o5oJ16j64O1
6306g1j18J40m9n7M4J57k66J86k14N04j26j43j24K95j99L08j48l42K45k72J61
6327h9Q0Q2k6j12q1K14j8q6q4J95j63j6l6J57j11K41m71M45p8j26j23J11J51k19
6351a63M42j58j8l8k8M8j52J23l09mK79J34r1k09J25J89j39j27l2J16k03N43k75
6374E3k56K37l3J3k08J96OJ84j70J84j90j30L6O3J31P6j92J2j30L8J15L5l35K44
6398b1kO1j50L8L59j56k24K36k86J64m0n8K13k42r8M87k97K63j92l0j33K26p5
6421D3LK57k66J6O4Ml72J55K65j06j3j73J91k20oJ8K09q8k02J86j19K65j62l8
6445h9J0J12k20K01O3l40L55j65r9K76j85K27n7P3m0l39L89l19L26j83j82K56
$$ plain form
6281 47 61 51 186 -2 -77 -131 -157 117 153 119 -95 191 280 -224 -40 8 -321 183 212 -13 -78 -84 32 -132 -71
6306 -71 -189 -49 -98 -155 -111 46 -220 -34 -248 256 130 -13 -137 158 -41 267 119 -223 22 -250 -89
6327 -89 -9 73 47 -65 -146 68 50 -36 -120 75 -88 -104 -140 17 -94 147 -324 121 43 -83 -206 -95 56 -163
6351 -163 279 121 103 65 37 85 -67 56 -253 -257 22 156 65 -144 -19 170 31 -96 -128 -12 -215 328 53
6374 53 -203 34 1 14 -194 2 8 192 22 206 16 -114 -78 -15 116 192 0 12 -118 -80 35 70 -265 -21
6398 -21 -23 38 -112 -74 285 129 -95 141 -145 19 -21 -79 134 -108 -206 281 -16 247 55 25 -108 118 43
6421 43 46 303 37 53 117 121 -251 -96 169 63 50 -123 68 -152 -158 -140 69 -19 -221 -35 -154 111 -51 -89
6445 -89 -79 33 -187 14 77 -263 92 -73 -172 104 -81 146 89 162 122 -217 172 -147 179 -4 -186 70
6467G0l7k45J64m1Q7m5J17k1j10J85r8K31j57k9j8L0r6J09j64J35J09k80K27M3
6491A66j94R6J66l74P0N9J61k80O5M2k17K01K03k91P0J34n4J98m70K92J26J01
6513B70j82P0k46J86p8J4R9m9jj80l0L50j43Q8k37Qk53K49L38l74m1jJ65k41K32
6538A3q7R4J92M2k67J12j77K37j03j40J49Q1o7k45L44J71l87K53k61K5O1m4Q9
6561H5J87k4k29j74l7J78j1j17J28r1p6L6O7Q7P5O2j93K42p9l28J34K06j25j91
6585a88O70l72m86K79J99k77K11O0m02K87K91q5j54J7m9q0K82j9k40J60O6j30
6607D0j95K47J75j95j70K52q7j16M5q1k2J7M2k12L21J8p1r0R9J81l35J86j48J51
6631E2k0l3j98K88j75K2Q5o9j93M16k38J08K10l07J11r0K38j18k34K11L8k89R0
$$ plain form
6467 70 33 -212 -48 -89 -2 -47 70 49 -61 124 26 257 100 71 53 83 -13 96 -68 67 176 -104 123 166
6491 166 -28 68 234 -140 -70 -11 150 -130 -65 -23 -240 -39 164 -127 -57 77 23 221 -249 43 169 270
6513 270 88 158 -88 98 20 34 133 84 83 -97 -127 223 80 168 -69 -61 -314 -65 273 -101 -142 -143 22 -219 13
6538 13 -74 20 212 254 -13 99 -78 159 56 -84 65 146 79 -166 178 349 -38 215 -46 -21 40 -4 85
6561 85 272 248 19 -155 -192 -14 -25 -142 -14 -105 -181 -145 -78 9 84 146 -47 195 116 -212 -78 128 3 -188
6585 -188 482 110 -376 -97 102 -175 36 96 -306 -19 272 187 33 50 1 -79 203 184 -56 104 170 40
6607 40 -155 92 267 72 -98 154 67 -49 -4 -85 -107 -90 -48 -260 61 79 8 -82 17 198 -137 49 -99 52
6631 52 32 -1 -199 89 -86 -64 21 -48 -241 175 -63 45 255 -52 59 -31 207 89 -145 66 104 -185 -95
6654i5Q4m16M94j07K25j31k19L35m42Q5J97N4j59o5J31j80R9J40Q0L2j97J12J11
6677A68Ro6j37r1L00l64k08N88m66K63K72n02j3J75O4K5K79k86j85K18ok77M04
6700A64J64m11j24L35k2r0OJ40j82j80J23L56n35J96J40l5J64k35n7J60j1L0k8
6723F8l54J40o8K89N3k61J39q3j45K91nl21K59l1Knj00K72j8n1K74m14J15J38
6747A84J05l45K77p6j89J05n5P8K4l3j0j73j09J13m8K27j26P0O5K47m54k8K77
6770A26l42Q7J14Rl6P7P9K39k23k4k02r8M24k07j65K68o7k16M4K48k37j73L76
6793A01p2n8O1Q6j58q0QM81n29K90k22j65L70k2J9l18K71k28MM9K86L8j05k24
6817a17J61q4r6K6O8L9m7P2j30L0n9K72j11K52m20K83j81J64j28m0K19k40K00
$$ plain form
6654 -95 -11 -427 67 -40 185 54 -165 170 -272 -187 10 64 -95 -160 -29 -209 -110 30 110 142 -55 57 168
6677 168 177 111 -26 -117 183 -181 -389 199 -267 -4 268 -234 -247 -72 -8 17 296 10 -175 43 37 -240 164
6700 164 328 -83 -207 128 106 16 22 162 -20 -200 -77 279 -256 -60 80 45 209 -26 -83 77 66 96 68
6723 68 -286 -146 -214 75 128 -133 6 -77 -222 69 64 -257 2 -29 -27 -32 -132 140 122 71 345 -69 46 184
6747 184 289 -56 221 145 -44 61 6 84 108 75 65 -108 -217 -104 -152 75 -51 19 84 331 -123 -151 126
6770 126 -216 -129 -15 -6 -42 35 114 353 130 106 -96 -194 230 23 -142 126 59 -157 -113 135 -102 -275 101
6793 101 29 -29 32 118 -40 -120 -112 369 -160 130 -92 -257 113 91 110 -208 63 -165 -161 -112 174 212 107 -117
6817 -117 44 -40 -136 -110 -42 -3 -50 22 -108 -78 -137 135 24 276 -144 139 -42 122 -6 -46 173 -67 133
6840A33l1k52J90j27l7j6KM37k94O4k45L90j60r8m5J56j06R0j13j9J33J41j66
6863B7l9r2L8R1K6j6m3L26m61r9J79P4j52J50N2j68K2j14J33P5R8k95j23L86L5
6888A10Q4m29J91K10k10J23k15j84K97L09k11K8K50n49J38kK54k3J73l99j31M37
6910B51k48J23p9j61J88o1j74J13q9K25l37K75K49l16j79J65PK06p6j4Mj50J75
6933I7K6q0j85L22k94R3K20k02j23L35m08L05m33j7P6K00k47K71j43K10j20m3
6955a40J40r1J13o7O3j36K67k50K26k17r0L8L50m4l43J18p6o0K30R5j22j10p3
6978a79J29P4O5j27j01K92q2k80m1L57n0N5k5m60J81L24k90k3K93J15k65k8l8
7001a04K25k12Q1j7j08%O4K19J3k13j44K41k33L29j40k7j71K20J33j50j08J45
$$ plain form
6840 133 102 -150 40 -87 -124 -140 -138 299 5 69 -176 214 54 -44 -89 67 -39 51 -62 -81 52 193 27
6863 27 -12 -104 -66 25 51 35 -8 318 -143 -242 -63 11 -141 9 61 -107 -85 -199 -66 9 107 -188 -311 75 110
6888 110 194 -235 -44 166 -44 79 -136 -320 -23 286 75 103 353 -196 -58 -60 194 171 344 -55 -186 251
6910 251 3 126 47 -114 74 13 -161 -48 -137 88 -249 26 275 -41 -220 -55 -48 158 82 68 72 -78 97
6933 97 123 43 -142 180 -114 -21 199 -3 -126 209 -199 106 -327 -344 -268 -68 -315 -44 -187 23 -97 -140
6955 -140 0 -91 22 -45 18 -118 149 -101 125 -92 -182 -144 206 162 -181 -63 -139 -199 31 126 4 -106 -179
6978 -179 -50 24 89 -38 -139 153 71 -209 -250 107 57 112 87 -373 -192 132 -158 -181 112 227 -38 -66 -104
7001 -104 121 -91 -10 -27 -135 -135 -71 148 161 -52 -196 45 -188 141 1 -26 -197 23 156 6 -102 43
7023D3K86o52O46k37j72J37J46k17j40K39K37J9m69J50q7J52k0o1J45k33O6R9
7045G7j97J41J9J01k00k0j25J88J62j40j07J09R9J4k6J29j55k13K18O2k26J58
7067F8J19k78j12J36l0L42l47J16%n3j21J33pK45k04q2k7L6Q1M7j3J47k87J18
7091B7J2R5j31r2N0lJ86j33OK5J55k19P8N7L4k88L4L01j7q5l0M9j89oR8j75j68
7118c29L56J17k43K76p6q2J3m3J80m25L17%m0M11l90j16M6j10j44K97nj55J07
7141c8J52K36m74J09K96j03j43K12l69O8Q8j43K3K76o0n3N8j08j64J39LK08l62
7164a49J22K18j95J35lj04J25j93J81j16P4j96j25K4J21J00K3Jr2o2J14l9n1L68
7188B81l96K21J33m01J04K60m08J97m2N8k9n4M5N9m2Kn8k21J99J15l98M11r3K73
$$ plain form
7023 43 329 -323 323 86 -86 51 197 -20 -160 79 316 335 -134 16 -71 81 61 0 145 -88 -22 77
7045 77 -120 21 40 141 -59 -79 -204 -16 146 6 -101 8 107 121 95 224 69 -144 74 136 -90 68
7067 68 187 -91 -203 -67 -97 245 -102 14 14 -39 -160 -27 -34 211 7 -75 -102 -66 15 62 49 196 -91 27
7091 27 39 134 3 -89 -39 -42 144 11 17 42 197 -22 56 113 147 -141 -107 194 177 92 62 111 -78 -84 14 -161 -329
7118 -329 27 144 -99 177 101 19 32 -11 169 -256 61 61 21 432 42 -74 -28 -138 -282 15 10 -145 -38
7141 -38 114 350 -124 -15 281 178 35 247 -122 -54 34 -109 -86 190 130 77 135 27 -137 2 5 213 -149
7164 -149 -27 191 -4 131 128 24 149 -44 137 21 95 -101 -226 -202 -81 19 42 43 -49 -111 3 -36 -87 281
7188 281 -115 106 239 -162 -58 202 -206 -9 -51 7 -22 -76 -31 28 -14 -12 -70 -291 -92 23 -375 36 -57 216
7212B16k56m8K50l32K24R3k38K58k45J94m3Q2r3p9K30m09J2J55q6L21k14N9N5
7235A06r2j79K86m6k39J34q9J16J08Rk10N5O5k01R6K17o4p2K1J28j31j66J28J36
7259A16j61N8J4j87J94J01k95L30lk73J11k0J28j34K23k74n4P3K96l82j08J81
7281f6J62k46Kk0L33J30l97J46o5K9k2K50j1j05j76%L00l58J69K4l7n0J42Q7m71
7306b50L22O1j09m3R0J9%k6M9p7P8k6q8k7K85k46j01j9J27k0J6K0k28nL06l3J31
7333B06k56J45q9j07J39o8K53k88n1L08j39M7n3j03Q8R1l1o7o6j5L04k10M5j6
7357F7R0j65K7l1J57j28j44R3MR7M6k2j19Q0j68J36j66J69N7j74mJ50qJm3p4p6
7384a48L72j33j75K02j1J45p5J17l24Q6n6j11L80l34Q6k43O7n0M8J2J82Q8j32
$$ plain form
7212 216 -40 -88 162 -170 54 147 -91 167 -78 116 73 155 62 -17 213 -196 -184 -29 -115 206 -8 51 106
7235 106 14 -165 121 75 -164 -30 -119 -3 105 114 -96 -41 24 -177 -81 136 72 0 21 149 18 -148 -20 116
7259 116 -45 13 27 -160 34 135 -160 170 167 -106 5 -15 113 -21 202 -72 -126 -53 243 -139 -247 -66
7281 -66 96 -150 -148 -168 165 295 -102 44 -21 8 -14 236 225 120 -56 -56 244 -114 55 79 42 -8 134 221 -250
7306 -250 72 133 24 -19 71 90 90 64 113 36 114 88 0 -27 258 12 -89 -108 19 -1 15 35 -193 -198 108 75 206
7333 206 -50 95 6 -101 38 -30 223 -65 -116 192 53 100 47 -56 32 123 92 25 -41 -56 248 38 83 67
7357 67 157 -8 19 -12 145 17 -127 -34 -30 67 113 91 -28 52 -116 20 -146 23 80 -94 -98 52 44 45 2 -72 -148
7384 -148 224 91 -84 118 107 252 177 294 -30 56 0 -111 269 -65 21 -222 -155 -205 -157 -145 37 125 -7
7407gN6J19M1m04M0R9K23l21R1M1O2n8m6M1M4J4K47l25J21J80j9k51j07J34j21
7432a06J15k2m3M9l6M01k47L57m80J06mk83L85n9k96O5L19n07L04o6J79l89J87
7455g1K58Ok92j1L04k13J73n5j73J01m04M92j52K65j89p2J0NJ55q5k0r9r6K99
7479A36L1k96J4jK05k53J20Mo3m7M0o0L48k95O1N5J95j21k9J84j56o9M9l38J54
7504a32K32j52M7RR0j67Oj2O6j25L24M8j60k2R2l77J08R7K1Rj20J68o7k64L68
7529H7k14J77l4J81o4k61L20M1l05K30o8N3Q7k60J31M8k04q1L12k84l2K10Jj47
7553g6J39J20j41j00J13j67J11K3K7R4kj96q2J09k23K47K5j53j9J09j0L09k44
7576A3j51K78l0j41J31k87J09K58j08j53N4L8k01L17j4rN4k32k7Q0Q5q9j61L09
$$ plain form
7407 -7 49 168 209 -195 -155 -56 167 -154 -63 -22 40 -18 -64 -23 21 35 282 -43 78 258 239 -12 -119 15 -106
7432 -106 9 -13 -56 -7 -43 358 111 468 -12 94 90 -193 192 133 -163 -98 221 -286 18 -48 131 -258 -71
7455 -71 187 193 -99 -110 194 -19 154 99 -74 27 -377 115 -37 228 39 -33 -23 -18 137 52 32 -67 -163 136
7479 136 167 -129 -115 -116 89 -164 -44 -40 -103 -150 -110 -170 178 -117 -56 -1 194 73 44 228 72 3 52 -286 -132
7504 -132 100 -52 -5 4 94 -73 -67 -79 -13 -138 186 234 74 52 144 -233 -125 -28 -7 2 -118 50 -17 -281 87
7529 87 -127 50 16 197 133 -128 192 233 -72 158 90 143 230 -30 101 149 -55 -136 176 -108 -140 70 71 -76
7553 -76 63 183 42 -58 55 -112 -1 22 49 143 141 -55 -137 -28 -251 -4 21 -132 -151 -42 -52 257 13
7576 13 -138 140 110 -31 100 -187 -78 180 72 -81 -27 11 -190 127 113 104 158 -74 -101 -21 64 -25 -186 123
7600A23l6k58L26k27L27J1k25l40M88J14l10L2J37k09n7O1L32j78K8j55N1J35
7622A70m70L71q6J52m84K59J29L3j31j66J43R8nNj55J12J1J29o1j03j26K7J38
7645a0P2Q8j90N8Jk90L41j42o3J01R1m8J7lJ5j06r3K31N1l38lK00K44k17k06K88
7671H9m41L60K07l39M03m49jL82j93N9l00J40j11J76J03k04R1R9j49J22Q1j76
7693e1P3k21J79J38l26J09O5J10pk0J07k81J96J41j16n6l9q7K78k75O1K75j63
7716I0o2o4J72O4j37j89L72q3j16m7j75L02k47J8M5j00k0J80Pj36J42%k2j2J89
7741A71j94o3J27O5j70L6j0K97o7q5O0p1m6M2j20M2R9k4k58K32j37k6p0R7M7p8
7767a04Q2j18J74K25j14l76K97j76N5P1k9Q8rk16KO2R9J9M9m9K5l1j66J67J50
$$ plain form
7600 123 87 -171 155 -72 255 266 41 -299 189 303 -7 25 162 -47 -104 -43 289 111 139 -16 35 170
7622 170 -300 71 -15 137 -347 -88 41 74 -57 -223 -80 18 13 18 -137 -25 -14 115 54 -49 -175 -148 -10
7645 -10 62 150 -40 18 19 -271 70 -72 -135 -34 57 9 26 23 38 -68 -161 70 121 -217 -220 -20 224 7 -199 89
7671 89 -352 8 215 -124 279 -170 -171 211 18 77 -223 -83 -194 -18 85 -119 -28 71 -78 44 125 -51
7693 -51 22 -199 -20 118 -208 -99 -34 76 69 49 156 -125 71 212 96 40 1 -86 192 -83 -22 253 90
7716 90 28 -36 136 200 63 -126 246 163 47 0 -175 127 -120 -102 -57 -157 -177 3 10 -126 16 16 -6 -18 171
7741 171 -23 -86 41 106 -64 -28 -38 259 192 107 167 96 50 92 -28 14 113 89 -169 63 -74 -100 -170 -73 -26 -104
7767 -104 -22 -140 34 259 145 -231 66 -110 -55 16 -13 75 66 -150 -148 -86 13 32 81 32 57 26 -140 27 177
7792A77j62j93L05l09mK65j41oK38N0l16j52L27j50N8J76m33K40J44j15p4Q1m3
7815c7J4l0j31K52j26k38L52k40M3J07k85qL61Qr1M6k21r2N73l94j15K39J81k71
7839a03L04j97J87j38o3J50j3J20k44j7N3p3j3J34l05K43m0R0j24Q7o3K33j98
7862A0R5j76j48K72K48L7m03M2J80j75qJ14n8N8L1k7p5j46j1K34k39N6J47r9m8
7887h9K02k48N3P4k4O4P0Q9q1j27j58K73J5j27OQ0j43K31k32J27J28j15J58k83
7911e7l0J44n3J32l94L93k18j83L59j4J10l4r7k30J54J16K5Q5j09j11j7j2j31
7934a72J29r6J87K0L5K0j50k36L54k38J74NR9k15K28P2j61l9J36j34j76J46K2
7957A0j2K7n6L06k75K30l17L95k43P4l52P5n1JL13r4J27k15L5p9Q1j57J56l0K53
$$ plain form
7792 177 15 -178 127 -182 -186 79 -62 -68 170 220 -96 -248 79 -71 -13 163 -270 -30 114 -1 -75 6 -37
7815 -37 -23 -53 -184 68 -58 -296 56 -184 -141 -34 -319 -327 34 42 -49 -3 -224 -316 257 -137 -252 -13 168 -103
7839 -103 201 4 191 53 -10 140 127 247 3 -14 39 -34 -47 87 -218 25 -15 75 -49 38 -25 208 10
7862 10 105 -71 -219 53 301 338 -65 -23 157 -18 -26 88 30 88 119 92 17 -129 -140 94 -145 -89 58 -41 -89
7887 -89 113 -135 -82 -8 -32 32 102 191 110 -17 -175 98 113 -14 -8 72 -71 160 -72 55 183 68 226 -57
7911 -57 -87 57 4 136 -258 135 -83 -266 93 79 189 155 58 -172 -18 98 123 208 99 -12 -29 -41 -172
7934 -172 -43 -139 48 68 103 123 -27 -263 91 -147 27 32 131 -84 144 216 55 16 152 18 -158 -12 10
7957 10 -2 25 -31 275 0 230 -87 308 65 139 -213 -138 -189 -188 125 31 158 -57 -22 -101 -20 -177 -21 -51 202
7982B02m85J9K54p3J46N4j58qL7j34J07Q4J28N6j09k73J61o8J55j19J70k26mJ35
8006E1r6L2j86K77j23o5M7j32L58j68Op2Mn8L8P3m1J39j07j32j65L10P4n8N3K3
8032H2PJm9j92J42N9k40N8J01K08j59J3K03l85M7R5j57L07K3j95k0N8j34J96j06
8057c7J62l90L89k3n1J59o9m58J47J46K29l29R4J91m55L25j07r2K25P5J45m66
8079a90Q8K18j77Q1j7k4k54L15k02K26j50J24J4K2j23l1k4Ll7L46l20j06O3N5
8103a00K36j86m5K44k65M9J01j45K18J88l23j08j25K23L21l56N7J05j52J72J7
8124A26j39R9K2j80j04N6K31k79N2k2J09o3K26j95P9Q7q4k63N1K69j23J90n9j85
8148i9M5K90jk91L69l18k21M62j54k55J08j18P0k65K39K30l2j72M05n73L69k19
$$ plain form
7982 202 -283 -264 -10 -83 63 117 -41 -49 -12 -146 -39 45 173 229 120 -153 8 -60 95 -24 146 -80 -84 51
8006 51 -45 -13 -199 78 -45 -110 -63 -195 163 -5 1 -71 -67 -125 -87 -14 -55 84 -23 -155 -320 -10 64 6 59 82
8032 82 89 90 41 -151 -9 50 -190 -132 -31 177 18 31 234 -151 -104 -9 -166 141 164 -31 -51 7 -127 69 -37
8057 -37 125 -265 124 101 50 209 140 -318 -171 -25 204 -125 -31 160 -295 30 -77 -169 56 131 276 -190
8079 -190 -102 116 -61 20 3 -21 -275 40 -162 64 -86 38 52 74 -49 -80 -104 -101 -138 208 -112 -218 -155 -100
8103 -100 136 -50 -95 149 -116 -67 34 -111 107 295 -28 -136 -261 -38 283 -73 -16 89 -63 109 126
8124 126 -13 86 108 -72 -176 -120 111 -168 -116 -138 -29 -92 134 -61 18 105 21 -242 -191 78 -45 145 86 -99
8148 -99 -54 236 235 -56 313 -5 -226 236 82 -173 -65 -183 -113 -378 -139 91 59 -113 292 -281 88 -131
8170a31J80N5j82Q5l4q6J62j18J20Qj6r5j27J39J33j34k07R9K08K26l41
$$ plain form
8170 -131 49 104 -78 7 -27 -113 49 -69 51 59 43 -52 -179 -40 93 -41 -248 -149 59 285 -56
8191e6
$$ Imaginary data points
##PAGE= N=2
##DATA TABLE= (X++(I..I)), XYDATA
0@%%%%%%Qq%qJ6j6J6k1K9m0M8n6P2q6J02j20J41j66J93k26K63l05L52m01M57n21
32b77N91o69P55q49R53j067J192j329J477j641J818k010K224k458K712k990L294
49A726l626L995m403M854n357N923o564P293q132R110j0271J1673j3401J5597
63H417j8487K2473k8342L7829n5633R9963m04240o65300R81098L92079m19788
74d9931K8294J10226m59258Q0867N58797r1809m17991J08079J06037j34234Q9301
85g1622J83877r1484q6560K5735J3388O1371L0350j54330l1322J40381o7074j21213
97a68503J87189Q0777k32543J2187K64706l0189j36785Q3905K230j09351Q2576
108C6199K5895j92912K5207K30491n6558k21436R769J58035J29997M5891j22171
$$ plain form
0 0 0 0 0 0 0 0 8 0 0 -8 8 -8 8 -13 16 -24 24 -32 40 -46 56 -64 77 -89 104 -122 141 -164 188 -213 244 -277
32 -277 314 -355 400 -449 504 -563 629 -700 777 -864 954 -1056 1168 -1290 1422 -1568 1726
49 1726 -1900 2095 -2308 2546 -2811 3112 -3452 3841 -4291 4819 -5452 6221 -7180 8417
63 8417 -10070 12403 -15939 21890 -33743 66220 -338020 -1003320 -22222 369857 -49931
74 -49931 -21637 88589 -370669 -289802 268995 177186 -240805 -132726 -26689 -160923 -71622
85 -71622 112255 20771 -65789 -40054 -26666 34705 65055 -89275 -120597 19784 -47290 -168503
97 -168503 18686 99463 -133080 -120893 143813 113624 -23161 60744 62974 -46377 36199
108 36199 62094 -130818 -105611 124880 68322 -153114 -143345 14690 144687 190578 68407
119F8407j38299L9362P3994L3907P9869n8731k45720m6103J98234P1822k7798
130D8944L1141j01633j55646J45540K29990q8219j72802L5442M1825n3818M1478
141B242Q8638n6129j01313L9279J29941M5158j02277q6458Q6118Q7813q4794o6630
153a8412M2205m3234o1426R3206K1181j35283M3323J53153r8782j20111J54662
164C0482R0211j36114k5737Q7935l6794m1353N1640j4881m0664O4261L1493p0278
176i799j8380M2316J2149J4015N992n3180m8828O403K9105M3059K809q8984m2400
189a05723R6191N0044p0168l53O3507l6506m5595M6372j97m7346M8306L7707r1818
202e5579m1783R2422L9807n5657j2448L4301M744k0904j2920K3017L3098l1077
$$ plain form
119 68407 -69892 -30530 43464 77371 157240 98509 -147211 -193314 4920 76742 48944
130 48944 80085 -21548 -177194 -31654 198336 110117 -62685 -27243 14582 -39236 2242
141 2242 90880 34751 -66562 -27283 102658 147816 45539 -40919 45199 133012 48218 -18412
153 -18412 23793 -19441 -80867 12339 33520 -101763 -58440 94713 -4069 -124180 30482
164 30482 120693 -15421 -41158 46777 9983 -31370 20270 5389 -35275 28986 60479 -9799
176 -9799 -28179 14137 26286 40301 46293 -6887 -55715 -49312 -20207 22852 25661 -63323 -105723
189 -105723 -9532 40512 -29656 -30009 33498 -3008 -48603 -2231 -2428 -49774 -1468 36239 -55579
202 -55579 -97362 -4940 34867 -20790 -33238 1063 5807 -15097 -28017 -5000 28098 -2979
214b979m9923K6131K3490l8611J8050O2330n1529q2928N6036P6221l2213k5823
226b1748J0641m5881k1432Q6361N1408p0418o3016J7887L7834L2433K5804j5977
238B3896n0607l3244J7527O8872N2295n0241r4964j4203N5932N2197K4120l5103
250A6477q3078j8312P5103M4887j8654j2315k7876m6075K9336P6198l499n1646
262a9454n077N313j4300K2991M0852j2809l5121m012N279J824J7369K0085m887
275A8053l2042l0368J3932M5727J2171k5024r010j1745l7336J6881Q5319J7269
287F3827q5352n2702K8829M2236L6628J9171n0313q0406K235Q5303N7020k2894
299D3582o4579m5045J7317N9310M2784o466n3687n8902J0075P7185M0187l9990
$$ plain form
214 -2979 -52902 -26771 -3281 -41892 -23842 38488 -13041 -95969 -39933 36288 4075 -21748
226 -21748 -11107 -56988 -78420 7941 59349 -11069 -74085 -56198 -18364 14069 39873 23896
238 23896 -26711 -59955 -42428 26444 78739 28498 -66466 -80669 -24737 27460 51580 16477
250 16477 -66601 -84913 -9810 35077 16423 4108 -23768 -69843 -40507 35691 32192 -19454
262 -19454 -24531 -19218 -33518 -10527 30325 17516 -17605 -21617 -16338 -14514 2855 22940 18053
275 18053 -13989 -44357 -30425 15302 27473 2449 -6561 -18306 -55642 -38761 46558 63827
287 63827 -21525 -74227 -45398 -3162 33466 52637 2324 -78082 -75847 9456 66476 43582
299 43582 -20997 -66042 -48725 10585 53369 46903 -6784 -65686 -55611 21574 61761 21771
311B1771m8447j2198N024K8376M1705l688m9620k7191J5689L1424K2702q341l1119
324a3913r805J3488M881L755J6111l186k3788k211R969k652R467K2412q700l3943
338a8115j0907K0200K5531R649j5406k8072j1704J0470K2590K6142o917n0121
350b6660k3328L9033L5351o170j3502j5396k4520O952M4971J7201k9932k9082
362b5082m578J6898K7026O609k0538j6726l041P589K2003J1844k3526k1319J3069
375i772J1176q054M121N899j5016o931J2215J975m238L328j819k202O978m308
389f648j3007J0430J5721j2113r235R837n518q555J9245J5106j3944j2195P08
402a0168L067J1865J0447j0410j3631m924p713R095K8152o758l3558J408J6323
$$ plain form
311 21771 -26676 -38874 -33850 -5474 36231 32543 -17077 -44268 -28579 2845 25547 17206 -13913
324 -13913 -23718 -10230 -5349 -1594 14517 11331 -12457 -14668 -4699 -7351 2116 24528 15828 -18115
338 -18115 -29022 -8822 16709 26358 10952 -17120 -28824 -18354 4236 30378 23461 -26660
350 -26660 -49988 -10955 24396 18226 4724 -10672 -35192 -28240 16731 33932 4000 -25082
362 -25082 -29660 -12762 14264 20873 335 -16391 -19432 -11843 10160 22004 -1522 -22841 -9772
375 -9772 1404 -6650 -2529 3370 -11646 -18577 -6362 -4387 -8625 -5297 -7116 -9318 -2340 -6648
389 -6648 -19655 -9225 6496 -5617 -14852 -5015 -10533 -19088 157 15263 1319 -10876 -10168
402 -10168 -7101 4764 15211 4801 -8830 -13754 -21467 -12372 15780 9022 -24536 -23128 -6805
415f805n914R215K4384j7324l4452R491K6224L774j429n810j5566J926J6546P018
429A1278Q666m03k7093o452L2466O175k4209L148N378k8543q14L6529P95k3423
443f502L637R15j1717J6721K4572m436j2550j4203j7532J7749L9997m364k7460
456D827l304j3014j0263M8724M2095l6550m5016j793O494K2638M0362j1663n7158
469a3621k0713J7880K6295L7726K13n7838k4287L6919K2901N973R261l4562m7310
482d1163K8382N1637j2163k4048k045j7109M734M5801Q838l2515m787j006j2045
495g489K9827K9218l6803l0510J7138n606r103M0253J4048m3952j3972J2720r281
508a3512J6605L8636j8658m3321o176j388J0057N0506J1703n4626k1615J9829
$$ plain form
415 -6805 -12719 -3504 20880 3556 -30896 -21405 4819 8593 7164 1354 -14212 -12286 4260 11278
429 11278 19944 19541 -7552 -14004 18462 24637 428 3576 8954 -19589 -20403 16126 16921 -6502
443 -6502 -2865 -1950 -13667 3054 27626 23190 10640 -3563 -21095 -3346 36651 32287 4827
456 4827 1523 -11491 -21754 26970 69065 32515 -12501 -14294 -7800 14838 55200 43537 -13621
469 -13621 -34334 -16454 9841 47567 47780 -10058 -34345 2574 25475 31448 40709 6147 -41163
482 -41163 -12781 38856 26693 2645 600 -16509 -11775 34026 42864 10349 5562 4556 -7489
495 -7489 22338 51556 14753 -15757 1381 -4225 -13328 26925 40973 -2979 -16951 -4231 -13512
508 -13512 3093 41729 23071 -20250 -26426 -27814 -17757 32749 44452 -10174 -31789 -11960
520a1960M832K9257M4700l5161o6882P112L5214P575J2807p488n0718j3438L9847
533d303J6145l770J159k9281k1239M4811K7428l6228j6048J1060j4509Q151M3019
546B6395j0686m7026M753K5767K178J4092R000l1222j8568J2485N64J0158K2779
559B0669k2550l6199J4546J2242j3095K7980L0085m0268l2421K5206P269o682
571a3218K6834O30m1812p841J6158l412J6769K5588k5858k7269J8583L220o167
584a7795L3627M332n0435m003L5601j0303j2457K6306n465k9014J9326J8937k2561
597a3904k369J6808j1163j623J6401j9281k1350K1795R125j5903J3971J0622k6634
610b3505j615K6381n237n384K0759q679k7075J0550J0610j2224J2302J2459k3053
$$ plain form
520 -11960 -7128 22129 66829 31668 -35214 -28102 7112 14687 27494 20006 -30712 -44150 -4303
533 -4303 11842 8072 9231 -20050 -41289 3522 30950 -5278 -21326 -10266 -24775 -16624 26395
546 26395 15709 -31317 -26564 -797 1381 15473 24473 -6749 -25317 -12832 -12268 -2110 20669
559 20669 -1881 -38080 -23534 -11292 -24387 3593 33678 -6590 -39011 -13805 -6536 -13218
571 -13218 13616 14246 -27566 -35407 -19249 -22661 -5892 19696 -6162 -33431 -14848 -11628 -17795
584 -17795 15832 20164 -30271 -34274 1327 -8976 -21433 4873 -592 -29606 -10280 8657 -13904
597 -13904 -16273 535 -10628 -12251 4150 -15131 -36481 -14686 -5561 -21464 -7493 3129 -23505
610 -23505 -25120 1261 -3976 -9360 11399 2720 -24355 -13805 -3195 -15419 -3117 9342 -13711
623a3711o873J8467j0717q277L1163P348l0730l366O947j5574J1187L3254o340
636A2778k9568p129K80J1122L3034O686l3037j6189O045J779K0506K2875k6469
649B713l5617J2163J9373j150R779M340k5503q801K4585R378q301r12o896p372
663a2221J3234P416j0611N86K301j4075L874K4107l896j9671N015M223j2235P772
677d181J9595p628j6672j413j597K610J8770R254j3304j4071r250R13K6074K4579
691C3679j7391l1440o951O310J6216K9783J759m2749k7989K1289L1702J2702o524
704B0396k7702k3269J1682K9106J2888p637k3947k0802J2225K9994O379j5141
716D172j1039q697j52K1696J7154j3543j9529l52O980P623R108r97j2854q930
$$ plain form
623 -13711 -20584 -2117 -12834 -21111 10052 17400 -13330 -16696 -9749 -25323 -14136 19118 12778
636 12778 -16790 -23919 -23639 -12517 20517 27203 -5834 -22023 -15978 -14199 6307 29182 2713
649 2713 -32904 -20741 -1368 -2518 7261 11601 -13902 -22703 1882 11260 2959 2047 -4849 -12221
663 -12221 1013 8429 -2182 -1596 705 -13370 -9496 14611 10715 -8956 -3941 282 -11953 -4181
677 -4181 15414 7786 -8886 -10299 -11896 -9286 9484 18738 5434 -8637 -17887 -16974 9100 33679
691 33679 16288 -15152 -22103 -15793 423 30206 31965 -10784 -38773 -17484 14218 26920 20396
704 20396 -7306 -30575 -18893 10213 23101 15464 -8483 -29285 -17060 12934 19313 4172
716 4172 -6867 -15564 -15716 5980 23134 9591 -9938 -10290 -3310 4313 13421 12424 -430 -9360
730i360J647P205P951K822p770q703j248l3M015J3192N083j4571j5898j12J2151
745c629J4181O436j1870k0488n538J6035K1165P912j4774k4758n399J9647K1066
758A9986J455j4702k0261p825J5074K4828L713k1842j8741L505J4887J2378K320
771A4775j1023j6999m244J5641J4859l217j4400q439M738Q563K889J900j59p448
785b564m590Q502P385n140l686M366k501q052K913P651k56k993n4j717l773J469
801c040P110M102o615j0662j767Q929N621k241j341k971o983L920J4840M380j0986
816B296o872L376L592K771K739k738p596k413L840N229K339m361l844K088J275
831A721k243K684L984m878n054K844J742l128K049N511p14l766k525K341N245
$$ plain form
730 -9360 -7713 -508 7443 10265 2495 -6208 -7456 -7489 -3474 9718 14801 230 -15668 -15780 -3629
745 -3629 10552 16988 5118 -15370 -20908 -4873 16292 24204 9430 -15328 -20727 -1080 19986
758 19986 21441 6739 -13522 -21347 -6273 18555 22268 426 -18315 -14810 77 12455 14775
771 14775 3752 -13247 -17491 -1850 13009 9792 -4608 -13047 -8309 254 3143 5043 4884 -2564
785 -2564 -7154 1348 8733 3593 -93 4273 1772 -6280 -3367 4284 4028 1035 981 -736 -4509 -3040
801 -3040 4070 8172 1557 -9105 -10872 -1943 3678 1437 96 -2875 -9858 -5938 8902 13282 2296
816 2296 -4576 -1200 2392 5163 7902 5164 -2432 -4845 -1005 4224 6563 2202 -1642 446 1721
831 1721 -522 2162 6146 1268 -3786 -942 800 -2328 -279 5232 4518 752 -1773 568 5813
846E813M050j045m523m378k142M299R055K255j1001r264L022Q407P347K383p647
861F631j1227k863J0009J2000O83j1835j2245r87J0903J1087K968q158j3350m513
875a0897J3227J6049N10j3163j2036m94Q123J0900L771q681j3928m266J0839J3934
889A3888Q06r419q056k794L185Q135O484l943j1423o924L970Q710L755L7k858
904C553q212o746O600J4506K487r609o850m412j506J0447J3397k787j6944j1190
918a7266N056J5793J0978n257j4527r677k30J2599J7843k744k4931j2981J2288
931a3056J4459O102p2j3826j8389N667K4249R915j0418j4377j0544M382J8132
944B224R284p303j1658j0740p03J7600J4678j0416j3674r7j601J031J4259M417
$$ plain form
846 5813 9863 8818 4295 -83 -2225 2074 11129 13384 2383 -6881 -3859 4548 11895 14278 6631
861 6631 -4596 -7459 2550 14550 15233 3398 -8847 -9834 1069 12156 15124 6966 -6384 -10897
875 -10897 2330 18379 18889 5726 -6310 -6804 1319 12219 15990 7309 -6619 -10885 -46 13888
889 13888 14694 5275 -2781 -5575 -2390 5745 12229 8286 -3137 -10061 -6091 2619 6374 6411 3553
904 3553 -4659 -11405 -4805 9701 12188 2579 -4271 -8683 -10189 258 13655 10868 -6076 -17266
918 -17266 -12210 3583 14561 9304 -5223 -14900 -15130 -2531 15312 12568 -12363 -25344 -13056
931 -13056 1403 7505 7433 -6393 -24782 -19115 5134 15049 4631 -9746 -20290 -15908 2224
944 2224 11508 4205 -7453 -18193 -18896 -1296 13382 2966 -10708 -10805 -12406 -11375 2884 7301
958G301j3394n968K421k772M560J1774k139q820n59l192j835J4763Q061j3132
972b931p266K388l285O045J5686o327j8484J046Q476K750P482J05j7013m176J5096
987d08M898j724J719j2488j2680J8021J8302j0749j0536k85o945M036K2186J802
1001A5149j9555n266K457l31J3444Q755j4267q953O204k557J252J5690j537j5944
1015e459M831O230j1691K208J6426m856r906M738m244q558J1781R984p585k199
1029A700r47j0351M937J8292m408j1746N185j436r347J1757J1066j4555n725J1801
1043F223k293o403Q815j011r856P247O834r186m21L132r555L028J6032n448j3283
1058f145O839J056j0358J0959J3392j2661r418Q211l892n377J3016M287r697J92
$$ plain form
958 7301 -6093 -12061 -9640 -12412 -7852 3922 1783 -7037 -7596 -10788 -12623 2140 10201 -2931
972 -2931 -10197 -7809 -11094 -5049 10637 4310 -14174 -13128 -4652 -1902 5580 5685 -11328 -15504 -408
987 -408 4490 2766 4485 -8003 -20683 -2662 15640 4891 -5645 -5930 -12875 -8839 13347 15149
1001 15149 -4406 -9672 -7215 -7546 5898 14653 386 -8567 -2363 -4920 -3668 12022 10485 -5459
1015 -5459 -628 5602 -6089 -3881 12545 7689 -2217 2521 -1723 -10281 1500 11484 3899 1700
1029 1700 753 -9598 -4661 13631 9223 -2523 2662 1226 -8121 3636 14702 147 -5578 6223
1043 6223 3930 -2473 6342 5331 -4525 2722 9556 370 -51 3081 -6474 -3446 12586 7138 -6145
1058 -6145 694 1750 -8608 2351 15743 3082 -6336 1875 -2017 -7394 5622 9909 212 404
1072D04r83j0156P264J4898l987n365K242j2667p855K0992J2090j2784m903j613
1086b423j3180N537K4093Q2j5293l663m178l797J7703J1420j5638r420M065l275
1100g967N237J5072p385j6932O092R315l263L773J889j4798j594J6977J429p919
1114g4J398p185q212J4661J2922j0554o702J604q346K63J9308L718j4603l845
1128e647k46n394R195J4313m775r841k757n945K347J8195M866j2973n213k006
1142e881o843J1518J9453p643j7623j17J450P98J3949O618j6817j1077N687O045
1156d83O161M905j1083j2156P022R436J049K221n057j4791L393J9025K371j0241
1170A772l675m067k488J3390J1275r982j1385j185O44O973J0744l676j1689k261
$$ plain form
1072 404 -579 -10735 -3471 11427 7440 2075 4317 -8350 -16205 4787 16877 4093 -810 -2423
1086 -2423 -15603 -10066 14027 14109 -1184 -4847 -9025 -12822 4881 16301 663 -8757 -4692 -7967
1100 -7967 -2730 12342 4957 -11975 -5883 3432 169 3942 5831 -8967 -10561 6416 7845 -74
1114 -74 1324 -5861 -14073 588 13510 2956 -3746 -2142 -10488 -10225 9083 12801 -1802 -5647
1128 -5647 -5893 -11287 -2092 12221 7446 -2395 -5152 -11097 -8750 9445 14311 1338 -3875 -5881
1142 -5881 -12724 -1206 18247 10604 -7019 -7136 -5686 -4888 9061 15679 -1138 -12215 -6528 -483
1156 -483 5678 10583 -500 -12656 -5634 3802 4851 7072 2015 -12776 -9383 9642 12013 1772
1170 1772 -1903 -5970 -8458 4932 16207 6225 -5160 -6345 -5701 1272 12016 8340 -3349 -5610
1184e610J234P21Q851O040j0025p385L942n0k5Q918J714r698l668K521M03N397
1200C280N855n269p184P58M41K441Q724q40j1319k578N955K058K111K926p030
1215C29p923N367P949l75k149l844n287K984Q202O79m697k984l173J114Q567K892
1231G651p036m045K643J230J794M055j910n565L81K320k63J862O12l569k95K050
1247A915k280j124M335M43l290L9j06l363J285N579K77l822k415r16K388M354
1263C299J554k801l205k320P22O939L389o344n572J384K263J547L334m29o448
1278b688l838M157M981N12k388m065j437J277K644K899j95m739l547K764L651
1293a2l00O87K32l535l416L263M891l11j413k791j912k08K906M091R42m651n656
$$ plain form
1184 -5610 -4376 -3655 5196 11236 1211 -6174 -2232 -2282 -2307 6611 8325 -1373 -5041 -2520 -2117 3280
1200 3280 9135 3866 -3318 -2560 -2119 322 9046 8206 -3113 -5691 264 2322 4433 7359 329
1215 329 -7594 -2227 5722 5347 3198 -646 -5933 -2949 5253 5932 1235 -1749 -4922 -3808 4759 7651
1231 7651 615 -3430 -787 443 2237 6292 4382 -1183 -802 1518 1255 3117 3729 160 -135 1915
1247 1915 -365 -1489 2846 3289 -1 38 -68 -3431 -2146 3433 3710 -112 -2527 -3443 -1055 3299
1263 3299 4853 2052 -1153 -3473 -2751 4188 7577 1233 -4339 -2955 -692 855 4189 3760 -2688
1278 -2688 -6526 -2369 2612 3124 736 -3329 -4766 -3489 -845 2054 1859 -2880 -6427 -3663 -12
1293 -12 -312 375 607 -2928 -6344 -3081 1810 1499 86 -2705 -4617 -4825 -1919 2172 3114 -1537 -7193
1310g193L62N615L696p51l035n386l726M843Q410P30n515o845k040N129P812K915
1326E021n264q158k603M943R332L640p064q251j811M727P208M347m449q903l955
1341a1240N503Q239K199m667o990l422M059O322K671j660o166m768K473O783L509
1356B845k533l220l096r63M105N637j46l874l415j426K240M898K620k017m523
1371b868l945R51O394M899k915o303k776N69M049O782Q04p951o975K291P151M804
1387D961J82n907p028J36P586O152M41o169q223R34Q609M557j474l514m747l310
1403f814N781Q583k106p034j792N49J329M383J744m134l115J0J100K794K332l460
1419A50j895J872l78j943M515K301n197j080L351j946q74N008R5n520l57K767
$$ plain form
1310 -7193 -6831 -1216 2480 1729 -1306 -6692 -10418 -5575 2835 3565 -1950 -8795 -10835 -5706 2106 5021
1326 5021 -243 -8401 -11004 -6061 3271 6911 -153 -8404 -10215 -5488 1720 6067 1618 -7285 -11240
1341 -11240 -5737 2502 4701 34 -6956 -10378 -6319 3 2674 1014 -5152 -9920 -7447 -664 2845
1356 2845 312 -2908 -6004 -6967 -2862 2775 2629 -1245 -4660 -6086 -3846 1052 3672 1655 -2868
1371 -2868 -6813 -5862 532 5431 2516 -3787 -6563 -5994 -1945 4837 5641 -2310 -9285 -6994 157 4961
1387 4961 5143 -764 -7792 -7656 -70 6082 6523 354 -7869 -6935 1674 6231 4757 1243 -3504 -6814
1403 -6814 -1033 7550 5444 -1590 -3382 -2833 -1504 2879 4623 489 -2626 -2616 -1516 1278 3610 150
1419 150 -1745 127 -251 -2194 2321 4622 -575 -1655 1696 -250 -1124 3884 3979 -1541 -1898 869
1435H69K21J935J542m953l408L383J273J409K611m199p558L330P308j123j018
1450A622N88n659k858P721L878l607j468p01l964K572O410j959k868J740k576
1465a129k663N066K503m442O16K586n404j523N909L43k714K334j447n757L149
1480b573N053k309j87K164o315k010Q393J238n779J630J276n123L579O369m763
1495F43m828L975J79j128N711j551q814J703N535j550K166L094r560n252R529
1510a48M295l606K466j396j0398J430J1436N51l128Q29o020m936Q329O202l511
1525B395P15j502r069J914J1484j359m211L197m224p776P869Q336n494k381K187
1540B081o042j519R861J205o501P93j07m513O739N469q044l454N843j493o37P896
$$ plain form
1435 869 1090 3025 4567 -386 -3794 -411 862 2271 4882 683 -6875 -3545 3763 2640 1622
1450 1622 2210 -3449 -6307 1414 5292 1685 217 -484 -4448 -1876 4534 2575 -293 1447 -1129
1465 -1129 -3792 1274 3777 -665 -49 2537 -2867 -4390 1519 1862 -852 1482 35 -5722 -2573
1480 -2573 2480 171 -16 2148 -4167 -6177 2216 3454 -2325 -695 581 -4542 -963 5406 643
1495 643 -4185 -210 -31 -1159 4552 3001 -5813 -4110 1425 -125 2041 5135 -4425 -9677 -148
1510 -148 4147 541 3007 1611 -8787 -7357 4079 4630 1502 2331 -3689 -8625 -296 5906 2395
1525 2395 3110 1608 -7461 -5547 5937 4578 367 3564 -660 -8436 -567 7769 2275 -106 2081
1540 2081 -3961 -5480 4381 5586 -915 -122 -229 -4742 1997 7466 -578 -4032 1811 318 -319 7577
1556G577l199j1444L322Q887j195M63J213r512m887J0886O176l457k01n335r304
1571a0010O421J2464j253n166j060p710k569J3028O607p919l005m92o009L934
1585b739J1204j775p021J161j828m124P932N247p272j627L273m457o43Q243j035
1600D539p019K593K004m596L048M803p002k444N913k98k261M478k742p951N067
1615a868O885k752j037J505p744k602J1101M650o277k051k192m996N815J0014
1629H451l167o092q44l600L61R730K419q426j518J368l852K918Q590l850o395
1644c907L082M91l671M160L654m555q65K716l464p02N023p47l070L430n08n303
1660d236L713M377m669j684M325k255l173M447M51n354J965L672k332o1J838m040
$$ plain form
1556 7577 4378 -7066 -3744 5143 3948 4411 5624 -3888 -8775 2111 8287 4830 4629 -706 -10010
1571 -10010 -3589 8875 7622 2456 1396 -6314 -8883 4145 10752 2833 -172 -664 -6673 -2739
1585 -2739 8465 6690 -331 830 -998 -5122 2810 8057 785 -842 2431 -2026 -2669 5574 4539
1600 4539 -2480 113 2117 -2479 569 5372 -1630 -4074 1839 1541 -720 3758 1016 -6935 -1868
1615 -1868 5017 2265 1228 2733 -5011 -7613 3488 8138 1861 -190 -2382 -7378 -1563 8451
1629 8451 5284 -808 -1652 -5252 -4891 4839 7258 -1168 -2686 -1318 -5170 -2252 6338 2488 -3907
1644 -3907 -825 -334 -4005 155 3809 -746 -1611 1105 -2359 -3061 1962 1215 -1855 1575 1067 -4236
1660 -4236 -523 3854 -815 -2499 1826 -429 -3602 845 1296 -4058 -2093 1579 -753 -814 1024 -3016
1676c016j650N749J051l179J144j685m232L554N958k729l039J964k959j516N756
1691A171K568m512p74Q17l015J262M428j641k488J828j733l222M126L131k660
1706g14m26R06l912m12N598N21k992lj090k409L716M358k817k310M09j447J052
1723a972N335q21n586l22J938K1K390J906m382l670L107K654M30R71k598m029
1739d628J121M436L63j97o51m143j130N297L451k485j218q59k766J534N248M88
1755C861l064j794j183K07L222K318j801j803j213j402K665M452j208l705r37
1770a385j99N4L852K465l558l801K62K136K372K261j337m489j262K235K890K708
1786E204j479n258j787L191K824J272l4l484m063K068N318J038k075k986k293
$$ plain form
1676 -3016 -4666 1083 2134 -1045 99 -1586 -5818 -2264 3694 965 -2074 -110 -3069 -4585 1171
1691 1171 3739 -773 -1547 -730 -3745 -2483 1945 304 -2184 -356 -2089 -5311 -1185 1946 -714
1706 -714 -1140 -234 -4146 -4558 1040 1561 -1431 -1434 -2524 -4933 -1217 3141 324 -1986 -1577 -3024 -1972
1723 -1972 3363 2542 -3044 -3366 -1428 -1407 983 2889 -1493 -5163 -2056 598 1028 1999 -599 -4628
1739 -4628 -3507 929 1292 1095 444 -3699 -4829 468 3919 1434 216 -643 -3409 -1875 3373 3861
1755 3861 797 -997 -2180 -1973 1249 3567 1766 -37 -1250 -2652 13 4465 3257 -448 -1385
1770 -1385 -1584 -1530 2322 4787 1229 -2572 -2310 -174 2198 4459 3122 -1367 -2629 -394 2496 5204
1786 5204 3725 -1533 -3320 -129 2695 3967 3933 449 -3614 -1546 3772 4810 2735 -251 -2544
1801b544L8M125K560j278k993k395L72L397K801j131k783j304n68J833L088L12
1817C530k979j878K93R39J733J487j253k572r50P59K005J533p17k427j817N80
1833a734J342J759O81j754k791j05K522K084K48j399l005o86K179K438P68j466
1849A081l033j235K069K968M33j621j724j119N64L181Q57k154j895m33Q42J042
1865a77J260q20j842l81L12J572J115n52j593J85L68n47P40J514r10j331N31L85
1883a71o0O44O36p78j240K13K77J037O80j165j104q4p0O04J701J52k663j151J941
1902f01P77M04N16q19k288J57K493O31l8r75j569j63J641P20j37L55j118j779
1920a793J279K035n46q36O67j714j154K329J464j461k04J05j649N35K260k40q38
$$ plain form
1801 -2544 -2506 1619 4179 2901 -92 -2487 -2115 1282 4083 2952 169 -1135 -1703 130 3218 3530
1817 3530 551 -1327 -1034 -95 1638 3125 1872 -700 -1650 -891 1114 2647 1930 -497 -2314 -1734
1833 -1734 -392 1367 2048 294 -2497 -2602 -80 2004 2252 853 -2152 -2838 -659 1779 2547 1081
1849 1081 -1952 -3187 -1118 1850 2283 662 -1062 -2181 -1617 1564 2421 267 -1628 -2061 -1219 -177
1865 -177 1083 263 -1579 -1960 -1648 -76 1039 487 -1106 -921 -553 -1100 -360 1154 244 -1087 -556 -171
1883 -171 -231 413 1049 271 -969 -756 -479 558 1238 73 -1031 -1115 -1185 -581 1120 1272 -1391 -2542 -601
1902 -601 176 580 1096 277 -2011 -1854 639 1270 1232 257 -1312 -1475 166 886 749 1104 -14 -1793
1920 -1793 -514 1521 975 139 806 -908 -2062 267 1731 270 66 171 -1478 -943 1317 1077 239
1937B39J71j507n90L060J442k636o82O13r35J277K961j388l422K14P41M15K797
1954B770O19m172k280K048J189J533J708k629m548J507L326M95R33l78m687j366
1970c932M578J923o28R6k390l095K826L342r29o75K50l199o91M444J007k991Q5
1987B1K37k187J420L455j828k244J106q24k52K967L45l629j97J431j067K262K699
2004C715l724l474K700J600m93K672m9n749q51L858J622M10P88m116l768L224
2020a635L768J35J30j403n154J38N857R76k043O01k465l494L600M440k361j646
2036e56J035k038q30M008N29l000Q87M54k090K129J972l046j151L150q57j758
2052a162K809l15m076J506L154k087J38J874k758k326L518J537j548J459o60m394
$$ plain form
1937 239 410 -1097 -1687 1373 2815 179 -503 110 -825 452 3413 2025 -1397 -1183 -442 -27 2770
1954 2770 3389 -783 -3063 -1015 174 1707 3415 786 -3762 -2255 1071 1566 2499 2121 -2566 -3932
1970 -3932 646 2569 1941 2037 -353 -3448 -622 2720 1791 1116 1366 -1833 -2524 1920 2927 -64 21
1987 21 258 -1929 -509 2946 1118 -1126 -20 -844 -1096 1871 2216 -1413 -1610 -179 -1246 1016 3715
2004 3715 -9 -3483 -783 817 324 2996 2947 -2802 -3653 205 1827 2237 3025 -1091 -4859 -1635
2020 -1635 2133 2268 2398 995 -4159 -4021 1836 2812 769 1370 -1095 -4589 -989 3451 1090 -556
2036 -556 479 -1559 -2389 1619 2148 -852 35 489 -1601 528 2500 -546 -1697 1453 596 -1162
2052 -1162 1647 1332 -2744 -1238 1916 -171 -33 1841 -917 -3243 275 1812 264 1723 1063 -3331
2068c331R37M366j79q34J507l577l015M235L450j799l88j66m006K11N052K48k285
2085D26J084j988l150L376K988k533o30J866k672j234L528K13k100J739N12l118
2101a693Q74K166j385j57K682j759k359K775K1k375K226J523l197N5K462j596
2117B63j980K724M10k267J797M63l181K95K615p37n3J793l173k238L271K071j642
2134D31R66O54m469k19M735L32j586J462j835l278K350L262j129m42N95l045q80
2151b096L445N99j618J575q63l572J606L577j945p70J439j750j892L349J329k444
2167c1P06N21k007J102K511j545k161J769j98r79K335L16l770K38K897r83K76
2184I97J516k457k947K340J909m53P53p57l432J57L588Q50r30N64k156k660L012
$$ plain form
2068 -3331 -2394 1972 1793 959 2466 -1111 -4126 109 3559 1760 1372 1206 -2800 -2589 2463 2711 426
2085 426 1510 -478 -3628 -252 2736 203 -427 1439 -1233 -2467 1061 1274 -826 913 1425 -1693
2101 -1693 -819 1347 -38 -195 2487 728 -1631 1144 1165 -1210 1016 2539 -658 -603 1859 263
2117 263 -1717 1007 1417 -850 947 1410 -1771 -1476 1139 402 349 2142 -1031 -3269 2 2073 431
2134 431 1397 2051 -2418 -2637 2098 2430 844 2306 471 -2807 -457 2805 1676 1234 1829 -1216 -2096
2151 -2096 1349 1948 330 1905 1042 -2530 -924 2653 708 -62 1377 -373 -2265 1084 2413 -31
2167 -31 675 1196 -811 291 2802 1257 -904 865 667 -312 2023 2339 -1431 -1193 1704 721 997
2184 997 2513 56 -2891 -551 1358 905 1658 901 -2531 -2374 1214 2064 1134 1698 -458 -3118 -106
2201a06L124j291r22m26k261J61L302O38j731m00j040r81K200J849j342j351K69
2218c08j166K20K988l82k438k88P63o67J193J664j865j759J161L86L40J422n51
2235G13k518L26J539K44M35N33k311j419K140J386k63k65q20k541O09K432O96
2252I16j205m00j505J28J512J381j27j134r78n61R69K416m64j817k10J86k26J429
2270C10J122j675j086P20L40K29P54k30j111m62L29M94O61k7j402j43Q79k38M53
$$ plain form
2201 -106 3018 1727 805 379 -1882 -1721 1581 2219 488 88 -952 -1933 267 2116 774 -577 -308
2218 -308 -1474 -1254 1734 1352 -1086 -1374 -611 -1278 -85 1579 -286 -2045 -884 -498 -158 1264 713
2235 713 -1805 -1479 60 304 739 1272 -1039 -2458 -318 1068 805 540 -280 -2821 -2212 220 916
2252 916 -289 -689 -2194 -2066 -554 827 700 -434 -1412 -1973 -1004 1412 948 -869 -1079 -893 -1119 310
2270 310 1432 -243 -1329 -609 -269 -40 714 484 -627 -1089 -760 -266 395 368 -1034 -1177 -298 -536 -83
$$ [...]
8191a89
##END NTUPLES=NMR FID
##END=
