##TITLE=1H_Ser 6-5-i
 CDCl3, 8 sc, 
 5.08.2021
##JCAMPDX= 6.0         $$ Bruker NMR JCAMP-DX V2.0
##DATA TYPE= NMR FID
##DATA CLASS= NTUPLES
##ORIGIN= UXNMR, Bruker Analytische Messtechnik GmbH
##OWNER= root
$$ XWIN-NMR		Version 3.5
$$ Thu Aug  5 13:03:21 2021 Russian Standard Time (UT+4h)  she@DPX200
##.OBSERVE FREQUENCY= 200.131506
##.OBSERVE NUCLEUS= ^1H
##.DELAY= (6, 6)
##.ACQUISITION MODE= SIMULTANEOUS
##.ACQUISITION SCHEME= undefined
##.AVERAGES= 8
##.DIGITISER RES= 18
##SPECTROMETER/DATA SYSTEM= spect
##.PULSE SEQUENCE= zg30
##.SOLVENT NAME= CDCl3
##.SHIFT REFERENCE= (INTERNAL, CDCl3, 0, 15.7039)
##AUDIT TRAIL= $$ (NUMBER, WHEN, WHO, WHERE, WHAT)
$$ ##TITLE= Audit trail, XWIN-NMR		Version 3.5
$$ ##JCAMPDX= 5.01
$$ ##ORIGIN= Bruker BioSpin GmbH
$$ ##OWNER= she
$$ F:/spectra/data/she/nmr/H-F/1/audita.txt
$$ ##AUDIT TRAIL=  $$ (NUMBER, WHEN, WHO, WHERE, WHAT)
(   1,<2021-08-05 13:01:32.67 +0400>,<she>,<DPX200>,
      <created by zg, POWCHK disabled, PULCHK disabled
       configuration hash MD5:
       00 E9 B6 7A A2 85 ED C7 34 08 36 98 17 FE 4E 26
       data hash MD5: 16K
       FB E7 13 DC B6 9C 45 DB 06 CA 24 5F 99 63 16 0C>)
$$ ##END=
$$ 
$$ hash MD5
$$ 1B F3 74 73 86 B7 62 2B CF E6 21 4F F2 1F 49 3F
##$RELAX= 
##$RELAX= 
##$RELAX= 
##$RELAX= 
##$RELAX= 
##$RELAX= 
$$ Bruker specific parameters
$$ --------------------------
##$DU= <F:/spectra>
##$EXPNO= 1
##$NAME= <H-F>
##$PROCNO= 1
##$TYPE= <nmr>
##$USER= <she>
##$AMP= (0..31)
100 100 100 100 100 100 100 100 100 100 100 100 100 100 100 100 100 100 
100 100 100 100 100 100 100 100 100 100 100 100 100 100 
##$AQSEQ= 0
##$AQ_mod= 1
##$AUNM= <au_zg>
##$AUTOPOS= <>
##$BF1= 200.13
##$BF2= 200.13
##$BF3= 200.13
##$BF4= 200.13
##$BF5= 200.13
##$BF6= 200.13
##$BF7= 200.13
##$BF8= 200.13
##$BYTORDA= 1
##$CFDGTYP= 0
##$CFRGTYP= 5
##$CHEMSTR= <none>
##$CNST= (0..31)
1 1 145 1 1 1 1 1 1 1 1 1 1 1 1 1 1 1 1 1 1 1 1 1 1 1 1 1 1 1 1 1 
##$CPDPRG= <>
##$CPDPRG1= <>
##$CPDPRG2= <>
##$CPDPRG3= <>
##$CPDPRG4= <mlev>
##$CPDPRG5= <mlev>
##$CPDPRG6= <mlev>
##$CPDPRG7= <mlev>
##$CPDPRG8= <mlev>
##$CPDPRGB= <>
##$CPDPRGT= <>
##$D= (0..31)
0 1.2 0 0 0 0 0 0 0 0.06 0 0.03 0 0 0 0 0.0002 0 0 0 0 0 0 0 0 0 0 0 0 
0 0 0 
##$DATE= 1628154092
##$DBL= (0..7)
120 120 120 120 120 120 120 120 
##$DBP= (0..7)
150 150 150 150 150 150 150 150 
##$DBP07= 0
##$DBPNAM0= <>
##$DBPNAM1= <>
##$DBPNAM2= <>
##$DBPNAM3= <>
##$DBPNAM4= <>
##$DBPNAM5= <>
##$DBPNAM6= <>
##$DBPNAM7= <>
##$DBPOAL= (0..7)
0.5 0.5 0.5 0.5 0.5 0.5 0.5 0.5 
##$DBPOFFS= (0..7)
0 0 0 0 0 0 0 0 
##$DE= 6
##$DECBNUC= <off>
##$DECIM= 32
##$DECNUC= <off>
##$DECSTAT= 4
##$DIGMOD= 1
##$DIGTYP= 9
##$DL= (0..7)
0 120 120 120 120 120 120 120 
##$DP= (0..7)
150 150 150 150 150 150 150 150 
##$DP07= 0
##$DPNAME0= <>
##$DPNAME1= <>
##$DPNAME2= <>
##$DPNAME3= <>
##$DPNAME4= <>
##$DPNAME5= <>
##$DPNAME6= <>
##$DPNAME7= <>
##$DPOAL= (0..7)
0.5 0.5 0.5 0.5 0.5 0.5 0.5 0.5 
##$DPOFFS= (0..7)
0 0 0 0 0 0 0 0 
##$DQDMODE= 0
##$DR= 18
##$DS= 0
##$DSLIST= <SSSSSSSSSSSSSSS>
$$ [...]
##$SUBNAM2= <"">
##$SUBNAM3= <"">
##$SUBNAM4= <"">
##$SUBNAM5= <"">
##$SUBNAM6= <"">
##$SUBNAM7= <"">
##$SUBNAM8= <"">
##$SUBNAM9= <"">
##$SW= 20.0188882624521
##$SWIBOX= (0..15)
0 0 2 0 0 0 0 0 0 0 0 0 0 0 0 0 
##$SW_h= 4006.41025641026
##$TD= 16384
##$TD0= 1
##$TE= 0
##$TE2= 300
##$TE3= 300
##$TEG= 300
##$TL= (0..7)
0 120 120 120 120 120 120 120 
##$TP= (0..7)
150 150 150 150 150 150 150 150 
##$TP07= 0
##$TPNAME0= <>
##$TPNAME1= <>
##$TPNAME2= <>
##$TPNAME3= <>
##$TPNAME4= <>
##$TPNAME5= <>
##$TPNAME6= <>
##$TPNAME7= <>
##$TPOAL= (0..7)
0.5 0.5 0.5 0.5 0.5 0.5 0.5 0.5 
##$TPOFFS= (0..7)
0 0 0 0 0 0 0 0 
##$TUNHIN= 0
##$TUNHOUT= 0
##$TUNXOUT= 0
##$USERA1= <user>
##$USERA2= <user>
##$USERA3= <user>
##$USERA4= <user>
##$USERA5= <user>
##$V9= 5
##$VALIST= <valist>
##$VCLIST= <CCCCCCCCCCCCCCC>
##$VD= 0
##$VDLIST= <DDDDDDDDDDDDDDD>
##$VPLIST= <PPPPPPPPPPPPPPP>
##$VTLIST= <TTTTTTTTTTTTTTT>
##$WBST= 1024
##$WBSW= 4
##$XGAIN= (0..3)
0 0 0 0 
##$XL= 0
##$YL= 0
##$YMAX_a= 383821
##$YMIN_a= -292753
##$ZGOPTNS= <>
##$ZL1= 120
##$ZL2= 120
##$ZL3= 120
##$ZL4= 120
##$ABSF1= 10
##$ABSF2= 0
##$ABSG= 5
##$ABSL= 3
##$ALPHA= 0
##$AQORDER= 0
##$ASSFAC= 0
##$ASSFACI= 0
##$ASSFACX= 0
##$ASSWID= 0
##$AUNMP= <proc_1d>
##$AZFE= 0.1
##$AZFW= 0.1
##$BCFW= 1
##$BC_mod= 2
##$BYTORDP= 1
##$COROFFS= 0
##$CY= 11.3945322036743
##$DATMOD= 1
##$DC= 2
##$DFILT= <>
##$DTYPP= 0
##$F1P= 2.36226072786647
##$F2P= -0.459571619588291
##$FCOR= 0.5
##$FTSIZE= 0
##$FT_mod= 4
##$GAMMA= 1
##$GB= 0.15
##$INTBC= 1
##$INTSCL= 1
##$ISEN= 128
##$LB= 0.24
##$LEV0= 0
##$LPBIN= 0
##$MAXI= 10000
##$MC2= 0
##$MEAN= 0
##$ME_mod= 0
##$MI= 1.114404
##$NCOEF= 0
##$NC_proc= 0
##$NLEV= 6
##$NOISF1= 3.799351
##$NOISF2= 2.8
##$NSP= 1
##$NTH_PI= 0
##$NZP= 0
##$OFFSET= 15.70392
##$PC= 1
##$PHC0= -13355.47
##$PHC1= 13.40099
##$PH_mod= 1
##$PKNL= yes
##$PPARMOD= 0
##$PSCAL= 0
##$PSIGN= 0
##$REVERSE= no
##$SF= 200.130013532006
##$SI= 16384
##$SIGF1= 3
##$SIGF2= 2
##$SINO= 400
##$SIOLD= 16384
##$SREGLST= <1H.CDCl3>
##$SSB= 0
##$STSI= 0
##$STSR= 0
##$SW_p= 3612.71676300578
##$SYMM= 0
##$S_DEV= 0
##$TDeff= 0
##$TDoff= 0
##$TI= <>
##$TILT= no
##$TM1= 0
##$TM2= 0
##$TOPLEV= 0
##$USERP1= <user>
##$USERP2= <user>
##$USERP3= <user>
##$USERP4= <user>
##$USERP5= <user>
##$WDW= 1
##$XDIM= 8192
##$YMAX_p= 0
##$YMIN_p= 0
$$ End of Bruker specific parameters
$$ ---------------------------------
##NTUPLES= NMR FID
##VAR_NAME=  TIME,          FID/REAL,        FID/IMAG
##SYMBOL=    X,             R,               I
##VAR_TYPE=  INDEPENDENT,   DEPENDENT,       DEPENDENT
##VAR_FORM=  AFFN,          ASDF,            ASDF
##VAR_DIM=   8192,          8192,            8192
##UNITS=     SECONDS,       ARBITRARY UNITS, ARBITRARY UNITS
##FACTOR=    0.0002496,     1,               1
##FIRST=     0,             0,               0
##LAST=      2.0444736,     0,               0
##MIN=       0,             -292753,         0
##MAX=       2.0444736,     383821,          0
$$ Real data points
##PAGE= N=1
##DATA TABLE= (X++(R..R)), XYDATA
0 0 0 0 0 0 0 0 0 0 0 0 -8 8 -8 8 -14 16 -17 24 -26 32 -40 48 -57 65 -77 89 -105 120 -139 160 -184 208 -235
33 -235 266 -302 340 -382 427 -480 533 -594 660 -733 812 -899 991 -1094 1205 -1329 1465
50 1465 -1614 1779 -1960 2163 -2390 2647 -2937 3271 -3661 4119 -4669 5346 -6197 7306 -8829
65 -8829 11044 -14598 21240 -38083 180293 312421 224871 383821 314203 251852 309098 330874
77 330874 221043 270667 329502 247279 197739 283362 253555 187560 231648 252748 173360 187493
89 187493 236082 187371 148695 194271 178502 138247 168887 171040 112676 133553 167205 116759
101 116759 96532 137815 108411 70862 113283 114183 45792 60912 106886 60488 31917 70089
113 70089 44619 4295 49646 54506 -19712 -8412 49620 4613 -41826 2464 -78 -53230
125 -53230 -27630 -6224 -62466 -65001 -19464 -54703 -91845 -50173 -53888 -107202 -82340 -52874
137 -52874 -106246 -116334 -70310 -97258 -131393 -93009 -97397 -145937 -118927 -91540 -144633 -153092
149 -153092 -104909 -132932 -170624 -125830 -125893 -185726 -162356 -121613 -173595 -195937 -146142 -159695
161 -159695 -202872 -169877 -159042 -211656 -197732 -155096 -198413 -224678 -173661 -176710 -223885 -200513
173 -200513 -175640 -213285 -214796 -179731 -201780 -222107 -187020 -189309 -223209 -199790 -180581 -214453
185 -214453 -213589 -181606 -200271 -218313 -188044 -189535 -217567 -194797 -177811 -211332 -206304 -173235 -196467
198 -196467 -213130 -176504 -177887 -211185 -185124 -160510 -198029 -199282 -156953 -173783 -200384 -164128
210 -164128 -154117 -187783 -170274 -141855 -171974 -177105 -135381 -146340 -175948 -142332 -122617 -156668
222 -156668 -148941 -115754 -134378 -143955 -111114 -114697 -137017 -110128 -93883 -122082 -113601 -81634 -99511
235 -99511 -110489 -77504 -79143 -102476 -77536 -60653 -85781 -77780 -47920 -64657 -75416 -42014
247 -42014 -42396 -67540 -42468 -21435 -48509 -42953 -9017 -24136 -40169 -6788 278 -26443 -8747
260 -8747 16769 -5237 -6103 25123 14633 -1900 28354 37277 10514 23942 50837 32416 25303
273 25303 54133 50313 33944 57303 66960 44519 56341 79237 61826 56777 84572 80556 63261
286 63261 84983 95841 73399 82303 106058 89267 82534 109967 105966 86836 107758 119586 96782
299 96782 103115 127875 112501 101570 128625 128514 105990 123377 139097 117509 119182 142984 131293
312 131293 118563 141289 143130 121680 135473 152431 131271 128872 151826 142477 127752 146444
324 146444 149886 130742 140364 154142 135761 132295 152830 143477 128052 146129 149567 129168 136797
337 136797 150528 132664 127202 146102 138605 121796 137094 141842 120520 125455 140112 122609 114590
350 114590 133111 126983 108307 120640 127118 106304 107049 122657 108102 96430 112883 108594 89763
363 89763 99366 106082 86618 85977 100280 86928 74048 87835 85820 66935 74188 81459 63382
376 63382 61113 74015 61167 48668 61554 59851 41532 47472 55649 38092 33933 47644 36138
389 36138 22451 35325 34918 16419 21125 29627 13123 7876 20675 11308 -3229 7950 9441
402 9441 -9357 -6568 2483 -12879 -19378 -7613 -14866 -29286 -20526 -18017 -35105 -34157 -25053 -38381
416 -38381 -45363 -33930 -39936 -54525 -46864 -43320 -58638 -58859 -49635 -60651 -68333 -57567 -62019 -76196
430 -76196 -68906 -64245 -78886 -79354 -69869 -80057 -87941 -77915 -80540 -94218 -88311 -81786 -95501 -97280
444 -97280 -87226 -95947 -104166 -94032 -95429 -108264 -102857 -95393 -107408 -110579 -100030 -106158 -114930 -104597
458 -104597 -103557 -116024 -111065 -103183 -113139 -115811 -105136 -109227 -117455 -107545 -104480 -116361 -112109 -102677
472 -102677 -111430 -114025 -103105 -106321 -113697 -104005 -101038 -111434 -107581 -97696 -105010 -107718 -96883 -99389
486 -99389 -106548 -96888 -93150 -102766 -98525 -88708 -94731 -97274 -86851 -87838 -94331 -84867 -79797 -88119 -83891
501 -83891 -73737 -78888 -80899 -70635 -70321 -75509 -67371 -61142 -67976 -65125 -55157 -59015 -61156 -50685
515 -50685 -49690 -55544 -47290 -40665 -47253 -45221 -35508 -37422 -40421 -30780 -28346 -34464 -27493 -20035 -26322
530 -26322 -25197 -14482 -15723 -19358 -10390 -6737 -12602 -6914 1331 -3520 -3676 7434 6917 2885 10922
545 10922 14727 9652 14706 22923 18827 18203 28120 28511 23837 31351 35575 30285 35101 42625 38508
560 38508 37939 46860 46482 42256 49913 53561 48100 52529 60057 54984 54445 63058 62366 59110 66341 68541
576 68541 63238 68158 75134 69960 68843 77693 76883 73126 79641 81935 76369 80127 86624 82063 80117
591 80117 87331 87431 82868 87485 90199 84135 86450 92813 88672 85298 91073 91356 86854 89478 92187
606 92187 87141 87620 93006 89304 85308 89991 90222 84973 87599 90120 84652 83633 88758 85874 80758
621 80758 84108 84878 79448 81441 83794 77164 75768 81158 77467 71463 74803 75566 69355 70603 72694
636 72694 65781 63699 68702 64659 58943 62367 61673 55298 56627 58351 51513 49477 54102 49928 44259
651 44259 47478 46318 40003 41303 42801 36009 34636 38220 33858 28647 31769 30461 23665 25007 27258
666 27258 20200 17773 21267 17159 12353 14633 13061 6984 7882 9747 3225 -256 3533 257 -5391
681 -5391 -3703 -3999 -9887 -10078 -8604 -13815 -17183 -14655 -16657 -21793 -20642 -20158 -26431 -27162 -24844 -29604
697 -29604 -32690 -30303 -32064 -37138 -36247 -35548 -41076 -42095 -39289 -43670 -47253 -43877 -46061 -51586 -49434
712 -49434 -48060 -54329 -54875 -51204 -54943 -59233 -55630 -56875 -62349 -59651 -58114 -64216 -64360 -60200 -64270
727 -64270 -68072 -63804 -64139 -69571 -67370 -64557 -69539 -70211 -65713 -69513 -72699 -67904 -67958 -73000 -70372 -67462
743 -67462 -72149 -72531 -67863 -70627 -73613 -68413 -68277 -73001 -69948 -67142 -71089 -70624 -66297 -68493 -70651 -65471
759 -65471 -64950 -69383 -66688 -62486 -65979 -66135 -60835 -62027 -64720 -60100 -58282 -61881 -59840 -55110 -57890
774 -57890 -58241 -52219 -52965 -56114 -51362 -48211 -51639 -49798 -45015 -46842 -47468 -41894 -41653 -44783 -39963 -36410
790 -36410 -39841 -38003 -32539 -34632 -35362 -29238 -28837 -31960 -27462 -23026 -26443 -25403 -19571 -20912 -22298
805 -22298 -15862 -14942 -18472 -13672 -9336 -13014 -12081 -5502 -6575 -8626 -2428 -698 -4627 -615 4306
820 4306 779 1898 8327 6567 5110 11122 13056 9293 12658 17759 15170 15377 21576 20443 18494
835 18494 24341 26129 22471 25962 30810 28159 27932 33951 33333 30496 35890 38725 34758 37330 42631
850 42631 39567 38853 44700 44237 41252 45903 48839 44566 46327 51614 48634 47347 52939 52760 49124 53192
866 53192 55902 51867 52495 57213 54835 52961 58083 58160 53586 57085 60020 55426 55636 60310 57658 54930
882 54930 59459 59615 54747 57414 60541 55574 55122 60163 57086 53652 57937 57721 52600 54799 57751 52928
898 52928 51568 56066 53503 49027 53304 53226 47569 49515 52556 47610 45450 49818 47417 42413 45882
913 45882 46711 40744 41399 44833 39828 37363 41281 38781 34194 37086 37975 31880 31989 35263 30720 27319
929 27319 31412 29527 24095 26688 27384 21584 21174 24497 19970 16334 20103 18759 12511 14739 16232
944 16232 10146 9319 12933 8575 4828 8228 6808 1104 2555 4552 -1687 -2838 926 -3132 -7855
959 -7855 -4394 -4819 -10904 -9794 -7506 -13079 -15168 -11299 -14554 -19502 -16252 -16392 -22597 -21325 -18838 -23997
975 -23997 -26151 -22489 -25377 -30295 -27211 -26236 -32386 -31640 -28661 -33934 -36307 -32002 -34251 -38966 -35873
990 -35873 -35377 -40690 -40354 -37031 -41492 -44044 -39422 -40841 -45958 -43015 -41307 -46842 -46299 -42341 -46310 -48564
1006 -48564 -44339 -45028 -50165 -47378 -44799 -49685 -49751 -45043 -48218 -51223 -46433 -46727 -51265 -48873 -45547 -49750
1022 -49750 -50215 -45339 -47630 -50882 -45962 -45393 -49843 -47298 -43555 -47319 -47904 -43124 -44618 -47901 -43397
1037 -43397 -41429 -45839 -43554 -39060 -42933 -43699 -38215 -39386 -42682 -38076 -35546 -39840 -38561 -33326 -36305
1052 -36305 -37378 -31539 -31920 -35559 -31107 -27915 -32416 -30828 -25546 -27808 -29226 -23725 -23221 -27082 -22822
1067 -22822 -19291 -23191 -21836 -16604 -18594 -19810 -14676 -13967 -17526 -13661 -10003 -13301 -12371 -6780 -8517
1082 -8517 -10375 -4883 -4045 -7382 -3784 48 -3004 -2400 2983 2017 -519 4936 6656 2855 5940 10210
1098 10210 7393 7130 12653 12407 9372 13793 16570 13050 14913 19845 17333 16184 21723 21872 18869
1113 18869 22976 25596 22511 23603 28080 26180 24911 29891 30203 26931 30586 33223 29903 30895 35430
1128 35430 33179 31582 36369 37043 33148 36362 39597 35666 36244 41167 38584 36023 41141 41653 37266
1143 37266 39911 43585 39146 39043 44012 41845 38523 42832 43453 39020 41111 44459 40388 39486 43892
1158 43892 42172 38612 42118 43202 38633 39939 42945 39499 38115 41760 40101 36731 39414 40349 36202
1173 36202 36707 39265 36256 34377 37596 36280 32325 34871 35815 31491 31317 34303 31184 28790 31944
1188 31944 31200 26669 28340 30537 25731 25028 28076 25442 22049 24834 24981 20098 20836 23194 18845 17364
1204 17364 20560 18374 14434 17141 17276 12247 12831 15263 11259 9411 12524 10068 6249 8637 8796
1219 8796 3995 4583 6996 2643 1140 3606 1290 -2219 101 533 -4630 -4095 -1659 -5724 -8205 -4909
1235 -4909 -6872 -11017 -8624 -7887 -12694 -13270 -10615 -13830 -16579 -13672 -14545 -18952 -17339 -15998 -20399 -21175
1251 -21175 -18388 -21124 -23970 -21731 -22246 -25821 -24938 -23256 -26776 -27923 -25400 -27190 -29775 -27804 -27923
1266 -27923 -31224 -30447 -28745 -31734 -33090 -30047 -31582 -34418 -32230 -31885 -35335 -34551 -31788 -34731 -36493
1281 -36493 -33289 -34189 -37294 -34911 -33444 -37267 -36563 -33379 -35910 -37988 -34546 -34755 -37965 -35924 -33803
1296 -33803 -36800 -36913 -33487 -35281 -37353 -33954 -33833 -36479 -34243 -32306 -34976 -34932 -31499 -32911 -34875 -31565
1312 -31565 -30782 -33300 -31043 -29266 -31587 -31303 -27729 -28963 -30352 -26827 -26592 -28506 -26630 -24273 -26368
1327 -26368 -26300 -22609 -23171 -24952 -21654 -20682 -22833 -21088 -18216 -19842 -19872 -16559 -16646 -18529 -15486 -13744 -15808
1344 -15808 -14692 -11507 -12765 -13181 -9818 -9269 -10944 -8532 -6687 -8060 -7185 -3960 -4925 -5606 -2300 -1700
1360 -1700 -3419 -1031 1316 -218 485 3415 2813 1900 5244 6275 4320 6537 9125 7264 7854 11173
1376 11173 10581 9452 12714 13889 11912 13436 16517 14671 14509 18143 17533 16305 19235 20654 18622
1391 18622 20013 22260 21077 20812 23904 23831 22225 24595 25959 24076 25140 27351 26250 25974 28393 28374
1407 28374 26557 28650 29942 28005 28584 31084 29407 28735 31228 31072 29048 31031 32303 30122 30528 32360
1423 32360 31265 29666 31949 32093 29714 31115 32500 30329 30168 32225 30870 29433 31110 31332 29063
1438 29063 29754 31026 29167 28321 30202 29285 27477 28865 29365 27038 27035 28436 26568 25464 27001 26076 24156
1455 24156 25537 25537 23367 23188 24269 22518 21604 22933 21828 19591 20753 20903 18375 18127 19334 17512
1471 17512 16271 17599 16443 14364 14726 15263 12912 11853 13606 11878 10216 11127 10284 8163 8597 9058
1487 9058 6835 5729 6961 5441 3527 4263 3747 1595 1886 2138 156 -903 -103 -1184 -3031 -2595
1503 -2595 -2771 -4810 -5242 -4686 -6608 -7678 -6891 -7848 -9630 -9076 -9356 -11351 -11647 -10869 -12776 -14082 -12656
1520 -12656 -13778 -15768 -15032 -15017 -17264 -17113 -16536 -17998 -19351 -18228 -18758 -20503 -20212 -20061 -21714 -21817 -21075
1537 -21075 -22436 -23669 -22550 -23068 -24443 -24012 -23748 -25193 -25372 -24394 -25191 -26472 -25557 -25699 -26939 -26382 -26075
1554 -26075 -27136 -27444 -26604 -27188 -28018 -27134 -26825 -28113 -27711 -26551 -27845 -27763 -26866 -27394 -28104 -27105 -26886 -27682
1572 -27682 -27347 -26411 -27027 -27225 -25850 -25911 -26731 -25495 -25007 -25932 -25475 -24505 -24676 -24840 -23601 -23461 -23913 -23328 -22360
1591 -22360 -22808 -22430 -21301 -21487 -21474 -20307 -19826 -20324 -19644 -18278 -18690 -18420 -16926 -17003 -17394 -15907 -15312 -15991
1609 -15991 -14984 -13654 -14022 -13692 -12276 -12042 -12237 -11059 -10177 -10502 -9645 -8499 -8768 -8175 -6787 -6706 -6572 -5459
1627 -5459 -4858 -4758 -4031 -2893 -2844 -2591 -1114 -977 -805 281 1184 1205 2013 2973 2993 3561 4765 5241 5241 6068
1647 6068 6936 7062 7575 8576 9022 9322 10357 10872 11175 11626 12491 12559 13196 14158 14468 14535 15457 15775 16059 16525
1667 16525 17245 17447 17957 18457 18861 18786 19357 19972 20177 20475 21055 21087 21338 21787 22148 21744 22349 22652 22787 22827
1687 22827 23467 23199 23173 23757 23639 23587 23745 24144 23929 23978 24280 23979 23977 24397 24281 23918 24145 24446 23774 24032 23845
1708 23845 23668 23523 23818 23529 23087 23323 23188 22757 22627 22664 22024 22009 22153 21518 21119 21095 20893 20429 20561 20165
1728 20165 19873 19598 19359 18634 18567 18287 17940 17425 17087 16549 16321 15963 15504 15161 14740 14437 13822 13552 13176 12419
1748 12419 11945 11533 11216 10874 10294 9621 9125 8788 8410 7763 7144 6698 6349 5705 5207 4447 3909 3446 3211
1767 3211 2549 1931 1442 1070 458 -412 -697 -1421 -1996 -2208 -2505 -3416 -4039 -4413 -4889 -5492 -6050 -6311 -6920 -7489
1787 -7489 -7766 -8581 -9055 -9143 -9970 -10411 -10716 -11264 -11723 -11897 -12198 -13242 -13352 -13398 -14183 -14622 -14554 -15460 -15763 -15916
1807 -15916 -16209 -16986 -17010 -17163 -17838 -18073 -17822 -18521 -19049 -18559 -19003 -19461 -19413 -19691 -20202 -20066 -19848 -20662 -20779 -20479
1827 -20479 -20792 -21330 -20779 -21116 -21617 -21279 -21144 -21388 -21533 -20952 -21240 -21348 -21150 -21232 -21271 -21067 -20997 -20903 -21218 -20623 -20717
1848 -20717 -20859 -20664 -20195 -20265 -20147 -19671 -19814 -19875 -19379 -18961 -19321 -18898 -18086 -18109 -18228 -17531 -17451 -17729 -16743 -16307 -16439
1869 -16439 -16160 -15504 -15519 -15592 -14496 -14323 -14398 -13542 -12893 -13171 -12820 -12045 -12006 -11826 -10915 -10358 -10619 -9930 -9038 -9193
1889 -9193 -8943 -7692 -7664 -7786 -6545 -6230 -6629 -5602 -4747 -4978 -4444 -3224 -3337 -3225 -2165 -1762 -1971 -968
1907 -968 -339 -427 213 1312 1423 1338 2570 3052 2888 3703 4372 4461 4880 5724 5937 6094 6913 7721 7326 8058
1927 8058 8954 8828 9158 10076 10225 10326 11264 11895 11592 11948 13015 12840 12862 13994 14206 13794 14698 15022 14903
1946 14903 15190 16069 16016 15920 16671 16993 16475 17230 17611 17084 17370 18311 17744 17674 18723 18684 18155 18479 19155 18540
1966 18540 18504 19409 18842 18330 19337 19365 18676 18937 19590 18766 18515 19440 18938 18561 19117 19077 18085 18388 19099 18158
1986 18158 17921 18582 18072 17288 17885 18175 16981 17121 17716 16815 16044 17043 16603 15393 16296 16133 15067 14798
2004 14798 15602 14452 13901 14362 14078 12945 13363 13341 12109 11932 12562 11731 10916 11146 10948 9664 9727 10108 8811
2023 8811 8226 8994 7966 7184 7488 6878 5789 5989 6098 4892 4150 5144 3962 2969 3355 3097 1600 1622
2041 1622 1942 579 54 627 8 -1325 -1131 -1165 -2472 -2605 -2412 -3515 -4350 -4002 -4340 -5207 -5377 -5327 -6630
2060 -6630 -6862 -6240 -7397 -8296 -7590 -8148 -9271 -8889 -9076 -10114 -10567 -9974 -10795 -11719 -11062 -11216 -12685 -12423
2078 -12423 -12124 -13230 -13478 -12867 -13608 -14376 -13679 -14010 -15047 -14868 -14537 -15386 -15793 -15042 -15651 -16531 -15844 -15773 -16825
2097 -16825 -16640 -16164 -16822 -17374 -16473 -16706 -17606 -16949 -16697 -17472 -17484 -16448 -17393 -17803 -16787 -17020 -17916 -17090 -16411
2116 -16411 -17489 -17633 -16530 -16852 -17307 -16326 -16399 -17202 -16214 -15548 -16316 -16608 -15425 -15510 -16351 -15173 -14894 -15753 -14608
2135 -14608 -13819 -14895 -14716 -13509 -13606 -14254 -13038 -12365 -13376 -12626 -11586 -12137 -12197 -10759 -10925 -11531 -10398 -9847
2153 -9847 -10563 -9721 -8820 -9141 -9189 -7767 -7560 -8132 -7269 -6462 -6943 -6462 -5290 -5556 -5747 -4346 -4113 -4748 -3658
2172 -3658 -2827 -3226 -2741 -1454 -1779 -1890 -403 -415 -882 138 1126 779 855 2325 2255 1941 3062 3940 3017
2191 3017 4105 5272 4699 4666 5953 6033 5578 6692 7221 6628 7223 8365 7842 7881 9398 9245 8753 9991
2209 9991 10287 9832 10428 11614 11094 10812 12261 12164 11527 12395 13017 11946 12577 13938 12967 13074 14175 14098 13066
2228 13066 14217 14839 13886 14199 15202 14681 14574 15213 15141 14549 15186 15620 14961 14979 15569 15355 14755 15448 15637
2247 15637 14906 15135 15608 15107 14975 15760 15109 14867 15156 15326 14525 14583 15256 14180 13972 14904 14668 13555 14154
2266 14154 14472 13369 13253 14088 13173 12720 13268 13068 11770 12375 12635 11431 11543 12199 11416 10368 11216 10977
2284 10977 9781 10107 10467 9264 9002 9377 8698 7795 8443 8284 7056 7014 7705 6210 5943 6528 5776 4988
2302 4988 5371 4928 3976 3986 4278 3183 2648 3137 2431 1303 1812 1673 738 658 817 -164 -618 -119 -775 -1851
2322 -1851 -1390 -1547 -2905 -2777 -2656 -3365 -4131 -3571 -4207 -5105 -4912 -4882 -5790 -6156 -5767 -6495 -7318 -6778 -6947 -8310
2342 -8310 -7846 -7587 -8536 -8988 -8465 -9098 -9970 -9541 -9567 -10398 -10315 -9940 -10971 -11295 -10473 -11224 -11969 -11538 -11405 -12332
2362 -12332 -12397 -11852 -12746 -13028 -12139 -12551 -13392 -12850 -12679 -13525 -13482 -12745 -13498 -13902 -12980 -13133 -14163 -13272 -13306 -14124
2382 -14124 -13938 -13414 -13703 -14179 -13376 -13416 -14163 -13547 -13145 -13571 -13698 -12974 -13493 -13665 -13013 -12853 -13562 -12814 -12228 -12825
2402 -12825 -12865 -11977 -12163 -12456 -11865 -11515 -12071 -11600 -10825 -11337 -11456 -10646 -10449 -11101 -9950 -9607 -10180 -9714 -9084
2421 -9084 -9426 -9274 -8413 -8144 -8890 -7908 -7407 -7821 -7490 -6607 -6946 -6873 -6089 -5701 -6018 -5330 -4757 -5317 -4640 -3795
2441 -3795 -3987 -3986 -2946 -2742 -3351 -2466 -1611 -1893 -1717 -839 -850 -907 -229 238 -257 555 1408 978 1237 2262
2461 2262 1894 1813 3007 3387 2973 3705 4439 3949 4188 4816 4916 5010 5914 5909 5820 6225 6987 6662 6803 7501 7584
2482 7584 7394 8140 8455 8370 8398 9139 9111 8758 9498 9934 9571 9955 10392 10145 10120 10866 10803 10442 10995 11376 10907
2503 10907 11207 11955 11435 11303 11970 11886 11411 11948 12135 11744 11957 12560 12290 11925 12519 12599 11805 12326 12432 12135
2523 12135 12022 12561 12118 12000 12354 12331 11592 12165 12296 11425 11771 12155 11684 11549 11745 11369 11032 11234 11401 10897
2543 10897 10804 11192 10492 10240 10592 10321 10102 9855 10308 9225 9207 9382 9282 8808 8953 8823 8243 7998 8086 7670
2563 7670 7214 7566 7106 6590 6503 6405 5976 5636 5492 5270 4839 5036 4480 3995 3976 4023 3316 3025 3237 2567 2152
2584 2152 2109 1918 1300 1165 1153 488 275 486 -151 -426 -395 -940 -1523 -1633 -1298 -2031 -2466 -2299 -2936 -3511 -3001
2605 -3001 -3473 -4085 -4002 -4143 -4687 -4955 -4771 -5127 -5762 -5596 -5748 -6617 -6446 -6433 -6808 -7310 -7136 -7312 -7742 -7618
2625 -7618 -7908 -8324 -8467 -8302 -8700 -8940 -8642 -9061 -9473 -9259 -8989 -9587 -10073 -9847 -9957 -10095 -10155 -10085 -10597 -10642 -10427
2646 -10427 -10835 -10638 -10248 -10458 -10883 -10758 -10802 -10930 -10735 -10749 -11067 -11043 -10675 -10736 -11241 -10857 -10775 -10941 -10986 -10643 -10631 -11017
2668 -11017 -10521 -10451 -10594 -10444 -10418 -10444 -10270 -9871 -9869 -10054 -9835 -9537 -9706 -9570 -9198 -9507 -9415 -8821 -8975 -8788 -8421
2689 -8421 -8476 -8351 -8063 -7888 -7798 -7631 -7086 -7085 -7249 -6903 -6609 -6577 -6226 -5726 -5795 -5568 -5414 -5368 -5427 -4894 -4502 -4562 -4319
2712 -4319 -3827 -3767 -3538 -3179 -2935 -2971 -2533 -2243 -2138 -1964 -1218 -1329 -1084 -784 -392 -421 -141 215 333 539 966
2733 966 1134 1282 1670 1867 1971 2351 2661 2673 3079 3214 3697 3629 3752 4209 4212 4538 5001 5013 5036 5517 5473 5625
2755 5625 5929 6112 6329 6326 6556 6669 6720 7153 7103 7133 7365 7555 7669 7661 8045 8080 8027 8244 8324 8380 8639 8839 8661
2778 8661 8486 8982 9161 9129 9172 9271 9177 9171 9253 9297 9264 9452 9375 9444 9646 9559 9437 9477 9713 9581 9353 9305 9598 9327
2802 9327 9374 9694 9302 9116 9567 9347 9031 9255 9091 9137 8985 8735 8721 8558 8529 8574 8106 8198 8280 7978 7901 7953 7560
2825 7560 7276 7367 7439 7113 6819 6844 6247 6428 6371 6081 5701 5767 5759 5454 5243 5102 4715 4491 4499 4292 4085 4019 3959
2848 3959 3156 3396 3083 2760 2688 2741 2297 2005 1785 1730 1429 1199 995 701 490 455 266 -196 -168 -579 -726
2869 -726 -1058 -1010 -1263 -1409 -1787 -1960 -2111 -2422 -2467 -2839 -2835 -3085 -3181 -3464 -3710 -3796 -4097 -4343 -4409 -4198 -4765 -4865
2891 -4865 -4895 -5126 -5257 -5344 -5734 -5813 -5912 -5824 -6304 -6422 -6334 -6550 -6538 -6784 -7086 -7016 -6946 -7023 -7617 -7318 -7423 -7796 -7571
2914 -7571 -7576 -7638 -8090 -7799 -8145 -8316 -8071 -8127 -8185 -8263 -8171 -8173 -8272 -8340 -8273 -8183 -8489 -8345 -8396 -8300 -8512 -8492 -8384 -8283 -8030
2939 -8030 -8425 -8358 -8196 -8204 -8046 -8102 -7905 -8084 -7762 -7577 -7924 -7747 -7516 -7578 -7486 -7345 -7194 -7306 -7314 -6907 -6963 -6805 -6758
2962 -6758 -6599 -6577 -6218 -6150 -6381 -6055 -5643 -5688 -5560 -5236 -5270 -5283 -4828 -4811 -4869 -4649 -4065 -4265 -4195 -3850 -3670 -3591 -3183
2985 -3183 -3104 -3073 -3003 -2460 -2480 -2501 -1995 -1999 -1842 -1486 -1075 -1349 -882 -605 -628 -336 -128 58 272 508 758 605
3007 605 835 1107 1362 1403 1550 1910 2074 2325 2519 2440 2712 2995 3445 3256 3447 3592 3519 3907 4120 3989 4317
3028 4317 4638 4744 4588 4763 5139 5034 5128 5466 5576 5398 5700 6023 5950 5856 6175 6236 6149 6428 6358 6247 6727 6693
3050 6693 6571 6727 7085 6722 6972 7048 7048 7077 7228 7225 7208 7482 7377 7311 7148 7686 7398 7380 7624 7530 7314 7442 7440 7340
3074 7340 7432 7311 7436 7404 7538 7366 7113 7158 7376 7226 7225 7117 7073 6692 6926 7108 6459 6586 6534 6356 6430 6556
3096 6556 6437 6045 5931 5956 5764 5743 5633 5447 5290 5110 5070 4616 4902 4881 4534 4260 4376 4193 3768 3948 3914
3117 3914 3362 3530 3534 3089 2701 2927 2699 2360 2392 2275 2033 1895 1663 1451 1128 1144 1256 591 665 759 185 40
3139 40 -183 -37 -606 -292 -769 -892 -1206 -896 -1449 -1386 -1649 -1784 -2067 -1968 -2324 -2452 -2314 -2654 -2967 -3044 -3077 -3348
3161 -3348 -3773 -3458 -3349 -3920 -3860 -3906 -4168 -4204 -4298 -4303 -4823 -4590 -4530 -4805 -5092 -5184 -5312 -5489 -5310 -5320 -5527 -5665 -5674
3184 -5674 -5860 -6027 -5776 -5952 -6065 -5975 -5994 -6428 -6387 -6198 -6334 -6307 -6270 -6388 -6716 -6582 -6545 -7002 -6740 -6402 -6829 -6748
3206 -6748 -6336 -6730 -7008 -6480 -6494 -6861 -6852 -6281 -6615 -6660 -6480 -6336 -6689 -6419 -6161 -6536 -6390 -6136 -6243 -6405 -6084
3227 -6084 -5982 -6084 -5857 -5746 -5859 -5556 -5692 -5673 -5599 -5510 -5214 -5321 -5480 -4936 -4940 -4970 -4607 -4596 -4491 -4236 -4110 -4159
3249 -4159 -3930 -3649 -3465 -3666 -3320 -3237 -3441 -3149 -2669 -2832 -2543 -2122 -2198 -2234 -1977 -1811 -2036 -1483 -1339 -1362 -1090
3270 -1090 -711 -774 -961 -213 -588 -343 84 177 339 268 642 690 689 1132 1336 1104 1414 1704 1586 1779 2153 2001
3292 2001 1956 2358 2623 2515 2739 2923 2891 3089 3414 3378 3413 3527 3717 3776 4009 4034 4142 4293 4300 4455 4331 4519
3314 4519 4827 4852 4647 5012 4882 4819 5276 5059 5191 5225 5719 5430 5123 5565 5543 5544 5753 5628 5487 5624 6015 5850
3336 5850 5904 6072 5985 6021 5947 6033 5985 5881 6156 5915 5932 6137 6055 5829 6139 6068 5856 5863 6077 5813 5549 5760 5552
3359 5552 5417 5651 5662 5413 5497 5510 5331 5121 5303 5046 5076 5200 4961 4856 4512 4903 4546 4457 4447 4482 4227 4140
3381 4140 4265 3752 3567 3827 3512 3387 3222 3230 3009 2926 2910 2567 2629 2708 2328 2182 2028 1940 1795 1611 1445 1330
3403 1330 1031 1062 1003 692 714 664 310 285 222 13 -270 -267 -326 -697 -769 -430 -1030 -927 -934 -1232 -1468 -1478 -1480 -1918 -1782
3428 -1782 -1916 -2269 -2193 -2230 -2591 -2674 -2471 -2659 -3003 -3022 -2946 -3378 -3570 -3463 -3581 -3806 -3757 -3780 -3814 -3894 -4095 -4175 -4349
3451 -4349 -4069 -4287 -4597 -4466 -4475 -4786 -4580 -4907 -4886 -4823 -5153 -5054 -5182 -4907 -5108 -5336 -4973 -5056 -5373 -5553 -5245 -5270
3473 -5270 -5554 -5412 -5285 -5369 -5472 -5320 -5556 -5553 -5583 -5395 -5538 -5456 -5102 -5500 -5375 -5239 -5448 -5593 -5252 -5132 -5383
3494 -5383 -5325 -5178 -5102 -5109 -5011 -4971 -5173 -4905 -4783 -4765 -4997 -4775 -4695 -4576 -4227 -4375 -4333 -4245 -3895 -4178 -4037 -3699 -3961
3517 -3961 -3684 -3454 -3417 -3565 -3359 -3213 -3265 -3020 -2725 -3134 -2614 -2681 -2376 -2513 -2406 -2039 -1969 -1916 -1771 -1510 -1441 -1306
3539 -1306 -1123 -1090 -1127 -946 -866 -822 -351 -782 -303 -15 88 27 332 482 318 379 839 767 753 1096 1164 1037 1231
3562 1231 1456 1464 1840 1669 2042 1764 2168 2384 2306 2216 2705 2526 2397 3019 2956 2737 2998 3219 3149 3357 3519 3695
3584 3695 3339 3627 3675 3672 3858 4047 3969 3847 4447 4288 4229 4166 4512 4340 4511 4444 4464 4530 4692 4771 4638 4922 4835
3607 4835 4795 4851 5203 4758 4820 4867 5074 5054 5276 5118 4800 5075 5149 4943 4861 5082 5216 4807 5004 5158 4989 4877
3629 4877 5015 5036 4738 5064 4727 4676 4748 4947 4696 4411 4763 4631 4318 4352 4421 4243 4155 4115 4141 3918 4019 3808
3651 3808 3534 3475 3864 3511 3176 3305 3224 3201 3136 3091 2764 2703 2751 2556 2404 2468 2386 2172 2102 2167 1900 1740 1633
3674 1633 1587 1297 1325 1223 940 927 934 868 674 795 519 350 436 -31 62 -20 -54 -409 -336 -226 -684 -839 -1044
3697 -1044 -1071 -1250 -1191 -1244 -1588 -1599 -1573 -1553 -1868 -1800 -1713 -2064 -2094 -2201 -2263 -2378 -2340 -2388 -2764 -2781 -2824 -2885 -3045 -2945 -3192
3722 -3192 -3260 -3030 -3150 -3434 -3481 -3435 -3810 -3698 -3567 -3833 -3753 -3566 -3967 -4151 -3804 -3949 -4192 -4225 -4258 -4297 -4363 -4353 -4291
3745 -4291 -4419 -4357 -4258 -4354 -4636 -4431 -4681 -4646 -4282 -4386 -4531 -4665 -4321 -4493 -4631 -4473 -4711 -4392 -4552 -4332 -4406
3766 -4406 -4457 -4472 -4526 -4629 -4322 -4363 -4300 -4193 -4233 -4382 -4115 -4028 -4346 -4035 -3874 -3912 -4035 -3728 -3569 -3788 -3897 -3756
3788 -3756 -3576 -3507 -3254 -3166 -3241 -3054 -3118 -3249 -2974 -2968 -2780 -2748 -2605 -2451 -2488 -2387 -2173 -2107 -2319 -1901 -1934 -1903 -1722
3811 -1722 -1533 -1586 -1437 -1248 -1346 -1191 -871 -647 -833 -652 -441 -684 -513 -389 -245 -287 -276 -25 104 182 537
3832 537 564 543 679 613 553 892 1032 1078 1175 1128 1292 1388 1579 1568 1261 1663 1888 1888 2039 2098 2094 2088 2284 2352 2389 2510
3858 2510 2552 2784 2431 2742 2807 2820 3101 3094 3116 3073 3290 3328 3238 3365 3436 3276 3482 3768 3633 3601 3491 3653 3845
3881 3845 3734 3995 3599 3878 3782 3867 3771 3994 4018 3997 4195 4085 3944 4126 4122 4215 4149 4303 4092 4125 4218 4016 4050 4068
3905 4068 4021 3939 4133 4081 4078 3784 3812 3933 3891 3786 3912 3705 3643 3508 3615 3677 3448 3477 3288 3295 3335 3227 3011 3020 3060
3930 3060 3079 2754 2765 2625 2560 2785 2720 2383 2621 2437 2164 2115 2213 1938 1839 1962 1885 1769 1645 1697 1291 1505 1244
3953 1244 1309 1025 915 967 950 1028 879 544 578 490 390 322 349 180 53 -198 -76 -417 -302 -285 -668 -418 -493
3976 -493 -841 -836 -964 -942 -1104 -1196 -1284 -1365 -1466 -1517 -1392 -1711 -1727 -1863 -1895 -2028 -1761 -1981 -2255 -2015 -2096 -2297 -2138
3999 -2138 -2448 -2489 -2703 -2419 -2690 -2722 -2793 -2644 -2759 -3003 -2885 -3021 -2955 -3087 -3176 -3099 -3247 -3381 -3150 -3375 -3379 -3298 -3526
4022 -3526 -3470 -3480 -3648 -3565 -3591 -3497 -3743 -3577 -3565 -3574 -3670 -3623 -3716 -3576 -3723 -3499 -3832 -3586 -3773 -3797 -3567 -3797 -3698 -3630
4046 -3630 -3654 -3750 -3535 -3720 -3659 -3523 -3428 -3517 -3449 -3581 -3196 -3250 -3389 -3146 -3211 -3306 -3185 -2855 -3157 -3031 -3039 -2853 -2831 -2742
4070 -2742 -2848 -2652 -2619 -2556 -2551 -2511 -2455 -2210 -2226 -2151 -1956 -1949 -1762 -1815 -1963 -1795 -1838 -1334 -1737 -1403 -1387 -1298 -1131 -1080 -962
4095 -962 -943 -1025 -677 -933 -801 -774 -506 -618 -388 -146 -326 -110 45 -141 110 165 221 401 526 663 452 611
4117 611 653 653 1000 1011 752 937 1332 1139 1377 1154 1524 1331 1504 1703 1460 1696 1755 1817 1904 2204 2233 2082 2435
4140 2435 2278 2164 2238 2118 2404 2448 2587 2806 2546 2729 2903 2721 2691 2825 3083 2834 3020 3156 3048 3120 3122 3293
4162 3293 3190 3120 3252 3186 3246 3188 3253 3284 3278 3304 3559 3362 3522 3217 3203 3527 3217 3318 3126 3306 3271 3347 3371 2959
4186 2959 3092 3443 3051 3147 3133 3168 2995 2894 2959 2917 3047 3070 2989 2688 2881 2800 2794 2883 2836 2722 2432 2510 2480 2191
4210 2191 2339 2161 2303 2013 2189 2018 1957 2024 1681 1920 1807 1694 1761 1507 1548 1501 1323 1184 1164 1051 1473 1302
4232 1302 950 1048 1018 853 787 756 884 581 469 310 380 265 301 233 313 152 252 -231 -275 -148 -431 -392 -347
4255 -347 -524 -696 -692 -580 -502 -703 -782 -1033 -1118 -901 -1058 -1226 -1271 -1361 -1458 -1205 -1456 -1601 -1710 -1595 -1560 -1696 -1859
4278 -1859 -1810 -1808 -2059 -1933 -2078 -2103 -2013 -2018 -2339 -2324 -2031 -2419 -2272 -2300 -2443 -2335 -2287 -2393 -2699 -2691 -2489 -2692 -2654 -2658 -2523
4303 -2523 -2943 -2717 -2623 -2866 -2724 -2864 -2778 -2928 -2753 -2696 -2936 -3047 -3017 -2714 -2970 -2735 -2857 -3066 -2941 -2823 -2728
4324 -2728 -2837 -2915 -2776 -2713 -2515 -2815 -2823 -2602 -2605 -2599 -2628 -2456 -2487 -2576 -2531 -2571 -2637 -2356 -2536 -2167 -2315 -2313 -2187 -2168 -2129 -2054
4350 -2054 -2185 -2124 -1765 -2037 -2183 -1481 -1715 -1575 -1582 -1480 -1689 -1404 -1486 -1401 -1530 -1256 -1236 -1296 -1110 -965 -1154 -1137
4372 -1137 -942 -718 -975 -639 -567 -579 -669 -434 -410 -541 -101 -332 -146 -76 67 -28 195 473 207 167 105 419
4394 419 395 336 452 302 538 600 566 720 964 912 920 1208 1256 1058 1333 1242 1287 1377 1778 1497 1643 1731 1379 1463
4418 1463 1740 1717 1517 1937 1798 1885 2049 2025 1987 2050 2067 2220 1896 2206 2154 2246 2223 2364 2443 2308 2234 2584 2603 2385
4442 2385 2409 2370 2555 2349 2622 2383 2491 2692 2261 2316 2459 2625 2391 2449 2455 2525 2656 2583 2414 2491 2657 2357 2570
4465 2570 2482 2581 2501 2433 2317 2287 2326 2366 2576 2393 2186 2243 2023 2152 2073 2037 1874 1854 1818 2070 2020 1793 1877 1795 1685
4490 1685 1886 1501 1579 1506 1404 1414 1664 1503 1308 1366 1349 1293 1385 1017 1051 1147 1173 1037 566 864 815 851 589 405
4514 405 693 428 563 285 419 317 230 216 149 305 110 23 -20 -188 -174 -399 -110 -248 -374 -202 -507 -711
4536 -711 -436 -336 -617 -794 -724 -899 -750 -894 -918 -986 -1017 -943 -1261 -1223 -1246 -1360 -1349 -1305 -1383 -1254 -1320 -1415 -1641 -1632 -1451
4561 -1451 -1712 -1683 -1695 -1900 -1901 -1897 -1863 -1864 -1897 -2139 -1949 -2110 -2090 -1962 -2151 -2445 -2168 -2179 -2241 -2162 -2369 -2223 -2406 -2191
4585 -2191 -2147 -1967 -2135 -2410 -2243 -2382 -2313 -2278 -2470 -2228 -2325 -2148 -2204 -2329 -2361 -2235 -2286 -2402 -2193 -2100 -2199 -2050 -2232
4608 -2232 -2132 -2187 -1892 -1931 -2044 -2091 -1873 -1843 -1811 -1958 -1654 -1685 -1897 -1614 -1774 -1603 -1687 -1700 -1619 -1325 -1626 -1514 -1569
4631 -1569 -1413 -1486 -1192 -1253 -1175 -1269 -1412 -1031 -1146 -1082 -957 -1225 -902 -815 -743 -759 -729 -675 -450 -513 -667 -537 -617 -447
4655 -447 -582 -409 -187 -351 -341 -230 8 -194 -2 175 30 -133 256 242 -48 272 499 420 578 467 508
4676 508 568 861 596 606 559 805 942 968 959 782 958 1014 1245 1044 1030 1382 1130 1063 1266 1361 1411 1389 1323 1434
4700 1434 1713 1545 1494 1374 1563 1632 1681 1838 1849 1691 1894 1850 1751 1791 1610 1794 1789 2097 1729 2083 1824 1761 1919
4723 1919 2005 1871 1833 2018 1856 1995 2059 1841 2021 1996 2023 2198 1970 1990 1957 2123 1844 2009 1830 2141 1880 1913
4745 1913 1872 1792 2088 1925 1776 1627 1505 1645 1506 1744 1674 1553 1660 1645 1426 1430 1562 1522 1557 1514 1546 1310 1353
4768 1353 1395 1213 1233 1264 1135 1115 1162 1274 1140 877 1171 1029 936 739 922 759 744 788 590 834 653 578 556
4791 556 554 537 313 357 357 91 343 114 252 120 200 -55 63 -113 -99 -210 -29 -234 -328 -226 -363 -283 -519
4814 -519 -664 -542 -568 -627 -565 -755 -761 -622 -774 -863 -867 -622 -905 -980 -873 -1092 -978 -999 -1044 -1052 -1134 -1115 -1191 -1243 -1190 -1437
4840 -1437 -1449 -1532 -1339 -1465 -1579 -1639 -1457 -1510 -1523 -1460 -1455 -1704 -1515 -1633 -1702 -1591 -1616 -1774 -1683 -1636 -2038 -1533 -1621 -1767
4864 -1767 -1610 -1659 -1616 -1557 -1570 -1877 -1701 -1568 -1598 -1841 -1507 -1524 -1668 -1505 -1495 -1671 -1739 -1447 -1503 -1501 -1496 -1456 -1291 -1513
4888 -1513 -1536 -1552 -1602 -1469 -1346 -1372 -1508 -1493 -1347 -1188 -1460 -1331 -1501 -1202 -1106 -1169 -1234 -1307 -923 -877 -900 -1020 -1054 -910
4912 -910 -1158 -925 -801 -901 -830 -841 -765 -678 -682 -624 -616 -581 -387 -331 -265 -438 -423 -312 -368 -271 -273 -181 79 -217 -116 36
4938 36 -27 -19 109 226 132 152 113 214 323 314 496 155 410 436 190 594 473 570 603 713 709 548 909 696 713
4963 713 763 827 926 980 973 983 1033 973 1094 1193 1083 947 1062 1164 1278 1205 1156 1307 1121 1230 1306 1280 1369 1376 1227 1393
4989 1393 1415 1580 1544 1509 1491 1370 1417 1546 1272 1345 1551 1621 1521 1526 1588 1352 1527 1338 1601 1472 1548 1643 1411 1408
5013 1408 1463 1508 1683 1445 1581 1512 1512 1223 1526 1268 1190 1374 1293 1362 1370 1194 1171 1322 1224 1134 1143 973 1054 1000 1077 1132
5039 1132 812 931 967 992 884 732 1058 918 852 626 853 728 739 602 820 779 638 521 546 653 511 337
5061 337 330 369 221 276 342 124 173 288 12 214 82 -7 81 -58 -59 3 -76 -111 -108 -244 -202 -185 -180 -379 -393 -322 -344
5088 -344 -230 -706 -526 -564 -524 -465 -672 -572 -714 -557 -654 -885 -824 -591 -1005 -841 -756 -1121 -1126 -1153 -966 -878 -1143
5111 -1143 -943 -1122 -1325 -919 -1209 -1137 -1189 -1131 -1130 -1282 -1049 -1273 -1144 -1183 -1330 -1293 -1239 -1352 -1251 -1052 -1154 -1159 -1378
5134 -1378 -1118 -1326 -1325 -1228 -1395 -1296 -1163 -1081 -1186 -1250 -1294 -1157 -1282 -1156 -1276 -1471 -1416 -1210 -1260 -1198 -1118 -1224 -1360
5157 -1360 -953 -996 -1095 -912 -1247 -1190 -1249 -1101 -869 -1154 -1104 -1071 -940 -951 -966 -1069 -932 -822 -931 -916 -671 -853 -814
5180 -814 -745 -712 -804 -719 -778 -612 -509 -835 -406 -502 -550 -398 -445 -691 -350 -525 -256 -362 -324 -356 -253 -307 -230 -148
5204 -148 95 7 -240 -131 -62 53 -112 -22 112 123 129 162 199 242 251 302 339 233 275 373 417 370 279 493 274 521
5230 521 609 566 628 671 757 639 814 798 933 1074 791 804 493 760 944 872 1096 901 929 965 870 948 966 979 900
5255 900 1095 993 864 876 1223 896 1012 950 1319 1147 953 997 913 983 1086 1015 999 901 932 1024 1191 1294 1123
5278 1123 996 972 1030 1153 822 1056 963 1005 870 887 1032 1014 952 1022 973 934 1012 939 848 731 824 1144 801 787 888
5303 888 944 840 795 848 656 847 679 692 682 647 598 727 647 524 592 568 450 502 472 379 495 319 405 483 423
5328 423 104 303 490 131 224 458 338 311 264 118 -29 173 120 28 -83 45 -90 17 -128 -291 -182 -61
5350 -61 28 -220 -365 -333 -436 -253 -241 -394 -578 -569 -282 -575 -413 -456 -588 -374 -542 -687 -736 -702 -486 -662 -576
5373 -576 -628 -755 -779 -652 -741 -711 -760 -623 -908 -807 -955 -857 -951 -820 -1048 -812 -894 -811 -909 -888 -931 -911 -707 -733 -1061
5398 -1061 -1157 -934 -1092 -1016 -1104 -873 -849 -1002 -1061 -752 -914 -1013 -574 -872 -834 -1086 -896 -817 -766 -912 -932 -1170 -850
5421 -850 -691 -821 -800 -901 -1150 -695 -1026 -720 -922 -676 -884 -904 -676 -755 -666 -562 -633 -577 -483 -528 -483 -543 -547 -566
5445 -566 -608 -495 -649 -294 -623 -281 -415 -579 -511 -381 -289 -318 -229 -270 -426 -125 -52 -170 43 30 -319 -95 -254
5468 -254 27 16 -59 -13 -16 76 138 41 251 210 76 62 178 362 205 286 375 360 112 319 314 409 373 472 470 434 399
5495 399 444 711 470 515 591 424 582 595 554 753 664 659 851 952 846 918 539 640 873 833 841 1032 672 782
5519 782 895 926 793 774 1035 1012 944 1005 875 760 883 962 816 855 1127 892 1100 778 922 874 791 1042 828
5542 828 801 835 869 930 920 955 784 824 740 859 1062 906 838 791 853 774 769 568 626 569 803 555 642 540 487 600
5568 600 569 627 740 594 639 621 429 470 464 565 509 440 277 293 293 430 439 388 414 491 209 304 265 154 235 62 -99
5595 -99 -141 161 76 -12 -29 29 29 -35 -60 175 11 -31 -21 -333 55 -150 -278 -291 -233 -182 -359 -386 -320 -339 -346 -426 -606
5622 -606 -472 -449 -509 -518 -388 -407 -401 -675 -618 -733 -654 -697 -534 -783 -878 -510 -702 -708 -818 -653 -818 -786 -756 -987 -891
5647 -891 -843 -1004 -1076 -1057 -832 -880 -877 -950 -858 -952 -1025 -1067 -904 -1153 -961 -908 -1185 -810 -1057 -720 -930 -1085 -839 -794
5671 -794 -808 -840 -981 -1041 -512 -1050 -1009 -868 -982 -986 -828 -858 -945 -1015 -865 -968 -786 -831 -921 -1002 -591 -752 -839 -568
5695 -568 -722 -824 -730 -536 -760 -786 -978 -730 -730 -547 -653 -442 -637 -520 -469 -626 -358 -477 -338 -466 -458 -397 -480
5718 -480 -221 -271 -261 -216 -151 -393 -161 -133 -239 -242 -49 171 -175 -76 -83 -48 82 163 -169 -2 166 139 265 54
5742 54 -5 216 127 218 192 594 520 256 473 326 482 511 484 476 511 602 474 547 363 606 511 506 648 659 621 848
5768 848 559 852 656 754 765 903 910 831 973 809 916 887 752 681 776 1035 891 873 1079 933 1003 980 1029 1034 1003
5793 1003 901 990 969 683 1057 918 1056 962 1029 932 970 1188 961 940 752 868 850 860 915 780 891 815 780 753
5817 753 812 950 818 818 901 585 871 759 746 794 923 527 751 733 616 779 569 822 542 568 589 624 391
5840 391 451 284 508 222 498 601 563 338 310 422 110 214 291 270 180 131 239 152 312 -13 296 99 75
5863 75 237 -12 -32 -96 -312 -294 -96 -65 -103 -102 -290 -94 -358 -307 -376 -155 -238 -526 -484 -585 -474 -446 -624 -403
5887 -403 -617 -530 -627 -502 -623 -723 -491 -661 -587 -744 -845 -1000 -722 -849 -674 -584 -727 -809 -736 -723 -953 -623
5909 -623 -930 -714 -960 -1034 -1122 -881 -877 -1054 -810 -1051 -965 -951 -906 -868 -906 -961 -1150 -867 -1033 -1157 -1041 -970 -973 -846
5933 -846 -1025 -857 -1056 -1052 -973 -1046 -954 -998 -903 -785 -745 -886 -923 -800 -946 -902 -774 -889 -885 -828 -835 -663 -847 -766 -866
5958 -866 -846 -873 -649 -522 -596 -842 -445 -732 -480 -738 -636 -609 -585 -529 -572 -351 -581 -608 -419 -389 -445 -267 -313 -167
5982 -167 -247 -219 -200 -318 -57 -223 -351 -267 -81 -70 -26 -263 -212 -127 -92 51 32 51 -48 11 360 159 150 213 134 368
6008 368 299 582 100 320 505 568 415 429 416 433 671 602 489 684 507 775 672 822 662 708 782 927 851
6031 851 937 840 765 692 753 812 764 991 945 961 960 1087 988 1166 938 973 791 1004 948 1010 1058 1180 963 995 1048 1001
6057 1001 1217 1042 967 1203 1036 1256 953 899 1077 1115 1222 1038 1131 1195 1180 859 1014 1044 963 1151 962 963 1111
6080 1111 855 1092 969 775 919 880 793 1154 1056 873 1057 865 624 737 948 936 774 875 937 821 698
6101 698 652 677 606 522 633 576 412 662 561 399 493 477 554 356 370 507 258 353 344 162 229 -263 -1 358
6125 358 226 -31 360 146 84 26 92 1 -192 -52 -40 -109 -26 -164 -64 -229 -301 -437 -285 -519 -252 -368 -195
6148 -195 -539 -260 -556 -382 -516 -639 -523 -471 -495 -604 -559 -635 -673 -641 -834 -731 -847 -851 -609 -819 -859 -1044 -1029
6171 -1029 -983 -1067 -858 -901 -1017 -1091 -1142 -1050 -985 -1013 -1051 -943 -1123 -961 -1056 -1033 -919 -1091 -1225 -1073 -1216 -1232 -1072 -1043
6195 -1043 -1036 -1126 -1014 -1041 -1152 -1036 -958 -986 -1095 -1084 -876 -977 -1197 -1148 -1207 -1007 -934 -953 -1146 -1040 -924 -945 -1003 -1063
6219 -1063 -1069 -1031 -842 -769 -957 -1047 -851 -942 -1105 -808 -804 -617 -709 -547 -559 -618 -695 -736 -528 -550 -652 -375 -697 -646 -517
6244 -517 -402 -420 -505 -550 -560 -548 -377 -299 -274 -198 -639 -218 -80 -313 -133 -60 -25 -99 -17 83 74 31 -49 -70 180 265
6270 265 -27 -44 168 305 53 163 182 176 332 476 569 321 443 480 497 300 663 628 658 529 597 691 789 631
6294 631 647 749 662 854 759 753 923 731 909 866 716 929 941 999 884 1075 929 1147 1141 1209 1009 1075 1046 1085 862
6319 862 1228 977 1077 1051 983 1073 984 1135 1169 958 1015 1077 1135 1002 977 1074 1011 1145 1168 1117 1094 1121 1115 1115 1019 904 1026
6346 1026 1072 1074 996 950 924 843 1025 1105 963 1005 855 984 692 875 696 841 888 716 835 659 832 657 651 655
6370 655 582 679 679 594 642 676 643 506 531 554 423 268 426 458 296 347 365 213 48 199 225 326 153 40 253
6395 253 27 52 171 26 32 -101 -136 -38 -56 -182 -321 -338 -257 -187 -286 -98 -233 -403 -355 -255 -541 -566 -471 -529 -517
6420 -517 -387 -627 -436 -768 -460 -618 -738 -734 -661 -934 -930 -862 -606 -993 -746 -769 -902 -1030 -972 -730 -1029 -1093 -729
6443 -729 -1084 -1310 -1136 -1050 -999 -956 -828 -1044 -1061 -982 -1245 -1162 -1115 -1109 -1032 -901 -1403 -1164 -950 -1108 -1088 -1303 -1198 -1237
6467 -1237 -1329 -1041 -1082 -1223 -1058 -1075 -1098 -1187 -917 -1114 -1080 -1119 -1138 -1215 -1119 -902 -976 -998 -1253 -1012 -1128 -930 -884 -969
6491 -969 -976 -953 -971 -938 -848 -865 -873 -760 -1058 -828 -626 -709 -535 -802 -658 -643 -764 -622 -732 -538 -581 -442 -617 -530
6515 -530 -468 -472 -267 -344 -428 -404 -181 -283 -285 -311 -384 -231 -105 -84 -237 -19 113 46 207 11 33 159 314 175
6539 175 163 206 329 361 449 446 324 419 211 465 470 546 632 532 503 827 577 567 678 680 703 777 734 878 832 885 872
6566 872 901 748 936 763 823 941 904 1029 1105 1022 1047 1084 1153 1279 1075 1267 995 1178 1184 1333 1185 1176 1193 1189 1141
6591 1141 1448 1252 1221 1159 1135 896 1350 1279 1175 1185 1213 1213 1169 1111 1144 1145 1140 1204 1067 1275 1030 1260 1168 1106 982 1186
6617 1186 1126 996 1159 1282 1244 1107 1005 999 1003 964 976 1001 794 1018 941 693 902 680 982 630 677 734 866 630
6641 630 477 867 691 494 544 549 547 472 401 550 483 382 282 453 432 456 217 185 8 180 140 158 -17 32 -134
6666 -134 51 -153 -137 -45 -134 -80 52 -203 -501 -65 -453 -333 -206 -351 -555 -443 -354 -227 -409 -437 -514 -580 -425
6689 -425 -583 -491 -794 -684 -900 -842 -920 -772 -976 -856 -935 -948 -866 -986 -818 -1019 -961 -1222 -859 -1104 -1260 -1005
6711 -1005 -1159 -1314 -1176 -1183 -1037 -1053 -1169 -923 -1395 -1479 -1343 -1073 -935 -1408 -1096 -1151 -1310 -1290 -1267 -1156 -1315 -1317 -1254
6734 -1254 -1134 -1194 -1308 -1283 -1239 -1369 -1334 -1264 -1410 -1451 -1374 -1215 -1165 -1277 -1264 -1177 -1192 -1056 -1062 -1015 -1219 -1188 -917 -1161 -1104
6759 -1104 -889 -1132 -866 -839 -920 -868 -884 -861 -884 -769 -792 -881 -701 -715 -627 -636 -840 -795 -498 -751 -539 -567 -479 -607 -546
6784 -546 -409 -456 -328 -307 -214 -394 -343 -278 -301 83 -153 -72 -195 -68 45 88 -82 -102 72 241 -21 310 364
6807 364 317 181 327 369 252 367 483 486 363 477 455 656 669 368 723 717 478 800 756 559 828 885 789 1206
6831 1206 553 958 1150 774 1050 988 1041 835 928 1212 1257 1120 1095 1171 1103 1281 1103 1069 1176 1076 1362 1356 1155
6854 1155 1154 1110 1266 1411 1132 1227 1360 1240 1276 1228 1392 1228 1465 1332 1434 1247 1350 1232 1380 1051 1235 1273
6876 1273 1223 1363 1345 1425 1078 1466 1331 1196 1249 1350 1192 1231 962 1033 982 1031 1019 1162 1114 939 991 1045 1037 991 922
6901 922 990 1079 760 929 839 839 595 726 681 722 706 626 697 559 680 598 567 711 455 630 582 184 260 187 265
6926 265 161 291 106 191 136 189 69 -35 143 4 -274 -149 -59 -5 -136 -270 -119 -320 -309 -429 -400 -309 -332
6949 -332 -466 -478 -555 -376 -553 -459 -499 -623 -788 -860 -625 -754 -879 -815 -707 -845 -762 -1149 -839 -1021 -1213 -1073
6971 -1073 -1077 -1071 -1130 -1014 -1183 -1172 -1117 -1266 -1459 -1060 -1170 -1210 -1374 -1520 -1221 -1507 -1254 -1227 -1428 -1323 -1259 -1255 -1384 -1365
6995 -1365 -1208 -1346 -1329 -1347 -1420 -1495 -1388 -1264 -1229 -1215 -1519 -1331 -1335 -1253 -1281 -1587 -1178 -1251 -1415 -1426 -1285 -1297 -1490 -1277
7019 -1277 -1249 -1282 -1342 -1111 -1282 -1262 -1279 -1137 -1154 -1126 -1100 -977 -1113 -1332 -1166 -1269 -947 -1156 -850 -697 -845 -703
7041 -703 -745 -600 -563 -716 -590 -781 -691 -784 -598 -702 -420 -542 -609 -361 -370 -412 -436 -414 -251 -564 -201 -111 -121 -220
7065 -220 -216 -164 -198 30 -113 114 -123 125 230 339 260 81 186 146 260 121 342 352 264 308 522 452 482 586
7089 586 543 643 730 870 750 796 941 666 750 876 798 902 998 1109 860 896 984 1184 1009 1231 1003 1118 1152
7112 1152 1264 1134 1167 1490 1082 1319 1370 1231 1162 1357 1316 1371 1387 1410 1555 1465 1407 1344 1440 1274 1368 1441 1380 1298 1342
7137 1342 1284 1196 1353 1469 1264 1482 1483 1467 1236 1552 1384 1362 1440 1440 1308 1282 1378 1121 1283 1469 1190 1231 1217 1254
7161 1254 1204 959 1325 1048 1354 993 1357 1137 1187 1103 981 854 909 893 1064 1027 874 599 704 804 842 913
7183 913 779 590 473 646 635 771 572 448 351 522 413 410 375 242 163 324 236 14 45 -152 162 238 67
7206 67 -142 -171 -55 -121 -80 -232 -339 -166 -139 -399 -250 -407 -557 -383 -453 -591 -518 -585 -641 -497 -740 -665 -875
7229 -875 -908 -750 -630 -830 -743 -876 -933 -849 -850 -833 -1019 -942 -1282 -1272 -1257 -859 -1174 -1071 -1085 -1309 -1236 -1090 -1341 -1338 -1405
7254 -1405 -1344 -1415 -1354 -1464 -1325 -1432 -1251 -1380 -1439 -1526 -1328 -1417 -1494 -1376 -1391 -1307 -1353 -1405 -1418 -1248 -1317 -1532 -1417 -1395
7278 -1395 -1303 -1689 -1264 -1202 -1500 -1329 -1524 -1475 -1294 -1339 -1369 -1314 -1435 -1338 -1153 -1461 -1276 -1310 -1203 -992 -1097 -908
7300 -908 -1395 -1036 -1006 -1018 -978 -1033 -1103 -1115 -812 -1027 -938 -815 -881 -792 -842 -629 -847 -924 -749 -621 -528 -738 -751 -575
7324 -575 -656 -736 -554 -531 -381 -306 -269 -316 -230 -262 75 -328 53 -50 -143 -87 -11 -156 25 115 -130 91 112 174 169
7349 169 201 82 362 151 389 485 461 394 429 413 690 658 712 813 731 872 708 768 921 920 967 965 752 944 937 1006
7375 1006 1090 1115 1083 1151 1138 1091 1127 1299 1035 1259 1264 1302 1164 1216 1282 1263 1296 1435 1240 1304 1349 1149 1161 1305 1519
7400 1519 1400 1496 1310 1449 1337 1405 1613 1427 1239 1163 1462 1329 1369 1531 1383 1540 1258 1490 1271 1155 1491
7421 1491 1541 1381 1272 1190 1279 1166 1152 1524 1264 1387 1326 1220 1356 1237 1112 1051 1039 1247 994 1196 899 1055
7443 1055 1168 1121 1058 979 937 871 978 1048 835 780 700 711 716 636 596 598 544 426 664 555 352 358 370 303 249 295 87
7470 87 155 91 164 147 199 -113 -78 -31 74 -8 -211 63 -42 50 -43 -57 -592 -128 -394 -556 -520 -689 -299 -515
7494 -515 -633 -405 -594 -781 -809 -613 -813 -894 -697 -766 -779 -934 -1051 -945 -902 -981 -1072 -1099 -1043 -1007 -1081 -954 -1179 -1112
7518 -1112 -1089 -1250 -1307 -1303 -1243 -1410 -1226 -1228 -1169 -1273 -1296 -1470 -1478 -1124 -1369 -1456 -1397 -1201 -1458 -1460 -1248 -1276 -1596 -1187 -1274
7543 -1274 -1385 -1435 -1258 -1682 -1508 -1407 -1240 -1213 -1497 -1633 -1328 -1270 -1388 -1290 -1538 -1194 -1357 -1265 -1434 -1369 -1261 -1333
7565 -1333 -1362 -1238 -1121 -1159 -1282 -1012 -1209 -1174 -1220 -1109 -902 -1212 -975 -1229 -1023 -1127 -964 -1024 -901 -821 -966 -795
7587 -795 -705 -890 -647 -679 -572 -625 -690 -928 -577 -591 -593 -648 -478 -398 -488 -611 -324 -326 -200 -221 -83 -70 -213 -263 -241
7612 -241 -320 -80 197 145 97 -58 -39 56 247 74 255 201 294 280 242 365 534 559 386 602 544 583 753 492
7636 492 551 747 761 729 842 942 697 894 822 987 875 1145 927 1056 1150 1025 1092 1055 1299 1269 1161 1206 1322
7659 1322 1114 1405 1211 1187 1293 1245 1172 1443 1254 1101 1357 1360 1427 1247 1597 1302 1305 1225 1219 1306 1166 1394 1492 1439
7683 1439 1200 1497 1361 1462 1440 1296 1271 1305 1162 1272 1292 1279 1463 1472 1278 1355 1355 1185 1173 1126 1095 906 1088 1150
7707 1150 1213 1178 1170 863 1010 948 864 1054 1015 864 1082 1037 760 1024 863 1034 862 1066 840 870 742 557 723
7730 723 860 628 457 264 656 641 660 443 561 333 338 246 170 156 271 177 168 23 151 48 -95 19 -174
7753 -174 -104 -87 -101 -209 -31 -343 -304 -251 -248 -208 -336 -493 -397 -531 -538 -646 -714 -594 -715 -669 -675 -628 -745 -684 -735 -867
7779 -867 -937 -859 -852 -998 -811 -868 -1034 -969 -906 -1074 -1097 -1123 -1067 -1139 -1157 -1098 -1038 -1257 -1300 -1278 -1231 -1330 -1232 -1268 -1138 -1209 -1175
7806 -1175 -1310 -1461 -1406 -1571 -1438 -1274 -1435 -1258 -1380 -1348 -1264 -1423 -1240 -1349 -1309 -1198 -1438 -1320 -1342 -1414 -1089 -1309
7828 -1309 -1246 -1436 -1356 -1391 -1234 -1014 -1193 -1299 -1220 -1301 -1103 -1072 -1130 -1309 -1137 -1158 -1200 -990 -1080 -1015 -776 -1128 -1078 -1037
7852 -1037 -842 -818 -912 -855 -1151 -1079 -755 -839 -792 -794 -700 -775 -756 -569 -754 -718 -585 -635 -485 -503 -594 -312 -439 -406 -378
7877 -378 -384 -471 -337 -230 -233 -217 -139 86 -64 -335 57 59 21 137 -42 226 179 276 233 313 378 331 282 410 253 351
7903 351 503 393 406 534 666 659 550 591 709 743 837 709 770 889 932 915 1090 931 694 758 1095 872 895 953
7927 953 992 1012 1113 1234 980 993 1244 1315 1069 1166 1229 1383 1401 1165 1149 1279 1173 1295 1304 1331 1292 1240 1316 1417 1405
7952 1405 1387 1437 1310 1263 1378 1277 1291 1240 1171 1427 1353 1282 1272 1200 1341 1401 1130 1134 1139 1180 1088 1242 1211 1283 1316 1023
7978 1023 1379 1113 900 1306 1186 1114 1194 1235 887 974 896 783 843 899 897 757 786 546 799 886 718 673 902 806
8002 806 721 495 598 615 544 517 674 653 298 277 306 273 20 311 490 457 224 313 -81 210 -14 268 -192
8025 -192 6 -175 -87 6 -44 -146 -147 -146 -385 -175 -487 -382 -400 -466 -376 -410 -600 -427 -611 -755 -792 -739 -951 -835
8049 -835 -738 -803 -796 -668 -937 -892 -933 -843 -999 -745 -944 -775 -941 -1015 -888 -1108 -1163 -1125 -1146 -1080 -1220 -1047 -1121 -1080 -1195
8074 -1195 -1211 -1127 -1071 -1118 -1083 -1281 -1378 -1084 -1422 -1162 -1330 -1116 -1269 -1430 -1317 -1194 -1231 -1340 -1117 -1137 -1076 -1298 -1274
8097 -1274 -1161 -1377 -1216 -1335 -1281 -1214 -1192 -1274 -1355 -1203 -1322 -1142 -1097 -990 -1179 -1211 -1100 -1225 -1064 -1216 -1013 -1122
8119 -1122 -1037 -939 -1224 -1012 -975 -1085 -918 -787 -897 -833 -1043 -751 -667 -776 -689 -819 -764 -737 -962 -605 -342 -540
8141 -540 -713 -373 -631 -443 -651 -715 -442 -291 -314 -273 -353 -347 -243 -166 -108 -219 -323 -107 -38 -64 -32 217 89 166
8165 166 81 306 245 229 195 108 288 376 440 202 458 590 455 295 493 643 673 643 619 894 754 451 741
8188 741 666 806 966
8191I66
$$ Imaginary data points
##PAGE= N=2
##DATA TABLE= (X++(I..I)), XYDATA
0 0 0 0 0 0 0 0 0 0 0 0 0 0 8 -4 8 -8 8 -8 16 -16 20 -24 28 -32 40 -44 52 -59 68 -79 91 -101 117 -132 150
35 150 -167 189 -210 236 -262 293 -322 360 -396 441 -484 536 -591 652 -716 791 -870 962
53 962 -1058 1174 -1298 1445 -1608 1805 -2035 2316 -2659 3099 -3676 4483 -5681 7647 -11454
68 -11454 21539 -106720 -261390 -98728 -127443 -224511 -175227 -125514 -224425 -204847 -126525 -193704
80 -193704 -258662 -170893 -169179 -249326 -216555 -173040 -243683 -247218 -186231 -221837 -272943 -225182
92 -225182 -218673 -265199 -242918 -221163 -270412 -261463 -215925 -255059 -286304 -238600 -244208 -285137 -247923
105 -247923 -227636 -286472 -279538 -220589 -253060 -292559 -247654 -245344 -285651 -248001 -224309 -286343
117 -286343 -282055 -212268 -240129 -292753 -244951 -220850 -270401 -254055 -213384 -254190 -264524 -208648
129 -208648 -223581 -265074 -223213 -204083 -251941 -234510 -188455 -226465 -244298 -189195 -195679 -235390
141 -235390 -198638 -180323 -222707 -202265 -158017 -196363 -211551 -154923 -161642 -202586 -160739 -136899
153 -136899 -186897 -169918 -113386 -149294 -178145 -121143 -113315 -158008 -129588 -97285 -138563 -133521
165 -133521 -80356 -106945 -139275 -86445 -70316 -117163 -99648 -58662 -87198 -97085 -54727 -61190
177 -61190 -85447 -50495 -36364 -67868 -49833 -17987 -43772 -48458 -8727 -14030 -35210 -5002
189 -5002 8194 -18384 -1572 26459 1255 -385 39118 28777 6832 41840 53553 20799
201 20799 39226 73608 45035 35152 80670 76264 43471 75055 97922 64824 72752 108901 87358
214 87358 73070 113606 113346 79246 105896 135285 102671 99500 137450 125780 105714 135387 140904
227 140904 115033 133915 156669 129805 127846 160814 148655 128303 157048 163602 136009 151235
239 151235 173203 147869 143983 174248 162045 141684 168951 175209 144550 158235 182629 155211
251 155211 147751 179959 169827 144022 169361 181233 149694 155059 182635 162131 148111 176462
263 176462 171207 144966 165691 178461 148357 150115 177840 160407 142126 165362 165474 140443 153389
276 153389 165771 140119 140381 162714 145173 128740 150629 149270 123906 135218 148959 123921
288 123921 120463 142656 126508 108384 129378 128746 102400 113094 126993 101364 95246 117463 103416
301 103416 82269 101961 104649 75870 82121 99123 75194 64627 85515 75923 53938 69134
313 69134 73458 46961 49861 66550 45165 32410 52795 45950 22942 34502 40163 17042 16882
326 16882 31050 13796 1283 18449 11834 -10461 572 7159 -16325 -16838 -2099 -18464 -31587
339 -31587 -15885 -20354 -42209 -32778 -23937 -46158 -48916 -32642 -47430 -62296 -46122 -48142 -69757
352 -69757 -62214 -51708 -71536 -77217 -60621 -71451 -87915 -73423 -71731 -92040 -86534 -75511 -92949
365 -92949 -98707 -83350 -91200 -106962 -94426 -90106 -108833 -106036 -93882 -108991 -115141 -99857 -106735
378 -106735 -121146 -108906 -104682 -122487 -119882 -106769 -119879 -126851 -111021 -115581 -130893 -118952 -112612
391 -112612 -129278 -126692 -112797 -123736 -130876 -115564 -117827 -132113 -121331 -112495 -127916 -126312 -111313
404 -111313 -120178 -128224 -113789 -113704 -126594 -117458 -107813 -120610 -120525 -106453 -113189 -121193 -107189 -105563
418 -105563 -118156 -109308 -99133 -110193 -111042 -97355 -101643 -108973 -95855 -92352 -103805 -96327 -84880
431 -84880 -94898 -95641 -81234 -84169 -91146 -78270 -73346 -84271 -77920 -65269 -73327 -75464 -60597 -61667
445 -61667 -69102 -57155 -51262 -61157 -55508 -42474 -48883 -52005 -37902 -37083 -45230 -34486 -27018 -36509
459 -36509 -31719 -18597 -23924 -26901 -13888 -12330 -19586 -9702 -1458 -10056 -6407 7153 2904 -870
473 -870 11824 14047 7207 16660 24952 17116 19881 32679 29100 24920 36946 39603 32647 40933 49092
488 49092 40938 42811 54596 51324 47191 57576 60503 52931 59956 67284 59527 60714 71982 69012
502 69012 64079 73685 76015 69211 74794 82021 75330 75298 85915 83465 77961 86592 89064 81690 86799
517 86799 93951 87916 86204 95371 93974 87566 94274 97809 90148 93303 100767 94194 91237 99871 98682
532 98682 91561 96902 100748 92951 94311 101669 95725 90954 99127 98752 91309 95435 99096 92168 91884
547 91884 98515 93439 88084 95306 95560 87344 90842 94331 86843 86483 92400 86840 81924 88093 87225 79259
563 79259 81961 84715 76569 76002 81804 75651 69612 75504 73557 65689 68351 69452 61464 61460 65824 58927
579 58927 52803 58328 56800 48271 50459 51929 44270 43089 47271 41075 34751 39047 38283 30493 31224
594 31224 33340 25715 23338 27857 22199 15455 18803 18892 11375 10558 12182 5857 2583 6100 2012 -4844
610 -4844 -2214 -2071 -9452 -10515 -8634 -14574 -18110 -14523 -16845 -24229 -22830 -21716 -28419 -29342 -26687 -32984
626 -32984 -36249 -31580 -34352 -41825 -39967 -38172 -44496 -45454 -42391 -48165 -51469 -46888 -49323 -56892 -54034
641 -54034 -52357 -58659 -58740 -55710 -61717 -64538 -60010 -61915 -68416 -65533 -63951 -70016 -69273 -66183 -71586 -73832
657 -73832 -68934 -70977 -75917 -72757 -71546 -77156 -76452 -72159 -76982 -79462 -74121 -75086 -79495 -76834 -75100
672 -75100 -79662 -78437 -74353 -78144 -80370 -75327 -75050 -79842 -77451 -74596 -78318 -77746 -73527 -75795 -77908
687 -77908 -73786 -72848 -76488 -74451 -70878 -73895 -73723 -69155 -70570 -73185 -68709 -66987 -70401 -67678 -63909
702 -63909 -66290 -66583 -61442 -62002 -64415 -59531 -57401 -60940 -57593 -53027 -56235 -56394 -49722 -50167 -52836 -47913
718 -47913 -44643 -48307 -45141 -39787 -42921 -42585 -35762 -36292 -39086 -33068 -29827 -33792 -31116 -24870 -27171
733 -27171 -27152 -20587 -20559 -23150 -16838 -14142 -17549 -14084 -8507 -10495 -10480 -3757 -3912 -6438 -615 2776 -502
750 -502 2375 8101 6249 6000 11965 12127 10141 15372 18760 15340 17706 23947 21562 20676 26789 27411
766 27411 24846 29578 32842 29712 31173 36435 35229 33728 39707 40824 37019 40971 45057 41939 41976
781 41976 47278 46676 44849 49518 50895 46993 50123 54540 50934 50772 56091 55065 52533 57280 58628
796 58628 54266 57036 61221 57702 56917 62239 61037 57656 62260 63371 58700 61347 65734 61568 60081
811 60081 65217 64198 59920 63825 65885 60706 62013 66419 62104 60185 65087 63297 59088 63017 64699
826 64699 59220 59331 63605 59938 56712 61316 60283 55238 58654 59997 54341 54392 58329 54215 51065 54773
842 54773 53964 48481 50665 52643 46589 46006 49711 45922 42277 45446 44544 39166 40359 42365 36694 34827
858 34827 39065 35416 30580 34108 33298 27307 28286 30441 25041 23015 26343 23122 18146 20834 20786 14211
874 14211 15373 17880 11989 9433 12691 10082 5057 7517 7625 1650 1818 4369 -884 -4122 -56
889 -56 -2859 -8291 -5498 -5377 -11421 -11527 -8537 -13688 -17149 -13139 -15051 -20816 -18740 -17572 -23797 -24204
905 -24204 -20889 -25314 -29079 -25128 -26549 -32340 -30476 -28573 -34343 -35304 -31249 -35038 -38929 -35147 -36020
920 -36020 -41488 -39526 -37395 -42313 -43539 -39158 -42327 -46624 -42860 -42639 -48096 -46296 -43583 -48380 -49401
935 -49401 -45118 -47923 -51989 -48239 -47207 -52411 -50894 -47171 -51855 -53282 -48349 -50473 -54723 -50599 -49179
950 -49179 -53992 -52840 -48781 -52738 -54437 -49127 -50522 -54639 -50663 -48292 -53402 -52039 -47625 -50940 -52623
965 -52623 -47578 -47618 -51876 -48146 -45165 -49824 -48987 -43820 -46697 -48411 -42989 -42705 -46896 -43467 -39814 -43599
981 -43599 -42998 -37502 -39820 -42000 -36209 -35376 -39453 -35634 -31741 -35128 -34390 -28671 -30430 -32701 -27248 -25499
997 -25499 -29465 -25915 -21260 -24669 -24249 -18334 -19474 -21793 -16109 -14276 -18010 -15222 -9870 -12964 -13289
1012 -13289 -7185 -7759 -10294 -5126 -2505 -6014 -3682 1390 -1082 -1880 4015 4142 1112 5940 9005
1027 9005 5030 7173 12361 10017 9106 14625 15179 11929 16005 19527 15560 16727 22411 20244 18459
1042 18459 24229 24551 20936 24715 28603 24543 25488 30962 29103 26388 31923 33014 28567 32082 35949
1057 35949 32239 32010 37587 35737 33131 37817 39269 34971 37481 41941 38119 37018 42486 41002 37731
1072 37731 42306 43792 39578 41563 45213 41859 40477 45726 44283 40920 44865 46355 41796 43030 47129
1087 47129 43542 41743 46416 45638 41286 44706 46888 41813 42506 46256 43312 40665 44633 44359 39896
1102 39896 42071 44606 39912 39171 43532 40539 37082 40715 40775 35703 37133 39680 35451 34009 37520
1117 37520 35230 31517 34162 34672 29757 30705 33310 28806 27299 30568 28125 23840 26828 27189 22189
1132 22189 22733 25470 20956 18578 22776 20021 15195 18179 18897 13001 13513 16374 11680 9009 12755
1147 12755 10776 5643 8216 9462 3770 3446 6557 2352 -672 2863 1444 -3771 -1998 -399 -5707
1162 -5707 -6411 -3474 -6847 -9653 -6900 -8277 -12642 -11390 -9979 -14082 -15420 -12592 -14863 -18530 -16034
1177 -16034 -16677 -21086 -20092 -17996 -22273 -23655 -20500 -23033 -26406 -23951 -23630 -28363 -27766 -24956 -28698 -30834
1193 -30834 -27343 -28789 -32878 -30350 -29085 -33734 -33397 -30240 -33266 -36068 -32464 -33249 -37077 -34592 -33003
1208 -33003 -37431 -37432 -33790 -36363 -39095 -35671 -36008 -39566 -37233 -35123 -39387 -39299 -35390 -38153 -40558 -36507
1224 -36507 -36880 -40462 -37925 -35791 -39642 -39545 -35685 -37799 -40199 -36168 -36059 -39648 -37254 -34603 -38055 -38365
1240 -38365 -33967 -35145 -37938 -34442 -33004 -36512 -34476 -31341 -34073 -34560 -30699 -31076 -33341 -30464 -28585
1255 -28585 -31030 -29898 -26606 -28309 -29289 -25636 -24892 -26931 -24358 -22221 -24476 -23277 -19875 -21378 -22063
1270 -22063 -18288 -17500 -19832 -17002 -14331 -16656 -15691 -11980 -13012 -14731 -10237 -9128 -11879 -9213 -6157
1285 -6157 -8486 -8228 -3403 -4304 -6122 -2265 -453 -3352 -1188 2133 30 237 4470 4127 1902 5665
1301 5665 7604 4777 6686 10081 8391 8096 12236 11868 9649 12994 14692 12789 14367 17046 15371
1316 15371 15423 18952 18535 16548 19691 21531 19357 20339 23508 21785 21113 24655 24711 22560 25404 26976
1332 26976 24675 25528 28741 26958 25814 29189 29672 27182 29134 31464 29224 28971 32186 31315 29648 32169
1348 32169 33101 30724 31709 33987 32032 31791 34150 33522 31499 33843 34719 31973 32645 34856 33159 32319
1364 32319 34697 33888 31435 33686 34461 31517 32090 34315 32017 30822 33174 32246 29695 31319 32315 29069
1380 29069 29265 31480 29310 27589 29847 29089 26201 27608 28236 25822 24907 26915 24821 22919 24789 24151
1396 24151 21257 22167 23070 20439 19421 20760 19167 17073 18574 18103 15295 15794 16805 13990 12811 14429
1412 14429 12563 10382 11780 11310 8356 8730 9849 6842 5610 7197 5626 3066 4081 4402 1261
1427 1261 1097 2361 -16 -1482 -259 -1286 -3929 -2973 -3028 -5695 -6183 -4724 -6828 -8720 -7249 -8349
1443 -8349 -10740 -10027 -9727 -12221 -12695 -11607 -13194 -15138 -13968 -14517 -16935 -16085 -15755 -18093 -18708 -17412 -19138
1460 -19138 -20640 -19466 -19699 -21906 -21342 -20727 -22903 -23776 -22043 -23345 -25270 -23745 -23721 -25924 -25538 -24369
1476 -24369 -26301 -27438 -25845 -26296 -28362 -26944 -26667 -28716 -28414 -27045 -28500 -29344 -27647 -28188 -29738 -28846
1492 -28846 -28254 -29868 -29385 -28093 -29072 -30136 -28660 -28468 -29994 -28988 -28261 -29478 -29402 -27595 -28613 -29414 -27453
1509 -27453 -27758 -28907 -27801 -26619 -27660 -27605 -25895 -26527 -27276 -25382 -24784 -26011 -25106 -23535 -24614 -24415 -22681
1526 -22681 -22685 -23488 -21859 -20933 -21949 -20978 -19502 -20068 -20037 -17882 -18006 -18494 -16904 -15705 -16433 -15652 -13848 -14329
1544 -14329 -14170 -12269 -11999 -12534 -10955 -9858 -10349 -9470 -8078 -8213 -8010 -6337 -6056 -6171 -4784 -3614 -4061
1561 -4061 -3410 -1447 -1822 -1659 22 532 53 1539 2562 2106 2682 4434 4460 4353 5962 6681 5995 7467
1579 7467 8824 8253 8638 10113 10281 10221 11344 12153 12028 12467 13840 13709 13876 15168 15408 15068 16301 17104
1597 17104 16707 17228 18384 18387 18275 19491 19641 19382 20421 21154 20632 21017 22053 21897 22154 23025 23226 22681 23598
1616 23598 24206 23591 23800 24869 24398 24466 25342 25311 24667 25375 25948 25490 25349 26224 26012 25450 26288 26138 25522 26066
1636 26066 26201 25744 25670 26375 25848 25243 25660 25693 25150 25231 25332 24774 24460 24777 24414 23675 23829 23703 23050 23037 22971
1657 22971 22218 21719 21837 21547 20855 20841 20360 19787 19482 19258 18589 17936 17938 17548 16808 16417 16098 15304 14791 14790 13991
1678 13991 13375 13062 12637 12034 11363 11172 10225 9827 9510 8815 7898 7896 7252 6200 5914 5764 4817 4374 4219 3433
1698 3433 2526 2271 1742 739 447 52 -893 -1163 -1425 -2477 -3048 -3246 -3919 -4691 -5082 -5227 -6158 -6606 -6819
1717 -6819 -7681 -8225 -8377 -8908 -9642 -9970 -10643 -11015 -11362 -11852 -12300 -12625 -12782 -13543 -14204 -14400 -14891 -15376 -15585 -16065
1737 -16065 -16365 -16656 -17075 -17421 -17693 -18286 -18599 -18861 -18750 -19275 -19633 -19600 -19921 -20528 -20427 -20751 -21118 -21091 -21305 -21548
1757 -21548 -21972 -21957 -22111 -22220 -22294 -22378 -22701 -22631 -22550 -22858 -22759 -22928 -22879 -22653 -22962 -22899 -22872 -22784 -22749 -22591 -22563 -22712 -22382
1780 -22382 -22173 -22217 -22121 -21825 -21921 -21667 -21130 -21465 -21140 -20568 -20552 -20675 -20192 -19654 -19678 -19243 -18973 -18926 -18325 -17853 -17663
1801 -17663 -17665 -16798 -16739 -16257 -15595 -15107 -15380 -14712 -13852 -13823 -13425 -12608 -12213 -12323 -11160 -10763 -10798 -9961 -9283 -9271 -8820
1822 -8820 -7902 -7895 -7522 -6630 -6155 -6111 -5190 -4510 -4386 -4090 -2953 -3074 -2669 -1472 -1372 -1040 -162 340 291 768
1842 768 1776 1978 2136 3140 3576 3565 4220 4962 5276 5676 6154 6659 6622 7438 8101 7927 8501 9408 9598 9860
1862 9860 10548 10965 10778 11201 12111 12329 12266 13094 13441 13208 14390 14618 13963 14858 15831 15286 15636 16643 16479
1881 16479 16206 16966 17204 16888 17458 18406 18114 17867 18954 18781 18508 19398 19734 19004 19280 20165 19611 19355 20357
1900 20357 19902 19631 20440 20403 19897 20104 20768 20251 20046 20499 20539 19705 20479 20465 19530 19872 20297 19686 19233 19839
1920 19839 19544 19067 19222 19204 18496 18369 18603 18096 17408 17865 17501 16687 17052 17039 16054 15876 16080 15296 14698 14894
1940 14894 14669 13549 13710 13685 12861 12369 12701 12116 10933 11331 11279 9941 9790 10219 8751 8306 8857 8014 6890
1959 6890 7345 7057 6047 5615 5912 4956 4216 4505 4003 2520 2936 2953 1362 1426 1703 604 -187 105 -273
1978 -273 -1438 -1478 -1257 -2767 -3214 -2701 -3615 -4581 -4127 -4571 -5543 -5753 -5614 -6730 -7273 -6684 -7424 -8631 -8132
1997 -8132 -8356 -9717 -9670 -9305 -10211 -10957 -10484 -11055 -11981 -11671 -11769 -12998 -12798 -12275 -13552 -13921 -13467 -14208 -14761
2016 -14761 -14562 -14358 -15597 -15562 -15010 -15822 -16466 -15833 -16175 -17076 -16666 -16570 -17768 -17463 -16752 -17726 -18114 -17496 -17489 -18578
2036 -18578 -17851 -17613 -18546 -18251 -17575 -18249 -18837 -17907 -18046 -18915 -18231 -17752 -18330 -18653 -17491 -17954 -18492 -17360 -17544
2055 -17544 -18137 -17530 -16755 -17543 -17553 -16300 -16658 -17232 -16179 -15859 -16558 -16105 -15034 -15627 -15452 -14468 -14766 -15079 -13895
2074 -13895 -13313 -14169 -13182 -12404 -12924 -12762 -11415 -11376 -11867 -10895 -10119 -10677 -10088 -9111 -9357 -9172 -8049 -7830 -8153
2093 -8153 -7223 -6400 -7019 -6611 -5257 -5571 -5910 -4394 -3662 -4601 -3598 -2542 -3045 -2815 -1493 -1713 -2006 -445
2111 -445 86 -736 204 1235 1109 956 2386 2256 1981 3124 3828 3167 3589 5151 4483 4568 5905 6071 5665
2130 5665 6648 7422 6967 7172 8626 8221 8122 9487 9211 8926 9935 10430 10228 10592 11614 11384 11094 12416
2148 12416 12354 11739 12684 13437 12819 13093 14178 14038 13523 14501 14785 13946 14958 15826 15051 15090 15835 15719 15249
2167 15249 16207 16252 15651 16008 16893 16011 15682 16852 16706 15910 16843 17034 16260 16373 17181 16274 15911 16809 16730 15647
2187 15647 16080 16596 15676 15701 16510 15584 14988 15943 15589 14750 15111 15423 14115 14021 14951 14023 13284 14257 13914 12500
2207 12500 13095 13512 12215 12155 12586 11763 10909 11479 11405 9988 10334 10910 9485 9095 9696 8994 8009 8784 8610
2226 8610 7296 7470 7529 6447 5866 6444 5866 4577 5162 5039 3787 3744 4173 2974 2625 3032 2419 1254
2244 1254 1725 1559 171 258 474 -502 -977 -597 -953 -2062 -1853 -1830 -2943 -3343 -3033 -3672 -4523 -4045 -4449
2263 -4449 -5439 -5185 -4962 -6222 -6816 -6085 -6836 -7807 -7416 -7602 -8739 -8604 -8102 -9213 -9522 -8821 -9593 -10672
2281 -10672 -9902 -9977 -11278 -10953 -10672 -11152 -11848 -11287 -11795 -12714 -11988 -11960 -12964 -12918 -12285 -13343 -13860 -12931 -13397
2300 -13397 -14462 -13799 -13236 -14402 -14395 -13945 -14508 -14790 -14110 -14415 -15144 -14625 -14156 -14946 -14836 -14411 -14837 -15189 -14568
2319 -14568 -14460 -15173 -14839 -14101 -14773 -15003 -14302 -14276 -14778 -14032 -13728 -14374 -14084 -13423 -13569 -13703 -12866 -12747 -13372 -12649
2339 -12649 -12263 -12837 -12530 -11687 -11817 -11999 -11082 -11098 -11450 -10710 -9990 -10565 -10571 -9212 -9607 -9722 -8830 -8431 -8910 -8172
2359 -8172 -7402 -7997 -7883 -6690 -6684 -6919 -5881 -5573 -6041 -5324 -4484 -5148 -4735 -3799 -3926 -3980 -2686 -2477 -3189 -2208
2379 -2208 -1418 -2099 -1826 -616 -757 -980 52 480 -44 691 1564 986 1278 2232 2457 2021 3293 3461 2896
2398 2896 3776 4550 4226 4295 5195 5202 5091 5796 6338 5916 6483 7483 7252 7088 7895 8164 7656 8218 8793 8803 8822
2419 8822 9671 9662 9236 10162 10502 9769 10283 11161 10824 10937 11602 11587 10883 12007 12171 11566 11983 12652 12217 12103
2439 12103 13111 12876 12256 13128 13294 12540 12920 13440 12921 12886 13573 13229 12641 13338 13457 12920 13016 13689 12875 12719
2459 12719 13407 13194 12349 13104 13218 12557 12572 12991 12088 12073 12647 12371 11701 11863 12041 11314 11155 11817 11266 10667
2479 10667 10802 10748 10232 10359 10268 9957 9544 9852 9228 8717 8787 8826 8018 8074 8017 7430 7076 7312 6878 6258 6531
2500 6531 6600 5748 5147 5505 4806 4432 4778 4432 3434 3668 3876 3032 2614 2992 2365 1686 2065 2008 955 1159
2520 1159 874 172 -6 343 -267 -1070 -942 -1003 -1837 -1612 -1799 -2315 -2665 -2690 -2861 -3468 -3604 -3614 -4299 -4315 -4214
2541 -4214 -4926 -5261 -4994 -5369 -6280 -6048 -6249 -6652 -6874 -6564 -7248 -7598 -7343 -7625 -8325 -8308 -7969 -8733 -8880 -8611
2561 -8611 -9153 -9524 -9232 -9500 -9990 -9829 -9693 -10300 -10494 -10489 -10701 -11008 -10600 -10730 -11343 -11025 -11068 -11623 -11638 -11295 -11602
2582 -11602 -11970 -11650 -11367 -11855 -11894 -11625 -11949 -11759 -11632 -11742 -11946 -11602 -11621 -11978 -12006 -11425 -11695 -11751 -11273 -11416 -11647
2603 -11647 -11194 -11162 -11307 -11023 -10559 -10863 -11126 -10564 -10292 -10480 -10211 -9784 -9923 -9866 -9096 -9474 -9364 -9060 -8761 -8795
2623 -8795 -8380 -8009 -8229 -7955 -7616 -7394 -7515 -6956 -6650 -6760 -6532 -5982 -6078 -5999 -5447 -5031 -5156 -4779 -4328 -4355 -4406
2644 -4406 -3740 -3769 -3333 -3115 -2884 -2860 -2465 -2136 -2019 -1743 -1383 -1316 -1281 -573 -252 -442 -40 213 245 599 1145
2665 1145 1270 1272 1825 2029 1922 2350 2884 2822 3133 3685 3603 3627 3988 4383 4362 4564 5014 5204 5135 5436 5830 5908
2687 5908 6104 6537 6475 6605 7179 6986 7185 7678 7778 7713 8043 8328 8140 8322 8696 8511 8535 8948 9178 9126 9209
2708 9209 9453 9539 9728 9869 9638 9752 9890 10207 10125 9993 10407 10340 10013 10198 10349 10266 10455 10481 10260 10162 10525 10299
2730 10299 10426 10199 10217 10171 9954 10162 9808 9922 10070 9821 9676 9749 9849 9457 9357 9495 9294 9003 9052 9136 8787
2751 8787 8932 8873 8349 8309 8086 7700 7691 7603 7577 7293 7119 7054 6732 6619 6801 6454 5912 6190 5994 5469 5246 5282
2773 5282 4784 4602 4575 4398 4077 4327 3725 3551 3432 3147 2959 2545 2372 2099 2167 2023 1601 1413 1226 1234 650
2794 650 494 388 235 -180 -415 -529 -625 -1073 -1002 -1471 -1655 -1776 -2044 -2401 -2389 -2414 -2920 -3149 -3204 -3238 -3654 -3900
2816 -3900 -3811 -4236 -4513 -4045 -4765 -4979 -5056 -5330 -5457 -5478 -5861 -6003 -6365 -6013 -6425 -6679 -6585 -6788 -6987 -7008 -7152
2837 -7152 -7499 -7740 -7500 -7822 -8028 -7940 -7963 -8352 -8102 -8257 -8559 -8576 -8564 -8656 -8979 -8750 -8760 -8922 -8977 -8849 -9180 -9167
2859 -9167 -9206 -8949 -9267 -9258 -9042 -9123 -9055 -9079 -8970 -9202 -9026 -8816 -9138 -8707 -8744 -8871 -8915 -8827 -8761 -8695 -8571 -8346 -8362 -8191
2883 -8191 -7839 -8160 -8138 -7693 -7809 -7798 -7611 -7273 -7172 -7115 -6923 -6886 -6771 -6345 -6297 -6440 -6275 -6049 -5886 -5753 -5311
2904 -5311 -5387 -5285 -4919 -4794 -4868 -4459 -4208 -4133 -4073 -3798 -3733 -3631 -3317 -3110 -2986 -2651 -2512 -2347 -2352 -1910 -1927 -1869 -1610
2927 -1610 -1139 -1027 -793 -858 -448 -288 -92 66 205 720 747 867 882 1363 1308 1459 1917 2065 1930 2294 2579
2948 2579 2791 2783 2991 3269 3200 3627 3973 3878 4068 4390 4385 4503 4831 4988 4776 5158 5284 5387 5280 6040 5802 5928
2970 5928 6084 6477 6309 6822 6742 6670 6542 6957 6873 6826 7300 7525 7271 7460 7652 7518 7510 7938 7720 7538 7781 8004
2992 8004 7873 7977 8001 7837 7940 8075 8202 8060 8074 8140 7968 8041 8026 8082 7573 7838 8089 7609 7982 7811 7676 7643
3014 7643 7791 7560 7378 7315 7352 7086 7241 7256 7020 6920 6894 6683 6372 6533 6268 6198 6032 6028 5764 5743 5831 5492 5092
3037 5092 5480 5315 4805 4740 4874 4721 4339 4625 4286 3982 4076 3844 3484 3402 3722 3115 2786 2819 2705 2259 2265 2309
3059 2309 1710 1684 1818 1518 1032 1239 1094 606 660 493 103 -101 201 -462 -511 -396 -667 -1057 -1061 -1017 -1294 -1560
3081 -1560 -1619 -1884 -2228 -1981 -2290 -2615 -2811 -2686 -2869 -3276 -3289 -3498 -3724 -3854 -3659 -4201 -4349 -4276 -4415 -4744 -4564
3102 -4564 -4832 -5064 -5035 -4898 -5539 -5526 -5466 -5530 -5810 -5852 -5948 -6110 -6207 -6041 -6374 -6582 -6416 -6617 -6849 -6511 -6695 -6899
3124 -6899 -6860 -6676 -6872 -7055 -7046 -6917 -7202 -7102 -6873 -7397 -7318 -6915 -7205 -7293 -7019 -7058 -7374 -6995 -6910 -7356 -7071 -7099
3146 -7099 -7005 -7144 -7018 -6956 -6936 -6849 -6743 -6888 -6566 -6460 -6566 -6355 -6313 -6139 -6482 -6029 -5922 -5969 -5975 -5632 -5745 -5770 -5448
3169 -5448 -5305 -5481 -4955 -4716 -4756 -4925 -4571 -4655 -4713 -4260 -4118 -4041 -3999 -3614 -3722 -3769 -3257 -3140 -3292 -2869 -2919 -2902
3191 -2902 -2747 -2383 -2427 -2260 -2028 -1963 -1948 -1558 -1480 -1504 -1298 -1101 -874 -1079 -625 -452 -391 -226 172 131 10 420
3213 420 428 654 1092 1225 1158 1360 1644 1635 1720 2123 2354 2009 2527 2614 2424 2567 3063 3002 3071 3516 3606 3583 3693 3798
3237 3798 3967 4135 4309 4344 4357 4618 4673 4800 4950 5026 5045 5188 5456 5165 5107 5520 5609 5452 5796 5905 5862 6016
3259 6016 6138 6143 5846 6235 6116 6166 6261 6497 6012 6241 6260 6348 6234 6502 6385 6408 6241 6507 6440 6466 6498 6296 5986
3282 5986 6281 6484 6028 6029 6195 5958 6005 6087 5931 5672 5858 5746 5707 5761 6075 5672 5405 5350 5196 5092 5137 5398
3304 5398 4755 4962 4947 4704 4321 4632 4474 4320 4114 4171 3920 3863 3783 3677 3482 3297 3412 3169 2949 2916 2831 2637
3326 2637 2605 2154 2061 2343 2247 1831 1588 1798 1427 1384 1129 972 621 1005 606 141 209 572 94 -108 -267
3347 -267 -531 -490 -432 -551 -1037 -1021 -1013 -1375 -1414 -1568 -1554 -1829 -1923 -1992 -2269 -2585 -2543 -2545 -2834 -2664 -2810 -3240 -3170 -3042
3371 -3042 -3537 -3487 -3440 -3621 -3874 -4014 -3652 -4260 -4369 -4223 -4418 -4633 -4631 -4805 -4802 -4745 -4822 -4928 -5156 -4860 -5079 -5572
3393 -5572 -5238 -5202 -5361 -5462 -5224 -5701 -5653 -5381 -5811 -5807 -5721 -5761 -5851 -5759 -5647 -5796 -5996 -5445 -5862 -5852 -5876 -5643 -5622
3416 -5622 -5633 -5441 -5640 -5826 -5369 -5382 -5857 -5442 -5373 -5482 -5456 -5258 -5303 -5417 -5020 -5022 -5230 -4978 -4680 -4806 -4798 -4374 -4782
3439 -4782 -4613 -4418 -4358 -4455 -4237 -3939 -4016 -3823 -3787 -3757 -3878 -3436 -3546 -3537 -3263 -3218 -3218 -3017 -2927 -2730 -2711 -2547 -2385 -2516
3463 -2516 -2440 -2206 -2143 -2032 -1724 -1667 -1628 -1358 -994 -1291 -1315 -972 -1064 -762 -619 -447 -419 -67 69 120 83 434 333
3486 333 527 618 857 998 969 1324 1282 1571 1707 1705 1774 2154 2037 2136 2324 2335 2565 2454 2886 2919 2899 3211 3439
3509 3439 3160 3274 3628 3568 3615 3981 3775 3755 3948 4143 4038 4007 4368 4332 4369 4480 4598 4582 4776 4843 4706 4578
3531 4578 5158 4927 4984 5048 5247 4962 5115 5292 5117 5017 5087 5233 5249 5323 5192 5173 5304 5258 5315 5226 5246 5471 5132
3554 5132 5125 5221 5026 5183 5239 4967 5006 5266 4983 4948 4835 4793 4784 4708 4952 4654 4611 4685 4504 4329 4512 4385 3901 4256
3578 4256 4263 3998 3893 3972 4021 3777 3848 3716 3282 3338 3448 3102 2909 3061 2991 2863 2808 2849 2552 2589 2437 2237 1919
3601 1919 1868 1868 1750 1770 1492 1490 1538 1419 1306 932 1081 1094 637 440 425 254 78 200 80 0 -82 -180 -386 -574
3625 -574 -460 -665 -896 -858 -1101 -1161 -1382 -1439 -1596 -1474 -1680 -1622 -2016 -2056 -2096 -2349 -1946 -2273 -2417 -2624 -2840 -2802
3647 -2802 -2895 -2988 -2967 -3263 -3570 -3357 -3552 -3732 -3461 -3808 -3761 -3808 -3446 -4177 -4103 -4076 -3925 -4351 -4192 -4370 -4482 -4295
3669 -4295 -4234 -4619 -4580 -4427 -4701 -4764 -4514 -4622 -4746 -4691 -4654 -4816 -4864 -4544 -5016 -4873 -4718 -4691 -4784 -4729 -4656 -4711 -4926
3692 -4926 -4639 -4663 -4873 -4866 -4655 -4695 -4575 -4607 -4610 -4690 -4278 -4510 -4598 -4213 -4387 -4531 -4208 -4122 -4149 -4119 -3992 -4005 -3985 -3824
3716 -3824 -3771 -3744 -3715 -3536 -3492 -3687 -3239 -3534 -3143 -3206 -2979 -3152 -3037 -2788 -2974 -2856 -2702 -2468 -2495 -2360 -2292 -2117
3738 -2117 -2019 -1749 -1704 -1848 -1879 -1602 -1575 -1298 -1477 -1108 -1147 -968 -646 -812 -686 -686 -683 -311 -68 -193 -108 195 213
3761 213 225 567 762 508 460 973 867 815 1121 1135 1018 1420 1626 1665 1498 1959 1859 2004 2184 2030 2223 2421
3783 2421 2592 2581 2694 2762 2873 2658 2900 3045 3180 3063 3367 3170 3480 3502 3540 3508 3460 3642 3601 3608 3607 3788 3780 3845
3807 3845 4036 3967 3901 3983 3999 4171 4176 4160 4165 4212 4426 4246 4234 4199 4285 4110 4465 4385 4246 4271 4342 4100 4378 4480 4188
3832 4188 4053 4158 4324 4222 4168 4106 4019 4120 4156 3939 3924 3980 4050 3835 3891 3819 3962 3768 3609 3726 3398 3557 3750
3855 3750 3448 3317 3153 3318 3016 3322 3023 3017 2785 2810 2827 2625 2794 2637 2432 2308 2521 2508 2200 2151 1995 1835
3877 1835 1953 1720 1794 1753 1771 1596 1603 1378 1178 1183 1149 901 812 947 1013 480 601 388 357 184 201 -7 -87 -224
3901 -224 -187 -585 -356 -461 -503 -902 -736 -672 -1045 -1043 -1101 -1272 -1332 -1521 -1496 -1623 -1605 -1749 -1799 -1850 -1990 -2034 -2158 -2265
3925 -2265 -2269 -2297 -2403 -2480 -2820 -2653 -2527 -2725 -2764 -2740 -2804 -2892 -2981 -3093 -3369 -3101 -3414 -3231 -3351 -3310 -3253 -3475 -3600
3948 -3600 -3474 -3595 -3503 -3566 -3603 -3740 -3601 -3582 -3754 -3655 -3550 -3883 -3808 -3838 -3818 -3921 -3704 -3694 -3792 -3799 -3771 -3792 -3831 -3914 -3579
3973 -3579 -3955 -3746 -3546 -3667 -3885 -3882 -3826 -3755 -3462 -3564 -3651 -3735 -3346 -3502 -3363 -3305 -3353 -3187 -3266 -3270 -3288 -3268 -2964 -3185
3997 -3185 -3064 -2899 -2918 -2944 -2716 -2731 -2838 -2532 -2563 -2541 -2331 -2236 -2407 -2328 -2137 -1951 -2132 -1895 -1558 -1493 -1693 -1427
4019 -1427 -1636 -1541 -1496 -1416 -1458 -1258 -1264 -1197 -1150 -1264 -702 -814 -608 -342 -228 -529 -262 -93 -272 125 91 224 409
4042 409 400 481 338 624 417 820 909 1000 840 1203 1322 1186 1312 1395 1697 1471 1716 1575 1648 1875 1796 1851 2059
4065 2059 2165 2248 2145 2399 2366 2369 2477 2594 2729 2615 2645 2654 2666 2936 2903 2938 2958 2991 3171 3128 3040 3233 3211 3186 3062
4090 3062 3100 3172 3393 3212 3347 3352 3319 3332 3324 3510 3354 3497 3476 3565 3346 3494 3582 3236 3558 3559 3600 3269 3507 3515 3369
4115 3369 3499 3554 3309 3250 3431 3367 3267 3279 3177 3112 3220 3136 3022 2916 3127 3048 2862 3217 3022 2866 2734 2679
4137 2679 2672 2702 2716 2558 2437 2415 2200 2423 2172 2127 1950 1938 1957 2276 1945 2055 1860 1707 1731 1566 1605 1367 1363 1174
4161 1174 1387 1255 1201 825 1185 953 889 703 729 637 636 606 402 268 84 246 206 -35 -124 -112 -339 -440 -404
4184 -404 -313 -469 -635 -675 -904 -907 -1009 -930 -1118 -1127 -1213 -1283 -1133 -1103 -1448 -1490 -1512 -1723 -1739 -1676 -1695 -1969 -1684 -2003 -2110
4209 -2110 -2146 -2106 -2204 -2304 -2165 -2340 -2419 -2478 -2406 -2404 -2462 -2680 -2572 -2819 -2562 -2649 -2988 -2781 -2750 -2924 -2864 -2593 -3021 -2943
4233 -2943 -2877 -3117 -3178 -2953 -2858 -2756 -3078 -2808 -2868 -2931 -2737 -2908 -3034 -3161 -2874 -3028 -3051 -2956 -2846 -2969 -3014 -2636
4255 -2636 -3080 -2945 -2774 -3048 -2831 -2828 -2882 -2722 -2658 -2569 -2662 -2811 -2707 -2717 -2734 -2602 -2642 -2497 -2392 -2373 -2229 -2313 -2130
4278 -2130 -2148 -2275 -2304 -2210 -2081 -2002 -1933 -2060 -1913 -1890 -1879 -1697 -1704 -1461 -1581 -1467 -1557 -1591 -1301 -1360 -1387 -1228 -962 -1058
4302 -1058 -963 -812 -674 -777 -975 -585 -717 -635 -574 -408 -516 -353 -181 -344 -27 -10 -16 94 140 161 209 383 379
4325 379 210 531 651 801 898 859 930 743 1089 1012 1135 908 1255 1327 1296 1482 1166 1532 1277 1609 1802 1603
4347 1603 1716 1864 1637 1980 1879 1725 2031 2274 1935 1999 2017 2089 2058 2145 2235 2221 2383 2193 2459 2398 2614 2466
4369 2466 2492 2449 2635 2505 2449 2691 2586 2371 2593 2714 2560 2474 2893 2298 2758 2693 2445 2706 2497 2577 2752 2713
4391 2713 2661 2452 2570 2574 2576 2485 2461 2646 2580 2321 2493 2448 2311 2534 2397 2366 2299 2451 2428 2341 2293 2081 2055 2297 2249
4416 2249 1996 2122 2152 1946 1841 1851 1781 1708 1727 1686 1818 1517 1463 1369 1383 1299 1411 1327 1265 1327 1150 1055 1114 1060 757
4441 757 730 837 824 662 581 466 505 366 461 265 209 146 22 2 275 -106 -379 -145 -229 -410 -442 -179 -584
4464 -584 -411 -581 -639 -597 -678 -772 -803 -1035 -747 -1115 -1085 -1191 -831 -1091 -1230 -1253 -1468 -1320 -1492 -1307 -1566 -1353
4486 -1353 -1737 -1722 -1516 -1613 -1682 -1939 -1601 -1909 -1749 -1819 -1930 -1978 -1919 -1863 -2072 -2084 -2017 -2162 -2184 -2052 -2152 -2011 -2152
4509 -2152 -2174 -2272 -2184 -2154 -2104 -2411 -2189 -2262 -2019 -2140 -2355 -2534 -2401 -2170 -2411 -2217 -2204 -2387 -2283 -2167 -2343 -2212
4531 -2212 -2241 -2190 -2176 -2375 -2320 -2315 -2330 -2207 -1986 -2307 -2066 -2043 -2191 -2132 -2330 -2173 -1955 -1853 -1893 -1889 -2053 -1778 -1898 -1855
4555 -1855 -1938 -1788 -1559 -1687 -1464 -1700 -1437 -1505 -1630 -1395 -1594 -1261 -1278 -1160 -1386 -1263 -1025 -873 -1076 -1151 -1035
4576 -1035 -715 -1014 -828 -722 -788 -655 -650 -541 -722 -546 -517 -280 -378 -114 -81 -391 224 157 -55 118 150 101 240
4599 240 354 423 243 404 596 272 691 732 601 515 744 999 625 897 1140 931 1156 1183 1040 1012 1388 1120
4621 1120 1252 1303 1067 1357 1479 1529 1541 1518 1386 1770 1749 1562 1873 1712 1635 1747 1650 1773 1820 1755 1863 1879 1895
4644 1895 1976 1949 1972 1954 1896 2055 2097 1910 1977 2059 1918 2163 2218 1914 1940 2040 2159 2117 2024 1947 2027 2055 2126 2127 2060 1963
4670 1963 2126 2027 2012 2045 2147 1836 1938 2005 1812 1905 2106 1820 1759 1904 1876 1637 1889 1679 1606 1678 1610 1603 1654 1570
4694 1570 1701 1526 1426 1660 1203 1382 1369 1376 1163 1279 1522 1213 1082 1160 1117 1200 961 1021 853 932 723 861
4716 861 541 607 571 719 611 631 421 307 537 340 213 303 192 262 37 128 20 -120 -151 -375 -264 -346 -334
4739 -334 -226 -286 -170 -515 -552 -459 -578 -447 -549 -781 -727 -568 -571 -843 -1092 -998 -896 -905 -923 -1020 -1017 -1126 -1189 -1347 -1250
4764 -1250 -1104 -1231 -1310 -1493 -1251 -1498 -1423 -1394 -1441 -1302 -1455 -1471 -1422 -1658 -1633 -1580 -1690 -1558 -1711 -1743 -1558 -1723 -1695
4787 -1695 -1721 -1816 -1996 -1736 -1942 -1761 -1815 -1880 -1825 -1894 -1912 -1816 -1793 -1926 -1799 -1735 -1956 -1805 -1900 -1723 -1882 -1731 -1858
4810 -1858 -1764 -1833 -1756 -1696 -1604 -1756 -1573 -1941 -1620 -1326 -1850 -1753 -1588 -1727 -1622 -1614 -1639 -1500 -1525 -1426 -1537 -1254 -1197 -1316
4834 -1316 -1472 -1303 -1225 -1287 -1113 -1136 -1094 -995 -883 -1168 -1105 -788 -835 -764 -807 -1009 -913 -578 -791 -662 -625 -595 -742 -510
4858 -510 -595 -508 -309 -584 -177 -294 -296 -164 1 -212 -7 15 57 53 -29 -83 -1 205 69 418 324 189 302 453
4882 453 584 362 614 436 434 359 604 925 587 857 789 760 883 702 912 723 763 1024 1125 1091 1127 1119 1076 1396
4906 1396 1022 1185 1283 1316 1252 1285 1187 1419 1325 1329 1398 1522 1423 1539 1294 1306 1414 1314 1307 1413 1700 1549 1639 1494
4930 1494 1620 1799 1459 1549 1552 1739 1639 1644 1627 1459 1584 1368 1607 1585 1460 1452 1370 1524 1616 1569 1501 1477 1561 1150 1448
4955 1448 1317 1414 1232 1352 1448 1156 1249 1220 1376 1370 1249 1285 1116 971 1122 1119 1131 1126 1093 1098 1110 974 916 862 898 910
4981 910 704 712 834 755 414 636 714 483 568 493 654 429 425 310 191 278 409 317 -155 38 121 64 85 -188
5005 -188 14 196 49 -297 -150 -235 -237 -169 -148 -299 -444 -352 -507 -258 -510 -553 -751 -300 -564 -564 -672 -656 -552
5028 -552 -495 -645 -740 -674 -777 -516 -809 -868 -839 -858 -1014 -976 -927 -1120 -1057 -1093 -1150 -1297 -1297 -1045 -1155 -1005 -1182 -942
5052 -942 -1120 -1096 -1328 -1302 -1240 -1451 -1331 -1240 -926 -1433 -1402 -1187 -1355 -1369 -1445 -1454 -1269 -1279 -1346 -1292 -1219 -1307 -1185 -1444 -1459
5077 -1459 -1457 -1376 -1388 -1372 -1459 -1313 -1379 -1270 -1358 -1272 -1213 -1084 -1340 -1281 -1342 -1403 -1102 -1259 -1318 -1195 -1271 -996 -1127 -1044 -1238
5102 -1238 -1146 -1015 -805 -1082 -1078 -1008 -829 -926 -769 -856 -862 -680 -707 -757 -685 -662 -828 -679 -611 -687 -736 -621 -685 -430 -441
5127 -441 -208 -471 -150 -397 -359 -398 -24 -278 -133 -199 -119 -242 -153 47 67 -193 7 41 144 93 321 454 263
5150 263 487 230 408 366 227 290 439 596 441 540 406 598 639 594 445 678 897 567 830 675 651 653 612
5173 612 1017 912 721 803 658 931 883 963 756 920 998 932 1020 1142 1235 1082 1134 901 1131 1077 1063 1086 1012 1102
5197 1102 1174 1183 1227 964 1355 964 1289 1120 1280 1060 1293 1341 1510 1302 1351 1189 1197 1195 1168 1198 1307 1270 915 960
5221 960 1181 1243 1000 1104 949 1106 1248 1047 1048 1117 965 905 1103 940 862 735 874 883 862 760 767 940 705 764
5245 764 829 637 545 764 701 690 623 595 659 701 499 676 378 185 384 317 495 145 320 205 56 184 190 238
5269 238 328 78 103 177 68 71 -60 -77 73 80 -39 -161 -123 -198 -205 -123 -180 -351 -242 -205 -289 -328 -205 -335 -374 -540
5295 -540 -342 -406 -368 -686 -644 -552 -573 -574 -550 -559 -776 -522 -855 -648 -748 -844 -691 -922 -755 -706 -741 -846 -763 -1031 -696
5320 -696 -955 -1089 -738 -944 -1058 -623 -961 -1029 -792 -965 -1025 -1061 -1214 -903 -1143 -950 -721 -1061 -1093 -1081 -976 -990
5342 -990 -937 -1003 -964 -1002 -1050 -1112 -860 -907 -859 -951 -1038 -1005 -742 -818 -767 -867 -1035 -578 -768 -835 -848 -714 -719 -803 -1172 -706
5368 -706 -868 -629 -742 -784 -724 -973 -798 -677 -523 -551 -448 -527 -171 -467 -403 -573 -334 -434 -601 -156 -589 -375
5390 -375 -445 -112 -372 -404 -284 -314 26 -323 -124 -195 7 -98 -237 22 240 94 76 -99 36 -116 -53 -203
5412 -203 90 140 54 327 214 230 115 173 267 396 427 214 208 587 300 597 290 223 409 722 356 468 545
5435 545 613 852 569 405 720 753 512 505 768 649 880 742 775 898 764 910 904 916 852 1163 818 1032 832
5458 832 963 710 977 786 981 944 979 893 914 846 740 856 789 925 943 1045 759 927 842 1004 888 992 1105
5481 1105 619 963 942 892 763 853 975 683 827 782 763 779 805 629 829 907 867 819 738 710 581 774 582 580
5505 580 501 629 695 261 689 432 588 510 530 321 445 378 578 240 378 326 204 247 310 170 333 153 213
5528 213 372 193 198 83 69 257 -19 81 70 -45 -64 18 -103 -181 -148 -396 0 -198 -189 -353 -217 -511 -482 -346
5552 -346 -294 -381 -375 -350 -446 -286 -431 -447 -484 -470 -475 -904 -704 -605 -616 -665 -748 -838 -557 -786 -630 -763 -610 -805 -619
5577 -619 -592 -1033 -938 -956 -745 -947 -757 -892 -801 -848 -951 -1026 -1010 -935 -926 -829 -792 -971 -844 -886 -805 -754 -783 -1068 -811
5602 -811 -971 -630 -1005 -831 -789 -886 -801 -888 -876 -962 -980 -834 -684 -1022 -873 -974 -890 -880 -884 -730 -904 -967 -851 -868
5626 -868 -603 -781 -687 -677 -772 -689 -1004 -732 -766 -838 -591 -685 -379 -575 -577 -526 -463 -485 -418 -390 -488 -502 -241 -241 -587 -294
5652 -294 -341 -342 -308 -568 -347 -249 -221 -310 -248 -219 -50 -144 -52 -14 -141 123 89 37 165 -139 142 354 120 113 131 120
5678 120 98 385 395 292 415 371 532 536 291 463 408 472 539 653 592 612 473 591 439 554 557 407 736 582
5702 582 647 982 792 655 723 752 782 789 678 808 941 784 781 768 1131 764 922 988 846 918 785 989 893 893 1062
5727 1062 1041 924 1149 776 971 902 974 906 893 982 1012 923 945 998 816 1001 993 962 960 1046 830 1000 988 788 869 1019
5753 1019 898 952 859 738 1005 1031 927 614 825 588 915 598 755 722 611 687 545 627 552 494 451 567 603
5776 603 586 785 501 478 255 428 419 247 297 379 235 160 178 284 248 148 136 116 193 87 234 11 67 -20 -101
5801 -101 -39 13 24 -139 -245 -28 107 -323 -328 -327 -255 -376 -285 -226 -461 -344 -349 -411 -281 -560 -534 -836 -728 -468 -612
5826 -612 -554 -569 -643 -715 -839 -730 -833 -843 -763 -737 -663 -717 -869 -666 -955 -886 -659 -949 -843 -968 -687 -1070 -875
5849 -875 -892 -847 -808 -955 -768 -889 -862 -617 -924 -760 -767 -965 -817 -981 -1167 -967 -1052 -791 -1022 -983 -941 -1092 -952
5872 -952 -1120 -703 -940 -1082 -1006 -965 -948 -771 -1054 -821 -856 -1002 -699 -877 -875 -987 -798 -664 -732 -903 -847 -852 -645
5895 -645 -711 -702 -681 -854 -623 -555 -461 -642 -589 -613 -658 -424 -522 -630 -293 -618 -610 -369 -429 -327 -222 -480 -175 -248 -310
5920 -310 -301 -150 -87 -31 -140 -243 -38 -156 -12 50 -101 75 -112 92 58 21 259 264 427 175 243 167 324 117
5944 117 246 538 577 534 415 364 496 469 465 624 673 586 511 603 675 660 730 757 663 698 610 754 824 609 560 829
5970 829 873 981 845 961 802 996 898 811 829 1053 1033 1109 980 899 911 932 1100 966 1082 1151 1059 1048 947 867
5994 867 1092 1081 849 1146 1027 943 1129 1004 919 991 1124 1050 936 1165 1199 710 790 959 1015 1158 915 816 880
6017 880 1022 825 922 1045 1057 848 1037 802 776 909 916 856 1095 623 648 816 659 500 491 679 464 461 496 639
6041 639 378 559 312 218 295 341 388 264 394 184 401 239 262 173 185 116 129 163 0 75 88 -44 -126 -190 18
6066 18 -63 -145 -201 -269 -250 -228 -384 -347 -144 -346 -210 -486 -37 -396 -450 -237 -647 -520 -472 -753 -417 -545 -694
6089 -694 -665 -712 -551 -791 -623 -659 -753 -698 -667 -914 -887 -922 -884 -897 -912 -991 -832 -753 -876 -989 -893 -1110 -993 -1202 -1071
6114 -1071 -1183 -1011 -921 -1072 -982 -1060 -1035 -986 -1190 -1099 -1130 -1281 -922 -1147 -1032 -1088 -1094 -1036 -1089 -1184 -1144 -1179 -991 -1197 -1150
6139 -1150 -1352 -1055 -1282 -1343 -1206 -844 -1002 -1101 -963 -1220 -1165 -1022 -809 -1084 -1028 -970 -925 -639 -906 -914 -1027 -1002 -921
6162 -921 -1051 -808 -902 -793 -705 -733 -711 -653 -672 -751 -745 -722 -498 -491 -601 -355 -280 -284 -355 -485 -242 -340 -391 -149 -197 -275 -360
6189 -360 -275 -270 -177 -248 -307 -159 76 129 67 101 147 -80 140 25 199 -32 143 231 239 253 212 356 302 311 174 402
6215 402 496 716 463 526 603 508 619 538 776 587 838 441 686 706 493 886 751 972 780 890 902 951 785
6238 785 918 1004 845 942 937 1045 887 992 883 926 753 1069 911 1221 1044 959 1271 1272 1022 1347 1101 1234 1144
6261 1144 1194 1002 1158 1078 1141 1151 1170 1047 1177 1167 929 1265 1079 1263 810 1148 1098 944 853 1172 1042 922
6283 922 1067 1124 1184 826 957 959 1021 1023 867 960 936 772 845 779 674 806 967 564 652 693 789 532 736 645 610
6308 610 654 325 508 627 519 367 521 366 394 299 295 209 475 236 311 263 121 101 146 97 8 301 41 16
6332 16 75 -275 -193 107 -135 -294 -149 -117 -172 -262 -324 -333 -419 -318 -385 -512 -570 -395 -557 -607 -514 -596 -656 -456 -564
6357 -564 -672 -716 -463 -753 -855 -781 -743 -958 -825 -715 -984 -864 -787 -845 -854 -871 -1193 -754 -1097 -959 -928 -1148 -932
6380 -932 -1058 -1093 -1188 -1103 -902 -1032 -996 -1102 -934 -1131 -1169 -1267 -1055 -1104 -1076 -1250 -1104 -1065 -1095 -1041 -917 -1174 -1114 -936
6404 -936 -1280 -1101 -1059 -1177 -1156 -1110 -1114 -933 -1118 -1084 -890 -1123 -1054 -1043 -1027 -782 -833 -714 -972 -832 -866 -944 -967 -809
6428 -809 -813 -740 -822 -722 -689 -797 -745 -723 -532 -803 -780 -740 -518 -546 -616 -764 -597 -575 -623 -229 -542 -515 -399 -433 -268
6453 -268 -377 -507 -362 -210 -198 -100 -58 -95 -399 -102 -81 76 -78 -144 106 15 201 108 298 257 171 356 416 74
6477 74 366 242 241 507 462 494 410 607 485 573 555 680 739 586 661 679 506 799 711 999 813 738 732 813 785 716
6503 716 1092 1068 771 908 1035 755 1015 1061 1054 1139 1113 1283 1063 1208 1129 1131 1193 1224 969 1130 1156 1327 1217 1104
6527 1104 1279 1189 1200 1024 1167 1233 1296 1277 1143 1118 1237 1148 1311 1049 1254 1215 1313 1197 1061 1150 1217 1034 1142
6550 1142 1158 1203 1211 1141 1042 891 1111 1010 756 1047 839 924 953 899 1199 960 742 621 833 902 798 604 618
6573 618 788 734 671 551 696 408 428 559 669 397 477 442 392 291 399 86 255 313 368 103 -3 182 5
6596 5 84 26 -179 50 148 -177 -170 -77 -153 -302 -183 -205 -320 -183 -437 -461 -495 -341 -585 -563 -487 -791 -534 -488 -357
6621 -357 -498 -584 -524 -738 -715 -681 -775 -851 -910 -760 -674 -788 -933 -845 -896 -852 -1044 -937 -974 -1081 -1012 -1028 -1017 -1083 -1138 -1118
6647 -1118 -1106 -986 -1225 -1032 -1275 -1048 -1114 -1116 -1048 -1147 -1145 -1332 -1311 -1271 -1228 -1204 -1129 -1343 -1219 -1344 -1187 -1308 -1134 -1283
6671 -1283 -1227 -1173 -1288 -1220 -1127 -1210 -1127 -1041 -1229 -1343 -1109 -1061 -1116 -1112 -1214 -1229 -1221 -1128 -1123 -1058 -1008 -957 -1125 -972 -912 -874 -1006
6698 -1006 -981 -927 -811 -813 -843 -821 -812 -708 -756 -613 -573 -766 -686 -520 -579 -647 -456 -532 -353 -526 -468 -441 -268 -412 -412 -267
6724 -267 -401 -145 -388 -211 -68 -91 -38 -66 -179 163 -49 341 210 121 366 -67 233 215 370 519 289 412
6746 412 472 358 619 469 344 217 508 267 543 878 561 625 694 691 898 757 971 732 798 848 858 843 845 748
6770 748 864 919 998 997 1004 926 1004 885 980 1228 1179 1350 1272 1041 1202 1239 1190 1261 1080 1220 1199 1348 1110 1274 1413
6795 1413 1202 1309 1217 1181 1123 1375 1248 1438 1235 1165 1183 1357 1217 1274 1228 1164 1262 1253 1102 1148 1308 1160 1073 1338
6819 1338 1044 1154 1091 1057 1137 1286 1102 1057 1130 1216 1171 984 1243 758 1031 903 855 716 813 731 653 589 910 702
6843 702 664 575 520 738 527 380 660 541 456 344 717 432 264 468 283 252 125 361 313 158 215 -69
6865 -69 80 -200 -104 287 38 -99 -97 -235 -202 51 -197 -294 -100 -268 -219 -284 -438 -532 -441 -339 -749 -632 -586 -739
6889 -739 -545 -506 -567 -654 -597 -798 -837 -847 -1106 -718 -780 -982 -1096 -1310 -1084 -923 -1048 -1068 -1204 -1071 -983 -901 -1280
6912 -1280 -1070 -1033 -1212 -1272 -1400 -1374 -1283 -1191 -1118 -1227 -1293 -1328 -1127 -1361 -1443 -1450 -1291 -1385 -1240 -1342 -1547 -1367 -1329 -1340
6936 -1340 -1192 -1376 -1344 -1364 -1359 -1161 -1407 -1173 -1205 -1647 -1329 -1386 -1500 -1201 -1191 -1339 -1238 -1353 -1316 -1139 -1271 -1190 -1181
6959 -1181 -1178 -1044 -1051 -1234 -872 -980 -1138 -819 -1117 -996 -986 -862 -818 -844 -927 -617 -905 -708 -786 -719 -465 -615 -565
6982 -565 -608 -618 -439 -362 -477 -375 -377 -250 -397 -337 -186 -408 -356 -203 -215 -220 -291 67 165 -110 291 60 101 115 218
7007 218 1 56 231 441 356 365 396 355 547 318 440 656 661 623 516 520 765 641 642 897 739 709 953 966 965 995
7033 995 1000 975 1030 954 1139 1050 930 912 1174 1034 938 1107 1374 1102 1221 1319 1123 1198 1379 1257 1284 1428 1429 1451 1253
7058 1253 1498 1440 1411 1274 1243 1295 1335 1486 1363 1387 1273 1474 1346 1325 1452 1375 1726 1346 1424 1262 1355 1343 1398 1266
7082 1266 1388 1415 1317 1197 1419 1341 1163 1517 1044 1328 1363 1355 1355 1277 1057 1112 1078 973 1253 1030 1071 981 1059 939
7106 939 877 611 859 702 958 697 676 802 686 715 448 668 453 607 560 503 479 503 497 432 477 153 206 149
7130 149 329 462 215 -20 12 238 -89 -112 -63 -168 -383 -232 -337 -328 -380 -154 -358 -371 -489 -254 -311 -508 -444
7153 -444 -582 -354 -653 -378 -669 -595 -738 -804 -709 -847 -836 -675 -942 -925 -996 -1075 -1117 -785 -874 -852 -1194 -946 -1332
7176 -1332 -850 -1134 -1268 -1074 -1106 -945 -1054 -1179 -1344 -1021 -1387 -1094 -1420 -1316 -1317 -1342 -1273 -1236 -1438 -1355 -1313 -1324 -1426
7199 -1426 -1580 -1636 -1390 -1222 -1421 -1589 -1380 -1440 -1583 -1277 -1226 -1281 -1582 -1255 -1286 -1390 -1310 -1279 -1409 -1345 -1430 -1216 -1270
7222 -1270 -1244 -1321 -1090 -1228 -1440 -1329 -1247 -1146 -1236 -1206 -1126 -1131 -1195 -1097 -1202 -1083 -1114 -1120 -984 -1043 -1019 -961 -686 -854 -854 -751
7248 -751 -693 -717 -783 -667 -705 -670 -640 -354 -354 -414 -392 -405 -614 -279 -151 -265 -317 -175 -123 -126 -15 -74 46 -54 -118 18
7274 18 -138 13 164 166 255 64 378 198 349 293 344 174 367 296 427 667 642 617 437 597 616 854 645
7297 645 767 790 740 672 921 885 883 1030 952 1012 930 1202 912 874 1091 1120 1114 1083 1124 1177 1209 1392 1355 1373 1148 1301
7323 1301 952 1162 1358 1464 1252 1527 1417 1420 1265 1340 1521 1646 1461 1315 1274 1413 1408 1520 1450 1360 1564 1418
7345 1418 1399 1541 1601 1205 1523 1440 1437 1455 1328 1280 1108 1380 1287 1116 1254 1102 1456 1436 1303 1375 1064 1274 1195
7368 1195 1416 1035 1354 1124 1027 798 1176 966 881 1022 813 992 1027 718 854 895 662 723 738 653 429 611
7390 611 544 448 338 585 444 382 392 740 157 430 283 83 219 370 87 182 -144 18 46 84 -31 -147
7412 -147 -112 -36 -32 -304 -371 -142 -167 -308 -440 -340 -541 -321 -395 -489 -407 -786 -563 -497 -539 -684 -1005 -750 -927 -802
7436 -802 -752 -777 -850 -1060 -856 -1066 -1054 -1056 -1021 -1353 -1107 -1191 -1053 -1118 -1266 -1158 -1233 -945 -1170 -1156 -1348 -1285 -1409 -1261
7460 -1261 -1359 -1291 -996 -1430 -1128 -1325 -1261 -1430 -1484 -1450 -1436 -1588 -1391 -1389 -1477 -1275 -1353 -1616 -1586 -1206 -1462 -1416 -1409 -1326 -1421
7485 -1421 -1619 -1550 -1388 -1543 -1388 -1410 -1500 -1483 -1297 -1353 -1651 -1238 -1344 -1231 -1394 -1381 -1184 -1172 -1142 -1061 -930 -1171 -1081
7508 -1081 -843 -881 -1099 -817 -1042 -892 -1062 -727 -973 -915 -870 -714 -746 -707 -762 -887 -600 -451 -634 -556 -596 -574 -477
7531 -477 -554 -508 -339 -145 -293 -99 -218 -286 -282 -155 -179 -325 342 -72 -34 94 2 43 109 80 366 242 385 372
7555 372 318 391 333 520 259 569 547 647 540 474 713 505 772 896 756 762 756 882 708 831 822 957 947 1005
7579 1005 904 935 1173 910 1083 929 1103 1112 1057 1123 1261 1120 1154 1319 1152 1109 1308 1341 1231 1337 1292 1378 1311
7602 1311 1259 1404 1119 1243 1301 1450 1693 1502 1423 1295 1174 1448 1441 1294 1421 1538 1220 1276 1455 1299 1638 1256
$$ [...]
8191I34
##END NTUPLES=NMR FID
##END=
