##TITLE=1H_Ser 6-5-i-H
 CDCl3, 8 sc, 
 27.08.2021
##JCAMPDX= 6.0         $$ Bruker NMR JCAMP-DX V2.0
##DATA TYPE= NMR FID
##DATA CLASS= NTUPLES
##ORIGIN= UXNMR, Bruker Analytische Messtechnik GmbH
##OWNER= root
$$ XWIN-NMR		Version 3.5
$$ Fri Aug 27 08:42:33 2021 Russian Standard Time (UT+4h)  she@DPX200
##.OBSERVE FREQUENCY= 200.131506
##.OBSERVE NUCLEUS= ^1H
##.DELAY= (6, 6)
##.ACQUISITION MODE= SIMULTANEOUS
##.ACQUISITION SCHEME= undefined
##.AVERAGES= 8
##.DIGITISER RES= 18
##SPECTROMETER/DATA SYSTEM= spect
##.PULSE SEQUENCE= zg30
##.SOLVENT NAME= D2O
##.SHIFT REFERENCE= (INTERNAL, D2O, 0, 15.7039)
##AUDIT TRAIL= $$ (NUMBER, WHEN, WHO, WHERE, WHAT)
$$ ##TITLE= Audit trail, XWIN-NMR		Version 3.5
$$ ##JCAMPDX= 5.01
$$ ##ORIGIN= Bruker BioSpin GmbH
$$ ##OWNER= she
$$ F:/spectra/data/she/nmr/H-F/1/audita.txt
$$ ##AUDIT TRAIL=  $$ (NUMBER, WHEN, WHO, WHERE, WHAT)
(   1,<2021-08-27 08:41:11.90 +0400>,<she>,<DPX200>,
      <created by zg, POWCHK disabled, PULCHK disabled
       configuration hash MD5:
       00 E9 B6 7A A2 85 ED C7 34 08 36 98 17 FE 4E 26
       data hash MD5: 16K
       6A A9 33 D3 3D 09 49 BA F6 8E 59 D0 B7 22 88 2E>)
$$ ##END=
$$ 
$$ hash MD5
$$ 39 59 A8 B0 E3 06 DF AC CF E3 2D E5 2C EA 0A 63
##$RELAX= 
##$RELAX= 
##$RELAX= 
##$RELAX= 
##$RELAX= 
##$RELAX= 
$$ Bruker specific parameters
$$ --------------------------
##$DU= <F:/spectra>
##$EXPNO= 1
##$NAME= <H-F>
##$PROCNO= 1
##$TYPE= <nmr>
##$USER= <she>
##$AMP= (0..31)
100 100 100 100 100 100 100 100 100 100 100 100 100 100 100 100 100 100 
100 100 100 100 100 100 100 100 100 100 100 100 100 100 
##$AQSEQ= 0
##$AQ_mod= 1
##$AUNM= <au_zg>
##$AUTOPOS= <>
##$BF1= 200.13
##$BF2= 200.13
##$BF3= 200.13
##$BF4= 200.13
##$BF5= 200.13
##$BF6= 200.13
##$BF7= 200.13
##$BF8= 200.13
##$BYTORDA= 1
##$CFDGTYP= 0
##$CFRGTYP= 5
##$CHEMSTR= <none>
##$CNST= (0..31)
1 1 145 1 1 1 1 1 1 1 1 1 1 1 1 1 1 1 1 1 1 1 1 1 1 1 1 1 1 1 1 1 
##$CPDPRG= <>
##$CPDPRG1= <>
##$CPDPRG2= <>
##$CPDPRG3= <>
##$CPDPRG4= <mlev>
##$CPDPRG5= <mlev>
##$CPDPRG6= <mlev>
##$CPDPRG7= <mlev>
##$CPDPRG8= <mlev>
##$CPDPRGB= <>
##$CPDPRGT= <>
##$D= (0..31)
0 1.2 0 0 0 0 0 0 0 0.06 0 0.03 0 0 0 0 0.0002 0 0 0 0 0 0 0 0 0 0 0 0 
0 0 0 
##$DATE= 1630039271
##$DBL= (0..7)
120 120 120 120 120 120 120 120 
##$DBP= (0..7)
150 150 150 150 150 150 150 150 
##$DBP07= 0
##$DBPNAM0= <>
##$DBPNAM1= <>
##$DBPNAM2= <>
##$DBPNAM3= <>
##$DBPNAM4= <>
##$DBPNAM5= <>
##$DBPNAM6= <>
##$DBPNAM7= <>
##$DBPOAL= (0..7)
0.5 0.5 0.5 0.5 0.5 0.5 0.5 0.5 
##$DBPOFFS= (0..7)
0 0 0 0 0 0 0 0 
##$DE= 6
##$DECBNUC= <off>
##$DECIM= 32
##$DECNUC= <off>
##$DECSTAT= 4
##$DIGMOD= 1
##$DIGTYP= 9
##$DL= (0..7)
0 120 120 120 120 120 120 120 
##$DP= (0..7)
150 150 150 150 150 150 150 150 
##$DP07= 0
##$DPNAME0= <>
##$DPNAME1= <>
##$DPNAME2= <>
##$DPNAME3= <>
##$DPNAME4= <>
##$DPNAME5= <>
##$DPNAME6= <>
##$DPNAME7= <>
##$DPOAL= (0..7)
0.5 0.5 0.5 0.5 0.5 0.5 0.5 0.5 
##$DPOFFS= (0..7)
0 0 0 0 0 0 0 0 
##$DQDMODE= 0
##$DR= 18
##$DS= 0
##$DSLIST= <SSSSSSSSSSSSSSS>
$$ [...]
##$SUBNAM2= <"">
##$SUBNAM3= <"">
##$SUBNAM4= <"">
##$SUBNAM5= <"">
##$SUBNAM6= <"">
##$SUBNAM7= <"">
##$SUBNAM8= <"">
##$SUBNAM9= <"">
##$SW= 20.0188882624521
##$SWIBOX= (0..15)
0 0 2 0 0 0 0 0 0 0 0 0 0 0 0 0 
##$SW_h= 4006.41025641026
##$TD= 16384
##$TD0= 1
##$TE= 0
##$TE2= 300
##$TE3= 300
##$TEG= 300
##$TL= (0..7)
0 120 120 120 120 120 120 120 
##$TP= (0..7)
150 150 150 150 150 150 150 150 
##$TP07= 0
##$TPNAME0= <>
##$TPNAME1= <>
##$TPNAME2= <>
##$TPNAME3= <>
##$TPNAME4= <>
##$TPNAME5= <>
##$TPNAME6= <>
##$TPNAME7= <>
##$TPOAL= (0..7)
0.5 0.5 0.5 0.5 0.5 0.5 0.5 0.5 
##$TPOFFS= (0..7)
0 0 0 0 0 0 0 0 
##$TUNHIN= 0
##$TUNHOUT= 0
##$TUNXOUT= 0
##$USERA1= <user>
##$USERA2= <user>
##$USERA3= <user>
##$USERA4= <user>
##$USERA5= <user>
##$V9= 5
##$VALIST= <valist>
##$VCLIST= <CCCCCCCCCCCCCCC>
##$VD= 0
##$VDLIST= <DDDDDDDDDDDDDDD>
##$VPLIST= <PPPPPPPPPPPPPPP>
##$VTLIST= <TTTTTTTTTTTTTTT>
##$WBST= 1024
##$WBSW= 4
##$XGAIN= (0..3)
0 0 0 0 
##$XL= 0
##$YL= 0
##$YMAX_a= 218357
##$YMIN_a= -273864
##$ZGOPTNS= <>
##$ZL1= 120
##$ZL2= 120
##$ZL3= 120
##$ZL4= 120
##$ABSF1= 10
##$ABSF2= 0
##$ABSG= 5
##$ABSL= 3
##$ALPHA= 0
##$AQORDER= 0
##$ASSFAC= 0
##$ASSFACI= 0
##$ASSFACX= 0
##$ASSWID= 0
##$AUNMP= <proc_1d>
##$AZFE= 0.1
##$AZFW= 0.1
##$BCFW= 1
##$BC_mod= 2
##$BYTORDP= 1
##$COROFFS= 0
##$CY= 11.3945322036743
##$DATMOD= 1
##$DC= 2
##$DFILT= <>
##$DTYPP= 0
##$F1P= 2.36226072786647
##$F2P= -0.459571619588291
##$FCOR= 0.5
##$FTSIZE= 0
##$FT_mod= 4
##$GAMMA= 1
##$GB= 0.15
##$INTBC= 1
##$INTSCL= 1
##$ISEN= 128
##$LB= 0.24
##$LEV0= 0
##$LPBIN= 0
##$MAXI= 10000
##$MC2= 0
##$MEAN= 0
##$ME_mod= 0
##$MI= 1.114404
##$NCOEF= 0
##$NC_proc= 0
##$NLEV= 6
##$NOISF1= 3.799351
##$NOISF2= 2.8
##$NSP= 1
##$NTH_PI= 0
##$NZP= 0
##$OFFSET= 15.70392
##$PC= 1
##$PHC0= -13367.12
##$PHC1= 26.00099
##$PH_mod= 1
##$PKNL= yes
##$PPARMOD= 0
##$PSCAL= 0
##$PSIGN= 0
##$REVERSE= no
##$SF= 200.130013532006
##$SI= 16384
##$SIGF1= 3
##$SIGF2= 2
##$SINO= 400
##$SIOLD= 16384
##$SREGLST= <1H.CDCl3>
##$SSB= 0
##$STSI= 0
##$STSR= 0
##$SW_p= 3612.71676300578
##$SYMM= 0
##$S_DEV= 0
##$TDeff= 0
##$TDoff= 0
##$TI= <>
##$TILT= no
##$TM1= 0
##$TM2= 0
##$TOPLEV= 0
##$USERP1= <user>
##$USERP2= <user>
##$USERP3= <user>
##$USERP4= <user>
##$USERP5= <user>
##$WDW= 1
##$XDIM= 8192
##$YMAX_p= 0
##$YMIN_p= 0
$$ End of Bruker specific parameters
$$ ---------------------------------
##NTUPLES= NMR FID
##VAR_NAME=  TIME,          FID/REAL,        FID/IMAG
##SYMBOL=    X,             R,               I
##VAR_TYPE=  INDEPENDENT,   DEPENDENT,       DEPENDENT
##VAR_FORM=  AFFN,          ASDF,            ASDF
##VAR_DIM=   8192,          8192,            8192
##UNITS=     SECONDS,       ARBITRARY UNITS, ARBITRARY UNITS
##FACTOR=    0.0002496,     1,               1
##FIRST=     0,             0,               0
##LAST=      2.0444736,     0,               0
##MIN=       0,             -273864,         0
##MAX=       2.0444736,     218357,          0
$$ Real data points
##PAGE= N=1
##DATA TABLE= (X++(R..R)), XYDATA
0 0 0 0 0 0 0 0 0 0 0 0 0 8 -8 8 -8 16 -16 24 -24 32 -40 48 -56 64 -72 88 -102 118 -136 154 -177 202 -231
33 -231 262 -296 333 -375 417 -470 522 -582 647 -717 794 -880 971 -1073 1183 -1302 1437
50 1437 -1584 1744 -1921 2120 -2341 2591 -2873 3198 -3573 4016 -4542 5187 -5993 7032 -8435
65 -8435 10440 -13559 19101 -31959 128631 -49794 -150496 218357 42227 -101751 124638
76 124638 101642 -137750 56966 155824 -81261 -51408 135942 -44557 -109827 102177 62634
87 62634 -93147 26725 54541 -70107 2633 74793 -57992 -32802 88134 -10105 -55135
98 -55135 85845 30115 -93198 19709 64739 -59625 -2788 83694 -45301 -69776 73407
109 73407 18860 -90650 6825 34712 -66472 -2835 63598 -56192 -58091 69380 -1150
120 -1150 -93454 25178 55828 -59171 -6244 70405 -41349 -47675 76522 5950 -78127 42355
132 42355 50584 -68729 14320 88505 -60808 -64474 87561 15120 -78862 41658 46131 -67127
144 -67127 13882 73362 -49648 -31823 70870 -18237 -51237 74124 27916 -69967 33648
155 33648 54799 -62218 -181 77647 -35779 -39837 70623 -381 -52084 64232 23983
166 23983 -92022 23886 87453 -55073 -37163 74036 -15245 -54551 62309 17114 -77844
177 -77844 25356 53687 -59597 -6528 69186 -42126 -52552 60876 2564 -66179 32301
188 32301 31456 -64217 1361 52750 -49537 -35995 58007 -16954 -64871 39692 25643 -62340
200 -62340 6676 42540 -54050 -27199 58989 -18912 -61126 38757 23380 -59170 3235 34333
212 34333 -46544 -19416 41698 -27772 -41731 42302 3020 -61373 14263 32527 -46623 -10432
224 -10432 40719 -31169 -30607 45867 -2404 -46113 29628 20002 -53314 9889 53396 -36172 -30042
237 -30042 46822 -7354 -41130 36247 13891 -52142 13932 39291 -40265 -13246 45543 -24262
249 -24262 -37142 44309 6412 -47955 25775 28450 -48572 773 50232 -29699 -31282 45092
261 45092 -2286 -43011 34819 22880 -53337 2295 42170 -34060 -22218 43941 -13122 -45724
273 -45724 29566 16413 -45998 5732 28251 -39213 -14186 39343 -20471 -35159 30990 931
285 931 -43969 17818 24309 -42315 -7876 35522 -26685 -25720 37261 -7631 -44596 23826 19997
298 19997 -41796 2811 32268 -35143 -21369 41879 -7734 -38305 27870 11821 -42356 11968
310 11968 32313 -33150 -11618 36485 -16377 -25745 36896 4749 -41426 19500 27164 -34904
322 -34904 1132 38557 -23390 -21196 39942 212 -34210 26175 20075 -36256 8294 39763
334 39763 -24205 -17955 36058 -5510 -27420 29634 14864 -33334 9520 28083 -24079 -6518
346 -6518 32486 -14022 -23619 29959 6736 -28888 17845 19036 -32082 -911 32404 -17728 -19101
359 -19101 30840 -576 -29940 21727 16976 -34040 1711 29110 -21038 -13218 32244 -6011
371 -6011 -30094 21246 13277 -29689 7156 24282 -24261 -7590 31421 -9923 -22389 24153
383 24153 3940 -29230 16297 23756 -25541 -2581 29639 -15888 -17724 30858 1532 -28137
395 -28137 20246 20687 -25594 4002 29731 -17567 -14230 31256 931 -21880 23628 16124 -23981
408 -23981 9727 26463 -17949 -5932 29092 -5192 -15259 28658 9520 -25146 14302 21265
420 21265 -22209 1741 31372 -11975 -14398 30218 4546 -22799 19783 18811 -23902 5938 31221
433 31221 -13046 -8724 30604 -1151 -20784 21499 13151 -22039 9641 22817 -17835 -4536
445 -4536 25728 -10641 -18809 21289 3678 -21758 13959 15623 -23172 -1266 23399 -13299 -14198
458 -14198 22120 51 -20027 16827 13501 -21649 1852 19653 -15271 -11580 21043 -880
470 -880 -17759 12779 6877 -22055 2027 15346 -16311 -9220 17093 -5914 -14496 15194 3132
483 3132 -21847 6494 16069 -15614 -3785 21044 -6963 -11798 21381 3759 -21353 11565 18217
496 18217 -16900 -478 24541 -8488 -12345 21277 731 -19882 16451 15392 -19060 3565
508 3565 20794 -12256 -5695 23289 -6090 -16809 22682 10630 -18752 12219 17870 -18511 1486
521 1486 25237 -11198 -13256 24914 5020 -18352 14733 11508 -21282 3961 19828 -15715 -8397
534 -8397 21913 -4317 -17754 12331 3232 -18193 6757 10958 -18868 -4028 17495 -8775 -12769
547 -12769 10910 -4673 -16529 9679 7384 -18524 -2582 13116 -10269 -11372 9282 -5110
559 -5110 -15533 8275 5543 -17525 -3785 10312 -9667 -11580 6937 -2907 -13124 6344 4635
572 4635 -16590 -3117 11288 -8961 -10026 7445 -4080 -10886 11627 4944 -19306 -295 13389
585 13389 -11284 -6705 13955 -6695 -13075 16822 4746 -21189 4465 15253 -13701 -3879 16990
598 16990 -8881 -10705 19223 132 -20418 10049 11795 -15878 1415 14453 -12772 -4550 19326
611 19326 -7370 -17563 14464 5797 -15358 9360 9575 -18693 1377 19285 -11718 -12331 15673
624 15673 -6 -13328 11210 4496 -17493 4519 12944 -14342 -7980 12430 -3546 -9688 7557
637 7557 -2472 -14493 5029 6252 -14325 -4938 8449 -5808 -6510 6023 -5978 -12219 6038
650 6038 5437 -12509 -4786 7378 -5461 -7032 6119 -4039 -13333 3954 7028 -11681 -6514 6930
664 6930 -3919 -8653 4402 -2952 -12511 5249 7767 -12063 -4765 8553 -5235 -6244 8008
677 8008 -3589 -11157 10548 7111 -14146 505 11276 -9254 -3649 13427 -6592 -11752 14690
690 14690 5726 -14732 4417 10168 -11207 -235 13500 -8101 -6852 15892 335 -12962 8092
703 8092 6183 -10255 5283 10124 -11267 -1572 15140 -4678 -9573 10278 752 -9731 8935
716 8935 6567 -12904 1047 12485 -7220 -7454 8905 -1935 -8594 8281 3318 -12052 931
729 931 8557 -7620 -5515 6474 -1920 -5974 5705 620 -9931 1266 6540 -6608 -4038 5333
743 5333 -2970 -4415 6377 -44 -9749 1964 6403 -7026 -3171 7503 -3416 -5716 8042 1056
757 1056 -10579 3032 8043 -6709 -2021 8618 -2888 -5034 8363 498 -9191 6631 7213 -7020
771 -7020 1559 9255 -4547 -1911 10479 -2088 -7192 10244 5617 -7624 5862 8830 -8320
784 -8320 149 12037 -4014 -5582 11309 3521 -7725 6685 6693 -7831 1379 10054 -5034 -3028
798 -3028 10434 214 -5863 6548 2813 -7083 3420 6329 -6025 -559 8742 -2460 -4756 6461
812 6461 -256 -6950 5129 4998 -6654 -94 7373 -3765 -4869 6362 -64 -6960 3934 4554
826 4554 -6205 -230 6020 -3888 -3790 5301 -464 -5068 4512 3491 -5776 1173 5214 -4926 -2425
841 -2425 6290 -1932 -4253 6583 2301 -6872 2598 6012 -5487 -975 8479 -2063 -4616 7805
855 7805 2537 -6343 3866 5743 -5376 400 8354 -2113 -3008 7807 644 -5603 5550 4244
869 4244 -5380 3203 7355 -3894 -712 7676 -1760 -4423 7300 2539 -5763 5082 6050 -5604
883 -5604 488 8000 -2863 -3579 7169 890 -5466 4933 4733 -5960 123 5889 -4207 -2846
897 -2846 6285 -771 -4644 4020 1277 -6170 846 3514 -5048 -1519 5261 -3133 -4410 4547 -646
912 -646 -6551 2270 2738 -6053 -820 5100 -3680 -4451 4408 -1230 -6945 1660 2466 -5396 -412 3740
928 3740 -4245 -4027 2891 -1543 -5244 2886 1600 -4953 835 3218 -4143 -1496 4291 -2245 -3361
943 -3361 4806 1499 -4545 2632 4032 -4674 -933 5842 -1866 -2842 5538 1649 -4345 2769 3483 -4236
959 -4236 206 5773 -1893 -1795 5706 70 -3754 4147 2034 -4235 1652 4288 -3167 -393 5758 -1627
975 -1627 -3640 4654 382 -5547 2797 3452 -4954 -467 4864 -3652 -4087 3949 -545 -5462 2145 1907
991 1907 -5322 -569 2777 -4923 -3118 2915 -2337 -4275 2096 -206 -5124 307 953 -5572 -1884
1006 -1884 2803 -3863 -3411 2909 -1470 -5424 732 623 -5359 -901 3114 -3116 -3527 2327 -1154 -4269
1022 -4269 995 301 -3891 -135 2747 -2502 -2308 2003 -1127 -3381 1610 511 -3362 1143 3357
1037 3357 -2569 -1098 3262 -1255 -2456 3736 1359 -3394 2548 4023 -3832 -860 4303 -1738 -2124
1052 -2124 4406 529 -3665 3396 3369 -3841 -435 3986 -2055 -1035 4699 -1185 -3088 4050 1129
1067 1129 -4122 1095 2392 -3301 778 4208 -3094 -2496 4557 -939 -4271 2638 1073 -3860 1496
1082 1496 2959 -4070 -2099 3409 -1309 -3656 1216 -483 -2747 1708 618 -3859 -1111 1153 -1751
1097 -1751 -1754 638 -1487 -1758 1499 -338 -3789 -628 1521 -1385 -1546 768 -605 -1770 1045 477
1113 477 -3329 -1413 2437 -207 -2269 927 613 -1744 933 1157 -2860 -814 3589 156 -1867 1874
1129 1874 500 -1740 2832 1638 -3334 1231 4457 -1264 -900 3316 -642 -1490 4807 1062 -4207
1144 -4207 3132 5009 -2481 -24 3981 -2375 -708 5422 -150 -3590 4100 3567 -2698 1326 2061
1159 2061 -3383 1864 4954 -2219 -1988 4144 389 -1812 2717 -358 -3735 3115 3613 -4116 -992
1174 -992 3374 -1106 -1284 2139 -1943 -2599 2905 1853 -2894 -969 843 -695 -677 174 -2150 -763
1190 -763 2377 260 -1983 -812 -674 -233 468 -712 -1729 -422 1638 922 -1390 -1455 388 586 -460
1207 -460 -6 266 -763 1095 2352 -2035 -2246 2596 1507 -956 1680 932 -1818 2113 3106 -2221
1223 -2221 -1224 3718 898 -426 2850 -163 -1570 4088 2321 -3369 902 3796 -721 1177 3523
1238 3523 -2176 -1176 5435 355 -3797 2987 2818 -2210 2096 2593 -3648 -95 4671 -828 -2447
1253 -2447 2517 624 -1387 2924 -143 -4177 1487 2743 -2807 -765 1812 -1561 -412 2806 -1810
1268 -1810 -3890 1938 1724 -2337 -265 1023 -2118 24 1517 -2030 -2434 1154 602 -1107 -258 -345
1284 -345 -780 267 -216 -1789 -1087 444 443 18 -610 -717 -289 93 151 -884 -1074 948 1897 -661 -963
1303 -963 508 -166 -188 1438 652 -1991 1025 2798 -1648 -1030 1988 -492 -606 2298 31 -1462 2073
1320 2073 2458 -1625 19 1751 -778 612 2747 -1311 -893 3094 328 -2096 1760 746 -1824
1335 -1824 1947 2597 -2355 -801 3335 -872 -2048 2225 -62 -2412 2230 1092 -2629 -64 1705
1350 1705 -1781 -1159 1242 -957 -1294 2030 -443 -2593 585 -33 -2427 -161 617 -2004 -667 1385
1366 1385 -1416 -2714 504 -54 -2228 -620 506 -1667 -869 525 -1003 -1794 -730 -21 -886 -339
1382 -339 135 -692 -741 113 -872 -774 57 -84 -387 166 566 -577 -401 1110 -600 -1153 1172 784 -993
1401 -993 840 1405 -622 -302 1833 -313 -1087 1621 1553 -875 804 1523 -1143 -285 1653 -235 -110
1418 -110 1606 538 -877 1120 708 -1219 799 1449 -1197 26 1808 -614 -1027 1519 -338 -1888
1434 -1888 655 1008 -1582 59 1297 -1539 -1500 852 -486 -2024 663 277 -1744 -439 383 -1464
1450 -1464 -1344 394 -1090 -1343 700 -381 -1811 13 -125 -2235 -671 430 -1614 -1144 1181 -165
1466 -165 -1660 76 -97 -1851 -149 1053 -988 -778 1069 -464 -1266 427 325 -1210 203 944
1482 944 -626 -117 1245 -191 -548 887 86 -635 1052 1129 -478 778 1447 -430 -171 1588 357
1499 357 -497 1748 1049 -724 418 1135 -359 -506 1565 751 -326 1270 1367 -575 637 730 -380
1516 -380 -152 1166 208 -31 1232 340 -958 464 701 -1505 532 1373 -955 -692 1000 -547 -1665
1533 -1665 605 612 -1498 -116 1494 -994 -796 880 -436 -1366 216 255 -1029 178 683 -1436 -750
1550 -750 176 -1333 -1070 912 -484 -1226 846 112 -2046 -176 577 -1134 -695 1182 -92 -1212 935
1567 935 617 -1351 156 860 -719 -121 1278 -61 -274 806 329 -944 205 1259 -84 726 1349
1584 1349 78 -206 1441 534 -839 1203 1393 -366 925 2063 -647 -444 2182 463 -967 1736
1600 1736 1516 -558 810 2107 -656 -407 2164 128 -754 1652 932 -662 1146 841 -1340 141
1616 141 1448 -569 -502 1608 -424 -1214 1467 217 -2376 902 1211 -1547 -427 1345 -1052 -1229
1632 -1229 1169 -491 -2189 375 664 -1200 -160 252 -1327 -351 359 -1286 -1458 667 151 -827 27
1649 27 -401 -1326 43 643 -1168 -545 775 170 -320 343 2 -483 211 734 -150 -772 617 1286 -313
1668 -313 -465 401 57 167 1355 675 -1052 876 1747 -272 -187 1018 69 43 1796 139 -936 1594
1686 1594 1263 -1083 474 1340 -1255 736 2779 -862 -1680 2251 630 -1498 1083 680 -1814 1082
1702 1082 2314 -1793 -1265 1976 -226 -1279 1443 -364 -1788 1943 979 -2672 -502 1321 -1688
1717 -1688 -334 1403 -1763 -1196 2210 -372 -2855 506 458 -1664 605 629 -2302 -421 1408 -1117
1733 -1117 -1679 486 -472 -883 667 -438 -1714 252 889 -1152 -1015 -59 -570 342 677 -1077 -1019 319
1751 319 517 -198 -507 -246 518 560 251 -313 -585 -321 910 702 -977 -332 1572 524 -217 518 -101
1770 -101 -728 1490 1109 -1384 354 1718 -121 25 885 -1210 -138 2490 61 -1497 1230 825
1786 825 -1257 971 800 -2282 272 2934 -1356 -1492 1951 -246 -1593 1646 -131 -2468 1163 1915
1802 1915 -2077 -650 1469 -1495 -1048 1629 -1508 -1816 2052 630 -2213 -14 143 -2255 404 1160
1818 1160 -2446 -1288 1853 -429 -1823 272 -472 -1466 786 464 -1586 -642 1482 -144 -1045 -114
1834 -114 -816 -295 842 185 -848 44 366 94 -242 -438 -489 311 1067 251 -587 -89 924 606 -124
1853 -124 -221 539 164 529 988 -365 -882 1242 885 -652 430 1013 -91 707 1366 -653 -857 1334
1871 1334 376 -984 984 642 -476 1236 996 -1371 -39 1597 -389 -795 1647 -30 -1029 1665
1887 1665 374 -2356 205 1512 -1267 -338 1240 -1070 -1036 1335 -597 -1939 219 633 -1063 113
1903 113 425 -1512 -417 764 -1161 -1507 853 -453 -1121 306 -183 -1459 30 838 -1331 -629 1126
1920 1126 115 -673 428 116 -879 129 907 -434 -449 679 300 7 234 -71 -446 156 598 7
1938 7 93 765 685 -93 499 454 -216 600 1292 -55 -67 1222 375 -583 831 759 -766 688 1773 -473
1958 -473 -10 1499 -88 -673 858 630 -635 799 1087 -627 50 1137 -192 -390 1264 -184 -682
1975 -682 900 593 -1159 51 686 -1175 -151 714 -564 -885 1282 -25 -1494 356 502 -1260
1991 -1260 -424 822 -620 -838 583 -584 -1237 179 -110 -1068 -130 370 -774 -310 475 -751 -1123
2008 -1123 145 30 -1125 193 334 -1232 -359 655 -864 -595 1091 273 -553 593 595 -534 -193
2025 -193 772 -268 -313 1085 529 -593 767 653 -685 330 834 162 352 967 483 -330 763 360
2043 360 -570 388 937 -144 435 1332 53 -500 1151 589 -736 465 1127 -610 87 1110 -252
2060 -252 -551 401 274 -793 354 581 -741 274 650 -676 -730 331 -373 -570 661 -61 -1009 30
2078 30 405 -1344 -672 601 -405 -639 227 -79 -1288 26 17 -1241 -557 455 -678 -817 579 -310
2096 -310 -1386 -80 246 -1059 -291 56 -894 -600 617 -626 -1026 192 -100 -858 201 688 -382
2113 -382 -134 717 -513 -835 552 507 -748 551 837 -208 -146 535 -16 -367 767 595 -124 692 526
2132 526 -124 200 1029 4 -4 1124 248 -295 723 625 -739 272 811 -466 -88 1118 266 -702 513
2151 513 304 -921 291 503 -782 -255 711 -450 -775 264 -309 -1000 61 198 -812 -283 467 -882
2169 -882 -717 465 -784 -708 162 -39 -806 310 230 -1053 -378 285 -1069 -378 507 -516 -1023 -23
2187 -23 125 -1005 -621 -61 -684 -404 225 23 -377 35 -12 -579 -141 87 -260 249 479 -23 -296 241
2207 241 230 -273 -14 591 298 339 836 128 -612 343 625 -265 -34 928 242 -20 927 95 -765 546
2227 546 1114 -177 232 1273 -109 4 1250 -257 -855 1125 670 -673 671 552 -642 551 945
2244 945 -1108 -721 1355 -46 -965 880 43 -1307 685 724 -1607 -393 1229 -381 -632 634 -557
2261 -557 -986 524 -56 -1486 260 660 -885 -318 168 -1355 -356 864 -810 -1300 454 172 -651
2278 -651 1 208 -971 -101 721 -373 -217 143 22 302 215 -616 -487 284 267 164 -161 -199 376 616
2298 616 -64 -231 179 479 600 627 180 -262 824 135 -420 241 219 -55 972 741 -702 93 1283
2317 1283 -236 -389 725 -122 -340 1596 276 -1102 610 1009 -467 -3 750 -812 110 1431 -459
2334 -459 -1180 1154 62 -744 877 206 -1295 438 1070 -1476 -957 665 -477 -641 769 -314 -1113
2351 -1113 835 458 -1414 -379 334 -564 -239 564 -929 -715 965 -4 -988 213 -48 -564 517
2368 517 190 -1207 -126 966 -280 -470 -28 -82 -194 657 -84 -806 -101 225 230 -225 -247 173 701 298
2388 298 -197 173 -29 249 767 31 -287 494 582 207 118 76 -183 465 817 -184 -19 881 -142 105
2408 105 489 -334 -193 1013 611 -757 71 929 -362 226 773 -743 -528 1323 196 -902 86 198
2426 198 -673 601 436 -890 -51 825 -217 -707 504 -368 -638 787 -207 -1326 126 577 -746
2443 -746 -466 321 -638 -269 805 -703 -978 458 -52 -606 -221 -444 -572 12 391 -391 -276 297 -97
2462 -97 -559 51 -336 -475 414 7 -343 -176 179 -5 -64 -5 -83 -155 351 295 88 -258 56 300 29 -190
2484 -190 450 22 -6 441 254 -402 359 446 -110 181 478 261 195 620 -88 -343 427 494 -314 249 474
2505 474 -366 311 538 -450 -381 611 120 -286 590 409 -718 62 414 -557 -234 585 110 -197 358 -215
2525 -215 -633 193 45 -735 104 134 -411 -235 279 -490 -585 23 -343 -745 -221 162 -399 -144 -79 -531 -579
2546 -579 346 -146 -460 3 18 -217 19 -370 -342 -388 166 54 -92 -143 -163 -4 -103 -79 -350 218 284 -85 -211
2569 -211 218 339 -40 179 626 -84 184 501 76 -167 339 180 -168 337 344 66 220 687 94 -324 17
2590 17 115 -125 394 321 21 237 550 123 -152 241 5 -142 317 333 -182 12 273 -216 -414 10 3 -283
2612 -283 268 68 -15 -63 110 -592 -264 47 -384 -173 142 -105 -291 -201 -173 -368 -238 -91 -516 -57 -177
2633 -177 -157 -497 250 -116 -525 -116 350 -102 -78 122 -384 -205 -90 30 -414 147 144 279 148 60 129 -52
2655 -52 9 -2 -83 358 179 190 46 172 -324 -54 237 -1 156 226 412 -246 254 574 -222 20 319 112
2677 112 -35 368 361 -161 -198 428 94 158 518 193 197 85 60 43 -92 -90 -23 198 503 -11 68 272 76 -503
2701 -503 23 147 -322 -136 221 -390 -485 356 -305 -582 127 -110 -229 91 4 -330 -392 -145 -35 -105 -54 -184
2723 -184 -50 -116 -135 -218 27 -131 -534 191 11 -144 -132 188 -85 -121 144 2 -54 71 243 8 -13 68 -119
2746 -119 -81 -68 216 276 264 416 426 5 -87 45 162 193 403 171 155 456 335 -14 260 145 35 204 631
2769 631 150 -32 482 113 -278 355 58 -476 438 380 -162 -47 451 -330 -84 108 60 -30 389 -50 -439
2790 -439 -86 123 -563 87 384 -305 -297 427 -449 -218 -32 -384 -194 442 -65 -744 215 -158 -593 -270 -28
2811 -28 -348 -117 183 -251 -211 -19 -84 -267 -21 -476 -141 417 441 -331 -269 -258 -62 119 353 -291 -266 518
2833 518 -41 -136 -48 4 -1 440 -185 133 497 344 188 412 40 -271 436 628 -313 112 537 165 20 311
2855 311 -360 -246 665 547 -40 276 70 -7 200 176 -480 -12 862 -47 -44 492 -17 -288 658 64 -665
2876 -665 404 686 -242 39 133 -347 -100 487 -467 -454 471 6 -439 176 -436 -629 363 266 -845 -131
2896 -131 337 -396 -2 253 -473 -375 331 -152 -662 -37 -255 -285 205 -193 -808 -86 434 -100 35 9 -530
2917 -530 -47 470 -220 -693 204 178 204 209 -195 -172 562 186 -486 40 403 178 278 161 -500 34 798 -91
2939 -91 -86 218 205 -72 650 178 -696 124 442 -342 -19 306 -154 346 433 -209 -325 424 239 173 686 338
2961 338 18 536 176 -587 131 417 -193 84 419 -549 -59 388 -360 -575 -69 173 -189 226 -238 -530
2981 -530 7 50 -543 -404 124 -133 101 277 -798 -689 226 -195 -307 -96 -40 -397 -62 293 -633 -392
3001 -392 75 -94 -6 160 -186 -239 284 -164 -308 101 34 -7 145 112 -350 121 128 -381 -74 150 32 252
3023 252 394 -100 -233 317 377 -27 133 -123 -162 619 97 -96 34 571 67 81 189 -173 198 708 139
3044 139 -232 495 -135 -86 440 270 -242 123 283 -134 -45 -95 -272 130 686 -173 19 397 -1 -426 -252
3065 -252 -69 -551 42 -106 -353 -298 -158 -538 2 72 -353 -278 149 11 -264 -2 -54 -631 -123 -34 -237 -224
3087 -224 -44 -288 39 7 -249 -346 -24 43 -302 159 -50 66 -228 -77 -206 30 36 -79 40 204 202 -223
3109 -223 93 47 -51 346 292 131 30 270 -213 295 -75 -11 76 21 231 125 10 152 7 193 -19 -11 151
3132 151 -44 189 125 -3 -3 -7 112 30 130 307 269 -87 223 203 131 -167 -9 226 118 -295 188 146 35
3155 35 -180 -182 -162 -138 -153 -121 -119 -257 83 -355 -250 -169 141 -319 -210 -99 24 -105 -177 -39 -61 65 -202 -117
3179 -117 139 -41 -32 -43 -210 -107 -76 65 -223 -224 254 -247 -357 -27 -79 70 109 108 -114 215 -86 138 155 -75
3203 -75 224 -109 255 95 297 199 189 307 -108 366 349 29 17 139 -41 99 -95 -135 27 355 54 130
3225 130 366 -184 106 -118 -34 31 -140 26 38 -19 148 -113 -17 -213 142 -67 29 242 -54 -83 74 -60
3247 -60 -174 119 92 -470 -66 91 -273 -233 -131 -320 -39 -90 121 -162 -90 -236 -219 -212 21 -80 -132 -216 -6
3270 -6 177 -106 -42 -32 -171 230 -171 23 165 -287 -67 101 -100 -57 126 241 -213 62 255 -59 87 95
3292 95 2 -24 231 4 96 155 272 315 69 52 221 -20 26 305 204 414 138 327 252 179 117 91 35 117 117
3317 117 -105 36 64 209 -41 111 127 119 52 -22 -114 115 -52 -424 186 -21 -9 99 68 -87 -26 292 -279
3340 -279 -193 -19 -99 -428 -4 183 -416 -144 37 -113 -292 -122 -425 -284 217 -296 -290 41 -190 -179 -269 -302
3362 -302 -108 234 230 -161 -336 93 -274 99 97 -220 -219 134 37 -378 178 335 -239 225 111 228 0 248
3384 248 157 -222 84 -10 -131 339 103 249 222 35 -214 135 30 -94 65 300 -220 245 199 -79 366
3405 366 -133 -74 -14 82 -98 175 288 -133 -73 182 29 -196 155 -106 -166 67 95 -225 234 398 -335 -494
3427 -494 72 -69 -382 41 -154 -488 109 85 -580 -133 376 -317 -109 197 -494 -430 413 32 -542 73 -68
3448 -68 -374 310 71 -414 -525 460 -247 -309 102 44 -65 525 146 -319 335 194 -400 53 231 -141 199
3469 199 493 -91 -104 246 206 183 -69 45 -106 580 342 -244 400 -36 178 224 58 -138 147 406 -171
3490 -171 170 326 -95 314 321 48 -22 210 303 -91 37 202 -228 413 63 -368 -41 96 -203 -167 44 -438
3512 -438 41 383 -170 -368 -8 -157 -326 290 -302 -366 90 679 -367 -161 225 -162 33 173 -217 -287
3532 -287 273 234 57 -149 -77 -558 66 130 -441 -429 265 88 -230 65 -173 -157 481 118 -252 -39 244 72
3554 72 276 -12 -74 198 308 -179 -83 295 59 358 262 228 57 56 344 -42 -100 425 175 137 292 -141 175
3577 175 445 211 468 144 36 140 287 -52 -118 -113 149 -117 260 -56 81 369 154 -28 -330 240 -292
3598 -292 406 270 -109 -457 204 -246 -449 -71 140 -534 257 149 -276 -69 229 -528 -300 79 -142 -86
3618 -86 267 183 -447 53 -25 -217 -129 67 -458 143 -1 -162 -412 20 -244 -248 59 328 -62 -122 -60 -328 -248
3641 -248 -92 -35 348 437 -35 51 156 -159 -253 -211 151 87 -84 181 -67 -64 91 -84 221 213 399 154 112 152
3665 152 -70 143 157 167 57 82 225 134 -220 313 61 31 213 596 179 -49 -64 -47 -162 229 -81 -184
3687 -184 -140 104 114 -154 133 -198 -82 138 88 -188 17 -81 -223 -303 -36 -261 -55 56 -270 -16 32 -123
3709 -123 -135 -39 109 -202 -71 83 -41 -175 -8 63 -268 180 -166 159 -169 171 -211 -52 95 -216 -481
3730 -481 77 105 -129 -188 70 -250 146 128 -38 -9 125 -41 -123 259 90 -104 -182 240 -41 -42 240 281 -123
3753 -123 -56 -69 53 -207 67 31 132 131 146 -32 229 471 -116 148 16 88 -3 409 376 25 209 239 -46
3776 -46 -209 -95 -28 -63 79 -98 189 142 -10 -169 -120 -9 -354 -166 279 -43 -356 109 6 -424 75 59
3798 59 74 -76 -15 -86 -218 -64 -73 -68 -139 -208 -233 -136 126 -135 -375 -111 -17 49 -49 -42 -85 -164 62 -293 -141 -112 -207
3825 -207 177 44 291 94 281 130 105 50 212 -45 170 300 64 23 130 182 56 7 297 -106 67 193
3847 193 -33 -65 -175 200 -359 181 211 185 383 85 112 98 362 150 -52 226 194 57 -189 -88 135 69
3869 69 209 24 -14 -67 43 -8 88 197 -200 -109 126 -71 -497 -6 -172 -192 -279 -230 -501 -147 15 -150 -211
3892 -211 -13 10 -95 -180 -240 -164 171 95 -348 -87 125 -204 -231 238 47 -192 364 67 -115 -106 81 88 36 59
3916 59 -13 -130 183 45 114 181 144 -36 63 164 96 96 172 562 152 203 302 101 -9 -38 42 137 46 41 112 -62
3942 -62 -83 -91 28 159 195 101 -210 164 -11 -254 223 218 173 150 11 -73 232 254 -292 -186 55 -182 27 149
3966 149 -287 -199 88 -26 -49 -192 -61 -191 193 220 -435 -346 104 124 -224 -63 -8 -256 259 134 -299 -247
3988 -247 226 -209 137 89 -410 110 61 -17 -560 77 -83 -64 189 194 -177 -113 298 -25 -9 103 -76 -59 200
4011 200 -264 -248 192 12 12 -4 -7 236 460 185 -42 64 158 239 68 76 27 151 383 245 43 117 155 101 266
4036 266 -55 -209 187 51 6 140 -115 69 240 345 -277 -106 208 61 -131 101 -283 -116 392 134
4056 134 -237 -159 -175 238 -22 28 -290 124 397 -223 -478 110 -100 -355 307 -211 -250 92 21 -362 -116 -62
4078 -62 -222 -152 199 -141 -217 40 44 -369 -26 -165 -242 272 459 -229 -41 212 -128 49 -204 -190 -3 6 213
4101 213 -354 -88 -45 -44 237 -65 -71 59 279 -76 267 -57 167 20 24 -285 183 443 477 -68 206 -98 -274
4124 -274 188 112 23 129 164 83 335 144 -227 102 24 273 -221 277 -148 -121 -128 -225 -251 159 287 -226 -50
4147 -50 19 -264 -133 111 -298 -125 103 115 -433 96 7 -313 253 -38 -264 -210 37 -332 -317 -109 -23 -188
4169 -188 128 -276 -37 -201 155 -135 163 -28 -317 -93 266 57 -278 15 195 93 6 -112 -110 250 300
4190 300 -205 -98 162 64 11 259 -85 -88 101 -64 156 42 -243 281 105 -59 16 338 -204 93 109 148
4212 148 12 312 134 121 419 174 -17 145 379 -53 -161 83 88 39 271 -86 47 126 70 -63 286 156
4234 156 50 167 149 -386 -26 43 -14 -116 56 93 -88 114 43 -286 -36 -43 -331 -49 228 53 -121 7
4256 7 -166 -48 -150 -151 -38 -65 -140 -74 -189 -235 44 -141 -389 -158 -35 -249 1 -113 81 96 93 -157 -171 47
4280 47 -256 96 200 147 -17 -9 40 -338 244 -70 70 277 -114 67 35 422 83 188 272 303 215 202 323
4303 323 139 -106 2 -105 -64 228 23 5 244 108 259 122 -147 88 -49 237 -57 88 -84 165 22
4324 22 37 61 -44 -145 -14 19 -319 -172 -85 -131 26 68 -335 -274 -114 -58 -42 -211 -225 -177 -272 303 -78 -60 69
4349 69 -44 79 61 -317 -28 17 -127 116 -75 -96 -168 -168 4 -82 179 210 89 -97 107 36 29 209 347 -12
4373 -12 267 36 -52 9 -107 193 -120 -99 53 260 -69 -67 -64 -136 -113 44 19 66 55 15 398 -7 66 189 -117
4398 -117 -40 -39 -17 77 -106 -13 115 -61 -73 -227 39 -95 -14 -70 -293 124 214 -103 -20 -174 -54 -298 150 -139
4422 -139 -308 -234 150 -197 151 -58 -165 -91 -93 58 -181 19 -310 -234 -252 -198 -411 -77 -116 117 -241 -393 39
4445 39 60 98 -90 -51 -53 -134 -273 97 37 -330 42 164 237 -99 112 67 197 -74 -43 3 178 -14 70 -158
4469 -158 -51 -88 96 30 60 88 268 53 149 89 -193 212 237 -116 200 183 -122 85 -301 -77 -143 106 100 -294
4493 -294 202 98 104 140 205 -56 -222 163 0 -171 178 147 -138 57 131 -276 182 34 -14 -246 125 -371
4515 -371 -415 -33 -49 -33 -120 73 -340 -19 47 -275 -13 -244 -267 -161 211 237 -311 -295 -59 -207 239 -98 -325
4538 -325 -237 -84 -28 54 -29 -320 -97 -64 -10 0 93 28 -301 81 -29 -82 482 -104 -54 53 -155 -252 89 516
4562 516 -168 -14 156 -192 -75 319 -84 -69 287 87 -113 38 208 88 93 -33 -193 389 428 -37 -186
4583 -186 145 102 35 58 -146 133 -54 -121 -189 239 211 -113 121 286 82 166 448 -6 -67 194 -241 -416 -63
4606 -63 44 -174 -69 283 -331 16 61 -18 -74 -47 -329 -170 361 -63 -269 89 -253 -44 182 -16 -212 95
4628 95 200 -137 143 160 78 -102 72 -212 -66 268 39 -101 74 -90 -24 -318 34 13 212 149 -118 -41
4650 -41 169 68 34 -19 -151 86 69 11 -86 196 -4 -230 368 146 143 324 71 -44 96 174 -178 66 73 110
4674 110 26 192 188 -303 214 255 -134 -241 -194 -266 -115 -11 -164 -108 79 234 -39 210 64 -170 133 73 -141
4697 -141 -301 164 -78 316 -344 -171 -125 69 -91 -222 -261 -358 79 47 -80 -190 -76 121 -207 -16 -123
4718 -123 -90 69 99 -118 -48 -133 -289 30 351 23 -66 21 -9 -104 277 -28 -319 126 383 -162 80 43 148
4741 148 -17 -170 -23 141 114 -53 186 193 90 227 76 -130 62 -49 -233 -70 302 130 -79 -131 -9
4762 -9 267 -42 350 309 -103 28 179 -326 -32 94 -273 -59 351 6 -243 58 -35 37 -93 -34 -195 11
4784 11 -28 -151 -95 -41 -228 22 -17 -73 -103 151 64 -76 190 131 -271 -103 -30 -140 -180 -71 -89 161 140 -37
4808 -37 -215 -162 -160 -99 -58 221 69 119 65 -22 97 -127 -8 -43 -97 -106 201 93 -308 244 54 55 104 8 -74 168
4834 168 173 62 -199 201 83 109 325 316 13 42 201 279 -70 427 35 -66 324 -75 14 91 100 15 -67 19 -33
4859 -33 205 106 178 -294 -55 84 157 196 12 -165 11 88 -173 -241 23 305 -44 -27 -25 24 98 -65 -289 131
4883 131 263 38 74 -185 -71 -78 -267 -208 -308 -163 239 128 -73 -24 232 -188 52 52 240 -147 138 157 -110
4906 -110 59 -205 17 -98 93 201 -65 -128 77 150 -5 -132 -266 74 34 155 306 -9 -20 -413 -4
4927 -4 282 -4 -27 -41 -47 157 204 305 43 142 102 151 162 241 237 -200 75 -147 322 5 -96 197 134 -63 -21
4952 -21 72 43 110 -92 -130 -326 190 57 -105 -135 -111 6 16 -133 -135 41 -87 -164 -226 -213 -26 -183 -235 35 -250
4977 -250 -95 -10 -21 -258 54 -444 -263 -304 -115 -34 -193 160 -107 18 -111 122 -144 -178 77 -35 -408 -116
4999 -116 297 -15 -63 102 66 -70 -227 109 52 18 -177 -168 113 -31 31 114 98 224 -9 12 -149 58 24 425
5023 425 2 35 251 300 -105 268 -144 -45 154 104 132 -103 8 116 9 221 30 63 -88 -71 -150 -203 129
5046 129 -158 82 189 93 -72 236 -316 -202 107 -131 -388 -18 -1 -145 122 143 -108 -346 -112 -65 -161 -260
5068 -260 -5 -150 -106 -225 -150 -4 -145 36 78 90 -49 -130 57 -221 75 -211 -26 -9 317 -101 357 -87
5090 -87 100 161 244 69 100 332 -4 -125 173 83 -23 40 3 111 -59 33 32 -289 -85 147 -41 189 80
5113 80 -513 -10 229 -105 256 218 42 300 192 161 8 45 338 -152 -137 100 -267 263 104 -221 -1 17
5135 17 257 52 -97 -102 -264 53 -329 30 31 -156 -262 -4 -3 -316 -28 114 -161 -168 -25 1 -43 -110 13 -430
5159 -430 42 164 383 -176 -48 -318 186 18 8 -86 347 -174 143 171 -280 134 142 65 -232 40 -352 -55
5181 -55 369 -185 -451 131 218 -193 161 253 -57 10 172 -156 -199 175 -61 163 373 -136 -190 98 124 -80
5203 -80 150 49 -39 32 424 -184 70 99 109 90 392 -107 44 230 242 -171 -311 377 -30 -61 12 -112 -123
5226 -123 221 -196 -164 139 411 63 -16 -160 -134 -91 -54 -230 -46 104 51 -138 -104 -444 -85 -5 -245 -184 -104
5249 -104 -185 68 -63 -172 -342 126 19 17 -65 -28 78 -101 -60 -174 73 280 70 22 98 -42 -73 8 -504
5272 -504 -382 -93 150 124 -72 118 -13 11 201 -28 -74 73 -71 -218 65 204 9 89 95 17 128 235
5294 235 122 184 -218 -94 -23 60 270 -229 -81 165 -74 239 260 -44 -155 -76 -154 23 11 -56 96 333 25
5317 25 -182 194 -119 -143 10 197 -443 23 24 20 -195 14 -227 -94 92 -209 -62 -151 -261 -221 52 -376 -200
5340 -200 207 65 64 -122 102 -18 -56 -33 -217 -114 -4 76 -232 132 -183 -117 -18 -3 -234 78 285 -64 -5
5363 -5 133 296 -99 88 62 -325 122 -6 3 64 37 -65 100 232 -52 -98 98 -34 -14 79 -68 41 86 48
5387 48 -101 173 251 -65 211 21 160 -142 337 12 132 65 -160 -26 -110 -44 178 303 350 159 235 -112
5409 -112 -63 -60 -18 -10 198 -140 -255 -192 -215 -341 123 76 213 161 121 31 20 -84 -321 -95 -86 -52 -163 -185 -143 189
5435 189 -25 165 -201 34 -255 -5 -6 184 -35 -172 199 -178 -11 -112 17 28 17 36 -42 -70 109 91 175
5458 175 -82 232 56 -141 127 -188 -164 -115 67 -109 216 214 40 -100 198 225 271 75 -93 68 109 137 -140
5481 -140 34 67 -18 26 28 208 4 -3 84 20 -67 -200 -117 -124 95 -132 -29 -192 -170 -17 379 -132 34 -131 8
5506 8 -7 11 72 -312 -84 -47 -24 -108 155 -155 -349 159 59 -206 -34 -146 152 -267 8 -6 -140 -97 124
5529 124 -102 -215 -128 -35 -24 -117 78 -5 26 -56 -121 10 259 48 -94 -117 -181 -113 91 93 -69 161 -57 -9 -107
5554 -107 -68 135 117 165 -40 -40 -110 151 170 -160 -67 449 -21 183 38 -121 -32 233 -69 158 64 42 133 128 367
5579 367 -111 44 -283 -158 -113 -80 147 -159 0 1 -76 -416 104 -30 -227 -46 43 66 -47 -63 -254 -5 -192
5602 -192 -179 74 16 22 -45 68 -80 -90 -79 106 -112 -120 -33 -66 -45 125 134 -50 56 288 39 -268 102 115 121 1
5628 1 -169 88 63 199 -66 -68 111 -2 110 -1 293 -17 437 -72 -348 169 124 -162 50 -71 168 127
5650 127 28 103 241 368 89 14 -49 198 24 360 -69 71 329 -64 209 -174 69 113 0 144 118 29
5672 29 4 -88 -20 135 12 -101 0 -262 56 66 -54 -182 -140 -179 49 21 23 -81 75 -312 -178 -177 56 -31
5696 -31 244 144 -102 -138 -130 3 96 -135 28 -36 106 14 -144 -120 6 -31 162 76 -268 -4 25 -396 -65 142
5720 142 111 90 189 -91 -118 238 86 -173 -138 93 -132 -108 197 -78 89 -23 170 96 23 225 20 184 75
5743 75 173 -90 232 -12 -39 21 -37 15 438 -37 20 -289 4 -152 158 62 -338 35 -17 -122 139 -123 144
5766 144 -119 262 -229 -298 320 102 -241 82 27 227 162 -97 -82 -38 106 -130 -51 87 -250 -41 204 106
5788 106 15 -309 -107 -135 86 89 -370 44 47 -140 -69 -190 -106 -55 -34 -285 -63 36 280 124 26 12 -154 89
5812 89 172 -169 23 197 100 168 149 -43 -55 135 188 -305 204 195 69 96 102 -105 -62 83 -155 189 133 65 166
5837 166 121 -154 -91 -53 -43 56 236 44 56 360 94 -11 -107 113 99 115 150 174 12 101 -178 -143 -71 -138 -236
5862 -236 -28 -14 108 168 136 -102 7 24 -80 -92 124 -182 -131 -17 -276 -498 -201 -153 -244 49 136 -30 -177
5885 -177 280 79 108 140 137 -134 -24 -132 -47 -58 57 -157 75 17 -312 193 289 123 -117 268 291 77 97
5908 97 -278 165 -49 36 172 -45 67 -46 -23 299 -103 16 -7 37 -171 -109 155 60 105 -35 -41 -185 40
5931 40 143 155 86 -139 166 -89 -111 132 200 4 23 22 -93 80 163 227 36 -104 -1 -195 221 252 -267 220
5955 220 -241 -94 -149 146 -147 -429 -11 -70 164 33 111 77 -86 23 -106 107 -153 -259 -248 -71 167 -80
5977 -80 36 16 -268 -90 -246 6 -5 -48 -191 -37 -37 15 62 49 95 37 139 -206 -140 184 -219 95 98 34 -21
6002 -21 -135 -89 33 -89 147 231 37 283 -177 7 -131 17 164 268 130 185 47 13 -187 -134 87 71
6024 71 -314 15 -211 34 221 106 68 96 89 -132 123 -16 217 -5 -109 190 -8 -48 -308 270 -36 282
6046 282 -73 -260 -73 91 142 -36 -147 3 -117 -38 64 8 -213 1 -11 -178 -14 -93 -412 106 -188 -224
6068 -224 154 -261 -271 -72 -9 111 66 41 -130 250 115 -365 47 -55 -186 -11 45 88 247 -368 82 251
6090 251 -31 55 -162 265 -345 -189 293 146 -62 -97 130 3 3 15 84 -54 -84 237 -9 75 -100 -9 -17 41
6114 41 -176 104 -110 85 -100 -177 117 -100 -122 -196 -339 -47 -29 34 -20 -56 -139 -143 97 2 109 -547 10 38
6138 38 -9 -88 -151 -14 -145 -1 132 110 122 -158 232 84 -170 251 66 34 -66 32 0 -48 25 -47 -34 -324
6162 -324 234 -14 53 -270 -329 -37 -255 33 -76 22 -102 -53 -83 209 91 -161 -334 73 33 41 -275 -156 218
6185 218 111 0 94 264 37 108 -18 48 -348 80 50 23 -18 40 -117 -187 78 49 -84 -200 93 -83 -123
6208 -123 -127 -167 -157 125 288 -34 -41 349 140 -262 72 352 -222 -132 67 -145 -54 -108 85 177 182 141 -315 -80
6232 -80 -189 -301 59 293 48 -190 -13 -186 -167 180 37 -189 87 115 -7 107 -37 94 79 45 -183 -11
6254 -11 32 -251 -181 47 -237 4 9 20 -58 -56 61 -227 -55 180 38 -23 -102 205 1 457 -234 120 59 162
6278 162 -40 24 152 -214 229 -153 44 -39 227 26 -29 506 35 149 272 108 19 305 -1 51 189 60
6300 60 26 -170 167 339 -47 81 -28 148 119 38 46 129 -16 15 -19 132 27 261 164 -57 -44 -39 -297 -143
6324 -143 -46 -45 155 37 139 -233 135 45 -120 -121 -64 3 -165 431 -15 -39 -67 -113 140 -22 -50 -97 87 -153
6348 -153 -217 -118 258 22 127 -47 -17 140 -163 -212 350 225 -241 -128 36 208 48 -252 347 157 238 -25
6370 -25 -93 -98 235 110 149 84 -43 7 -51 -50 -32 36 319 -8 -45 79 35 16 462 183 -51 117 -135 122 353
6395 353 -288 138 -43 -78 34 27 72 -172 -113 -137 -68 -154 -102 -345 -357 -222 -280 63 274 -146 -161 -73 156 234 -195
6420 -195 -36 -33 128 -26 -171 -50 -21 -54 -221 -165 -221 -36 24 55 120 62 187 165 -42 -135 -216 82 -48 213
6444 213 -10 -10 61 -72 -151 -121 -66 -54 441 -335 169 237 123 0 86 216 -53 196 -93 80 190 54 141
6467 141 48 -38 -41 -40 -192 134 101 -95 98 253 195 -145 -19 250 137 236 -97 155 -303 -62 -21 135 -25
6490 -25 39 -21 81 -93 84 -19 -188 89 24 -45 33 58 -77 -169 -140 -14 -107 49 -94 -79 -120 -2 -50 95
6514 95 -150 235 70 -19 77 151 -60 -239 -102 -144 138 -193 473 142 -103 -140 4 26 107 -50 -149 46 276
6537 276 -43 -66 -140 20 -48 51 253 -97 102 265 -45 -33 -79 -154 48 253 45 154 189 -111 -45 -215 143
6560 143 255 44 234 -78 42 -179 -122 36 -211 67 131 269 39 -42 -213 -163 37 -50 -95 -102 136 -40 -83
6583 -83 -144 -25 125 9 -42 -34 -38 -197 -160 116 -177 -242 -8 -97 106 -289 16 133 11 171 313 -195 -47
6606 -47 24 221 -161 199 67 116 -77 -11 228 -151 -98 -316 26 -215 -319 244 14 76 41 -203 33 267
6628 267 -61 -71 169 193 108 152 184 167 40 35 189 33 -45 39 -14 233 -65 38 -1 76 264 -82 162 94 5
6653 5 -247 209 7 4 186 141 49 142 104 -177 68 41 -46 128 -169 -126 163 -213 -16 -109 147 -70 112 -77
6677 -77 -102 -301 306 66 78 -39 -126 89 -38 -161 173 -79 -213 -61 -29 -60 -52 109 -61 -117 -48 -2 105 -126
6701 -126 -26 -21 -37 27 -55 -34 -273 19 143 107 73 143 258 245 -70 24 231 136 225 123 365 143 69 -47 132
6726 132 227 94 81 122 -8 164 23 60 206 -53 143 -89 108 -75 -75 43 148 16 3 142 -351 -4
6748 -4 -10 133 -186 91 119 -38 321 -93 -74 259 -218 155 -1 -21 -216 54 -46 -20 -409 143 -234 -12 163
6771 163 -227 -82 -38 -111 -164 -148 210 188 353 -53 -236 -96 177 -244 -156 -216 -21 -83 -165 167 -92 174 4
6794 4 194 -29 63 59 5 -156 -2 -75 21 -143 195 36 -143 -50 -65 -13 109 -112 -182 -9 249 67 -2 121
6818 121 96 66 -112 78 100 121 133 64 16 -11 149 -88 113 41 302 -94 35 -225 46 231 -18 257 34
6841 34 27 -125 -38 52 110 263 -13 119 31 172 -58 -164 99 -140 -186 74 -87 -22 -27 -125 -174 23 -125 144
6865 144 18 -137 52 43 -157 82 -133 150 150 -264 39 -181 -33 -111 2 -41 188 201 13 125 -58 -134 -34
6888 -34 9 -136 56 273 233 48 -222 102 -170 15 112 24 164 -259 42 -102 24 82 39 132 -106 68 -207
6911 -207 -72 161 294 -41 -241 -73 285 -152 -44 -174 -253 -59 13 -60 86 152 -14 177 34 -196 -230 50
6933 50 112 -2 -110 143 104 58 75 6 -212 -3 330 109 -47 152 -8 122 -196 -119 -49 52 -52 167 -16
6956 -16 -205 76 58 -19 -14 49 -175 -125 -138 -329 -8 -168 137 -86 -105 -95 40 -124 122 -110 -73 52 -123 -34
6980 -34 -54 -166 -331 84 190 -117 -13 -138 -163 -56 159 184 -80 0 -195 -13 73 -87 -165 92 334 -13
7002 -13 67 -68 135 -36 -22 -87 -40 246 -84 -11 -2 -6 -139 250 235 133 36 200 -25 9 47 -11 -208 116 12
7027 12 -194 -155 -73 46 -14 76 -60 102 132 -75 52 -115 -115 117 -23 -200 8 -64 -180 -120 129 -211 130
7050 130 161 24 90 33 -115 -205 -138 -121 54 190 24 -40 -28 1 121 148 35 103 -107 -31 -111 -167 239 36 -106
7075 -106 -8 62 -4 -86 -141 -53 109 152 -223 -128 -140 38 -29 192 -4 -104 -66 288 261 -75 -214 -146 -56 -189 58
7100 58 191 285 3 170 -3 -58 226 232 17 -163 91 -156 -25 -46 -152 47 -216 195 -94 68 57 47 -41
7123 -41 88 -14 -207 15 52 157 80 -192 -43 10 -350 -190 -79 -233 161 132 -158 -227 44 -146 102 -98
7145 -98 86 79 -65 148 -62 192 -195 186 8 64 182 -79 117 -112 -141 20 -57 127 12 188 45 70
7167 70 225 36 -143 -7 -176 336 -41 156 142 -24 -12 103 -6 -166 40 -156 11 -41 358 -114 67
7188 67 16 -30 27 -258 -23 138 -57 38 115 7 -306 -161 -237 -17 88 -2 -72 157 145 -274 -225 -4 42 192
7212 192 273 -296 214 -144 -59 -19 -42 197 -4 -174 -199 -265 -101 -230 -239 -147 4 -267 77 -147 359 84 67
7235 67 95 -7 26 -300 268 112 -93 162 -68 -88 152 -31 80 316 11 150 -51 46 96 299 -105 181
7257 181 -30 -79 77 -39 276 -113 56 53 98 -170 45 -53 -120 28 -9 302 -101 174 -19 -71 191 83 161
7280 161 -31 128 -35 22 -281 330 24 -9 -231 -106 257 -139 -22 21 79 84 -110 -146 47 -16 -93 108 120
7303 120 -55 112 55 -170 -120 -222 -77 -35 -216 -215 -3 -197 -42 -355 -86 -80 -90 190 -121 -238 93 -61 334
7326 334 -196 198 78 -37 -1 -127 127 217 -100 -159 -7 105 -51 12 -161 -333 117 -44 -87 28 -237 -207
7348 -207 14 166 -40 -66 162 129 -168 -122 -138 9 139 82 160 255 198 -110 -6 75 79 79 54 148 108 -157 128
7373 128 -19 59 317 -41 -3 236 128 -262 -67 122 -39 -34 152 -55 39 -5 130 141 5 163 157 -67 38
7396 38 -230 149 -68 -295 -156 -14 -72 -166 133 -56 87 -349 -148 100 -6 70 83 87 -144 -180 -2 -29 24
7419 24 -17 -267 -108 -292 -218 -124 -316 144 -228 87 132 212 -89 -127 -87 -48 -3 9 187 -61 -58 211 27 178
7443 178 -109 32 -151 62 -129 -109 108 -9 -3 -184 104 94 226 -152 101 -35 212 34 -213 -103 -38 -211
7465 -211 46 236 189 -369 13 203 132 -84 226 58 -40 -16 -44 -104 157 -70 -5 -116 109 -24 53 75 -200
7488 -200 151 -23 3 -16 -49 27 -170 162 135 -167 -57 58 223 -36 -74 -44 -13 35 111 -251 -55 25 88 -236
7512 -236 43 50 -253 107 74 -89 -206 84 -280 -112 49 -12 -114 308 8 12 -192 219 -339 85 -192 -29
7534 -29 -69 -69 76 -65 162 -91 -23 -15 231 -70 -63 -146 101 212 73 129 60 -128 48 181 -19 4 -62 66 160
7559 160 89 -101 4 73 103 -79 -44 186 66 151 -295 99 -63 -67 212 -105 27 -113 39 -39 98 -232 234
7582 234 -241 -179 139 -51 -40 55 211 177 -161 -5 9 138 -117 -91 173 -79 -199 -20 287 -156 -40 -85
7604 -85 120 6 -233 36 -191 49 -260 10 225 -12 96 103 -167 18 -123 10 -74 67 230 49 -141
7625 -141 -159 67 -49 188 87 27 -73 -29 -18 109 -199 -96 123 -21 69 309 194 -114 83 -51 305 -144
7647 -144 -97 196 163 111 122 388 -194 8 147 -38 -190 -392 -151 -74 136 188 149 85 -104 295 67 -136 -67
7670 -67 -201 41 53 -18 -178 103 -40 -48 148 -229 -269 -118 -262 -64 -72 -44 156 240 -63 -264 -53 -130 -355 -179
7694 -179 -106 79 60 -468 -44 65 146 202 263 46 276 176 -132 43 -259 -379 126 33 -37 16 35 101 200 221
7718 221 250 30 346 -18 -32 -14 -164 -90 -186 29 208 -246 -29 273 26 -56 127 -182 12 165 182 86 154
7741 154 95 -111 -58 128 -24 235 441 -178 -110 -210 131 25 -102 -201 128 31 -133 103 89 -67 -13 -126
7763 -126 -109 -61 134 -210 -21 -86 -7 -55 172 -163 -74 -239 95 -73 -29 -40 -96 -38 67 -50 110 -131 49
7786 49 -209 -247 -142 -3 -239 151 -63 378 -33 15 244 106 -26 -231 28 47 48 45 -55 -226 28 95 -16
7809 -16 61 206 180 90 207 11 -86 -238 70 22 -217 162 48 239 -229 179 58 -19 -72 37 -324 -64 -184
7832 -184 -97 -43 -218 -30 -147 -78 147 313 25 124 -34 -77 2 -156 -43 -112 -115 12 6 129 -247 -152 145 -176
7856 -176 -110 -112 146 65 -33 -49 -3 93 49 -103 -95 -129 254 -81 -240 260 11 -239 115 52 34 -126 -193 33 -41
7881 -41 407 -188 -72 1 -51 -265 -158 207 -153 219 132 -139 -326 32 157 24 0 43 -3 75 9 -177 46
7904 46 86 -5 -38 157 -14 113 -89 -14 -64 -184 -50 78 47 3 111 -89 -171 189 220 -22 -77 -38 -336 -202
7928 -202 20 -175 81 105 135 -20 -103 -157 -211 74 29 117 -39 -91 -156 -121 -70 -402 -66 149 -88 39 170 79
7952 79 -73 -38 35 -250 -178 141 -37 -13 -74 -107 -94 -148 42 -50 -66 57 -150 42 32 5 362 121 175 31 166
7977 166 195 -125 75 101 -59 54 -77 -6 14 -24 200 77 -23 158 42 230 172 255 182 231 -2 71 4 64
8001 64 62 -189 40 -218 -247 -34 -262 153 -133 -38 -194 -216 15 -317 -122 68 -42 138 -251 -285 -46 163
8023 163 222 -125 17 -83 77 -140 32 122 198 -108 181 141 -178 -236 -161 85 27 144 -7 42 139 -71 56
8046 56 -69 -60 0 -18 103 -16 -153 8 -255 207 -89 83 79 113 178 168 91 -160 60 -142 148 -51 -201 -227
8070 -227 -43 -245 7 300 206 5 -19 146 89 -190 -180 -6 90 2 253 115 214 -183 115 -40 -64 -138 65
8093 65 -226 44 -73 59 80 -77 -137 104 -229 -169 -101 242 -1 -122 -185 77 -192 -146 -43 -188 57 -133
8115 -133 -123 -237 -85 237 123 144 -90 -87 8 -38 494 14 -210 82 -53 -219 43 -54 -134 -207 -154 -14 -84 -145
8139 -145 224 11 203 208 -2 -215 211 -142 69 29 -163 -60 52 150 -25 58 28 37 -66 51 267 14 -89
8162 -89 -37 200 35 160 67 115 -179 34 232 49 -51 115 -203 -64 -73 -109 264 -13 92 93 -42 95 18
8185 18 -79 -312 -102 -118 -76 -23
8191b3
$$ Imaginary data points
##PAGE= N=2
##DATA TABLE= (X++(I..I)), XYDATA
0 0 0 0 0 0 0 0 0 0 0 0 0 0 8 -8 8 -8 8 -16 16 -16 24 -24 32 -37 41 -48 57 -66 77 -88 100 -113 129 -147 164
35 164 -182 206 -230 256 -288 317 -354 390 -431 478 -528 581 -641 704 -776 856 -944 1041
53 1041 -1149 1273 -1409 1570 -1753 1970 -2226 2540 -2927 3429 -4094 5031 -6443 8794 -13399
68 -13399 25666 -123816 -273864 139602 69012 -174506 30181 100391 -153981 -28723 143025
79 143025 -83244 -124724 102292 -15208 -142552 62933 72846 -127347 -41589 48181 -83088
90 -83088 -58014 48342 -62649 -85069 50898 -11858 -100425 27786 22596 -114873 -21686
101 -21686 72217 -50474 -41433 69774 -27437 -85463 58330 41343 -90825 -9905 62895
112 62895 -42484 -23161 63881 -35190 -72582 56187 20467 -93569 6435 72481 -49263
123 -49263 -37925 63397 -23203 -66372 59152 27542 -80676 21080 71539 -54002 -15772
134 -15772 85245 -36898 -78068 81154 45222 -84690 17545 67735 -57386 -16720 73716
145 73716 -36196 -59021 60946 4529 -67245 46327 38592 -81333 -2434 60835 -55963
156 -55963 -33425 70149 -23423 -66722 52847 16852 -70543 27364 34499 -88486 -6203 89463
168 89463 -47280 -71885 61261 3870 -75575 33932 29948 -82025 -2391 63642 -51313
179 -51313 -38106 61386 -26084 -71450 48388 22778 -72838 10600 45719 -57342 -21945 55614
191 55614 -33256 -53419 50495 4100 -70206 25007 42644 -59039 -14518 50840 -35731 -39793
203 -39793 57420 3055 -63924 30603 44263 -51433 -9317 50212 -25491 -26794 49237 -2297
215 -2297 -41794 38924 24813 -53782 6734 50544 -31437 -21671 47033 -10529 -37222 41820
227 41820 15946 -48036 17682 36863 -40771 -2201 59278 -21319 -40966 47249 15455 -42939
239 -42939 27372 32765 -43306 3174 51325 -26109 -26034 46520 -4912 -43289 36475 22961 -49639
252 -49639 9631 39559 -41046 -15900 51161 -17411 -43975 38764 15140 -46410 19619 34951
264 34951 -46402 -10886 51079 -18733 -33052 42106 4866 -47190 23195 33036 -39511 -5356
276 -5356 39465 -23730 -22033 41855 -2967 -38717 27954 20119 -38865 10503 38071 -30412 -15188
289 -15188 43403 -7552 -29417 36649 12912 -39852 20541 37668 -30944 -5421 42668 -16009
301 -16009 -23845 45737 11729 -37689 23290 30687 -32683 5077 44341 -19463 -18455 41156 2312
314 2312 -28304 32457 20137 -37477 11848 40305 -24593 -10146 42159 -9770 -28177 36541
326 36541 14141 -36177 16443 31594 -30026 -3625 42434 -14937 -28697 33719 8498 -31066
338 -31066 20950 24051 -31874 -1066 34036 -16594 -17259 31213 -2966 -28939 24624 17272 -30682
351 -30682 6348 25912 -26059 -9835 34895 -7847 -26132 26455 10846 -31327 12756 25747
363 25747 -28350 -6303 35389 -9929 -20381 30179 5627 -31000 16304 25040 -24734 -796
375 -796 30967 -13991 -14496 32129 902 -26499 20191 16606 -25460 9792 30999 -18963 -11433
388 -11433 31800 -4333 -22685 27034 13430 -28231 12560 28388 -21928 -6926 31118 -9458
400 -9458 -21446 28275 10395 -26010 13942 22037 -22903 -1524 28720 -12731 -15241 27524 3079
413 3079 -21130 20147 14748 -27343 3162 25167 -18628 -9793 28849 -7115 -24776 21192 8800
426 8800 -29618 6556 20525 -24413 -8212 27610 -11553 -22716 21690 2126 -28633 11269
438 11269 17212 -23623 -2312 23270 -14996 -15421 22053 -4875 -25177 15305 10175 -24893 3324
451 3324 16713 -22726 -12067 21002 -9746 -23025 15625 4765 -24793 6596 16059 -22243
463 -22243 -7422 20613 -9735 -16072 19915 6424 -19837 8131 13723 -17324 -1719 20343
475 20343 -8915 -11726 18370 2034 -16512 10834 8915 -19958 1433 20292 -11372 -10212 19766
488 19766 -1241 -17219 15619 9349 -21313 5717 22542 -12800 -7534 23771 -2490 -18124
500 -18124 17378 8406 -20032 9742 19864 -17879 -6203 21023 -9032 -14952 17889 -1717
512 -1717 -22598 13932 13020 -23895 -1753 16823 -18996 -11067 20709 -9063 -22672 16824 7221
525 7221 -25475 2824 13031 -21615 -6592 19233 -12773 -17631 17041 -1290 -23981 5506
537 5506 7423 -19832 -1397 11985 -16969 -11272 15714 -6536 -19674 7085 1145 -17307 5188
550 5188 10329 -17238 -7051 14690 -5961 -14232 8834 2394 -13367 6638 10376 -13891 -5186
563 -5186 14040 -3351 -11699 8692 5003 -10025 5498 9643 -11806 -3721 15340 -2430 -10666
576 -10666 9710 4506 -8736 9398 9541 -15297 -2195 18664 -4320 -9438 14942 1752 -13057
589 -13057 13442 10404 -19062 622 20464 -8637 -9009 17620 -1477 -14004 15604 6673 -20134
602 -20134 6105 17910 -13250 -4413 16429 -7512 -10159 17180 -1652 -20292 11473 12114 -16544
615 -16544 1188 12248 -15796 -5300 18926 -7692 -17313 13782 5820 -16120 5413 8685 -16256
628 -16256 -236 15842 -10205 -11204 13792 1628 -12133 5515 2993 -12506 3185 10334 -10699
641 -10699 -6768 11484 -1037 -8576 5355 -232 -9986 6157 9799 -9140 -5157 10746 252
654 252 -6476 6687 2895 -8511 6194 12443 -6468 -5190 11586 2948 -6645 6456 4927 -6767
668 -6767 5937 12555 -7037 -4797 12690 1644 -6406 8815 3479 -7990 9447 11926 -10858
681 -10858 -1638 15745 -3128 -5610 14421 715 -11100 13485 11375 -13622 1216 15170 -6705
694 -6705 -4044 15115 -2903 -9724 13995 4769 -14803 4735 10793 -9425 289 11276 -8771
707 -8771 -5920 14123 -1380 -12945 8180 5579 -10540 4375 8405 -11766 -2833 13208 -4630
720 -4630 -10601 8389 3115 -9011 5402 6147 -10651 -1328 10480 -4805 -7197 7687 2144 -6193
734 -6193 4490 3686 -7921 549 8899 -3626 -4680 7189 1776 -4210 5713 3341 -7598 2286
748 2286 10136 -3122 -3493 9285 1868 -5513 7299 5350 -8030 2801 11755 -3352 -3532 9843
762 9843 1033 -5964 7734 4719 -7636 4573 10152 -5942 -1688 10164 -2104 -4748 8922
775 8922 527 -8205 7686 7662 -8442 950 9266 -6894 -4495 11069 -1753 -9019 8626 4647
789 4647 -9988 1536 7297 -7940 -2880 9058 -4006 -7055 7603 1088 -9279 2681 3910
802 3910 -7774 -172 6356 -5636 -4438 7526 -1966 -7938 3836 1691 -7335 2453 5673 -6883
816 -6883 -3289 6895 -2557 -6953 5039 2491 -7041 1873 5841 -5787 -2753 6277 -2270 -5443
830 -5443 5074 2092 -5226 3099 4842 -5367 -1365 6103 -3208 -3665 6174 983 -4920 4930 3705
845 3705 -6793 80 6656 -3786 -3511 7760 -393 -6577 5651 4029 -7418 984 6565 -4769
859 -4769 -2549 7675 -1022 -5841 5324 1846 -7655 2535 5238 -5949 -623 6135 -4088 -4677
873 -4677 5169 -1311 -7057 3824 2940 -7605 457 5285 -7002 -4041 5785 -3271 -6992 4233
887 4233 1584 -7714 841 4166 -6976 -3418 4763 -3795 -5607 4484 -67 -7054 1127 1813 -6756
902 -6756 -1643 4083 -4517 -3816 4470 -1995 -6309 2488 725 -7238 335 4238 -5200 -2650 5163
917 5163 -2012 -5755 3586 1894 -6153 1424 4851 -3686 -1199 4882 -2060 -4295 3716 1754 -4013
932 -4013 2284 3675 -3741 -91 4551 -2694 -2365 5062 -301 -3654 4222 3254 -4756 1214 5167 -3681
948 -3681 -2526 6185 -195 -4256 4589 2644 -5109 705 4022 -3853 -1822 5180 -1380 -4255 3418
963 3418 345 -5592 1308 2516 -5269 -1074 3753 -3383 -3521 3560 -1928 -6031 2303 1203 -6445
978 -6445 190 3708 -5412 -3514 3724 -2938 -5680 3018 811 -6111 484 2498 -5276 -2591 3596
993 3596 -3474 -3833 3341 -627 -4337 1626 1435 -4235 -50 2549 -3657 -1812 4522 -699 -3282 3462
1009 3462 903 -4199 1104 3592 -2731 -369 5189 -682 -2830 3351 1758 -3060 1735 3803 -1641
1024 -1641 562 4643 -51 -1648 3394 1437 -1880 2557 3134 -1591 1334 4392 -993 -1679 3857
1039 3857 716 -2195 3176 3045 -3237 912 4507 -2777 -2080 4609 255 -2995 3470 1884 -3943
1054 -3943 1461 4051 -3626 -1909 3950 -925 -2522 3502 -172 -4322 2188 1726 -4572 -281 3140
1069 3140 -2701 -1042 3763 -2560 -3878 3362 233 -5055 1348 2489 -3847 112 3151 -3367 -2895
1084 -2895 3653 -28 -3866 1111 1539 -2262 1026 1729 -3305 -1271 2962 -180 -1332 1699 86
1099 86 -920 1630 1042 -2652 466 3157 156 -841 1893 810 -605 1552 1741 -1597 -102 3920
1115 3920 1877 -1093 1731 2451 -350 787 2369 -961 82 4401 1826 -1745 1202 1815 -1164
1130 -1164 1869 2757 -2198 707 4939 -133 -2075 2988 889 -2197 3355 1889 -3921 1304 5240
1145 5240 -2568 -2032 3494 -1150 -2219 4192 98 -4947 2386 3407 -3918 -1440 1791 -3086 -444
1160 -444 4024 -2618 -3864 3026 491 -3675 608 60 -3940 1556 3258 -4092 -2925 3084 -1074
1175 -1074 -3249 1312 -972 -2843 2270 1895 -3655 -1762 1603 -347 -895 185 -1243 -564 2309 363
1191 363 -2323 -457 782 479 743 -70 -928 477 2201 973 -1108 -788 1381 1583 248 565 1108
1208 1108 244 1365 2203 -1186 -1832 3072 2738 -1377 743 1987 -1420 998 2925 -1860 -1896 3756
1224 3756 1327 -1759 1334 443 -2507 2418 2145 -4243 -370 3723 -1190 -1324 2240 -2139 -3044 3482
1240 3482 349 -5503 1001 3186 -3302 -1189 1671 -3741 -2281 3548 -1011 -4178 1137 601 -2867
1255 -2867 573 -203 -4714 -266 3085 -2610 -2343 1704 -1232 -1715 1762 -1484 -4190 1382 2501 -2537
1271 -2537 -1072 1238 -1561 -952 1414 -1434 -2211 1459 1326 -1368 -650 -21 -349 431 338 -918 -263
1288 -263 1243 847 77 -277 -409 72 586 467 -159 -359 1199 1862 -472 -1171 860 686 -593 1046
1306 1046 700 -1035 586 2389 -1416 -1771 1658 404 -1159 1307 811 -2131 1155 1882 -2353 -1663
1322 -1663 1463 -579 -667 1916 -1196 -2609 1667 528 -3121 412 1146 -2387 68 2048 -2760 -2469
1338 -2469 2539 -656 -3406 758 426 -3001 641 1152 -3180 -1271 1295 -1537 -1877 1094 -532 -1799
1354 -1799 1066 -240 -2991 -38 1034 -1966 -320 1182 -1464 -1050 1672 -590 -2097 590 1207
1369 1207 -1360 -73 1312 -435 -457 1356 -109 -1052 712 943 -70 122 908 213 98 862 645
1386 645 43 990 1357 6 330 884 -83 -42 1191 529 -971 1164 1314 -600 464 1558 -299 -639
1404 -639 1477 485 -1195 1208 1572 -1103 -224 1300 -1057 -859 1710 -109 -1083 869 5 -1599 54
1421 54 341 -1711 -126 1099 -1453 -1293 1263 -817 -2219 623 -318 -2400 159 1191 -1617 -1039
1437 -1039 1379 -1042 -2144 739 406 -1717 440 906 -1568 -356 768 -851 -1046 1087 -256 -939
1453 -939 1133 846 -1478 556 938 -1125 14 1730 -74 -226 1444 714 -1144 896 1731 -742
1469 -742 343 2114 456 -138 1676 708 -848 1356 1660 -59 565 1876 310 294 1399 412 -394
1486 -394 1522 1035 -321 1351 1543 -352 336 1576 -193 -964 1367 678 -836 1182 1487 -1099 -478
1503 -478 1247 -412 -868 1220 553 -827 534 714 -1208 -630 255 -704 -862 648 -293 -1236 328
1520 328 -159 -1698 -115 577 -1492 -100 1217 -827 -1634 739 -181 -2135 237 1173 -1085 -748 1339
1537 1339 -1028 -1601 887 -90 -1410 251 590 -945 35 869 -886 -734 960 -425 -716 1564 522
1554 522 -799 1099 942 -1021 110 1557 -157 -145 1922 737 -747 913 1346 -750 343 1793
1570 1793 296 -120 1633 705 -351 868 1113 -577 603 1425 206 194 1234 73 -447 1005 553
1587 553 -831 749 1335 -476 -326 1236 -229 -1210 1353 333 -1758 411 1365 -1440 -851 787
1603 787 -1110 -1554 843 79 -1813 340 563 -1726 -782 481 -2177 -993 1334 -941 -1435 754
1619 754 -557 -2206 479 181 -2219 -399 1473 -1349 -1574 987 -585 -1575 541 48 -1744 310
1635 310 1168 -1265 -714 649 -1137 -522 1269 -252 -700 1291 710 -388 172 276 -436 458 1210 -260
1653 -260 -214 1417 717 -162 296 473 59 412 1323 400 -519 620 1044 -145 -350 607 707 -73 405
1672 405 632 -798 -185 1389 -611 -1120 670 186 -29 969 -388 -1587 422 1196 -1331 -499 992
1689 992 -1003 -321 1980 -1151 -2797 1328 717 -2717 -94 979 -1969 -362 1697 -2160 -2595 1678
1705 1678 -44 -2204 851 -83 -1892 934 891 -3072 -885 1753 -1264 -1277 1361 -1080 -1850 1994
1721 1994 -11 -3292 318 1684 -1281 -8 1174 -1666 -592 1810 -291 -1982 638 951 -227
1736 -227 775 411 -1320 739 1533 -861 -627 822 481 595 985 -350 -527 1124 1149 -332 -288 357
1754 357 776 1001 -66 -371 37 492 772 818 -858 -311 1568 436 -845 -89 104 -641 960 1197
1772 1197 -1675 -435 1794 -302 -1243 626 -1063 -586 1692 -8 -2152 225 1016 -1615 -285 774
1788 774 -2122 -422 2553 -1252 -2621 1501 351 -2129 645 498 -2472 377 2308 -1863 -1537 1335
1804 1335 -428 -1363 1447 -696 -2156 1541 1159 -2279 -335 1086 -1269 120 1548 -1277 -1304 2249
1820 2249 337 -1724 521 734 -476 1031 1302 -1407 27 1896 263 -779 263 379 299 1251
1836 1251 434 -761 482 1145 307 85 97 353 957 1131 432 -431 160 1040 619 -129 -114 790 443 159
1856 159 852 -304 -1006 965 1097 -914 -211 1135 7 -512 848 -516 -1277 962 917 -1218 -104
1873 -104 881 -700 -214 355 -1412 -844 1490 -182 -1547 758 -175 -1460 470 475 -2425 -444 1859
1890 1859 -1060 -1131 937 -521 -1431 616 -119 -1833 619 1249 -1197 -468 811 -630 -597 1447 -364
1907 -364 -1030 1197 692 -657 514 511 -667 414 1296 -361 -554 1414 927 -323 661 734 -665 244
1925 244 1214 -158 -304 896 948 -208 495 515 -326 409 1147 453 -250 649 472 -156 330 484 17 507
1945 507 884 -42 -272 739 268 -1033 186 681 -674 -109 983 -667 -1109 517 -64 -1246 297
1962 297 358 -1034 -111 676 -1118 -695 525 -576 -964 449 64 -1214 69 11 -1535 -678 640 -1071
1980 -1071 -559 803 -367 -1481 494 48 -1481 -128 743 -692 -535 600 -473 -889 360 28
1996 28 -1099 196 854 -733 38 710 -421 -140 628 -86 -562 706 470 -83 355 795 -593 -308
2014 -308 1224 181 -510 1169 614 -487 334 948 -287 -259 1193 410 -382 558 840 -598 363 605
2032 605 -370 -47 818 39 -39 628 -8 -524 306 288 -780 -233 747 -513 -274 691 79 -1116 101
2051 101 380 -940 -402 834 -593 -673 441 -601 -1426 132 29 -838 -166 400 -1043 -707 379 -349
2069 -349 -1001 121 -101 -1032 9 320 -1081 -594 235 -583 -600 467 -45 -927 282 229 -1028 -375 710
2088 710 -817 -604 1059 140 -663 499 308 -530 203 603 -292 272 891 -3 -252 587 -157 -467 612
2107 612 518 -561 299 1177 -313 -8 862 83 -493 933 541 -287 369 854 -62 -517 652 143 -564
2126 -564 589 768 -705 172 689 -281 -260 692 -302 -745 349 250 -648 300 458 -931 -310 401 -406
2145 -406 -500 815 105 -1140 66 -68 -1093 -499 648 -726 -904 728 -208 -981 95 110 -1122 -99
2163 -99 466 -824 -417 853 -455 -874 769 -303 -902 627 148 -857 148 585 -546 -721 654
2180 654 -293 -430 885 285 -805 522 405 -437 -140 537 108 -64 475 260 -213 204 613 -359 260
2199 260 764 132 548 504 154 -277 314 595 38 96 756 94 -23 462 214 -326 321 664 82 -350 797
2220 797 346 -301 384 83 -914 -64 1167 -556 -544 767 -165 -520 603 -226 -1108 304 518 -868
2238 -868 -353 456 -813 -70 623 -678 -841 1126 14 -1430 214 432 -1103 -26 808 -1252 -415
2255 -415 1284 132 -879 298 -8 -846 653 97 -1069 24 1013 -605 -553 689 -888 -210 1094
2272 1094 17 -850 784 868 -290 178 255 -518 5 1240 44 -466 344 619 71 318 -198 -71 604
2291 604 797 52 94 -119 315 676 246 -134 355 852 262 311 -191 -285 715 487 -477 271 468 277 377
2312 377 620 -1023 -611 1095 -246 -902 614 65 -526 668 256 -1616 -357 1095 -555 -751 467
2329 467 -602 -785 898 -715 -1581 693 542 -1523 -52 53 -1086 -149 1462 -1296 -1241 822 49
2346 49 -862 407 -64 -1294 614 898 -1262 -457 1207 -76 -46 422 -546 -763 1008 343 -932 216
2364 216 866 -334 640 625 -757 -127 1011 36 -421 366 293 161 623 86 -766 141 562 219 226 -34
2384 -34 491 435 466 -434 -125 434 545 722 100 -339 36 539 -161 -307 -74 71 -13 509 -513 -604 552
2405 552 270 -365 -79 -104 -712 809 380 -1275 -374 525 -534 -464 439 -479 -825 850 226 -1326 -206
2424 -206 191 -816 -348 159 -792 -419 954 -489 -854 176 -38 -773 669 58 -977 146 969 -809
2442 -809 -915 368 -330 -372 730 212 -919 454 618 -368 -185 207 -71 321 746 -515 -174 647 139
2461 139 -153 333 231 -172 640 438 -517 106 381 303 123 83 468 172 218 161 156 -401 229 221 438 -102 307
2484 307 186 13 151 207 -373 62 489 -71 -8 92 132 -213 348 -236 -776 -71 606 -541 -204 208 -247
2505 -247 -407 342 -500 -911 330 113 -800 -232 250 -771 -265 367 -340 -671 554 -318 -710 108 -303
2524 -303 -721 -175 299 -577 -257 476 -358 -372 165 -512 -501 518 -52 -721 394 221 -511 -352 302 0
2544 0 -208 483 300 -73 224 427 -141 -29 423 139 361 563 457 -107 440 228 51 75 225 6 185
2565 185 411 181 86 355 312 -100 262 306 101 -118 549 268 -122 27 302 -253 -8 290 78 48 294
2586 294 172 -542 -85 230 -176 183 83 60 -312 264 -235 -424 126 -26 -160 -86 -229 -373 -362 129 -622
2607 -622 -555 -38 -100 -60 14 41 -322 -267 48 -456 -130 282 -59 -249 10 93 -336 -16 -254 -67 -66 283 -228
2630 -228 -165 341 80 -203 246 -56 -280 40 163 117 -80 410 235 -436 -89 457 4 191 413 -39 -111
2651 -111 274 324 316 475 226 192 310 61 -186 197 181 -75 -16 383 328 131 196 434 -328 124 300 39 115
2674 115 429 137 39 94 180 -349 -210 196 162 -153 120 -124 -143 -80 -244 -333 -303 175 -329 56 21 -450 -311
2697 -311 -103 -267 -427 43 124 -621 -345 18 -560 -209 -46 -31 -220 210 295 -262 153 58 -295 -53 96
2718 96 179 64 303 109 -132 167 -151 -249 341 215 -148 154 332 90 220 211 191 -26 176 474 136 26
2740 26 48 275 296 150 372 143 83 371 547 -126 107 76 202 68 -10 158 160 398 -49 -226 -128 29 -265
2763 -265 243 375 -153 203 356 -305 -297 130 59 -223 70 99 -684 -115 313 -405 -342 283 -252 -377 236 -19
2785 -19 -365 104 155 -621 -188 58 49 -23 94 -496 -538 206 -405 -322 223 237 -615 204 244 -323 -165 520 -242
2808 -242 -290 119 -72 10 391 -21 -664 255 163 -214 238 133 -293 231 200 -208 276 512 43 160 311
2829 311 73 44 524 406 -182 21 53 252 366 152 -257 143 306 -185 99 149 56 128 696 -379 -391 251
2851 251 -18 -307 206 -22 -419 384 413 -315 7 109 -324 111 119 -570 -210 583 -344 -533 103 -58 -527
2872 -527 240 -97 -1031 24 497 -440 -421 10 -574 -645 441 -500 -547 475 -71 -430 -127 -291 -609 2
2892 2 369 -785 -434 421 -155 -268 276 -277 -273 673 368 -154 -6 213 -112 166 18 -574 401 945 142
2913 142 -69 435 -269 179 530 -44 -162 618 634 -183 146 61 -299 284 544 -135 -130 683 233 -162 278
2934 278 -377 118 698 247 -346 115 130 -210 253 160 -601 222 424 -354 -132 365 -136 -46 316 -399 -390 194
2956 194 94 -11 41 -160 -340 137 59 -724 -313 267 -156 -284 263 -488 -529 467 -94 -578 75 322 -293
2977 -293 103 -44 -511 -49 455 -595 -412 152 -245 -9 378 -79 -446 272 54 -300 95 168 -63 96
2997 96 319 -185 -36 330 133 -41 293 -19 59 544 139 -209 400 421 132 590 175 -48 143 546 -99
3018 -99 -218 315 308 123 162 -132 -225 249 243 -55 148 -18 160 272 78 -95 -33 178 -198 -167 398 56 185
3041 185 299 -368 -539 -72 -50 -185 -156 13 -335 117 289 -104 99 161 -217 -419 -56 -244 -592 102 -94
3062 -94 -446 -246 -92 -113 115 217 -469 -4 235 81 -101 -74 -91 -241 166 214 -515 151 -40 -89 219 23
3084 23 -149 370 205 -100 -44 159 -71 69 47 265 -141 287 90 28 -105 229 204 225 305 229 -47 -29 405
3107 405 -30 -61 360 24 318 315 -80 86 60 21 33 165 -2 448 82 -84 -261 100 -1 -12 -29 49 -160
3130 -160 109 -131 -67 -49 -190 -82 27 -48 -299 -148 399 -8 -126 -304 -192 -166 -169 -15 -13 172 -32 -98 -288
3153 -288 -498 -107 77 32 -393 -70 170 31 33 77 -49 -94 -66 138 -13 111 94 69 63 134 -13 -90 67 28
3177 28 -44 -129 57 -5 146 31 -234 152 -70 175 -171 162 167 -192 168 87 51 87 357 202 126 29 72 83
3201 83 108 -19 148 146 286 48 406 -91 -7 85 279 -61 118 -87 5 -162 -11 -19 -45 255 61 148 -7 -46
3225 -46 -383 95 -138 61 24 318 -138 -150 -349 -190 -5 -405 82 22 -203 32 -462 -219 -176 -223 -212 -216 68
3248 68 208 -122 -46 170 -25 40 -33 89 -80 -141 170 -240 64 161 -114 41 -20 42 -114 154 72 -77 184
3271 184 305 -34 138 396 303 -90 386 300 -274 291 303 -20 70 297 -91 121 115 108 -129 255 3 265 -3
3294 -3 -8 -17 120 134 107 213 101 -96 243 -84 -63 56 41 170 -102 -455 -197 183 -78 -46 260 -247 -373 74
3318 74 -53 -320 -191 -146 -312 -156 71 -307 -239 74 -54 -132 108 159 -144 -161 32 -332 -121 -144 156 -331
3340 -331 74 94 -306 187 79 -492 -364 219 -173 -219 424 -40 -105 294 -37 -202 195 478 -98 146 186
3361 186 -1 72 284 -189 136 678 239 -127 389 123 -169 155 262 -245 225 192 157 119 195 -136 121 450
3383 450 31 -72 140 163 201 251 -73 -209 70 238 -68 304 -97 -166 213 149 -201 -300 -53 45 309 -19
3405 -19 -332 -224 59 -71 -376 81 44 -111 -20 -120 -291 54 264 -335 -269 158 -252 34 90 -275 -567 329
3427 329 -124 -167 -60 94 -182 332 242 -73 187 212 -203 -67 308 -267 -100 683 174 -596 206 476 -333
3448 -333 -2 418 -210 199 359 -51 -261 377 317 249 539 125 -381 247 429 -57 29 -12 -78 86 605 -115
3470 -115 79 421 259 -43 162 -88 18 251 211 -119 -138 57 187 245 24 -38 198 390 -512 -311 -52
3491 -52 -5 11 93 -99 -314 114 67 -189 -330 -224 -502 -59 116 -228 -76 460 -119 -282 -14 -161 -113 268
3513 268 -42 -493 74 200 -438 -163 -185 -577 -20 304 -480 -215 236 -90 21 131 -78 -319 428 343 -368
3534 -368 265 124 111 135 249 129 -194 663 -160 -129 338 53 -259 166 197 88 86 360 54 -146 257 -81
3556 -81 -174 361 64 -59 338 -9 -28 270 246 -355 -105 516 -174 -220 108 69 245 -55 -270 -97 193 65
3578 65 16 175 -192 -213 -99 -228 -172 -89 -68 31 -324 32 -305 250 134 -373 -42 138 -164 -234 -89 -351 -341
3601 -341 184 -238 -243 -72 -172 -480 226 -120 -545 -130 230 -309 -250 229 -159 -155 150 121 -363 287 318 -76
3623 -76 59 121 -123 -58 481 -34 -214 174 223 172 150 80 37 100 286 -264 -141 412 180 159 261 -68 79
3646 79 522 122 -226 9 155 -60 58 -4 223 86 374 25 -49 99 0 -25 -293 -94 -295 -82 -33 126
3668 126 127 81 -385 128 -248 -224 -82 39 -101 91 -59 -130 -20 -436 -184 -90 -108 -115 22 -107 -113 -159 103 -48
3692 -48 -178 -33 -237 -419 -3 -195 68 -405 157 -68 65 13 34 218 187 -26 -16 -59 309 -146 205 101
3714 101 -174 -85 -26 -63 -345 -64 78 181 147 303 -11 76 175 -116 54 260 361 299 319 221 260 -65 -16 -140
3738 -140 -166 115 -149 179 322 -45 -20 27 214 10 -64 301 -16 186 51 -28 82 137 -76 24 143 212
3760 212 -112 -19 -201 40 -319 -133 193 143 16 181 -126 -225 -46 -61 -62 -235 44 -22 -112 233 67 -267 -53
3783 -53 -237 -638 -246 50 -217 -98 8 -56 -337 -68 -256 -116 -273 48 -203 -109 134 50 -185 -87 -226 -195
3805 -195 82 228 -96 108 265 -85 92 -153 81 60 65 330 2 15 -52 -111 179 247 284 154 233 249 175 95
3829 95 161 -123 121 350 140 99 197 -243 61 68 248 72 -121 266 102 -159 -38 -127 -53 -28 25 -68 -23 253
3853 253 -50 -96 -153 175 -226 -174 31 -31 -135 -39 -333 -374 68 -306 -167 -136 -212 -412 -223 -6 -238 -239 213
3876 213 -194 -203 145 -96 -8 -90 218 -496 -98 144 -395 -144 -100 -54 -112 155 -58 -69 483 88 -19 87 263
3899 263 -82 -158 47 60 -257 296 39 40 170 333 366 -40 140 -52 104 309 388 20 262 110 -177 211
3921 211 70 128 66 351 -126 296 -223 -67 51 43 -130 -123 177 263 9 -174 39 -219 24 -414 -37 32 27
3944 27 -114 31 -238 -350 -41 -259 -218 424 31 171 -48 -178 -584 -304 -149 -340 -77 -44 -127 -125 60 -101
3966 -101 -345 120 6 -265 -178 42 -20 -14 245 -346 -248 190 -108 -210 54 204 -137 -123 85 -156 -48 407
3988 407 118 -48 313 -253 13 135 -13 7 47 377 -153 177 174 39 132 219 -133 -9 140 216 -114 231
4010 231 -119 65 7 167 127 -138 0 193 117 199 -88 49 385 31 67 -7 181 47 267 -246 52 -234
4032 -234 137 -21 41 56 -234 66 72 -227 -97 -67 -37 275 341 -281 -374 221 -290 -450 58 -139 -206 237 142
4055 142 -415 13 222 -185 -276 92 34 -134 3 -298 -342 1 282 -165 178 152 -323 -178 652 -489 -366
4076 -366 216 150 194 270 142 -209 173 228 112 -83 154 333 -59 47 -71 -62 471 7 -4 381 372 105 514
4099 514 30 -272 230 363 59 -56 283 -157 207 424 -234 124 -71 18 75 -44 135 -95 108 88 -239
4120 -239 5 -65 -253 131 -189 -226 76 297 -255 -265 128 -272 112 329 -366 -243 -54 -209 -141 9 -82 -419
4142 -419 25 305 -116 -120 51 -173 15 -14 23 -208 304 44 -549 202 -205 60 131 51 -348 -104 123 -125
4164 -125 -96 45 210 -64 134 27 -374 234 186 -231 118 132 -171 118 147 95 204 207 122 -108 49 -62 -35
4187 -35 40 240 46 -47 -95 239 113 109 59 19 9 151 221 -136 -88 28 -133 -391 -176 -9 -19 -36 11 -50 -251
4212 -251 -88 -94 -350 -82 -82 49 -45 89 18 -210 123 -122 -246 -207 -415 -149 3 114 -498 -178 118 -70
4234 -70 -69 151 -96 -150 -111 103 -536 32 51 -67 11 56 -199 -248 223 -78 -62 109 25 -24 88 215 53 110
4258 110 57 -105 -57 164 120 -35 237 110 73 81 139 63 75 285 -41 -36 27 78 -184 64 234 21 202 46
4282 46 145 -104 5 200 167 -190 211 108 -255 23 84 -23 105 -112 -94 151 394 256 -93 157 216 -90
4304 -90 44 -71 -173 -12 101 -23 -101 -117 -75 -92 -438 200 -25 -24 -23 -29 219 -91 -104 -203 100 -159 -158 -50 -22
4329 -22 -75 -127 -19 -321 -140 -106 -133 25 18 -217 -215 34 -51 -59 6 236 -62 58 133 102 -136 -115 -47 91 200 104
4355 104 -146 172 162 -129 182 21 73 -129 81 149 -139 219 26 -83 81 227 136 168 -8 236 -39 145
4377 145 84 265 46 166 166 64 280 -89 -91 285 20 12 152 24 61 -141 48 37 -103 -19 42 -429 93 68
4401 68 -84 -231 -56 -133 -123 -15 -284 -186 -85 132 -144 -174 -167 -44 -86 138 -68 -88 -157 -4 -410 -104 -31 354
4425 354 -92 136 -131 -173 261 -28 -323 -167 76 66 -280 23 118 11 -17 53 1 90 256 268 126 3 110
4448 110 33 338 113 83 257 221 236 42 -16 -60 -63 35 -57 373 211 294 100 -134 47 81 -97 211 298 197
4472 197 48 281 73 -138 242 119 -162 -110 114 -265 46 -63 -29 -113 65 -62 -83 -159 46 -400 -270 46
4494 46 -82 -201 -130 -82 -231 161 -144 -429 18 2 -311 68 -159 -172 24 288 -163 -251 -126 34 -213 113
4516 113 -60 -357 293 197 -204 -162 -70 78 -41 405 41 96 132 345 -191 63 309 141 78 226 -167 92
4538 92 120 70 225 61 -4 -4 242 112 -77 217 500 262 123 21 66 187 99 -192 -269 73 226 44 7
4561 7 47 59 -53 -180 -63 -57 -132 -273 406 -15 -40 -76 187 18 -99 180 -10 36 182 -217 -356 -70 93
4584 93 -207 173 -139 -441 208 93 -195 266 -58 -233 -39 247 -360 -175 389 -40 -389 0 -41 -261 -76
4605 -76 183 -122 236 258 92 3 182 -193 -109 129 -109 -33 165 10 -3 67 -4 -124 537 197 101 -88 392
4628 392 354 35 46 -61 117 574 427 -113 -57 -74 -70 508 292 -221 15 112 -143 63 -73 -248 329 291 -28
4651 -28 -76 419 -82 1 172 -250 -38 71 179 -8 -314 233 -339 209 -39 55 44 180 -62 -201 -137 89
4673 89 -263 -186 -27 -338 -206 154 -87 -307 36 -183 -71 323 -227 -462 -9 34 -45 -177 -18 -260 -247 33
4695 33 -434 -107 -21 -59 -130 70 -100 -237 197 -344 69 285 233 221 101 -115 -183 171 41 -29 14 -118 -58
4718 -58 141 227 87 4 -5 157 -62 171 -35 96 192 -5 27 207 79 -103 -37 83 -193 -20 56 -77 -44
4741 -44 285 181 -162 262 326 101 326 150 -70 -23 117 -263 99 209 -162 -53 227 -168 21 35 98 -7
4763 -7 288 282 -190 -241 -165 -307 47 -87 -119 -176 358 -134 -208 125 134 -111 90 -146 -273 62 -46 -88 -54 -111 297
4788 297 21 26 -208 -95 -180 -23 -124 138 73 53 452 284 -16 22 -15 -53 9 -167 -62 57 245 294 -6
4811 -6 212 43 39 107 157 -53 463 189 155 170 404 -162 45 -34 -35 69 10 -200 125 -71 38 12 -116 -14
4835 -14 -54 258 106 43 -25 130 -158 150 -50 -185 136 202 205 -14 -66 -67 -98 66 -131 -260 -4 23 -45 187
4859 187 -47 -219 -176 150 109 -292 -81 -122 -6 -185 91 -129 -111 -214 86 -45 -11 -47 -27 -82 -335 -102 -63
4882 -63 39 -78 -168 72 173 -156 -92 -21 7 -47 -90 270 -95 192 -102 -42 -106 142 -2 330 122 262 34
4905 34 137 -66 141 351 270 234 134 110 246 12 -230 233 255 92 61 -97 50 -100 -94 -52 227 213 37
4928 37 -25 29 -44 -142 9 76 -200 -205 15 63 -30 21 62 -284 -139 57 -84 -139 -107 -185 207 -381 19 -99 -189
4953 -189 -203 -35 111 -267 -302 -61 -295 -73 -207 -188 -282 37 143 142 58 -358 -26 21 112 12 162 98 91 -129
4977 -129 -29 65 -41 203 152 60 200 208 157 268 -105 32 100 12 355 334 -13 155 -68 272 56 -236 262
5000 262 61 -22 -100 101 66 147 90 -148 192 -23 51 89 -44 -299 65 98 65 -191 -82 53 -53 20 142
5023 142 -52 27 27 -136 -232 97 -7 -394 97 7 -17 397 -230 -64 -30 -47 -107 29 -52 23 -354 93 -74 -146
5047 -146 56 -142 -13 16 -5 -70 34 154 56 247 -4 -191 -137 -91 -68 -172 255 -128 227 -185 84 -124
5069 -124 2 28 150 16 8 73 8 -53 -62 172 104 39 106 131 20 23 2 -77 -199 77 229 38 20 56 269 350
5095 350 128 -180 58 359 -132 202 158 46 36 41 122 -162 89 76 -49 172 99 -134 -432 131 -68 -105 334
5118 334 -41 -12 257 -11 -335 107 -80 -189 -97 -395 -168 42 16 -173 -135 65 -43 -155 129 36 -29 21
5140 21 -191 -312 -310 -157 -8 124 9 -107 -112 79 57 -293 -106 -184 144 415 -38 -177 -99 87 -35 -40 -14 -140
5164 -140 485 59 -295 113 126 164 162 41 -269 -186 511 335 43 109 170 39 327 296 -196 73 23 122 55 29
5188 29 -116 -52 329 -37 -95 154 100 5 288 -177 -126 -79 4 -35 -77 184 -66 -122 182 -224 -27 77 -22 -202
5212 -202 -162 86 -90 252 -184 -96 -243 221 -161 -304 -29 -3 -292 -128 -190 -323 91 7 102 -107 -119 -183 -26
5235 -26 -111 -211 -119 -235 148 -216 -71 -395 1 130 -42 190 79 -18 -291 -189 -15 -51 186 263 185 0
5257 0 66 -134 -274 -211 -18 46 85 44 -283 262 -8 -40 -58 113 -122 165 170 39 -196 192 -78 -66 36 -65
5281 -65 -342 -73 216 43 86 -192 -121 -120 261 -244 -129 29 -138 -74 -9 -190 -274 180 -126 -128 -69 -109 -243 -66
5305 -66 -63 -286 -144 -98 -30 -195 106 -122 -252 -101 -50 -225 -183 187 -337 148 7 146 -58 -84 21 -273 177
5328 177 -174 13 -29 -181 -153 52 13 -41 205 -112 77 150 51 -228 -156 70 -105 7 280 -15 53 141 229
5351 229 -59 330 92 60 -22 135 235 104 271 -95 -137 58 269 210 106 164 173 335 192 -219 -412 48
5373 48 -140 151 299 36 -173 444 -245 -154 199 -43 145 85 -195 6 -204 11 -143 -209 65 -4 13 7 -80
5396 -80 -355 -297 0 -120 -37 -200 14 -111 -15 -208 87 9 -29 -79 -33 -51 0 -214 91 -102 -148 -1 65 -274
5420 -274 10 -104 -120 -317 -30 71 -159 202 124 296 318 104 198 -194 -250 70 -70 117 9 43 -13 11 270
5443 270 259 187 113 62 -77 -26 -163 -88 170 -123 246 91 113 12 117 39 -49 -11 204 -286 67 196 94
5466 94 159 -85 -37 -84 15 128 -221 -194 71 285 27 -50 -257 40 322 -68 -144 -277 -167 -85 11 77 167 -283
5490 -283 -315 -6 -267 -57 111 -25 -89 -157 -8 -188 -183 -138 137 -49 -58 -77 -83 -173 -155 -284 44 50 -134 -70 148
5515 148 -81 -45 37 -131 36 142 -165 -70 -28 -203 -18 -152 -71 -101 39 41 118 32 380 328 98 -21 377 175
5539 175 -246 -45 256 -37 -30 162 100 -73 -79 -191 -94 -10 -23 97 23 -41 118 -152 -60 -10 279 53 -93 3
5563 3 -150 225 44 -5 62 73 9 351 -13 -76 -291 -188 145 -131 -148 -169 68 -184 -110 -264 -154 -10 88 -87
5587 -87 14 21 3 -30 134 122 -208 209 213 -39 80 166 -104 -381 -29 -20 10 20 285 -264 200 -22 -305 145
5611 145 164 -119 -99 214 -214 -65 37 92 121 312 -121 104 290 158 64 94 202 -59 134 146 116 11 356
5634 356 -309 159 170 71 47 -73 -114 64 52 -161 -155 -174 120 -82 -13 183 8 -260 -152 -264 -74 133 130 25
5658 25 17 -129 -423 206 -34 -125 -120 -64 -95 -73 181 60 13 122 133 -45 -20 -186 31 -52 120 -30 -64 22 -213
5683 -213 325 68 218 -93 20 -27 -69 -15 75 -68 88 -207 -26 53 191 108 110 24 116 54 85 -268 343 212
5707 212 -74 -216 185 -53 -50 150 114 230 404 12 -152 72 -59 13 224 105 -212 81 657 132 181 110
5729 110 135 -24 21 162 -98 -5 93 -19 4 -47 115 88 -206 -151 -326 -31 14 102 -50 259 -66 95 55 23
5753 23 77 -19 -89 -53 -157 -230 147 237 -91 -189 -135 -7 130 179 -63 -172 -9 -24 -167 -108 -118 129 41 46 -22 -229
5779 -229 179 167 51 -182 -42 170 160 -154 -126 -8 198 317 -41 406 -19 274 57 171 -124 114 130
5800 130 -108 -28 11 -138 -118 247 52 57 100 -45 467 66 -35 -61 89 49 -57 72 201 53 56 294 -105
5823 -105 42 46 -186 -167 -137 13 86 -24 69 -97 237 266 -164 312 -280 -55 -135 44 -52 -62 180 -285 -232 -137
5847 -137 -282 -79 -132 -57 -238 101 -23 -325 -283 -190 -355 119 172 95 -92 27 -84 -63 -177 156 29 133
5869 133 -101 83 -88 -111 -133 320 89 -178 177 -24 93 -95 3 -116 -193 250 45 88 9 -66 -63 -35 125
5892 125 -65 83 314 -42 173 40 -172 11 -148 72 17 308 273 -64 41 46 83 201 119 80 -232 205
5914 205 310 -136 1 -168 -221 -70 -282 -7 241 94 -193 74 18 33 42 -51 -219 -226 -178 77 -209 -203 -50 93
5938 93 -144 -51 -203 -137 -26 100 208 -95 -276 14 6 135 110 131 79 -25 35 -113 -163 -312 192 206 104 -1
5962 -1 -75 101 166 -226 -124 -52 -243 -6 91 -189 20 91 106 -46 -27 36 205 16 155 -108 177 95 243 226
5986 226 -7 219 -72 -205 -161 264 6 -12 -33 137 181 -82 38 176 -60 -112 86 17 -23 -90 126 114 -220
6009 -220 -3 -97 38 188 -247 -19 -47 89 -201 -117 -106 -75 12 70 221 -4 73 -206 -207 -110 -183 -293 131 -128
6033 -128 28 -159 9 -59 -18 -72 18 163 81 -125 129 -271 -220 -122 115 -186 -212 101 -134 -114 -8 24 128
6056 128 60 140 302 369 -153 22 72 5 -73 80 111 180 26 222 -123 59 106 -160 -13 70 -45 -5 268 -20
6080 -20 -105 -76 -17 -119 -137 272 -66 37 31 -174 74 117 51 -298 -267 418 -105 22 -193 6 -129 -48 -54 -21 -91
6105 -91 -206 -95 157 -285 -317 -399 161 -48 -70 -62 -450 124 69 -95 -28 -230 203 -10 -44 172 -58 102 44
6128 44 -191 -350 -182 -190 95 131 26 -63 125 -124 18 -71 -236 213 228 -75 -45 -86 -85 -51 -100 -98 -163 59 218
6153 218 -159 -116 114 -110 12 147 57 -25 99 416 76 39 -269 31 29 -117 53 81 126 112 -19 291 204
6176 204 146 143 -100 66 58 159 -149 -89 -51 -39 112 382 26 -207 -18 -245 6 -81 -223 136 -110 91 -152
6199 -152 -245 -61 -13 7 -261 -175 -109 78 -323 38 135 -210 -277 -306 -137 -294 168 153 336 61 -194 -18 -109
6222 -109 132 -366 -120 -135 6 -123 87 -2 -378 11 -163 -170 48 77 -209 50 -268 -179 173 118 -161 75
6244 75 364 -204 -140 -11 -15 -294 254 14 -97 143 -250 -98 118 19 -271 -208 52 23 1 104 278 166 97
6267 97 182 227 89 237 -37 25 -33 4 132 74 20 -46 -112 -106 74 44 -129 -44 3 182 20 17 82 93 -134 -234
6293 -234 -59 -63 -243 146 47 -252 -166 -150 74 -92 -75 -122 -130 -168 -70 -137 -1 -339 12 125 -171 71 83 24 48
6318 48 33 -252 68 -73 65 -38 212 -247 162 302 -95 -166 121 -70 1 -46 -89 -98 66 230 -99 -217 163
6341 163 -154 99 175 -43 426 92 46 -203 228 55 95 -31 100 -82 245 77 -253 -107 -58 15 109 149
6363 149 253 -1 105 135 11 153 -127 -89 278 71 45 -41 163 -86 93 79 -72 -11 108 -408 235 101
6385 101 192 114 3 -163 -167 69 -225 -176 124 -87 -292 117 -196 -110 174 -115 -178 -243 -17 106 125 290 -295
6408 -295 -157 -90 -194 63 -20 15 -11 -323 102 -259 78 82 41 -42 159 -144 262 143 -71 -50 206 391 -129
6431 -129 71 69 175 -117 440 -27 -103 49 141 -202 -54 -327 169 -50 -191 167 151 -63 -68 22 -67 -40 130
6454 130 124 56 -118 -10 228 97 -9 447 -474 -150 -212 -60 -68 -159 111 26 0 -146 73 -166 -57 6 21 144
6478 144 -45 -215 71 68 8 176 87 -106 -48 -216 -81 -173 -16 -244 -274 -262 -143 -110 108 -121 -91 -80 22 0
6502 0 21 63 -72 182 -115 -106 -204 141 -305 123 -301 28 2 258 225 153 448 -4 75 202 340 -188 120 85
6526 85 72 -35 292 258 79 233 -143 -21 224 5 -52 128 -209 177 64 56 -158 93 256 163 151 57 244
6549 244 -173 -153 82 9 -141 -158 -185 -32 137 -144 71 -265 -153 6 -220 -119 9 26 -174 189 -30 240
6571 240 52 -164 -10 -82 -166 -28 20 30 51 -30 34 -221 17 -33 -159 -220 142 31 117 68 193 96 -227 -24
6595 -24 -149 -150 128 -12 148 -150 286 -178 5 2 -233 389 62 -69 -189 160 -131 15 -219 259 102 -21
6617 -21 244 240 9 -139 30 300 86 -290 99 248 205 127 -64 -121 -93 170 -44 -70 -67 19 264 94 -97 -160
6641 -160 -77 164 83 64 20 20 -38 -116 5 -90 -88 281 142 88 -85 -176 405 -14 -14 3 188 46 296 -19 96
6666 96 -137 -66 -164 -274 68 -82 -120 121 27 -10 -195 -301 191 -111 9 -98 -38 -183 120 83 45 142 -260
6689 -260 -78 120 -76 -16 140 -42 -184 146 274 148 197 109 -153 -211 -25 290 360 -26 217 -18 -33 -170
6711 -170 -223 69 -4 203 -165 186 -135 29 -163 -99 -175 -75 65 -7 0 137 11 -14 -115 -3 -67 -35 -3 6
6735 6 -147 -299 115 -103 186 -177 291 -72 217 -277 -130 76 -51 55 -63 118 -68 -92 437 -70 -235
6756 -235 -34 107 -220 -421 -263 92 102 105 -36 -399 -267 83 -46 29 61 -249 -53 -65 -119 -225 252 25
6778 25 -89 -235 -55 75 -55 5 -286 -2 39 -131 -400 115 -123 127 177 92 184 168 -38 234 6 110
6800 110 -5 116 -43 51 164 9 -22 61 146 -179 161 -114 54 1 -45 -57 -23 -63 -38 116 15 118 -236
6823 -236 116 9 237 75 76 70 84 -124 -142 90 137 -154 -110 -81 185 -65 -179 -344 139 171 -97 -6 63 -103
6847 -103 -13 -122 49 -160 228 333 233 39 -32 151 -222 291 -218 101 193 -32 -80 4 25 -111 -85 84
6869 84 17 -24 109 242 -200 -17 75 -175 124 292 -77 -52 300 -74 101 -69 9 185 168 -108 -67 91 32
6892 32 -57 368 -422 171 69 133 12 53 300 -1 -24 179 65 -239 142 103 -139 239 -95 -27 259 -26
6914 -26 94 184 -77 -107 40 13 -56 -98 -49 -150 -86 44 -42 -20 27 12 -14 -74 -85 130 175 -166 71 8 -11 -222
6940 -222 253 23 -154 119 225 -70 -125 281 73 -216 -141 169 -121 -61 -66 24 -209 -108 -198 -66 132 272
6962 272 241 -20 22 5 -75 98 -126 -122 -90 70 27 69 86 -187 136 72 292 114 89 93 -152 54 258 95 -154
6987 -154 0 -199 -213 -7 219 174 43 -38 -139 114 -37 -29 -100 -83 -70 26 -29 -54 -196 337 176 162 187 114 -43
7012 -43 -57 59 35 114 -305 86 -113 -231 -274 -29 -141 -114 -5 -116 52 -63 135 -25 122 -274 -89 -2
7034 -2 240 11 85 -169 128 -58 100 140 -61 -133 125 -74 9 -23 -106 127 -185 213 239 346 173 187 21
7057 21 87 -23 38 24 18 128 280 93 -175 -61 123 27 220 53 49 194 28 217 -106 356 106 114 66 34
7081 34 35 -30 54 44 -136 -52 -129 -74 96 -25 -53 -370 -130 39 -93 198 -100 -55 -244 -57 -35 51 -1 -198 104
7106 104 -84 99 -251 -17 -243 -134 -133 71 137 175 -16 1 71 97 -62 -51 -52 211 328 -122 -36 76 24 214
7130 214 67 -200 127 76 159 -68 -25 -335 12 -81 -66 84 22 37 -168 -24 258 4 -176 44 -50 230 237
7153 237 95 -47 257 -56 121 183 43 -219 52 -90 103 -177 -64 183 224 -32 -81 244 -256 115 -14
7174 -14 -182 129 -141 -107 33 53 238 89 -120 26 133 -35 -170 -43 -269 107 98 12 5 -136 -129 55 -142
7197 -142 17 156 -92 -179 -70 -41 -120 142 -317 -86 -118 -129 -69 0 -110 4 66 196 29 -32 236 -68 -78
7220 -78 29 -158 -58 -59 53 -103 28 -7 -150 -159 -135 -164 -141 -118 -12 -16 197 12 -39 63 -69 185 121 69 -68
7245 -68 -6 325 182 -99 272 150 -8 70 -124 72 -39 117 176 -50 68 -95 208 347 108 14 153 -294
7267 -294 61 -58 76 121 -43 -108 -92 71 -135 -165 -341 317 19 -65 -126 194 124 -55 -117 -309 -86 -161 207
7290 207 120 213 -308 -166 4 21 -211 -149 -369 -211 -29 25 236 177 376 82 61 -232 103 -18 196 122 284
7313 284 91 -96 118 105 262 46 16 58 350 111 92 144 378 222 77 -282 363 156 -217 169 33 -87
7335 -87 79 112 108 30 60 279 75 47 -87 -111 -132 125 -83 34 -200 234 -19 -165 -103 108 134 0 -112 -24
7359 -24 -21 -26 -68 -49 -36 -107 12 -38 -68 87 50 130 -42 -396 95 -55 30 -160 77 -157 -42 17 99 -181 91
7384 91 -118 -23 273 102 181 -113 -88 66 -60 -45 -129 47 124 71 -114 -70 -151 -121 236 28 -250 133 166 -69
7408 -69 -53 90 86 99 -141 -48 -134 -185 177 100 -180 55 133 -118 426 -2 24 13 167 -146 -261 158 185 73
7432 73 23 79 27 438 -74 -118 -45 -217 95 -89 -98 99 129 152 144 206 -80 28 -160 15 295 105 -124 -441
7456 -441 -16 119 234 -61 100 -44 -164 65 -252 186 177 -194 -29 -41 263 69 174 -28 -160 -120 -126 -227
7478 -227 -293 103 -14 -139 167 -77 -78 96 -38 153 -12 216 -30 199 75 107 223 11 -183 -149 151 -187
7500 -187 -96 -21 169 190 -224 169 -287 218 179 94 105 180 275 -140 -88 52 -45 -12 -109 -45 -54 -193 -127 92 -3 -55
7526 -55 92 26 -147 -145 92 5 113 173 -139 -82 158 -119 -138 -153 89 -82 48 196 -42 -84 -21 47 92 -41
7550 -41 -141 111 161 -31 -277 66 -147 59 19 -283 4 -95 -44 7 -292 197 -90 -290 12 117 -91 44
7572 44 97 20 187 -317 -109 -10 -44 -113 -10 172 18 -411 -13 -13 -118 116 -42 -124 23 -18 -183 11 -318
7595 -318 -25 78 -10 -99 -69 -151 78 -162 157 187 -87 98 103 156 91 -110 143 53 27 46 7 -35 131 -73 129
7620 129 -304 19 204 -75 -124 99 180 371 -30 -160 -22 28 211 -37 -57 119 -396 -117 -131 -120 57 62 -22
7643 -22 -136 -56 -159 147 14 158 -352 -28 308 270 -234 -231 -124 -93 -181 -5 121 -19 -167 -109 -158 -98 93
7666 93 61 -108 91 103 -50 133 138 174 183 -241 -27 32 55 -19 -11 212 185 -291 128 -47 102 -267 -161 30 -91
7691 -91 26 198 90 -65 -116 96 -25 76 -247 5 13 14 109 -224 -67 -34 137 -130 -113 98 82 178 113 17
7715 17 193 -34 93 179 207 42 -81 -143 -61 -178 58 -270 130 -149 -114 109 -171 88 96 12 -38 -145 45
7738 45 -13 -121 -105 -92 -122 -274 -192 -22 108 46 97 181 -68 -25 -28 -196 34 199 -67 45 76 158 -143 31 34
7763 34 98 54 5 -30 -121 59 -192 148 -113 -121 -96 236 -7 125 -10 305 0 -93 -109 -104 -11 0 21 225 -45
7788 -45 20 -46 89 61 53 -192 -12 134 -174 -87 90 265 -11 333 -236 -47 11 203 -166 87 135 -316 -28
7811 -28 -13 122 153 68 -139 42 77 -42 -334 -48 89 -180 160 -242 -92 103 60 -114 214 91 -11 -199
7833 -199 -148 105 41 -23 -113 42 -133 -158 -168 99 139 141 -29 -178 -78 -36 -43 -21 -79 21 68 169 -307 -227 237
7858 237 24 -195 310 -4 -284 -2 234 -207 -136 70 36 -87 -24 53 -49 34 -3 213 13 29 -244 -93
7880 -93 -3 -98 -66 -9 -92 49 -126 -2 -127 23 -49 152 -114 124 143 -24 11 3 -83 -57 75 -373 -75 225
7904 225 -319 -25 -26 16 -66 44 -240 117 -120 -103 103 -90 -13 -6 98 113 -267 -205 -45 74 93 -34 150 -316
7928 -316 17 -132 -320 99 -242 -91 194 1 20 24 -187 1 -117 11 9 -168 -67 -315 218 -157 -161 31
7950 31 -1 -130 -5 -9 37 -75 68 296 -39 237 32 -117 -184 -18 -178 -1 143 -260 -63 108 342 197
7972 197 51 -124 80 125 -14 90 89 -97 -82 2 145 106 8 68 -16 -126 98 -162 -42 7 -239 -46 90
7995 90 93 -99 -191 -52 -58 -98 -199 -95 -291 311 -36 -62 332 315 -196 8 -119 -46 -116 -23 -155 15 94 -244
8019 -244 -41 -40 143 -226 -107 379 -166 22 -186 -71 -3 67 -93 -74 115 -184 -246 -70 -61 113 130 89 -258
8042 -258 14 25 20 382 -65 -131 85 -18 -273 120 -80 -194 102 -73 85 167 163 192 127 -71 -4 -158 157
8065 157 296 50 152 -87 -8 -83 39 90 18 -45 -94 98 -31 15 177 -54 -42 78 -230 175 -44 -137 327
8088 327 70 68 -215 -168 -304 209 56 7 -193 53 -243 75 -169 25 45 42 -35 -284 -124 -135 14 -67 -193
8111 -193 -109 -22 -34 -311 66 143 88 139 -194 43 -36 -74 114 -20 290 -181 120 -203 9 10 25 225 193 28
8135 28 101 -25 42 203 356 205 26 104 125 91 188 193 -11 289 -101 110 -96 87 -14 111 121 53 -41 -169
8159 -169 -21 -192 -255 212 26 -54 31 195 15 79 40 -155 41 125 137 -62 -149 68 186 69 -156 -48 -139
8182 -139 29 -2 -90 -181 -211 -98 -114 217 -272
8191b72
##END NTUPLES=NMR FID
##END=
