##TITLE=1H_Ser 6-5-i'
 CDCl3, 8 sc, 
 6.08.2021
##JCAMPDX= 6.0         $$ Bruker NMR JCAMP-DX V2.0
##DATA TYPE= NMR FID
##DATA CLASS= NTUPLES
##ORIGIN= UXNMR, Bruker Analytische Messtechnik GmbH
##OWNER= root
$$ XWIN-NMR		Version 3.5
$$ Fri Aug  6 13:25:38 2021 Russian Standard Time (UT+4h)  she@DPX200
##.OBSERVE FREQUENCY= 200.131506
##.OBSERVE NUCLEUS= ^1H
##.DELAY= (6, 6)
##.ACQUISITION MODE= SIMULTANEOUS
##.ACQUISITION SCHEME= undefined
##.AVERAGES= 8
##.DIGITISER RES= 18
##SPECTROMETER/DATA SYSTEM= spect
##.PULSE SEQUENCE= zg30
##.SOLVENT NAME= CDCl3
##.SHIFT REFERENCE= (INTERNAL, CDCl3, 0, 15.7039)
##AUDIT TRAIL= $$ (NUMBER, WHEN, WHO, WHERE, WHAT)
$$ ##TITLE= Audit trail, XWIN-NMR		Version 3.5
$$ ##JCAMPDX= 5.01
$$ ##ORIGIN= Bruker BioSpin GmbH
$$ ##OWNER= she
$$ F:/spectra/data/she/nmr/H-F/1/audita.txt
$$ ##AUDIT TRAIL=  $$ (NUMBER, WHEN, WHO, WHERE, WHAT)
(   1,<2021-08-06 13:24:09.20 +0400>,<she>,<DPX200>,
      <created by zg, POWCHK disabled, PULCHK disabled
       configuration hash MD5:
       00 E9 B6 7A A2 85 ED C7 34 08 36 98 17 FE 4E 26
       data hash MD5: 16K
       51 4B 5C AE 6A 14 8D 2A D5 0C 30 6D 71 CE CA 6B>)
$$ ##END=
$$ 
$$ hash MD5
$$ D6 95 D7 6D 1D D1 6F 37 3D 4B 50 9C 54 CC 8A 60
##$RELAX= 
##$RELAX= 
##$RELAX= 
##$RELAX= 
##$RELAX= 
##$RELAX= 
$$ Bruker specific parameters
$$ --------------------------
##$DU= <F:/spectra>
##$EXPNO= 1
##$NAME= <H-F>
##$PROCNO= 1
##$TYPE= <nmr>
##$USER= <she>
##$AMP= (0..31)
100 100 100 100 100 100 100 100 100 100 100 100 100 100 100 100 100 100 
100 100 100 100 100 100 100 100 100 100 100 100 100 100 
##$AQSEQ= 0
##$AQ_mod= 1
##$AUNM= <au_zg>
##$AUTOPOS= <>
##$BF1= 200.13
##$BF2= 200.13
##$BF3= 200.13
##$BF4= 200.13
##$BF5= 200.13
##$BF6= 200.13
##$BF7= 200.13
##$BF8= 200.13
##$BYTORDA= 1
##$CFDGTYP= 0
##$CFRGTYP= 5
##$CHEMSTR= <none>
##$CNST= (0..31)
1 1 145 1 1 1 1 1 1 1 1 1 1 1 1 1 1 1 1 1 1 1 1 1 1 1 1 1 1 1 1 1 
##$CPDPRG= <>
##$CPDPRG1= <>
##$CPDPRG2= <>
##$CPDPRG3= <>
##$CPDPRG4= <mlev>
##$CPDPRG5= <mlev>
##$CPDPRG6= <mlev>
##$CPDPRG7= <mlev>
##$CPDPRG8= <mlev>
##$CPDPRGB= <>
##$CPDPRGT= <>
##$D= (0..31)
0 1.2 0 0 0 0 0 0 0 0.06 0 0.03 0 0 0 0 0.0002 0 0 0 0 0 0 0 0 0 0 0 0 
0 0 0 
##$DATE= 1628241848
##$DBL= (0..7)
120 120 120 120 120 120 120 120 
##$DBP= (0..7)
150 150 150 150 150 150 150 150 
##$DBP07= 0
##$DBPNAM0= <>
##$DBPNAM1= <>
##$DBPNAM2= <>
##$DBPNAM3= <>
##$DBPNAM4= <>
##$DBPNAM5= <>
##$DBPNAM6= <>
##$DBPNAM7= <>
##$DBPOAL= (0..7)
0.5 0.5 0.5 0.5 0.5 0.5 0.5 0.5 
##$DBPOFFS= (0..7)
0 0 0 0 0 0 0 0 
##$DE= 6
##$DECBNUC= <off>
##$DECIM= 32
##$DECNUC= <off>
##$DECSTAT= 4
##$DIGMOD= 1
##$DIGTYP= 9
##$DL= (0..7)
0 120 120 120 120 120 120 120 
##$DP= (0..7)
150 150 150 150 150 150 150 150 
##$DP07= 0
##$DPNAME0= <>
##$DPNAME1= <>
##$DPNAME2= <>
##$DPNAME3= <>
##$DPNAME4= <>
##$DPNAME5= <>
##$DPNAME6= <>
##$DPNAME7= <>
##$DPOAL= (0..7)
0.5 0.5 0.5 0.5 0.5 0.5 0.5 0.5 
##$DPOFFS= (0..7)
0 0 0 0 0 0 0 0 
##$DQDMODE= 0
##$DR= 18
##$DS= 0
##$DSLIST= <SSSSSSSSSSSSSSS>
$$ [...]
##$SUBNAM2= <"">
##$SUBNAM3= <"">
##$SUBNAM4= <"">
##$SUBNAM5= <"">
##$SUBNAM6= <"">
##$SUBNAM7= <"">
##$SUBNAM8= <"">
##$SUBNAM9= <"">
##$SW= 20.0188882624521
##$SWIBOX= (0..15)
0 0 2 0 0 0 0 0 0 0 0 0 0 0 0 0 
##$SW_h= 4006.41025641026
##$TD= 16384
##$TD0= 1
##$TE= 0
##$TE2= 300
##$TE3= 300
##$TEG= 300
##$TL= (0..7)
0 120 120 120 120 120 120 120 
##$TP= (0..7)
150 150 150 150 150 150 150 150 
##$TP07= 0
##$TPNAME0= <>
##$TPNAME1= <>
##$TPNAME2= <>
##$TPNAME3= <>
##$TPNAME4= <>
##$TPNAME5= <>
##$TPNAME6= <>
##$TPNAME7= <>
##$TPOAL= (0..7)
0.5 0.5 0.5 0.5 0.5 0.5 0.5 0.5 
##$TPOFFS= (0..7)
0 0 0 0 0 0 0 0 
##$TUNHIN= 0
##$TUNHOUT= 0
##$TUNXOUT= 0
##$USERA1= <user>
##$USERA2= <user>
##$USERA3= <user>
##$USERA4= <user>
##$USERA5= <user>
##$V9= 5
##$VALIST= <valist>
##$VCLIST= <CCCCCCCCCCCCCCC>
##$VD= 0
##$VDLIST= <DDDDDDDDDDDDDDD>
##$VPLIST= <PPPPPPPPPPPPPPP>
##$VTLIST= <TTTTTTTTTTTTTTT>
##$WBST= 1024
##$WBSW= 4
##$XGAIN= (0..3)
0 0 0 0 
##$XL= 0
##$YL= 0
##$YMAX_a= 198413
##$YMIN_a= -218762
##$ZGOPTNS= <>
##$ZL1= 120
##$ZL2= 120
##$ZL3= 120
##$ZL4= 120
##$ABSF1= 10
##$ABSF2= 0
##$ABSG= 5
##$ABSL= 3
##$ALPHA= 0
##$AQORDER= 0
##$ASSFAC= 0
##$ASSFACI= 0
##$ASSFACX= 0
##$ASSWID= 0
##$AUNMP= <proc_1d>
##$AZFE= 0.1
##$AZFW= 0.1
##$BCFW= 1
##$BC_mod= 2
##$BYTORDP= 1
##$COROFFS= 0
##$CY= 11.3945322036743
##$DATMOD= 1
##$DC= 2
##$DFILT= <>
##$DTYPP= 0
##$F1P= 2.36226072786647
##$F2P= -0.459571619588291
##$FCOR= 0.5
##$FTSIZE= 0
##$FT_mod= 4
##$GAMMA= 1
##$GB= 0.15
##$INTBC= 1
##$INTSCL= 1
##$ISEN= 128
##$LB= 0.24
##$LEV0= 0
##$LPBIN= 0
##$MAXI= 10000
##$MC2= 0
##$MEAN= 0
##$ME_mod= 0
##$MI= 1.114404
##$NCOEF= 0
##$NC_proc= 0
##$NLEV= 6
##$NOISF1= 3.799351
##$NOISF2= 2.8
##$NSP= 1
##$NTH_PI= 0
##$NZP= 0
##$OFFSET= 15.70392
##$PC= 1
##$PHC0= -13358.82
##$PHC1= 16.40099
##$PH_mod= 1
##$PKNL= yes
##$PPARMOD= 0
##$PSCAL= 0
##$PSIGN= 0
##$REVERSE= no
##$SF= 200.130013532006
##$SI= 16384
##$SIGF1= 3
##$SIGF2= 2
##$SINO= 400
##$SIOLD= 16384
##$SREGLST= <1H.CDCl3>
##$SSB= 0
##$STSI= 0
##$STSR= 0
##$SW_p= 3612.71676300578
##$SYMM= 0
##$S_DEV= 0
##$TDeff= 0
##$TDoff= 0
##$TI= <>
##$TILT= no
##$TM1= 0
##$TM2= 0
##$TOPLEV= 0
##$USERP1= <user>
##$USERP2= <user>
##$USERP3= <user>
##$USERP4= <user>
##$USERP5= <user>
##$WDW= 1
##$XDIM= 8192
##$YMAX_p= 0
##$YMIN_p= 0
$$ End of Bruker specific parameters
$$ ---------------------------------
##NTUPLES= NMR FID
##VAR_NAME=  TIME,          FID/REAL,        FID/IMAG
##SYMBOL=    X,             R,               I
##VAR_TYPE=  INDEPENDENT,   DEPENDENT,       DEPENDENT
##VAR_FORM=  AFFN,          ASDF,            ASDF
##VAR_DIM=   8192,          8192,            8192
##UNITS=     SECONDS,       ARBITRARY UNITS, ARBITRARY UNITS
##FACTOR=    0.0002496,     1,               1
##FIRST=     0,             0,               0
##LAST=      2.0444736,     0,               0
##MIN=       0,             -218762,         0
##MAX=       2.0444736,     198413,          0
$$ Real data points
##PAGE= N=1
##DATA TABLE= (X++(R..R)), XYDATA
$$ [...]
1942D12P6O51n68N7O19m72k02N59R6o13K95L10l96k61N25j56p52Q38J49p02L35
$$ 412 488 1139 571 628 1247 775 573 1132 1228 615 910 1220 824 563 1088 932 180 1018 1167 465 800
1963H00J36q78L02L70m22o08R91j20j053N90M0m48l7O34r38n39P04q4o10P23P9
$$ 800 936 58 360 730 308 -300 691 571 -482 108 148 -300 -337 297 -641 -1180 -476 -560 -1170 -447 -368
1984c68q13K54O45r10k28J029n77l28N58K84j164N77O40p60L0P23m81q9O84j40
$$ -368 -1181 -927 -282 -1192 -1420 -391 -968 -1296 -738 -454 -1618 -1041 -401 -1161 -1131 -408 -889 -978 -294 -434
2004d34n56Q03J45q34M06O68n65k30R34R3o81O34N82p31L02R05o32m51J049m54
$$ -434 -990 -187 -42 -876 -470 198 -367 -597 337 430 -251 383 965 234 536 1441 809 358 1407 953
2024I53m96N17P03j099L65Q52n98n4P05l81o60Q02K20p83L47N31j037K02O65k95
$$ 953 457 974 1677 578 943 1795 1197 1143 1848 1467 807 1609 1829 1046 1393 1924 887 1089 1754 1459
2044A459q24P66q6q40J08Q04r50j92J026q21o55R21O1j136M13O50j168K4P90q41
$$ 1459 635 1401 1315 475 583 1387 437 245 1271 450 -205 716 777 -359 54 704 -464 -440 350 -491
2064d91n95R15k92j177R57L93j575N54J036j418j41J049o98n01N49K84j196P05
$$ -491 -1086 -171 -463 -1640 -683 -290 -1865 -1311 -275 -1693 -1834 -785 -1483 -1984 -1435 -1151 -2347 -1642
2082a642M41p34K8R87n06p54R88K44j210R71L54r00J20Q88k24p61J016K02p12
$$ -1642 -1201 -1935 -1907 -920 -1426 -2180 -1192 -948 -2158 -1187 -833 -1733 -1613 -725 -949 -1710 -694 -492 -1204
2101a204P63Q12j269k0R95o07l22J483j90r02N50R14j115J3J251q76k35J528k05
$$ -1204 -441 371 -898 -918 77 -530 -852 631 441 -461 89 1003 -112 -99 1152 276 41 1569 1364
2120A364j128R80M48j190K03R67p55n38J383n88q01O64P66j361K47J284j053n85
$$ 1364 236 1216 1664 474 677 1644 889 351 1734 1146 345 1009 1775 414 661 1945 892 307
2138C07J116l4j501J234M92j668J03J508j415m59J643j128p75R08K84j346O77
$$ 307 1423 1389 -112 1122 1614 -54 49 1557 142 -317 1326 198 -577 331 615 -731 -54
2155e4Q36j409j22J123n03q58P72K29r50K70P16r11l00J318r03j019J281L73j701
$$ -54 782 -627 -749 374 -129 -987 -215 14 -936 -666 50 -861 -1161 157 -746 -1765 -484 -111 -1812
2174a812Q84Q23r19J18J083p40r87J495k57j371J590P49j420Q2J456q94q76J507
$$ -1812 -928 -105 -1024 -906 177 -563 -1550 -55 -312 -1683 -93 656 -764 -682 774 -120 -996 511
2192E11Q8j182R88P47j497K37J102m62q09J407n2j275J190N97j112k20J690j119
$$ 511 599 -583 405 1152 -345 -108 994 532 -277 1130 1078 -197 993 1590 478 258 1948 829
2210H29o63J590m15j133Q99N39j202J65J028m91r77J327o83q98Q55O05j506M78
$$ 829 166 1756 1341 208 1107 1646 444 609 1637 1146 169 1496 813 -85 770 1375 -131 347
2228C47R52j125m54J427n45j228J200K01j660P35Q96j517n74J865r92j044J285
$$ 347 1299 174 -280 1147 602 -626 574 775 -885 -150 746 -771 -1345 520 -472 -1516 -231
2245b31K26j480M48R73j479k55J400l90j079J084m5j390R81Q28j411q6J200m54
$$ -231 -5 -1485 -1037 -64 -1543 -1798 -398 -788 -1867 -783 -828 -2218 -1237 -409 -1820 -1906 -706 -1160
2263a160p95J026m9j157R38R45j149l52J337o39m17Q59J12q17P67P21j300R5J444
$$ -1160 -1955 -929 -978 -2135 -1197 -252 -1401 -1753 -416 -1055 -1472 -613 -501 -1318 -551 170 -1130 -1035 409
2282D09n81m50Q31N25j335P80R78j476M9J412p36l83J160O8j192R60P80j493J64
$$ 409 -172 -622 209 734 -601 179 1157 -319 -270 1142 406 23 1183 1251 59 1019 1799 306 470
2301D70J456q08n20Q20n4j127Q97Q15j216p3J146q39q71J337j63j356J258M27
$$ 470 1926 1118 598 1418 1364 237 1134 1949 733 660 1806 967 96 1433 1270 -86 1172 1599
2319A599j545M00J429j500j26O66l50j067J109L07j269M70R53j315k06J347q90
$$ 1599 54 454 1883 383 257 923 573 -494 615 922 -347 123 1076 -239 -445 902 12
2336A2q07J088N2j504N11R01r82k76J080o21j038J596o1j023K57N76o41l01J061
$$ 12 -795 293 345 -1159 -648 253 -729 -1005 75 -546 -1584 12 -49 -1072 -815 -239 -880 -1181 -120
2355a20l52o94P61J28j254P69R87q94l66J027m05k83N36P20j171L77O07p14k1
$$ -120 -472 -1166 -405 -277 -1531 -762 225 -669 -1035 -8 -413 -696 -160 560 -611 -234 373 -341 -362
2374c62J128n55q83J312j89q45P57O06r28j35J298o89p48J102J88j301P37N21
$$ -362 766 211 -672 640 451 -394 363 969 41 -94 1204 515 -233 869 1057 -244 493 1014
2392A014q29J64Q56o50m12J013k8j324P51M06j114R9J228j116k03J050m16j057
$$ 1014 185 349 1205 555 143 1156 1128 -196 555 961 -153 -54 1174 58 -145 905 489 -568
2410e68R15O1q43L43N77r67l83J506r21o59P44P9q24K86O54j078n0P92o04m60
$$ -568 347 408 -435 -92 485 -482 -865 641 -280 -939 -195 -116 -940 -654 0 -1078 -1128 -336 -940 -1400
2430a400Q40L0q83L22N90q87r1P43Kq28P63K31j036J05J493j118n1R67n56m68
$$ -1400 -560 -530 -1413 -1091 -501 -1388 -1479 -736 -734 -1562 -799 -568 -1604 -1499 -6 -1124 -1175 -208 -764 -1232
2450a232P04J63p48K64J186r21k46J263m54p87J095j62l71K45O14m70j66J125
$$ -1232 -528 -365 -1113 -849 337 -584 -830 433 -21 -808 287 125 -246 -1 613 143 -23 1102
2468A102n31n85Q39k1p25O09L84o87L22O49m10p26J368m52q54R35Kp17J04Q83
$$ 1102 571 -14 825 804 79 688 1072 385 707 1356 946 220 1588 1136 282 1217 1219 502 606 1489
2488A489o08m67J045l26o08M73L98q29L31M70n31n70O42k25l38K54L52q68P9N64
$$ 1489 881 414 1459 1133 525 998 1396 567 898 1368 837 267 909 684 346 600 952 84 163 727
2508G27n81m10N43k21o12N31K63n34p1N48p45l01Q93k16p35L65L29o44K03N96
$$ 727 146 -264 279 58 -554 -23 240 -294 -365 183 -562 -863 30 -186 -921 -556 -227 -871 -668 -72
2528g2p53k13O00j50n82N23J72p51P53K32j24n77N72J7l69N14K42o41K88O42o46
$$ -72 -825 -1038 -438 -588 -1170 -647 -475 -1226 -473 -241 -365 -942 -370 -353 -722 -208 34 -607 -319 323 -323
2549c23k5O58j79m29L94m3J40k4O03p62j15R83q76r6O54Q5o79N27j6m77K82O9
$$ -323 -348 310 131 -298 96 53 193 169 772 10 -105 878 2 -94 560 645 -34 493 477 0 282 351
2571C51ln8O2M11q29N92J9j00k81M96k14m00O68l26k62pJ68k86J59J70k23n28
$$ 351 348 290 352 763 -66 526 545 445 164 660 446 46 714 388 126 119 287 1 160 330 107 -421
2593d21N31k54k41L65j10l09J86O7n81K38K41J07q24O27J13m07J09J25m33J13
$$ -421 110 -144 -385 -20 -130 -439 -253 -186 -767 -529 -288 -181 -1005 -378 -265 -672 -563 -438 -871 -758
2613g58J05j58L8K94K92m61k50M78n01K0O59j46k60L08M9k0Q6n9q9J07K63k73
$$ -758 -653 -811 -773 -479 -187 -648 -898 -420 -921 -901 -242 -388 -648 -340 -291 -311 -225 -284 -373 -266 -3 -276
2635b76J75M7K04k98l6N03l61M92J71M5m03J81J73l12K17J72j46J6J32j41J9J67
$$ -276 -101 -54 150 -148 -184 319 -42 450 621 666 263 444 617 305 522 694 548 564 696 555 574 741
2657G41K01k04K42k43J47K73l04j23NJ01j38N0J1l1m6J4J86q0k23j38K04m04J55
$$ 741 942 738 980 737 884 1157 853 730 735 836 698 748 759 728 682 696 882 802 579 441 645 241 396
2680C96j19J46l50K06j73R9j93J54k03J03J79n06N7J50kj08m5p8k99M23l25l4
$$ 396 277 423 73 279 106 205 12 166 -37 66 245 -261 -204 -54 -56 -164 -209 -287 -586 -163 -488 -522
2702e22K74l13k71L14R9k56p6L31l2j66P6l42J89JQ9j04J02R8M2L6O7l18K31J10
$$ -522 -248 -561 -832 -518 -419 -675 -751 -420 -452 -618 -542 -884 -695 -694 -605 -709 -607 -509 -467 -431 -364 -682 -451 -341
2726c41l03j2N03k52O3N4K66j79PM85l39J19o2j90r6K94J69k38K96N1j06j78K25
$$ -341 -644 -656 -153 -405 -342 -288 -22 -201 -194 291 -48 71 9 -181 -277 17 186 -52 244 295 189 11 236
2749B36J50j98J61J56j72J7k2J01m8j2k23K84j92K02k26k5j84j82M85K4O0k14
$$ 236 386 188 349 505 333 350 328 429 381 369 146 430 238 440 214 189 5 -177 308 332 392 178
2771A78Q0k15M3p7J79m20J42K70n14K37k59J28Q6j04J41l36J37r4O0J1r3k42J37
$$ 178 258 43 86 9 188 -232 -90 180 -334 -97 -356 -228 -142 -246 -105 -441 -304 -398 -338 -327 -420 -662 -525
2794e25K52j54k53K96L11m75J10J93k43R3L94j70k30J59P3l12M88J03O6n75M03
$$ -525 -273 -427 -680 -384 -73 -548 -438 -245 -488 -395 -1 -171 -401 -242 -169 -481 7 110 176 -399 4
2815DK46m29J58J42k0j83N59l76j53M33N9j03J9L01k63n1L16l8k63K23j50P5K56
$$ 4 250 -179 -21 121 101 -82 477 101 -52 381 440 337 356 657 394 343 659 621 358 581 431 506 762
2838G62l2m11L65J88Lk16J45j12k76O7j68q8J19L04k64k58M89m7l85j63J21j96
$$ 762 730 319 684 872 875 659 804 692 416 483 315 227 346 650 386 128 617 570 185 22 143 -53
2860e3J99l2l26P1K01N6n63M40l51p6O7L3n4m6K35q2r9j2L03k46j51J01j27j31
$$ -53 146 114 -212 -141 60 116 -447 -7 -358 -434 -367 -334 -388 -434 -199 -281 -380 -392 -89 -335 -486 -385 -512 -643
2884f43M1J53m30M72P8o78O75o7k64j40L73J20n44K18M61n40L17J01k34J11L56
$$ -643 -602 -449 -879 -407 -329 -1007 -332 -399 -663 -803 -430 -310 -854 -636 -175 -715 -398 -297 -531 -420 -64
2905f4j51l02K74J50k87M6N21l3m44J98K23m20M05N32k90k84L65m13K62J48J32
$$ -64 -215 -517 -243 -93 -380 -334 187 154 -290 -92 131 -289 116 648 358 74 439 26 288 436 568
2926E68l06L50k02l54L75Q9K1j42P0J4j96K37J6m16L66Q2m70R3M34l33k70K54
$$ 568 262 612 410 56 431 520 541 399 469 483 287 524 540 124 490 572 102 195 629 296 26 280
2948B80K1m01K00N6m07J32L24rj69J32o1k60O9J75l21l74Q14m36r5K36j33l29
$$ 280 301 -100 100 156 -251 -119 205 196 27 159 98 -162 -93 82 -239 -613 201 -235 -330 -94 -227 -556
2970e56Q4N27n40Q0L55j29j79K77J78p00M28K60p30K51O14k82l97M24j84J61P0
$$ -556 -472 55 -485 -405 -50 -179 -358 -81 97 -603 -175 85 -645 -394 220 -62 -459 -35 -219 -58 12
2991A2K17l99q0L89k60j4K49K47l12K75K27l54j38L58n7k08L87j0r7K10k4l97
$$ 12 229 -170 -250 139 -121 -135 114 361 49 324 551 197 59 417 360 152 539 529 432 642 618 221
3013B21K40L88o03Q1R4m0lj15R8m1j44P96p52m1P7j13r3K90q6k96J58K90m75J64
$$ 221 461 849 246 327 421 381 378 263 361 320 176 972 220 179 256 143 50 340 254 -42 116 406 -69 95
3037I5K45j98m36O32l43n36J76K33j62j66L25l45K5n2J59l01M09K0n63K96J30
$$ 95 340 142 -294 338 -5 -541 -365 -132 -294 -460 -135 -480 -455 -507 -348 -649 -240 -220 -783 -487 -357
3058c57j01k00K66J19m11L25J9k02j54M67k82m48N09M8p8J35K01l84j03M65Q0
$$ -357 -458 -658 -392 -273 -684 -359 -340 -542 -696 -229 -511 -959 -450 -402 -480 -345 -144 -528 -631 -166 -86
3079h6n88P13j87k53K57J8q9P5M04l20j12M02j35j42J52j04K62l10K52j31J09
$$ -86 -674 39 -148 -401 -144 -126 -215 -140 264 -56 -168 234 99 -43 109 5 267 -43 209 78 187
3100A87L21k68j76O84j27n45L64J04n1j70L06n1m99O24l71k41Q7L02j54l42O71
$$ 187 508 240 64 748 621 76 440 544 493 323 629 578 79 703 332 91 178 480 326 -16 655
3121F55j14m13L94j23l75J70K85k56l4L40j87k77j39L67l86M8L63l35l8P8j43
$$ 655 541 128 522 399 24 194 479 223 189 529 342 65 -74 293 -93 -45 318 -17 -55 23 -120
3142a20JJ59k7k28j51M83j06l49L21p0j84J32J52n45m8M33j02k01M30k17j06l15
$$ -120 -119 40 13 -215 -366 117 11 -338 -17 -87 -271 -139 13 -532 -580 -147 -249 -450 -20 -237 -343 -658
3164f58N56k75L16R8l96J47J78K90m41M14m3k18J4L15j31J2o1k10J76K53n2l07
$$ -658 -102 -377 -61 37 -359 -212 -34 256 -185 229 186 -32 -18 297 166 178 117 -93 83 336 284 -23
3186b3J00L82k48Q5Lq4j96N54k58l37J92K6J56m42M42Jk83L42m17N1K87N5k59
$$ -23 77 459 211 296 299 215 19 573 315 -22 170 196 352 -90 352 353 70 412 -5 46 333 388 129
3209A29o5J38o9j56J76l23O4j42L11k17j15R0j04j43L24j34l41L59j38K86j36
$$ 129 64 202 133 -23 153 -170 -106 -248 63 -154 -269 -179 -283 -426 -102 -236 -577 -218 -356 -70 -206
3230b06j24l52J70K87q5j95K6M6J08k78L73j83NL07k07k91K19J27l72L19J54n8
$$ -206 -330 -682 -512 -225 -310 -505 -479 -433 -325 -603 -230 -413 -408 -101 -308 -599 -380 -253 -625 -306 -152 -210
3252b10j66L25j4J9j43J87j16k20N36l56j58N89n43M9K88k3j01L61R8k37k57N21
$$ -210 -376 -51 -65 -46 -189 -2 -118 -338 198 -158 -316 273 -270 -221 67 44 -57 304 402 165 -92 429
3274D29l40k78P01L2l53J05J27k85l4L34J00k62K64r6k31K26J44l80R1N21n29
$$ 429 89 -189 512 544 191 296 423 138 104 438 538 276 540 444 213 439 583 203 294 815 286
3295B86l6K15j57q2K7j0P9l37NR8o3K57j27l1K7J2j38q7N3Q2k02j6Q8m0p4K40
$$ 286 250 465 308 226 253 243 322 -15 -10 88 25 282 155 124 151 163 25 -62 -9 73 -129 -145 -57 -97 -171 69
3321F9k21j68N71o3n66L1K22k20j12K5J26j30J62lk5L60k91j99L09j90J85lJ37
$$ 69 -152 -320 251 188 -378 -347 -125 -345 -457 -432 -306 -436 -274 -277 -302 58 -233 -432 -123 -313 -128 -131 6
3344Fj56N0m3L45m46M74l87J6J00m1J25k51L30j08k7j35L12N6K1J76n62J36K51
$$ 6 -150 -100 -143 202 -244 230 -157 -141 -41 -82 43 -208 122 14 -13 -148 164 220 241 417 -145 -9 242
3367B42j65qK47j90pq0K17m17J5J72J16l00J55J33M3Nj26K35l02J30J25j14Jo0
$$ 242 77 69 316 126 119 39 256 -161 -146 26 142 -158 -3 130 173 178 52 287 -15 115 240 126 127 67
3391F7j50N6J00l5k46K29K20m27j17n0K98k29p9K79J14k04J73pj65k7l96K18Q2
$$ 67 -83 -27 73 38 -208 21 241 -186 -303 -353 -55 -284 -363 -84 30 -174 -1 -8 -173 -200 -596 -378 -296
3414b96m3q7J14J19n4j56M3j71N30k48J07p3Q0q8J61j42R6j53J43p2N4J63kJ79
$$ -296 -339 -426 -312 -193 -247 -403 -360 -531 -1 -249 -142 -215 -135 -223 -62 -204 -108 -261 -118 -190 -136 27 25 204
3438B04k47J91J04j05Q5j21o3K6J20j75K45j08J10k67L44m8j34M0O8m9L9n1M5
$$ 204 -43 148 252 147 232 111 48 74 194 19 264 156 266 -1 343 295 161 201 269 220 259 208 253
3461B53L42j86k52k31K74Q1k43%O6r6M66j03O0j31k05J77k44J95n5L8p4k85K51
$$ 253 595 409 157 -74 200 281 38 38 104 8 474 371 431 300 95 272 28 223 168 206 132 -153 98
3484I8K1r3l5o2J93ol63J84m29M73o6l38L04r5J44p1j59K30j18N4J83m33J12R3
$$ 98 119 26 -9 -71 122 116 -247 -63 -492 -19 -85 -423 -119 -214 -70 -141 -300 -70 -188 -134 49 -384 -272 -179
3508a79N0k23O8K79l03J15L5j1j90K28m96L64L7J4k05M76j63Q4N0j99J74m7j7
$$ -179 -129 -352 -284 -5 -308 -193 -158 -169 -359 -131 -627 -263 -226 -212 -417 59 -104 -20 30 -169 5 -42 -59
3531e9p7j37J35l4J56kJ08j73K4N29m04O7l7j45K17j06R6L3j94K52j89M8KR5j07
$$ -59 -136 -273 -138 -172 -16 -18 90 -83 -59 470 66 133 96 -49 168 62 158 191 -3 249 60 108 110 205 98
3556I8J20P7j27Kl2J92l59mJ11O5k90J23M5j12L82l27j38J4L26m00O4J10k86K69
$$ 98 218 295 168 170 138 330 -29 -33 78 143 -147 -24 21 -91 291 -36 -174 -160 166 -234 -170 -60 -346 -77
3580g7J80j6l16P4L9l49K39p5j5J89J30k63J6J07L5j97L41j04Q2j73K9J54o9K65
$$ -77 103 87 -229 -155 -116 -465 -226 -301 -316 -127 3 -260 -244 -137 -102 -299 42 -62 20 -153 -124 30 -39 226
3604B26l82J13Q3j68N3p6P1j01L6J89O4j98J35P8N0j83J33lJ1N4o2M7l5J31j34
$$ 226 -156 -43 40 -128 -75 -151 -80 -181 -145 44 108 -90 45 123 173 -10 123 120 131 185 123 170 135 266 132
3629A32J04l2k5OK97j93k74K42k35p2K79j42K15pj35N1j47rJ80j09M9k6J27l08
$$ 132 236 204 179 185 482 289 15 257 22 -50 229 87 302 295 160 211 64 55 235 126 175 149 276 -32
3653c2J58l24J50r1K79j09J49j10OP8k56R9R8j88K29k62l04M59j32k62J20J74
$$ -32 126 -198 -48 -139 140 31 180 70 76 154 -102 -3 95 -93 136 -126 -430 29 -103 -365 -245 -71
3675g1k75J3K85M8l36O1J89p6j02K42k04J1J48q4j60L42l62P1J99l39J08P8j46
$$ -71 -346 -333 -48 0 -336 -275 -86 -162 -264 -22 -226 -215 -67 -151 -311 31 -331 -260 -61 -400 -292 -214 -360
3698c60j46L61j61M6k04O90l45Q7r6K13l56P6K83K2m8J6j13K43j08m2n3J9J98
$$ -360 -506 -145 -306 -260 -464 226 -119 -32 -128 85 -271 -195 88 110 62 78 -35 208 100 58 5 24 222
3721B22r6j23r0J52L9J17k7j28Q2J57j09k15J15j91R3K91l08K66l42K14j71J95
$$ 222 126 3 -87 65 104 221 194 66 148 305 196 -19 96 -95 -2 289 -19 247 -95 119 -52 143
3743A43m6n9j7j30J05J37n3K00l81M7J10p1n9J50J3k6J07J5k01j34K77l73N2K40
$$ 143 97 38 21 -109 -4 133 80 280 -101 -54 56 -15 -74 76 89 63 170 185 -16 -150 127 -246 -194 46
3767D6j03O2N3j55k79L39J57k88L30o1N2m49J68j3j71J53K05L6j74O5j07j18L39
$$ 46 -57 5 58 -97 -376 -37 120 -168 162 101 153 -296 -128 -141 -312 -159 46 82 -92 -27 -134 -252 87
3790H7R5n02L77L85j92m67L59R8K2O3j23R4j78J01k36J9N8J40m22J88K03j41j84
$$ 87 182 -320 57 442 250 -217 142 240 262 325 202 296 118 219 -17 2 60 200 -222 -34 169 28 -156
3813a56L83nJ6K43n16M34k41J42j0k66R6l02L72l32J98o5K5k1j17J31j27L8J05
$$ -156 227 222 238 481 -35 399 158 300 290 24 120 -182 190 -142 56 -9 16 -5 -122 9 -118 -80 25
3836B5r4O5k7K04l3j38l6l9k17K90J8j62j18L9J57k83l5L9K22rK25l52j74M58
$$ 25 -69 -4 -31 173 140 2 -34 -73 -290 0 18 -144 -262 -223 -66 -349 -384 -345 -123 -132 93 -259 -433 25
3860B5l26J61J1l78K33P5j87J28l15L15K97l96J26K22j47k4q4K68j22J77J86o00
$$ 25 -301 -140 -129 -507 -274 -199 -386 -258 -573 -258 39 -357 -231 -9 -156 -180 -264 4 -118 59 245 -355
3882c55M26j10J74n79N23K9l04K93K00k70J82P5j41p6J23N9k2r7J21k38K35O9
$$ -355 71 -39 135 -444 79 108 -196 97 297 27 209 284 143 67 190 249 227 130 251 13 248 317
3904C17l18K58j06j92J49O7j03pR9J94k49o0P0j88K75N8l8K5J53j30l10L24j38
$$ 317 -1 257 151 -41 108 175 72 65 164 358 109 49 119 -69 206 264 226 251 404 274 -36 288 150
3927A50r7q1J5J60j64N4pK43O9n49K07pj76J58K12j89K18m74M6N00k52J50j36
$$ 150 53 -28 -13 147 -17 37 30 273 342 -207 0 -7 -183 -25 187 -2 216 -258 -212 288 36 186 50
3950E0l70J71N2l14J55J25K06j52k69M18o8j98L89k85J11p8J49k8q0N7j77L65
$$ 50 -320 -149 -97 -411 -256 -131 75 -77 -346 72 4 -194 195 -90 21 -57 92 64 -16 41 -136 229
3972B29k86K40rj55m1l3R4K5m4Nl4J63K85m75K6N3L3j43Q8j88R2R0J30j16J98
$$ 229 -57 183 174 19 -22 -55 39 64 20 25 -9 154 439 -36 -10 43 76 -67 21 -167 -75 15 145 29 227
3997B27j11l15R5K09q8K81m84J23n6n9K63k86P9L10j56j5k73M2J72j0j09Qr1L6
$$ 227 116 -199 -104 105 17 298 -186 -63 -119 -178 85 -201 -122 188 32 17 -256 -214 -42 -52 -161 -153 -244 -208
4021b08J68k77M23j37k02J37N3k51J80J7kJ70k22l3M6j49j86N33k74Q0j23K90
$$ -208 -40 -317 106 -31 -233 -96 -43 -294 -114 -97 -99 71 -151 -184 -138 -287 -473 60 -214 -134 -257 33
4043C3j68m63O91j57J31L3m7p3k14J02K7j6k25K31J93k65K77j30o6Q8K47k78J81
$$ 33 -135 -598 93 -64 67 100 53 -20 -234 -132 -105 -121 -346 -115 78 -187 90 -40 -106 -18 229 -49 132
4066A32O8l05J23O7N6K1k08K87j30P4J19n3k94J50J25Ok98P7nJ89K11k96J38j36
$$ 132 200 -105 18 85 141 162 -46 241 111 185 304 251 -43 107 232 238 -60 17 12 201 412 116 254 118
4090A18R8k20M3K38l62L03J8k72J21k01K75q4O9j00k67J81j58K75j52K89m82L56
$$ 118 216 -4 39 277 -85 218 236 -36 85 -116 159 75 144 44 -223 -42 -200 75 -77 212 -270 86
4112H6L3k71J9J36Mj28N2K56j52j03K08j24l08Q1Q0j09O1J31l07K54O5j15j54
$$ 86 119 -152 -133 3 7 -121 -69 187 35 -68 140 16 -292 -211 -131 -240 -179 -48 -355 -101 -36 -151 -305
4135c05M27L2m19K76j82P5O5o7L2M4P5Q7n8j89q3J46N3k10j92L26l2K06j5K6k97
$$ -305 122 154 -265 11 -171 -96 -31 -98 -66 -22 53 140 82 -107 -190 -44 9 -201 -393 -67 -99 107 92 118 -179
4160a79L31j73l2K01j39n9J1J0K3M17j72j30K54m23J30j27j01N39k92K16j75o6
$$ -179 152 -21 -53 148 9 -50 -39 -29 -6 411 239 109 363 -60 70 -57 -158 381 89 305 130 64
4182F4j66j89J42J01J01j37J52N4k1p8K55k41o6j20J76j15j1q0J07J9l3l1R7J1
$$ 64 -102 -291 -149 -48 53 -84 68 122 101 23 278 37 -29 -149 27 -88 -99 -179 -72 -53 -86 -117 -20 -9
4206iJ2j28m5K76k8k98J95l6o0K10k45J19j38j7j04J67K42k57jN1J43K01k52J0
$$ -9 3 -125 -170 106 78 -220 -25 -61 -121 89 -156 -37 -175 -192 -296 -129 113 -144 -145 -94 49 250 -2 8
4230HJ5n0j3L5J00p9J58k68K95j58K04j16m8j4k85J26j03P7J22j4O9J51q5J53
$$ 8 23 -27 -40 -5 95 16 174 -94 201 43 247 131 83 69 -216 -90 -193 -116 6 -8 61 212 127 280
4254B80j71J34J9P2n28N81k24l7R1k21J72k67K04j6K7P1j11j23R7L7k04M25n02
$$ 280 109 243 262 334 -194 387 163 126 217 -4 168 -99 105 89 116 187 76 -47 50 87 -117 308 -194
4277a94K55k18N47j69m04K94k11O7o2kJ99l82J1K27j56M11n97M50Rrj52k76L77
$$ -194 61 -157 390 221 -183 111 -100 -33 -95 -97 102 -280 -269 -42 -198 213 -384 66 75 66 -86 -362 15
4300A5k14n7K02j29J09J11k20O8J9o8K63j66r0R5r7j27L30qp5j18K10j24k5j13
$$ 15 -199 -256 -54 -183 -74 37 -183 -115 -96 -164 99 -67 -157 -62 -159 -286 44 36 -39 -157 53 -71 -96 -209
4324b09K07j06J25J17l58N9J02qK22L0l11Q2q6k0L78NO5l14j3J16j69J06J78J5
$$ -209 -2 -108 17 134 -224 -165 -63 -71 151 181 -130 -48 -134 -154 224 229 294 -20 -33 83 -86 20 198 213
4348B13m2Q1j81j33K37j66J00j07K9J36k21K10m9J10m1K8m1j01N4j09o8j40K39
$$ 213 171 252 71 -62 175 9 109 2 31 167 -54 156 107 217 176 204 163 62 116 7 -61 -201 38
4371C8k93J99Q7k64J89k4j74J73J71j11J58m39M15j62n9l31L40k95J13N84j85
$$ 38 -255 -56 31 -233 -44 -68 -242 -69 102 -9 149 -290 125 -37 -96 -427 -87 -382 -269 315 130
4392A30k58K50j93m7L48k53J92l32K73r6j6l6k1J4J20O5L5m02L42k76J7J63J00
$$ 130 -128 122 -71 -118 230 -23 169 -163 110 14 -2 -38 -59 -45 75 140 175 -227 115 -161 -144 19 119
4415A19j49J27M5k13K14k15PJ84r8K6J03R2k12O8o0K88j35o4Q3j28K75k68O3j94
$$ 119 -30 97 142 -71 143 -72 -65 119 21 47 150 242 30 98 38 326 191 127 210 82 357 89 152 -42
4439d2J15Q8O6p7j51lnK13R0q0j56Q4j48n4J42K21m56m4J31K31j26K62l74J0O6
$$ -42 73 161 227 150 -1 -4 -9 204 294 214 58 142 -6 -60 82 303 -153 -197 -66 165 39 301 -73 -63 3
4464Cj05M2Q5l4J0K5m9o6Q3J99j60k15L20m36J25K94k60J80R6k03kR4l63J20j62
$$ 3 -102 -60 25 -9 1 26 -23 -89 -6 193 33 -182 138 -298 -173 121 -139 41 137 -66 -68 26 -337 -217 -379
4489c79Q9P1K24n8P6k0o1l4K04k29J02p7j76L93l4l96J76K06N3l46M54j39j75
$$ -379 -290 -219 5 -53 23 3 -58 -92 112 -117 -15 -92 -268 125 91 -305 -129 77 130 -216 238 99 -76
4512g6K58P1k84J4K9R5K9l4m8L6k0L2k8m3J59k25J77p6m8L62l43q9O2K38l02q8
$$ -76 182 253 -31 -17 12 107 136 102 54 90 70 102 74 31 190 -35 142 66 18 380 37 -52 10 248 -54 -142
4538a42K65l4k00M1L95l78R0m0O9m3j87R5K68k24K74p33M50k45L35j76J02j69
$$ -142 123 89 -111 -70 325 -53 37 -3 66 23 -164 -69 199 -25 249 -484 -34 -279 56 -120 -18 -187
4560a87J7p9O8j8J11J06J88j73k9K59m10j8j08J65j36L68k7k35J38J11k04J03
$$ -187 -170 -249 -181 -199 -88 18 206 33 4 263 -147 -165 -273 -108 -244 124 97 -138 0 111 -93 10
4582A0n2K09k22O3J13k86N6K66K27j54l50J58j68R2j31M7K61r1j62Q7r6L4J46
$$ 10 -42 167 -55 8 121 -165 -109 157 384 230 -120 38 -130 -38 -169 -122 139 48 -114 -27 -123 -89 57
4605E7J88k88J32K1j54M8k7J02R1l3k15j1L75R3n87M36r4k2J18n7k4Q9k42j64
$$ 57 245 -43 89 110 -44 4 -23 79 170 137 -78 -89 286 379 -208 228 134 112 230 173 149 238 -4 -168
4629a68J89M4j1L8N0j86L45l09k43K08k3P3j21j8j10k8J86Lj08j14J24K14k6J7
$$ -168 21 65 54 92 142 -44 301 -8 -251 -43 -66 7 -114 -132 -242 -270 -84 -81 -189 -303 -179 35 9 26
4653B6n3N8k84P4r6L9K00k27Q1K47l05K31r7L4j56O0J39J46j33k9j91K87j83L58
$$ 26 -27 31 -253 -179 -275 -236 -36 -263 -182 65 -240 -9 -106 -72 -228 -168 -29 117 -16 -45 -236 51 -132 226
4677B26l15J56K14n40L56j19o8L27K2K09m01j52K11P8r6k5J2j5J97l10J40J02
$$ 226 -89 67 281 -259 97 -22 -90 237 259 468 67 -85 126 204 108 83 95 80 277 -33 107 209
4699B09J95m3j01j06k82L31L39m40k8j2R1j61J37JJ52k85Q2j0Q7J68m29M25k27
$$ 209 404 361 260 154 -128 203 542 102 74 62 153 -8 129 130 282 -3 79 69 156 324 -105 320 93
4722I3J4j51J2KJ92k06L57m68K69lk70r5J1P7K50l15K59l0K3q7j68J92k09L96
$$ 93 107 -44 -32 -30 162 -44 313 -155 114 111 -159 -254 -243 -166 84 -231 28 -2 21 -66 -234 -42 -251 145
4746A45j09j71R4Qk49K54m4j21J45K31k27j56L22J0k28on8J95j12Q7r7J4L85m46
$$ 145 36 -135 -41 -33 -282 -28 -72 -193 -48 183 -44 -200 122 132 -96 -102 -160 35 -77 10 -87 -73 312 -134
4770a34K69j95K83l91J34J59J66L5l38J73k82J92L3j46K9K18r1k26J58N4k94L12
$$ -134 135 -60 223 -168 -34 125 291 326 -12 161 -121 71 104 -42 -13 205 114 -112 46 100 -194 118
4792A18j32R6J50k28j64K56l2J16j90q8R1j30K56o2j8J13j11j91J24K30j83J5
$$ 118 -14 82 232 4 -160 96 64 180 -10 -98 -7 -137 119 57 39 152 41 -150 -26 204 21 36
4814C6k45K88k93j19M24j15j90J73Q8k6k32J84j95J1N0j29L63k55j8K21k63L19
$$ 36 -209 79 -214 -333 91 -24 -214 -41 47 21 -211 -27 -222 -211 -161 -290 73 -182 -200 21 -242 77
4836G7k70L09k00j68J85l57K4J80P9J09j50m2K73J15r9j06R3p8j83M68l7l35J08
$$ 77 -193 116 -84 -252 -67 -424 -400 -220 -141 -32 -182 -224 49 164 65 -41 52 -26 -209 259 222 -113 -5
4859eJ28j60R2L32k5j4m29O3p0J71J88j45n0L25k00j81oJ21j34J04j2K4Q0j39
$$ -5 123 -37 55 387 362 348 -81 -18 -88 83 271 126 76 401 201 20 14 135 1 105 93 117 197 58
4883E8J53J51j25j37J56k61j28L85j23j78L20j53j64J81n0k04j5J29L2J84l42
$$ 58 211 362 237 100 256 -5 -133 252 129 -49 271 118 -46 135 85 -119 -134 -5 27 211 -131
4904a31K05k62M20m16j8J70K0j38j14K61K5%j10j44J01N04l94k7J22k37K28j47
$$ -131 74 -188 232 -184 -202 -32 -12 -150 -264 -3 22 22 -88 -232 -131 373 -21 -48 74 -163 65 -82
4926h2j94K99m7J16j19j06K93l84L88k40M7J05j20l2m6K37J41k44J75j57n8K6
$$ -82 -276 23 -24 92 -27 -133 160 -224 164 -76 -29 76 -44 -76 -122 115 256 12 187 30 -28 -2
4948bo1N2Kp3j34L32j60L9J02k22J55K59j40j59L06k01j17k07L98Lk19P1K0m9
$$ -2 -63 -11 -9 -82 -216 116 -44 -5 97 -125 30 289 149 -10 296 95 -22 -229 169 172 -47 24 44 -5
4972eK54J96m90p2J24N3J4P0k22J91K51m21M8k27L28J78l9l36Qj49K70N7J6k83
$$ -5 249 445 -45 -117 7 60 74 144 -78 113 364 -57 -9 -236 92 270 231 -105 -97 -246 24 81 97 -186
4996a86K70j1Kl07L5k2K70l19K12M34m54j07J04p6l3j07K65j66j62L7N22m67L48
$$ -186 84 73 75 -232 -197 -219 51 -268 -56 378 -76 -183 -79 -155 -188 -295 -30 -196 -358 -321 201 -266 82
5019H2m3k09K59k78QJ91q5L2J66j63J55J39j60j41M1J16M1j07J02r3m05N38R5
$$ 82 39 -170 89 -189 -181 10 -75 -43 123 -40 115 254 94 -47 -6 110 151 44 146 53 -352 186 281
5042B81l66L19j31J50j69j82K29j82J21j27L5kj92K19L81j57k20L33l86J04J1
$$ 281 -85 234 103 253 84 -98 131 -51 70 -57 -22 -24 -216 3 384 227 7 340 -46 58 69
5063F9r1J5j31J05r7L21j68K87m11k4J74n6J21j04j18J01j09L4p8K13K9k09J99
$$ 69 -22 -7 -138 -33 -130 191 23 310 -101 -125 49 -7 114 10 -108 -7 -116 -82 -160 53 82 -127 72
5086G2j59l5R0N8l72M43qr4M3K1r7j66R0M8L2jj7J71j69q5L12j09j58L8N4l2j10
$$ 72 -87 -122 -32 26 -346 97 89 -5 38 59 -38 -204 -114 -66 -34 -35 -52 119 -50 -135 177 68 -90 -52 2 -30 -140
5113a40J44j41N6J5r0J87k44K04j9n8J2J53j5K64k85j50K09J08j64k9N4J55r5
$$ -140 4 -137 -81 -66 -156 31 -213 -9 -28 -86 -74 79 64 328 43 -107 102 210 46 17 71 226 131
5136A31j29J44j01J99j50q9K55l5j42J00k26k02K42l3l9J06j18M20k11J0o2j39
$$ 131 2 146 45 244 94 5 260 225 83 183 -43 -245 -3 -36 -75 31 -87 333 122 132 70 -69
5158f9K36m7j18J25l32K21o9K54o9J02n7m55J95k03J40K03q0r1K43k40K02J8k09
$$ -69 167 120 2 127 -205 16 -53 201 132 234 177 -278 -83 -286 -146 57 -23 -114 129 -111 91 109 -100
5181a00l0J32J92j69N2n9p8R0j50M22l23J93m59K8K02J08K1j75P7K25m35L15J79
$$ -100 -130 2 194 25 77 18 -60 30 -120 302 -21 172 -287 -259 -57 51 72 -103 -26 199 -236 79 258
5204B58m57L14j26j75K83P5R8n24J63J27q4J98j2p8k0K04l32L57k4l6k87M96n18
$$ 258 -199 115 -11 -186 97 172 270 -254 -91 36 -48 150 138 60 40 244 -88 269 245 209 -78 418 -100
5227a00L34k12N2Lj06K90j26N7k9l89J03J82j12K82k52j38j30L59m0k08J95Pp7
$$ -100 234 22 74 77 -29 261 135 192 163 -226 -123 59 -53 229 -23 -161 -291 68 28 -180 15 22 -55
5250e5n9J19l9j42J66J34k77K59l23K49j65j80K79j08J5N26m29j76J3J52J35q4
$$ -55 -114 5 -34 -176 -10 124 -153 106 -217 32 -133 -313 -34 -142 -127 399 -30 -206 -193 -41 94 10
5272A0j38J1j89J22Q3K44k09p9QJ93k61k0ljr5R0L48K5m15K97j28Q0o7K67l27
$$ 10 -128 -117 -306 -184 -101 143 -66 -145 -137 56 -205 -225 -228 -229 -324 -234 114 139 -276 21 -107 -27 -94 173 -154
5297a54K17l16J20K8m7L9J2J81J25q5l08J24o4K52m2j70J64j16R1P8j54J15k16
$$ -154 63 -253 -133 -105 -152 -113 -101 80 205 120 -188 -64 -128 124 82 -88 76 -40 51 129 -25 90 -126
5320a26M6K58l0l57Q6M5K92j68mJ22l12J58Q2J72l65j31M52k26o6j91K39m6J16
$$ -126 -80 178 148 -209 -123 -78 214 46 42 164 -148 10 92 264 -101 -232 220 -6 -72 -263 -24 -70 46
5343D6K11l02J52j94K31j61j15l7K36n3J12j70O9q2K49m60K61l7j08K00j65L52
$$ 46 257 -45 107 -87 144 -17 -132 -169 67 14 126 -44 25 -57 192 -268 -7 -44 -152 48 -117 235
5365B35l05J26q4l0J43J14l07J08P7j86K85q4l60K47k75J52L10k19K34o0j18o2
$$ 235 -70 56 -28 -58 85 199 -108 0 77 -109 176 92 -268 -21 -296 -144 166 -53 181 121 3 -59
5387e9J6n0n7J75L9Oq6p6L51k89J42j66j00N03m49R5Q8q8n4J27j95J26L49l12
$$ -59 -43 -93 -150 25 64 70 -16 -92 259 -30 112 -54 -154 349 -100 -5 83 -5 -59 68 -127 -1 348 36
5411C6K13q4k1n9j6m41M11J20l66L21K5o0m2P8j45J44k44P8L2o8J03m2J04k57
$$ 36 249 165 144 85 69 -372 39 159 -207 114 139 79 37 115 -30 114 -130 -52 -20 -88 15 -27 77 -180
5435a80q9P0J17j60J62k1q2K39k83K96j62j06L18l31%M59n90M7J25L70p4k40P1
$$ -180 -269 -199 -82 -242 -80 -101 -183 56 -227 69 -93 -199 119 -212 -212 247 -343 -296 -171 199 125 -115 -44
5458d4j58K38pr1j86J92o8J69j34J87r8m3K9J45k44M3q6L14k20K7J50j15n9J12
$$ -44 -202 36 29 -62 -248 -56 -124 45 -89 98 0 -43 -14 131 -113 -70 -156 158 -62 -35 115 0 -59 53
5482E3j19j00L07K68m33k4K86k26J91j18j99J47K93m41K27Q2j61j39m4J57J8l5
$$ 53 -66 -166 141 409 -24 -48 238 12 203 85 -114 33 326 -115 112 194 33 -106 -150 7 25 -10
5504a0K65j78RJ3R5j95J65j83R2o4Q7j99J72Mo1n9J7L12k81k4k6L64l78J3l7J87
$$ -10 255 77 86 99 194 -1 164 -19 73 9 96 -103 69 73 12 -47 -30 282 1 -23 -49 315 -63 -50 -87 100
5530A00l01K59j56kqK19j97j05N8R9k05L49l30J88M5k73K13O0o9j68N8J85p3P8
$$ 100 -201 58 -98 -100 -108 111 -86 -191 -133 -34 -239 110 -220 -32 13 -260 -47 13 -56 -224 -166 19 -54 24
5554B4L11m21K4J40P8q2r8R9K05k03J34p3j59J78j87lr2J01j27K7KK22k07P7J96
$$ 24 335 -86 -62 78 156 74 -24 75 280 77 211 138 -21 157 -30 -33 -125 -24 -151 -124 -122 100 -107 -30 166
5579A66j52J85J4n2n1k3J2R2k20P1Jjk78L40J96k03K21n03L22j04Q0m2j07j36
$$ 166 14 199 213 161 110 87 99 191 -29 42 43 42 -236 104 300 97 318 -185 137 33 113 71 -36 -172
5603a72K60k16J08Q2J08l15J9L61k15Q6j69k53K50m7M3L90n43j72L65l1o6J16
$$ -172 88 -128 -20 62 170 -145 -126 235 20 106 -63 -316 -66 -113 -70 320 -223 -395 -30 -61 -127 -11
5625a1j62J5j04p2R1L63oo4P9q3m6l31K22Q2%O1k30J9K6J72l12J21j14K10J19
$$ -11 -173 -158 -262 -334 -243 120 114 50 129 46 0 -331 -109 -27 -27 34 -196 -177 -151 21 -291 -170 -284 -74 45
5650D5r2K16M3k59j47M10k47M23k93k77R0K1N6O1Q7j62k59K38K75Pj70q4J42K8
$$ 45 -47 169 212 -47 -194 216 -31 392 99 -178 -88 -67 -11 50 137 -25 -284 -46 229 236 66 -18 124 152
5674A52j95J67J29j43j50Q1K53l34K35j02j38k49K28l7K81k24jJ00k8o9K73l18
$$ 152 -43 124 253 110 -40 41 294 -40 195 93 -45 -294 -66 -103 178 -46 -47 53 25 -44 229 -89
5696h9J11M9K3n2K69k59j76K32k7j9J91oq3j80m9pR7k74K84Jk33K77j12j05KK2
$$ -89 22 71 94 42 311 52 -124 108 81 62 253 247 164 -16 -65 -72 25 -249 35 36 -197 80 -32 -137 -135 -113
5722a13k43J82P0K84n30L21J80m40M64j81j82R7n6L1m2M7L88l77J98p0N4J05j78
$$ -113 -356 -174 -104 180 -350 -29 151 -289 175 -6 -188 -91 -147 -116 -158 -111 277 -100 98 28 82 187 9
5745IK1l2m5J60K34k55m31N50j2jk57LK01m1P8j14k67K17N2l21K79MK26j46m5
$$ 9 30 -2 -47 113 347 92 -339 211 199 198 -59 -56 145 104 182 68 -199 18 70 -251 28 32 258 112 67
5770F7j93L67l40J92k4J7m96N62k21K79k90K24j18p8J32j49N8l76L72J5K1k43
$$ 67 -126 241 -99 93 69 86 -410 152 -69 210 -80 144 26 -52 80 -69 -11 -387 -15 0 21 -222
5792b22L17p8J55k56k05K41J05j66Nj8L29j48r2r7l9N9m4O8R5K9j02J19p9J9q8
$$ -222 95 17 172 -84 -289 -48 57 -109 -104 -122 207 59 -33 -130 -169 -110 -154 -86 9 38 -64 55 -24 -5 -93
5817i3K07k26r4K38j87l9M17j40p7R0k82MK95o2k7R9n8o8J0K31j99J88p6k85K36
$$ -93 114 -112 -206 32 -155 -194 223 83 6 96 -186 -182 113 51 24 123 65 -3 7 238 39 227 151 -134 102
5842A02j65j06K66k79K6l6K99K7n6l2J52j65L23r2k14J38o6j12J40k21Q0p3J40
$$ 102 -63 -169 97 -182 -156 -192 107 134 78 46 198 33 356 264 50 188 122 10 150 -71 9 -64 76
5865G6k48Q0J94J88n95K90j20J73K80l31R9r5M6k68K55n7O1q2j46M27l61J05m0
$$ 76 -172 -92 102 290 -305 -15 -135 38 318 -13 86 -9 37 -231 24 -33 28 -54 -200 227 -134 -29 -69
5888f9k9k4P8l9n9K35j45O3q2P6J3o6kr5Q3R9j47Q9J10o9k19l3j5J92K5L7K2J68
$$ -69 -98 -122 -44 -83 -142 93 -52 11 -71 5 18 -48 -50 -145 -62 37 -110 -21 89 20 -199 -232 -247 -55 -30 7 29 197
5916A97n7k62K12j04r8j85K98j65o9N6J87j05l36L82J10l5n6J71j96P1O4j12l2
$$ 197 140 -122 90 -14 -112 -297 1 -164 -233 -177 10 -95 -431 -49 61 26 -30 141 -55 16 80 -32 -64
5939f4K41j82N9k45K47j87L19j73mk6k02J48k2J10M4k13K67k53K6K12l21j1M36
$$ -64 177 -5 54 -191 56 -131 188 15 11 -15 -217 -69 -91 19 63 -150 117 -136 -110 102 -219 -230 206
5962B06k72K52l58K02k77K62o9M0m7J45j15Pj59p0N08l90J27p7K30j12k15O6L9
$$ 206 -66 186 -172 30 -247 15 -54 -14 -61 84 -31 -24 -183 -253 255 -135 -8 -85 145 33 -182 -116 -77
5985g7N21n29M8k28L32Q0j03K08k94J0q6K35j06n8q1j26K31q9K15J11j18l9K20
$$ -77 444 -85 -37 -265 67 147 44 252 -42 -32 -118 117 11 -47 -128 -254 -23 -112 103 214 96 57 277
6008B77l39J84%l8j0q1j60M33k90q5K24k36N1J25J06%Q4j73J00l67K32K05j08
$$ 277 -62 122 122 84 74 -7 -167 266 -24 -109 115 -121 -70 55 161 161 245 72 172 -195 37 242 134
6031A34P3N0k13J20J16k51j18M8o4J89q7n9j97J78J70j04J63j26p1J23j05O4n6
$$ 134 207 257 44 164 280 29 -89 -41 -105 84 -3 -62 -259 -81 89 -15 148 22 -49 74 -31 33 -23
6054b3K61j64j25n4J22J0j10J85j72N0L2j99L62k89J04O7l8n6o3K35k28J77j92
$$ -23 238 74 -51 -105 17 27 -83 102 -70 -20 12 -187 175 -114 -10 57 19 -37 -100 135 -93 84 -108
6077a08j26L29j33k7p7K34k8k45J15k92K12K72j15k8j16r4K29q4P0K6j54N5j44
$$ -108 -234 95 -38 -65 -142 92 64 -181 -66 -358 -146 126 11 -17 -133 -227 2 -82 -12 14 -140 -85 -229
6100b29M56j60M0K6R8j52k37K33m7K30j87k66K89l09L72l1j04N9k78J68r9L66
$$ -229 227 67 107 133 231 79 -158 75 28 258 71 -195 94 -215 157 126 22 81 -197 -29 -128 238
6122B38L6m35O18j92j11K9l47N79m33L19m27K53J26j88j48K46J60k69n8j43P7
$$ 238 274 -161 457 265 154 183 -164 415 -18 301 -126 127 253 65 -83 163 323 54 -4 -147 -70
6143g0L71l64L8l1L4l15K90p0M4n4L09j80J53k64P2J27n1o8k41L29r4QJ10j2k18
$$ -70 301 -63 -25 -56 -22 -337 -47 -117 -73 -127 182 2 155 -109 -37 90 39 -29 -270 59 -35 -27 83 71 -147
6168a47K73j51l0j38R0J5orl1p7L02l66L64k06K05k32O2J29l25L71j61J21p2j82
$$ -147 126 -25 -55 -193 -103 -88 -94 -103 -134 -211 91 -275 89 -117 88 -144 -82 47 -278 93 -68 53 -19 -201
6192b01P9J56mm8k7K70k99L57m7m31K01N4j08m4R1K6N3J76j24o5l8J6R0k02L4
$$ -201 -122 34 30 -18 -45 225 -74 283 236 -195 6 60 -48 -92 -1 25 78 254 130 65 27 43 133 -69 -35
6217c5L37n6l37K65oq1J86o26J08J49K42k77J69j69l9Q8N4pK43k66k0R6R2l14
$$ -35 302 246 -91 174 168 87 273 -353 -245 -96 146 -131 38 -131 -170 -82 -28 -35 208 -58 -78 18 110 -204
6241b04Q4J68k42M6j40K43K2j05j00r5J67j25K53rJ78J72l10M0j55J15P9l54O9
$$ -204 -120 48 -194 -148 -288 -45 -23 -128 -228 -323 -156 -281 -28 -37 141 313 3 43 -112 3 82 -272 -203
6264b03J63K32l14n8K23j87K15j98R4Q6j55K6K82m70M34j17J5j76pQ0J06M1k54
$$ -203 -40 192 -122 -180 43 -144 71 -127 -33 53 -102 -76 206 -264 170 53 68 -108 -115 -35 71 112 -142
6287a42J1N5K93k02Jj62J24K41j89k9M3l35L27O7r5j36K81N2k57j4J01O8j65L18
$$ -142 -131 -76 217 15 16 -146 -22 219 30 1 44 -291 36 103 8 -128 153 205 -52 -66 35 103 -62 256
6311B56m10J22M7K0j62O1J4k38N10k62J58j31M5k8K7J10j33L0j33K7r0J13k85
$$ 256 -154 -32 15 35 -127 -66 -52 -290 220 -42 116 -15 30 2 29 139 6 36 -97 -70 -160 -47 -332
6334c32L77n6l3K7L9j93K84j03l0J20J2j74K3j38M27l71J90L4j84M05k91k9q6
$$ -332 45 -11 -44 -17 22 -171 113 10 -20 100 112 -62 -39 -177 250 -121 69 103 -81 324 33 4 -82
6357h2J56k2P7k70L8P6Ok2J28j48N3K5j23J99j87j22K32j81J80L6j08J01O5l9
$$ -82 74 52 129 -141 -103 -27 -21 -43 85 -63 -10 15 -108 91 -96 -218 14 -167 13 49 -59 42 107 68
6381F8L8j97Q5R1k1J62j51J33k40M8J25n5k75K29j30R0J05m0l1o6j13J43J23m8
$$ 68 106 -91 -6 85 64 226 75 208 -32 16 141 86 -189 40 -90 0 105 65 34 -32 -145 -2 121 73
6405G3j56J37K08l72Q2L6J4j74Q4J82j89K1K1j04J52k31lJ70p6J39M4k09J26j01
$$ 73 -83 54 262 -110 -28 8 22 -152 -68 114 -75 -54 -33 -137 15 -216 -219 -49 -125 14 58 -151 -25 -126
6429a26K01j39P4K8j67p7%K03j25nL58j33P3k1k13o3J30k76N08l44J64j32mN8
$$ -126 75 -64 10 38 -129 -206 -206 -3 -128 -133 225 92 165 144 -69 -132 -2 -278 230 -114 50 -82 -86 -28
6453b8J3oP3m3L3l53L70K68o33J84K11NJ30n9R5j23q3M1J57k8q5M7jm16K48J53
$$ -28 -15 -21 52 9 42 -311 59 327 -306 -122 89 94 224 165 260 137 54 95 252 224 139 186 185 -231 17 170
6479A70j93O3j76j7K98n4j72J11q9J52J50q2O1j91n4P5R8j38P5J21m39J25LL66
$$ 170 -23 40 -136 -153 145 91 -81 30 -59 93 243 161 222 31 -23 52 150 12 87 208 -231 -106 -103 263
6503B63J03m37J29m84N32l25K10J97k77j20J08J8j5R9J32r6l67K75L09j12lk11
$$ 263 366 -71 58 -426 106 -219 -9 188 -89 -209 -101 -83 -98 1 133 37 -330 -55 254 142 139 -72
6525g2k5J08l2P0j38r4K05J04O1o9l28M46k29Nr0k02L49r3L1L40k12j81J14L6
$$ -72 -97 11 -21 49 -89 -183 22 126 187 118 -210 236 7 12 -78 -280 69 -24 7 347 135 -46 68 104
6549A04p1k45J18J00K59l0l40N24n07l5L09p8k68P4J76j19Jm7j94L56k32J91j41
$$ 104 33 -212 -94 6 265 235 -105 419 -88 -123 186 108 -160 -86 90 -29 -28 -75 -269 87 -145 46 -95
6572i5K80p7j5l4j26K51k6j90O8K5j77J50j0r3j53K03J9J42l75K57p3j90r5L77
$$ -95 185 108 93 59 -67 184 158 -32 36 61 -116 34 24 -69 -222 -19 0 142 -233 24 -49 -239 -334 43
6596D3N9k61M9K52k38p8J37R5j05J9j31k9J33j38Q2J29n2M2O3j29K3j22j9O7j20
$$ 43 102 -159 -110 142 -96 -174 -37 58 -47 -28 -159 -188 -55 -193 -111 18 -34 8 71 -58 -35 -157 -176 -109 -229
6621b29J86n4j56M81k36j6j30M05j99qj19J05m0n4P4q2r2M30q1r7P6j05J56m65
$$ -229 -43 -97 -253 228 -8 -24 -154 251 52 44 -75 30 -10 -64 10 -72 -164 266 185 88 164 59 215 -250
6645b50L58j22L6j1K02j27J16k09j42K70k15J35O8n2k71K2K92O6J6j28J45L1j72
$$ -250 108 -14 22 11 213 86 202 -7 -149 121 -94 41 109 57 -214 -192 100 166 182 54 199 230 58
6668E8j43K16N8q9J77l3q9j11k26M3J7LR6K9k73J37L69j58J14k88K30k37l9j32
$$ 58 -85 131 189 100 277 244 155 44 -182 -139 -122 -119 -23 6 -267 -130 239 81 195 -93 137 -100 -139 -271
6692b71R3J83p6m1R1J47k69L1J98m2k1P0m19M04o1j83K39rM7l11j7M9J66O8m10
$$ -271 -178 5 -71 -112 -21 126 -143 -112 86 44 23 93 -326 78 17 -166 73 64 111 -200 -217 -168 -2 66 -344
6717c44J10L49j21n0o9J57k86M84j35j27K08n5J20q7j24J03j77k41L20L4j86J30
$$ -344 -234 115 -6 -56 -125 32 -254 230 95 -32 176 121 241 154 30 133 -44 -285 35 69 -117 13
6739A3j59K76j59R6j23J24r2K8N0j34L4r7L04j6q9k99J94O8J27j5j10j16p7K29
$$ 13 -146 130 -29 67 -56 68 -24 4 54 -80 -46 -143 161 145 56 -243 -49 19 146 131 21 -95 -172 57
6763E7j05Q1J71l7l83K23J48m7j01J61l96J20J06L7L2j50J64J20k07P0j9j11J22
$$ 57 -48 33 204 167 -216 7 155 108 7 168 -228 -108 -2 35 67 -83 81 201 -6 64 45 -66 56
6786E6k35N0k8L58n2p9o1n4l10K48J65R8N4k88P2J31J05j59n6M5J97k28M4l01
$$ 56 -179 -129 -157 201 149 70 9 -45 -355 -107 58 156 210 -78 -6 125 230 71 15 60 257 29 73 -228
6810b28J22P5l8J39J57r8j13j47L97j81n9j5r3J50q4N5k25K78j31j1K10k7k86
$$ -228 -106 -31 -69 70 227 129 16 -131 266 85 26 11 -82 68 -16 39 -186 92 -39 -50 160 133 -153
6833a53L77Nk15K7m9J4k61K71j88K51j43j79M28l24K24K06l53O8n3j07K08j48
$$ -153 224 229 14 41 -8 6 -255 16 -172 79 -64 -243 185 -139 85 291 -62 6 -47 -154 54 -94
6855i4r5MJ53J00m5K3J5o3k06J46o5K15l0M2K3q1j15r0j61N8Q6K01L3j10j41L47
$$ -94 -189 -185 -32 68 23 46 61 -2 -208 -62 -127 88 58 100 123 42 -73 -163 -324 -266 -180 21 54 -56 -197 150
6881A50j60J3Q0k87J65o1lL63j88j27k6k5L3k6M27k03J46K0j83L0jJ3k00K01l88
$$ 150 -10 3 83 -204 -39 -100 -103 260 72 -55 -81 -106 -73 -99 328 125 271 291 108 138 137 150 -50 151 -237
6906b37N67r0k39L15k89j22j8M08j85l08K25J58kk98L59k03j8J61l47L07k50K69
$$ -237 330 240 1 316 27 -95 -113 295 110 -198 27 185 183 -115 244 41 23 184 -163 144 -106 163
6928A63k08o0M6k3K56J9j40k08J39LJ6K04l47J69l1K62p9k26l4K53l35J95M0p4
$$ 163 -45 -105 -59 -82 174 193 53 -155 -16 -13 3 207 -140 29 -2 260 181 -45 -79 174 -161 34 74 0
6952@J42L2k76l8J69p3J48p5j10K5R8O3l79K38j34O4j44L69j83L2j49k28K52M93
$$ 0 142 174 -102 -140 29 -44 104 29 -81 -56 42 105 -274 -36 -170 -106 -250 119 -64 -32 -181 -409 -157 336
6976C36k63L6j65P1K8J77r6j13j32J17J34l61K96m1J20o0k03L54k13K02k1l10
$$ 336 73 109 -56 15 43 220 124 11 -121 -4 130 -231 65 24 144 84 -119 235 22 224 203 -107
6998a07KJ75p5Q6j93j10J58J41P2m7K17m13N8P9K3J42q8j75j04K67q9K2k36j55
$$ -107 -105 70 -5 81 -112 -222 -64 77 149 102 319 -94 -36 43 66 208 120 -55 -159 108 19 41 -195 -350
7022c50O48m48J20p8N29l85J12j52J37r8j47J17k4q0J50rJ24l53k9L44l08K64
$$ -350 298 -150 -30 -108 421 36 148 -4 133 35 -112 5 -19 -99 51 42 166 -187 -216 128 -180 84
7044H4Pk79L09j49K09l10L55k88j70Q2m8K45k42m7L64L1k13k34J61j0J43q6M6
$$ 84 91 -188 121 -28 181 -129 226 -62 -232 -150 -198 47 -195 -242 122 153 -60 -294 -133 -143 0 -86 -40
7067d0j12J68L9k49K70k28L50p4k27L3L58k73k34K95j17J74pJ23k44J16j27J88
$$ -40 -152 16 55 -194 76 -152 198 124 -103 -70 288 15 -219 76 -41 133 126 249 5 121 -6 182
7089A82j5l80M05j45O3k44K10J75r6j11l9J34M5J9j21k6j66J44O2J14k26Q6J12
$$ 182 167 -213 192 47 110 -134 76 251 155 44 5 139 184 203 82 56 -110 34 96 210 -16 70 182
7112A82k54j31K45l65M88p2k88K31j67R8j47M3L88l50M49j69Nl6l53J1J29J10
$$ 182 -72 -203 42 -323 165 93 -195 36 -131 -33 -180 -137 251 -99 350 181 186 150 -203 -192 -63 47
7134D7j06j5j2j21J36J34q9n5m2P0J35j48M3K06j40Q3j07N4j01l9P8J96p4k96
$$ 47 -59 -74 -86 -207 -71 63 -26 -81 -123 -53 82 -66 -23 183 43 126 19 73 -28 -67 11 207 133 -163
7158a63J41K7j73J80j29J83kl22N26l18K74k62L6J7k6K8r5K13n1N5j55Q7J7p1
$$ -163 -22 5 -168 12 -117 66 64 -258 268 -50 224 -38 -2 15 -11 17 -78 135 84 139 -16 71 88 17
7182A7j68K12j74K14K6l3p8j68L07j1j5j23J36l5n04M18J51k39r2J63r1j05J2
$$ 17 -151 61 -113 101 127 94 16 -152 155 144 129 6 142 107 -397 21 172 -67 -159 4 -87 -192 -180
7205a80K99k71J31p6R6L2k28J41nJ86l1J00k61j03L07k76L29j21J13k01J31j13
$$ -180 119 -152 -21 -97 -1 31 -197 -56 -61 125 94 194 -67 -170 137 -139 190 69 182 -19 112 -1
7227aj45K84j78Q1J47k54K04l96L01J50l9k94J20J0n1J78k24J37O3l24L68l50
$$ -1 -146 138 -40 41 188 -66 138 -258 43 193 154 -140 -20 -10 -61 117 -107 30 93 -231 137 -213
7249b13J8J47j04j40L74k06R6J8L8r2J38Ol1J54o4j18K4k29M13p4j63Q1J15j54
$$ -213 -195 -48 -152 -292 82 -124 -28 -10 28 -64 74 80 49 203 139 21 45 -184 229 155 -8 73 188 34
7273C4j26N98m00j40J7J71j46J95k10M7R7J26l25Q3J41j90m7O6k9L63nk22j39
$$ 34 -92 506 106 -34 -17 154 8 203 -7 40 137 263 -62 21 162 -28 -75 -9 -38 325 320 98 -41
7296d1k2J5J23n2lJ14j31l31M30n8J8N9k01N8Q1k4m9o1J52k03J79j50n6n7J97
$$ -41 -63 -48 75 23 20 134 3 -328 102 44 62 121 -80 -22 59 35 -14 -75 77 -126 53 -97 -153 -210 -13
7321a3L5k21M19k47J91l25r1j3J56l2M40m75M0j03J79j1m6K53j98J00l03R2L39
$$ -13 22 -199 220 -27 164 -161 -252 -265 -109 -141 299 -176 -136 -239 -60 -71 -117 136 -62 38 -265 -173 166
7344A66J10j73n9j42jJ57j00p0j00R2J3L6L05j32j49p4R0K00k11n4J75k86J68
$$ 166 276 103 44 -98 -99 58 -42 -112 -212 -120 -107 -71 234 102 -47 -121 -31 169 -42 -96 79 -207 -39
7367c9L46k23o8Q0k01K12J3Pj64l6K46j29l7N7J54l81K11j55k8J09m0K55k83N3
$$ -39 307 84 16 96 -105 107 120 127 -37 -73 173 44 7 64 218 -163 48 -107 -135 -26 -66 189 -94 -41
7391d1K65l49K11J2Q5j23k67L27m2J57l81J29r6j0k5l8J00m2J33o0J0J20J03O7
$$ -41 224 -125 86 98 183 60 -207 120 78 235 -146 -17 -113 -123 -148 -186 -86 -128 5 -55 -45 75 178 245
7415B45kk92J05q3o3K35L4j18n53K47L2L15k83J45j19L59n2j23R1k81L31j70L66
$$ 245 243 -49 56 -27 -90 145 179 61 -492 -245 -213 102 -181 -36 -155 204 152 29 120 -161 170 0 366
7438C66l27J48m24L24J45j73l41K34LJ24j75J57J26j22QK7m3j0J13R4k05J30k3
$$ 366 39 187 -237 87 232 59 -282 -48 -45 79 -96 61 187 65 73 100 57 47 160 254 49 179 156
7461A56k12N7K57j38K4J12r6k04o1Q2j81L69j65J15p6P1j23O2J1j75l4Rj2K34
$$ 156 -56 1 258 120 144 256 160 -44 -105 -23 -204 165 0 115 39 110 -13 49 60 -115 -149 -140 -152 82
7485H2l5j38L3J83K8k7k07J89k37J77o8k20k5J78L80l97oPp6M24n87M15j26Q9
$$ 82 47 -91 -58 125 153 126 -81 108 -129 48 -20 -240 -265 -87 293 -104 -110 -103 -179 245 -342 73 -53 36
7509C6j98L23j93M9J7k09K77m0R7k91J52q9j26J53J06L9p8P6N6j21j20J52k2r4
$$ 36 -162 161 -32 17 34 -175 102 62 159 -132 20 -69 -195 -42 64 103 25 101 157 36 -84 68 46 -48
7533d8L8k92N06k20j05K79q7N4j2j86L01l15K32k78K85N3J5m8Om3l15Q3J42J19
$$ -48 -10 -302 204 -16 -121 158 71 125 113 -73 228 -87 145 -133 152 205 220 172 178 135 -180 -97 45 164
7557A64Pj2l2J7j12L81o59L78j41n1K9K18j76K7j41J83q8rL7J71m37Q2JK02n9
$$ 164 171 159 127 144 32 413 -246 132 -9 -60 -31 187 11 38 -103 80 -8 -17 20 191 -246 -164 -163 39 -20
7582b0k4J53J31j21k71K73j75J80j49l63K19N99l94n2n0J75Q8l12M5j44L8J25
$$ -20 -44 109 240 119 -152 121 -54 126 -23 -386 -167 432 38 -14 -64 111 199 -113 -68 -212 -174 -49
7604d9j66J55J16J2NKq7O3r3J17j95ON6j22M81p2L8k6j30Q1k35k56J98K12j94
$$ -49 -215 -60 56 68 73 75 -12 51 -42 75 -120 -114 -58 -180 301 229 267 241 111 192 -43 -299 -101 111 -83
7629h3J69n1J01j95N8P0om2j11Q8J05J06k20lq4J15L14m75K38k0k47R4m8J50K74
$$ -83 86 35 136 -59 -1 69 63 21 -90 -2 103 209 -11 -14 -98 17 331 -144 94 74 -173 -79 -127 23 297
7654B97r4k14L70m31r2M9J4k36MN15n0j20Lk0k6J08j36k01J30J88p9M9k28K0K46
$$ 297 203 -11 359 -72 -164 -115 -101 -337 -333 182 132 12 15 -5 -31 77 -59 -260 -130 58 -21 28 -200 -180 66
7679F6k53PL57k39l09O39l51j56L03m8N7j93J5J57j68q7Q5J27K25l06K10J6k93
$$ 66 -187 -180 177 -62 -371 268 -83 -239 64 16 73 -120 -105 52 -116 -203 -118 9 234 -72 138 154 -139
7702a39J85j61j00L50N0k82l2J33J05J44m20K09P1r8Q9k03K60j10K3R1k68M7O
$$ -139 46 -115 -215 135 185 -97 -129 4 109 253 -167 42 113 15 104 -99 161 51 74 165 -103 -56 -50
7725e0K5p6L02o6k81K62j90L5j44J77K64m05K8j02L14p0j45K88L7k74J99J91m05
$$ -50 -25 -101 201 135 -146 116 -74 -39 -183 -6 258 -147 -119 -221 93 23 -122 166 203 -71 128 319 -86
7748h6r9P7P2lj44K97q0M8k38M56l38O6j01K23r1j48l3q0P4K70K02o02L75k20
$$ -86 -185 -108 -36 -39 -183 114 34 82 -156 300 -38 28 -73 150 59 -89 -122 -202 -128 142 344 -258 117 -103
7772a03J55Pj14N0j5o1j3J36j70K76pr8k9l66K59J30l5k53L61Mj9k31R0K4l12
$$ -103 52 59 -55 -5 -20 -81 -94 42 -128 148 141 43 14 -352 -93 37 2 -251 110 114 95 -136 -46 -22 -334
7797c34L39j4J70k64K09k18Q8RK95k95j74J80J00j70J00o3Pl0j12J70m8K21k71
$$ -334 5 -9 161 -103 106 -112 -24 -15 280 -15 -189 -9 91 -79 21 -42 -35 -65 -177 -7 -55 166 -105
7820a05k37J22J73LJ99l49K92j08R9n6q5j60M24l02O5q0j04K68N6j60j47L05k10
$$ -105 -342 -220 -47 -44 155 -194 98 -10 89 33 -52 -212 212 -90 -25 -105 -209 59 115 -45 -192 113 -97
7843i7j00Q6J64j01J06p3j05N6K21O6m8n0l69J95J64k6Pj30j32J41J79m27N06
$$ -97 -197 -111 53 -48 58 -15 -120 -64 157 223 175 125 -244 -49 115 89 96 -34 -166 -25 154 -273 233
7866B33l05p2J27r8j1J32K33j84N9k52K84N0l85K96j14o4P2J09k22r1J52R7L4
$$ 233 -72 -144 -17 -115 -126 6 239 55 114 -138 146 196 -189 107 -7 -71 1 110 -112 -203 -51 46 80
7889H0p1l95N12j24M3oqj5J02j47LJ19j19J15jJ37j40K2l8k1J12j94M6p8J38M5
$$ 80 9 -386 126 2 45 39 31 16 118 -29 -26 93 -26 89 88 225 85 107 69 48 160 -34 12 -66 72 117
7915A17l0k7k9J4l46L38K38j13j24j33M96q08N24m5j60L7J86j38J25j20q2J42
$$ 117 87 60 31 45 -301 37 275 162 38 -95 401 -407 117 72 -88 -51 135 -3 122 2 -80 62
7937F2J03J08j99j61N4m3QPJ95J33o6k01l04L26k8k0J51j04j40ml5J62o7J04j91
$$ 62 165 273 74 -87 -33 -76 -68 -61 134 267 201 0 -304 22 -6 -26 125 21 -119 -123 -158 4 -63 41 -150
7962a50R6J60J59n43K05J44r1O0k42J62K02l66L34L10n38O2R3j73L6Q5J40j34
$$ -150 -54 106 265 -278 -73 71 -20 40 -202 -40 162 -204 130 440 -98 -36 57 -116 -80 5 145 11
7984A1J81j44J15Q9m38K12j39L9J22j97K54p5l8O7N7Q1l10J8J56k71K67j58Q4
$$ 11 192 48 163 252 -186 26 -113 -74 48 -149 105 30 -8 59 116 197 -113 -95 61 -210 57 -101 -17
8007a7R5j13J6J32j35J64%k88J8K03j12k3o1J67K8j22k6o6O1r3l9K00J9j1n9k7
$$ -17 78 -35 -19 113 -22 142 142 -146 -128 75 -37 -60 -121 46 74 -48 -74 -140 -79 -172 -211 -11 8 -3 -62 -89
8033h9K10N7k33m5j41K66Q5p2j46K35r6j73k20K96k1J22R0J06j83J65l26J90k4
$$ -89 121 178 -55 -100 -241 25 110 38 -108 127 31 -142 -362 -66 -87 35 125 231 48 213 -113 77 53
8056E3n0p9k13J63O8N7K76m4k50J10j76J97j96L61m40P3J44lJ64J56k54q2k41
$$ 53 3 -76 -289 -126 -58 -1 275 231 -19 91 -85 112 -84 277 -163 -90 54 51 215 371 117 35 -206
8079b06J51K46j18j7L27o18m6N40k65J16L7k69J69j43J75jl22M05p1j37J28J12
$$ -206 -55 191 73 56 383 -235 -281 259 -6 110 147 -122 47 -96 79 78 -244 161 90 -47 81 193
8101A93k43k9o1J23K48j32k52l82N48l4K1r6k16L12p5K43m71J01M8K84m8k08m0
$$ 193 -50 -79 -140 -17 231 99 -153 -535 13 -21 0 -96 -312 0 -75 168 -303 -202 -154 130 82 -126 -166
8124a66M1J34p9rj05J97J15k52J95p7m7lm3J97k30J40q4J77k5R5j36P1j8j37M5
$$ -166 -125 9 -70 -79 -184 13 128 -124 71 -6 -53 -56 -99 98 -132 8 -76 101 76 171 35 106 88 -49 -4
8149dj8J25j94L2M4j00J0Q6m2J10l34L64j18J17l13K18O9j31J73m1JJ9k62M15
$$ -4 -22 103 -91 -59 -15 -115 -105 -19 -61 49 -285 79 -39 78 -235 -17 52 -79 94 53 54 73 -189 226
8173B26l40J73k53K46J5l30R2j90O70k65l25K01O4r0J24J45j02m4
$$ 226 -114 59 -194 52 67 -263 -171 -361 309 44 -281 -80 -16 -106 18 163 61 17
8191A7
$$ Imaginary data points
##PAGE= N=2
##DATA TABLE= (X++(I..I)), XYDATA
0@%%%%%%%%%%%%%%Qj6J6j6J6k4L2l2M0m8N6o7P5q8J03j18J34j53J74j96K20k48
$$ 0 0 0 0 0 0 0 0 0 0 0 0 0 0 0 8 -8 8 -8 8 -16 16 -16 24 -24 32 -35 40 -48 55 -63 71 -82 92 -104 116 -132
36a32K79l11L48l89M33m80N32n88O49p17P90q73R64j060J168j287J419j567J730
$$ -132 147 -164 184 -205 228 -252 280 -308 341 -376 414 -459 505 -555 613 -674 745 -822 908
55I08j915K128k374K662l002L410l916M558n403O565q270J1020j6131K8619j09779
$$ 908 -1007 1121 -1253 1409 -1593 1817 -2099 2459 -2944 3621 -4649 6371 -9760 18859 -90920
70i0920j27842L15704l6261k12677J35856Q9082j91153O7986J60388j67050q3183
$$ -90920 -218762 96942 60681 -151996 -16140 72942 -118211 -50225 110163 -56887 -140070
81a40070J98903l1465j47905J18222N5666j54198M7278J21177j14096n7510J21872
$$ -140070 58833 27368 -120537 -2315 53351 -100847 -53569 67608 -46488 -103998 17874
92A7874k7481p5883Q7232M64j00305P9456O5587j18357j271J04483o3939l9594
$$ 17874 -9607 -85490 1742 2206 -98099 -18643 46944 -71413 -72684 31799 -32140 -71734
104g1734J11325l3655j08176J05178P0387j27807N93J03291o7068k7199J16648
$$ -71734 39591 5936 -102240 2938 73325 -54482 -53889 49402 -17666 -44865 71783
115G1783n3172j12504J25361P3714j49969m194J31533n9620o4401J03412j4406
$$ 71783 18611 -93893 31468 105182 -44787 -48981 82552 22932 -41469 61943 47537
126D7537r5490Q5481M9642j14144K0928R7732q3552m2281J16106k8271j04107
$$ 47537 -47953 37528 87170 -26974 -6046 91686 8134 -34147 81959 53688 -50419
137e0419Q4319M9318j04742K2037P2292q6892j1780J09512o1652r1646J09833
$$ -50419 33900 83218 -21524 513 72805 -14087 -25867 83645 21993 -69653 40180
148D0180L1183j22205L9768Q3269j03173j6274J24819n7001j01213J06495M1615
$$ 40180 71363 -50842 -11074 72195 -30978 -47252 77567 20566 -80647 25848 67463
159F7463j15766K8722Q2134q6613j8102J10109m8867q9861R7149L7197j08198
$$ 67463 -48303 -19581 62553 -24060 -42162 67947 19080 -70781 26368 63565 -44633
170d4633K2073P9872o6018k9052P7574k6004n5888O1303P039o6671M2113M0028
$$ -44633 -22560 57312 -8706 -37758 39816 13812 -42076 19227 26266 -40405 1708 41736
182D1736p4267L188P3656m2997m3393O1460j980n1776M8943J7826p2918L0379
$$ 41736 -32531 -29343 44313 1316 -42077 19383 17403 -34373 14570 32396 -40522 -10143
194a0143O7450o8988k9271Q6071j9130o8123O4658K8640q4297K3717P5742o4933
$$ -10143 57307 -11681 -40952 45119 25989 -42134 22524 51164 -33133 -9416 66326 1393
206A393l5883Q5590j5004p0781N9835L1483p8908J9594O8944n9424l3121P8316
$$ 1393 -34490 51100 36096 -34685 25150 56633 -22275 -2681 66263 6839 -26282 52034
218E2034j2922o8577N1025L3332o6462J0845N1583m5908j6984N7024k7268m6025
$$ 52034 39112 -29465 21560 54892 -11570 -725 50858 4950 -12034 44990 17722 -28303
230b8303N8230J1650o9055K5454M9212n5587j3721N7462l0216l8032N7205k267
$$ -28303 29927 41577 -27478 -2024 47188 -8399 -22120 35342 5126 -32906 24299 22032
242B2032o2874L9332M0248o7744l729O8403l7945m4992O2324L354o4269L5412
$$ 22032 -40842 -1510 38738 -29006 -32735 35668 -2277 -47269 15055 18409 -45860 -10448
254a0448L8868o0886k165O1675l5691m0300N7773J493n7411L4563L3480n6050
$$ -10448 28420 -32466 -34631 27044 -8647 -48947 8826 10319 -47092 -12529 20951 -35099
266c5099K482N4281l5212l1707N1331j392m5990L3197K2476m8321J3944M2476
$$ -35099 -32617 21664 -13548 -45255 6076 4684 -41306 -8109 14367 -33954 -20010 22466
278B2466m2611j6006N5501j4881m4189M2956J9530n1204J5670M1496m1854j1071
$$ 22466 -20145 -36151 19350 4469 -39720 3236 22766 -28438 -12768 28728 -13126 -24197
290b4197N3511k1750l9223M9477J2519n6119K1084M4539m3727j4493N2323j7626
$$ -24197 29314 7564 -31659 17818 30337 -25782 -4698 39841 -3886 -18379 33944 16318
302A6318l8258M3496J1387n0122K1279L7521m2275q978M6387k0082l2585M0980
$$ 16318 -21940 21556 32943 -17179 4100 41621 -654 -9632 36755 16673 -15912 25068
314B5068O044m4647K2873K9928m1467l591M0982k4364k4531L9257k433l8780K6931
$$ 25068 31112 -13535 9338 39266 -2201 -5792 35190 10826 -13705 25552 23119 -15661 11270
327A1270K1126m3807L975M0542l0943k2880M2961n232l9445K7432J8674m1468
$$ 11270 32396 -11411 -7436 33106 2163 -20717 22244 17012 -22433 4999 23673 -17795
339a7795P258L6079l1460j9092M2983p896l9744K9591J8963m0632O636L4013k8824
$$ -17795 -10537 25542 -5918 -25010 17973 10077 -29667 -76 18887 -21745 -15109 18904 -9920
352i920j5544L7190q892l2426K8888J3717l7288J0404L0101k9817j0269L5524
$$ -9920 -25464 11726 2834 -29592 -704 13013 -24275 -13871 16230 -13587 -23856 11668
364A1668j2570k6642L0339Q377l4438J4715K5492l0542m759L4876j7403k2172
$$ 11668 -902 -27544 2795 11172 -23266 -8551 16941 -13601 -18360 16516 -887 -23059
376b3059L3857K274l4187J9833K3401l2519j808L4661j8302k0925L3340Q3l2596
$$ -23059 10798 13072 -21115 -1282 22119 -10400 -12208 22453 4151 -16774 16566 16649 -15947
389a5947K1821J9202l2952K227L2412k0976j8770L2020j845l0131K1363J5843
$$ -15947 5874 25076 -7876 -5649 26763 5787 -12983 19037 17192 -12939 8424 24267
401B4267l1113M564K7069k3179j2804K9614o629k6284K2688J0767l0629P031K3952
$$ 24267 -6846 -2282 24787 1608 -11196 18418 11789 -14495 8193 18960 -11669 -4638 19314
414A9314k4468r497K9255j0988k3071K4155O585k9363J0270K0606k5067n729K8672
$$ 19314 -5154 -14651 14604 3616 -19455 4700 11285 -18078 -7808 12798 -12269 -17998 10674
427A0674j3472k2192K6255M516k8788J2169J8985k4896k660K6738j5129j9459
$$ 10674 -2798 -24990 1265 5781 -23007 -10838 8147 -16749 -19409 7329 -7800 -27259
439b7259K6626K284k7634J4427J7353k5919m51K5618j6480j6020K6090K57k5209
$$ -27259 -633 1651 -25983 -11556 5797 -20122 -20573 5045 -11435 -27455 -1365 -1108 -26317
452b6317J6684J4066k5699L363K4652j8747j2512K7526k681k2695J8766J1146
$$ -26317 -9633 4433 -21266 -17903 6749 -11998 -24510 3016 335 -22360 -3594 7552
464G552k4663P212K2742j9230r527K7495m926k0677K1274P470k4431J0964K1401
$$ 7552 -17111 -9899 12843 -6387 -15914 11581 6655 -14022 7252 14722 -9709 1255 22656
477B2656k1805o936K7096q056j8806K1639M743k4446J3279J8337k4177l459K5572
$$ 22656 851 -6085 21011 12955 -5851 15788 20531 -3915 9364 27701 3524 65 25637
490B5637j2497j6632K2984J265k5438J4824J6399k5630j892K3904j5220j3694
$$ 25637 13140 -3492 19492 20757 -4681 10143 26542 912 -980 22924 7704 -5990
502e990K3500k742k4473J6749J4256k5551l79K2812j5136j1969K3272m608k2756
$$ -5990 17510 14768 -9705 7044 21300 -4251 -4630 18182 3046 -8923 14349 9741 -13015
515a3015J7030J2406k4189J580K0821j5485j0129K1751m582k1500J6911J0365
$$ -13015 4015 16421 -7768 -6188 14633 -852 -10981 10770 6188 -15312 1599 11964
527A1964k2754L156J7913j5587q142K0342o285j8343J6288P882k1159M893J6291
$$ 11964 -10790 -7634 10279 -5308 -13450 6892 607 -17736 -1448 6434 -14725 -9832 6459
540F459j7663n026K0957q546j6452J7749N702j9943P936J4311j8847p09K2234
$$ 6459 -11204 -16230 4727 -3819 -20271 -2522 3180 -16763 -8827 5484 -13363 -14072 8162
553H162j2175j4801K2496K515k1736J2814J3950k0752J798K3177j4813j3673K5475
$$ 8162 -4013 -18814 3682 6197 -15539 -2725 11225 -9527 -7729 15448 635 -13038 12437
566A2437j206k2942J7061J3221k4644L492K4042j7661j2923K4864k152k3005J7151
$$ 12437 11231 -11711 5350 18571 -6073 -2581 21461 3800 -9123 15741 13589 -9416 7735
579G735J1635k5292L882K2057j8181j1190K3246m365k0025J6167Q872k3144L929
$$ 7735 19370 -5922 -2040 20017 1836 -9354 13892 9527 -10498 5669 14541 -8603 -4674
592d674J9426j6384r161K0267n131j6344J5211N304j9848O023J5895j6106n991
$$ -4674 14752 -1632 -10793 9474 4343 -12001 3210 8514 -11334 -5311 10584 -5522 -11513
605a1513J8694n933j5089J5056M103j8137P426J2396j5226k687J7035r027j2941
$$ -11513 7181 1248 -13841 1215 5318 -12819 -5393 7003 -8223 -10910 6125 -2902 -15843
618a5843J6895K813j8978Q618J2376j6714j602J7586j1191j1413J8889P03j9463
$$ -15843 1052 3865 -15113 -6495 5881 -10833 -12435 5151 -6040 -17453 1436 2139 -17324
631a7324J1337J1863j9396J082J9789j3514j1626K2972j482k0225J4873J1451
$$ -17324 -5987 5876 -13520 -12438 7351 -6163 -17789 5183 3701 -16524 -1651 9800
643I800k1409L834K1433j5890j0821K4600l315k0725J8170J0718k3687N355K2350
$$ 9800 -11609 -7775 13658 -2232 -13053 11547 8232 -12493 5677 16395 -7292 -1937 20413
656B0413j6960j0690K3283l460j8992J6860Q447k2482O859J9341j7947q734K2092
$$ 20413 3453 -7237 16046 12586 -6406 10454 18901 -3581 3278 22619 4672 -4062 18030
669A8030n053j7370J5937N709j9507O429J4962j7046m552J8542q197j3314J6084
$$ 18030 12977 -4393 11544 17253 -2254 4175 19137 2091 -2461 16081 7884 -5430 10654
682A0654K194j8850Q326J2134j6282k386J7165r810j1810J6470J37j8556J0412
$$ 10654 12848 -6002 2324 14458 -1824 -4210 12955 3145 -8665 7805 7942 -10614 -202
695b02J1053j7775l77J7031j1669j1335J8672o40j9787J1453J2140j8918r99J7973
$$ -202 10851 -6924 -7301 9730 -1939 -13274 5398 4758 -15029 -3576 8564 -10354 -11353 6620
709F620j1797j0440J8405j892j8440J2764J1419k0424M98J9016j2423j0475J9329
$$ 6620 -5177 -15617 2788 896 -17544 -4780 6639 -13785 -13287 5729 -6694 -17169 2160
722B160j659j7585J2965R199j8370L129J7502j4315q162K1348m102j7931J5145
$$ 2160 501 -17084 -4119 5080 -13290 -10161 7341 -6974 -15136 6212 2110 -15821 -676
735f76Q360j8832N463J6177j5177o139K0905n698j6705J6447O443j9180P401J5450
$$ -676 7684 -11148 -5685 10492 -4685 -10824 10081 4383 -12322 4125 10568 -8612 -1211 14239
749A4239j6453m919K0017o412j5476J5875N203j7961O962J4054j6298l657J8388
$$ 14239 -2214 -7133 12884 6472 -9004 6871 12074 -5887 1075 15129 -1169 -4826 13562
762A3562p991j3258J6459K477j7803P992J2764j6125l518J7157q154j1290J5362
$$ 13562 5571 -7687 8772 11249 -6554 1438 14202 -1923 -5441 11716 3562 -7728 7634
775G634j94j6640R910J0344j7092j094J6914r129j1475J5327O9j6370J0267R311
$$ 7634 7440 -9200 710 11054 -6038 -7132 9782 653 -10822 4505 4574 -11796 -1529 7782
789G782j6542J94J5839j0528r807J5979q06j6611J0928R787j6902P31J5811j0944
$$ 7782 -8760 -8566 7273 -3255 -13062 2917 2111 -14500 -3572 6215 -10687 -9956 5855 -5089
803e089q575J6548k038j4756J1550P943j6255K876J4433j2069o111J7001l853
$$ -5089 -13664 2884 846 -13910 -2360 5583 -10672 -7796 6637 -5432 -11543 5458 1605
816A605j3932J3022O515j5944M160J3271j2050m124J5952n170j2512J4229M880
$$ 1605 -12327 695 7210 -8734 -4574 8697 -3353 -7477 8475 3305 -9207 5022 9902
829I902j6383N733J3558j3163l511J6048n867j1587J3207L984j5368O916J1437
$$ 9902 -6481 -748 12810 -353 -3864 12184 6317 -5270 7937 11921 -3447 3469 14906
842A4906j3445k860J5634p191j1325J4077K727j4793O344J0331j3177k292J4275
$$ 14906 1461 -1399 14235 7044 -4281 9796 12523 -2270 4074 14405 1228 -1064 13211
855A3211p258r835J2918J313j4336P154Q759j3493p73J3372q167r254J2935L18
$$ 13211 5953 -3882 9036 10349 -3987 3167 11926 -1567 -2340 11032 2865 -6389 6546 6864
869F864j3746P477P693j4099R42J2804r520p734J3568j727j3614Q828P498j4313
$$ 6864 -6882 595 8288 -5811 -4869 7935 -1585 -9319 4249 2522 -11092 -2264 5234 -9079
883i079R44J2778r610o821J3089k186j2767J0338N894j4067K419J2478j0415o033
$$ -9079 -8135 4643 -4967 -11788 1301 -885 -13652 -3314 2580 -11487 -9068 3410 -7005 -13038
897a3038J3439k572j1863J0699M728j3014L636J0921r938m157J3404m091r984
$$ -13038 401 -2171 -14034 -3335 1393 -11621 -7985 2936 -7002 -11159 2245 -1846 -11830
910a1830J0896L881j2967M972J0255j0214k401J2309m504q809J0762K751j1991
$$ -11830 -934 2947 -10020 -5048 5207 -5007 -7408 4901 397 -8412 2350 5101 -6890
923f890N609R286j0592j568J2392n456q366J0907K067j1752N881Q180j0417j449
$$ -6890 -1281 8005 -2587 -4155 8237 2781 -5585 5322 7389 -4363 1518 9698 -719 -2168
937b168J1770o326p521J0987O65j1330O218P476j0797j160J0953o193p104J0393
$$ -2168 9602 3276 -4245 6742 7407 -3923 2295 9771 -1026 -2186 8767 2574 -4530 5863
951E863K61j0793O529N990j0840L24J0190p116n435J0134j087r917O901M918j0582
$$ 5863 6124 -4669 1860 7850 -2990 -2666 7524 408 -5027 5107 4020 -5897 1004 5922 -4660
966d660J066R969p876m747J0442k383r447P681M178j0796K049R460q174m892J0698
$$ -4660 -3594 6375 -1501 -6248 4194 1811 -7636 45 4223 -6573 -4524 4936 -3238 -8130 2568
981B568k274q937P641L949j0261K394Q624p997l842J0640k629q597Q494L230r489
$$ 2568 294 -8643 -1002 2947 -7314 -4920 3704 -4293 -8135 2505 -124 -8721 -227 3003 -6486
996f486L208P692p507k365R423l069o565Q267J828r023M514O726p768r23R202
$$ -6486 -3278 4414 -3093 -5458 3965 896 -5669 2598 4426 -4597 -83 6643 -1125 -2048 7154
1011G154m280n575Q001J299q489M743N944q218k63Q444m760n433Q470R5q514N145
$$ 7154 2874 -2701 5300 6599 -1890 2853 8797 579 316 8760 4000 -1433 7037 7132 -1382 3763
1027C763N478q535r3P658m760n079P392k08p585M768M078p743l4P098m862m407
$$ 3763 9241 706 613 8271 3511 -1568 5824 5616 -1969 2799 6877 -866 -900 6198 1336 -3071
1043c071P177p81p080M572L666p398Q60O057n550k651O661j861o353N477J816
$$ -3071 4106 3325 -3755 817 4483 -2915 -2055 4002 -1548 -4199 2462 601 -5752 -275 1541
1058A541p168J891N801o156j986O984k894n931O051J487p324K950N101o274j743
$$ 1541 -5627 -3736 2065 -4091 -6077 907 -1987 -7918 -1867 -380 -7704 -4754 347 -5927 -7670
1073g670O943k814n454O065J708p114L339M727n888q47O116k610m153O286M38
$$ -7670 -727 -3541 -8995 -2930 -1222 -8336 -4997 -270 -6158 -7005 -889 -3499 -7652 -1366 -928
1088i28n717L446L754n020L76N012k523k894N459Pm803L959K966m968P59N498
$$ -928 -6645 -3199 555 -4465 -4089 923 -1600 -4494 965 972 -3831 128 3094 -1874 -1115 4383
1104D383l675k423N926r34m800L832K829n101Q64N122l876k441N643o37n114L613
$$ 4383 708 -1715 4211 3277 -1523 2309 5138 37 901 6023 2147 -294 5349 4712 -402 3211
1120C211K572n115P22M771m283k087N045p21m651L233K254m903J241L461m070
$$ 3211 5783 668 1390 6161 1878 -209 4836 4115 -536 2697 4951 48 1289 4750 680
1135F80q89M453k199l355M007J49m319K123K866m794J75M457l547k405M626j260
$$ 680 -209 4244 2045 -1310 2697 2846 -1473 650 3516 -1278 -1103 3354 -193 -2598 2028 768
1151G68m565M122K131n930J076M673l708k987N370j414m257M430J261n234J209
$$ 768 -3797 325 2456 -3474 -2398 2275 -1433 -4420 950 -464 -4721 -291 970 -4264 -3055
1166c055M468l662j865M365p03l718L331J577m028J266L241k775p18K809m08k005
$$ -3055 1413 -2249 -4114 251 -452 -4170 -839 738 -3290 -2024 1217 -1558 -2276 533 125 -1880
1182a880K372M24k533J480K655k780m23L591j769j330K709j0l093K500K180l240
$$ -1880 492 916 -1617 -137 2518 -262 -685 2906 1137 -193 2516 2506 -587 1913 4093 853
1198H53M08L142k339k193M119k94m415L089K594l615q03L577j645k544M228n72
$$ 853 1261 4403 2064 -129 3990 3696 -719 2370 4964 1349 546 4123 2478 -66 4162 3590
1214C590m490L009K398m171k70L289k528j906M000r44m168L256J222m143J067
$$ 3590 -900 2109 4507 336 66 3355 827 -1079 2921 1977 -2191 1065 2287 -1856 -789
1229g89K735l619n78M035k848l219M261nm419K552K326m618L10M271l385k873
$$ -789 1946 -1673 -2251 1784 -1064 -4283 -22 -27 -4446 -1894 432 -4186 -3876 395 -2990 -5863
1245e863M820p33m029L113J877m847P76M168k982k472M292N9l808K951J375l811
$$ -5863 -1043 -1776 -5805 -2692 -815 -5662 -4886 -718 -3700 -6172 -1880 -1821 -5629 -2678 -1303 -5114
1261e114J367L030k324j670L574l10k307K101R69k542J748K322k701j02L001j072
$$ -5114 -3747 -717 -3041 -4711 -1137 -1447 -3754 -1653 -684 -3226 -1478 844 -1857 -1959 1042 -30
1277c0j992L044L59k775J937K651k993q26M297j817k386L818L97l758K398K914
$$ -30 -2022 1022 1381 -1394 543 3194 201 -625 3672 1855 -531 3287 3684 -74 2324 5238
1293E238l767p80M325j578l002L937M22m363K329L158l893j149M333j966k369
$$ 5238 1471 691 5016 3438 436 4373 4795 432 2761 5919 2026 877 5210 3244 875
1308H75L513m93l857K829K083m245K00L799l366j548L680j082l653L292J189m814
$$ 875 4388 3895 38 2867 4950 705 905 4704 1338 -210 3470 2388 -1265 2027 3216 -1598
1324a598J622L104l947j067M380k647l114L966P96m710J805L138m577p23M533
$$ -1598 24 3128 -819 -1886 2494 -153 -3267 699 1495 -3215 -1410 1728 -2849 -3572 961
1339I61k051l406M150O50m661K103K977l615o15M081j976l011L854N08l956J869
$$ 961 -1090 -4496 -346 304 -4357 -2254 723 -2892 -3507 574 -1402 -4413 -559 -51 -4007 -2138
1355b138K837l553J94L718k478j838M073l00l464K451K561l982O97L783k619k068
$$ -2138 699 -2854 -2660 1058 -1420 -3258 815 515 -2949 -498 2063 -1919 -1222 2561 -58 -2126
1371b126M259p07l190L106K022m112O92M086l512j929N044p78m115L331K094m602
$$ -2126 2133 1426 -1764 1342 3364 -748 -56 4030 518 -1411 3633 2855 -1260 2071 4165 -437
1387d37O76L912l366j667M550j179m046L647J467m938J512L715l619j467M369
$$ -437 239 4151 785 -882 3668 2489 -1557 2090 3557 -1381 131 3846 227 -1240 3129
1402C129j805l692L739Q21m197J400K990m018p61M488k660l231L841M96m375K263
$$ 3129 1324 -2368 1371 2192 -2005 -605 2385 -1633 -2394 2094 -566 -3797 44 540 -3835 -1572
1418a572K598m439k25M225k704l158M889j97m614K916K305l989m58M238k181k771
$$ -1572 1026 -3413 -3638 587 -2117 -5275 -386 -583 -5197 -2281 24 -3965 -4423 -185 -2366 -5137
1434e137M443n2m375K722K727m277LM459k369k253M153j1l993K881K716m156M76
$$ -5137 -694 -746 -5121 -2399 328 -3949 -3946 513 -1856 -4109 44 33 -3960 -1079 1637 -2519 -2043
1451b043M522l179j613M489q17l436L345J776m239J278M127l392j840M925j294
$$ -2043 2479 -700 -2313 2176 1359 -2077 1268 3044 -1195 83 4210 818 -1022 3903 2609
1466B609l313L830J300m164J230M062m033j186M681j130m199M126J375m635J485
$$ 2609 -704 3126 4426 262 1492 5554 1521 335 5016 3886 -313 3813 5188 553 2038
1481B038L413l921j076M446j325l768L869R96m891J637L310l843j136M507k577
$$ 2038 5451 1530 454 4900 3575 -193 3676 4672 -219 1418 4728 885 -251 4256 1679
1496A679k947L583N21m522K059K756m163n53M088k830k638L904R2m402K661K590
$$ 1679 -1268 2315 2836 -1686 373 3129 -1034 -1587 2501 -329 -2967 937 1029 -3373 -712 1878
1512A878m818l52M643k962k317M015j54m412K644K532m618M31M326l384k162M587
$$ 1878 -2940 -3292 1351 -1611 -3928 87 -67 -4479 -1835 697 -3921 -3490 836 -2548 -4710 -123
1528a23n60m372L251K460m393O14M054l058j668M216o61l711L207J752m044J086
$$ -123 -683 -5055 -1804 656 -3737 -3123 931 -2127 -3795 421 -240 -3951 -744 1008 -3036 -1950
1544a950L954k944k095M509r25l234L412J836m094J044L698l530j172M539j513
$$ -1950 2004 -940 -3035 1474 549 -2685 727 2563 -1531 -487 3211 -319 -1491 3048 1535
1559A535l370L747J170l974J123L568l462r60M074j548l479L721R06m115J484
$$ 1535 -1835 1912 3082 -892 231 3799 337 -623 3451 1903 -1576 2145 3051 -1064 420
1574D20L339l796r54M293k066k968L247Q24m075J607K912l678r16M185k640k440
$$ 420 3759 -37 -991 3302 1236 -1732 1515 2339 -1736 -129 2783 -895 -1811 2374 -266 -2706
1590b706L479L66m247K346K309l888l28L647k409k377L741j47l751K434K213l810
$$ -2706 773 1139 -3108 -762 1547 -2341 -2669 978 -1431 -3808 -67 -214 -3965 -1531 682 -3128
1606c128k6L840k713k162L957Pl825K667K119m348M99L889k557j541L748n40l181
$$ -3128 -3154 686 -2027 -4189 -232 -225 -4050 -1383 736 -3612 -3113 776 -1781 -3322 426 -114 -3295
1623c295K445K075l548M43L591k407j551M054q26l152L220J419l788J478K912
$$ -3295 -850 1225 -2323 -1880 1711 -696 -2247 1807 981 -2171 1049 2468 -1320 158 3070
1638C070k363j527M368j175l227L099J374l425J130L173l084q06L598j277l011
$$ 3070 707 -820 3548 2373 -854 2245 3619 194 1324 4497 1413 607 4205 2928 -83
1653h3L357J035l748J345K604k971p86L673j853k735L229O42l364J253K254l246
$$ -83 3274 4309 561 1906 4510 1539 753 4426 2573 -162 3067 3709 345 1598 3852 606
1669F06o73L428j895k319L057N5l590J509K155k894k98K735k070j967K879j0l366
$$ 606 -67 3361 1466 -853 2204 2259 -1331 178 2333 -561 -859 1876 -194 -2161 718 708 -2658
1686b658J861J525k644m31K910k243j666K561L04k950J657J831l090l7K834j903
$$ -2658 -797 728 -1916 -2347 563 -1680 -3346 -785 -481 -3431 -1774 57 -3033 -3070 -236 -2139
1702b139k022L242R1l038J873J646l173M91K949k044j641L595l23k776K221J253
$$ -2139 -4161 -919 -828 -3866 -1993 -347 -3520 -3029 -80 -2124 -3765 -170 -493 -3269 -1048 205
1718B05k931J006K952k494r06L281q54k631K416J212l015J445K505k643m87K981
$$ 205 -2726 -1720 1232 -1262 -2168 1113 259 -2372 44 1256 -1759 -314 2191 -452 -939 2042
1734B042r53k525K786P47l071J850K312k900n23K749r52j871K162M47k389J272
$$ 2042 1089 -1436 1350 2097 -974 876 3188 288 -235 2514 1562 -309 1853 2300 -89 1183
1750A183J737k749M8K436j260j917K468l88k062J469R21k135k12K500j338j651
$$ 1183 2920 171 219 2655 1395 -522 1946 1558 -504 965 1886 -249 -461 2039 701 -950
1766i50J879Q5k129J006J064j847m30K089p95j813J860L1j968J054J368k398q7
$$ -950 929 1014 -1115 -109 955 -892 -1322 767 -28 -1841 19 50 -1918 -864 504 -1894 -1981
1783a981K313j230j705K275l6j942J379R70k212m8K500j542r89K436o03j631J579
$$ -1981 332 -898 -2603 -328 -364 -2306 -927 43 -2169 -2217 283 -1259 -2248 188 -415 -2046 -467
1800d67J086k397K95K250j543n15K187l95j808J956P18k132M83K414j627n35J722
$$ -467 619 -1778 -1483 767 -776 -1291 896 501 -1307 649 1367 -765 -282 2132 505 -30 1692
1817A692p58j138J662Q08j999J126J384j558l45J771j218p13J820j63j532R76
$$ 1692 934 -204 1458 2266 267 1393 2777 1219 874 2645 1427 714 2534 2371 839 1815
1833A815J197j613l76J775j075r54J419L7j780J032Q03j609J60J145q98j018J475
$$ 1815 3012 1399 1023 2798 1723 769 2188 2225 445 1477 2280 671 831 1976 1078 60 1535
1850A535l16j241K49R48j412O5O61m05p14P60j22j555N54J186j461l6Q80r90m20
$$ 1535 1219 -22 227 1175 -237 -172 489 84 -630 130 8 -1547 -993 193 -1268 -1304 -424 -1414 -1834
1869a834R78m89j142R81M09j350M27R23j180j02J110m62r50J006M33j266N25R67
$$ -1834 -856 -1345 -2487 -1506 -1097 -2447 -2020 -1097 -2277 -2379 -1269 -1731 -2681 -1675 -1242 -2508 -1983 -1016
1887a016j185j14J652o00q09O51O04j191Q02N55r35K19J445o67n42J235j64p34
$$ -1016 -2201 -2315 -663 -1263 -2072 -1421 -817 -2008 -1206 -651 -1586 -1367 78 -589 -1131 104 -60 -794
1905g94M50Q74q36K59R57n02l60J043j08p55R37Q2p24P49N02j159NJ241l20n79
$$ -794 -344 530 -306 -47 910 408 48 1091 983 228 1165 1247 523 1272 1774 615 620 1861 1541 962
1925I62Q65j00m54l1K54l84k17Q89j76m89J98R6n42O5K77j97l61O57k91n97M55
$$ 962 1827 1727 1273 1242 1496 1112 895 1784 1608 1119 1317 1413 871 936 1213 1016 655 1312 1021 424 879
1946H79l87l85L28J47o60P0N92n05l71N04m24o86L41P37q10j90Q72j024n8N44
$$ 879 492 107 435 582 -78 -8 584 79 -292 212 -212 -898 -557 180 -630 -820 52 -972 -1030 -486
1966d86R5o42N89K05q69L58K92p80L23R82m88m99N68L07r08O81M45q52J38J179
$$ -486 -391 -1033 -444 -239 -1108 -750 -458 -1238 -915 67 -421 -920 -352 -45 -953 -272 173 -679 -541 638
1986F38o95n67Q27k5n26Q51K10o57K38P18p87l5J055m76l47N40J56m80O01J69
$$ 638 -57 -624 203 178 -348 503 713 56 294 1012 225 190 1245 769 422 962 1118 638 1239 1408
2006A408o12P6P19k52n41L75K19o02L89O73j179J16P69q92j93Q79l65n71M64K47
$$ 1408 796 872 1591 1339 798 1173 1392 790 1179 1852 673 789 1558 666 473 1352 987 416 880 1127
2026A127q68L8L71m95k87R23m89q14N09L95r11j15M25q05K0Q76m59q36P59P5q25
$$ 1127 259 297 668 173 -114 809 320 -494 15 410 -501 -616 -191 -996 -976 -100 -559 -1395 -636 -561 -1386
2047a386k30O56n17j94Q99n87o11O20L18j010N10M33q21K79Q38p04n89J193j27
$$ -1386 -1616 -960 -1477 -1671 -772 -1359 -1970 -1350 -1032 -2042 -1532 -1099 -1920 -1641 -803 -1507 -2096 -903 -1030
2066a030q36L34R80r60M4Q25m35j31R15l26o33Q44M65r37J14J115n75n01J096
$$ -1030 -1866 -1532 -552 -1512 -1468 -643 -1078 -1209 -294 -620 -1253 -409 56 -881 -767 348 -227 -728 368
2085C68k60o40J048N48j300N82Q04n10m04J164r0j136J185K10j136N12J102j175
$$ 368 108 -532 516 1064 -236 346 1150 640 236 1400 1310 174 1359 1569 433 945 2047 872
2103H72j96J101m48o91R48M60j448N09R70r59k82J246q35o96O48L34j415L92J124
$$ 872 676 1777 1329 638 1586 2046 598 1107 2077 1118 836 2082 1247 551 1199 1533 118 510 1634
2122A634j059m73R76l75p66R20m0r61M64M87j020k60J080o37j206J534k10j449
$$ 1634 575 102 1078 703 -63 857 817 -144 320 807 -213 -473 607 -30 -1236 298 88 -1361
2140a361J025O89j495r0J591j052q57J287j21r56O00N14j131K34J158p07p67J388
$$ -1361 -336 353 -1142 -1232 359 -693 -1550 -263 -384 -1340 -740 -226 -1357 -1123 35 -672 -1439 -51
2158e1p3j323R67R06j733N81J299r46o26J200J7j036J183L64j151M13J000p42
$$ -51 -124 -1447 -480 426 -1307 -726 573 -373 -999 201 218 -818 365 729 -422 -9 991 249
2176B49o86J271l6j226J220L43j457P45J115j456l29J758p25r30J295K72j446
$$ 249 -437 834 798 -428 792 1135 -322 423 1538 82 -247 1511 786 -144 1151 1423 -23
2193b3P01Q15j172l58J371o71r18J151J59j382N84R15j291j09J296q14j116J351
$$ -23 678 1493 321 -37 1334 663 -255 896 1055 -327 257 1172 -119 -228 1068 254 -862 489
2211D89J86j596O59O82j080j18J050p02r03J321J48j682O22R45j551k8J308o94
$$ 489 675 -921 -262 420 -660 -778 272 -430 -1333 -12 136 -1546 -924 21 -1530 -1558 -250 -944
2229i44r27J437j08j241O52Q22j412k10J615r10q10J236J88j577J267N66j290
$$ -944 -1871 -434 -542 -1783 -1131 -309 -1721 -1931 -316 -1226 -2036 -800 -612 -2189 -922 -356 -1646
2246a646K66J419r96q03J853m85j070R83Q33j218N37Q28r12j73J381k07j188J052
$$ -1646 -1380 39 -957 -1760 93 -392 -1462 -479 354 -864 -327 501 -411 -584 797 590 -598 454
2264D54N09j079K23J434j180K5J081m82p41Q50O72j284M09J061r73l93J493n62
$$ 454 963 -116 107 1541 361 386 1467 985 244 1094 1766 482 891 1952 979 586 2079 1517
2282A517j033R99J75j180O61J199j431n85J845n47j505Q71P60j566O83R37j233
$$ 1517 484 1483 1658 478 1139 2338 907 322 2167 1620 115 986 1746 180 863 1800 567
2299E67o47J404k89j464J125O37j465N59Q66j506j60J223o29r25J273j28j632
$$ 567 -80 1324 1035 -429 696 1333 -132 427 1293 -213 -373 850 221 -704 569 441 -1191
2316a191J089O87j430p3J332q01r37J464p20q08O32P66j595N68J195j187m00R47
$$ -1191 -102 585 -845 -918 414 -387 -1324 140 -580 -1388 -756 10 -1585 -1017 178 -1009 -1409 -462
2334d62j45q68J035L59j547M59J147o73n54J218l07j140J096O43j113O0J346o99
$$ -462 -607 -1475 -440 -81 -1628 -1169 -22 -695 -1249 -31 -338 -1478 -382 261 -852 -792 554 -145
2352a45k59Q67p0j249J113K47j148K78J127n57l69J121m24p56P83M74j250K95
$$ -145 -404 463 393 -856 257 504 -644 -366 761 204 -165 956 532 -224 559 1033 -217 78
2370G8J174r29l46J393o58o79P27N18j509L38R48n75o95J250n74r64J043N16j361
$$ 78 1252 323 -23 1370 712 33 760 1278 -231 107 1055 480 -215 1035 461 -503 540 1056 -305
2389c05M0J189r83j33J197j089p27J136J5j126N25O05r14m74J001k46j074J071
$$ -305 -265 924 -59 -192 1005 -84 -811 325 340 -786 -261 344 -570 -1044 -43 -289 -1363 -292
2407b92Q4q87L85P24j065k98J099n98m55J137k38j196Q53O70j162K07Q69o79j72
$$ -292 -208 -1095 -710 14 -1051 -1349 -250 -848 -1303 -166 -404 -1600 -747 -77 -1239 -1032 -163 -842 -1014
2426a014R15K1q77M29P38j044K41J219q45l75P94J04q31N84O47p30k4R24k85o82
$$ -1014 -99 -78 -955 -526 212 -832 -591 628 -217 -592 202 306 -525 59 706 -24 -48 876 591 -91
2446i1O36J93p72N59Q63r51K6Q81o99l11J272l55q86M65N39o75J41P49p29l17
$$ -91 545 738 -34 525 1388 437 463 1344 645 334 1606 1251 365 830 1369 694 835 1584 855 538
2466E38N18kq08N97L57p62J40P87r59RO24k51r20O43M76j151L13M56r61R2Q85
$$ 538 1056 1054 246 843 1200 438 578 1365 406 415 1039 788 -132 511 987 -164 149 605 -356 -264 621
2487F21o52p02O68P8n67J55L91m25l57P49l09o98P32J10r12K90N69r51J13N72
$$ 621 -31 -733 -65 13 -554 -399 -8 -433 -790 -41 -350 -1048 -316 -206 -1118 -828 -259 -1210 -1097 -525
2507e25n15o6K57L37q87O59M76o97jN59j34n05O83j87p43M60L57k24K07O83p99
$$ -525 -1040 -1106 -849 -512 -1399 -740 -264 -961 -962 -403 -537 -1042 -359 -546 -1289 -829 -472 -696 -489 194 -605
2528f05RO98m4o19L79L31j37k62L91n3n28Q02O3o50O77L97m92k9N44n60j89P66
$$ -605 -596 102 58 -561 -182 149 12 -250 141 88 -440 362 425 -225 452 849 357 328 872 312 123 889
2550H89k44m53L56L14o71M60J53m51l44M88K83q07M64M00j013M65M90o71l4L66
$$ 889 645 192 548 862 191 651 804 353 9 497 780 -27 437 837 -176 289 779 108 74 440
2570D40o67R2K50k0l53p7Q25p50Q1Q8j66l25K63J38k76lm4r5j17L59j76k54N20
$$ 440 -227 -135 115 95 -258 -335 490 -260 -179 -91 -257 -582 -319 -181 -457 -460 -504 -599 -716 -357 -533 -787 -267
2593b67M5n54L81J11m12K2L49k59l5K40L29l63j04O37n33M9M59n97J47N04j67
$$ -267 -222 -776 -395 -284 -696 -674 -325 -584 -619 -379 -50 -413 -517 120 -413 -364 95 -502 -355 149 -18
2614a8j79K48M82o02K70L14l38o0N12j67p9n9M17k16j93M41k14RR4J13k75L67
$$ -18 -197 51 533 -69 201 515 177 117 629 462 383 324 741 525 332 773 559 568 662 775 500 867
2636H67O1m01J99K17j13j37K08j8l96J98N99o59j09L06k94J59P5l20j65N13l10
$$ 867 928 527 726 943 830 693 901 883 487 685 1284 625 516 822 528 687 762 442 277 790 480
2657D80l08M7j09J05n25L16P4l34K08k04j20N7J23k67q3J00l83k10N22j39l72
$$ 480 172 219 110 215 -310 6 80 -254 -46 -250 -370 -313 -190 -457 -540 -440 -823 -1033 -511 -650 -1022
2678a022R2M54m28J21J09p2k04P4L9j06K70k64K8j54OK43L0J01k78R2J61J46k1
$$ -1022 -930 -476 -904 -783 -674 -746 -950 -876 -837 -943 -673 -937 -909 -1063 -1057 -814 -784 -683 -961 -869 -708 -562 -583
2701e83o0J45J83j75J73r0K79M9R8l87L98m4J33l1J23j14N7K11p3q1L62j05j04
$$ -583 -643 -498 -315 -490 -317 -407 -128 -79 19 -368 30 -14 119 88 211 97 154 365 292 211 573 468 364
2724C64L06j69o4l1J18l3j48K24j00J55j33K60o90L75P1j23K54n9l60J6K54M5
$$ 364 670 501 437 406 524 491 343 567 467 622 489 749 59 434 505 382 636 577 217 233 487 532
2746E32k48N6j67j22J88K03m05J02R7p9N5k03M9j72j61L29l87L26j58o5k55K55
$$ 532 284 340 173 51 239 442 37 139 236 157 212 9 58 -114 -275 54 -333 -7 -165 -230 -485 -230
2768b30J44m25K92M6l39k0J92k01J97o2J85j97K87k87j16L06J01k58K4J96Q6j67
$$ -230 -86 -511 -219 -173 -512 -532 -340 -541 -344 -406 -221 -418 -131 -418 -534 -228 -127 -385 -361 -165 -79 -246
2790b46M57j83j76Q9J23j74N8L18j01K8K11k7o3J57K8l19N45J45k71k74K01k44
$$ -246 211 28 -148 -59 64 -110 -52 266 165 193 404 377 314 471 499 180 725 870 599 325 526 282
2812B82m8j7O71n63J36K40n9m24L89l59j98K72J24k89P7O6q0j22J66L5l87J48
$$ 282 234 217 888 325 461 701 642 218 607 248 50 322 446 157 234 300 220 98 264 299 -88 60
2834F0K68k97J94K7O2m22P2k06k83L86M6r9j46K67n79j36K20K23m23N09k25l07
$$ 60 328 31 225 252 314 -108 -36 -242 -525 -139 -93 -192 -338 -71 -650 -786 -566 -343 -766 -257 -482 -789
2856g89K41K50p32J64L40k82n6J55J08J2l31O47o92J33K84j20j44M01K6j01J67
$$ -789 -548 -298 -1030 -866 -526 -808 -864 -709 -601 -589 -920 -273 -965 -832 -548 -668 -812 -411 -385 -486 -319
2877c19P7k18PL21k56J14L70r6j76l9K03j9j16M45q8k44K48J73k77R3K22j48R5
$$ -319 -242 -460 -453 -132 -388 -274 96 0 -176 -215 -12 -31 -147 298 210 -34 214 387 110 203 425 277 372
2900C72M42k93l12L08J20m58N54q0o12M78L34k95k67O47k96l61L66q7l56R7L78
$$ 372 814 521 209 517 637 179 733 653 41 519 853 558 291 938 642 281 647 560 204 301 679
2921F79l75k90R99o35n31M76P9j93j11L02n03j42L70j12k81L89j15m88L26K10
$$ 679 304 14 1013 378 -153 323 402 209 98 400 -103 -245 125 13 -268 121 6 -482 -156 54
2941E4j47k64L34k30j94L42M8j74l23K76J32l10K11l0l13J09N26n10J76K17n16
$$ 54 -93 -357 -23 -253 -447 -105 -57 -231 -554 -278 -146 -456 -245 -275 -588 -479 47 -463 -287 -70 -586
2962e86K17L46R6m98J72K78m60N46j79M8NK35l58Q9L91j02m98L30K39l79J26L52
$$ -586 -369 -23 73 -425 -253 25 -435 111 -68 -20 -15 220 -138 -49 342 240 -258 72 311 -68 58 410
2984D10qm03L37P9k65k4O03n83J65J46j25l00N86j54k75O0J82m06N23k78j96r3
$$ 410 402 -1 336 415 150 126 729 146 311 457 332 32 618 464 189 249 431 25 548 270 74 -19
3006a9M64l52J05kK08k69m4ol24P1L43m35l10M55N0n5k63N15m09J71k05K71l53
$$ -19 445 93 198 196 404 135 91 85 -239 -168 175 -260 -570 -115 -65 -120 -383 132 -277 -106 -311 -40 -393
3029c93K99m6n47j33O28l68J25N6l24j19M50K20l29J14l6qk92O26Jn89M37r7l51
$$ -393 -94 -140 -687 -820 -192 -560 -435 -379 -703 -822 -372 -152 -481 -367 -403 -411 -703 -77 -76 -665 -228 -325 -676
3052f76L09K61M0l73L14j52k32L64L41k84J8L77l85j00N09l88p2M80j40r9k7O51
$$ -676 -367 -106 -66 -439 -125 -277 -509 -145 196 -88 -70 307 -78 -178 331 -57 -129 351 211 112 85 736
3074G36l90M0P5m7l08M22L5j57r2P58p66J02L36k70j57J33K77n17K00O2K0m6J78
$$ 736 346 386 461 414 106 528 563 406 314 1072 306 408 744 474 317 450 727 210 410 472 492 446 624
3097F24m45Q8m5K77l57l2L11l32L61j23l48J13J00K48l95m9K51m36J6L28m29m2
$$ 624 179 267 222 499 142 110 421 89 450 327 -21 92 192 440 45 -4 247 -189 -173 155 -274 -316
3119c16L51j36j35n1K91l10j67K88j74N9L46j58m16pK38j96j52N13k24j29M90
$$ -316 35 -101 -236 -287 4 -306 -473 -185 -359 -300 46 -112 -528 -535 -297 -493 -645 -132 -356 -485 5
3140Ej25k43J27J07k19K35J64l67j36O60n43J18J13Q7n3J23p5K70l51J90J39l34
$$ 5 -120 -363 -236 -129 -348 -113 51 -316 -452 208 -335 -217 -104 -17 -70 53 -22 248 -103 87 226 -108
3162a08J68K49m09K32J96m53L17J68o1j6k3k0j4k04L0Q2j35J47M6k3n5J12m27
$$ -108 60 309 -100 132 328 -125 192 360 299 283 260 240 226 22 52 134 -1 146 192 169 114 226 -201
3185b01O22J90p27K06j98J28J2J17k1k89J21J92m84L2J58m0k9J31J56k90J49J6
$$ -201 421 611 -116 90 -108 20 32 149 128 -161 -40 152 -332 -300 -142 -182 -211 -80 76 -214 -65 -49
3207d9l38jL45k96l4R4J76rl99M45k01l86N25j66j97J28K12l43K30K45k24n8M08
$$ -49 -387 -388 -43 -339 -373 -279 -103 -112 -511 -66 -267 -653 -128 -294 -491 -363 -151 -494 -264 -19 -243 -301 107
3230A07j99j25N5K67l06n4L11j92j67N29r6l19O09k47r5J15K80l18N8J46r6o9
$$ 107 -92 -217 -162 105 -201 -255 56 -136 -303 226 130 -189 420 173 78 193 473 155 213 359 263 194
3252A94R7Q8j99KR5kj3L72k67j67L63j46O8J17j6j83K7L54k61l30L69m99J17K17
$$ 194 291 379 180 182 277 275 262 634 367 200 563 417 485 602 586 403 430 784 523 193 562 63 180 397
3276C97J62j50m95L06K17l33M36p06L16k30J78l21J13K74p7k33K90j79pj1nk18
$$ 397 559 409 -86 220 437 104 540 -166 150 -80 98 -223 -110 164 87 -146 144 -35 -42 -53 -58 -276
3298b76O1J08j01j82L79k12Kj50J36j99J8J57l1k18L17J36o6k28L98n58L05j49
$$ -276 -215 -107 -208 -390 -11 -223 -221 -371 -235 -434 -416 -259 -290 -508 -191 -55 -121 -349 49 -509 -204 -353
3320c53m6J27o1K1r1K28J3P6k37J55J2L50k86k0r0J10k0O2j63M69j86j61J45J11
$$ -353 -399 -272 -333 -312 -403 -175 -162 -86 -323 -168 -156 194 -92 -112 -202 -92 -112 -50 -213 256 70 -91 54 165
3344A65m13M60P4j48j69L57m47j13N42m6j3k74L54Rm61N40m64K03nK6j07J17k30
$$ 165 -248 212 286 138 -31 326 -121 -234 308 262 249 -25 329 338 -123 417 -47 156 151 177 70 187 -43
3367d3j69L69j71K05L5J24k61k08j06L27p6J31j72%j60L41l10J23J24m2n1m06
$$ -43 -212 157 -14 191 226 350 89 -119 -225 102 26 157 -15 -15 -175 166 -144 -21 103 61 10 -396
3389c96L79j94Q7J28p9n8J37k38p3J55L16n90K81l3m6N8j19K79J57k84m7mJ09
$$ -396 -17 -211 -124 4 -75 -133 4 -234 -307 -152 164 -426 -145 -178 -224 -166 -285 -6 151 -133 -180 -184 -75
3412g5L7R2r8j9K16m56J10N99l77L8j00K66k27k1K87M9O7L4j28j04mJ89j47Q2
$$ -75 -38 54 -44 -63 153 -303 -193 406 29 67 -33 233 6 -15 272 321 388 422 294 190 186 375 228 310
3436C10j38J87Qk17K61m33N01k17j42QJ63l8N0l1P7j60J02j13J33p9k12J30k93
$$ 310 172 359 367 150 411 -22 479 262 120 128 291 253 303 272 349 189 291 178 311 232 20 150 -143
3459a43L82jm65L33K5k69p4Q0Q7N2r5j26K8qj87L27Nq3j10r3K57l3l53J02j0J64
$$ -143 239 238 -227 106 131 -138 -212 -132 -45 7 -88 -214 -186 -194 -381 -54 -49 -132 -242 -335 -78 -111 -464 -362 -372 -208
3485b08k37M02M1m31k49L88L0r6M3J90k79o6J95k5K83K1m17L42Q0j19j26K79o4
$$ -208 -445 -43 -2 -433 -682 -294 -264 -360 -317 -127 -406 -472 -277 -302 -19 2 -415 -73 7 -112 -238 41 -23
3508b3j70K30j62l6J55J70k91N02l29L45n35J95J4j52J52J27J02k73N71o92N14
$$ -23 -193 37 -125 -161 -6 164 -127 375 46 391 -144 51 65 -87 65 192 294 21 592 -100 414
3529D14k71N0j10O2N5j19j44M04k32K3J35r6L3j16J30N3k34L51j44l33J97K4j72
$$ 414 143 193 83 145 200 81 -63 341 109 132 267 171 204 88 218 271 37 388 244 -89 108 132 -40
3552d0M2j65K23j61j21M33m97O4K27j7l70J80J08k8L06j76j67K02k67jJ92M3k33
$$ -40 2 -163 60 -101 -222 211 -286 -222 5 -12 -382 -202 -94 -122 184 8 -159 43 -224 -225 -33 10 -223
3575b23m8M19j80%M4n4q5j33J30J59o7l2P9J6M5J22k58N1P0l45M63m9j03J55R7
$$ -223 -271 148 -32 -32 12 -42 -127 -260 -130 29 -38 -70 9 25 70 192 -66 -15 55 -290 173 124 21 176 273
3600B73j35Lk35N0j18M31k6r0j19l9K00K43k51M5q1j3R8J7j28Qj6j16P1k4N4k7
$$ 273 138 141 -94 -44 -162 269 243 153 34 -5 195 438 187 232 151 138 236 253 125 133 117 1 72 48 102 75
3626G5J37j2j21r5K54q3j59Q8p7J30j18Ok37K89j64N0P6O0k58J35o2j84O4J09
$$ 75 212 200 79 -16 238 155 -4 84 7 137 19 25 -212 77 -87 -37 39 99 -159 -24 -86 -270 -206 -97
3650i7j75j53K71j75j09K36J54k96J02L58l58j79K53N6j96j9L12m19L16j72j6
$$ -97 -272 -425 -154 -329 -438 -202 -48 -344 -242 116 -242 -421 -168 -112 -308 -327 -15 -434 -118 -290 -306
3671c06K54k37K6l12O99l55J70j74K08j77K45q5k7K03l31J54K5j28Q9J99j86J61
$$ -306 -52 -289 -263 -575 124 -231 -61 -235 -27 -204 41 -44 -71 132 -199 -45 -20 -148 -59 140 -46 115
3693A15k42K16k18J81K56n0k41O7L9K65k18jJ15nm8J43j68l52J94Q8Nj82L92M
$$ 115 -127 89 -129 52 308 258 17 84 123 388 170 169 284 279 231 374 206 -146 48 136 141 -41 351 355
3717C55k4p7j2n7r9Q1o6o6J0N2q7L04j23n41M56%L7m58L67Qj69MJ2K20j97k10
$$ 355 331 254 242 185 86 167 101 35 45 97 10 314 191 -350 106 106 143 -315 52 60 -109 -105 -93 127 -70 -280
3743b80M24m12K7J23J23p0Q5J1o2n4M6p2K23k32LJ00j24J44k49M0J87k62N98n77
$$ -280 144 -268 -241 -118 5 -65 20 31 -31 -85 -39 -111 112 -120 -117 -17 -141 3 -246 -206 -19 -281 317 -260
3767b60mK03J7J9K09m80J57l6J53k1o9J43kj67J80J91k70J10k22n9QJ21J09j29
$$ -260 -264 -61 -44 -25 184 -296 -139 -175 -22 -43 -112 31 29 -138 42 233 -37 73 -149 -208 -200 -79 30 -99
3791i9OJ55p1L10l17J64r8L8K78l98j92L68j19j26O3L97m47o6J38j57J24L9j01
$$ -99 -93 62 -9 301 -16 148 50 88 366 -32 -224 144 25 -101 -38 359 -88 -154 -16 -173 -49 -10 -111
3814a11O3M80l22l17m9K31L56m30L41l72J9K10l53J05j24K73j25k66M21j47M6
$$ -111 -48 432 110 -207 -256 -25 331 -99 242 -130 -111 99 -254 -149 -273 0 -125 -391 30 -117 -71
3835g1j50k7j79J77J04j38j93K75J2k19L74L0l37J19K60r2M0l6j58M2K87k31k6
$$ -71 -221 -248 -427 -250 -146 -284 -477 -202 -190 -409 -35 -5 -342 -223 37 -55 -15 -51 -209 -167 120 -111 -137
3858a37J55j63L1j22L50k36K97j19q7J05j7J42k98K92q0R8j39L44k75R7M5p0k85
$$ -137 18 -145 -114 -236 114 -122 175 56 -31 74 57 199 -99 193 113 211 72 416 141 238 283 213 -72
3881g2L45j02j67K15J8r3j46J94J43j76j96O6J25K87k89Ll03M47j12j73J40R5
$$ -72 273 171 4 219 237 144 -2 192 335 159 -37 29 154 441 152 155 -148 299 187 14 154 249
3903B49j54j22K23j16j76J79j06m8p0k0n4K3K53J16k93K53k14l0k63J93j46J35
$$ 249 95 -27 196 80 -96 83 -23 -71 -141 -161 -215 -192 61 177 -116 137 -77 -107 -370 -177 -323 -188
3925a88L07j8m25K05P3l2k78K55q8K20k4j44p8K64j06j32L9J39J38l64J57k2p9
$$ -188 119 101 -324 -119 -46 -78 -356 -101 -189 31 7 -137 -215 49 -57 -189 -150 -11 127 -237 -80 -102 -181
3948a81L21j03p5J43j20N3J67j0k59j56K58J53j15J42j26L0k02K34o9k20L77j61
$$ -181 140 37 -38 105 -15 38 205 195 -64 -220 38 191 76 218 92 122 -80 154 85 -135 242 81
3970H1j76k52N81j96k38L83N3k46K68k64l8K72n7q5l4n7l0J64k15L7j04NM05j62
$$ 81 -95 -347 234 38 -200 183 236 -10 258 -6 -44 228 171 86 52 -5 -35 129 -86 -49 -153 -148 257 95
3994I5k72K03j5N6P9k14O9l15K15j25K22k00M3J45J9N6j22j70K82k00P8j38K40
$$ 95 -177 26 11 67 146 -68 1 -314 -99 -224 -2 -202 -159 -14 5 61 -61 -231 51 -149 -71 -209 31
4017C1k35K08l70K7l7L44K09n77J31K42j20L76l21L3lk5k07K81J22j83j18K99
$$ 31 -204 4 -366 -339 -376 -32 177 -400 -269 -27 -147 229 -92 -59 -62 -87 -294 -13 109 -74 -192 107
4039A07P1l44K27n3L15j72nn6O7R8k44R0L39j48j31J46j72P0q3j7k5o8M03l58
$$ 107 178 -166 61 8 323 151 146 90 157 255 11 101 440 292 161 307 135 205 122 105 80 12 415 57
4063E7P2r3Q5k61O1L34q1j98K49O1j60J89j20k77K27j61K00l22q0R3J13Q6R5k5
$$ 57 129 36 121 -140 -79 255 174 -24 225 286 126 315 195 -82 145 -16 184 -138 -218 -125 -12 74 169 144
4087A44j79j98j1L49o3m08M06l7K7p5k40J71j44O9K37l44k57L63J60m6q9J43j50
$$ 144 -35 -233 -244 105 42 -366 40 3 30 -45 -285 -114 -258 -189 48 -296 -553 -190 -30 -76 -165 -22 -172
4110a72n2M3j83oK34J00j08O8Ql9j23k62J32L64K9L4j28j18K62k20JM16m91M0
$$ -172 -224 -181 -364 -370 -136 -36 -144 -76 -68 -107 -230 -492 -360 4 33 67 -61 -179 83 -137 -136 280 -211 -171
4134a71jL42j65N4j30j43J88j51K44l6L51K0k21l13K15k13L49k08P5j04j58L55
$$ -171 -172 170 5 59 -71 -214 -26 -177 67 31 382 402 181 -132 83 -130 219 11 86 -18 -176 179
4156A79k99K95p3Q4Kj54K7j54J76j24K05j62J95j68r6K41l39J95M4P0j06j78K28
$$ 179 -120 175 102 186 188 34 61 -93 83 -41 164 2 197 29 -67 174 -165 30 74 144 38 -140 88
4179H8j9p3j59N4Q3k1m2k20J35K1Q1K35k16K5l43K24K12q2J3j61J39j23J86J44
$$ 88 69 -4 -163 -109 -26 -47 -89 -309 -174 -153 -72 163 -53 -28 -371 -147 65 -17 -4 -165 -26 -149 37 181
4203A81o7R2k07j14O0K6j59K03j11J01K05q4j76p7oJ14J10j3J51j88K04j98M1
$$ 181 114 206 -1 -115 -55 -29 -188 15 -96 5 210 126 -50 -127 -133 -19 91 78 229 41 245 47 88
4226H8K99j08j03m8j06K22k2j12jmql4J11J88k54j09K04J11k55P4O2k34L15k28
$$ 88 387 279 176 128 22 244 222 110 109 105 97 63 174 362 108 -1 203 314 59 133 195 -39 276 48
4250D8J97k75J49j93r1J5K8RJ40j79J93k3J79k68O0M3j73n4n3p1J42QJk68K50
$$ 48 245 -30 119 -74 -165 -150 -122 -113 27 -152 41 18 197 -71 -11 32 -141 -195 -248 -319 -177 -169 -168 -436 -186
4275a86J35p3m3LR0l4P7l5k91L60r2k33J14J77k5k41M70k67m4J26j51lJ65j23
$$ -186 -51 -124 -167 -164 -74 -108 -31 -66 -357 3 -89 -322 -208 -31 -56 -297 173 -94 -138 -12 -163 -166 -1 -124
4299a24J62k94L47k57L40n05O97K1m47k42K76R6l7j37K41m2m7J70k16J86l0j95
$$ -124 38 -256 91 -166 174 -331 366 387 -60 -302 -26 70 33 -104 137 95 48 218 2 188 158 -37
4321c7K01R3l00J51k12J13J12P3k79M21j63r3n0P1L14k90j28L94k66o9M5j19o3
$$ -37 164 257 -43 108 -104 9 121 194 -85 336 173 80 30 101 415 125 -3 391 125 56 101 -18 -81
4344h1K53j54J38k70K94k46J75KM8j91N1N7j79J08q3Q6j21J73pM7j17J20n05K72
$$ -81 172 18 156 -114 180 -66 109 111 159 -32 19 76 -103 5 -78 8 -113 60 53 100 -17 103 -402 -130
4368a30j50M49k60J18J01j25k48j70L24O2j96K0L13j27j88O3K13j22K0J92j8l11
$$ -130 -280 169 -91 27 128 3 -245 -415 -91 -29 -225 -205 108 -19 -207 -144 69 -53 -33 159 141 -170
4390a70K18K1q0m8K30n2K1j68J49j8j26R3j5o3N5K06j02k97K70j51J26o7K33l36
$$ -170 48 69 -11 -59 171 119 140 -28 121 103 -23 70 55 -8 47 253 151 -146 124 -27 99 32 265 -71
4414g1J85J22l90J54J60K68n73M7J72N0k30M46p5m39Q1K89n8L7n4J5j21J45k20
$$ -71 114 236 -154 0 160 428 -145 -98 74 124 -106 340 265 -174 -93 196 138 175 121 136 15 160 -60
4437f0K66k64J4L6j39Q7q8J26J50o7k06R0n0o0J28l10J13NK9K17k01P4k15J57
$$ -60 206 -58 -44 -8 -147 -60 -148 -22 128 61 -145 -55 -105 -165 -37 -347 -234 -229 -200 17 -184 -110 -325 -168
4461a68J82k98J44N7k7j42J18j52J12Q7k35M58p5l07J83K9K00l86K93p0K2m0m3
$$ -168 14 -284 -140 -83 -110 -252 -134 -286 -174 -87 -322 136 61 -246 -63 -34 166 -220 73 3 25 -15 -58
4484e8K1J50j01M9n3o0K48j27J56o8j64J54P4j67P0K10m45L62j88l13L03j4jq8
$$ -58 -37 113 12 61 8 -52 196 69 225 157 -7 147 221 54 124 334 -111 251 63 -250 53 39 38 -50
4508e0K12R0m05L77j8j61K77j88j19J44L8j52J97l6p9j29k72M57k86R0k5J83k
$$ -50 162 252 -153 224 206 45 322 134 15 159 197 45 242 206 127 -2 -274 183 -103 -13 -38 145 143
4531A43k98J85P8k70M78k95j8P8m16L16l86J48J5j3J70K35l99K73r4J54j41J72
$$ 143 -155 30 108 -162 316 21 3 81 -335 -19 -405 -257 -242 -255 -85 150 -249 24 -70 84 -57 115
4553A15j78J49k23j2K20k71L15O5j1j50K3m6K4j86L72j78J20k25K25J46j67j33
$$ 115 -63 86 -137 -149 71 -200 115 180 169 19 42 -4 20 -166 206 28 148 -77 148 294 127 -6
4575fp9J07N2j15N8R4k67J55M3K90j62j97J59K14n38L20j98j5K47k64j26M09m08
$$ -6 -85 22 74 -41 17 111 -156 -1 42 332 170 -27 132 346 -192 128 -70 -85 162 -102 -228 181 -227
4598b27L61j41L1lK91r5l58L30l42L22Kr2j1J47k54J86l19K46J15k07n0m3j02
$$ -227 134 -7 24 21 312 217 -141 189 -153 169 171 79 68 215 -39 147 -172 74 189 -18 -68 -111 -213
4621b13K64j39j99M13j19o8j0J0j14K48l46L61l77J65K52l25J25K8j08J36r6M
$$ -213 51 -88 -287 126 7 -61 -71 -61 -175 73 -273 88 -289 -124 128 -197 -72 -44 -152 -16 -112 -108
4643a08J34j82K08k40N2N1J37o0J68j40l7J96j59L6p8r1J84r4j09K64j36r9K72
$$ -108 26 -156 52 -188 -136 -85 52 -8 160 20 -17 179 20 56 -22 -113 71 -23 -132 132 -4 -103 169
4666A69J69k77N4j10k33J41k9J71k0R9j68q3K90L8Q9m5j93K30l83K21JK54j25
$$ 169 338 61 115 5 -228 -87 -116 55 35 134 -34 -117 173 211 300 255 62 292 -91 130 131 385 260
4689B60k75K09l49L04Q0j96k18K91M9q3rR7J40l35j00J64J45p9l01oL29l06L57
$$ 260 -15 194 -155 149 229 33 -185 106 155 72 63 160 300 -35 -135 29 174 95 -206 -212 117 -189 168
4712A68j54j70M7L27m08L40k64j6Q5P4J3k13K42l51K54j17oP8K00j65j12J45n4
$$ 168 14 -156 -109 218 -190 150 -114 -130 -45 29 42 -171 71 -280 -26 -143 -149 -71 129 -36 -148 -3 -57
4735e7lR2k13K78p3j54J62k42L01k95K22L8J43k43q3j37J82l29O31j22j68J41
$$ -57 -60 32 -181 97 24 -130 32 -210 91 -204 18 56 199 -44 -127 -264 -82 -411 220 98 -70 71
4757G1j00r0M07m44j93M58K44j77J6k83k0J87L3j27R8r9J19M1m7N1q0r2K0j63
$$ 71 -29 -119 288 -156 -349 109 353 176 192 -91 -111 76 109 -18 80 -19 100 141 94 145 65 -27 -7 -170
4781a70L65k29k69L35O2l27M37Q5k01k25K51j18j98L57j7l58K27j08K82j79j66
$$ -170 195 -34 -303 32 94 -233 204 289 88 -137 114 -4 -202 155 138 -220 7 -101 181 2 -164
4802a64R8l4q3q6K96j95K75m5l53J53J57o9NP1j84K50r0P7k15J56l18L37L3j20
$$ -164 -66 -100 -183 -269 27 -168 107 62 -291 -138 19 -50 -45 26 -158 92 2 79 -136 20 -298 39 72 -48
4826d8j23K18R5k9j82K3k09J43J27J76k40J21k54J19K11k19j5r0M03j8Q9m24N1
$$ -48 -171 47 142 113 -69 -46 -255 -112 15 191 -49 72 -182 -63 148 -71 -86 -176 227 209 298 -126 -75
4849g5M7o2K65r9J80o1j43K01k81J1K01j37O0J18l15L5o7J65r3J0K06o9P5Nj67
$$ -75 -28 -90 175 76 256 195 52 253 -28 -17 184 47 107 225 -90 -55 -122 43 -50 -40 166 97 172 177 10
4874A0M2K0l18M40l31J23J29j92J11j15J73k91N4o7L24l39L28k6k30m3J62Pk81
$$ 10 52 72 -246 194 -137 -14 115 -77 34 -81 92 -199 -145 -212 112 -227 101 75 -155 -198 -36 -29 -310
4897c10L37j98J14j60m7L99k06j91M7l0o2PJ05J24k05M5L04l66K15RJ7L0j16l6
$$ -310 27 -171 -57 -217 -264 135 -71 -262 -215 -245 -307 -300 -195 -71 -276 -231 73 -293 -78 -69 -52 -22 -138 -174
4921a74K21j96J66o3k03J03K76k72J97j46L06j21r0J6J68m65L74J07J02j70k02
$$ -174 47 -149 17 -46 -249 -146 130 -142 55 -91 215 94 4 20 188 -277 97 204 306 136 -66
4942f6J70M3R2j59J64oj02j12K11j43%n9J25j08j31l6M59m27J95j69K7r1L25j3
$$ -66 104 147 239 80 244 238 136 24 235 92 92 33 158 50 -81 -117 342 -85 110 -59 -32 -123 202 189
4966A89J65l80l6lL2M5J19k62J54k9n7lk3K2R0J08K3l6k61K28J98k07n7K8l1n3
$$ 189 354 -26 -62 -65 -33 12 131 -131 23 -6 -63 -66 -89 -67 23 131 154 118 -143 85 283 76 19 47 16 -37
4992c7l10M52K3p6k77K18Q2k6j02q1J44p6Q5kJ90l16J60j58K93J3k13K09P9l25
$$ -37 -347 105 128 52 -225 -7 75 49 -53 -134 10 -66 19 17 207 -109 51 -107 186 199 -14 195 274 -51
5016e1J57j86J09P1j17j75K54K7n5j23J35LK5j55J96k94L23j6M7k11L04R9l25
$$ -51 106 -80 29 100 -17 -192 62 89 34 -89 46 49 74 -81 115 -179 144 128 175 -36 268 367 42
5039D2p3k10L61q9p9Q4K09j40Q7n5j00j79J90k45N6J70j23J11J27j33l7j23O9
$$ 42 -31 -241 120 31 -48 36 245 105 192 137 37 -142 48 -197 -141 29 -94 17 144 11 -26 -149 -80
5062h0K39q4k81K67k90l3J72K5j15M3J63k39m8O1j56M54j17j24JJ13j58L49k26
$$ -80 159 75 -206 61 -229 -262 -90 -65 -180 -137 26 -213 -261 -200 -356 98 -19 -143 -142 -29 -187 162 -64
5085f4J89j36j20n4J95J3k89K60k51M61l01l1J14k48J09J61j19p2L82k72J33p7
$$ -64 125 -11 -131 -185 10 23 -266 -6 -257 204 -97 -128 -14 -262 -153 8 -111 -183 199 -73 60 -17
5107a7j05N7J62l69K74R9q1L68o02Q8K05j06Q4P9k63N59m01k3k14M19l34M48l47
$$ -17 -122 -65 97 -272 2 101 20 388 -214 -126 79 -27 57 136 -127 432 31 8 -206 213 -121 327 -20
5130b0l8K00q9J5jj14N2j57N15m01k08K67r4J74l60M3K06L4k55L51l30J54j47
$$ -20 -58 142 53 68 67 -47 5 -152 363 -38 -246 21 -73 101 -259 -216 -10 24 -231 120 -210 -56 -203
5153b03K26r7j58K48jJ77l79K8K2M7r9L69k20j48m1R5m25M37M5N3j56R2P3p8m0
$$ -203 23 -74 -232 16 15 192 -187 -159 -137 -90 -189 180 -40 -188 -229 -134 -559 -122 -77 -24 -180 -88 -15 -93 -133
5178a33L34j20n6q7R3p0J3L29k19J42j13J7l88M0J40J46Q5j54j21L8J12n1jQ9
$$ -133 201 81 25 -62 31 -39 -26 303 84 226 113 130 -258 -218 -78 68 153 -1 -122 -84 28 -23 -24 65
5202F5O5J05J30m07J48N5r0J10q3n3O0q4l4M3K19l39J65J64l93K06p6J68j49j31
$$ 65 130 235 365 -42 106 161 71 181 98 45 105 21 -13 30 249 -90 75 239 -154 52 -24 144 -5 -136
5226a36P1rj50J79J15k34J06j3M20k96j21j15K41n7jj28j51M4L41j11l16L42o3
$$ -136 -65 -74 -224 -45 70 -164 -58 -71 349 53 -68 -183 58 1 0 -128 -279 -235 106 -5 -321 21 -42
5249d2l07L72j33L3K35l37J40j06L31j12k03R2l56L84pj1n0p2j62K93K5J4l03
$$ -42 -349 23 -110 -77 158 -179 -39 -145 186 74 -129 -37 -393 -9 -16 -27 -77 -149 -311 -18 7 21 -282
5272b82M04j80k25L89k94N6J21m9J3Q4J55o9L4R8n2K8k97L20k25R4l7j51N8J6
$$ -282 122 -58 -283 106 -188 -132 -11 -60 -47 37 192 123 157 255 203 231 -66 254 29 123 86 -65 -7 9
5296IK09L4j26p3k7K38o3l36L07J77k85m8K01p7j39j16L70o2L6l89J39J37m6p4
$$ 9 218 252 126 53 26 264 201 -135 172 349 64 16 217 140 1 -115 255 193 229 -160 -21 116 70 -4
$$ [...]
8191h0
##END NTUPLES=NMR FID
##END=
