##TITLE=1H_Ser 6-5-V
 CDCl3,8 sc, 
 27.10.2021
##JCAMPDX= 6.0         $$ Bruker NMR JCAMP-DX V2.0
##DATA TYPE= NMR FID
##DATA CLASS= NTUPLES
##ORIGIN= UXNMR, Bruker Analytische Messtechnik GmbH
##OWNER= root
$$ XWIN-NMR		Version 3.5
$$ Wed Oct 27 11:30:49 2021 Russian Standard Time (UT+4h)  she@DPX200
##.OBSERVE FREQUENCY= 200.1313468511
##.OBSERVE NUCLEUS= ^1H
##.DELAY= (6, 6)
##.ACQUISITION MODE= SIMULTANEOUS
##.ACQUISITION SCHEME= undefined
##.AVERAGES= 8
##.DIGITISER RES= 18
##SPECTROMETER/DATA SYSTEM= spect
##.PULSE SEQUENCE= zg30
##.SOLVENT NAME= D2O
##.SHIFT REFERENCE= (INTERNAL, D2O, 0, 15.7039)
##AUDIT TRAIL= $$ (NUMBER, WHEN, WHO, WHERE, WHAT)
$$ ##TITLE= Audit trail, XWIN-NMR		Version 3.5
$$ ##JCAMPDX= 5.01
$$ ##ORIGIN= Bruker BioSpin GmbH
$$ ##OWNER= she
$$ F:/spectra/data/she/nmr/H-F/1/audita.txt
$$ ##AUDIT TRAIL=  $$ (NUMBER, WHEN, WHO, WHERE, WHAT)
(   1,<2021-10-27 11:29:37.10 +0400>,<she>,<DPX200>,
      <created by zg, POWCHK disabled, PULCHK disabled
       configuration hash MD5:
       00 E9 B6 7A A2 85 ED C7 34 08 36 98 17 FE 4E 26
       data hash MD5: 16K
       1E 54 56 CB 83 E6 BE 8C F9 CD F2 62 1A 36 41 3E>)
$$ ##END=
$$ 
$$ hash MD5
$$ C9 FE 5B E6 D5 F7 05 35 83 76 EA 5E AA 97 61 58
##$RELAX= 
##$RELAX= 
##$RELAX= 
##$RELAX= 
##$RELAX= 
##$RELAX= 
$$ Bruker specific parameters
$$ --------------------------
##$DU= <F:/spectra>
##$EXPNO= 1
##$NAME= <H-F>
##$PROCNO= 1
##$TYPE= <nmr>
##$USER= <she>
##$AMP= (0..31)
100 100 100 100 100 100 100 100 100 100 100 100 100 100 100 100 100 100 
100 100 100 100 100 100 100 100 100 100 100 100 100 100 
##$AQSEQ= 0
##$AQ_mod= 1
##$AUNM= <au_zg>
##$AUTOPOS= <>
##$BF1= 200.13
##$BF2= 200.13
##$BF3= 200.13
##$BF4= 200.13
##$BF5= 200.13
##$BF6= 200.13
##$BF7= 200.13
##$BF8= 200.13
##$BYTORDA= 1
##$CFDGTYP= 0
##$CFRGTYP= 5
##$CHEMSTR= <none>
##$CNST= (0..31)
1 1 145 1 1 1 1 1 1 1 1 1 1 1 1 1 1 1 1 1 1 1 1 1 1 1 1 1 1 1 1 1 
##$CPDPRG= <>
##$CPDPRG1= <>
##$CPDPRG2= <>
##$CPDPRG3= <>
##$CPDPRG4= <mlev>
##$CPDPRG5= <mlev>
##$CPDPRG6= <mlev>
##$CPDPRG7= <mlev>
##$CPDPRG8= <mlev>
##$CPDPRGB= <>
##$CPDPRGT= <>
##$D= (0..31)
0 1.2 0 0 0 0 0 0 0 0.06 0 0.03 0 0 0 0 0.0002 0 0 0 0 0 0 0 0 0 0 0 0 
0 0 0 
##$DATE= 1635319776
##$DBL= (0..7)
120 120 120 120 120 120 120 120 
##$DBP= (0..7)
150 150 150 150 150 150 150 150 
##$DBP07= 0
##$DBPNAM0= <>
##$DBPNAM1= <>
##$DBPNAM2= <>
##$DBPNAM3= <>
##$DBPNAM4= <>
##$DBPNAM5= <>
##$DBPNAM6= <>
##$DBPNAM7= <>
##$DBPOAL= (0..7)
0.5 0.5 0.5 0.5 0.5 0.5 0.5 0.5 
##$DBPOFFS= (0..7)
0 0 0 0 0 0 0 0 
##$DE= 6
##$DECBNUC= <off>
##$DECIM= 32
##$DECNUC= <off>
##$DECSTAT= 4
##$DIGMOD= 1
##$DIGTYP= 9
##$DL= (0..7)
0 120 120 120 120 120 120 120 
##$DP= (0..7)
150 150 150 150 150 150 150 150 
##$DP07= 0
##$DPNAME0= <>
##$DPNAME1= <>
##$DPNAME2= <>
##$DPNAME3= <>
##$DPNAME4= <>
##$DPNAME5= <>
##$DPNAME6= <>
##$DPNAME7= <>
##$DPOAL= (0..7)
0.5 0.5 0.5 0.5 0.5 0.5 0.5 0.5 
##$DPOFFS= (0..7)
0 0 0 0 0 0 0 0 
##$DQDMODE= 0
##$DR= 18
##$DS= 0
##$DSLIST= <SSSSSSSSSSSSSSS>
$$ [...]
##$SUBNAM2= <"">
##$SUBNAM3= <"">
##$SUBNAM4= <"">
##$SUBNAM5= <"">
##$SUBNAM6= <"">
##$SUBNAM7= <"">
##$SUBNAM8= <"">
##$SUBNAM9= <"">
##$SW= 18.0517286264689
##$SWIBOX= (0..15)
0 0 2 0 0 0 0 0 0 0 0 0 0 0 0 0 
##$SW_h= 3612.71676300578
##$TD= 16384
##$TD0= 1
##$TE= 0
##$TE2= 300
##$TE3= 300
##$TEG= 300
##$TL= (0..7)
0 120 120 120 120 120 120 120 
##$TP= (0..7)
150 150 150 150 150 150 150 150 
##$TP07= 0
##$TPNAME0= <>
##$TPNAME1= <>
##$TPNAME2= <>
##$TPNAME3= <>
##$TPNAME4= <>
##$TPNAME5= <>
##$TPNAME6= <>
##$TPNAME7= <>
##$TPOAL= (0..7)
0.5 0.5 0.5 0.5 0.5 0.5 0.5 0.5 
##$TPOFFS= (0..7)
0 0 0 0 0 0 0 0 
##$TUNHIN= 0
##$TUNHOUT= 0
##$TUNXOUT= 0
##$USERA1= <user>
##$USERA2= <user>
##$USERA3= <user>
##$USERA4= <user>
##$USERA5= <user>
##$V9= 5
##$VALIST= <valist>
##$VCLIST= <CCCCCCCCCCCCCCC>
##$VD= 0
##$VDLIST= <DDDDDDDDDDDDDDD>
##$VPLIST= <PPPPPPPPPPPPPPP>
##$VTLIST= <TTTTTTTTTTTTTTT>
##$WBST= 1024
##$WBSW= 4
##$XGAIN= (0..3)
0 0 0 0 
##$XL= 0
##$YL= 0
##$YMAX_a= 102607
##$YMIN_a= -180406
##$ZGOPTNS= <>
##$ZL1= 120
##$ZL2= 120
##$ZL3= 120
##$ZL4= 120
##$ABSF1= 10
##$ABSF2= 0
##$ABSG= 5
##$ABSL= 3
##$ALPHA= 0
##$AQORDER= 0
##$ASSFAC= 0
##$ASSFACI= 0
##$ASSFACX= 0
##$ASSWID= 0
##$AUNMP= <proc_1d>
##$AZFE= 0.1
##$AZFW= 0.1
##$BCFW= 1
##$BC_mod= 2
##$BYTORDP= 1
##$COROFFS= 0
##$CY= 11.3945322036743
##$DATMOD= 1
##$DC= 2
##$DFILT= <>
##$DTYPP= 0
##$F1P= 2.36226072786647
##$F2P= -0.459571619588291
##$FCOR= 0.5
##$FTSIZE= 0
##$FT_mod= 4
##$GAMMA= 1
##$GB= 0.15
##$INTBC= 1
##$INTSCL= 1
##$ISEN= 128
##$LB= 0.24
##$LEV0= 0
##$LPBIN= 0
##$MAXI= 10000
##$MC2= 0
##$MEAN= 0
##$ME_mod= 0
##$MI= 1.114404
##$NCOEF= 0
##$NC_proc= 0
##$NLEV= 6
##$NOISF1= 3.799351
##$NOISF2= 2.8
##$NSP= 1
##$NTH_PI= 0
##$NZP= 0
##$OFFSET= 15.70392
##$PC= 1
##$PHC0= -15152.04
##$PHC1= 11.40082
##$PH_mod= 1
##$PKNL= yes
##$PPARMOD= 0
##$PSCAL= 0
##$PSIGN= 0
##$REVERSE= no
##$SF= 200.130013532006
##$SI= 16384
##$SIGF1= 3
##$SIGF2= 2
##$SINO= 400
##$SIOLD= 16384
##$SREGLST= <1H.CDCl3>
##$SSB= 0
##$STSI= 0
##$STSR= 0
##$SW_p= 3612.71676300578
##$SYMM= 0
##$S_DEV= 0
##$TDeff= 0
##$TDoff= 0
##$TI= <>
##$TILT= no
##$TM1= 0
##$TM2= 0
##$TOPLEV= 0
##$USERP1= <user>
##$USERP2= <user>
##$USERP3= <user>
##$USERP4= <user>
##$USERP5= <user>
##$WDW= 1
##$XDIM= 8192
##$YMAX_p= 0
##$YMIN_p= 0
$$ End of Bruker specific parameters
$$ ---------------------------------
##NTUPLES= NMR FID
##VAR_NAME=  TIME,          FID/REAL,        FID/IMAG
##SYMBOL=    X,             R,               I
##VAR_TYPE=  INDEPENDENT,   DEPENDENT,       DEPENDENT
##VAR_FORM=  AFFN,          ASDF,            ASDF
##VAR_DIM=   8192,          8192,            8192
##UNITS=     SECONDS,       ARBITRARY UNITS, ARBITRARY UNITS
##FACTOR=    0.0002768,     1,               1
##FIRST=     0,             0,               0
##LAST=      2.2672688,     0,               0
##MIN=       0,             -180406,         0
##MAX=       2.2672688,     102607,          0
$$ Real data points
##PAGE= N=1
##DATA TABLE= (X++(R..R)), XYDATA
$$ [...]
1758D6J1Q8m57k86J77N85P7J1j53m3j83J67O01M55p63J11k23j61J62J29J98m43
1780A06l29J3k36K42J71P1m37j72l0J5P23p2l70k10r0J72N43J89J4m53R3j56L04
1803A01N50m61l21j56j32J46N88j70K9o86N6NM09J64m82J7j4K31M7L24J5r5n47
1826c82K78L15J60K24l4k27k53jp5L63J18k76k2m19P3L19J80k42m86N7K25nP1
1849c9P4j95k38l3M82k2J43j14j52j65o2M50P6L5m98j60L55o2J43N84m31n51L41
1872c9j94L16M79k19m32j32L44j35J19j9j6l67K82L6J96j41m94M1J05L3L23l80
1894b94M17k52j87j9K21K95J93J2l91Q4k75J26K57J90k91k78J4R6k36L94J55o11
1916c80K06j58K0N76l18j1N3r4L98K2j21P0j90K09j81N75q6j23k62p0J5L21j29
$$ plain form
1758 46 57 145 -312 -598 -421 164 241 252 99 56 -127 40 641 1096 333 444 221 60 222 351 549 106
1780 106 -223 -210 -446 -204 -33 38 -399 -571 -601 -586 137 65 -305 -515 -605 -433 110 299 313 -140 -47 -203 101
1803 101 651 190 -131 -287 -419 -273 315 145 174 -512 -456 -451 -42 122 -360 -343 -357 -126 -79 245 260 165 -382
1826 -382 -104 211 371 595 561 334 81 80 5 368 486 210 188 -231 -158 161 341 99 -387 -330 -105 -110 -39
1849 -39 35 -160 -398 -431 51 29 172 58 -94 -259 -321 129 205 240 -258 -418 -63 -125 18 602 171 -380 -39
1872 -39 -233 83 562 343 -89 -221 123 -12 107 88 72 -295 -13 23 219 78 -416 -375 -270 -237 86 -294
1894 -294 123 -129 -316 -335 -114 181 374 386 -5 79 -196 -70 187 377 86 -192 -178 -82 -318 76 231 -380
1916 -380 -174 -332 -312 264 -54 -65 -12 -106 292 314 193 263 73 282 101 676 590 467 205 135 150 471 342
1939C42j93k81J0O1J18l19J8J5k34L70l21M04k53N4k05L06j31K60K73k60J93n8
1961A69K8OJ52j14m7k3k46M0n11K42O5j22R9j13j48J09L09j30k58K17L37k96M88
1984B53p2K29l00j98L87K95k82lk52K21n52L81j61N0q0j8j35K96n3j44l01K52
2006a87J92l2K07m57K88j65K79P9L00k78J4r3k93M1OJ97J98j43l72K5J08Q8K51
2029B53m51J99j61j13L55J1P0m06N36l72P5K90M7l38P0m71L57R5J44j46j40j08
2051b04R1j61K73R3j61R3l9k65K63L25O1m03P3O0O2J32m6j73m36K12J90l4J63
2074A69k28k59p6n1M01k9J01j11l62L60J58R5r5j85M4K50P1K85r2j02k31jp6K43
2098B79m8l61M79p18J81j87J99J09n4p3Q0l91K66M29k77l8R2j0M70l52L14q6m0
$$ plain form
1939 342 149 -132 -122 -61 57 -262 -244 -229 -463 -93 -414 -10 -263 -209 -414 -108 -239 21 294 34 227 169
1961 169 197 203 355 241 194 171 -75 -35 -546 -304 -239 -361 -262 -375 -523 -414 -105 -235 -493 -276 61 -235 253
1984 253 181 410 110 -88 299 594 312 309 57 278 -274 107 -54 -4 -84 -102 -237 59 6 -138 -439 -187
2006 -187 5 -27 180 -277 11 -154 125 204 504 226 240 147 -146 -105 -99 98 296 153 -219 -194 -86 2 253
2029 253 -198 1 -160 -273 82 93 163 -243 293 -79 -4 286 333 -5 65 -406 -49 46 190 44 -96 -204
2051 -204 -113 -274 -1 92 -69 24 -15 -280 -17 308 369 -34 39 99 161 293 247 74 -362 -150 40 6 169
2074 169 -59 -318 -394 -445 -44 -73 28 -83 -445 -85 73 168 73 -112 -68 182 253 538 446 344 113 112 36 279
2098 279 231 -130 349 -369 -188 -375 -176 -67 -121 -194 -114 -505 -239 190 -87 -125 -33 -43 427 75 389 303 263
2121B63j75J15J35L3n8m39J35m79M64M8j49j44k60j44N31J75j96k09K17j66l5
2142c38L72J99l20PJ23k7J73K08J60k53l38K8R7j85K87q8j09J0k29p6L15J43j1
2165A48l66q5L67j57P6J04mk44R4Q9K46ol04l83J88J66K01N3O6l86n4J73q5M17
2189C14k32l97J23j63J7K23K6J76m09J30P7J07J38J85n07L28l86M43J01K84m43
2210A35J05m34K92K05j51j4j75K9N0j3L46j35j24j41q2J66j08m5L06k92k58K05
2232a33J56j52K44j41k28J33j29J78QK63k66oj25L23J52m2k73k1L9J53j44K92
2254B81m7j92j96j47K48N2j00O7j93N9K64j64j4K18n4k41o6L65mJ26l07K36k69
2277g8J9j07N03j54j60j41R3J57j89J83k79p2q5L05L97r0k18k1m54M88J37rj6
$$ plain form
2121 263 88 203 338 371 313 -126 9 -470 -6 42 -107 -251 -511 -655 -124 51 -145 -354 -137 -303 -338
2142 -338 34 233 -87 -80 43 16 189 397 557 304 -34 -6 91 -94 193 105 -4 6 -223 -299 16 159 148
2165 148 -218 -303 64 -93 -17 87 83 -161 -67 22 268 262 -42 -425 -237 -71 130 183 249 -137 -191 -18 -103 314
2189 314 82 -315 -192 -355 -338 -115 -89 87 -322 -192 -115 -8 130 315 -192 136 -250 193 294 578 135
2210 135 240 -194 98 303 152 138 -37 -8 42 29 375 240 116 -25 -107 59 -49 -94 212 -80 -338 -133
2232 -133 23 -129 115 -26 -254 -121 -250 -72 -64 199 -67 -73 -198 125 277 235 -38 -59 -20 133 -11 281
2254 281 234 42 -154 -301 -53 -1 -101 -34 -227 -168 96 -68 -82 136 82 -159 -225 140 136 262 -45 191 -78
2277 -78 -59 -166 337 183 23 -118 -25 132 -57 126 -153 -225 -310 -5 392 302 84 63 -391 97 234 225 209
2300B09l23M2j47J54L46O5l58k8M9k7M68l33ML11m07J03L6m7Kj84P2j22L7R2K1
2325C5k71P0M8o3K3J00j93L53j72J2L34k74K68j16j6j29M3M7r4r1J38k84L3J10
2349h9l2K38l09k1k6l9L3K99j3l03L03N3j98K34J14j77n3N8K71k6o5L2k53N4M0
2374A25%Q3k30J21j45j76J0K81p7M2j91k39K66O5M9m5j04R1K19k65L11J8j43k47
2398a81P0J33K66l30m0J86M4k2o3J90l26J00j58o8k7L72k57K99k21l1J8K09r0
2421G3q1j34R1k73O5K16L73m55o1L9J56QO6j00j91J41J1K07k23K6M4R9l14K97
2445H0n2o9K5m7M1J46j81K21j52N0J87l95L63j14j04R6n6%n1J66k39K88j99K96
2469C00k81P1J66R3l48K69k61J22r8J9nj02Nm8O8J70l2l17JK27k84K06J55o2r1
$$ plain form
2300 209 -114 -72 -219 -65 281 346 -12 -40 9 -18 450 117 121 432 25 128 164 117 119 -65 7 -115 -78 14 35
2325 35 -236 -166 -118 -181 -158 -58 -251 102 -70 -58 276 2 270 154 138 9 52 99 5 -86 52 -232 -199 -89
2349 -89 -121 117 -192 -213 -239 -278 -245 54 41 -262 41 94 -104 130 244 67 14 72 343 317 252 284 31 85 125
2374 125 125 208 -22 99 -46 -222 -212 69 -8 34 -157 -396 -130 -65 -16 -61 -165 -74 145 -120 191 209 66 -181
2398 -181 -111 22 288 -42 -82 104 148 126 63 253 -73 27 -131 -199 -226 146 -111 188 -33 -64 -46 163 73
2421 73 -8 -142 -51 -324 -259 -43 330 -125 -186 -147 9 17 83 -17 -208 -67 -56 151 -72 -46 -2 97 -217 80
2445 80 28 -41 -16 -63 -22 124 -57 164 12 62 249 -146 217 103 -1 95 39 39 -12 154 -85 203 4 300
2469 300 19 90 256 349 1 270 9 131 33 52 47 -55 -50 -98 -30 140 108 -209 -208 19 -265 -59 96 34 -57
2494e7j33J00J56M6K02l30m2K92j12j98J20j6m1j49j1K45k0j46J1j9j06J87m17
2517d38N10k20k01L04L2k22J86J77l14J29L67J33k70K35j90j40pj14J87j10j39
2538a05J18j67J57J16j51LJ4k20N8J29JL2N7j01J85k21M8N03k06o1l66M02k53
2561b8K08n8k38O1j20K62k06M65m58J66j95J47r3L14j10m29J46J04J30j49K00
2582A19J13n36p4L75Qm1q8K21k90K53k9K59l22Lj01J63j0j79J64J06j45k01M03
2605A71m47L19K01k52P6j77K15j28J02j73Q9m8j87L44p5L2p6jj22J94Q7K0j23
2628D1k18J13J41J08j28J17l1k14%J55M0m6j93j35K34q3O3P4%j87j22oK87o1j1
2653f2Q0p5r3L7K23K26j97j28j36J51K32o3r5Ll37L52j42j35K20o6m8j52J55k7
$$ plain form
2494 -57 -190 -90 66 112 314 -16 -58 234 122 -76 44 28 -13 -162 -173 72 52 -94 -83 -102 -208 -21 -438
2517 -438 72 -148 -349 -45 -13 -235 -49 128 -186 -57 310 443 173 408 218 78 71 -43 144 34 -105
2538 -105 13 -154 3 119 -32 -29 -15 -235 -177 -48 -47 -15 42 -59 126 -95 -47 456 250 189 -177 225 -28
2561 -28 180 122 -116 -55 -175 87 -119 346 -112 54 -141 6 -87 227 117 -312 -166 -62 68 -81 119
2582 119 232 -304 -378 -3 5 -36 -124 97 -193 60 31 290 -32 -29 -130 33 23 -156 8 114 -31 -232 171
2605 171 -276 43 244 -8 68 -109 106 -22 80 -93 -4 -52 -239 105 30 62 -14 -15 -137 57 144 164 41
2628 41 -177 -64 77 185 57 174 143 -71 -71 84 124 78 -115 -250 -16 -99 -36 38 38 -149 -271 -277 10 -51 -62
2653 -62 18 -57 -150 -113 110 336 139 11 -125 26 258 195 100 103 -234 118 -24 -159 61 -5 -53 -205 -50 -77
2677g7j59K11K2n6J08n5m7J90N1j52j42K36j12L26j78J1M2M9l76K06O5j38l15
2700b90L4q3L90k09K19l73R5J69NK26r2k16R8o3J5L46j91P3Qj70Q7j57R7M6j43
2725g9K08k58LP3J97l54j2J41j78K98n7K9l31L9J37K6J94P3L10l74K39j26P2o1
2749B09m4j19m14K59L2K33J12j88l6k15J93l0p3J44q2P1m10K66n6M70j67q1j70
2772i6P3J10L6j85K05M49o41J89N2mk42J70p4K5Pl04J59n3K13k19N8L6N2K0k94
2797b58o7M90j76j44L79j10j07j12L2j85L73n3j67k80N22j62J3J15q6j37K79j6
2819A43j31R4j25o7Q7J32l1%J6n0o9m2N3k0k03J20j4O0Qlj3O2K56l82K56j43J50
2846A44q1k94L49k50J05Q6K8k09K4O4ON1k4O1l47J39J91q2k7J08R1m92L30lnJ76
$$ plain form
2677 -77 -236 -25 -3 -59 49 -6 -53 137 188 36 -106 130 18 344 166 177 219 268 -108 98 163 25 -290
2700 -290 -256 -339 51 -158 61 -312 -217 -48 -43 183 91 -125 -27 -90 -75 271 80 153 161 -9 78 -79 18 64 -79
2725 -79 129 -129 -126 -53 144 -210 -222 -81 -259 39 -18 11 -320 -281 -144 -118 76 149 459 85 324 198 270 209
2749 209 165 46 -368 -109 -77 156 268 80 44 -171 22 -8 -81 63 -19 52 -358 -92 -148 322 155 74 -96
2772 -96 -23 87 123 -62 143 592 -49 140 192 188 -54 116 42 67 74 -230 -71 -124 89 -130 -72 -36 16 36 -258
2797 -258 -325 165 -11 -155 224 114 7 -105 -73 -258 115 62 -105 -385 137 -25 -12 103 17 -120 159 143
2819 143 12 106 -19 -86 1 133 102 102 118 68 -1 -43 10 -10 -213 -93 -107 -47 -39 -42 -55 7 263 -119 137 -6 144
2846 144 63 -231 118 -132 -27 59 87 -122 -98 -34 -28 23 -1 60 -287 -148 43 -39 -66 42 133 -359 -29 -32 -37 139
2872A39k21J20j43J16K73k10J7j39J9J79q8J5l03J29J84m22L76L3p6k2O3jj28
2895i0L9k8o9J12J22k31J57J38j21J72j06q0J2J91n6q2J21j61k46J44j27J63J48
2918A22j42j42j32N02j09J02k48j70K36j46K24j35J18m14J04M38Q5j47q7L4k96
2939b03J67M9j7j05O5P9l00n5L57j78J28j23K62MJ2j94R1J21k75K42Jj84N0j78
2963a84J87rm4m3K21k4j78j1j02K24p5J20j72Q5q7L67q6j37j9j58r6J77J08J28
2987A92R6k31k64K55o0j35K94j20mj32O3K01p6o6m7l0J98N5R5k08o5o6m0J85P
3012I7l4P6l56J79J52k28J80m5p8j07K8K12Q8j89N9p0L1J0p3K9M7j42J85r1K5
3037a5J98N4L3k47J65k1l5j19M4q9n7jQ1k32O7J02R9J1o7k9j51J49J58L0k15L17
$$ plain form
2872 139 -82 38 -105 11 284 74 91 -48 -29 150 62 77 -226 -97 87 -335 41 74 -2 -24 39 38 -90
2895 -90 -51 -79 -148 -36 86 -145 12 150 29 201 95 15 27 218 162 80 201 40 -206 -62 -189 -26 122
2918 122 -20 -162 -294 208 99 201 -47 -217 19 -127 97 -38 80 -334 -230 208 293 146 59 93 -203
2939 -203 -36 13 -4 -109 -44 35 -265 -320 37 -141 -13 -136 126 130 142 -52 39 160 -115 127 128 -56 -6 -184
2963 -184 3 -6 -50 -93 128 104 -74 -85 -187 37 -38 82 -90 -5 -92 275 189 52 33 -125 -221 -44 64 192
2987 192 288 57 -207 48 -12 -147 147 27 23 -109 -46 155 79 13 -34 -64 134 189 284 76 11 -55 -95 90 97
3012 97 63 139 -217 -38 114 -114 66 21 -57 -164 -136 76 164 -25 34 -36 -5 5 -68 -39 8 -134 51 -40 -15
3037 -15 183 237 270 23 188 167 132 13 57 -32 -89 -90 -9 -241 -174 -72 27 38 -29 -58 -209 -60 98 128 -87 230
3063B30j99R3q2r5J67K10j68j85L7k49o3J10L20L7k90o7p4J03K92k51J14l21L37
3086FJ10j14l0N1J1L8L6L7j43L1j58J35l2j11J93pj00N5J45j48j19Mj67J09K75
3111A07l8l50K04P2L4M3p6j13q9K31K0K9j52K72n3j14K18k69J63K1j97n1P7j82
3135a93J21K36q9n6O9k6k3J32j66L1K1n4j11J01P8OPl7J54j73o6J47j72l7L41
3160B41k03k9K17j27k63L76r2k55j9J33J7q0K87j96J01l22O9L1K12k17M4O3N0
3183C8j02N4O6J15j93j51O4M1k26P14l80m5J97j46O9jR4j75j38J16K06k40J48
3206A25j52Q4j95M0J47K4l17J72l6n0K26n6j56K37Q1K7j17j24J59j9j75K31k01
3229d5j48K23j09J78k43R6L2k23P1K5k7j73L37j94J83J87k60J51J65j85o0K27
$$ plain form
3063 230 31 124 42 -53 114 324 156 -29 8 -241 -304 -194 126 163 -127 -194 -268 -165 127 -124 -10 -331 6
3086 6 116 2 -28 23 34 72 108 145 2 33 -125 10 -22 -133 60 53 -47 8 153 5 -114 -110 -277 -168 107
3111 107 69 -281 -77 -5 29 72 -4 -117 -206 25 45 74 -78 194 141 27 245 -24 139 160 -37 -88 -11 -193
3135 -193 -72 164 75 19 88 62 39 171 5 36 57 3 -108 -7 71 77 84 47 201 28 -38 109 -63 -100 241
3160 241 38 9 226 99 -164 212 120 -135 -154 -21 -4 -84 203 7 108 -214 -145 -114 98 -119 -75 -12 38
3183 38 -64 -10 56 171 -22 -173 -109 -68 -294 420 40 -5 192 46 115 114 208 33 -105 11 217 -23 125
3206 125 -27 57 -138 -98 49 73 -244 -72 -108 -158 68 12 -144 93 174 201 84 -40 119 100 -75 156 -45
3229 -45 -193 30 -79 99 -144 -48 -16 -239 -168 -143 -170 -343 -6 -200 -17 170 -90 61 226 41 -19 208
3251B08j65K12m7O8j14n6j34q8O3J28J0j09K15m51K4K08j36q8K7L34j4Kq9k36
3275b28L11j66J05N0j28J53K16j45J32j75l02L12k95q4J95k64L69j36m3L4J54
3296F5o9k74J25J47K3L3n8Q4P3k88L05Q5pl6j38q4n1J20N5L3r1loJ51l06L1k5
3323a06j55L00r4q1J92p1j72J63R3j17L33j80j48No7L0n8K26j57R4kM4K7k24J01
3348b4Q0L7q0l22L01J4k01K07r0J32k30R6N9M6J3k29K93l08K38j46K0K14l33R1
3372a22N9J48k05J22J82j37L45l45J19r0j60p5K26j39J08j02o6J90P3k20P0J66
3394A47l47J49l18N75j46k45K22q3j0L23L2k63J8j68O1J99l56L74j30k09L55j53
3416B7rlj12K24k99J11M7J70n6L8j80l21K74R2n7J11l93L21n8j29K60P4m0j61
$$ plain form
3251 208 43 255 208 276 162 106 -28 -116 -53 75 85 -24 191 -260 -236 -28 -164 -252 -225 109 95 97 8 -228
3275 -228 83 -83 22 72 -56 97 313 168 300 125 -177 135 -160 -244 -49 -313 56 -80 -123 -89 65
3296 65 -4 -278 -153 -6 17 50 -8 76 149 -139 166 251 244 208 70 -14 -65 55 110 143 52 49 43 194 -112 -81 -106
3323 -106 -261 39 -55 -136 56 -15 -187 -24 69 -48 285 105 -43 -38 -105 -75 -133 93 -64 30 28 72 99 -125 -24
3348 -24 56 93 13 -309 -8 6 -195 12 -78 54 -176 -80 -21 25 38 -191 102 -206 32 -114 -94 120 -213 -122
3372 -122 -63 85 -120 2 184 47 392 47 166 76 -84 -159 67 -72 36 -66 -132 58 131 -89 -19 147
3394 147 -200 -51 -369 206 60 -185 37 -46 -56 267 299 36 54 -114 -53 146 -210 164 34 -175 180 27
3416 27 18 15 -97 127 -172 -61 -14 156 100 138 -42 -363 -89 3 -54 57 -336 -15 -73 -202 58 132 92 -69
3440f9K53o4O5k84J42j39K4j06K61P7l52J70o2j44J59m8L97k82K7KR2j07J0j98
3464a76J73m4L8J64N9Rl85J67J40K5p0J52m01R1L8k71M94k88l5R8n0l20M59k80
3488b13J98n7J9j22J22R5J09J05k64l3K57P0j89pj22k0Oj9l5K00Pm1j11k29M23
3513A49k35J92l49J55K31k97J33qJ24m31J40K02L7K51k79k21M3K02j31L36k26
3534A8j00J71j04J26k03K61p2j30P7j3l9L19j23j85J50J0m70K77K29k41J27nq5
3557eK39j53L5j07m8P1j04m4Q1R8o4L2J7m0j42K85k01KK17j6j23l9m2j66K22k
3583CJ50J01m28J53j24K32j42K47j45p0R4J24m2j29l38L31j02J59R7j07k94J78
3605e2J76j05L75m63K81k79K2J3J38J14j93k1j32M2j82L22J06j47m4K9r2L22O2
$$ plain form
3440 -69 184 120 185 -99 43 -96 -72 -178 83 160 -192 -22 -84 -228 -69 -117 280 -2 25 27 119 12 22 -176
3464 -176 -3 -47 -9 155 214 223 -162 5 145 170 100 252 -149 -58 -20 -291 203 -85 -120 -22 -72 -392 67 -213
3488 -213 -15 -72 -53 -175 -53 42 151 256 -8 -41 216 286 97 90 -32 -52 -46 -65 -100 100 107 66 -45 -274 149
3513 149 -86 106 -243 -88 143 -154 -21 -29 95 -336 -196 6 43 294 15 -206 -163 39 -92 244 18
3534 18 -82 89 -15 111 -92 169 97 -33 44 31 -8 311 188 3 153 163 -307 -30 199 -42 85 80 -5
3557 -5 234 81 116 9 -39 32 -72 -116 -35 63 -1 31 48 8 -134 151 -50 -48 169 153 30 -9 -51 -217 5 3
3583 3 153 254 -174 -21 -145 87 -55 192 47 -23 71 195 153 24 -314 17 -85 74 171 64 -230 -52
3605 -52 124 19 394 -69 212 -67 -45 -32 106 220 27 6 -126 -84 -266 56 162 15 -29 0 -92 230 292
3628B92k30r1K22l52L17j11J18M2j71L9k29o0K31J3j23K7K25k78R8k39M37l33
3650a56N3P1O8j4J92j69l0P0K0J30k10K28k20J96j37j03J03j87J08N2k31J86q3
3673f3M6j23J52qOp2M7J10k73N0K94j01O1K16j94mk17L96k40J75p1K62m15r0o0
3698a16J82K3j10M5j01J09l2J95Q5n70K86j15p3L40q3j79J23k9j04J19q0O7j45
3721a63K09j55L43j52k14N1L4j3p2J23q9j1J76o5j06K38p7N3k13n0L63k04k3m9
3745f6J38J37k86J71p0O3m4k25N1K53j33O2L24L0n30K12j07J8J81j48q8P2j20
3768a05J90JK37m65J08j99K54r7L04k24j89K11Ol8J95j22N1k95K80K2j8K47m56
3791a02L98n40K04K14J37m5j16M2k46j91P8L91k12R9j83k05K54R2J0p0j13K23
$$ plain form
3628 292 62 -29 193 -159 158 47 165 207 36 75 -154 -214 17 30 -93 -66 159 -119 -21 -260 177 -156
3650 -156 -103 -32 36 22 214 45 15 85 105 235 25 253 33 229 92 -11 92 -95 13 65 -166 20 -63
3673 -63 -17 -140 12 4 10 -62 -15 95 -178 -128 166 65 126 342 148 144 -73 323 83 258 187 449 34 -56 -116
3698 -116 66 89 -21 24 -77 32 0 195 280 -290 -4 -119 -192 148 65 -114 9 -20 -124 -5 -85 -18 -163
3721 -163 46 -109 234 82 -132 -81 -47 -60 -132 -9 -98 -109 67 2 -104 134 57 110 -103 -153 210 6 -17 -66
3745 -66 72 209 -77 94 24 87 43 -182 -131 122 -11 51 375 405 -125 87 -20 -2 179 31 -57 15 -105
3768 -105 85 86 323 -142 -34 -233 21 -76 228 4 -185 26 32 -6 189 67 118 -177 103 125 107 354 -102
3791 -102 296 -244 -40 174 311 266 150 192 -54 -245 -167 224 12 111 -72 -277 -23 69 79 9 -104 119
3813A19J23j48j10J75k59J54j44J03J40j63j0n9q1L21l29K59p1M1k61K57q1j48
3835a72N6j11O5O5j3L18j91N9m5N4k05L27j96J36K6k55J14l3K38k73j5L1rj33
3859a62J54L5j13r5M5J88q0M9J24j94K13l38J53K05k67K26j68j20J77J10o2K6
3881A06k51m2L56l32N73o10J04K8j16L5n5J48Q2o9l18J79K88j36O4n9K78l38J95
3904A10P1j20J07j87N5j40j52L50k80j50K30M6J18j69K24k3j51J38J87k30j75
3925a41J02J12l44M27j46j26K41k64j67J51P9K63k14o5M4J82j66r6J81k24M1o0
3947a90Q1k36L58J89m9j90p0J70p2j19K48P1j18k14J41O3j37J04J9p7n5K17k92
3970a58L25j63R4j09n3M20l03%j61K04k2K59j07j10j25p1J47p4j8L20m80O1J29
$$ plain form
3813 119 242 94 -16 159 -100 54 -90 13 153 -10 -20 -79 -160 161 -168 91 20 61 -200 57 -24 -172
3835 -172 -116 -227 -162 -97 -110 208 17 76 31 85 -120 207 11 147 173 -82 32 -1 237 -36 -51 -20 -29 -162
3859 -162 -8 27 -86 -181 -136 52 -28 21 145 -49 164 -174 -21 184 -83 143 -25 -145 32 142 80 106
3881 106 -145 -187 169 -163 410 -200 -96 -68 -184 -149 -204 -56 26 -43 -361 -182 106 -30 34 -25 253 -85 110
3904 110 181 61 168 -19 36 -104 -256 94 -186 -336 -106 -60 58 -111 113 90 -61 77 264 34 -141
3925 -141 -39 73 -271 156 10 -116 125 -139 -306 -155 -76 187 -27 -92 -48 134 -32 -128 53 -171 -130 -190
3947 -190 -109 -345 13 202 153 -37 -107 63 -9 -128 120 191 73 -141 0 63 -74 30 49 -28 -83 134 -158
3970 -158 167 4 98 -11 -64 356 53 53 -108 96 74 333 226 116 -9 -80 67 -7 -25 295 -185 -124 5
3993EL2O0p6j01M5J30j70J19mj07Q1j45K91k32L99j59p3p4n5q2P8r5J88k01l6
4018a82j54L05k16j03K89K1M5j98K35Mn4j19L35j21j04j40MJ94J27j91O5jJn9
4042a7j34J19n6J38k9N2N5m31L35l33L20q9J30n9p5Q0R4k06J23M1J87k57J48Q3
4066B19k12K2l9M1j97J11J08O5j13J5o2K4j09K26j24j40K75K9k6l57L24p9j82
4089a81L04r9J14m4j10J97j74j9o8l1K02RK8k27K39j14P0P8l7j9j52K85k41r7
4113h7J20l37J74J65KK60m66O5L90l96R0J4k84M26k65M7M45l91n6R9J17j94L7
4136b5J08j6qj16J38l04L54j39J25l55L51L7j34k30J71l14J97L48k22n9n4J09
4158c8J03k52J66J71n8k31J45Q1M2J65j19j45M9J44j63j40qj0K69l28q8J61o5
$$ plain form
3993 5 37 97 21 -80 -35 95 -75 44 40 -67 14 -131 160 -72 327 168 95 21 -34 -116 -38 -133 55 -146 -182
4018 -182 -336 -31 -247 -350 -61 -40 5 -193 42 46 -8 -127 208 87 -17 -157 -153 41 168 -23 42 41 42 -17
4042 -17 -151 -32 -88 50 21 73 128 -303 32 -301 19 -70 60 1 -74 6 100 -106 17 58 245 -12 136 219
4066 219 7 29 -10 31 -166 -55 53 118 5 20 -42 -18 -127 99 -25 -165 110 139 113 -244 80 1 -181
4089 -181 123 24 138 94 -16 181 7 -12 -80 -111 91 100 128 -99 140 26 96 174 137 118 -34 251 10 -87
4113 -87 33 -304 -130 35 37 297 -169 -104 286 -110 -20 -6 -290 136 -129 -82 363 -28 -84 15 132 -62 -25
4136 -25 83 67 59 -57 81 -223 131 -8 117 -238 113 150 16 -214 -43 -357 -160 188 -34 -93 -147 -38
4158 -38 65 -187 -21 150 92 -139 6 87 129 294 175 30 79 223 60 -80 -88 -98 171 -157 -245 -84 -149
4181a49J94j30J27l45R8J47J26k3n7l9jl6L38k46p6K67K08n03L7K50M0l86O1K27
4205A29k07K23k37k29L75l16j41L12J05k03Q8M3O0N4O7J3R8l68J60K3j81L95l37
4228g4J45r7K22k75l0P4j85L96r6q4KK7M0M5j61m3J08q0p8J64j30j1N6O8Q7J28
4254B18l4j68P0j32J73j22j27o6M1L54j36p4j94P5q7R4J68j29j04Q8R8N5K5j7
4278F9N0l89L26P0N6j51K26l29j13L22qM7n6j32N2q0q9M8J47j92J93j24L51o38
4302c44J95J0J44Q5k20o5J56k04L89j61j65R0J58J0k23J63M8k35K68o4P5m4M5
4325A11k96K67m5k14K91Mk00M2N7K58P0j64k62J37k49J94P0k00P0L4J2j07j17
4348b37O9J96J26l17P7K01o3J66k74Q6J14j37k0J06o5k98J72j29J66j45K31K3
$$ plain form
4181 -149 45 -85 42 -303 -205 -58 68 45 -12 -51 -52 -88 250 4 -72 195 403 -100 -63 187 227 -159 -98 129
4205 129 -78 145 -92 -321 54 -262 -403 -91 14 -189 -101 -58 2 56 123 136 234 -134 26 49 -132 263 -74
4228 -74 71 -26 196 -79 -109 -35 -220 176 80 -4 -2 25 65 110 -51 -94 14 -66 -144 20 -110 -121 -65 3 90 218
4254 218 184 16 86 -46 127 5 -122 -188 -147 207 71 -3 -197 -122 -209 -115 53 -76 -180 -92 6 61 86 69
4278 69 119 -270 56 126 182 31 257 -72 -185 137 129 176 120 -12 40 -40 -129 -81 66 -126 67 -57 294 -344
4302 -344 -149 -139 5 90 -130 -195 -39 -243 146 -15 -180 -90 68 78 -145 18 66 -169 99 35 110 66 111
4325 111 -185 82 37 -177 114 118 -82 -40 17 275 345 181 -81 56 -193 1 71 -129 -59 -25 -13 -120 -237
4348 -237 -168 28 154 -163 -86 115 52 218 -56 30 144 7 -13 93 28 -270 -98 -227 -61 -206 25 48
4370D8l24K70k14K0K54J27o7o8k10m4K11r9M37k53J57k7j43k6J32j4n0r4o4J43
4394A02k20J91j57j46K27o4M9k03K68Mk39j16L49k1J19j77j01M57k59j28J13n7
4416iJ34j34J74M8j72r6J00KJ30l24j9J00O9J22j90o1N0N1m2J87j03J23j72K46
4440B14n0n6N3k21J45k35L36j88JM4L53k04p1j57j00P4k7J34J33l42K24q8j37
4463a65J39J55k48p2K42j93O6K67k22o0Q1L31m62K91n5R3p2l10L11J57j60K6j16
4486B4J09k26m2J56j03j22K30j96%K47j29l29L59j81k3J98QP8k15L41j87J2k22
4509b13K59r6J25j77J49k2J66P4m46J44Q1m2j28M0J46R2m7k96M16j67p4J5j21
4532a22J1j2j8L19k56L4N3K3o0J4K17l25R0K05j54O6j16M4k28L44p5j62K86j63
$$ plain form
4370 48 -276 -6 -220 -200 54 181 114 46 -164 -208 3 -96 341 88 245 218 75 49 181 167 117 23 -41 102
4394 102 -118 73 -84 -230 -3 -67 -18 -221 47 51 -188 -304 45 24 143 -34 -135 322 63 -65 48 -9
4416 -9 125 -9 165 213 41 -55 45 47 177 -147 -166 -66 3 125 -65 -126 -76 -25 -67 120 17 140 -32 214
4440 214 164 108 161 -60 85 -150 186 -2 -1 43 396 192 121 -36 -136 -62 -89 45 178 -164 60 -28 -165
4463 -165 -26 129 -119 -191 51 -142 -76 191 -31 -91 -10 321 -141 150 95 188 116 -194 117 274 114 140 24
4486 24 133 -93 -135 21 -82 -204 26 -170 -170 77 -52 -381 -22 -203 -226 -28 -20 58 -157 184 -3 9 -213
4509 -213 46 -50 75 -102 47 25 191 265 -181 -37 44 2 -126 -86 60 152 105 -191 225 58 -16 -1 -122
4532 -122 -111 -123 -141 178 -78 -44 9 32 -28 -14 203 -122 -32 173 19 85 -31 13 -215 129 54 -108 178 15
4556A5l2r6q6J13O8J26l29J74M1j50J46q3P7k0j7Q4q1k04M16j5k83K77J09j54
4580I6K07m37K17l50L12R8j82l4Q7j22J06L1L0q5l0K34j44K38l92K9L8J60J2K55
4604C74j42j02j0K9j33j12K02j01l0M7p8k13J49r8j02M28j41Q0j54K59P0q5M8
4627A85j92m1J32K26j45n2j0m4p0N6k8R8j71o4K31k01k4K09N8l56qQ1L8k8j25
4652b45L78mk41K33j32L66m46Q5N2o7k4K49j96j98J99J39J68k08k6O7j82o8K14
4675A13l08K81k59J18J98j41Q9j53J99k19J43j60lJ53Q3k69L84j7m19pK07k93
4697b80R8K59j37J79J6k65J43j40J71O3M8k60k3M9P9O5r0N6j01K5J42%j17K5l6
4722c1j36NK25k80K80Q9l33K65Pj03P4j46P8N3J0K59j45k5j17J13rN4j59J17l43
$$ plain form
4556 15 -17 -113 -199 -86 -18 108 -221 -47 -6 -156 -10 -93 -16 -36 -53 31 -50 -254 162 147 -136 141 250 96
4580 96 303 -134 83 -267 45 143 -39 -73 14 -108 -2 29 59 -26 -56 178 34 272 -120 -91 -53 107 119 374
4604 374 232 130 120 149 16 -96 106 5 -25 22 -56 -269 -120 -218 -320 108 -33 47 -107 152 222 137 185
4627 185 -7 -48 84 310 165 113 103 59 -11 45 17 115 -56 -120 111 -90 -114 95 153 -203 -211 -130 -92 -120 -245
4652 -245 133 129 -112 121 -11 355 -91 -6 46 -21 -45 204 8 -190 9 148 316 108 82 149 -33 -101 113
4675 113 -195 86 -173 -55 143 2 91 -62 137 -82 61 -99 -102 51 134 -135 249 232 -187 -194 13 -280
4697 -280 -182 77 -60 119 135 -130 13 -127 44 107 155 -105 -128 -79 0 65 -25 31 -70 -45 97 97 -20 5 -31
4722 -31 -167 -162 63 -217 63 152 -181 84 91 -12 62 -84 -6 47 57 316 171 146 29 142 133 187 28 145 -198
4747a98M2J46q5k4R3O8k69K92j36J67k56J60L9k87J32J06O2J17j33J50o5k65J98
4770E4j80P6J06J84k35o9j42l0PL21k6j62J69k17K41j5l8n5J14K6O3l2J64k02
4794A22o5k8l5K73l39J78k6l65K42P9O5k25J02K6Qm1m8j69K06o1J85r3P0M87k32
4819C16j36n5p1n6j27L01j02n6O4R2J03l99L38j05l35j1J80R1j06O0J05o0j6j49
4843a34J58oJ49j9R9k30L7J03j94J71l46J03P1Q5O1l48J53O8K7l3j55P8l6q3K71
4868E0J56j71j37k72K22K04q9K05J86l55k06J95q0J30J06q4j99J57p4J65k38%
4890a29K36r8L3J5nj43K47j36j01o5j5K01l1p1n0kQ0J86j17k15J95k10J68R7M9
4915A19N5k07Q7j26K95j69M0n8j18L5K19l16L12k28J79j5k16LL36k26K2J13j75
$$ plain form
4747 -198 -156 -10 -95 -119 -26 42 -227 65 -71 96 -160 0 39 -248 -116 -10 52 169 36 186 121 -144 54
4770 54 -126 -50 56 240 5 -64 -206 -236 -229 92 66 -96 73 -144 97 82 44 -11 103 129 192 160 324 122
4794 122 57 29 -6 267 -72 106 80 -285 -43 36 101 -124 -22 4 12 -29 -77 -246 -40 -101 84 -9 61 548 316
4819 316 180 125 54 -2 -129 172 70 14 78 170 273 -126 212 107 -228 -239 -59 32 -74 -14 91 31 15 -134
4843 -134 24 18 167 148 247 17 54 157 -37 134 -212 -109 -38 47 108 -240 -87 -19 8 -25 -180 -102 -138 -221 50
4868 50 206 35 -102 -374 -152 52 -37 168 354 -1 -207 -12 -92 38 144 60 -139 18 -56 109 -129 -129
4890 -129 107 9 42 57 52 -91 156 20 -81 -146 -161 40 9 -62 -112 -114 -34 152 35 -180 15 -195 -27 70 119
4915 119 174 -33 54 -72 223 54 94 36 -82 -47 172 -144 168 -60 119 104 -112 -109 227 1 23 136 -39
4938c9M3J1K0R1p6J45k50j32K82j5n8p1M6P8l1j66J18l0j67M39l43J89j86j02
4962b04K03K3l1K4J22j16q1k27K19Q8K8R5k39K21l5j99O5l9J19l7K50p1pJ31k73
4987B9J21l7R9l89R3K4j96L25j27l9o1K57K4k18j5J8R0J40k78J95p6n4K7J20M1
5012A13n32J30J28J59o5J12k03J37j7J04q9k6j54L61j10o9j3jn8Q4J09k79K90
5035A11j65L3J44k7j76K16j50K34k21k16K35j43R5J25N3Q3k99k0r0J73p3P5j19
5058a22J46N3j35L65l06p6NK24j7k40k8J15Q0j75K27j51M6J21k61J96mj49J72
5081H6Lm8j90K89l21K88n6o9J75k11J36k30J31M9j48o8K4l7J91K36m02N4JJ24
5105GM3j25J6J64J19q1j34K17oj65oJ33M4k48J59j90M6o6Lj43L27k10J29j33%
$$ plain form
4938 -39 4 15 35 126 50 195 -55 -187 95 80 22 -49 -3 75 44 -122 -4 -34 -201 238 -105 84 -102 -204
4962 -204 -1 22 -9 15 137 21 -60 -287 -68 20 48 143 -96 125 90 -109 -44 -83 36 -1 249 178 171 302 29
4987 29 150 113 212 -177 -84 -60 -256 69 -58 -97 -158 99 123 -95 -110 -92 -2 138 -140 55 -21 -75 -48 72 113
5012 113 -419 -289 -161 -2 -67 45 -158 -21 -38 66 -23 -49 -203 158 48 -21 -34 -35 -93 -9 100 -179 111
5035 111 -54 -21 123 96 -80 136 -14 220 -1 -217 18 -125 -30 95 148 231 -68 -88 -178 -5 -78 -3 -122
5058 -122 24 77 -58 307 1 -75 -70 154 137 -103 -131 -16 64 -111 116 -35 11 132 -129 67 63 -86 86
5081 86 89 41 -149 140 -181 107 51 -18 157 -54 82 -148 -17 32 -116 -184 -160 -197 -6 230 -172 -118 -117 7
5105 7 50 -75 -59 105 224 143 9 226 220 55 49 182 226 -22 137 -53 -7 -73 -70 -213 114 -96 33 -100 -100
5130a00K06j06q6K77j20j76M0L20k71N6k02K03K75l07J97l54R6K8r0J36j16j96
5152b90M84l43P2n4J32L16m84j15K53m2k2J47P5j97J61N0l66J19L35l26K30l67
5174b32K46j8J34q7o0l7Q9r5J34j64J2L8K01j79p3J01kJ27k04R3M4J39l19n8L91
5199B21k58nk94M90O7j04k04J94l7J53m60O3o3J92j56M1N0J34j0Q0K04k07Lk40
5223a46J52L7M3p8r0L09l2l19K57j12p9J2O4j35q0J92l3j34J12J88j38K65r6j87
5247b8J54k63N6L33j36k34R6n9r0L99k85J67p4j46j61J13J45J7n4j7L6P0j46J71
5271F4qj4p0j56K14j85L17r5m6L4l2k7j44R2J88j82Q7Q5j62J23j83m2K53mj7k01
5297a11KK83k10M00m11M6L2j07K84m02N3O5K20J94l35O7j63o0K53k44R1J19l5
$$ plain form
5130 -100 106 0 -86 191 71 -105 -65 255 -16 40 -162 41 316 9 206 -148 -52 -24 -114 22 -94 -290
5152 -290 194 -149 -77 -131 1 317 -167 -282 -29 -71 -93 54 129 -68 93 143 -223 -104 231 -95 135 -232
5174 -232 14 -4 130 43 -17 -54 35 -60 74 -90 -78 -40 161 -18 -91 10 8 135 -69 24 68 207 -112 -170 221
5199 221 -37 -42 -336 154 221 117 -87 107 70 223 -237 -174 -237 -45 -201 -160 -110 24 14 94 298 91 94 -146
5223 -146 6 43 86 8 -82 227 195 -124 133 21 -58 -46 18 -117 -197 -5 -38 -172 -60 128 -10 255 159 -28
5247 -28 126 -137 -81 252 116 -118 -22 -81 -171 228 -57 110 36 -110 -271 -158 -13 4 -50 -67 -31 39 -107 64
5271 64 56 42 -28 -184 30 -155 162 67 21 55 23 -4 -148 -56 132 -50 37 122 -40 83 -100 -142 111 107 90 -111
5297 -111 -109 174 -36 364 -47 -1 31 -76 208 -194 -141 -76 144 338 3 70 -93 -153 100 -144 -53 66 31
5320C1j55L20j38k59L26M8n1q9j40j1J7J70M1k05J99P6l39K10mO6Ql66J63J48
5344F6j89J1j0K17pk92K83M4m29K97J61j33o3R6k5j63J71j5o8RM2j20l6K56j28
5369b5j6K66j27k02k8JJ31J4k11J48j20J60J03l7j50j05K25l05L67J24k67K09
5391A55l92L20Q5p6o2q4n3K18j67J7J8l1Lj8J06j13K54j69M4k11J97jR4j90K17
5416A61j49n3J70j1j06k9k4j49K75J23k76o5L04k31Q8j09j14l0M21m58O0N7J92
5439D7J84l53N3J71q7J5l7Jk33K56j2kK08l12J11J70j40j13K01J4k2J49k15K87
5463C41l81K15k44j78K42r1K64j47J28rk51J34j92kN8L11j61J29k47r9J32M4J45
5486A41J13k84k09L04J83l13m0J25j39j28L98m48L60J40j38J70k37Lj2j75j3K38
$$ plain form
5320 31 -124 196 58 -201 125 173 122 33 -107 -118 -101 69 110 -95 104 180 -159 51 47 113 121 -245 -82 66
5344 66 -123 -112 -122 95 88 -204 79 123 -306 -9 152 19 -44 52 27 -136 35 20 -48 -39 3 -117 -153 103 -25
5369 -25 -41 225 98 -104 -132 -131 0 14 -197 -49 -169 -9 94 57 -93 -198 27 -278 89 213 -54 155
5391 155 -237 83 168 92 30 -54 -107 111 -56 -39 -21 -52 -49 -67 39 -74 180 11 55 -156 41 40 134 -56 161
5416 161 12 -41 129 118 12 -17 -41 -190 85 208 -68 -133 171 -60 28 -81 -195 -225 196 -262 -202 -145 47
5439 47 231 -122 -69 102 15 30 -7 -6 -239 17 5 3 211 -101 10 180 40 -73 128 142 120 269 54 341
5463 341 -40 175 -69 -247 -5 -96 168 21 149 140 -111 23 -169 -171 -113 198 37 166 -81 -180 -48 -4 141
5486 141 254 -30 -239 65 248 -65 -105 20 -119 -247 151 -297 63 203 65 235 -2 1 -11 -186 -199 39
5508C9o6Q5N2Pk70J74q5J2o7M0J94O6K6l02J98l07L49k89K34j47m4J76J33k11
5532cj65Jp0K32k29J35L8M1J79j29M1L1k73J96j04J18j7j99O5o6K20J62j69K13
5556B48k94j71J81L57k60l60K10j05J74PJ27k25P4M4j93J75j67K96J4k24J13M3
5578F4J10j40M7K00j93l5p4J4k33K17l9r3J64j13L17j86j81K90j84J6K5MQP4o3
5603A6j95J35Q9J59m3j57L0j08N6K28m13j7R9J01J00k0k38J15J80L4j68K81k77
5626a3J08k24J27J48p0j49j29J12j2J10Q5L9j80M1j42K41l38J91J54J0qLj74M8
5650b2q6m6M64n18K36R6l00J63n5R1J28J26k90n6J52j82L01l06k3J46P8o2J42
5673A77L4j7k82K19j62K23L4l46M35k46j9O6N8j1j95j25J30J60j35j15N6J15L2
$$ plain form
5508 39 -27 58 110 117 -153 21 -64 -52 -119 -79 115 181 207 -95 103 -204 145 -144 90 -57 -101 75 208 -3
5532 -3 -168 -167 -237 -5 -234 -99 -61 -20 159 30 71 102 -171 25 -79 39 22 -177 -112 -178 42 204 35 248
5556 248 -46 -217 -36 321 61 -299 -89 -194 -20 -13 114 -111 -37 7 -186 -11 -178 118 132 -92 21 64
5578 64 174 34 81 281 88 53 -21 -7 -240 -23 -62 -155 9 -104 213 27 -154 136 -48 -32 -7 -3 5 79 16
5603 16 -179 -44 45 204 161 4 34 -74 -18 210 -203 -220 -121 -20 80 60 -178 -63 117 151 -17 264 -13
5626 -13 95 -129 -2 146 76 -73 -202 -90 -102 8 93 132 -48 -7 -149 92 -246 -55 99 109 101 104 -70 -22
5650 -22 -108 -154 310 -208 28 124 -176 -13 -68 23 151 277 -13 -69 83 -99 202 -104 -127 19 97 35 177
5673 177 211 194 -88 131 -31 192 226 -120 315 69 50 116 174 163 -32 -157 -27 133 -2 -117 -61 54 86
5696H6j56nK68l64K23q2J6K11k83K33R0j0j46L2k15K10O5j45j41n6R5K1K10l50
5720a93K89k38J27k4P7j81qJ71Qj76J6M09k41j27R7L53j51l3Nj79J9r5O3K89k18
5745E9k07K87R1k63J20j2j56J05j16j08L29j08k8j11L2L55l61R1J49j08L1r9j46
5768a74L35j90j59ML12Rk41M9O0k0J45k8M5j31j03K18p4r7N9L1N5k65L9K72k76
5793a25J77k91L24J43l94LP3n7J56K00l51P6O2o6K7K8l08N54m4n4k95J02J82j72
5817e0J61k0k7Nj92J89j17J75o6r7k29K43J82o5j11J5J90j85k0r1K48q6k54J91
5841a1j4O4J11k66j70M36j31j27K45Ql52K83N3k02P9RJ6J75m74J98L20l11L38
5864B77k44M1j48J02K37m06L99k97R4j56m6P1n5r0J07m5M9J99j05K3o4q0K34j59
$$ plain form
5696 86 -70 -75 193 -171 52 -30 -14 197 -86 147 237 227 81 113 -102 108 173 28 -113 -169 -74 -53 157 -193
5720 -193 96 -142 -15 -39 38 -143 -151 20 28 -148 -132 277 36 -91 6 359 208 175 180 1 20 -75 -12 277 59
5745 59 -148 139 230 -33 87 75 -81 24 -92 -200 129 21 -7 -118 -86 269 -92 -1 148 40 71 -28 -174
5768 -174 161 -29 -188 -184 128 137 -104 -55 5 -15 130 102 147 16 -87 131 57 -40 19 50 105 -160 -121 151 -125
5793 -125 52 -239 85 228 -166 -163 -90 -147 9 209 -142 -66 -4 -70 -43 -15 -323 231 187 133 -162 -60 122 -50
5817 -50 111 91 64 69 -123 66 -51 124 58 -39 -268 -25 157 92 -19 -4 186 1 -19 -110 138 52 -202 -11
5841 -11 -25 39 150 -116 -286 150 19 -108 137 145 -207 76 129 -73 6 15 31 206 -268 -70 250 -61 277
5864 277 33 74 -74 28 265 -141 258 -39 55 -101 -147 -76 -131 -221 -114 -159 -110 89 -16 7 -57 -137 97 -62
5888f2j09K86p8j73J83j22L02l12Q6j28J85k50K41k41K21j16K52l34K01q0m1J13
5910B4j88Q6j3Q4p1J10j2l4k31K26K5O7M0P1r3kMN7j30L27k47k22K51k5j47R3
5936E0j24J31l32J56J34p2lJ22O7j62l8J16j37J14l5r7J28l6J05n3j31K60j92
5959b9J56l28K40j23J27l8r3P7m7o1L49j78R5j19r4J27m07N52l42K53k54J69p9
5982d7L88l00N3o9J11Q7l50K62l19j13J81J84p5m4j29Q8R2J65k64o8R5J51k75
6005a96L55J7l90J99J29m7K0j50J21n3k64K60r4l2Rp7J01J9K03q3j63K54k48J60
6029E0O9j7j44j54K19K27n63K35k06J16J53j63J62j55J41J80k69r5J09pJ11L0
6051B9j19l1K72j4l84K11K8l29K65K06p1j30J10j07j47K66j73J84j70k9m4J32
$$ plain form
5888 -62 -171 115 37 -136 47 -75 227 -85 1 -127 58 -192 49 -192 29 -87 165 -169 32 -48 -89 24
5910 24 -164 -78 -91 -7 -78 32 20 -14 -245 -19 6 73 113 184 91 89 93 150 20 347 100 -122 129 104 -43 50
5936 50 -74 57 -275 -119 15 -57 -60 62 129 -33 -71 45 -92 22 -13 -110 18 -18 87 34 -97 163 -29
5959 -29 127 -201 39 -84 43 5 -88 -11 -58 -119 230 52 147 28 -66 61 -346 206 -136 117 -137 32 -47
5982 -47 341 41 94 25 136 223 -127 135 -184 -297 -116 68 -7 -51 -180 -92 0 165 -99 -167 -72 79 -196
6005 -196 159 176 -214 -15 114 67 87 -63 58 5 -259 1 -93 -125 -116 -193 -92 -73 130 47 -116 138 -110 50
6029 50 119 102 -42 -196 23 250 -313 -78 -284 -168 -15 -178 -16 -171 -30 150 -119 -214 -105 -112 -1 29
6051 29 -90 -121 151 137 -247 -36 -8 -337 -72 134 63 -67 43 -64 -211 55 -118 66 -104 -133 -177 -45
6073d5q5K17QN9p0j79rk1J37k41j7J64R9N2n9J47l30Q8L26k85J28l16K94p0k44
6098b52J60NP4R3j29k30J81J4j73J92l0J54o0J17k03K72n9n2m5J23l78K06rK02
6122A73l00J99r3j29m5Q3j86K59j8N0j72Q4K75j84q4K9J45K4P5j61o9J42P5k47
6146g5N0N1k52J09j4k5K86j60j07J90l0l1p9N5k7J77K8m6L6J0j13K22l09J11j68
6171a11K36l3j42K5r8K97j10K13l31K84k45M4k22J57M3J30l96M24k67Pj33R2k7
6194a63J16r6j8J92N7o8j75J91P6o4j93q4k8K63N3k12K34l1L8k29L64j75L3m2
6218C9j15rk0n9Q1l2M4J38J62l54K81j38m6m7NJ13j78J48J5n6l8J34k2j89K33
6243I0m8m7P1Lj7Kj81K29p4n2j49J94O3j19J32j23j15OJ40L7j98J24j86K69j13
$$ plain form
6073 -45 -130 87 95 154 84 -95 -104 -125 12 -229 -246 -82 17 69 10 157 -173 -85 241 -44 84 -232 62 -8 -252
6098 -252 -92 -87 -13 80 -49 -279 -98 -84 -257 -65 -95 59 -1 116 -87 185 126 74 29 152 -226 -20 -29 173
6122 173 -127 72 -21 -150 -195 -112 -298 -39 -57 -7 -179 -95 180 -4 -88 -59 86 110 185 24 -45 97 172 -75
6146 -75 -25 26 -226 -117 -131 -156 130 -30 -137 53 23 -8 -87 -32 -59 118 146 100 136 146 33 255 -54 57 -111
6171 -111 125 92 -50 -25 -123 174 64 277 -54 230 -15 29 -193 -36 7 137 -259 165 -102 -95 -228 -136 -163
6194 -163 -47 -143 -161 31 88 20 -155 36 112 48 -145 -229 -257 6 59 -153 81 50 88 -141 223 48 81 39
6218 39 -76 -85 -105 -164 -83 -115 -71 67 229 -125 156 18 -28 -75 -70 43 -135 13 28 -28 -66 68 46 -143 90
6243 90 42 -5 66 69 52 54 -127 102 28 -24 -173 21 84 -35 97 -26 -141 -135 5 42 -156 -32 -218 51 -62
6268f2o7N9j55J76N2K11J72l88n0J8Q6R3j57J03P7m03KK56R8j62Q5j12K8K15l21
6293a46J74Q2k55K9K1K84k59P9j15OK40j82J75l00Q2n5k0lL20k00k34K40J34m0
6317E7j41L89k92L2O6l30L49q0R1k31L6L2M3k88L03N9l1k4K44k12j31J50n9K90
6341C22l68R2j77L67m15j15Q4L76j21Qm56L19Q2Q5N3Q9j28p7J54j8p9jr8j20L05
6366A63k43J81k89J95Q6m6j99K35J6N7q0o9n6j4P0J40j26N5K2j47l6m8o2L8m0
6391a97K88l05K30nJ82k44j61J39L37l49r9m7J48J53j04k7M01l55r6J22N2J1k39
6414a65j2K00l20J51J5J78n3l08M42o1k5j26N8j22L32J40l59KqQ7l7M03k02j22
6438H8j57J04n2J87j44q1P5k52K84l6k47J27j14J77M2M7m8j35M8r3J92R5l0M1
$$ plain form
6268 -62 -129 -70 -225 -49 3 214 386 -2 -52 -34 52 145 -12 91 168 -235 -233 23 121 -41 44 -68 -40 175 -146
6293 -146 28 110 -145 -116 -95 189 -70 9 -106 -100 140 -42 133 -167 -85 -140 -160 -163 157 -43 -277 -37 97 57
6317 57 -84 305 13 45 111 -219 130 50 141 -90 -54 -22 21 -267 36 95 64 40 284 72 -59 91 32 322
6341 322 -46 46 -131 236 -179 -294 -210 166 45 53 -403 -84 -2 83 136 225 97 20 174 156 77 76 -22 -142 163
6366 163 -80 101 -188 7 93 47 -152 83 99 156 76 7 -49 -63 7 147 21 76 98 -49 -85 -133 -195 -157 -197
6391 -197 91 -214 16 11 193 -51 -212 -73 264 -85 -184 -231 -83 70 -34 -61 340 -15 -111 11 63 74 -165
6414 -165 -177 23 -297 -146 -131 47 -6 -314 128 67 42 -84 -26 -148 184 324 -35 -33 -41 46 9 412 210 88
6438 88 -69 35 -17 170 26 -55 20 -232 52 16 -231 -104 -218 -41 1 48 0 -135 -87 -180 12 107 77 118
6462A18j10m9K2J85q2J0k0l1j69J32o1j33K54k43M0J45j07J39k01K08j91J91j60
6485a13Q5J44n5L4j44o8J01J4n4J86j74K26j68R7j09m5J44j59J05L6j87K23k29
6508a10J90p3RN2j52J59j65L45P6l47l5J88k08K0J85j06j12K9R2j54J36J37j59
6531cm2J06r0o3R2R8j37J69N8k00j22J48r3k54L61J24k7P5k92q1K2J05r1J30O8
6556F1mj19Q6M7j02q8J61j67N3J52j24J91j27j13P4L7l2op9J01k7l2L21m16n5
6581b07M14k44J48j76K19j47K4p6M8j67J43k3R3j6j81J01J71p5k27J84k59P0J83
6604@r0N6J81l95L01j57r8j04K52kj80L16j05N7J06m3j01j29K61K05j01k16R3
6627A07p8K9K24l92K1j03K99Ok61J88J67q2j09k70J55M7j72J23J98k71J85r0j8
$$ plain form
6462 118 8 -41 -19 166 84 94 74 43 -126 6 -55 -188 66 -177 -137 8 -99 40 -161 47 -144 47 -113
6485 -113 -28 116 61 95 -49 -117 -16 -2 -56 130 -44 182 14 111 2 -43 101 -58 47 83 -104 119 -110
6508 -110 80 7 16 68 -84 75 -90 255 331 -16 -51 137 -71 -51 134 28 -84 -55 37 -117 19 156 -3
6531 -3 -45 61 -29 -92 0 98 -39 130 188 -12 -134 14 -79 -333 28 152 125 200 -92 -173 -151 -46 -137 -7 61
6556 61 57 -62 24 71 -31 -119 42 -125 -72 80 -44 147 20 -93 -19 18 -14 -20 -99 2 -25 -57 264 -152 -207
6581 -207 207 -37 111 -65 154 7 31 -45 3 -164 -21 -44 49 33 -148 -47 124 49 -178 6 -253 -183 0
6604 0 -90 -34 147 -248 53 -104 -202 -306 -54 -56 -236 80 -25 32 138 95 -6 -135 126 331 230 14 107
6627 107 29 58 282 -110 -89 -192 107 113 -148 40 207 125 16 -254 -99 -52 -224 -101 97 -174 11 -79 -97
6650i7Q8m8J74m0j45J29Lj66L53j90k40J47K29n09L17p4NJ07k49J4J26n4Q6K8
6674fl9J67k91K48k9OP2kl01K45k77M41l40J51N9k22J78L8j44K08j24q6Pl1P8
6699FL42m86J35kR8k21L57k15p3J06K31L2l93q5%J05k91N08k70J00K4r0l3L4k53
6724c34J43P7N9K19k67R8M3O8j29m8o0O4m6j27J92J64j93K17q9p6K37k40l6O3
6748an1M9j11K95k90p5M4J56J5j59L32k34k2J73J3m1j76J41j39l2J15o9L17j54
6772I6l24K32l2JL45k99q0LJ99q3p3L1pJ45l7o5k11R2J93P9l06j3J81j35QJ14
6798E4k26l8J07K46j68k19K22k8Jj70K88k0K4k5K5k93K70r4J73q2j9M6K64k37
6822A01qL07o03J00J63j75J81k35J69p0R9j98rM7N5K04k88L68k29L4J20k59J60
$$ plain form
6650 -97 -9 -57 117 77 -68 61 64 -102 251 61 -179 -32 197 -312 5 -69 -64 43 -206 -192 -66 -120 -34 -6
6674 -6 -45 122 -169 79 50 56 128 126 -175 70 -207 234 -106 45 104 -118 60 98 -46 162 38 -48 -41 -72 6
6699 6 348 -138 -3 -5 93 -128 229 14 -59 47 278 310 -83 -168 -168 -63 -354 154 -116 -16 8 -82 -115 -81 -334
6724 -334 -191 -114 -55 164 -103 -5 38 106 -23 -71 -131 -67 -113 -240 -48 116 -77 140 51 -25 212 -28 -64 -1
6748 -1 -52 -3 -114 181 -109 -184 -140 16 31 -128 204 -30 -52 121 134 93 -83 58 -81 -113 2 -67 250 96
6772 96 -228 4 -28 -27 318 19 -61 -58 141 58 -15 16 9 154 117 52 -159 -67 126 205 -101 -114 67 -68 -60 54
6798 54 -172 -210 -103 143 -25 -244 -22 -50 -49 -219 69 49 73 48 73 -220 50 -44 129 47 28 74 338 101
6822 101 93 400 -203 -103 60 -115 66 -169 0 -70 29 -169 -178 -131 -76 128 -160 208 -21 13 133 -126 34
6845C4r2K12m5j0J12l2j05J4n22L83j0l2o7J15Q6J8p7k7L36k50r4L6j4J45r1J50
6871A73k14N3Q8r6K08k27oJ36q4m3n0m3P2J7K51k19j68J3J04n1J20QKn3K20o9
6897A42k80J03j19K34k02J87O4k2j53P0j58O1L22k97L10l00m9K15l81K54oK8k58
6920b35J73J59r7J54l08P8L46m14J74j20J31k31N6K21l58L12j2J1kO5k56J47j08
6943a14L44p1l4k72m4J22K28L1q1km25N4K04j68K14lo3M6o4J82j48k8M5R2J9j24
6969f0R3m8p9K08j52j18K9J23m3Q3l6j44J65N0J9j28K8r1R2J78j22M4o3j6j45
6994a33K61k77q1K48J41j08J61j51j62J48p0J03n2Q7J1kk07O4J8J10k76J30N5
7017A8j24L53l52M1k04Q8J31J54j74J67O7k48N2K41j88L2J52l28N9Oj8n4N9M73
$$ plain form
6845 34 -58 154 109 99 211 179 74 88 -434 -51 -61 -93 -160 -45 41 59 -18 -45 291 41 -53 -17 -31 114 23 173
6871 173 -41 12 100 4 212 -15 -21 115 31 -12 -62 -105 -33 -16 235 16 -152 -139 -35 -86 34 42 44 -9 211 142
6897 142 -138 -35 -154 80 -122 65 129 107 -46 24 -134 -73 249 -48 262 -38 -87 128 -253 1 -5 23 -235
6920 -235 -62 97 0 154 -154 -76 270 -144 30 -90 41 -190 -134 87 -271 41 29 40 38 103 -153 -6 -114
6943 -114 230 159 125 -147 -191 -69 159 190 109 107 -318 -264 -60 -228 -14 -17 -80 -34 -98 84 -64 -92 -47 45 64 -60
6969 -60 33 -15 -94 114 -38 -156 -127 -4 -47 36 0 -144 21 71 90 -38 -10 -101 -9 169 47 91 28 12 -133
6994 -133 128 -149 -230 18 159 51 212 61 -101 47 -23 80 28 115 126 124 -83 -19 -1 109 -167 -37 18
7017 18 -106 247 -105 -64 -268 -180 -49 105 -69 98 165 -83 -31 210 22 54 206 -122 -63 -57 -75 -129 -70 403
7041D03o37L38J2Po1m28J70Q6J52j10j2K4m3K64n3j89J83j18Q6L4k43L46l6m0
7065A35P2J9l81Q7J58j77Q8K45k32k9l3r3P3j6jp0K05o6K13m34J57j50L99k51
7089h2M2pK0l2J72k84K31k24K52q8q1p9%J13J09j86J08M2k95M38k58L31l40p0
7113a68K69o5kP4m08N37r2j64l2%pm28N87j55J05j54O1l2M8n7m2R7J67k62K09
7138H6n5k1k0k63K32j67R2J17J35l14J45N5j04J08r5M3k10L13N7p4M3j73Q5j7
7162bl7J21J44k00k99L26jrj26K35n8k04K58rk88K23k13m4K9J48mJ37k24K31p7
7187E7P5j46p1j26K68K7j21J62j43Q8p6j0J81k58L38j01r9O8k28l6J50K04k98
7210i5j7k3K42j58r6K52l3j6P5j53Q8n4k72N14j28j85K14k33L7J22j35J27mn9
$$ plain form
7041 403 -234 104 116 123 62 -366 -196 -110 42 -68 -80 -56 -99 165 112 -77 106 -12 74 108 -135 211 175 135
7065 135 207 226 -155 -68 90 -87 1 246 14 -15 -48 -141 -68 -84 -85 -155 50 -16 197 -237 -80 -230 169 -82
7089 -82 -40 -47 -27 -59 113 -171 60 -164 88 0 -81 -160 -160 -47 62 -124 -16 26 -269 169 -89 242 -98 -168
7113 -168 101 36 34 108 -300 237 145 -19 -51 -51 -58 -486 101 -54 51 -103 -42 -74 -26 -83 -125 -28 139 -123 86
7138 86 31 10 -10 -273 -41 -208 -116 1 136 -178 -33 22 -82 26 -69 -26 -236 77 134 60 103 -70 15 -2
7162 -2 -39 82 226 26 -273 53 52 43 -83 152 94 -110 148 139 -149 74 -139 -183 -154 -6 -10 127 -97 134 57
7187 57 132 -14 -85 -211 57 84 -37 125 -18 70 -6 -16 165 -93 245 144 45 113 -115 -151 -1 203 -95
7210 -95 -112 -135 107 -51 -147 105 72 56 131 -22 66 12 -260 254 126 -59 155 -78 -41 81 -54 73 69 10
7234A0o8J6m1J6J58j06J76l57R6O6j08P3J38J15j50L5J21k87M0J12k55L2L40J43
7258C15k51j12K87m79K58j44J37P9k60l9J10L20l23K40n0j80O3O7J14q9j34pQ0
7281Bn8k11L63j16J02J02j91j77K00k47L35q5j49j09L09%j18K3K02O1k02j29K87
7304A94%k16M1k86L92k15K0j30N41k40Lk39lK11j53L22l11K90k04J25M6j33m8
7327GJ97k81n5J56r6J45j22Q6j3J73j53j64L5P3j25J86P7j44K4K8p0J5o3O2J06
7352H4k27K20Q1n0r4K21k19J07j49L4n2R0n4pJ89k67R9l4O7n3J03q8J26m1k3j01
7378c8m7J70J6L1n6q6M0Kk9n8Ok3q6K4O7N8J11j40j32M9l6o9J48Q6q4j70J9K07
7406b0k17L32j45j8O0P7N7n2oj38J53q0j26K37l79K41K1j68K52j46j85J57j3j75
$$ plain form
7234 10 -58 -42 -83 -67 91 -15 161 -196 -100 -34 -142 -69 69 184 34 69 190 -97 -57 55 -200 -168 172 315
7258 315 64 -48 239 -240 18 -126 11 90 -170 -209 -99 221 -102 138 88 -92 -29 38 152 63 -71 -78 2
7281 2 -56 -267 96 -20 82 184 -7 -184 16 -231 104 19 -130 -239 70 70 -48 -25 177 238 36 -93 194
7304 194 194 -22 19 -267 125 -90 -70 -200 341 101 104 -135 -138 73 -80 242 -69 221 17 142 188 55 7
7327 7 204 -77 -132 24 -72 73 -49 37 24 197 44 -120 -85 -12 -137 49 126 -18 6 34 -36 -21 -84 -22 84
7352 84 -143 77 158 108 14 235 16 123 -26 8 -44 46 -8 -15 174 -93 6 -28 39 -14 89 1 127 86 63 -38
7378 -38 -85 85 101 132 76 -10 30 32 3 -55 -49 -72 -158 -134 -67 -9 102 -38 -170 -121 -157 -226 -78 8 -76 -246 -227 -20
7406 -20 -237 95 -50 -68 -8 69 126 74 68 -70 83 3 -123 114 -265 -24 -3 -171 81 -65 -250 -93 -106 -281
7430b81R3K96k41R7n5K07p8k5J8J79j96Q9rQ2j12K08l07n5J52o5k77M84m13K04
7454eK77n38K52j50J33Q5p1J13p0l32K56R3q4q7K13j17N5J00M3l6j61M2k57l1
7478b77K38J96r8j66K11k20K66j37M6j9R7k41k6J52l4j53J40J58j45m5J76j75
7500e6N0l04K19K34n6N5Rk80L7L0m5J18J31m2K3k30J90j20J53K3p6l13K44P2l38
7525b72J96j80Q8o2L78l70n9M22N0l0j28q9O7J6k4k02L48o2J2j46J97k52L97k67
7549B8r9K9j19k6J46J53k24N7j50O8J38j34J16J33j13l7p7q4L36j31oO7j52J66
7573H5j6m8K45n4j75J17r7J22k42L2P5j60J8R1Rk6k19Q5K37j73R1M4J5j64K29
7598A21N9j13N4k68L18l50J71J27k7K9k57K05L3j32O2j17K30j78J04j08O0O5j25
$$ plain form
7430 -281 -188 108 -133 -36 -91 116 38 13 31 210 14 103 94 176 64 272 -35 -90 62 -3 -280 204 -209 -5
7454 -5 272 -266 -14 -164 -31 54 -17 96 26 -306 -50 43 -41 -128 85 -32 23 123 166 130 -31 11 -246 -277
7478 -277 -39 157 59 -107 104 -116 150 13 59 40 137 -104 -130 22 -12 -165 -25 133 -12 -57 119 -56
7500 -56 -6 -310 -91 143 87 142 151 -129 -92 -62 -107 11 142 100 123 -107 83 -37 116 139 63 -250 -6 66 -272
7525 -272 -76 -256 -168 -230 148 -222 -281 141 191 161 33 -56 11 27 3 -199 149 87 99 -47 150 -102 295 28
7549 28 -71 -42 -161 -187 -41 112 -112 -55 -205 -137 1 -133 -17 116 3 -34 -111 -195 141 10 4 71 -81 85
7573 85 69 21 266 212 37 154 57 179 -63 -31 44 -116 -98 -7 2 -24 -243 -158 79 -94 -3 41 56 -108 121
7598 121 180 67 121 -147 171 -179 -8 119 92 121 -136 69 102 -30 32 -85 145 -33 71 -37 23 88 -37
7621c7j29L8j97L29L4J68k37p0K6L1K8K7m6oM2K2L29n35q3Q7K1K95m0j01j61J82
7647A7p9P0J41k9p3J86m09o2K36J11p8j24L45k28n5K39j69pR8qj99qK09k77J24
7672b9j41O0k4j0O0P3j21K62k38j79K22j12K15n0M9Oj30J64r3Jl2J35L7j93R9
7697C1j71oK4K05mj4J20j37m7l8J70L8j59J36k94Q3K31k08J79J3m71M38j31K1
7721IN5k89J95J04q9j12J65J04J7j94k20K47n2R4j3j82L35l06J18n3PN3L6p0J5
7746b6n5j28R9K3j2O0j60J43K11k8k10P8n0K78Q3l98L24m38K06R1pn84M08L70
7770B78m96J45M6K30k69K99m06N1J99k29J57k2j44J74j38L31j71j67J63K9O3K59
7792C82m89J77j07q6O3R2l85K29J93k26OOK28l8m2J7q1q6K73q9k5J72j36q2j2
$$ plain form
7621 -37 -166 -128 -325 4 38 206 -31 -101 -75 -44 -16 11 -35 -41 1 23 352 -183 -266 -179 -158 137 97 -4 -165 17
7647 17 -62 8 149 120 47 233 -176 -238 -2 109 31 -93 252 24 -31 208 39 32 130 122 -77 -85 124 -153 -29
7672 -29 -170 -110 -134 -144 -84 -11 -132 130 -108 -287 -65 -177 38 -12 37 43 -87 77 -16 -15 -47 88 125 -68 31
7697 31 -140 -146 -122 83 79 65 185 48 1 -37 133 171 12 148 -146 -63 168 -40 139 152 -319 119 -12 9
7721 9 64 -225 -30 74 -15 -127 38 142 159 -35 -255 -8 -60 34 21 -161 174 -132 -14 -67 -60 -7 29 -41 -26
7746 -26 -81 -209 -110 -87 -99 -39 -199 -56 155 127 -83 -5 -55 223 306 -92 232 -206 0 91 84 -500 -92 278
7770 278 -218 -73 -27 203 -66 233 -173 -122 77 -152 5 -17 -161 13 -125 206 35 -132 31 60 123 382
7792 382 -107 70 -37 -123 -60 32 -353 -124 69 -157 -151 -145 83 45 3 20 -61 -147 126 37 12 184 48 -34 -46
7817d6J82J18l19p0K05j36KJ10l5J53l96K80J4l03M40l59O4j14P6n3J31O6Ll1
7841a8o1o4M5J58%j2j86O0N4o3o3P5k9J67k31K21k91K74J48j95j58J88N7j53J26
7866D9l2k59K78K10l20R4j22L57j3o3k81M8K3q6p9qQ7J24K6k61K16jj11r0M6O8
7892a00J31%N6l5l07L8J61k55K37J8j43P2O8k4R5j03M6J19p7j69L20k86L7MP6
7917b1l4j8K21k98K40k28J31l0J36k73L11l23L22k4l8k22K0P7N9R2j92L43l93
7940a42K08j22r5K29m6L4o1l50L97L6j18J09K26l05J39j4j96L2j14kL76n8j73
7963a0J93l77J07R6O1j15P7j45M2M7j42J29p3nK27k16k1J75j03J12r1p3J36k71
7987b40K33j59K00m9k3J44k62j79K50m8jL37m31J03J73m5K0m4l7K96q5m02L18
$$ plain form
7817 -46 136 254 -65 -135 70 -66 -64 46 11 164 -232 48 62 -241 199 -160 -96 -210 -134 -187 -56 10 13 -18
7841 -18 -79 -143 -98 60 60 48 -138 -78 -24 -87 -150 -75 -104 63 -168 53 -238 36 184 -11 -169 19 76 -77 49
7866 49 17 -242 36 246 -74 20 -102 255 242 179 -102 -54 -31 -117 -196 -204 -117 7 33 -228 -12 -13 -124 -214 -168 -100
7892 -100 31 31 87 52 -255 -217 -56 -311 -74 -56 -199 -127 -59 -83 12 -91 -45 74 -3 -172 148 -138 -101 -97 -21
7917 -21 -55 -73 148 -150 90 -138 -7 -37 99 -174 137 -186 136 112 74 -148 -128 -51 8 100 -92 251 -142
7940 -142 66 -56 -151 78 32 66 5 -345 52 88 -30 79 305 0 139 125 -71 -39 -153 -155 221 163 -10
7963 -10 183 -194 -87 9 70 -45 32 -113 -71 -24 -166 -37 -110 -115 112 -104 -125 50 -53 59 -32 -105 31 -240
7987 -240 -7 -166 34 -15 -38 106 -156 -335 -85 -133 -134 203 -228 -125 48 3 23 -21 -58 238 153 -249 69
8010F9l55K06L1M6J33k37K77L4j66j05j07J49n3J33j47J38l02L78j06Lj77K1J52
8033A5J16j40k7K42k62j5K07j27p6j3L1K22j22MJ7m2J1o6K20J66l28q9j29J12
8057g3R0K1j33J62J06j68L9j71J23Jn2j63K70j0J60j90k17K39m2K8n2J67k36J51
8081E0p2LJ87l51K45l64K22K43l52K89p8k23K64k81K72K39l51P3k09L43l02P5
8103g8J00Rj32Q9j9j52L74M5j15l5j38N4M3k53M75m16O5K4r2R6o0K33p5j15j28
8128b01J86N8k00L71l76l4L66l81K81K7j84P9O4K56k34K38k52j60k5j3J51j53
8150a36J07J67k82M2K70r6J23j65j55k0O8j41L89k11K70k65J27k57J60j0J15k33
8172a33j5l8K89k82J26JQJ6J9J34nj61j46J97j29J66mK95o6
$$ plain form
8010 69 -286 -80 -49 -3 130 -107 170 204 38 -67 -174 -25 -78 55 -92 46 -256 122 16 19 -158 -137 15
8033 15 131 -9 -36 206 -56 -71 136 9 -67 -80 -49 173 51 55 72 30 41 -25 195 361 33 -56 -185 -73
8057 -73 17 38 -95 67 173 5 44 -127 -4 -3 -55 -218 52 42 202 12 -205 34 -8 20 -32 135 -101 50
8081 50 -22 -19 168 -183 62 -302 -80 163 -189 100 22 -201 63 -218 54 293 -58 15 -194 149 -153 -78
8103 -78 22 31 -101 -12 -31 -183 191 236 121 86 -52 2 45 -208 267 -149 -84 -60 -152 -56 -116 117 42 -73 -201
8128 -201 -15 43 -157 214 -162 -196 170 -211 70 97 -87 -8 56 312 78 316 64 -96 -121 -134 17 -136
8150 -136 -29 138 -144 -102 168 72 195 30 -125 -145 -77 -218 171 -40 230 -35 92 -165 -5 -15 100 -133
8172 -133 -148 -186 103 -179 -53 -52 -44 -28 -9 125 120 -41 -187 10 -119 47 43 338 272
8191B72
$$ Imaginary data points
##PAGE= N=2
##DATA TABLE= (X++(I..I)), XYDATA
0@%%%%%%%%%%%%%%%qJ6j6J6j6J6k4L2l2M0m8N6o4P2q6R6j06J20j38J59j79K00
37A06k24K51k81L13l46L83m25M69n18N72o30O94p66Q44r29J024j130J249j383
56g27J535j712J918k158K450k810L261l853M666n853P757j1291J9987q0203j13373
71a80406J83637R4744n9149j2174M7557n7752m2925P5943L9607q6489l0907M6813
83A8499j3227m3989M7133N8356m1188o2293K6394L3082l2704k4505K6737J1744
95D039k4203o056L3363J5169j6727O876K9632o943l2899p749J6611L890p52O346
109B0597k7693m4608K3523O5913J976o2154k7956L3039K4720m480J456n115k3567
122b4349o487J7440J3841K209O55j0609k2365P467M0305J9087j6295k2999r893
$$ plain form
0 0 0 0 0 0 0 0 0 0 0 0 0 0 0 0 0 -8 8 -8 8 -8 8 -16 16 -16 24 -24 32 -32 40 -46 50 -56 64 -74 85 -94 106
37 106 -118 133 -148 165 -181 202 -223 246 -272 300 -330 364 -402 442 -487 537 -593 656 -727
56 -727 808 -904 1014 -1144 1306 -1504 1757 -2096 2570 -3283 4474 -6817 13170 -67033 -180406
71 -180406 3231 97975 38826 26652 74209 16457 -26468 49475 89082 2593 -28314 18499
83 18499 5272 -38717 8416 66772 25584 -36709 -10315 22767 -9937 -34442 -7705 4039
95 4039 -20164 -26220 7143 22312 5585 12461 42093 35150 2251 -5498 11113 15003 14251 20597
109 20597 -7096 -51704 -28181 37732 39708 -22446 -50402 -17363 7357 2877 4333 -782 -24349
122 -24349 -30836 -13396 445 2654 3309 -7300 -29665 -22198 18107 37194 20899 -2100 -11993
135a1993J3892K0505j664j9586j0200k47o266L916K4789J113k8319K212K5541
148A3693o900k2981Q542J7094j3495j3548R359m542n670L2306K3082l0176k5565
161a8801K4257K2320j9847j3760J5439o932l0371j529K6190J3537o040m940n506
174e983j0821J2008L3957j05l5284j5748J8751J2970m821O371J0041j8054j7730
187a4448J7545J9959r570j6131J221n65j4366K975J9113M58j2134q40L448l290
201f625M377J7183J290k3632o820J9692P164j1655j876J0710l074j6248p69J0132
215a51J006j767j819j0041p390J0172J7772k44j5362l744O075M77Q55O801L832
230F472p762r962P124J3557K808j795j171n553p714R62J1580K785j1016p087n93
$$ plain form
135 -11993 1899 22404 20740 1154 -9046 -9293 -15559 -11643 13146 14259 -14060 -11848 13693
148 13693 6793 -16188 -7646 9448 -4047 -17595 -8236 -12778 -18448 13858 36940 6764 -18801
161 -18801 5456 27776 7929 -5831 9608 2676 -27695 -29224 -3034 10503 4463 -477 -5983
174 -5983 -16804 -4796 29161 29056 -6228 -21976 -3225 9745 4924 11295 21336 3282 -14448
187 -14448 3097 23056 13486 -2645 -1424 -1989 -16355 -13380 5733 6191 -5943 -6783 -3335 -6625
201 -6625 -2248 14935 16225 -7407 -14227 5465 12629 974 -902 9808 6734 -9514 -10283 -151
215 -151 855 -912 -2731 -12772 -20162 -9990 7782 7538 -7824 -11568 -5493 -5016 -4161 2640 6472
230 6472 -1290 -11252 -4128 9429 12237 10442 9271 3718 -3996 -3034 8546 11331 315 -6772 -7365
245g365R79Q243R860k455j4281o878J0181O412n299j898K407k034m603K570J0929
260F768N187m862l814l492k500M455N934j414j0022l856P096J866k946M550K605
275E555o710p523J197N854K40r77J521l512l969M528Q563L856m285o787k311p2
291d832L538P272j513p949m025N331P524k0q39Q51n639o460L095O986K069m637
307G52m490K93J703O050N564m058p053k864K083K657m67j51J019l849j923M323
323d11M769P75l105j987j349l466K002N767J02l060k027M53K110K739K813j888
339D237p114l042K011J697J776j44j007j612k386L175N970O45l608n476k463J977
355e364L756M206j41n067r0L713L045L156o3l305n210l013L308L849M03j363l595
$$ plain form
245 -7365 -6386 1857 11717 9262 -5019 -11897 -1716 4696 -603 -2501 -94 -2128 -6731 -4161 6768
260 6768 11955 7093 3279 -213 -2713 1742 7676 6262 -3760 -7616 -520 1346 -1600 2950 5555
275 5555 -1155 -8678 -7481 -1627 -1387 -2364 -843 -4355 -8324 -3796 4767 8623 4338 -2449 -4760 -4832
291 -4832 -1294 5978 4465 -3484 -7509 -2178 5346 5326 4487 5338 -301 -6761 -3666 3320 5389 752
307 752 -3738 -3445 -1742 4308 9872 5814 -1239 -4103 -2020 637 170 19 1038 -2811 -4734 -411
323 -411 4358 5133 2028 41 -1308 -4774 -2772 2995 3097 37 -1990 -1537 573 3312 6125 4237
339 4237 -2877 -5919 -3908 -2211 -435 -579 -1586 -3198 -5584 -2409 3561 4206 598 -4878 -7341 -5364
355 -5364 -1608 2598 2457 -2610 -2700 1013 4058 7214 7151 3846 -1364 -4377 -1069 2780 3183 1820 -1775
372a775j688K711L383K928j039n842m317m94K606L719m8k423k682j038N120N241
388D362O46j421l096k234P30L235L505o19l778j992l58K490L600n41k769k895
404a135k371J622K043J109O70k715k140j626J383L703J826j636k626k142J594
419b441N957L951P98l776n498p44K456L759L1n688n587k075L182P155L229k907
435A802m677l199J310M166K380j912p373n000L053N219N368K406k875k960R07
450a385M175K853j557k405l145l168P33M511K701R93p32k58k21l05K227J618k605
467D030m254l408k689J326M062M125j322m571k87K357L759M843L80n997o180m26
483d252N956M938J05l903o429k315O276O226P29n062o764k467K492M792L197l527
$$ plain form
372 -1775 -3463 -752 2631 5559 4520 -1322 -5639 -6133 -3527 192 144 -2279 -4961 -5999 -879 4362
388 4362 5008 3587 491 -1743 -1013 2222 5727 5108 1330 -662 -1020 1470 5070 4529 1760 -1135
404 -1135 -3506 -1884 159 1268 1938 -777 -2917 -4543 -3160 543 2369 733 -1893 -4035 -2441
419 -2441 3516 7467 8265 4489 -1009 -1753 703 4462 4493 -1195 -6782 -8857 -5675 1480 4709 1802
435 1802 -2875 -6074 -4764 -598 1782 -130 -7503 -12503 -9450 -4231 1137 3543 668 -2292 -1385
450 -1385 2790 5643 4086 1681 -1464 -4632 -3899 612 3313 4306 3574 3316 3095 2790 5017 6635 4030
467 4030 -224 -3632 -6321 -4995 -933 3192 1870 -2701 -2988 -631 3128 7971 8351 2354 -3826 -4252
483 -4252 1704 6642 6747 2844 -3585 -5900 376 6602 7331 2269 -4495 -6962 -4470 322 3519 -8
499hn958l221J813O143M283p34k619k866K62M128M097L5l750l239j138j659K244
516b187L583r09k148j9M12L21K949L525p21n424l394p60p44L925L837k976n633
533f363n73M836M899K710O21n090p241K34N516L365k79l409l695j143N194R370
549H952J842n308m991k508Q47L986K723k956o870l167M007M130M357J450l568
564B926l795K0K584L480r5k556l012k591O90L203L044R43l830l222J07O02K075
581E73J480j003l837k576N96K384K022K738m18n798k180L453M531J931j258l897
597a259l844r24N071M112k013l820l847j492L769N984K857k797m898o07K773M063
613C128L605j855n327l599O83N175L950l41l198l668l7L493K600J50k825m203
$$ plain form
499 -8 -5966 -9187 -7374 -1231 3052 2318 -301 -3167 -2905 1223 5320 5355 1605 -1634 -2772 -4431 -2187
516 -2187 1396 487 -1661 -1680 -1268 -947 2002 5527 4806 -618 -4012 -4772 -5516 -1591 2246 -730 -6363
533 -6363 -6936 -2100 2799 5509 6130 1040 -6201 -5967 -451 2914 2635 -774 -4469 -5612 -418 8952
549 8952 10794 5486 495 -2013 -1166 2820 5543 2587 -4283 -7450 -3443 687 5044 6494 2926
564 2926 -869 -849 1735 5215 5120 2564 -448 -3039 -2349 854 3898 4841 1011 -2211 -2104 -1502 573
581 573 2053 1050 -2787 -5363 -4767 -2383 -361 2377 1959 -3839 -6019 -2566 1965 3896 2638 -1259
597 -1259 -5103 -6027 -956 3156 1143 -2677 -6524 -8016 -4247 1737 4594 1797 -3101 -3708 -935 3128
613 3128 6733 4878 -449 -4048 -3365 1810 5760 5419 2221 -1447 -1484 2009 4609 4759 1934 -2269
629b269j596J10K281K724K82j282k291m55K629K874L53o89l073k066%J684L542
646B758Q60j626k069j902J648L620J430j437m193m066O25K797L023O01l517l469
662d917o28L004N104J016l270l714j218K157M374K667o36l486k440J610K559K237
678D419N88l704l887j431K756L358R4k147j759j828J18K446J830Kk142k065l42
695c694J488L027K113l39j964j912O72K473J135L6j418l259j298K109K673J425
711C267j898k659q36k79K162K320l66k226k736k10K510K800J611r07l337j886
727b670J846K763J285j549j660j856o70K512K145O32j999k496j068J177K077J550
743B019j191k918p73O42K523K144r8j903j376r02J420K125K69j438k277l08J028
$$ plain form
629 -2269 -3865 -3755 -1474 1250 1532 250 -2041 -2496 133 3007 3360 2671 -402 -2468 -2468 -784 2758
646 2758 3618 1992 -77 -1979 -331 3289 4719 3282 -911 -4977 -4352 -1555 1468 2069 -1448 -4917
662 -4917 -5545 -2541 2563 3579 309 -3405 -4623 -2466 1908 4575 3939 453 -1987 -377 2182 4419
678 4419 5007 1303 -2584 -4015 -1259 2099 2193 46 -1713 -3541 -3423 -977 853 855 -1287 -3352 -3694
695 -3694 -2206 821 2934 2595 631 -1281 -609 1864 2999 3035 1617 -1642 -2940 -831 1842 3267
711 3267 1369 -1290 -2126 -2405 -243 2077 1711 -515 -3251 -3461 -951 1849 3460 2553 -784 -2670
727 -2670 -824 1939 3224 1675 15 -1841 -2511 1 2146 2778 779 -1717 -2785 -1608 469 2019
743 2019 828 -2090 -2863 -2221 302 2446 2348 445 -931 -1833 -413 1712 1981 543 -1734 -2042 -1014
760a014P39J646K78k253j702j8J371J153L38N5j736j003J973J955J015J6r71j366
778D76o24M86K254J35j552j509j450N81J827J071l88k662j797O46J190J821L90
795H95j280j664j61J542K701R21j271j689j048R21J042J120j03k095j529P91Q51
812e6J113j0j546k032q82J033J381k35k62k41j016O35J984J155L24p91r81J36
830b91K93J512O53p33q93k40L74J265P33j15j284k085q3K37N45M95r83j124j01
849a825Q11J394Q75K01j322r77K74J434M97M84r38j215k1O62J459N75j052j093
867B23n77l24O66P26l38j140j329J26R62N91P56r23j389J74P78J502O26p23l22
886F5p69l20J677N36p66o26j198M40P22Q31P13q97j089m3K28P84M41q70p81q13
$$ plain form
760 -1014 -275 1371 1649 -604 -2306 -2324 -953 200 538 593 -1143 -2146 -173 1782 2797 2813 1842 476
778 476 -148 338 2592 2727 1175 -334 -1784 -1203 624 1695 1307 -1355 -3152 -2506 -1316 505 895
795 895 -385 -2049 -2210 -668 2033 2954 1683 -6 -1054 -133 909 2029 1926 -169 -1698 -907 -56
812 -56 1057 1047 -499 -2531 -3413 -2380 -999 -1234 -1496 -1737 -2753 -2118 -134 1021 1345 554 -427 -291
830 -291 2 1514 2167 1434 541 301 675 1940 2673 2558 1274 -811 -894 -657 -112 383 -600 -1724 -1825
849 -1825 -1014 380 1255 1456 134 -843 -569 865 1362 1846 908 -307 -328 334 1793 2368 1316 223
867 223 -354 -678 -12 714 376 -764 -2093 -1967 -1005 -414 342 -581 -1970 -1796 -1018 484 1110 387 65
886 65 -704 -1024 653 1189 423 -203 -1401 -961 -239 592 1305 408 -681 -724 -496 288 729 -141 -922 -1735
906a735K5J328P33l6o5k14J55k0L92Q46p03j349r66L50N90R58J92Rj261o4J191
927C56J131m0l73j357p90M3J282J546p34q15l51lJ083J282J01j207k164k85Q83
946d12N00P61q11j419j21O59J353Q32n08r26n33J07R74N57K21m44j532k74Q71
965a45P07O63j21r79j062m42J107J066p57p15o33r28Q1J254J003k75j871J35N24
984a388Q34J330M88r15r81p49R64J421K05l27j048j001R22J231J347q82j004r50
1002e03k21jR99O80r73j479p69J139J594N22L31q49j350L28J473J012k90r26m89
1021B28p55L86K110P36q93j369n44L92K70N68P58k458j406K27J001Q89O5m34r04
1040a133p31P79J557M48k68r55q68j38N02J682R00j036j271l52L0J406P55l40
$$ plain form
906 -1735 -1710 -382 351 315 250 36 191 171 563 1409 706 -643 -1609 -1259 -669 289 481 490 -771 -835 356
927 356 1487 1447 1074 -283 -1073 -1030 252 1798 1064 249 -102 -105 978 2260 2361 1154 -1010 -1295 -412
946 -412 88 849 38 -1381 -1502 -843 510 1342 834 -92 -625 -518 456 1013 1234 790 -742 -1016 -145
965 -145 562 1225 1104 125 -937 -1379 -272 794 37 -678 -1311 -2239 -2158 -904 99 -176 -2047 -1912 -1388
984 -1388 -554 776 1264 349 -632 -1381 -417 1004 1209 882 -166 -1167 -245 986 2333 1451 447 -503
1002 -503 -724 -725 274 954 -19 -1498 -2267 -1128 466 988 1319 470 -880 -552 921 1933 1643 717 228
1021 228 -527 -141 1969 2705 1812 443 -101 291 561 1129 1887 -571 -1977 -1750 -749 140 205 -229 -1133
1040 -1133 -1864 -1085 472 920 652 -303 -1171 -1309 -807 875 1775 739 -532 -884 -854 552 1307 967
1058I67q35j642j34J493N54L41o27j291p39L63J657J112n28j661o22L36J177J634
1076A555N7j101j619j45J347Q40O32o55j047o57L75J304J098q11q79j155j29R32
1094e8O83M75n72j534j96Q97R02P55m13r58o07n34R17J306m80j83r20n08k44J568
1114B96J551m54j873o78Q5P14J156Q05j073j459m82J418P18N46m2j430j332J64
1132a370J634L96J27j396l03o19O26J288M50n64j337n21R07O84P94K93j081j058
1150a050J88J064J145K4m91p32q16J15J282O97n61j196q23N90K81Q00P35j539
1168b87j205k59P06J112N37j9p82p58N2J661N51P6n50p96n00L46J182R18p32j170
1188H3q69L30M48P43J53q66j509m50J047R35O30o14j123o36M22J444J270q74p10
$$ plain form
1058 967 132 -1510 -1644 -151 403 744 117 -1174 -1913 -1550 107 1219 691 -970 -1592 -1256 -79 1555
1076 1555 1612 511 -1108 -1253 94 934 1566 911 -136 -793 -418 886 1984 1173 294 -861 -990 -58
1094 -58 625 1100 528 -1006 -1202 -305 597 1352 939 -19 -626 -1160 -243 1063 583 400 -520 -1028 -1272 296
1114 296 1847 1393 -480 -1158 -1073 -359 797 1602 529 -930 -1412 6 724 1270 1228 -202 -1534 -1370
1132 -1370 264 660 787 -609 -912 -1531 -905 383 833 269 -1068 -1589 -682 2 796 1089 8 -1050
1150 -1050 -862 202 1347 1371 880 148 -668 -553 729 1426 865 -331 -1154 -564 -283 517 1252 -287
1168 -287 -1492 -1751 -1045 67 604 585 -197 -955 -903 758 1309 1385 835 39 -461 -115 1067 1985 1253 83
1188 83 -786 -456 -8 735 888 22 -1487 -1937 -890 45 675 61 -1062 -1698 -1276 168 1438 564 -146
1207a46n32K30P17Q64L91n62j332j00P69L32M38l83q59q66p1R99L08l66n1m91
1227g11o66O00Q88R06n85r19j32J80O77M91O34o01o44m25J58R18K81J19j098n77
1247e06j07N20J320k17j087r07q3N23R24J66j50j213l96P03P12O20n5r57r55M14
1267g31R57P00l49n86l12n63P78P95k15j57p04p93N67K27M02L90q94k55R5k6J227
1288E53J52k39l73q47j70P63P34j04o82m66r3M05N90P60m96p11l97L64O32J82
1308E57K53p30m57l0R88M00K35m56n90r6j41J043l61j43p51k00l88O71M22o5k38
1329g7q88J47N20L72K58j84n12K1K7P71L77l43k38l78R3M01K8L02l81q47o9L42
1351b58oJ50n0m40n10P7L88L31N5Mk80O1N7N59J48L83n81L60j43j20P28l1l18
$$ plain form
1207 -146 -678 -448 269 1133 1524 962 -370 -470 299 631 1069 686 -173 -1039 -1110 -111 197 -169 -220 -711
1227 -711 -1377 -777 111 1017 432 -487 -619 -439 238 729 1363 762 118 -307 -149 769 1050 1169 71 -506
1247 -506 -613 -93 1227 1010 -77 -984 -1067 -544 380 546 396 -817 -1213 -510 202 822 767 -190 -1145 -731
1267 -731 226 926 577 -9 -321 -884 -106 689 474 317 -387 -1180 -613 -386 16 406 -488 -743 -648 -674 553
1288 553 705 466 93 -754 -924 -161 573 469 -213 -679 -772 -367 223 983 487 -224 -621 -257 375 557
1308 557 810 80 -377 -407 581 981 1216 760 170 74 -67 976 615 472 -279 -479 -867 -196 226 161 -77
1329 -77 -965 -818 -298 74 332 148 -364 -343 -316 455 832 489 251 -127 -34 367 395 697 316 -531 -600 -258
1351 -258 -264 -114 -164 -604 -1114 -1037 -649 -318 -263 -259 -539 -478 -421 138 286 669 88 448 305 185 913 882 564
1374E64n48l79M12N27o5l63p88k37J21M25J95no69J30j06N54R94m37j76o47K24
1395b74O37M23N9j69m37o4L78L10k4l19k59k22M7Q3n4JK8o65J41K86j65J29J21
1418il2k15k21J15N64j14J02j63j69J22L93oK65o70m55J25J06N28Ol97k52m58
1440h35L83N88j86oo70j80N86K94K11j65m56J35R8J87N88m39k48n03K73N40J25
1461C20O2k77l87pM81J10k2k5k10o4j23o1N73L18m92m43J16k08M54M42k85l14
1483d2m20L0K58L54m7j53k70K8J38O94J4l07l09r2k4M38J58M7n35j08j34L35J37
1506A90J93k76k31m14j22N73K47l02r4k05p2K05L46J98m24m41K73l4J89L87K85
1527D71o04l61J23O28K02j93j33l93k36L75N61o0n37l31R9p8M66J80n2m26l09
$$ plain form
1374 564 16 -363 49 576 511 148 -640 -877 -756 -331 -136 -141 -810 -680 -786 -232 762 325 149 -498 -274
1395 -274 363 786 845 676 239 175 553 863 839 520 261 39 86 169 115 116 144 -521 -380 -94 -259 -130 -9
1418 -9 -41 -256 -477 -362 202 88 190 27 -142 -20 373 367 632 -38 -493 -368 -262 266 272 -125 -377 -835
1440 -835 -452 136 -50 -56 -726 -906 -320 -26 185 20 -436 -301 -203 -16 572 133 -115 -618 -345 195 320
1461 320 382 105 -282 -289 192 302 280 255 45 -19 -142 -203 370 688 196 -247 -131 -339 115 557 272 -42
1483 -42 -462 -432 -174 180 133 -20 -290 -262 -124 570 584 277 -32 -124 -148 290 448 495 -40 -148 -282 53 190
1506 190 383 107 -124 -538 -660 -87 160 -142 -236 -441 -513 -308 38 236 -188 -629 -356 -390 -201 186 471
1527 471 -133 -494 -371 257 459 266 133 -260 -496 -121 440 380 -157 -488 -389 -467 -1 179 127 -299 -608
1548f08LN55J12J92K14n78k35L43K69M93m10J42m95j74M51N19k51p9n83r7J71
1569d6m9O37k04o90l66Q6M86M79p0l45q12L09M76L70K06l07p76K13L67M65L29
1590G58m0n41l92J17L03N15l74l33k87l60J36N23R4j36m60k49K1K50N33J58l82
1611a46l14p6J68M79L08K12k27p36J63N63M90K29n68n59j72J34O11k4m31l51n04
1632g51Q3M16N07J57o44m75L07K42L09K24k27l40l04L60N27J36K51l73p87J69
1652b13M74K54J77p17m45J1K41L21R7j33l18l84J01N70K91j82l10l97l0L78O32
1673D18J68m41j70m14R5P51J45On95j17k99N36N4J68L63q33j35k9L70M60N2l95
1695A58m02k16O23L58p2l11m33j84L89KN87j57o19k31j14P60R5O1k21n67j24N80
$$ plain form
1548 -608 -605 -50 62 254 468 -110 -345 -2 267 760 350 492 -3 -177 274 793 542 463 -120 -217 -46
1569 -46 -95 542 338 -352 -718 -632 -146 333 263 -82 -894 -585 -109 261 467 160 -616 -403 -36 429 758
1590 758 718 177 -215 -98 205 720 346 13 -274 -634 -498 25 119 -17 -477 -726 -705 -455 78 236 -146
1611 -146 -460 -536 -368 111 419 631 404 -332 -169 394 884 1113 545 -14 -186 -52 559 535 104 -247 -751
1632 -751 -668 -252 255 412 -232 -707 -400 -158 151 375 148 -192 -496 -136 391 527 778 405 -382 -213
1652 -213 261 515 692 -25 -470 -459 -218 103 200 67 -251 -635 -534 36 327 145 -165 -562 -592 -214 418
1673 418 586 145 -25 -439 -344 407 552 558 -37 -154 -453 83 137 305 668 -165 -300 -329 41 501 553 158
1695 158 -244 -460 163 521 449 138 -295 -479 -90 -88 499 342 -277 -508 -622 138 233 294 73 -494 -618 -38
1717c8L55K64j84n21o9K00J48L71j27l14k41N1K07ko7j30j28n59K60L55J77oo
1740dm58k72M20M16J49O7k55l49J81K97N42j54p3p98o3N39N02k07n04j69k96J75
1762c14J77K34m87J04m32pK36M71M89o14m0k14N01N10J58l04p7l94K71L75j42
1783E01J63l20l70n2m6J67L36n28m6l13JK38L22m5j71l85L2M49M06l18J43ql89
1806b33K63L65j47j01l19L76o16K44J27L37k90k27j63p1K42P6Q3j58k27m1J07
1827c73O58k90j8j94k7L05J5N73m81l04J60m6K94P5j01l09K14p7j17L16J25Q7
1849D85o58k69L84K13pn2j78j07O0J85N8l4j65N5k97M88k25K48R7k75j58k5k20
1872c97L82j07O1P2o6j2O9K99l2k39j16J41n4M36N9l60m31J13j6K8M78q5n48K2
$$ plain form
1717 -38 317 581 397 -124 -193 7 155 526 399 85 -156 -105 102 100 33 -97 -225 -784 -524 -169 8 2 -4
1740 -4 -462 -734 -314 102 251 318 63 -286 -105 192 734 580 507 -291 -354 185 687 480 -24 -193 -489 -314
1762 -314 -137 97 -390 -286 -718 -725 -489 -18 471 -143 -183 -397 104 614 772 468 391 -3 268 643 501
1783 501 664 344 -26 -78 -124 43 379 -149 -195 -508 -507 -269 53 8 -163 -548 -516 -67 339 21 164 156 -233
1806 -233 30 395 248 147 -172 204 -412 -168 -41 296 6 -221 -384 -455 -213 -137 -54 -212 -439 -480 -373
1827 -373 285 -5 -23 -217 -244 61 76 649 168 -136 24 -22 272 347 246 -63 151 74 -43 273 398 485
1849 485 -173 -442 -58 155 148 96 -82 -189 -129 56 114 80 -85 -30 -327 161 -64 184 281 6 -152 -177 -397
1872 -397 -15 -122 -61 11 -55 -67 2 301 269 30 -86 55 1 437 496 136 -295 -182 -198 -170 308 223 -325 -303
1896c03j71N10j83J01k31j14L1L77L59j70k18O6R8m2J52r7J75k50M5m8J52j91
1918D8P1l46j52j4Q1Q0k7j45J64j91J05L72k39K63J37m40L56Q4N0K75k15p7K03
1941D43k07K00J6l8l48o1j50K32jk54J81k40k18J89K53o9m0k36J40k7L56p2n8
1964iL75m05L2K05R9J98j17n23k9K59j46Q1l0l25n4P7K00j11J21k09j21J69qN30
1988B59k41j20j44J76K95l3%L8Kj89J43J8K94m29K48k87q5L55j91l1k44o1K3j05
2012c09J13J5L46K8l13R1J9n0L07j5j58k66K17L54j17j87Q4j24j62J54M7J28l47
2035a45K11j99J12J20J97J44n88Q3j38M95jj88j38k64N35l03N5k63K42L9j29Q2
2057d1m0K51k06k40J14j84L37J27J10n9J1m50L58J46J1K00l87k51J67J52j04L23
$$ plain form
1896 -303 -474 36 -147 -46 -277 -391 -360 17 376 206 -12 54 152 110 262 165 340 90 135 87 239 48
1918 48 119 -227 -379 -393 -312 -232 -259 -404 -240 -431 -326 46 -193 70 207 -233 123 207 257 532 317 240 443
1941 443 236 436 452 414 66 5 -145 87 86 -168 13 -227 -445 -256 -3 -72 -112 -348 -208 -235 121 49 -9
1964 -9 366 -39 -7 198 297 495 378 -145 -174 85 -61 20 -10 -335 -389 -312 -112 -223 -102 -311 -432 -263 -271 259
1988 259 18 -102 -246 -70 225 192 192 230 232 43 186 204 498 69 317 30 -55 300 109 78 -166 -227 -204 -309
2012 -309 -196 -181 165 193 -120 -29 -10 -60 247 232 74 -192 25 379 262 75 159 35 -127 27 74 202 -145
2035 -145 66 -133 -21 99 296 440 -148 -65 -203 292 291 103 -35 -299 236 -67 -12 -275 -33 6 -123 -41
2057 -41 -81 170 -36 -276 -162 -346 -9 118 228 169 180 -270 88 234 245 445 58 -193 -26 126 22 345
2079C45m02j28k36J55J86N4k65O6k78K74J69N9J69j55k98K62K76k49K06L11m59
2100F2J71j73J24p2J96l77k24K36l9J8J21j71j48k55J51N39k93K65j31m30K96
2121a34K95Q1K89j32j70O0Q9J21j70p1j31q8j15L00n4K9l73N0j42J37o3P7J84
2144F9k15k71N0N55j03n0M2l26R9J38J98J62qm57L00k21Q5M63l63j51OR2j3J25
2168B06K9j58m14O0J96N9%j05k71K61q1K27J84k82m0l4J13M1M7J29l77K01J2k4
2192b1J61M7m3j04l7j74k1Q8L05l36r0j29Q7J24R7J80j06k38p2P6J45N07j88j90
2216F8l07P2L98j5j08k67l3q4J34O67j58j75j71j71K34K31j76J11j92k60J85j3
2238c0J95l04P3j06R7k09J89L40l57j30J22J65L2K06j16N1k39L0L33j19O0j84
$$ plain form
2079 345 -57 -185 -421 -266 -80 -26 -291 -225 -503 -229 -60 -1 168 13 -285 -23 253 4 210 521 62
2100 62 233 60 184 112 308 -69 -293 -57 -96 -78 43 -128 -276 -531 -380 159 -134 131 0 -430 -134
2121 -134 161 242 531 399 229 289 378 499 329 258 127 39 -76 224 170 199 -174 -124 -266 -129 -192 -115 69
2144 69 -146 -417 -367 188 85 35 77 -249 -150 -12 186 348 340 -117 183 -38 47 510 147 -4 2 94 81 206
2168 206 235 77 -337 -277 -81 -22 -22 -127 -398 -137 -218 9 193 -89 -129 -163 -50 -9 38 167 -210 -9 3 -21
2192 -21 140 187 144 40 3 -171 -192 -104 201 -135 -225 -354 -267 -143 -46 134 28 -210 -282 -206 -61 446 258 68
2216 68 -239 -167 231 216 108 -159 -192 -276 -142 525 367 192 21 -150 84 315 139 250 58 -202 -17 -30
2238 -30 165 -139 -66 -172 -75 -284 -95 245 -112 -242 -120 45 77 283 167 218 -21 9 342 223 283 99
2260I9j21O5j66L24N9k16j09j56j40L73O0J10k79n6J20kQ8J83k28L9QK0n9J02
2284A18J9k7l08N3L59m2j8j07j82O9l80M70O7j52q7L5p4r0M23k1m76J68j47J93
2308a37J9K44pl2j52J58Q6J49N8m07J37j43R1J94j69N2j27o1k59K94p4J45K9r3
2332el50O7L30l7K24l72k71J97N4J85J56k96N4J16p2K43J74l84j63P6K35j36J03
2355A28o8m80K21m0j98K60KJ90l08M0Q2J94k21j72L31J06k00J27J56P7j88m4L8
2378C3J01r4K73l32K00j25j19Q3k1N3j4R6l83j26L79J82l52L5L0NL04q5o3j4N9
2403A05j60R9N0Q8k31k31K90Q1j13J12m1Q8k47L5m1Q3L69l81J46j98NQ1Q1k40
2427a70K85l34J43O8O1K43l20k83K60L66k16p0J12j61Q9j57N1Q3%N5k78QL5K39
$$ plain form
2260 99 -22 43 -123 201 260 44 -65 -221 -361 12 72 182 -97 -153 -33 -35 53 236 8 47 55 75 16 118
2284 118 137 110 -198 -145 214 172 154 47 -135 -66 -446 24 91 -61 -148 -113 -187 -277 146 125 -351 -183 -330 -137
2308 -137 -118 126 119 87 -65 93 179 328 386 -21 116 -27 64 258 89 141 14 -47 -306 -12 -86 59 88 -5
2332 -5 -355 -288 42 5 229 -143 -414 -217 -163 22 178 -118 -64 52 -20 223 397 13 -150 -74 161 25 128
2355 128 60 -420 -199 -239 -437 -177 -175 15 -293 -253 -171 23 -198 -370 -39 67 -133 -6 150 227 39 -5 33
2378 33 134 40 313 -19 181 56 -63 20 -1 52 38 134 -249 -375 4 186 -166 -131 -101 -96 208 123 60 46 105
2403 105 -55 44 94 182 -49 -280 10 91 -22 90 49 137 -110 -75 -116 -33 336 -45 101 -97 -92 -11 70 -170
2427 -170 115 -219 -76 -8 53 296 -24 -307 -47 319 103 33 145 -16 73 -84 -33 50 50 105 -173 -165 -130 109
2451A09j48k9j67L28q3j61L40l51n7J30J6j10n4K24j60J49n0m6J98R8O4n3k83
2474i6O8K04j04K24k88K26N2j51J58%n05K83j33p5J8NJ63j41j31j14M24m5J32
2497A74j93k34J18K8K94j59J93O1k39M9j07K42m9J61k04o2j57P7j40K3K21k34
2519a37M8j80J26R9k18n4k12N08n4k76K11K78k87J05K68Jj4L3n9n8j11K31k38
2542A0k14K09K7J7q2pj66L38m03L35j94K05k59J38p3K0M0O0J8O7r9j22K08R6j39
2567C0K24k71n3qR4j8L0j48j06J7K26k2k9Lm3M4m0o2J09Pj0p1k13K76%J32M2j88
2595d8J85n4j04J34K34l39J24j34m24K83L40l29J25n3k3K94k00J11O8j41k13J51
2617a3K54j30N4k15J19j1O9j93j58J70m3r6Q8L22ok77J0J53P5j62R2j83j09P9
$$ plain form
2451 109 -39 -68 -235 93 10 -151 189 -162 -219 -89 -73 -183 -237 -13 -173 -24 -74 -120 78 176 240 187 -96
2474 -96 -28 176 72 296 8 234 286 135 293 293 -212 71 -62 -137 -119 -114 49 -92 -223 -337 87 42 174
2497 174 -19 -253 -135 -107 187 28 221 282 43 92 -15 227 178 339 135 73 -84 -7 -147 -124 97 -137
2519 -137 -89 -269 -143 -44 -262 -316 -528 -20 -74 -350 -139 139 -148 -43 225 226 212 245 186 128 17 248 10
2542 10 -204 5 32 49 -33 -40 -206 132 -271 64 -130 75 -184 -46 -119 -99 -59 1 19 86 -13 -135 73 169 30
2567 30 254 -17 -70 -78 16 -2 28 -120 -226 -209 17 -5 -34 -31 -74 -30 -70 -132 -23 -16 -26 -97 -310 -34 -34 98 140 -48
2595 -48 137 83 -21 113 347 8 132 -2 -426 -143 197 -132 -7 -60 -83 211 11 122 190 49 -164 -13
2617 -13 241 111 165 -50 69 58 127 -66 -224 -54 -97 -193 -105 217 211 -66 -56 97 172 10 102 -81 -190 -111
2641a11J89o2j02J45N8p2q6J5o1J41O4j23k50L44j78J63j79l2o9J94K04j48J75
2664B19j31k53J76K04J3J31j39J1l90K18j13J99j72P1j45k2k2j60J93J10n8j2
2686g2mJ27J72j09P6k92N4k0K64j47K10r0j72J16R2o9J4k85j34L00j09j53K6j
2710b06J49j15J2M77k47k8l43J09N4J48M19k25j44j08O1N1lJ00j37L7Ll7J39j19
2734D7J37k76N3j78j45P5K70M7k33q2N5R1J95k26L07L0j42j05J24N5J37k10k16
2757a90J02M6J79kk13J92j61L4k02J46M0o3k01K53N2ON2l12M23k93J42N2k40L03
2781A45m13m7L15J47o0L9k38Q7P8j49J87J02n63M07l33J85K20O9j00n6k50J21
2803a07P7J87q0M9k03L77j11k07j13q4J00p7K29j0q5nJ45q4k10L40j03J70Q5k12
$$ plain form
2641 -111 78 16 -86 59 117 45 -41 -26 -87 54 118 -5 -255 89 -89 74 -105 -137 -206 -12 192 44 219
2664 219 88 -165 11 215 228 359 220 231 -159 59 -54 145 -27 44 -101 -123 -145 -305 -112 -2 -60 -72
2686 -72 -76 51 223 114 190 -102 -48 -68 196 49 259 169 -3 113 205 136 150 -135 -269 31 -78 -231 -205 -206
2710 -206 -57 -172 -160 317 70 42 -301 -192 -138 10 429 204 60 -48 13 64 61 161 24 61 64 27 166 47
2734 47 184 -92 -39 -217 -362 -287 -17 30 -203 -285 -230 -139 56 -170 137 167 25 -80 44 99 236 26 -190
2757 -190 -88 -42 137 135 -78 114 -47 -13 -215 -69 -29 -92 -293 -40 12 18 70 -242 181 -112 30 82 -158 145
2781 145 -268 -315 0 147 87 126 -112 -25 53 -96 91 193 -370 37 -296 -111 109 178 78 22 -228 -107
2803 -107 -30 157 77 126 -77 300 189 -18 -131 -215 -115 -192 37 27 -58 -63 82 -2 -212 128 25 195 280 68
2827F8m0m52L76O4l1m4Q6p6Q3j1K11k32j03J6j05J1J00J4K07l54K34J00j37M53
2851D38l80k1j01MJ71m8k6K20l58j03K35Q9q3m2j66l5j7K00L3j93N9j2K08k13
2875a41K30O5k53J90r6K0j52K38J8J5l81K21K06n7M7r8j02k45J29K06k27K6n4
2898a95Q0j10J52j29K90j25o3k04K51O7P8j92J44J29l21M00j71j8j36J27m2l6
2920b4J02J21l13j07J87o8r9J69n2K30l65K64L2P9O8o9m96K67J39J3J91k07k21
2943a59j72L39Q3J07j88r2O6k0K66j14L0k00q4q3Q8K54j90P7j03l6n9J72k47M20
2967A55j02m6q0K32j80N3O9j25rN8KP9k73K20l04O4M01k3q0j44JJ9K27j1k97K55
2993A61l56l9L94l44K52o1l74M79rk04K11o2j05j08J62mq9r5K16j62k1M91j09
$$ plain form
2827 68 28 -424 -48 16 -15 -59 27 -49 34 23 234 2 -101 -85 -190 -179 -79 -65 142 -212 22 122 -15 438
2851 438 58 37 -64 -60 111 63 37 257 -101 -204 31 120 37 -5 -171 -206 -223 -23 10 -183 -124 -136 72 -141
2875 -141 89 154 -99 91 -5 15 -137 101 119 134 -247 -26 180 123 170 72 -30 -275 -146 60 -167 -141 -195
2898 -195 -115 -225 -73 -202 88 -37 -100 -304 -53 14 92 -100 44 173 -148 252 81 63 -73 54 12 -24
2920 -24 78 199 -114 -221 -34 -102 -201 -32 -84 146 -219 45 77 156 224 155 -341 -74 65 78 269 62 -159
2943 -159 -331 8 91 198 10 -82 -16 -36 230 116 146 -54 -138 -221 -133 121 -69 8 -95 -131 -190 -18 -265 155
2967 155 53 7 -73 159 -21 32 101 -24 -33 25 27 106 -167 53 -251 -187 214 191 111 -33 -32 -13 214 203 -94 161
2993 161 -195 -234 160 -184 68 7 -367 112 103 -101 110 48 -57 -165 -3 -7 -96 -191 25 -137 -158 333 224
3016B24k05L15j26m8j61r6J29r5l1p5j3J65J10k57K58l28K16Q2j09l2R0R8P8o9
3040A20k47K03J49k75J03K38k12J71m97L37j35j05K01j26P6J05l8j04m5K18k96
3061a59j09k2K60J23j40j87L68j92K90M3l12J16J67q2K17o34K27K13j32J09k1
3082A43k10j46k3m9M11k29p2R2Lk34O1M97j05m4K2j78P4J07k08J48J56k41k9n7
3106a11J91M4l89L73J76j50j20K3j20n5n7J18K08k72Q0K0R6j20j4R2M5K4j65r1
3130a74L03o0K4N4O2l19J27J06j51k0l7K85j33k84L36j02m7O8r8J99j41j37R5
3153d4J11P5N6k47Q0K68o1j26j98O2J1O6J53r5K4l39J04%J47k39K72q8L4K9j11
3178e6p0P9p2K38L7j51q2J09k1j90J40J20j42K95l86O0L0J39J32k32K27m32J45
$$ plain form
3016 224 19 334 208 160 -1 -97 32 -63 -94 -169 -182 -17 93 -164 94 -234 -18 64 -45 -77 13 111 189 120
3040 120 -127 76 225 -50 53 291 79 250 -247 90 -45 -150 51 -75 1 106 68 -36 -81 137 -159
3061 -159 -268 -290 -30 93 -47 -234 134 -58 232 275 -37 79 246 164 381 -253 -26 187 55 164 143
3082 143 -67 -213 -236 -285 126 -103 -175 -83 -80 -314 -253 244 139 95 117 -61 13 120 -88 60 216 -25 -54 -111
3106 -111 80 124 -265 108 284 134 14 37 -83 -138 -195 -77 131 -141 -61 -41 55 -65 -79 13 58 82 -83 -174
3130 -174 129 69 93 147 209 -110 17 123 -28 -48 -85 200 67 -217 119 17 -30 38 -60 139 -2 -139 -44
3153 -44 67 142 198 -49 31 299 238 112 -86 -24 -13 53 206 111 135 -204 -100 -100 47 -192 80 -8 26 55 -56
3178 -56 -126 -47 -119 119 156 5 -77 32 11 -179 -39 81 -61 234 -152 -92 -62 77 209 -23 204 -228 -83
3201h3J54k04J73K57l95J13q8J04J1j7j44l16O07j92J81k33n1J46p8M8J13j92
3223h6J75j00j59M39k88J13o8n4K23j01l69M22K4j81M4m9P3k9j7n1Q9l37J08J47
3247c2O1K3J14l33K57n0j37J70k17L03k79P2K0J09o4J6qK85l93J28L9j31Q6k12
3271a73K60j16j09K16q6n3q7M8j6K51k04k54L02j74O0K92j72oq2L02j29R8l7J1
3295A42k05P0K4j22J9Kn9J32k86K52mj86K60j15L1J46j73Q3Q7Jl2k25K60k53J92
3320D1K1J4L2k6j82L42j16j1L3l12M6R8J13N8j30j27p1o2K04J7J34k69M0k27N39
3345A99j04k86NR8J6o6M74n40K67k61O6L76l51K63k11Qj88K07M4L3P7j61L3K0
3369A8Q7j14k07K61q4j18R4o7MJ4M1R8kl4J10k69M1j1N5J23j11R4r8Q0J0l7p5
$$ plain form
3201 -83 71 -133 40 297 -98 15 -73 31 42 25 -119 -435 172 -20 161 -72 -123 23 -55 -7 106 -86
3223 -86 89 -11 -170 269 -19 94 26 -28 195 94 -275 147 171 -10 34 -15 58 29 12 -39 50 -287 -179 -32
3247 -32 29 52 166 -167 90 40 -97 73 -144 159 -120 -48 -28 81 17 33 25 310 -83 45 84 -47 39 -173
3271 -173 87 -29 -138 78 -8 -61 -148 -100 -116 135 -69 -323 -21 -195 -135 157 -15 -21 -103 199 70 168 131 142
3295 142 -63 7 31 -91 -72 -70 -129 3 -283 -31 -35 -221 39 -76 -45 101 -72 11 98 99 67 -158 102 -151 41
3320 41 62 76 108 82 -100 242 126 115 148 -164 -118 -20 93 151 21 -106 -177 -239 -35 -18 116 -153 -113 -340 199
3345 199 95 -191 -186 -88 -72 -138 336 -204 63 -198 -132 244 -107 156 -55 -47 -235 -28 16 49 126 -35 -2 18
3369 18 105 -9 -216 45 -39 -157 -63 -130 -126 -112 -71 27 25 -9 101 -168 -127 -138 -83 40 -71 23 -75 5 15 -22 -97
3396i7M05q9m63K82k06K61J49l01p2j8M3P5J88m5j24L7j20J09j86K33P0j51j1
3419c1O2N5j49j1J76L3o2K5j95K22k02k9R8L1M9k55M6R6k88J86J77j8O3J57mk71
3445c9l9K13l8Q3r8j15Q0J7K5M3j31j28K04J58l09j8j22J16M2N1r4l6L1Q9J16
3470A01k10O4J11k4J35l7Q4l88K71J66j64L8k16K22J1r6j5K2j7j36L26l67J60
3493D1K36l54j67R4QJ53J12k95j16J38M1L75j20or2k28J7K41j25K4L09l26J57
3516A17j24Q1KM3j38j00pJ75j28J38J5O7k12LK99j36k83L83j65q6R4O3j13K17
3540B05l17Q7K6L20k58m6J23n24L11J21K36k04O7l24K80k99J71r6mj7o7K05K70
3563B66m9l38K75k61mJ45M9q2j20J58PJ6K19m13K37l5J18l85K73J35k02J01j01
$$ plain form
3396 -97 308 219 -244 38 -168 93 242 -59 -131 -149 -106 -31 157 112 -12 25 -95 14 -172 61 131 -20 -31
3419 -31 31 86 -63 -74 102 135 73 98 -97 125 -77 -106 -8 23 72 -183 -137 -41 -329 -143 34 16 79 236 232 -39
3445 -39 -78 135 97 180 82 -33 47 64 89 132 1 -127 77 235 -74 -92 -214 -98 -56 -5 -99 -135 -104 -15 101
3470 101 -109 -45 66 42 177 140 224 -164 107 273 109 147 -69 153 164 68 53 75 58 -78 248 -119 41
3493 41 277 -77 -244 -150 -142 11 123 -172 -288 -150 -109 266 146 140 48 -180 -163 78 -47 -23 286 -40 117
3516 117 -7 74 76 119 -19 -119 -126 49 -79 59 74 141 -71 -68 231 95 -188 195 30 -56 38 101 -12 205
3540 205 -112 -25 1 321 63 17 140 -384 -73 48 284 80 147 -177 103 -196 -25 -121 -125 -142 -209 -4 266
3563 266 217 -121 154 -107 -111 34 83 1 -119 39 46 62 281 -132 105 70 188 -197 76 211 9 110 9
3586IL12k34r3O7L2j48l4k17L37j86M8J23J9R7p3J71l18J9J75m1P6j80P0j14Q4
3611AO3K0R7J8r1M7r3k37J57j9q0L18k95k35L18J59j91m0J41k51J26J00j0K30
3635B53l37j15K75q2J87m1k45K31j3j09K07j98m3J42J11m09J96j6q1J11j25l1
3657a32K75j56P9j29q2K31RJ1K6k61K98q3k15J91J09k26O6j3J35k96Q2q3r8L08
3681D6p8j04q1K64J47p2k23O1j3K78j25o9N6RO3k1p8o6q4P6j62K67r8J17j36j37
3707a63m7K80j52Q8J00l09O1k4K90j44Q4J20l25M02n2k21k08K84p3J8J03J6o7
3730F1K7K2k16L3J40J14k26J19j17J77l47J92K33j83k33K99Q5k91L31j97K1k18
3752a74k1J09l05M76l13r7K04L34j79J44po5R3l90J52O8j16m6L14k77K32k56K87
$$ plain form
3586 9 321 87 -6 61 93 -55 -89 -306 31 -155 -107 16 35 132 59 230 -88 -69 106 65 141 -39 31 -83 1
3611 1 64 84 181 199 108 155 62 -175 -18 -37 -117 201 -94 -329 -11 148 -43 -83 58 -193 -67 33 23 253
3635 253 -84 -199 76 -6 181 140 -105 126 113 4 211 13 -30 112 223 -186 10 -6 -87 24 -101 -132
3657 -132 143 -13 66 -63 -145 86 95 106 132 -129 169 86 -129 62 171 -55 11 -2 133 -163 -81 -164 -262 46
3681 46 -32 -136 -217 47 194 122 -101 -40 -53 225 100 31 87 96 159 138 60 -6 -90 -14 -176 91 -7 110 -26 -163
3707 -163 -210 70 -82 6 106 -203 -142 -166 124 -20 64 184 -141 261 209 -12 -220 64 -9 9 112 128 61
3730 61 88 110 -106 -73 67 181 -45 74 -43 134 -213 -21 212 29 -204 95 180 -111 220 23 44 -174
3752 -174 -195 -86 -391 85 -228 -325 -121 213 34 178 171 106 199 -191 -39 29 -87 -133 181 -96 136 -120 167
3775A67o8p8j27R8P1k46l4K44k80J72K33j25M8n3k01K20J2L07j74k4n5k81Q7K05
3799A18j2q6j49K67r8l56L24J13o9j19j3q3j0K82j82m0K54l65L40q9l5M2l9K1
3823A6k28J81M1r1J31O8K34k90rLJ17j94j34K20k59N4K49k42n1P0R8k22L3K27
3847B2j6q9L6J24j72L38k37J53L3m05L67J03l90J71r9L3m3J1Q1j59L4N1L3m6Q6
3872B0j41r5R4k8K32j25P7n2r7M0P0J01j86K0J44m9P6m74M26R5r5j06j31J05m1
3897a20J71q8k6r9R5K37k29K6j11J44P3j2Q6n2l3K0J73m25K84R1M3k26p8k8k3
3922a07K48j78R1k07R1K29k71K36q3J30l76J49J02o6L8k44R8k2J00m4j10K91j24
3945b9J77k63m9k2K74m88O66j9n44LM17J8m8p0q5q1K10j75J34q3J50k7J3N2q6
$$ plain form
3775 167 99 21 -106 -8 63 -183 -217 27 -253 -81 152 27 75 22 -179 41 53 360 186 162 107 -174 -87 118
3799 118 106 20 -129 138 40 -316 8 121 52 -67 -80 -163 -173 109 -73 -113 141 -224 116 27 -8 34 -5 16
3823 16 -212 -31 10 -81 50 118 352 62 53 56 173 -21 -155 65 -194 -140 109 -133 -184 -114 -16 -238 -205 22
3847 22 6 -83 -47 77 -95 243 6 159 192 -213 154 257 -133 38 -61 -28 -71 -60 21 -138 -104 -53 -20 -66 20
3872 20 -121 -216 -122 -150 82 -43 34 -18 -115 -75 -5 96 -90 -70 74 25 101 -373 53 148 53 -53 -184 -79 -120
3897 -120 51 -37 -63 -162 -67 170 -59 -33 -144 0 73 61 147 95 62 82 255 -170 114 205 248 22 -56 -84 -107
3922 -107 141 -37 54 -153 -62 167 -104 132 49 179 -197 -48 54 -12 26 -218 -120 -142 -42 -86 -196 95 -29
3945 -29 148 -115 -164 -186 88 -400 266 247 -297 -294 123 141 93 23 -62 -143 67 -108 26 -57 93 66 79 131 45
3970D5j07K0K16l12N3k9N0K68k01j75O8J67j40o3J57j06K78j12k7O1k23N2Q4J28
3994A52L4M5m00J96m0K7k11L97j73N7k31L9N2l7N6R8j36Q9J89M8k07k32M02l30
4018a16L43L6j19l08N5R0R5k09K5n0O7J39l9Mk19J43K38k84R1P9P9k59j28L44
4042I7j63N8P7j07J85j97J9K13m0k87J41%n75L76J53r1P6R3j19r4K01r5M9R3k7
4067C6j97J50J89j16J08n7j46K64q5r6o2j5N8p0o1n8N9J19M6j97K39q8j64K59
4091A15r5o3J12l11K79Q0r9O8j5k4k37K04J94pk86j06R8J67K4k09J46j73J59J50
4115A71J02k45Pm7j13jM2j06P1j11J41O9K08r6k60K29j11J11R1j37J6j76K59j66
4139e2q3M52k51q6J51k21J73p3j38K79j00N7o4Q0k22MQ2j20J08J81k64J12k11
$$ plain form
3970 45 -62 -42 174 -138 -85 -114 -64 204 3 -172 -104 63 -77 -140 17 -89 189 77 50 111 -112 -60 24 152
3994 152 186 231 -169 27 -13 14 -197 200 27 84 -147 -108 -56 -93 -37 61 -75 14 203 251 44 -188 214 -116
4018 -116 227 263 144 -164 -109 -19 76 -133 -108 -158 -91 48 9 13 -206 -63 175 -109 -18 61 140 -119 -247 97
4042 97 -66 -8 69 -38 147 -50 -31 182 142 -145 -4 -4 -579 -203 -50 -141 -65 28 -91 -185 16 -79 -30 63 36
4067 36 -161 -11 178 62 170 113 -33 231 146 50 -12 -27 31 -39 -100 -158 -99 20 66 -131 108 20 -144 115
4091 115 20 -43 69 -242 37 117 18 86 71 47 -190 14 208 201 -85 -191 -93 74 98 -111 35 -138 21 171
4115 171 273 28 35 -12 -125 -126 -84 -190 -119 -230 -89 -20 188 92 -168 61 -50 61 152 15 31 -145 114 -52
4139 -52 -135 317 66 -20 131 -90 83 10 -128 151 51 108 44 124 -98 -94 -12 -132 -24 157 -107 5 -206
4162b06J02J84p2K3j16n6R4j62L65j14M34n13p2J03K6P5l46L56j19j1k31M36n0
4185A30j37j01K88k9j04j51K7K29q6l6p2J41N4k70L05l24Q3J90Rk43M47j96j13
4208D1R9p0m4k35L65k55J12j77J71K28m04k14K17O7J47j06J38K00m23K4K3M1L32
4231B77l62K08N3j8K58n10n6K22J25k22K3k11L54k85n8K33l95K23J44L0o1R2m58
4254c94L80J18q0J16l39Q3K58qk6j50J50j40l01J67K16j40j22J40J89j77P0Q2
4276I2r1Jq4k37K62J98j5o6r3o7Q6K13j84M4M5j10j57j39K91O6P7k66J81k05J58
4301@k17J78j93K71P0p0K48l85j73K71K16j39j25L8k6L5j14J10N4lJ1J39j67j87
4325a58K29j10r3k7P9o4K95k0K6j45j24R9L7j07Q1J03j78r4QJ50p7K14n3k07O0
$$ plain form
4162 -206 -104 80 8 31 -85 -141 -47 -209 156 42 476 -37 -109 -6 20 95 -251 105 -14 -25 -256 180 130
4185 130 -7 -108 180 151 47 -104 -77 152 66 30 -42 99 153 -117 188 -136 -53 137 146 -97 350 154 41
4208 41 140 70 26 -209 156 -99 13 -164 7 235 -169 -383 -166 -99 48 -58 80 280 -143 -119 -96 -55 277
4231 277 -85 123 176 158 416 -94 -150 72 197 -25 -2 -213 141 -144 -202 31 -364 -141 3 33 -28 64 -394
4254 -394 -14 104 24 140 -199 -116 142 134 108 -42 108 -32 -333 -166 50 -90 -212 -72 117 -60 10 92
4276 92 1 2 -82 -319 -57 141 126 60 -33 -100 -14 199 15 59 104 -6 -163 -302 -11 55 132 -134 47 -158 0
4301 0 -217 -39 -232 39 109 39 287 -98 -271 0 216 77 -48 -10 -36 -1 -115 -5 49 46 57 196 29 -158
4325 -158 71 -39 -132 -159 -80 -144 151 131 157 12 -112 -13 24 -83 -2 101 -77 -171 -163 -13 -90 124 71 -136 -76
4350g6k13L39Q3j71O4j89J09J67k79K73L01m54M1J08J80L8l37K73k99J10q3J51
4372A36k20Q2k14L0L09J6j13j42J58l11J72j3L57k04R2k78J43o7K3J7K05l09M2
4395h9R9p3J80j11Q2m8j60K5j0R7J74l45k0j65M22k2M2k08J71k75L40N9j62Oo9
4420f0n3L3J41P6J34j28j78J46k67J6Q0J43j07j42R9R7k2K54k30j86N8N6J17p8
4444aK04o4m9k49n1L44Q9m13K92j93K42k0kr2j00J36j6pj47Qj06J05K16j56o9
4469i9M8J53r1J29p9j9O0m0j8K3k61J74J05R6N0k71O1o0J76n3J23l36J30k35L65
4494A31j79K7k0j68L38r0L7j30m9j3J69ol5K0J84k97K63q9q5k0J35j43l8J84M1
4519A67o4j02J25J85j99J9j4P6jok28j34L13j33p6k63L73k13k89L48Q7m3M29n70
$$ plain form
4350 -76 -289 50 133 -38 26 -163 -54 113 -166 107 408 -46 -5 103 283 321 -16 257 -42 68 -15 136
4372 136 -84 -2 -216 -186 123 139 26 -116 42 -269 -97 -110 247 43 135 -143 0 -67 -44 -27 178 -131 -89
4395 -89 10 -63 117 6 88 40 -120 -95 -105 -8 166 -179 -199 -364 58 36 78 -130 41 -234 106 165 3 9 -60
4420 -60 -113 -80 61 137 271 143 -35 111 -156 -140 -60 83 -24 -166 -67 30 8 262 32 -154 -96 -40 77 -1
4444 -1 203 139 90 -159 -210 134 223 -190 102 -91 151 131 129 37 -63 73 57 50 -97 -89 -195 -90 126 -30 -99
4469 -99 -51 102 11 140 61 42 102 62 44 67 -194 -20 85 181 231 -40 21 -39 137 84 207 -129 1 -234 131
4494 131 -48 -21 -41 -209 129 39 76 -54 -103 -116 53 47 12 32 216 -81 182 93 8 -12 123 -20 -58 126 167
4519 167 103 1 126 311 112 131 117 193 192 186 -42 -176 137 4 -72 -335 38 -175 -464 -116 -29 -72 357 -213
4543b13J6K05j19QL78l23P4Q4n1N3L0l05K0K65k4K1j42J53l13J15k6j2M0K56m0
4568A50k48J37l8K2j08M32l50k8J47K4j39O4j67J76p6J77k51L68j67k73J02l0
4590g6J31j80O4m5mo7J50j56J80k67K41j25j81J75J58R2k8p0R4K49k12J63j33
4613A53j08j57J23J26o1N4j12k43J93K7j83J44j68L31j77j47K57j75K0n6P2P3
4635a4K00Jk25K42j82J20j13rj26P6K63k14K33j43j05K9kR6l04K07j92L26P8l20
4659g8J49J04P1l18j01L5N3%J79k09k4K17n1O1j08L01j76k33K62m7j47J22K60
4682C22n92J15K26J01k5j51j9Q3m3J03p0k28O4J52k7K28l13r0K34K28l90M1J14
4705F3K01k50K18j30n3m4Jj25J50j91J59K00j96J12j29p9j83L29j36j15L39j94
$$ plain form
4543 -213 -197 8 -111 -103 275 -48 26 110 59 112 142 -163 -143 122 98 119 -23 130 -183 -68 -94 -106 -66 190 150
4568 150 -98 39 1 23 -85 347 -3 -31 116 140 1 65 -102 74 -2 175 -76 292 125 -148 -46 -76
4590 -76 55 -125 -61 -106 -110 -177 -27 -183 -3 -270 -29 -154 -335 -160 -2 90 62 -8 86 335 123 286 153
4613 153 45 -112 11 137 76 130 18 -225 -32 -5 -188 -44 -212 119 -58 -205 52 -123 -103 -159 -87 -14
4635 -14 186 187 -38 204 22 142 29 20 -106 -30 233 19 252 109 4 33 31 127 -177 30 -162 164 242 -78
4659 -78 71 175 246 -72 -173 -138 -85 -85 94 -115 -139 78 27 88 -20 281 105 -128 134 87 -60 62 322
4682 322 -270 -155 71 172 147 -4 -23 60 17 120 50 -178 -114 38 11 239 -74 -164 70 298 -92 -51 63
4705 63 264 14 232 102 49 5 6 -119 31 -160 -1 199 3 115 -14 -93 -276 53 -83 -198 141 -53
4727e3j34K22r2o2J60k86N28m11J63n5j4l8L93k48j20K61M2k71K9j20J16j93Q7
4750i6m5j33M24k96L63l83J72L4P2k13K17j66L2P8j95m8K17M4j18J49P5j6o1n4
4774E3n4L43m41k4J89p4N4P5L38n06k9K38k32j85L50l57L5n3K06n4L45j05J75
4797B87l30o5P8l4P2Q7Nm2l54j9K70J5J31j33l6q1J9J5K64k01J43k29KJ87m60
4822d09N30j13J57l94J63M39k68mj6J10j31r2j42N8J72n1k38J91K0l9J87j36j7
4845b3J21j00M5k41L90k51m4K21J4k2k19K92j61r0Q4O6l9j21O5j34Q8L5J31k72
4869a65l9P1k5L15j90Q4k11k4J48R8j13m9o0j3K15J11k08J66J85m75R8R8J81j26
4893G2j02Q9l1K4J05j51J11Q1P5k72J21k23J82j60J62J50l18L38j53l81L07k1
$$ plain form
4727 -53 -187 35 -57 -119 41 -245 283 -128 35 -20 -34 -72 321 73 -47 214 256 -15 14 -106 10 -183 -96
4750 -96 -141 -274 150 -146 217 -166 6 40 112 -101 116 -50 -18 60 -135 -183 34 78 -40 109 184 168 107 53
4774 53 -1 342 -99 -123 66 -8 46 121 459 -47 -76 162 -70 -255 95 -262 -227 -280 -74 -128 217 112 287
4797 287 -43 -108 -30 -64 8 95 100 58 -296 -315 -45 -30 101 -32 -68 -149 -130 -115 149 -52 91 -138 -136 51 -409
4822 -409 121 8 165 -229 -66 373 105 101 85 195 64 -28 -170 -112 60 9 -229 -38 -18 -57 130 -6 -23
4845 -23 98 -2 43 -198 192 -59 -103 118 132 110 -109 183 22 -68 16 82 43 -78 -13 -147 -59 -24 107 -165
4869 -165 -204 -133 -158 157 -33 51 -160 -184 -36 62 -51 -100 -160 -173 42 153 -55 111 296 -179 -81 17 198 72
4893 72 -30 59 28 52 157 6 117 198 273 1 122 -101 81 -79 83 233 -85 253 100 -281 26 5
4915EJ1k31L8J30n9K33k37J56k30K13K53k67J43k87m0K69J22j98J66ok55p3P7
4938f7K84l59J05n9j68K70j40R8j82K79Ol04K94j24R2l29K84J56j83Q0k0m4j87
4961b18J1J70j05J85K32n48L39l5J5k7j18J33j20k95K71p3J52r1J50J89j08l7
4983G2l7j62J21K07q0j50R7j3J66k90J60j70J84J30r6K6m66K52j3K06P1m82J50
5006a17L44j99k05K98j27L9K58k36J40l59L95j94oJ28k11J31k91K30l9J12j64
5027g3J28j16k6O1m5K71l03K50r0J00l6l09L0J01K13K3l93L58p8j88L64j12p0
5050F0J17r4j39L2j08L30m04L37l82L39j12L84m83K28L1j75K79j03N9l45L03k39
5072h5M7j81K67k54M00l47J49k67K05j9J70k50K49R0l37K18lK3j27j27L05j26
$$ plain form
4915 5 16 -215 -177 -47 -106 127 -110 46 -184 29 282 15 158 -129 -169 100 222 24 190 184 -71 -144 -67
4938 -67 217 -142 -37 -96 -264 6 -134 -36 -218 61 67 -237 57 -67 25 -304 -20 136 -47 33 13 -31 -218
4961 -218 -207 -37 -142 43 275 -273 66 31 46 19 -99 34 -86 -381 -110 -183 -31 -122 28 217 109 72
4983 72 35 -127 -6 201 121 -29 68 55 221 -69 91 -79 105 235 139 165 -301 -49 -62 144 215 -267 -117
5006 -117 227 28 -177 121 -6 33 291 55 195 -164 231 37 31 159 -52 79 -212 18 -21 91 -73
5027 -73 55 -61 -87 -26 -71 200 -103 147 57 157 121 -188 -158 -57 156 179 -214 144 66 -122 242 130 60
5050 60 177 83 -56 -24 -132 198 -206 131 -251 88 -24 360 -123 105 136 -39 240 137 196 -149 154 -85
5072 -85 -38 -219 48 -206 194 -153 -4 -271 -66 -85 85 -165 84 174 -163 55 52 75 -52 -179 126 0
5094@K36o41L91L6j40L53m21K22j09L49m87J94J9O6p7j14R7j38R0K89m9m03K39
5117BP6l82K01L39k58n5R8K5Ok33M82k32j78J32O3L4n11M37j08j16J82l7n7O0
5141c0O9O1j32O3l7p6K1O5j9K40l0l44K35K2P8j65J7k6j1J33l68K71j69J04q6
5166a14J92mqL1j72J67p4J49k70L12j13j03R8J5j89J42K20n61L07J80o4o9P9l46
5190a95%O4N5K52J95m04J44J04l54K58j17K20m09J95J41o3J84k95J15j46o2n6
5212a74J60K0j71J14j37K3J62n8K47r7j83j98K99p2K0M1O5o9j3j7P6J75l13k4
5236a24M71l24P0p5J05j69j92M80j83q5l0k0K18j85J92o2K65m96L06k15n7J17
5258Gm3k8j9O2p8l9K0L8MJ97l18L21j04L9L9K8k16L33j85j34J97k64N2J51J20
$$ plain form
5094 0 236 -405 -14 22 -118 235 -186 36 -73 276 -211 -17 2 68 -9 -123 -26 -164 -74 215 166 -237 2
5117 2 78 -304 -103 236 -22 -77 21 46 52 -181 301 69 -109 23 86 120 -391 46 -62 -178 4 -33 -90 -30
5141 -30 39 100 -32 31 -6 -82 -61 4 -15 225 195 -149 86 108 186 21 38 12 1 134 -234 37 -132 -28 -114
5166 -114 78 74 66 97 -75 92 18 167 -103 209 96 -7 91 106 -83 59 279 -282 25 205 141 72 151 -195
5190 -195 -195 -131 -76 176 371 -33 111 215 -139 119 2 222 -187 8 149 86 270 -25 90 -56 -118 -174
5212 -174 -14 6 -165 -51 -188 -165 -3 -61 186 89 -94 -292 7 -65 -45 -4 61 -8 -21 -38 38 213 -100 -124
5236 -124 347 23 93 18 123 -46 -238 242 59 -26 -56 -76 142 -43 149 87 352 -144 162 -53 -110 7
5258 7 -36 -64 -83 -21 -99 -138 -118 -80 -76 121 -197 124 20 59 98 126 -90 243 58 -76 121 -143 -91 60 180
5283A80q3Q5k22K1Mo9j2N1K13l36K96k12P5j86O5J98k7J15j91J13p2K9l1j2J52
5308A44qj18J9j6qK16k6j34J9K3l12J81K7k07K30k07L07j4k19K50j63N9j54J50
5332C9Q8j02q0K32m7k84L59k77K61Jj0m41J39J55k35R4j07K05k94M12j62j12k00
5355c66L42l1p5J13J61q4J4j14O9q0K3L2j82K13Mk2l6r0M4K3lK77l00k71J20Q4
5381a35J69o4J25k51j03J58K13k15O5%J40k92o5J56J29m1L3M6k4K52k36q1J2l8
5405d7K9L6J95m51M96l39n6q3K54l5mJ9J60m06J17J93j94K4j02J64K9QlK74l52
5430g4K20m29L20l8J90j57M1q2m0q0J15q0M4O3K94m33p9O5K31j25MK11o9m66M67
5455A13j90j7J3QJ7J45J29j24q8PK04j03n7j40j3K7N6L2J07l7k21j00N33l52j04
$$ plain form
5283 180 97 182 -40 -19 -15 -84 -96 -45 168 -168 128 -84 -9 -195 -130 68 41 156 -35 78 6 35 4 -8 144
5308 144 136 18 37 21 13 229 203 69 88 111 -201 -20 7 -200 30 -177 130 116 -103 147 -16 43 -111 39
5332 39 127 25 -55 177 130 -154 205 -72 189 190 180 -261 -122 33 -202 -108 -215 -10 -304 108 -54 -166 -366
5355 -366 -24 -55 -130 -17 144 60 74 -40 29 -51 -28 4 -178 35 39 17 -19 -109 -65 -42 -45 232 -68 -339 -219 -135
5381 -135 34 -30 95 -156 -259 -101 112 -103 -38 -38 102 -190 -255 -99 30 -11 22 68 44 296 60 -21 -9 -47
5405 -47 -18 18 213 -238 258 -81 -137 -220 34 -1 -5 14 174 -232 -115 78 -116 -92 -194 -30 -1 7 4 278 -74
5430 -74 146 -283 37 -1 189 32 73 -9 -49 -129 -14 -94 -50 13 307 -126 -205 -140 91 -34 -30 181 112 -354 113
5455 113 -77 -94 -81 -73 -56 89 218 94 6 13 217 114 57 -83 -96 -69 -13 19 126 89 -132 -232 301 -51 -155
5480a55l9K64J36k99J83l0j2p1j81M25m54M67j22j04M1K3j26O3J42j93J09J22
5502A89q7N2q2o0k6k69L68j20j6J93k7j1j79qm1J39j54K44nR1q2p9j11J1j13N2
5528a31K35j02J33n11R7K07O5k62J70O2N2j97L07p7j60K7q4J48p4J72k31J42P2
5551F0J08O2j35k4N1j38J8J46o3l1j79K35k65J26J25k75J4L47l29j32L73j09m6
5574f1r0r6K61o4n7K94l10L16k44N5j54L67k05K70Ml41k2Q0k32rJ08J06nN2NJ60
5600A88j61mm6J01m5PoJ8k1j27Q7J32k0j63m1%J75m8k08K55j80R5J44l21J32L1
5626b6J05R4l36L35J36m18k2J32l9J77l12J89J22j43m6qK06K1j21k43L01j27j43
5649a66J72P6k02L23r0k0L5p0P1j89q0L32J7r7n8m1O9n1k98K27K32l18Q8j99K86
$$ plain form
5480 -155 -194 70 206 -93 90 60 48 -23 -204 221 -233 234 112 8 49 72 -54 9 151 -42 67 189
5502 189 102 154 72 12 -14 -283 85 -35 -51 142 115 104 -75 -83 -124 15 -139 105 100 191 109 30 -81 -70 -183 -131
5528 -131 104 2 135 -376 -279 -72 -7 -269 -99 -37 15 -182 125 48 -112 -85 -169 -21 -95 77 -154 -12 60
5551 60 168 230 95 71 122 -16 2 148 85 54 -125 110 -155 -29 96 -179 -165 182 -147 -279 94 -15 -61
5574 -61 -151 -247 14 -50 -107 187 -123 193 -51 4 -150 217 12 282 286 -55 -77 3 -229 -238 -130 -24 -29 23 28 188
5600 188 27 23 -23 78 33 40 34 52 31 -96 -9 123 103 -60 -101 -101 74 26 -182 73 -107 -12 132 -189 -57 -26
5626 -26 79 173 -163 172 308 -110 -132 0 -39 138 -174 15 137 -6 -52 -60 146 167 46 -197 104 -23 -166
5649 -166 6 82 -120 203 113 93 128 58 129 -60 -140 192 209 112 54 13 82 31 -267 -40 192 -126 -38 -237 49
5674D9R2l78N40o57M86j95L9kJ2P3L1K66n07J63r3K83j8J39j05m29J17m9K1o7
5698a89J42L06j56j91q5k6N23m07P9N7p3N4j70K01o8p2Q3%J83j73J03J23j77J78
5722B45o1j71j25j02J71L50m70L3Lj17K89k37P3J87j64k2J35K84k56nk6K05j48
5745G1r2q4J7O9k48M00j87P2q4J65j1k19j11K57O7r2J34o3j69J23j04J46K5j66
5769h4K43j38Mq5j52M08j38j61K69j7k5n6k54K19j36L45k40p6p7P9L18k44j75
5792a73J10J00j59o4M0J9P0j92K95j08k2l1N1J53l9j9JP9l84J72K17Km23L65m51
5817c91K27J45K4j15Jj64M20j01Lj23J62k52J61K48l35k55M48j69k21K07J26r7
5839e1J46k43K36K6J83j80j22K03j93J17K21k53k21P0J82l3oj53K05l80J02J05
$$ plain form
5674 49 141 -237 303 -354 132 -63 -24 -26 -14 59 90 356 -151 12 -81 202 184 323 218 -211 -94 -143 -122 -189
5698 -189 -47 259 103 -88 -173 -199 324 -83 -4 53 -20 34 -136 65 -3 -75 8 8 191 18 121 244 67 245
5722 245 184 13 -112 -214 -43 307 -163 -130 -127 -244 45 -192 -119 68 -96 -118 17 301 45 40 14 219 71
5745 71 -21 -105 -88 -19 -267 133 -54 18 -66 99 88 -131 -242 15 82 -10 124 61 -108 15 -89 57 82 -84
5769 -84 159 21 25 -60 -212 196 58 -103 166 149 124 68 -186 33 -103 242 2 -74 -151 -72 246 2 -173
5792 -173 -63 37 -122 -186 -146 -127 -57 -249 46 -62 -84 -115 -64 89 50 31 32 111 -273 -101 116 118 -305 60 -391
5817 -391 -164 -19 5 -110 -109 -273 147 46 49 -74 88 -164 -3 245 -90 -345 103 -66 -287 -80 46 -51
5839 -51 95 -148 88 114 297 117 -5 198 5 122 343 90 -131 -61 121 88 82 -71 134 -246 -144 -39
5861c9r6M9r6J46M0l7K41j82q3J97r1j12L65m29L56k94J26k2L2J53k16o6j05N
5885a58J15K9j54J74l30M43k4k38K60K1j25K80j05k74K98kk09J28o2m12L33R2
5907H0J66l92L20j55k39N6J86j1p4L1r4J74j31N6l0j07J2q1K83K27k65n4J47o4
5931D1M9J6k7O1j61J38l02K09R9rj2p0j50J0K9l2J29L8n4j18J48J65l58K60J39
5956B38k21l5L8N6j36L5M3J68K06l15o1j58J48Q4k47L55k87K42j31J4M6J6J30
5979B28k07r7O0rR5N1j25R4j51J48j00m4O2r1k7M5K7J61k39L82l70J26l83N44
6003A80l7l49J95j1q1L90l29K09l4j99K1J38k09K01O3j60Lj33J82n2J44k20n5
6026a43K30k31K60j08j61J16n7K12j01l4J44R4m45kL10J6P0k13J19j2J08j61l21
$$ plain form
5861 -39 -135 -86 -182 -36 4 -33 208 26 -57 140 49 -63 302 -127 229 -65 61 39 71 224 8 -58 -163 -158
5885 -158 -43 -14 -168 6 -324 119 95 -143 117 138 13 293 188 -86 212 210 1 129 67 -345 -12 80
5907 80 246 -146 174 19 -220 -164 22 11 -63 -32 -126 48 -83 -27 -57 -164 -152 -233 50 277 12 -42 105 41
5931 41 90 106 79 140 -21 117 -185 24 123 114 102 32 -118 -108 -79 -111 18 56 2 -116 32 197 -161 99 238
5956 238 17 -18 20 76 -60 -25 18 186 392 77 16 -142 6 90 -157 198 -89 153 22 36 82 98 228
5979 228 21 -76 -16 -25 70 121 -4 90 -61 87 -13 -57 5 -86 -113 -68 -41 120 -119 263 -107 19 -364 180
6003 180 143 -206 -11 -22 -103 287 -42 167 133 -66 -45 93 -116 85 148 -12 -9 -142 40 -12 132 -88 -143
6026 -143 87 -144 116 8 -153 -37 -94 118 17 -17 127 221 -224 -226 84 100 170 -43 76 64 172 11 -310
6049c10K64J03j47J02q3J25k9q0k41L47k05O3K2J46q8k3j1K57l04J7j6N0RL29
6073B97n40L34k22K39j79k75K14LJ41p2p0M02m05R8L8M0J84k89%J33R7P8n4l18
6097a26J97j06J06k47M6M4J46j43K3r7k9J35P0Mj38K35k22Np1L60m39K32J4J94
6121A93j69J01K65k51k42J68%l24K33J76l44M0Q6K27j07O3k9j49N7nq9J70j74
$$ plain form
6049 -310 -46 57 -90 12 -71 54 25 -55 -296 51 -154 -91 -69 77 -11 -34 -45 212 -92 -75 -91 -41 -32 297
6073 297 -243 91 -131 108 -71 -346 -132 -129 12 -60 -130 272 -133 -35 3 43 227 -62 -62 71 168 246 192 -126
6097 -126 71 -35 71 -176 -130 -86 60 -83 -60 -157 -186 -51 19 23 -115 120 -102 -97 -168 192 -247 -15 -1 193
6121 193 24 125 390 139 -103 65 65 -259 -26 150 -194 -154 -68 159 52 115 86 -63 -6 -11 -100 70 -104
$$ [...]
8191d45
##END NTUPLES=NMR FID
##END=
