##TITLE=1H_Ser 6-5-V-3
 CDCl3
 8 sc, 
 28.10.2021
##JCAMPDX= 6.0         $$ Bruker NMR JCAMP-DX V2.0
##DATA TYPE= NMR FID
##DATA CLASS= NTUPLES
##ORIGIN= UXNMR, Bruker Analytische Messtechnik GmbH
##OWNER= root
$$ XWIN-NMR		Version 3.5
$$ Fri Oct 29 11:16:29 2021 Russian Standard Time (UT+4h)  she@DPX200
##.OBSERVE FREQUENCY= 200.1313468511
##.OBSERVE NUCLEUS= ^1H
##.DELAY= (6, 6)
##.ACQUISITION MODE= SIMULTANEOUS
##.ACQUISITION SCHEME= undefined
##.AVERAGES= 8
##.DIGITISER RES= 18
##SPECTROMETER/DATA SYSTEM= spect
##.PULSE SEQUENCE= zg30
##.SOLVENT NAME= D2O
##.SHIFT REFERENCE= (INTERNAL, D2O, 0, 15.7039)
##AUDIT TRAIL= $$ (NUMBER, WHEN, WHO, WHERE, WHAT)
$$ ##TITLE= Audit trail, XWIN-NMR		Version 3.5
$$ ##JCAMPDX= 5.01
$$ ##ORIGIN= Bruker BioSpin GmbH
$$ ##OWNER= she
$$ F:/spectra/data/she/nmr/H-F/1/audita.txt
$$ ##AUDIT TRAIL=  $$ (NUMBER, WHEN, WHO, WHERE, WHAT)
(   1,<2021-10-29 11:15:02.48 +0400>,<she>,<DPX200>,
      <created by zg, POWCHK disabled, PULCHK disabled
       configuration hash MD5:
       00 E9 B6 7A A2 85 ED C7 34 08 36 98 17 FE 4E 26
       data hash MD5: 16K
       15 93 3C 50 7C B9 FB 77 2E F5 FB 89 BC 61 75 EB>)
$$ ##END=
$$ 
$$ hash MD5
$$ 2E D8 34 DD B1 E3 16 72 4F 48 78 78 CF 6F 0E 91
##$RELAX= 
##$RELAX= 
##$RELAX= 
##$RELAX= 
##$RELAX= 
##$RELAX= 
$$ Bruker specific parameters
$$ --------------------------
##$DU= <F:/spectra>
##$EXPNO= 1
##$NAME= <H-F>
##$PROCNO= 1
##$TYPE= <nmr>
##$USER= <she>
##$AMP= (0..31)
100 100 100 100 100 100 100 100 100 100 100 100 100 100 100 100 100 100 
100 100 100 100 100 100 100 100 100 100 100 100 100 100 
##$AQSEQ= 0
##$AQ_mod= 1
##$AUNM= <au_zg>
##$AUTOPOS= <>
##$BF1= 200.13
##$BF2= 200.13
##$BF3= 200.13
##$BF4= 200.13
##$BF5= 200.13
##$BF6= 200.13
##$BF7= 200.13
##$BF8= 200.13
##$BYTORDA= 1
##$CFDGTYP= 0
##$CFRGTYP= 5
##$CHEMSTR= <none>
##$CNST= (0..31)
1 1 145 1 1 1 1 1 1 1 1 1 1 1 1 1 1 1 1 1 1 1 1 1 1 1 1 1 1 1 1 1 
##$CPDPRG= <>
##$CPDPRG1= <>
##$CPDPRG2= <>
##$CPDPRG3= <>
##$CPDPRG4= <mlev>
##$CPDPRG5= <mlev>
##$CPDPRG6= <mlev>
##$CPDPRG7= <mlev>
##$CPDPRG8= <mlev>
##$CPDPRGB= <>
##$CPDPRGT= <>
##$D= (0..31)
0 1.2 0 0 0 0 0 0 0 0.06 0 0.03 0 0 0 0 0.0002 0 0 0 0 0 0 0 0 0 0 0 0 
0 0 0 
##$DATE= 1635491701
##$DBL= (0..7)
120 120 120 120 120 120 120 120 
##$DBP= (0..7)
150 150 150 150 150 150 150 150 
##$DBP07= 0
##$DBPNAM0= <>
##$DBPNAM1= <>
##$DBPNAM2= <>
##$DBPNAM3= <>
##$DBPNAM4= <>
##$DBPNAM5= <>
##$DBPNAM6= <>
##$DBPNAM7= <>
##$DBPOAL= (0..7)
0.5 0.5 0.5 0.5 0.5 0.5 0.5 0.5 
##$DBPOFFS= (0..7)
0 0 0 0 0 0 0 0 
##$DE= 6
##$DECBNUC= <off>
##$DECIM= 32
##$DECNUC= <off>
##$DECSTAT= 4
##$DIGMOD= 1
##$DIGTYP= 9
##$DL= (0..7)
0 120 120 120 120 120 120 120 
##$DP= (0..7)
150 150 150 150 150 150 150 150 
##$DP07= 0
##$DPNAME0= <>
##$DPNAME1= <>
##$DPNAME2= <>
##$DPNAME3= <>
##$DPNAME4= <>
##$DPNAME5= <>
##$DPNAME6= <>
##$DPNAME7= <>
##$DPOAL= (0..7)
0.5 0.5 0.5 0.5 0.5 0.5 0.5 0.5 
##$DPOFFS= (0..7)
0 0 0 0 0 0 0 0 
##$DQDMODE= 0
##$DR= 18
##$DS= 0
##$DSLIST= <SSSSSSSSSSSSSSS>
$$ [...]
##$SUBNAM2= <"">
##$SUBNAM3= <"">
##$SUBNAM4= <"">
##$SUBNAM5= <"">
##$SUBNAM6= <"">
##$SUBNAM7= <"">
##$SUBNAM8= <"">
##$SUBNAM9= <"">
##$SW= 18.0517286264689
##$SWIBOX= (0..15)
0 0 2 0 0 0 0 0 0 0 0 0 0 0 0 0 
##$SW_h= 3612.71676300578
##$TD= 16384
##$TD0= 1
##$TE= 0
##$TE2= 300
##$TE3= 300
##$TEG= 300
##$TL= (0..7)
0 120 120 120 120 120 120 120 
##$TP= (0..7)
150 150 150 150 150 150 150 150 
##$TP07= 0
##$TPNAME0= <>
##$TPNAME1= <>
##$TPNAME2= <>
##$TPNAME3= <>
##$TPNAME4= <>
##$TPNAME5= <>
##$TPNAME6= <>
##$TPNAME7= <>
##$TPOAL= (0..7)
0.5 0.5 0.5 0.5 0.5 0.5 0.5 0.5 
##$TPOFFS= (0..7)
0 0 0 0 0 0 0 0 
##$TUNHIN= 0
##$TUNHOUT= 0
##$TUNXOUT= 0
##$USERA1= <user>
##$USERA2= <user>
##$USERA3= <user>
##$USERA4= <user>
##$USERA5= <user>
##$V9= 5
##$VALIST= <valist>
##$VCLIST= <CCCCCCCCCCCCCCC>
##$VD= 0
##$VDLIST= <DDDDDDDDDDDDDDD>
##$VPLIST= <PPPPPPPPPPPPPPP>
##$VTLIST= <TTTTTTTTTTTTTTT>
##$WBST= 1024
##$WBSW= 4
##$XGAIN= (0..3)
0 0 0 0 
##$XL= 0
##$YL= 0
##$YMAX_a= 157384
##$YMIN_a= -271407
##$ZGOPTNS= <>
##$ZL1= 120
##$ZL2= 120
##$ZL3= 120
##$ZL4= 120
##$ABSF1= 10
##$ABSF2= 0
##$ABSG= 5
##$ABSL= 3
##$ALPHA= 0
##$AQORDER= 0
##$ASSFAC= 0
##$ASSFACI= 0
##$ASSFACX= 0
##$ASSWID= 0
##$AUNMP= <proc_1d>
##$AZFE= 0.1
##$AZFW= 0.1
##$BCFW= 1
##$BC_mod= 2
##$BYTORDP= 1
##$COROFFS= 0
##$CY= 11.3945322036743
##$DATMOD= 1
##$DC= 2
##$DFILT= <>
##$DTYPP= 0
##$F1P= 2.36226072786647
##$F2P= -0.459571619588291
##$FCOR= 0.5
##$FTSIZE= 0
##$FT_mod= 4
##$GAMMA= 1
##$GB= 0.15
##$INTBC= 1
##$INTSCL= 1
##$ISEN= 128
##$LB= 0.24
##$LEV0= 0
##$LPBIN= 0
##$MAXI= 10000
##$MC2= 0
##$MEAN= 0
##$ME_mod= 0
##$MI= 1.114404
##$NCOEF= 0
##$NC_proc= 0
##$NLEV= 6
##$NOISF1= 3.799351
##$NOISF2= 2.8
##$NSP= 1
##$NTH_PI= 0
##$NZP= 0
##$OFFSET= 15.70392
##$PC= 1
##$PHC0= -15159.65
##$PHC1= 19.20082
##$PH_mod= 1
##$PKNL= yes
##$PPARMOD= 0
##$PSCAL= 0
##$PSIGN= 0
##$REVERSE= no
##$SF= 200.130013532006
##$SI= 16384
##$SIGF1= 3
##$SIGF2= 2
##$SINO= 400
##$SIOLD= 16384
##$SREGLST= <1H.CDCl3>
##$SSB= 0
##$STSI= 0
##$STSR= 0
##$SW_p= 3612.71676300578
##$SYMM= 0
##$S_DEV= 0
##$TDeff= 0
##$TDoff= 0
##$TI= <>
##$TILT= no
##$TM1= 0
##$TM2= 0
##$TOPLEV= 0
##$USERP1= <user>
##$USERP2= <user>
##$USERP3= <user>
##$USERP4= <user>
##$USERP5= <user>
##$WDW= 1
##$XDIM= 8192
##$YMAX_p= 0
##$YMIN_p= 0
$$ End of Bruker specific parameters
$$ ---------------------------------
##NTUPLES= NMR FID
##VAR_NAME=  TIME,          FID/REAL,        FID/IMAG
##SYMBOL=    X,             R,               I
##VAR_TYPE=  INDEPENDENT,   DEPENDENT,       DEPENDENT
##VAR_FORM=  AFFN,          ASDF,            ASDF
##VAR_DIM=   8192,          8192,            8192
##UNITS=     SECONDS,       ARBITRARY UNITS, ARBITRARY UNITS
##FACTOR=    0.0002768,     1,               1
##FIRST=     0,             0,               0
##LAST=      2.2672688,     0,               0
##MIN=       0,             -271407,         0
##MAX=       2.2672688,     157384,          0
$$ Real data points
##PAGE= N=1
##DATA TABLE= (X++(R..R)), XYDATA
0 0 0 0 0 0 0 0 0 0 0 0 0 8 -8 8 -8 16 -16 17 -24 32 -32 40 -48 56 -70 80 -94 108 -125 143 -163 185 -212
33 -212 239 -270 304 -342 383 -428 478 -532 590 -656 725 -803 888 -981 1080 -1191 1313
50 1313 -1446 1593 -1755 1937 -2141 2368 -2630 2927 -3274 3684 -4172 4770 -5524 6502 -7836
65 -7836 9763 -12816 18411 -32077 142615 87490 -113962 106048 137911 33245 30971 77514
77 77514 -74274 -127101 10933 65921 -48899 -35508 42691 -10343 -91121 -4831 71314 -11877
89 -11877 -97850 -34301 19953 -14803 -28647 27438 49629 18471 15372 62534 60233 5495 -2889
102 -2889 35223 24476 -28272 -45784 -36596 -43363 -18427 25794 -19037 -108709 -73732 44659
114 44659 59260 -34513 -73758 -27967 893 1512 16093 10865 -20689 -24779 1753 19876 35290
127 35290 53895 33844 -15535 -13888 37746 61380 35166 -16763 -52799 -33823 5607 2693
139 2693 -22871 -22176 -19281 -37362 -16719 38959 26550 -32451 -22298 21945 2265 -29357 -145
152 -145 23802 476 6562 35742 9612 -6083 52369 72848 -4005 -48386 -3427 15045 -31415
165 -31415 -40492 -6352 -12769 -42594 -27425 11529 23257 19902 21809 4492 -23216 -307 51384
178 51384 43197 -12119 -24364 12255 27359 16963 28856 34452 -5323 -30649 -981 20909
190 20909 -5491 -28147 -17755 -19789 -34589 -15434 14508 7880 -8492 -2724 1189 -7159 5551
203 5551 33680 22536 -20509 -22126 13759 22322 465 -5557 3374 -7592 -23667 -14580 -2964
216 -2964 -6824 -8796 -10954 -24891 -28625 -4726 18817 6048 -19988 -19683 -3760 4280 8142 14685
230 14685 15238 2671 -3021 14499 29860 23443 11339 5417 -1863 -10762 -4918 10925 7209 -10205
244 -10205 -14664 -11571 -7772 5443 16887 4262 -21557 -22727 110 9658 2999 2029 4852 2419
258 2419 1469 12047 26694 25000 11272 713 -6265 -5355 5511 12875 994 -20238 -21736 -5726
272 -5726 -136 -2739 -1570 -7970 -21179 -22944 -8195 2918 -929 -4607 -3055 -5201 -1070 12078
286 12078 20898 15820 2342 -4320 -2348 2463 10172 13111 2035 -11638 -10970 2867 10080 2668
300 2668 -3673 -7216 -15989 -17465 -6104 3944 2965 -4641 -7862 -4538 3864 17193 20448 8300
314 8300 -3476 -4557 3364 10921 11274 8287 2408 -4718 -2923 7364 14042 7684 -4016 -10411 -12785
329 -12785 -11842 -2637 3745 -3139 -11360 -11585 -4578 3602 9951 9485 -1343 -11063 -6685 2681 7565
344 7565 6664 1814 -2423 -4590 -1751 6346 10462 4217 -6797 -14019 -12068 -5112 1428 2934 -4474
359 -4474 -12329 -8815 396 6476 7689 3528 -4008 -9744 -5342 6009 11087 8144 3102 -2186 -778
374 -778 6898 12315 11761 2762 -8512 -12125 -7558 831 4071 -324 -7325 -11085 -6523 4797 9495
389 9495 5049 -1001 -6424 -6157 -552 7730 10657 5119 -1036 -1084 2486 9794 13035 6705 -1665 -7576
405 -7576 -6898 -1815 2130 1477 -3200 -8706 -9267 -4845 2102 6367 2814 -3385 -5652 -4021 3284 11300
421 11300 12512 7446 -151 -1177 4321 10655 12602 5726 -5298 -9428 -5288 2936 8179 3637 -5667
436 -5667 -10739 -10014 -3908 960 -571 -9748 -18694 -17501 -7142 697 4181 1735 -4356 -4884 2125
451 2125 9514 9123 3440 -1727 -6035 -6410 784 5901 4648 1557 -1047 -1921 -844 1272 2952 -1942
467 -1942 -9288 -13408 -14109 -10279 -3372 1652 1428 -2322 -1532 6442 13644 17331 16702 9439 2347 2192
483 2192 9523 15687 13991 6746 -566 -3652 2785 11325 9671 -1116 -11426 -14727 -9794 -3320 -488
498 -488 -5116 -12696 -13363 -6949 2589 9134 7180 1163 -715 1514 7531 12211 10547 3724 -2468 -2686
514 -2686 -1291 -411 1642 -917 -8115 -10010 -7150 -4812 -2510 -1074 -2318 -8010 -10355 -6830 -4409
529 -4409 -2177 1675 -1237 -7157 -5215 4931 12410 12694 9326 3914 -1703 1043 7986 6898 -257
544 -257 -6487 -10008 -8350 -635 7169 5981 -3348 -8279 -5456 -1453 2368 1047 -6134 -13023 -13068 -4255
560 -4255 4228 6748 5464 2978 1571 5986 11592 12464 7455 -10 -3841 -4203 -2122 1203 2542 193
576 193 -3174 -5233 -2204 3070 4579 2373 -2050 -6007 -5428 -147 5266 5767 3770 2873 2421 3162 9174
593 9174 13702 9166 1578 -2706 -2546 -289 2375 2330 -4911 -11344 -10394 -6270 -1669 985 -1616 -6321
609 -6321 -8019 -3306 3519 6689 4777 215 -3874 -2398 1585 4952 5766 986 -5459 -6940 -2049
624 -2049 3374 3923 -1119 -6724 -10647 -8603 -3376 -1320 -3653 -6876 -7721 -5377 -148 6197 9436 6507
640 6507 2385 1603 4415 7921 8722 5416 1461 -2301 -1024 3586 5863 4948 1571 -2656 -4529 -4057
656 -4057 -915 179 -3955 -7509 -8687 -6877 -2059 3049 5360 3552 -432 -127 4811 8893 9735 6046
672 6046 944 -1639 190 5304 7679 4454 -1169 -4759 -5982 -3372 387 -173 -6298 -12080 -11253 -5651
688 -5651 -887 1434 -469 -4535 -4689 -725 4725 7529 5669 2652 441 1814 5716 8204 8053 3945
704 3945 -1212 -2131 -1294 -528 -530 -2240 -5979 -9695 -8425 -3617 -290 -588 -2158 -4195 -4926 -1610 2676
721 2676 4708 3368 818 -64 1083 4676 9779 9531 4516 -479 -1455 1930 4097 2973 -1175 -6387
737 -6387 -8380 -5269 -1065 1046 -1077 -4852 -6496 -5368 -347 3689 2586 -176 -2540 -1779 2917
752 2917 6870 7252 4869 1467 -744 466 3661 5475 1629 -3088 -4327 -4238 -2707 21 40 -3085
768 -3085 -6234 -6395 -4101 -1898 1438 2231 -1579 -3375 226 4300 6757 6472 3728 639 -1365 799
784 799 3780 3561 998 -2713 -5000 -3495 -356 2014 796 -3525 -6282 -5928 -2720 591 590 -687 -2916
801 -2916 -3074 768 6390 8074 5807 2633 1162 1639 3172 5132 3752 -778 -3455 -3349 -1521 1316
817 1316 1994 -334 -4258 -5916 -3420 -150 594 -240 -2438 -3942 -2172 1715 5158 5672 3667 2041
833 2041 517 2463 5623 5481 3283 -351 -2557 -2046 140 1450 448 -3069 -5841 -6915 -4667 -1740
849 -1740 -821 -3594 -5433 -5522 -3243 183 2790 2659 -46 -1930 -85 2428 4706 5867 3026 -312
865 -312 -1067 1009 3782 3476 153 -3141 -5446 -4853 -2579 -1031 -1798 -4401 -6186 -4466 -1594 1555
881 1555 2948 1031 -747 -1102 1305 4639 5734 5283 3762 1374 2260 5564 6813 5500 2388 -731
897 -731 -1907 -1242 494 499 -1838 -4214 -5222 -4256 -1584 515 295 -1741 -3703 -2889 539 3399 4058
914 4058 1924 574 867 1778 4600 6333 3796 469 -1486 -1306 199 1103 614 -2105 -5817 -5442 -2988
931 -2988 -1145 -919 -2293 -4114 -5245 -3997 -16 2007 948 -167 -948 -303 2220 4432 4768 2448
947 2448 -612 -992 -224 1131 2212 175 -2501 -4280 -3488 -662 842 2 -2596 -3943 -3721 -1667
963 -1667 195 1672 408 -1565 -1418 947 3241 4547 4013 2109 -516 -391 2490 3524 2260 617
979 617 -1471 -2563 -935 1316 2232 -120 -2291 -2435 -2013 -149 1763 1611 -60 -1313 -1292 1593 3597
996 3597 3833 2892 923 -735 377 3279 4314 2038 -917 -1423 -1707 -689 530 623 -1920 -4818 -4073
1013 -4073 -2046 -972 -236 180 -2001 -3248 -1295 1915 2842 1576 739 35 -1100 936 3596 3189
1029 3189 968 -1061 -806 -585 -537 1012 4 -3755 -5244 -4760 -2904 -1599 -1077 -1767 -3495 -3628 -179
1046 -179 2733 3078 1919 507 356 1118 2764 4854 3975 1118 58 240 1524 2869 2353 96 -3012
1063 -3012 -3999 -2320 -558 -846 -1848 -3473 -3558 -2491 -250 2022 2172 233 -273 789 2379 3761
1079 3761 4164 3934 1660 427 1594 3272 3355 2309 194 -1755 -2511 -1617 610 -229 -2725 -4091 -3954
1096 -3954 -3294 -1659 -51 -48 -1865 -3242 -1189 1363 3163 3079 2324 452 -173 2217 4709 3660 733
1113 733 -968 -1226 -864 142 1227 -238 -3521 -4594 -2587 -1829 -1274 -1195 -1860 -3646 -3497 -835 1251
1130 1251 1325 1136 1070 6 947 3004 4175 3221 919 400 398 409 1273 1701 459 -1637 -2887 -1819 -381
1149 -381 41 -408 -1764 -3540 -3248 -619 1737 1579 -97 -942 -402 876 2922 4115 2813 177 -933
1166 -933 695 2212 1980 1777 -126 -2324 -2662 -284 1069 -74 -1920 -2830 -3007 -2447 -13 1117 -518
1183 -518 -1627 -1187 258 1251 2108 2531 1358 -71 -114 804 2445 2197 494 -376 -1468 -1796 61 761
1201 761 -662 -2300 -3145 -2630 -1998 -369 1081 52 -1965 -1326 678 2240 2530 2662 1594 -172 134
1218 134 2870 3355 2342 683 -880 -1456 -415 736 1116 -1315 -2952 -3005 -2318 -882 -207 -257 -1433
1235 -1433 -2193 -1475 968 2168 2431 1476 373 175 1283 3002 3619 2003 180 -366 -210 519 861
1252 861 284 -1310 -3368 -3275 -1506 -973 -685 -1453 -2417 -2843 -1951 420 1379 348 -325 -206 -237 1557 3068
1271 3068 3326 2052 665 645 1257 1537 1963 708 -1331 -2363 -2463 -1090 165 -866 -2236 -3236 -2903
1288 -2903 -1480 -53 557 -557 -1606 -1282 31 1493 2910 2887 1571 764 1236 2665 3235 2651 1393
1305 1393 -391 -1215 -30 931 886 -433 -2297 -2606 -2332 -1019 -6 -506 -1441 -1995 -1518 298 1936
1322 1936 1902 1680 539 24 1419 2525 3247 2391 836 19 -121 479 1230 572 -740 -2202 -2547 -1662
1340 -1662 -1061 -664 -1035 -2628 -3298 -2128 -479 834 733 -470 -906 -784 550 2200 1881 924 -100
1357 -100 -601 117 1163 1400 772 -1295 -1869 -1438 -419 99 -427 -1414 -2484 -2492 -1192 455 892 536 -603
1376 -603 -771 373 1420 2519 2124 822 334 647 1211 2260 2087 1049 -414 -926 -307 350 477 -120
1394 -120 -1265 -2055 -1385 -416 808 773 -273 -1243 -825 248 1573 2050 1336 385 -295 906 1626 2286
1412 2286 1297 -32 -708 -1054 -187 605 202 -1130 -2292 -2333 -1503 -328 -15 -440 -1572 -1802 -780 253
1430 253 1162 1329 572 -23 20 1170 2305 2511 1238 185 -548 -446 552 517 -16 -1529 -2197 -2123 -1262
1449 -1262 -701 -466 -1286 -2102 -2048 -1149 253 628 112 -110 -539 268 1548 2686 2291 1224 283 558 960
1468 960 1501 1509 282 -1060 -1581 -1017 -359 -314 -738 -1607 -2251 -1979 -562 260 249 -19 -725 -211 751 2108
1488 2108 2730 2068 1377 849 1606 2506 2274 1965 843 -388 -651 74 342 265 -992 -1838 -2478 -2130 -951
1507 -951 -621 -946 -1675 -2243 -1166 164 1012 1260 650 -197 223 1159 2138 2063 1522 457 -371 -115 605
1526 605 1170 278 -954 -1730 -1795 -1147 -761 -876 -1565 -2333 -1882 -1061 -324 514 433 -134 -236 462 1550 2224
1546 2224 1734 1145 488 172 771 1703 1774 623 -720 -849 -699 -204 -61 -751 -1407 -2187 -1684 -613 91
1565 91 -42 87 -563 -718 384 1342 2210 1425 745 185 462 1266 1803 1346 345 -965 -815 -293 160
1584 160 75 -758 -1754 -2076 -1659 -493 113 -340 -739 -1013 -735 364 1266 1566 1052 106 312 1222 1786 1802
1604 1802 1144 41 -835 -514 0 173 -433 -1130 -1572 -2122 -1059 -52 70 -711 -1172 -1190 -392 370 864
1623 864 1018 395 -82 710 1693 2077 1870 1033 111 -453 -98 448 690 -342 -1292 -1794 -1875 -990 -387 -721
1643 -721 -1538 -1587 -1309 -123 576 684 420 10 90 1063 1620 1796 1539 1209 736 440 925 1455 729 -612
1663 -612 -1491 -1535 -899 -925 -820 -1124 -1988 -1850 -1346 -327 259 61 -370 -360 -24 828 1972 1794 1265 812
1683 812 471 1064 1960 1923 992 -203 -854 -863 -226 -463 -739 -1668 -2261 -2249 -1614 -644 -685 -488 -930 -873 -83 869
1705 869 1435 1551 783 488 880 1426 1801 1577 1035 130 -312 133 704 276 -290 -1299 -1719 -1657 -974 -617
1725 -617 -379 -1147 -1391 -1161 -141 758 1296 942 233 142 955 1774 1869 1169 1263 192 279 890 859 800 -301
1746 -301 -730 -1332 -1141 -515 -523 -963 -1769 -2089 -1291 -585 104 75 -363 -675 -267 500 1396 1188 520 266 -20
1767 -20 189 901 789 332 -465 -884 -701 -586 -170 -69 -770 -1413 -1455 -839 -89 23 -320 -380 -365 217 1263
1788 1263 1501 1546 938 682 664 1032 1372 1278 354 -656 -625 -346 -243 18 -427 -939 -1082 -953 -260 21 -143
1809 -143 -548 -839 -521 127 546 1305 769 239 451 926 1330 1378 1054 393 -439 -505 -112 -99 -152 -897 -1646
1830 -1646 -1269 -841 -207 -95 -30 -1033 -915 -550 242 862 767 687 -4 594 1056 1461 1363 1014 502 169 -12
1851 -12 338 230 -45 -1023 -1421 -1747 -783 -610 -556 -1121 -1496 -1311 -543 -81 233 203 -324 -96 219 776 1517
1872 1517 1309 914 455 325 771 1328 829 44 -522 -881 -1008 -311 -118 -781 -1053 -1795 -1282 -563 245 -46
1892 -46 30 -398 -359 630 1149 1760 1123 674 749 1038 1537 1686 1243 552 -82 -421 295 225 -93 -487 -1176 -1367
1914 -1367 -1326 -608 -505 -531 -949 -994 -814 88 585 499 297 -91 -169 538 989 1070 747 54 72 371 582 737
1936 737 301 -721 -951 -986 -888 -592 -541 -750 -1236 -1411 -701 113 197 648 -234 -104 197 723 1169 805 615
1957 615 331 209 470 942 605 479 -336 -696 -517 -97 182 -45 -686 -1042 -801 -638 224 3 -95 -324
1977 -324 -626 13 573 1000 984 92 119 240 680 698 906 250 -465 -348 -124 190 135 -203 -870 -1293 -537
1998 -537 -239 -131 215 -252 -883 -462 79 658 742 414 389 229 662 1155 984 587 -60 -406 -124 -61 103
2019 103 132 -353 -814 -903 -484 -275 -239 -238 -820 -879 -672 194 376 274 188 -77 95 433 1047 932 575 152
2041 152 -106 20 499 516 -129 -754 -949 -683 -215 -248 -157 -667 -873 -934 -371 204 365 160 85 108 181 861
2063 861 1182 828 846 468 474 402 767 618 -135 -487 -323 -315 -110 -234 -445 -946 -1268 -848 -217 -166 217 -165
2085 -165 -693 -273 290 633 867 497 419 389 613 902 1173 807 334 -31 -330 -15 220 -132 -661 -1517 -970
2106 -970 -998 -755 -336 -585 -756 -743 -545 108 499 436 28 17 441 1025 861 1131 927 154 642 286 538
2127 538 564 250 -683 -732 -765 -579 -371 -583 -580 -989 -668 -380 -160 406 323 188 219 39 609 995 1112 565
2149 565 250 355 680 628 612 164 -420 -706 -419 -161 -167 -476 -788 -738 -900 -478 -277 -80 -335 -492 -177 314
2171 314 611 723 534 -40 116 230 540 799 242 174 -196 -129 31 59 37 -281 -897 -657 -549 -476 -135 -422
2193 -422 -494 -587 10 440 733 424 490 405 409 577 613 731 369 -16 -259 365 -12 199 -25 -416 -671 -339
2215 -339 -420 -261 -85 -437 -708 -630 -104 518 577 611 508 318 547 788 1076 892 293 302 -133 108 177 -232
2237 -232 -232 -818 -821 -684 -524 -308 -359 -888 -741 -444 55 167 311 134 101 379 815 693 1044 873 459 180
2259 180 336 467 104 -196 -488 -979 -532 -651 -712 -648 -1010 -975 -989 -666 -304 -106 -163 -387 -39 9 371 721
2281 721 665 417 429 403 432 861 639 339 -54 -399 -291 -290 -252 -163 -889 -1263 -838 -483 -156 -245 -496 -180 -482
2304 -482 129 590 724 527 536 482 692 954 974 992 843 464 365 117 300 -97 -225 -761 -1294 -753 -561 -340
2326 -340 -536 -900 -825 -739 -209 -59 288 18 199 132 579 914 930 677 238 148 255 565 252 85 -194 -393
2348 -393 -612 -608 -267 -252 -407 -796 -741 -609 -227 -36 -137 -57 -117 70 383 564 919 513 241 301 594 331
2370 331 538 351 171 -303 -135 24 -55 -386 -458 -997 -623 -645 -479 -155 62 -291 -82 33 491 578 660 199
2392 199 140 146 570 462 463 287 211 -2 -278 -66 -132 -90 -533 -642 -418 -340 -437 26 -342 -295 -251 175 641 552
2416 552 242 519 195 223 591 793 156 213 -188 -123 137 148 -149 -430 -479 -535 -495 -416 -262 -385 -588 -475 -117
2439 -117 207 510 529 495 180 228 449 794 636 428 331 -74 50 -49 232 -48 -571 -493 -698 -308 112 -251
2461 -251 -422 -875 -636 16 -286 235 94 10 85 244 735 792 708 465 581 406 428 778 472 127 -308 -223
2483 -223 -325 -153 -235 -341 -437 -869 -624 -432 -325 -289 -650 -80 -81 215 315 297 349 397 269 454 713 602 593
2506 593 224 34 -147 59 47 -152 -303 -491 -844 -488 -467 -159 -301 -646 -447 -450 67 334 208 317 238 182
2528 182 362 877 712 472 228 137 306 292 144 -53 -289 -511 -655 -421 -547 -434 -388 -275 -499 -317 -36
2549 -36 133 -7 39 74 269 451 622 783 332 14 443 259 467 483 -146 -3 -443 29 -114 -105 -431 -370
2571 -370 -563 -462 -212 17 -168 -216 -178 166 123 515 476 237 258 -76 141 293 555 244 43 -87 -374 39
2593 39 363 -139 -197 -472 -345 -480 -286 -305 -16 -76 -267 -19 -6 602 258 518 144 300 308 212 208 465 -127
2616 -127 -298 109 288 50 93 -150 -547 -323 -342 -333 -295 -278 -271 -17 -258 20 304 67 227 127 314 516 554
2639 554 534 207 124 264 91 -169 74 -13 -327 -482 -284 -317 -204 -496 -267 -709 -266 -245 24 229 179 97
2661 97 -62 543 502 544 444 190 100 190 416 364 261 -177 -464 -553 -467 -223 -394 -470 -340 -469 -483 17 35 60
2685 60 84 -120 -63 428 360 591 324 286 461 197 539 610 302 -86 -170 -277 -181 28 -331 -387 -391 -683 -263 -360
2709 -360 -209 -465 -267 -298 -317 298 274 -10 238 102 119 413 598 657 260 -18 165 163 44 228 -103 134
2731 134 -14 -497 -324 -204 -463 -328 -523 -501 -276 24 96 63 18 8 124 272 451 352 334 102 142 416 273
2754 273 349 8 -198 -268 -123 227 -266 -233 -505 -668 -553 -256 -52 -248 -168 -357 -64 315 539 403 245
2775 245 -60 142 475 301 173 324 198 -165 -69 118 244 -418 -355 -558 -485 -346 -337 -95 -255 -109 33 115
2797 115 137 357 480 96 292 13 400 515 214 392 190 33 163 168 -261 -53 -376 -418 -633 -207 -57
2818 -57 120 -146 -248 -239 -43 10 271 266 82 180 35 250 308 126 356 94 180 210 409 -124 -41 -226 -202 -118
2842 -118 -29 -240 -177 -198 -326 -46 -128 -116 132 132 264 41 245 455 198 175 266 180 115 -91 -59 108 155 -449
2866 -449 -442 -113 -414 -146 -326 -350 -404 -400 50 -100 -15 131 50 289 205 194 316 238 305 201 148 422 433 191 261
2891 261 44 -114 -124 -184 -129 -326 -476 -399 -236 -176 -127 -291 -264 -103 99 332 334 13 337 505 653 255 412
2914 412 251 230 45 346 94 136 99 3 -263 -402 -306 -154 -125 -162 -347 -537 51 -171 -51 185 207 89 126
2937 126 340 486 276 240 359 243 86 238 18 50 166 -235 -134 -373 -130 -55 -291 -34 -350 -261 -231 -53
2959 -53 -40 -326 -73 189 193 386 493 458 86 129 405 354 295 89 -22 139 -124 83 55 -247 -384 -341 -338 -249
2983 -249 -140 -236 31 -68 -123 -226 184 183 162 -113 15 335 253 389 264 131 150 -39 -53 -63 -36 -85 -139 -328
3007 -328 -508 -245 82 -122 -325 -234 -163 77 -44 11 298 60 -50 119 360 162 226 53 -189 -28 68 371
3029 371 -61 51 -427 -400 -232 -209 -79 -213 -315 -165 -271 -21 321 241 43 167 253 361 263 336 48 206
3051 206 -12 520 405 56 -29 -147 -221 -307 46 85 -191 -424 -292 -624 -41 175 78 -80 32 109 166 231 193
3074 193 264 -9 235 300 325 374 179 185 -83 -250 -52 -278 -252 -394 -423 -254 -521 -181 -81 34 -271 -266 5
3097 5 389 145 267 466 268 275 555 311 498 369 -99 242 274 -80 178 -136 28 -251 -529 -417 -293 -528
3119 -528 -224 -104 -331 -205 -86 278 99 322 240 104 288 430 163 257 200 333 252 235 -87 48 -117 -71
3141 -71 -234 -294 -154 -340 -278 -234 -217 -54 132 -66 29 -18 -125 164 507 358 60 300 -40 43 137 135 141 59 -48
3166 -48 -237 -184 75 -143 -159 -281 -298 -214 -50 -72 -271 -56 -109 236 -297 72 13 327 198 51 -35 269 329
3189 329 277 289 44 -301 69 28 212 -291 -105 -290 -284 -217 31 50 94 26 -238 221 -263 420 -3 19 188
3212 188 425 251 181 148 -25 -68 129 173 1 -100 -57 -178 -161 -298 -221 65 -21 -314 -224 109 216 170 321
3235 321 111 74 -48 122 40 367 36 28 138 165 167 33 30 -52 72 -75 -394 -128 -104 -205 -203 -216 -66 -147 103
3260 103 102 286 -18 169 288 355 246 -25 83 -23 294 63 -7 25 -113 -163 38 -136 -300 -152 -227 -425
3282 -425 -123 -19 -136 -166 -138 -17 165 194 620 262 282 473 316 158 283 372 167 146 44 312 80 89 94
3305 94 12 -270 -322 -359 -48 2 -240 -34 -64 -90 35 88 217 139 326 17 460 188 298 316 208 126 56 233
3329 233 -77 -188 -409 -442 -344 -109 112 -186 -341 -185 -173 -34 -46 -175 7 160 20 190 95 264 356 383
3351 383 163 236 202 108 98 -21 -148 -261 -235 -18 -19 -208 -227 -426 -43 -84 -150 -154 -31 -62 -28 95 115 190 171 243
3377 243 108 123 153 268 47 120 -57 -146 -216 -28 59 -254 -68 -192 -193 -283 -155 -257 -61 -238 -316 -116 -13
3400 -13 398 -91 -74 187 -22 -96 539 111 123 7 -199 -10 -141 147 -47 -29 -249 -46 -86 47 -225 -29
3422 -29 -151 -46 273 394 131 242 13 113 34 5 -147 140 -266 -61 -10 59 228 -88 -66 -52 -19 -145 14
3445 14 -393 6 29 -52 -116 97 230 9 -102 63 239 298 192 307 204 -27 74 -57 -118 27 76 -157
3467 -157 53 95 -264 25 -282 -169 -89 -75 -188 8 184 -106 37 298 -85 100 202 352 70 -259 24
3488 24 329 186 231 5 66 -301 -31 -8 -324 -359 -291 -97 -256 -260 36 -252 -242 239 129 110 194 123 169 202 125
3513 125 64 84 40 55 -60 179 33 -51 6 -236 -128 -259 -283 -483 -35 -16 0 4 -281 -10 77 199 -163 -146
3537 -146 -59 392 215 234 217 179 193 268 177 -30 -81 -102 -34 -161 2 -27 -506 17 -294 -293 41 -45 202 25 -176
3562 -176 62 -57 22 6 92 -126 272 -50 -28 163 58 142 -77 -17 -223 -140 -243 -196 -203 -81 -50 -9 -125 -9
3586 -9 -88 -58 -222 -180 126 56 296 421 -228 271 184 292 152 -102 260 -206 20 75 -90 -23 -215 10 -173
3609 -173 52 -52 -7 -432 108 -126 9 309 -376 50 132 -69 82 366 329 267 88 -24 -20 21 -139 -67 -80
3632 -80 -63 -152 -134 -146 -308 -304 -28 60 48 74 258 72 195 96 -39 27 185 147 97 226 -16 -173 192 -148 80
3657 80 -127 13 -125 -339 134 -147 -57 0 -279 -333 -141 44 389 -39 -16 111 157 278 76 142 -99 36
3679 36 -57 353 371 -27 85 239 -370 -113 22 -96 -245 -143 -354 55 -71 -37 -82 35 -92 16 71 72 -130
3702 -130 362 -10 210 144 143 66 375 -403 -209 -144 -109 -146 -240 -61 -237 -370 -63 -90 -75 -116 -118 -117 -181 -248 28 311
3728 311 80 102 109 102 -66 159 93 229 -107 34 152 184 -239 -183 -339 -187 71 -55 -141 -55 -285 -91 -77 -60
3752 -60 -23 144 68 333 80 14 189 224 24 176 -53 20 202 -60 -286 74 11 -170 -7 -196 -74 -252
3774 -252 5 -180 -301 -149 -138 28 -19 -59 78 -57 -92 33 232 348 176 -47 16 366 36 -111 -132 -80
3796 -80 145 15 -77 -90 -88 -112 -68 -36 -54 -140 -185 66 -129 -78 109 136 91 82 168 209 -119 -92 -96 285 -223 -183 -218 -54
3824 -54 43 -47 46 -106 -90 -228 66 -200 213 120 -99 63 148 204 117 164 14 59 159 -61 139 -8 283 -163
3848 -163 73 -251 -85 -124 -168 83 -42 -144 -150 -219 -122 61 -116 -155 101 72 -116 152 262 21 102 -82 -3
3871 -3 146 138 -119 92 6 108 -70 -49 -305 153 -114 19 -322 -113 -56 69 7 -19 -70 2 237 64 113 274
3895 274 68 42 136 146 334 -9 165 -48 -155 -156 -133 29 139 -10 42 -80 -94 -170 -212 -34 72 249 42
3918 42 174 154 -43 75 312 135 150 71 225 170 77 -129 218 291 -1 -194 -331 -18 -129 -149 -70 -128 -54 115
3942 115 -64 -97 283 -229 115 73 11 -38 262 52 3 53 -4 137 32 100 -122 -166 -81 -103 -20 34 -170 -234 -243
3967 -243 112 -37 -21 141 116 243 148 94 112 55 190 30 234 -73 77 55 192 163 -105 412 55 15 33
3990 33 -203 -59 -124 -145 -224 -351 -204 -97 -83 142 -145 48 58 -30 183 281 -52 -136 -65 101 -66 -62 71 116
4014 116 42 117 -96 -315 -163 -161 123 69 5 -169 263 -2 -333 -50 -169 -93 6 -13 109 -46 95 -103 -64
4037 -64 154 -17 72 -274 167 184 -135 53 -104 -94 -25 38 -10 175 -119 92 46 255 191 13 196 162 -221
4060 -221 245 308 137 68 120 -185 -145 52 66 39 -157 -81 -126 -78 30 -317 -13 48 71 -21 -3 223 164 216 51
4085 51 160 63 54 212 -130 105 204 -124 -118 -114 1 -128 35 86 -148 -32 -40 123 -117 289 229 -172 -126 91 -156
4110 -156 139 65 -113 144 54 -31 -117 122 134 -238 310 125 80 140 -81 101 71 -27 -79 -143 75 -207 -64 194
4134 194 -151 -40 -79 88 33 81 -38 174 225 120 45 27 -165 -133 47 37 -38 -182 -293 -200 -184 -13 -47 -170
4158 -170 -112 22 -139 70 73 -103 -12 75 264 -3 16 132 -167 14 170 329 161 219 -136 -126 179 -225 -97
4181 -97 125 132 -49 46 -72 110 -2 314 42 -42 -91 34 -72 -54 -191 95 261 -164 -178 -205 -68 -56 79
4204 79 110 0 110 -265 -255 -232 -59 7 78 -221 -274 165 46 26 209 -132 -190 99 -61 27 140 31 19 146
4228 146 -157 -86 -136 -37 -213 -60 207 -122 20 45 -275 -133 -31 -104 -59 19 179 138 -80 69 -155 356 107
4251 107 -23 70 -183 154 140 -4 -54 -118 -213 -39 -84 -202 130 67 -69 -81 -156 -232 120 120 -54 -49 89 155 39
4276 39 -91 -71 47 -83 59 80 238 83 58 -15 -188 -186 280 164 14 -104 -132 -71 -22 19 -74 36 166 37
4300 37 59 -151 -19 127 10 -44 79 -189 283 -154 21 -27 72 -1 -134 -21 124 -90 -207 -37 -60 87
4322 87 68 63 195 0 -52 106 -141 -25 -34 226 75 44 -84 69 56 50 226 -275 103 -69 87 -54 -169 42
4346 42 -19 -91 180 -220 -21 -49 3 194 -179 144 93 55 11 -168 -80 -330 81 -44 44 97 51 -233 206 172
4370 172 64 20 82 -32 28 -47 156 19 -196 -92 -45 122 -49 147 170 24 -43 192 -33 -35 294 132 115
4393 115 125 -148 -109 -104 116 -192 4 -68 -159 225 145 87 -233 127 -55 -103 -178 -32 35 62 -69 38 -12 201
4417 201 -106 50 40 -79 -116 58 83 53 -49 34 403 -73 -63 -4 41 132 -7 -137 -59 -210 -113 -11 -130 -68
4441 -68 74 161 -72 -34 -241 66 -54 111 101 -4 -45 126 72 -54 5 -138 78 170 -40 -209 -115 -74 -218
4464 -218 88 59 -62 -47 118 -130 -22 -21 -8 -64 -36 -92 -122 -65 124 -193 -166 -93 -87 139 161 -98 -86 -5 114 96
4490 96 149 156 -150 89 93 -117 -89 98 -250 11 -75 112 -34 48 -38 4 -119 -68 111 -253 108 158 -109 -152 132
4515 132 51 44 -22 -21 57 -6 -3 150 221 174 21 122 -159 206 -41 108 -237 -14 155 -125 40 -79 -10 -284
4539 -284 -135 -90 50 -73 203 22 -183 -43 -35 -136 60 36 50 46 101 151 54 -49 120 -32 -137 185 -59
4562 -59 179 18 186 -143 108 -22 105 21 120 -199 -10 -27 -127 244 91 -7 50 197 20 16 -25 -164 -236
4585 -236 79 201 -113 -112 -45 9 161 4 -233 7 -111 107 0 49 90 77 -8 76 122 -206 164 -12 -316
4608 -316 -1 101 65 26 102 139 11 -18 -48 105 71 -102 -214 23 -49 -109 -150 -133 -305 -235 -106 -47 -50 155 -61
4633 -61 -169 -190 146 104 181 -50 109 22 82 107 -219 222 163 97 -83 147 83 42 -15 77 -63 -71 -305 -114 134
4658 134 122 -89 -141 -37 -165 184 159 65 48 130 -196 33 164 64 -54 13 -129 129 27 -204 -223 -182 12
4681 12 -76 19 -37 -264 216 -107 -66 212 304 60 -31 103 72 -118 247 -24 -62 53 13 32 -232 121 321 182
4705 182 -97 68 7 -173 -19 64 29 15 -139 216 -33 130 38 124 138 112 160 254 -54 -83 25 -127 -199 95
4729 95 176 33 -17 15 -15 44 60 65 205 29 -19 -120 10 -79 183 -106 184 -50 222 -96 209 74 114 -45
4753 -45 95 89 -107 230 -41 66 -8 70 -37 38 51 -35 -154 85 -33 45 186 264 -95 88 -169 339 -69
4776 -69 115 -231 -89 -64 -9 29 -178 28 -147 -33 -18 -279 -52 57 9 9 8 -361 -103 73 39 -229 48 -59
4800 -59 71 -77 -3 -135 183 76 -266 -53 73 77 -53 -204 -218 -69 187 19 -75 -66 -13 -67 -17 75 19 -100
4824 -100 71 -98 181 91 -145 195 -96 124 236 52 -133 -30 13 169 -100 -153 -52 -110 2 -85 115 -53
4846 -53 70 65 55 343 160 176 96 112 230 14 -39 86 -223 -49 205 14 -183 -53 96 -178 -16 43 190
4869 190 -44 136 94 -157 -164 -116 16 19 193 8 -67 149 -10 83 182 -149 180 125 -132 144 -75 153 155 -72
4893 -72 23 25 35 -23 71 3 10 66 -80 88 42 -94 101 -41 -150 -222 36 46 207 -38 -19 58 5 -42 -73 -250
4919 -250 -66 56 -121 -39 -91 53 121 -66 -164 -126 -9 113 159 233 -114 21 244 87 231 133 256 6 161
4942 161 12 123 107 102 -36 -143 -93 205 88 -97 170 -135 43 -50 -159 -208 -26 -122 13 13 -173 92 73
4965 73 -84 -29 13 88 92 -91 -51 -29 8 53 139 39 106 81 178 5 113 8 -217 164 91 -198 -61 333 -119
4990 -119 -25 52 49 62 155 18 111 -38 -123 -25 -151 -48 -145 -235 162 -190 129 53 236 -71 184 -206 -56 118
5014 118 -154 -185 -47 128 147 -2 -235 19 -126 215 -108 -36 188 134 29 51 33 149 37 43 103 -72 -78 253
5038 253 146 -70 77 155 -214 -90 -4 136 259 192 162 123 82 -222 41 -17 -202 -71 87 152 22 14 52 -149
5062 -149 -50 -17 -48 -5 -78 -358 33 203 -96 86 109 -85 -13 -179 135 291 144 194 175 -187 -40 -215 -186
5085 -186 -182 34 -198 40 295 35 -72 -196 -25 133 48 103 -197 117 173 50 136 274 -65 -70 18 -153 -112
5108 -112 68 -187 211 -18 -185 -17 -171 17 110 -218 -92 76 104 80 -188 -246 -74 219 -24 -93 122 -101
5130 -101 -22 144 167 -178 42 -113 -55 29 -204 184 -245 34 -44 71 -22 -177 34 -309 21 65 118 -9 24
5153 24 63 8 195 41 151 -98 -97 -107 -102 -70 0 -130 159 -228 -106 -7 66 120 -5 -47 -187 -134 -170 80 113 201
5179 201 -60 -170 14 128 278 -32 121 -127 50 221 -207 8 178 -45 -28 -154 48 -143 -201 -199 -104 -180
5201 -180 63 -46 -2 -179 -212 120 53 -280 -110 -32 108 185 34 -5 93 4 12 160 -60 -20 -67 88 -29 -195
5225 -195 -126 356 -61 -24 -130 40 -358 95 170 -88 174 -83 187 72 29 114 206 97 79 135 22 20 -36 89
5249 89 235 79 -279 43 -106 98 -126 -156 51 19 85 56 -241 169 131 223 -80 99 30 -37 23 129 -40
5272 -40 -51 -254 -103 -21 63 53 -256 80 -179 29 -62 88 74 -283 40 -50 102 124 67 163 75 300 105 50
5296 50 -75 105 38 139 -98 18 103 -50 -209 9 -49 29 47 114 -81 -49 -21 204 30 -201 19 137 -60
5319 -60 99 87 38 -21 100 -23 -113 137 173 34 -97 124 64 -135 -106 -100 -122 58 14 -20 -85 63 -84 115 174
5344 174 199 136 153 240 142 220 192 9 -146 -99 112 83 -167 227 93 -293 178 -77 -295 -222 -164 134 58 -228
5368 -228 134 14 38 222 167 161 11 144 -129 -135 104 47 291 -27 -5 -106 -40 -12 96 -111 -316 -121 -236
5391 -236 -22 -283 -263 -158 -3 -32 112 181 179 -162 170 19 -79 -112 20 135 -45 94 -89 -23 47 139 -39
5414 -39 -49 -46 55 62 -2 42 -167 -28 36 -90 55 185 -41 130 65 -307 -63 33 -134 -1 88 168 -188 -104 38
5439 38 -94 72 194 -131 -34 156 -165 -64 -162 -212 368 -34 63 -7 78 18 223 61 122 -190 104 -68 79
5462 79 -116 18 19 98 202 61 72 55 -128 -40 199 -140 206 70 -296 157 237 44 -61 369 -15 116 15
5485 15 -93 116 109 125 67 115 39 130 55 -85 -90 44 2 101 -28 -48 21 -42 -70 140 11 172 71 155 -159 -34
5511 -34 139 63 149 44 65 128 -37 22 92 26 40 -94 -194 32 -166 -161 -8 -140 -177 -51 -90 -84 -91 -200 23 121
5537 121 -33 -28 -28 -8 140 -28 98 127 6 -112 167 -25 -183 132 1 -78 -174 257 -113 -101 -219 226 48
5560 48 -18 134 -144 220 207 -16 13 -35 18 -86 158 -98 14 160 -175 133 126 198 -6 93 -173 36 68 7
5584 7 -165 -74 -312 -47 -21 7 49 -16 148 89 -11 47 -4 -50 45 256 -29 -137 67 -83 6 -37 -89 -117 110
5609 110 101 130 -111 10 200 -149 115 65 80 -84 215 -23 260 222 103 130 327 -261 165 -61 72 -120
5631 -120 -116 -82 -105 -70 113 66 -35 -2 74 156 87 -209 51 87 235 127 51 -177 -42 -79 -22 105 113 3 121
5656 121 135 19 83 35 31 -19 61 -253 -92 26 -129 417 -120 -40 97 -177 -139 -64 -52 -20 101 49 121 47 79
5681 79 -84 131 -181 10 -8 -124 -48 -243 -198 -235 23 -114 -88 -125 22 85 71 -74 51 106 253 23 88 24
5705 24 59 -43 48 254 129 43 -329 10 -64 48 -123 -63 60 170 -259 -19 127 -75 149 -110 -183 67
5727 67 61 9 -33 81 58 19 133 5 184 160 102 -7 -62 7 122 -31 -79 -226 -29 12 -124 160 268 -45
5751 -45 -46 -40 -102 337 56 90 -21 155 94 -12 84 -26 -113 18 -58 129 184 -130 18 -179 -348 -18 -4 202
5775 202 17 221 34 13 -167 100 96 85 -130 47 -62 -213 38 43 69 97 63 103 173 -144 190 147 67 -52
5799 -52 -135 -180 -230 -268 -82 -78 67 222 -43 -47 35 224 -95 145 -33 -128 44 68 -26 358 52 -149 -92 305 79
5824 79 224 -54 123 -44 -28 111 134 -48 -211 5 85 27 8 72 37 -11 -12 43 7 -130 298 -12 51 111 -103
5849 -103 -78 -18 -68 66 -239 -24 82 -61 -39 209 -6 101 25 141 66 70 87 -166 -75 181 64 -60 -155 -23
5873 -23 18 -169 55 -34 -125 -2 83 133 -295 -18 -77 251 -122 -26 34 31 -34 62 -71 121 135 -101 -35 -101 62
5898 62 -86 98 89 17 -150 119 -165 122 61 -47 100 -28 -299 -43 -31 10 28 -39 -66 94 83 -3 41 133 -65
5923 -65 96 -109 224 -89 141 -98 52 -230 -12 197 -50 -238 -7 -39 -83 -49 -28 -8 5 -83 -127 -86 182
5946 182 250 83 -85 -86 52 48 236 -15 169 -99 268 104 -165 -265 153 -84 31 -258 47 -72 -48 -64
5968 -64 -58 -124 -88 -3 30 166 133 -122 191 26 278 153 -129 -60 185 -282 22 -21 35 -29 30 118 0 -18 -73
5993 -73 316 -17 93 -138 59 -80 22 -89 38 -65 238 -36 -62 -5 33 -17 -71 -99 -47 -195 158 -261 -158
6016 -158 156 -63 -218 159 79 18 -121 -131 -180 68 7 58 169 -96 132 -132 -59 269 125 -3 139 93 242
6039 242 0 72 -119 117 82 -59 -93 -8 -175 90 59 195 346 123 34 -92 71 76 42 164 183 -214 107
6062 107 -171 -10 39 111 281 181 -140 -46 227 35 45 209 -27 -284 -203 -134 63 89 66 170 134 71 138 216
6086 216 99 -86 234 146 22 39 -171 134 39 -95 -108 54 -78 -92 -199 -138 84 -79 19 -10 -34 -130 28
6109 28 240 -74 52 -25 48 -117 -31 117 -56 89 -26 -182 -90 -71 138 96 -95 93 -142 -383 -53 -89 -9
6132 -9 -53 -12 118 14 139 -49 -232 26 224 -89 70 -209 221 111 210 114 -113 -16 -103 -100 87 22 -115 -2
6156 -2 80 -300 -81 -237 14 -75 166 -26 3 -2 -87 120 201 140 59 60 85 118 19 1 2 -72 210 6 -60 182 -48
6183 -48 60 264 -59 3 -165 -75 121 153 41 -162 -239 92 59 34 -17 171 4 41 -19 -32 34 -168 -59 -29
6207 -29 -64 48 -219 169 -118 -277 -20 -62 -124 110 119 180 -124 36 178 84 129 97 -167 -174 -168 -51 -61 208 84
6232 84 -180 92 9 -108 -56 58 328 -379 -168 65 60 66 -173 -165 -80 234 -204 -139 -4 165 97 66 44 135 287
6257 287 -210 -144 -9 23 130 -102 139 36 164 -43 30 -267 -67 -258 -31 1 19 -100 -23 220 250 115
6279 115 -358 118 -112 24 11 129 111 -281 86 110 -217 296 156 -165 302 -18 -60 22 -75 168 238 147 -77
6302 -77 -216 134 -103 47 -277 316 38 26 -10 126 -176 121 29 148 -68 -148 -30 -177 -125 -137 62 197
6324 197 -138 -17 9 109 116 57 -15 -213 -242 147 -182 221 12 62 -106 -29 -88 -154 -71 73 -151 -108 -85 -196
6348 -196 -334 203 -71 126 145 -41 146 9 5 43 182 8 43 135 -77 -111 124 -34 30 117 -41 -7 -11 -15 37
6373 37 -69 -106 -38 -177 51 -135 -70 -111 101 -156 -103 -116 27 -135 -163 136 -141 -66 67 223 31 64 144 52
6397 52 39 11 129 300 -190 -179 -77 75 -41 76 62 187 111 -77 90 -78 -16 70 8 32 -23 -183 34 -152
6421 -152 -25 168 114 10 89 15 -250 24 47 210 -161 313 -18 -88 -46 21 -130 65 73 -9 80 -226 -44 -12
6445 -12 130 244 -24 -82 -131 231 194 -59 105 99 2 112 -46 -213 88 190 72 -110 92 -114 -51 -30 255
6468 255 -1 -69 -3 -86 -130 -304 143 341 247 145 44 24 -211 -115 132 49 114 155 257 184 180 -150 -341 56
6492 56 87 82 -63 -66 185 155 135 73 195 93 36 45 90 -37 75 118 -1 -335 -288 -127 113 45 -87 48 145 -9
6518 -9 108 1 40 148 3 -327 99 295 -150 -52 144 -79 -128 -394 -18 68 -78 52 -190 -75 55 -261
6540 -261 66 -12 31 -43 -287 -69 -254 130 232 -31 217 14 66 13 -7 -97 -132 18 58 -247 145 145 27 142
6564 142 -155 -139 -49 -47 106 -64 -166 -174 -71 -30 54 -113 8 -86 35 226 6 -86 249 103 263 156 -35
6587 -35 152 58 -203 -71 -84 123 168 -10 184 -137 -95 8 7 138 66 -372 153 68 346 361 -101 107 19 -55
6611 -55 48 77 -90 80 -112 3 -5 -112 -211 -43 135 183 103 -184 14 -132 -84 20 -8 7 67 32 -120 -166
6635 -166 -106 70 111 202 120 270 64 -13 -194 -51 -68 103 -8 207 -49 -344 151 -22 111 236 310 -53
6657 -53 228 68 -64 270 51 107 -260 285 47 252 -160 -220 166 -198 -233 -127 103 80 -31 43 -17 -32 195
6680 195 4 -5 74 -207 -104 108 -45 -173 -22 45 62 16 13 -98 106 24 65 30 383 20 -19 -42 -237 -83
6704 -83 36 -30 -221 209 27 3 260 74 263 32 -26 203 51 -5 164 -158 105 -172 -41 -144 242 -117
6726 -117 -60 -116 -88 -161 -204 121 -16 -77 72 199 -165 -101 214 90 -156 46 149 80 53 220 34 148 -133
6749 -133 174 -74 37 12 46 216 28 87 -246 -7 116 -32 220 -177 223 -79 20 38 -9 148 96 93 -117
6772 -117 142 252 -87 -108 58 -46 245 10 36 -32 -153 -7 103 33 -157 -26 113 -127 -99 75 -101 139
6794 139 34 65 59 171 -165 -85 -95 -221 -39 63 63 -19 103 194 -86 -100 -65 -93 234 -7 -143 6 11 -103 109
6819 109 -141 -26 66 -22 29 192 155 -26 -40 127 172 -82 -12 69 -190 -169 -226 225 111 65 -123 -137 -150 -85 70
6844 70 24 30 146 -3 -135 175 195 92 75 -6 3 46 97 209 -210 -120 -247 -52 185 -81 108 -225 -99 8
6868 8 123 -15 -39 -104 -14 -168 21 -226 113 171 33 149 56 73 30 -289 391 157 61 157 -14 277 70 -97
6892 -97 3 71 8 -144 -53 25 116 -91 -76 204 0 146 247 -192 -47 150 -144 19 -85 163 -219 129
6914 129 -44 86 57 10 -83 -161 -110 -66 -8 78 226 -38 301 -43 24 103 169 84 26 -15 -46 111 100 -63 88
6939 88 6 38 -136 -68 -100 -23 116 -51 -255 -64 123 -122 -304 33 122 -300 -175 12 266 -159 -64 99 135
6962 135 315 243 177 -40 -129 55 121 -90 -238 153 67 -152 0 119 -74 58 -78 -2 12 -69 -199 97 -140
6985 -140 -16 146 183 -27 104 -155 207 125 42 138 -28 60 -160 75 -1 -126 130 317 136 -223 -49 44
7007 44 5 -31 -52 -18 121 -73 91 -67 163 65 -134 -250 -78 -19 12 -70 -40 14 111 357 -7 -18 -199 155
7031 155 119 115 -272 169 236 -266 79 -172 56 105 96 8 113 -1 153 -80 -168 158 85 122 27 32 303 101 -5
7056 -5 -164 -164 65 199 56 -136 -84 -16 57 -42 129 -29 150 -57 257 210 -118 152 -87 -226 -74 91 146
7079 146 174 83 157 -349 -176 -154 -213 79 -39 276 -112 314 40 -107 -211 38 182 44 20 144 125 111 -26
7102 -26 67 18 -82 46 -122 180 -199 276 -210 66 72 -69 -172 161 -29 -87 -116 -121 -49 82 156 51 116 -96
7126 -96 -147 35 -8 140 120 121 -10 110 -104 89 118 149 323 -68 -35 -64 185 -50 42 -16 -143 101 18 -167
7150 -167 81 -121 43 147 -98 51 69 111 90 38 158 32 -23 -192 39 -47 -44 -37 -249 36 -149 1 -140
7173 -140 -146 215 95 -51 135 187 131 38 125 -74 79 375 -175 -44 213 -132 51 -119 -121 -20 -35 26 -138
7196 -138 213 164 -171 45 11 -258 -48 -24 23 46 -172 -33 2 -268 88 113 203 47 53 -86 -80 -1 32 -60 -99
7221 -99 -349 127 -107 -18 57 -57 98 32 81 -180 40 31 -28 57 -263 41 -30 100 11 -75 14 190 169 -122 -94
7246 -94 110 -170 -188 -27 -109 161 0 -35 -111 -63 15 86 -46 96 -17 77 180 229 82 47 -70 14 191 200 32
7271 32 29 -23 27 137 -122 -71 23 27 128 -63 25 13 21 132 127 19 21 148 49 189 127 83 44 138 21 19 101 -272
7299 -272 10 -248 113 26 -282 -69 -126 -246 35 62 -55 -86 -271 184 -16 -4 -304 -152 235 -59 -71 96
7321 96 -44 143 -84 -35 -176 -166 134 169 -130 20 62 -141 72 -9 -28 -59 -66 -8 208 -1 -32 22 98 -37 166
7346 166 -87 119 160 294 -13 -207 -202 71 161 -101 -28 -407 31 -225 34 -165 -123 175 -100 -189 -26 -11 -30
7369 -30 93 74 48 280 41 63 -134 -17 122 -143 11 6 234 148 -48 -64 -134 -15 -121 -67 -38 128 -21 -78
7393 -78 55 118 -41 11 -42 48 -68 145 -1 195 80 -129 -2 81 146 139 -18 -120 -100 -29 13 37 -164 -61
7417 -61 -184 -152 45 -26 -27 -31 -75 276 9 -64 -73 -19 51 7 -97 -52 12 -19 303 154 -87 275 58 268 0 -131
7443 -131 30 -174 -136 -399 -119 42 95 229 66 260 -2 24 -48 248 182 22 -168 -61 -71 168 122 14
7465 14 32 31 234 -286 -124 -200 -97 -61 260 72 -57 143 123 65 83 -165 2 142 -89 99 7 18 -16 282
7489 282 49 295 -235 -35 4 109 -164 -20 -31 246 -273 -41 -17 -84 111 -7 -278 -10 130 -167 156
7510 156 -22 24 89 -51 -54 58 -84 50 144 64 179 -123 15 179 -163 -104 34 229 47 -149 38 -106
7532 -106 -208 109 -41 -17 145 116 -23 278 -114 44 -76 -89 263 62 190 118 -85 67 52 150 49 -211
7554 -211 -123 1 -4 27 46 40 -178 -192 188 -36 180 31 129 6 -30 -64 61 -180 -123 -66 -267 -157 115 90 -36
7579 -36 45 -85 24 -194 -207 -71 -193 -142 60 61 145 204 363 -117 -76 -10 212 198 58 143 76 96 -8 -38 19
7604 19 -117 65 -116 182 -294 -16 -8 -50 -140 62 -56 199 37 157 -12 -251 9 -53 -105 1 -202 26
7626 26 23 -45 187 -203 7 -280 152 -140 87 -116 -53 -303 25 -28 -94 67 -37 151 224 364 -80 -57 21
7649 21 193 144 -32 80 110 -272 -110 70 50 -270 -66 25 169 91 270 -22 -51 -344 40 91 -224 335 31
7672 31 -49 124 162 -110 -36 40 -180 188 -98 111 101 10 64 -6 -35 36 128 91 130 -54 57 120 -122 66 98
7697 98 56 195 66 -14 -46 247 33 -7 -60 130 103 -73 -148 -60 -30 -181 -129 106 114 -117 28 112 -10 -17 259
7722 259 142 85 -28 144 40 -83 -78 -30 154 -7 -59 -54 2 -43 -128 7 -7 146 -167 -85 96 172 -156 9
7746 9 -37 56 57 93 -24 180 -66 12 98 85 -127 -38 99 -175 337 146 86 -51 50 16 95 -34 20 141 40
7771 40 14 -180 -272 185 2 169 -98 21 -31 -49 -96 217 127 392 372 98 71 -150 63 -139 -93 48 111 -29
7795 -29 14 211 127 31 -90 22 -30 260 87 -126 -45 52 -78 152 26 94 -48 89 16 144 144 172 11 150
7819 150 12 -149 -126 92 -12 -111 363 162 12 61 9 -117 -48 116 95 -144 17 -1 178 -16 -62 7 -76
7842 -76 225 102 50 -29 -13 207 87 252 52 -193 -106 -194 164 58 6 50 -111 166 -251 68 179 44 -41
7865 -41 26 62 -118 -68 230 -7 56 103 6 -85 141 -70 1 84 -195 -157 -53 62 65 -142 44 -197 -87 85
7889 85 -33 -307 -69 70 20 205 57 103 -93 -113 -41 -70 -55 1 -179 191 -172 -57 -122 173 51 199 144
7912 144 -49 125 -363 112 -36 -22 -202 95 -15 197 -64 -221 324 159 235 8 62 -92 20 91 -204
7933 -204 -82 30 59 -64 157 206 -90 -121 -178 170 -271 82 116 27 103 40 -244 191 139 -228 160 -19 -130
7956 -130 73 155 -111 -238 213 53 -347 -146 -44 92 154 -49 76 -37 9 155 21 -134 -145 260 150
7977 150 16 86 52 23 -35 240 38 -7 179 37 5 -142 -9 -31 85 -28 -86 -68 -18 -55 134 -37 -293 -132
8001 -132 1 4 288 -48 123 310 -108 94 -87 134 131 78 88 95 73 -23 -49 108 -7 -118 -260 266 -60 303
8025 303 -123 81 -166 149 -103 -116 126 -195 76 89 28 -208 165 134 -206 73 17 -146 -225 90 -262 -189
8047 -189 -79 233 335 -93 9 86 113 -97 -96 -261 105 210 172 -185 116 248 -178 138 -50 -58 135 15
8069 15 -85 -39 52 32 44 -30 70 -185 -387 -29 68 207 196 -134 -12 -182 116 394 -157 -87 64 62 -150 30
8093 30 109 -44 11 -12 35 -108 115 -152 -152 -66 88 11 64 -82 119 67 155 122 244 93 -56 -141 234 -123 87
8118 87 17 138 -100 58 -230 -160 2 -53 6 -200 119 -14 -190 -10 22 -36 -41 133 -11 -115 -169 146 110 141
8142 141 170 96 -48 35 197 -30 29 140 59 -2 -70 78 -104 -111 -69 45 -38 -130 176 225 90 7 165 349 -150
8167 -150 149 16 78 95 -195 54 -252 -19 49 59 54 -90 146 91 7 -278 19 137 -206 -23 8 32 107 -114
8191a14
$$ Imaginary data points
##PAGE= N=2
##DATA TABLE= (X++(I..I)), XYDATA
0 0 0 0 0 0 0 0 0 0 0 0 0 0 0 -8 8 -8 8 -8 13 -16 16 -24 24 -32 33 -40 48 -55 63 -72 81 -92 105 -118 133
35 133 -150 168 -189 209 -233 259 -289 320 -355 390 -432 476 -525 578 -638 701 -774 853 -941
54 -941 1040 -1155 1285 -1435 1608 -1817 2069 -2386 2787 -3323 4071 -5199 7076 -10766 20723
69 20723 -104750 -271407 27075 157384 40976 25493 107358 14160 -38052 95804 142215
80 142215 -4214 -33408 53947 22481 -53930 24369 101552 11262 -82381 -18944 37736 -22101
92 -22101 -65545 -24497 -7366 -41726 -41756 15198 34350 2298 14270 70751 71217 21952 11108
105 11108 36059 33854 30499 42877 -4506 -78123 -35394 71533 58749 -53443 -85417 -14536
117 -14536 24146 2959 -7385 -18094 -48282 -48447 -15955 -1734 -5679 -5331 -21117 -48240 -23630
130 -23630 43113 63890 28892 -7916 -12954 23215 59445 40491 -6018 -18569 -13182 -25180
142 -25180 -16043 23015 8908 -46863 -31774 24115 9654 -30970 -11200 10929 -22075 -35432
154 -35432 -7963 -18419 -30765 25585 55893 -2837 -27323 38854 71235 19730 -5671 19150
166 19150 4369 -39760 -35018 -2716 -2770 -21224 -23032 -23842 -30616 -1985 42249 24007 -35072 -40463
180 -40463 6199 24658 6100 7694 19406 -1658 -10023 31877 58606 27610 -2287 6102 8622
193 8622 -10180 -3968 14685 -2586 -28123 -20685 -6812 -7810 1129 21462 9033 -27037 -20218
206 -20218 23134 31156 3884 -3469 12202 11169 -750 9106 21556 10468 -1151 -5302 -14615
219 -14615 -16236 2182 15241 -4892 -32467 -26590 -5227 -1343 -7761 -11019 -14712 -24111 -23910 -3033
233 -3033 14273 7685 -1472 1343 5929 6928 13906 24648 15517 -7410 -11892 -2452 2733 9881 13325
248 13325 -764 -20886 -15548 9516 13173 -5079 -14625 -14446 -15949 -14531 -2883 10384 9043 -1598
262 -1598 -1999 5402 14761 25394 26427 9864 -8884 -5367 13654 17666 7587 3708 -427 -8916
276 -8916 -7385 5478 8464 -5351 -17964 -17755 -16975 -13098 -1787 4127 -2159 -10490 -8823 2009
290 2009 9946 12741 10206 -1719 -11720 -4711 11205 16853 7483 -237 595 -1854 -2417 5789 7587
305 7587 -3251 -16975 -20275 -13903 -5198 3203 3658 -7496 -13578 -5923 6443 12281 7669 0
319 0 -4584 -7134 -798 12135 17590 10542 1076 579 5491 8308 12199 11054 -2376 -13685 -11749
334 -11749 -3046 3493 4728 671 -7713 -11667 -2354 8473 8193 1213 -5646 -8235 -5083 1079 9563
349 9563 11858 4834 -2691 -3235 2928 9191 8473 2176 -7846 -15401 -9152 1047 3862 809 -4450
364 -4450 -9189 -9725 -3563 5115 4342 -4411 -10618 -11263 -5036 5293 10601 8783 2775 -2943 -242 7586
380 7586 12199 8694 -1458 -9687 -11055 -4787 4677 6145 -1714 -7658 -8709 -5038 1402 4970 2016
395 2016 -6732 -12123 -7490 426 7470 9660 4161 -1269 -690 4440 10095 10597 5116 -1817 -6966 -5331
411 -5331 183 3897 3904 -2921 -9652 -9490 -5127 504 3632 -301 -6611 -9345 -4797 5500 12436 11649
427 11649 4715 -2306 -748 6947 13226 12956 5073 -3107 -2622 4003 11646 13976 8821 -960 -8116
442 -8116 -5448 1696 2627 -3527 -10377 -16003 -13292 -3204 4594 3912 -1504 -3932 -3277 -1646 3719 5412
458 5412 -210 -5417 -6030 -2749 2306 7089 9225 5930 -50 -2157 -1864 -1456 -1522 -5670 -13286 -20451
474 -20451 -19910 -10724 -3887 -3102 -3932 -6944 -7973 -1409 7825 11994 6957 -833 -2915 899 10798 19071
490 19071 15594 5655 677 4044 11434 14233 9350 -601 -9896 -10313 -4380 29 -43 -6152 -12119 -10716
506 -10716 -3838 3225 6917 4978 627 -223 3979 9450 10672 10136 6947 167 -1183 2747 4706
521 4706 3759 2648 -67 -4486 -5448 -571 1587 -731 -2317 -7649 -14727 -12705 -3766 287 -2965 -6420
537 -6420 -6567 -3671 4400 13889 12787 3589 -1280 -1788 878 5441 7220 1810 -7507 -8044 465 7673
553 7673 9093 5375 -3174 -8715 -7491 -2047 -88 -5755 -11858 -14185 -11903 -3746 4601 6386 3221
568 3221 -73 1073 4443 6148 6678 4152 -1362 -4690 -5227 -601 4635 4020 310 -3121 -4886 -3110
584 -3110 792 1754 -1771 -7015 -7685 -5560 -2683 3889 8084 4421 -112 1134 6465 11257 12766 10066
600 10066 3003 -2361 731 5370 5889 3329 -2261 -7734 -8128 -2891 2721 2404 -2271 -5505 -5908 -1671
616 -1671 4664 6146 4575 -438 -4615 -2226 4064 8474 6448 813 -2411 -2013 1838 6288 4332
631 4332 -2823 -8228 -10163 -8495 -5864 -4009 -4254 -8363 -10485 -6245 -225 4431 4674 1331 -1706 -2080
647 -2080 643 5146 6165 3423 749 -384 1872 5417 8218 7152 1824 -3178 -3985 -3414 -1693 -1369
663 -1369 -3715 -7659 -10319 -7793 -327 4049 3137 -357 -3451 -1982 2763 7832 8844 4469 651
678 651 981 4066 8372 10819 7635 367 -4367 -2762 2005 2191 -1049 -5970 -10543 -9022 -4257 31
694 31 -180 -4168 -6901 -6257 -2418 2552 4784 3376 1108 81 3403 7691 8891 7969 5065 1032
710 1032 -1520 -337 2505 2394 -2131 -5080 -6651 -6118 -2843 -250 -1172 -4545 -7287 -6690 -3877 -508
726 -508 2915 2006 -2190 -2931 973 7129 9902 7370 3609 -176 -341 3349 5851 3940 -533 -4844
742 -4844 -5561 -2808 820 1828 -1619 -6679 -7508 -5337 -997 1999 629 -1886 -3360 -1717 2372 6577
758 6577 7430 3450 -467 138 3094 4092 5499 3775 -708 -3451 -2218 138 770 -207 -2373 -7017
774 -7017 -8499 -4235 -264 545 -680 -2489 -2785 -881 3585 6463 4937 1660 -1042 -1231 1711 4787
790 4787 4959 2000 -1795 -3106 -1156 1917 2160 -653 -4943 -7209 -7208 -3746 -17 -397 -3100 -4494 -2411
807 -2411 1532 4442 5963 4562 277 -615 1441 3237 4927 4162 702 -2252 -2398 1270 3823 1980
823 1980 -1286 -4405 -5593 -3813 -1100 193 -1553 -3903 -4469 -2519 1139 5098 5147 2310 791 1108
839 1108 3699 6381 6867 4629 1070 -97 1212 2786 4250 2419 -2171 -5052 -4255 -2423 -784 -806
855 -806 -2971 -5649 -6124 -3112 211 1215 458 -1520 -3279 -1050 2811 5166 4752 2008 592 555 2375
872 2375 4414 3948 655 -3056 -5185 -3753 -1640 -1020 -2292 -4723 -6941 -5746 -2774 -267 -577 -2508
888 -2508 -3432 -3975 -1426 2790 4496 3363 1590 1120 3097 5156 6541 5847 2199 -434 -863 311
904 311 2138 2073 -794 -3208 -4624 -3222 -203 1071 -739 -3696 -4506 -2698 -76 2446 3692 1364
920 1364 -231 765 3381 5836 6061 4413 1739 -785 728 3409 3365 1918 -777 -2877 -3105 -2064
936 -2064 414 -191 -2863 -5010 -4828 -3119 -620 957 657 -783 -1797 -94 2534 4039 3909 1951
952 1951 -867 -1271 283 2689 2762 673 -1725 -3132 -1977 -216 77 -493 -2866 -5554 -4745 -2004 -229
969 -229 -73 -973 -2446 -2880 -765 3105 3584 1523 207 -909 -867 1755 3307 2739 9 -2199 -1643
986 -1643 -225 1092 1296 -555 -2687 -3735 -2469 233 1430 125 -848 -2020 -1353 1143 3421 3946
1002 3946 1343 -224 1095 2361 3623 4414 3359 1076 -1458 -69 2167 1646 315 -865 -3388
1017 -3388 -4173 -1622 838 737 -1439 -2568 -1796 -1683 576 3098 2002 -680 -950 895 2705 3312
1033 3312 4041 3127 16 -1015 936 1761 1239 -542 -2912 -4815 -4995 -2171 -70 -1602 -3593 -4449
1049 -4449 -3348 -1386 518 1426 378 -1787 -1968 711 2812 4038 3040 1504 285 526 2939 3594
1065 3594 1903 -717 -2535 -2478 -1806 -843 -582 -2028 -4308 -4139 -2350 -949 54 -382 -596 -1507 -1253
1082 -1253 993 3487 3511 2666 1446 1222 2268 3526 4727 3488 511 -687 5 638 1201 535 -779
1099 -779 -3535 -4502 -2605 -502 -406 -1745 -3124 -2965 -1943 821 3564 2509 0 -180 1427 2794
1115 2794 3932 4050 2494 -640 -823 1902 2408 1089 349 -1490 -3074 -3005 -1065 -351 -2191 -3524 -3802
1132 -3802 -3447 -2089 188 856 -24 -1150 -635 1250 2177 2685 2773 1712 87 -149 1219 2795 2180
1149 2180 664 -989 -2268 -1555 138 681 -918 -3249 -3750 -2462 -793 554 1033 -647 -2004 -1460
1165 -1460 1102 2979 2751 1422 688 -542 702 3066 3650 2178 -451 -1035 -737 -104 1084 769 -1883
1182 -1883 -3480 -2950 -1376 -205 -200 -200 -1250 -2122 -1064 1084 2286 1635 484 42 262 1319 2911 3007
1200 3007 1118 -584 -1172 -141 566 167 -11 -1973 -4125 -3410 -1273 177 -467 -1125 -1718 -2388 -745
1217 -745 1851 2609 922 -28 -97 792 2352 3523 2892 663 -716 -208 843 1135 602 -644 -2253
1234 -2253 -3201 -2320 -153 70 -868 -1983 -2836 -1537 98 1604 1681 193 -451 110 1873 2954 3225
1251 3225 2399 1072 -397 422 1969 1993 762 -395 -2149 -2252 -1341 -61 -214 -1911 -3115 -3001 -2192
1268 -2192 -491 486 -169 -1388 -1539 -100 1757 2645 2567 1745 595 633 1413 2804 2780 945 -941 -1398
1286 -1398 -868 56 433 -637 -2195 -3914 -3111 -1547 -1294 -1089 -1352 -2460 -2794 -810 1035 2042 1320
1303 1320 642 157 972 2273 3174 2447 1177 35 -123 798 1036 1070 -190 -2129 -2473 -2107 -671 -321
1321 -321 -1159 -2101 -2518 -2269 -25 934 1414 659 -352 107 1429 2709 3566 2437 780 381 866 2287
1339 2287 2479 1372 328 -1032 -1625 -331 214 12 -1210 -2351 -2552 -1874 -301 821 132 -1138 -1252
1356 -1252 -473 491 1713 1380 960 -362 -175 873 1995 1857 682 -683 -1376 -1341 -324 327 -474 -1861
1374 -1861 -2742 -2463 -1280 -488 -251 -581 -1785 -1622 -298 738 1466 1276 446 -175 130 1341 2299 1701
1392 1701 666 -427 -567 192 841 874 -3 -1551 -2217 -1305 -352 451 68 -1074 -1652 -1274 463 1716
1410 1716 1468 994 353 211 955 2238 2625 1860 124 -360 -8 640 1113 534 -886 -1539 -1914 -843
1428 -843 151 -169 -486 -1952 -1928 -1132 189 853 890 -241 -359 266 1362 2319 2652 1512 235 258 802
1447 802 1488 1252 478 -681 -1774 -1479 -400 -297 -881 -1705 -2308 -2266 -1306 -296 44 -509 -1313 -1200 -47
1466 -47 1188 2006 1734 986 -207 250 1321 1908 1427 315 -508 -1378 -678 78 -67 -920 -2131 -2935 -2309
1485 -2309 -1434 -535 -432 -1439 -1805 -953 88 1291 1733 1125 947 486 1266 2795 2786 2295 1304 429 693
1504 693 1051 1184 869 -529 -1875 -1909 -1264 -401 -499 -999 -1575 -2003 -1087 139 643 704 181 167 57 772
1524 772 2187 2443 1373 680 489 669 1618 1500 637 -666 -1576 -1428 -655 -716 -886 -1906 -2604 -2384 -1445
1543 -1445 -303 -188 -555 -693 -781 -248 855 1481 1606 791 77 738 1635 1729 1610 824 -316 -744 -257
1562 -257 145 273 -801 -1423 -1686 -1705 -855 102 -168 -614 -1643 -787 39 796 1425 789 268 188 854 1741
1582 1741 2015 1274 610 -172 -450 77 632 640 -773 -1789 -1687 -1448 -785 -52 -455 -1454 -1537 -1098 432 871
1602 871 994 689 87 269 950 2021 1770 944 -30 -143 -99 367 922 195 -973 -1691 -1175 -542 -442 -468
1622 -468 -711 -1560 -1733 -709 376 651 485 30 107 697 1454 2233 1799 831 280 200 934 1020 550 -44
1642 -44 -1299 -1388 -984 -570 -586 -906 -1541 -1791 -1855 -631 141 -1 -205 -440 198 435 1386 2016 1768 830 573
1663 573 1129 1515 1775 983 -13 -521 -1140 -611 -182 -533 -1234 -1911 -2133 -1773 -822 -317 -481 -1241 -1031 -197
1683 -197 306 1501 1554 1218 437 427 1687 1877 2251 1339 367 -118 -76 244 328 -475 -1662 -1955 -1933 -1262 -822
1704 -822 -790 -1133 -1795 -1531 -501 397 762 384 152 187 516 1341 1983 1415 858 592 642 746 1020 700 158
1725 158 -1309 -1609 -1368 -839 -446 -916 -1441 -1807 -1232 -368 802 530 225 -164 47 639 1422 1778 1555
1744 1555 712 561 1085 1399 1664 1480 198 -565 -633 -216 12 -295 -965 -1304 -1933 -1159 -421 269 -237 -874
1764 -874 -737 -324 136 1167 1123 449 78 227 559 978 874 804 39 -703 -687 -56 151 -503 -1202 -1700 -1657
1785 -1657 -1215 -588 -174 -941 -1025 -963 -212 829 1121 925 564 103 387 951 1251 1097 433 -213 -450 -302
1805 -302 421 406 -70 -1064 -1391 -820 -452 -262 -368 -878 -1290 -628 -180 925 806 540 214 181 799 1671
1825 1671 1642 812 476 -330 -236 231 263 122 -674 -1086 -1240 -895 -151 64 -730 -1208 -1527 -678 -19 670 427
1846 427 221 293 204 919 1756 1765 1262 501 357 601 905 809 614 -672 -1182 -683 -200 -301 -472 -901 -1760
1867 -1760 -1204 -856 -331 -292 -528 -761 -325 -318 714 1015 944 491 234 368 822 1110 990 440 -402 -684 -283
1888 -283 -458 -401 -756 -1344 -1463 -1401 -888 -643 -376 -557 -850 -1031 -149 560 975 773 633 444 694 1318 1548
1909 1548 1333 981 243 196 636 649 416 -333 -806 -997 -786 -410 -225 -397 -906 -833 -662 58 448 389 160
1930 160 -361 -145 525 1034 1120 954 484 325 498 572 851 362 -352 -658 -904 -128 -326 -506 -601 -957 -1376
1951 -1376 -852 -80 -311 -157 -719 -352 -334 344 1213 760 348 166 55 750 1241 910 561 -302 -436 38
1971 38 120 107 195 -764 -1042 -801 -212 -83 -238 -505 -678 -594 1 537 542 564 220 -106 229 640 968 628 180
1994 180 -444 -270 182 522 112 -339 -558 -1009 -570 -265 101 -366 -794 -465 -351 91 421 475 529 -115 123
2015 123 774 887 1068 561 383 -53 178 464 463 3 -371 -638 -564 -755 -85 -456 -699 -745 -745 -369 173 502
2037 502 230 67 -21 194 778 1207 820 314 31 -71 452 778 428 248 -567 -619 -557 -451 -242 -107 -1159
2058 -1159 -1220 -986 -537 -99 -181 -197 -419 -341 -28 849 715 652 749 346 468 637 1039 889 409 71 -76 -147
2080 -147 165 -201 -617 -762 -1122 -884 -371 -264 -207 -558 -845 -350 43 417 621 259 337 222 856 1377 1226
2101 1226 905 397 200 290 392 299 59 -439 -953 -759 -850 -451 -642 -783 -1011 -1059 -792 -318 -72 -50 -287
2122 -287 -240 137 834 1003 971 810 439 421 374 602 625 -16 -108 -704 -641 -430 -435 -346 -703 -1042 -679 -673 -215 -68
2146 -68 57 -524 -480 10 756 726 677 656 309 539 1051 986 815 519 64 -92 67 -11 -23 -175 -803 -928 -605
2169 -605 -267 145 -364 -375 -604 -513 19 479 549 342 -131 21 100 495 896 274 68 2 40 169 93 -42
2191 -42 -520 -565 -742 -595 -309 -296 -533 -662 -599 -361 67 376 302 149 57 319 544 745 822 650 8 -68 168
2214 168 366 421 -99 -229 -567 -817 -563 -361 -568 -756 -716 -459 -100 58 345 311 2 258 784 699 724 778
2236 778 259 176 113 296 394 263 -88 -474 -529 -491 -137 -350 -513 -796 -984 -545 -305 129 -153 -11 120 -9
2258 -9 512 847 814 828 777 566 556 803 551 309 -93 -57 -507 -431 -215 -456 -350 -865 -1047 -804 -490 -219 -439
2281 -439 -422 -456 -205 112 474 657 223 547 618 617 830 587 542 340 -177 -118 298 -82 -388 -673 -828 -640
2303 -640 -397 -540 -559 -723 -723 -642 -342 -125 -72 159 285 411 921 910 1191 1108 809 476 512 641 635 234 32
2326 32 -451 -586 -875 -480 -288 -452 -503 -1005 -826 -538 -326 -163 -324 -131 -221 456 745 783 436 537 250
2347 250 514 750 324 666 -81 -417 -335 -337 -18 -350 -618 -734 -924 -681 -372 -88 -398 -331 -344 -124 231 443
2369 443 544 263 308 212 414 759 702 383 197 -122 47 32 176 -166 -601 -833 -702 -592 -181 -34 -535
2390 -535 -496 -452 106 281 155 371 -88 96 274 200 570 331 245 -179 89 174 191 -21 -155 -638 -579 -437
2412 -437 -30 -207 -251 -213 -567 -248 -58 271 319 98 -29 294 420 482 898 662 297 165 306 414 467 9
2434 9 -24 -548 -529 -379 -255 -216 -651 -669 -652 -269 -95 -11 114 49 -137 266 145 757 669 418 379 179 480 270
2458 270 240 112 -327 -548 -578 -268 -462 -408 -696 -803 -443 -672 -153 13 -257 -279 -170 530 552 707 544 500
2480 500 363 465 780 496 368 103 -34 -50 -71 3 95 -213 -624 -642 -607 -346 -214 -279 -305 -707 -495 100 214
2503 214 451 239 197 357 610 521 689 662 294 232 29 125 316 -28 -355 -499 -696 -374 -221 -337 -613 -584
2525 -584 -500 -377 -58 325 88 -140 -179 102 342 734 704 488 216 224 362 540 472 292 -333 -288 -182 -216 -98
2548 -98 -236 -643 -594 -472 -306 -151 -121 -109 -230 -276 -9 466 532 468 65 364 380 757 452 216 250 -19 -151
2571 -151 8 -171 -52 -296 -496 -517 -354 -224 -73 -236 -143 -88 -122 -110 389 230 -13 239 166 317 357 563
2593 563 603 74 5 -114 103 66 72 -306 -403 -493 -292 -13 -12 -109 -113 -413 -479 276 69 432 76 57 -65 344 480
2618 480 237 220 131 192 105 178 192 62 -268 -327 -320 -322 -9 -140 -490 -288 -463 -166 55 91 188 13 -161 325
2642 325 200 509 365 524 57 147 402 296 297 -77 -421 -285 -318 -385 -295 -286 -488 -662 -496 -111 -21 -28 -333 -227
2666 -227 184 199 714 433 495 517 319 519 441 431 297 117 -37 -357 -99 -116 -43 -375 -478 -420 -467 -360 -427
2689 -427 -418 -194 -366 -271 192 374 647 163 213 446 492 614 809 256 45 298 35 104 157 -45 -168 -903
2711 -903 -279 -342 -85 -204 -473 -692 -481 -229 -28 55 -87 135 23 200 668 634 508 236 305 386 303 332
2733 332 274 75 -236 61 -240 -145 -295 -377 -466 -456 -460 -373 -299 64 -263 -124 -122 198 472 347 403 202 360 225
2757 225 557 910 374 -109 -18 118 22 115 -266 -459 -381 -369 -475 -179 -30 -314 -350 -169 -125 32 39 334 279
2780 279 190 151 508 376 370 -23 23 58 147 -31 38 62 -303 -51 -429 -83 -251 -314 -414 -471 -243 -304 -261 299
2804 299 109 69 -159 135 265 385 341 179 173 -203 296 236 275 15 -142 -433 -232 -201 -179 -71 -301 -332 -180
2827 -180 31 80 -1 -74 165 79 264 297 424 505 360 18 77 324 213 174 67 -306 -111 -121 15 -129 -92
2850 -92 -463 -156 -258 -100 1 -60 -84 -34 67 173 543 209 397 -23 -34 337 335 346 123 -59 -134 -316 -283
2873 -283 -8 -315 -192 -445 -482 -321 -145 -328 -129 -325 5 136 -200 230 348 178 508 244 361 376 431
2894 431 569 51 46 65 166 118 -36 -163 -505 -356 -415 -193 -210 -337 -365 -299 108 92 205 182 353 126 500
2917 500 325 321 407 271 -114 146 -163 329 -27 -145 -159 -251 -163 -167 -361 -532 -379 -466 -319 -330 -149 -165 186 31
2941 31 -16 359 179 237 183 339 257 381 504 362 323 41 -154 30 81 -197 -295 -480 -487 -275 -339 -93 157 40
2965 40 -187 -186 144 -28 106 346 156 41 342 132 393 397 246 115 -133 -116 228 126 -301 -115 12 131
2987 131 -45 -231 -135 -344 -284 -506 -211 173 89 409 20 43 73 324 468 278 15 124 53 -51 -115 23
3009 23 -24 -54 -181 -71 -20 47 -250 -407 -261 115 78 120 40 118 -159 83 447 548 122 503 -5 -124 361
3032 361 130 87 166 -279 -383 -171 -214 -53 -274 -244 -335 -301 -261 58 -131 -7 155 -51 159 254 307 561 43
3055 43 209 224 188 146 317 125 -112 -166 -68 118 -175 -155 -81 -227 -231 -139 66 -280 -99 -242 90 66 190 331
3079 331 -45 139 217 54 445 318 148 247 163 -157 244 135 -8 -235 -392 -360 -417 -343 49 -231 -366 -325
3101 -325 -235 -173 139 128 277 340 89 299 331 508 247 126 125 240 213 20 -182 -81 -370 -201 -18 -277 -203
3124 -203 -177 -343 -435 -278 -53 -126 -85 103 -19 62 234 461 330 327 67 188 132 225 192 42 -10 -34 -203 -192
3148 -192 150 -173 -44 -80 -372 -333 -127 -132 -245 -299 -51 -361 107 260 262 -5 316 151 345 139 166 113 34
3171 34 -150 -112 209 -98 21 -445 -171 -292 -168 -251 -216 -127 -382 -410 -22 77 -187 189 -52 309 2 77 338
3194 338 284 -188 54 -213 -135 110 -94 -285 -219 -353 -196 -281 68 -286 -177 -220 -211 -90 129 125 207 178 103 512
3218 512 159 332 199 109 321 277 133 52 -109 -172 -266 -301 175 -132 -216 -187 -102 -361 -178 192 120 300 72
3241 72 -137 -51 62 122 247 197 123 46 252 126 292 40 53 -87 71 -50 -330 15 -67 -411 -79 -265 -102
3264 -102 132 -161 -265 -24 205 195 43 -85 360 262 277 186 333 69 -148 193 49 93 22 -28 -7 -407 -305
3287 -305 -263 -103 -427 -49 -24 -169 -181 -199 53 175 231 5 144 -17 351 327 365 12 -73 179 217 -116 4
3310 4 -113 -415 -346 -250 -246 -244 -127 -148 -184 41 -32 99 -109 27 205 178 151 323 456 271 70 -39 307 464
3334 464 55 -182 -226 -270 55 -132 -180 -170 -162 -287 -139 -182 -110 -156 -100 32 148 145 -79 448 26 197 72 425
3358 425 221 227 243 207 135 -185 -8 126 -216 11 -337 15 -205 -7 -194 -248 -38 -20 -76 -86 171 -34 -92
3381 -92 8 299 256 71 206 193 306 -59 -99 27 -17 126 -86 -247 -158 70 -415 -169 -456 -367 -43 342
3403 342 218 21 95 207 -122 215 56 363 -36 99 -69 -156 107 -70 253 112 -42 17 39 -240 -142 -180
3425 -180 -351 -426 -273 -154 -201 -45 70 -66 130 342 352 134 15 267 14 36 5 54 -15 73 -1 -266 -28
3448 -28 -88 -135 -214 -244 -151 -360 -154 -143 -25 -445 75 223 173 94 111 89 -138 156 333 220 190 -110 -14 33 -214
3473 -214 119 -65 -307 -269 -208 -267 -303 27 -132 -212 -159 -197 100 151 37 340 223 41 309 284 249 385 235
3496 235 121 179 -73 182 93 -71 -160 -55 -294 -121 -270 -172 -214 -275 51 -246 123 -38 -32 90 63 106 66 239
3520 239 55 -61 105 186 191 -170 -12 109 194 -63 -171 -221 -171 -23 -235 -446 -43 -181 -118 163 57 -15 112
3543 112 16 189 83 203 96 249 -6 20 36 -14 9 -129 -24 -52 -90 -202 -296 -100 -130 -138 20 49 48 -224 -57
3568 -57 -252 171 194 190 34 260 227 169 109 246 48 92 -192 108 109 -39 23 -138 -322 -73 -248 -325 84 -248
3592 -248 -317 -5 350 -36 8 54 -14 44 55 322 45 -45 -21 -65 -11 -86 250 38 -127 -221 -40 -21 100 -161
3616 -161 27 49 -56 -334 211 -93 -26 -196 -130 99 239 161 77 179 -63 185 78 -7 52 -78 -130 49 -380
3639 -380 14 -102 -228 -227 -14 2 -123 36 -40 121 164 -77 -73 138 401 165 -4 -54 273 -53 -59 27 -160 -197
3663 -197 -15 -35 225 -128 -108 -327 -278 -119 188 -95 -195 -185 -38 52 -119 329 159 171 214 -70 179 150 192
3686 192 -62 413 -46 71 302 -120 9 -363 -153 -23 -258 34 -124 117 -269 -185 -32 109 -89 29
3706 29 244 -60 349 206 111 350 239 156 83 38 -76 -91 -109 -24 -115 -95 -72 -90 -201 -182 -372 -46 3 105 52
3731 52 91 8 -78 106 40 270 138 228 96 150 -84 -50 192 -23 47 -161 -139 -15 -19 -158 -356 -68 -303 -247
3755 -247 -117 72 -62 39 71 21 202 249 258 199 76 -21 70 48 252 220 145 -164 90 40 80 -151 -27 -171
3779 -171 -63 -171 80 48 -169 162 -9 -265 -9 -124 -95 47 123 19 -18 28 92 99 -69 32 -162 -97 -15
3802 -15 -92 -27 -143 -113 23 13 -246 -107 -49 -28 -274 -184 -60 244 88 107 89 360 308 16 -137 276 5 103
3826 103 52 -232 96 -79 30 15 42 13 80 -311 35 140 -86 75 -160 366 -141 33 112 -12 41 149
3848 149 50 -66 -165 141 -41 -13 -151 88 -134 -195 126 -49 -98 -18 -127 -64 -63 208 240 4 172 124 137 -8
3872 -8 17 87 139 206 -32 172 333 -173 59 -141 -353 -127 -70 -215 -148 -74 -161 -131 -43 -11 -55 -208 55 199 202
3897 202 187 42 -5 456 15 79 251 61 203 27 -4 145 -27 -28 -178 -41 -179 -140 -158 -148 19 -111 20
3920 20 121 59 232 96 8 179 177 96 120 234 -27 -3 149 -70 250 195 79 -127 4 -151 -178 -86 -225 -54
3944 -54 -109 75 -36 -110 -174 83 123 -215 -67 -159 191 177 47 -3 138 -121 60 -81 249 -107 -124 -79 248
3967 248 -114 -179 286 -121 -83 78 45 -177 -156 -52 -55 50 435 -13 162 92 195 -13 195 260 107 -100 -132
3990 -132 -133 167 76 106 57 -62 -182 -129 40 -227 -81 -179 -6 -217 31 -2 185 176 -80 -40 138 6 195 8
4014 8 140 -101 34 -49 204 -18 21 -264 -54 -95 10 2 -37 -120 -62 9 -31 -50 118 28 -92 -152 -64 -46 217 132
4040 132 28 30 192 -236 28 -65 -154 -173 211 192 -166 -267 63 -34 -278 -213 100 -89 -114 -362 142 -18 108
4063 108 -58 -80 115 122 64 60 -23 -51 83 -97 -163 69 100 3 -71 -125 -77 90 -94 65 32 -194 150 146 -245 -8
4089 -8 105 178 38 -114 -104 -159 271 84 35 126 -26 -192 -238 -174 29 -151 36 64 151 -23 -93 69 -1 142
4113 142 91 -65 -58 52 125 132 -53 175 -98 54 179 -31 129 -1 -158 93 -209 -232 68 -152 22 96 157
4136 157 67 12 199 27 30 215 -144 -31 195 112 147 120 10 5 108 212 -231 174 -299 -95 -111 178 46
4159 46 -153 -164 -174 -70 -147 -54 8 44 -66 -214 111 -32 -106 264 0 234 134 33 28 -19 -308 79 -84 -152
4183 -152 -130 113 -48 -31 3 -314 -37 107 -43 -204 89 -25 -119 -18 -43 -14 -42 211 95 -174 -87 40 -112
4206 -112 -23 182 -118 170 -148 62 154 -135 25 -25 -143 24 -108 78 58 147 132 -127 26 -123 230 -85
4228 -85 237 205 -21 -95 -106 -29 249 -14 -97 -152 88 31 76 171 -57 -92 -164 -137 -178 -48 144 -45 -140 -37 257
4253 257 153 -84 43 -21 -111 30 -13 -75 -26 -39 -118 -38 -25 13 -84 -93 -266 -70 82 -137 -182 69 48 -19 251
4278 251 86 -17 -51 159 197 -106 162 70 74 38 107 -173 190 281 -149 265 -2 -57 -45 42 283 -37 5 179
4302 179 19 -239 -33 -88 41 217 176 37 226 228 -142 115 -58 215 -61 -59 47 202 29 -301 -114 31
4324 31 -39 16 20 -92 263 -134 45 -38 -8 -2 106 72 98 114 139 246 102 -81 98 5 -59 285 54 160 -65
4349 -65 -131 -77 108 -184 -146 23 10 89 -56 180 -50 -60 41 117 35 -57 -52 -170 204 -87 105 1 -114 148
4373 148 -65 -70 -8 -260 39 69 -167 -38 88 -250 -140 -1 -181 121 -29 -99 5 146 17 114 97 -110
4395 -110 -25 -171 14 -83 81 110 -65 184 -93 111 23 27 -42 4 11 -105 194 -95 30 44 42 90 279 37 223
4420 223 11 -156 58 46 77 -124 4 71 -198 123 18 -301 68 4 -133 -100 61 -144 135 97 68 56 -59
4443 -59 -109 28 193 18 -8 246 -195 160 -51 105 -12 -1 49 70 191 167 -37 -8 19 -53 205 274 205 125
4467 125 -125 137 -34 -90 99 91 101 98 1 65 -133 17 146 -5 217 99 -138 -11 -87 10 -52 -138 -166 -230 17
4492 17 -232 19 -36 20 -39 61 -244 196 -75 -58 15 16 59 -174 -52 -45 32 -73 -119 -166 -298 3 -77 -145 73
4517 73 -72 -85 -83 204 -148 93 -2 -10 82 -355 49 96 -14 245 242 -131 28 -69 17 117 -37 180 44 -68
4541 -68 28 -15 132 -5 -156 65 -108 -84 -27 -142 71 -24 53 -85 -10 109 80 148 -215 139 0 -12 128 46
4565 46 94 276 -25 53 -114 -176 -127 -213 -161 39 123 -63 76 155 -25 44 139 -329 149 -105 70 -33 -144 -141
4589 -141 -157 -109 17 -110 75 50 -92 5 213 -225 -261 -65 -184 103 20 180 -196 -173 -64 22 -165 -68 -137
4612 -137 -238 -76 275 -69 158 -39 -285 131 161 162 -191 25 8 153 2 -57 -9 -83 106 -85 -69 -119 104
4635 104 -107 -136 -230 98 188 -11 104 245 126 51 160 -111 -125 11 -137 156 -12 -2 177 -3 -304 -73
4657 -73 -230 -87 88 -70 105 -135 -113 49 41 224 244 214 -153 127 289 280 180 -28 -101 -230 259 224 20
4680 20 -82 -48 64 -172 160 -209 -132 -288 148 23 111 -1 -80 -54 -33 -109 109 59 130 134 51 313 -76 -28 -340
4705 -340 -145 69 -25 -179 -43 -80 77 19 41 -167 -108 54 -29 -31 2 28 152 -57 -9 -92 6 247 89 -194
4729 -194 67 67 -97 148 -212 -10 43 -66 -264 -138 31 -176 -80 71 155 -151 -52 142 111 -100 -50 95 -198
4752 -198 59 136 0 -145 -294 189 -25 -30 115 53 -187 178 -158 -77 -78 97 74 153 -242 106 120 5 218
4775 218 -53 150 -20 108 77 59 3 -47 74 79 -80 -77 37 73 -83 30 -120 154 -230 -273 -72 -58 6 43
4799 43 128 -110 -178 53 -11 30 32 -58 -191 30 142 -30 88 -155 14 -132 83 -64 139 -67 6 81 -50
4822 -50 -33 -43 186 -13 -121 211 -186 -39 104 63 263 11 398 114 50 39 38 -21 -232 63 14 -236 -134
4845 -134 28 230 -65 -235 37 -266 58 209 -57 20 67 -92 -42 -148 -31 7 102 -8 268 28 -46 112
4867 112 -163 -133 -9 -193 -68 32 -1 75 -70 220 -185 -272 64 376 -191 -23 -35 -125 -19 -92 142 151 17
4890 17 -23 -27 142 -38 271 230 -63 -153 -111 -284 -129 -115 -120 10 -161 287 187 -50 46 -287 53 120 264 26
4914 26 230 171 -155 64 -36 132 62 -60 -80 42 39 170 199 183 21 -258 84 -314 126 138 -57 -49 -136 12
4938 12 52 64 -179 -38 -51 -42 -95 8 273 167 219 184 75 -44 -8 -47 -165 -189 -26 -97 59 -259 55 33 -206
4963 -206 -246 140 36 -15 83 231 -73 94 -5 80 -72 255 -36 94 -27 211 -126 93 -66 2 -65 183
4985 183 -52 27 -66 67 10 -136 224 72 95 118 -55 17 357 -66 232 -80 -169 -48 118 -21 73 171 133
5008 133 -29 154 -76 21 -1 77 -12 -318 81 -24 53 -65 105 -253 86 135 95 95 -123 -129 98 24 -108 31
5032 31 256 -22 89 140 -55 10 -1 -258 -59 133 46 239 -34 -169 230 -21 77 13 100 82 -228 145 158
5055 158 153 122 87 -74 301 122 -130 -226 48 -90 -134 -92 34 -16 201 -157 76 -11 -157 13 70 -138 -26
5078 -26 -149 253 -142 -87 58 221 26 212 -49 34 113 -22 6 -63 206 52 -32 -108 33 83 65 -98 -63 94
5102 94 44 -19 -4 41 86 -45 -89 -194 -99 15 -54 -96 -104 -83 -99 -10 -156 37 -169 -108 12 -202 65 158 -17 48
5128 48 36 -246 -62 -89 -11 311 -63 92 -238 160 12 -116 -12 -135 -159 -130 70 -133 48 -13 -31 -97 -55
5151 -55 -394 40 66 -29 -17 -98 -215 -205 130 210 45 82 144 38 200 78 71 1 -47 -44 132 16 276 45 27
5176 27 -63 -198 -148 8 -149 110 -146 86 113 -152 -120 -31 58 15 -70 106 -35 -37 -16 98 68 53 217 -64 -109
5201 -109 -177 154 -47 -184 35 -15 -62 -1 78 -251 -20 -64 -157 117 279 -64 60 235 85 -81 64 276
5223 276 -71 90 -11 -248 63 -5 -140 -78 264 -39 -22 -150 -45 39 -38 75 -90 -190 96 206 -180 125
5245 125 -131 45 -160 1 50 -72 43 99 127 119 13 171 54 -57 -83 31 -154 -48 -14 -124 -79 123 -73
5268 -73 67 -191 -140 -140 17 -149 -187 184 -123 -161 137 -108 -43 10 24 -127 39 95 -435 17 -237 88 -66
5291 -66 -199 -165 -231 167 -116 -122 72 99 59 -87 6 -60 186 39 169 405 91 273 81 -198 114 -6 123
5314 123 -26 -87 -87 12 -190 120 73 155 187 -16 -18 81 307 -30 61 94 -11 168 -75 170 114 85 -85 166 -107
5339 -107 130 -6 -6 -108 -39 -335 -81 62 -118 -42 180 -37 15 63 302 75 80 33 37 261 -223 89 187 -83
5363 -83 -86 107 -168 -144 33 260 -94 19 -9 -37 -14 1 75 -186 -43 -215 -172 199 162 167 16 29 39 131 286
5388 286 -94 -24 -198 -1 -33 -106 -12 -12 -94 -168 -2 52 -76 -112 250 -71 -137 61 87 -36 -35 31 230 160 -63
5413 -63 68 62 -17 -112 323 122 -193 -207 -155 40 -122 70 10 38 -178 -81 -244 -177 -154 -176 -41 -140 89 -76 -113
5438 -113 -168 209 74 -59 216 -91 17 42 -52 -237 -51 95 16 -180 -127 141 -11 61 35 -423 -59 -166
5460 -166 47 23 -60 -54 137 127 -93 28 81 -31 7 -21 279 -117 -186 -58 -117 -54 -11 -206 305 146 183 84 166
5485 166 -30 138 21 -109 -47 -41 166 -8 30 -71 -32 66 123 -283 -85 -2 -14 -156 -147 50 219 -203 -152 -208
5509 -208 -291 180 -105 -40 -140 -16 20 -99 -42 130 23 101 388 -125 -20 -51 145 212 133 -184 -53 -106 166
5532 166 30 1 -29 43 -66 -121 152 129 -9 27 107 301 -82 -43 118 45 -70 138 109 58 205 50 -63 -270
5556 -270 146 269 18 -120 -148 32 40 166 28 -391 51 -7 -47 -19 52 -70 2 -150 208 -112 -255 -92 50
5579 50 148 57 111 8 -12 -61 -17 41 -142 -96 -31 -229 27 177 13 -188 -9 -211 -63 79 -59 11 261 18
5603 18 -84 121 -38 13 -109 24 -64 -67 135 -91 -45 -71 71 -125 -111 -65 1 -181 -32 -88 98 131 174 84 -10
5628 -10 -51 -16 108 75 -8 145 -105 -38 201 -5 -94 220 52 201 -294 -20 5 35 237 -116 -96 -50 22 83
5652 83 -182 -70 -11 -4 22 10 109 323 105 -155 105 116 -230 -103 294 -150 -31 142 -246 -68 -3 -48 -57 112
5676 112 149 -289 -12 -10 -72 287 -94 -48 -486 -133 -8 71 -24 -26 -46 185 -255 -80 246 -64 41 -57 -139 52
5700 52 -82 94 160 -159 4 32 150 288 -7 332 375 98 -29 154 281 48 -84 -84 -84 -140 168 15 108
5723 108 -53 -83 52 165 78 -119 -50 26 227 -41 187 -142 -75 -74 31 104 155 98 -169 214 68 308 186
5746 186 -97 231 -17 21 9 -313 45 -87 -91 248 174 28 -154 14 67 145 -69 -199 154 247 61 -68 1
5769 1 -42 48 -92 -134 362 55 40 53 154 235 192 -168 -187 -171 -58 -19 53 227 91 -108 161 78 -50 222 32
5794 32 124 35 27 -22 46 244 -125 -45 3 -35 -8 -235 -153 -65 -303 153 -178 -122 -242 -115 52 62 76 -118 -265
5819 -265 142 109 60 -153 16 -18 -46 -82 -171 83 -188 46 209 -83 -41 166 -77 44 -83 -3 -8 184 -203
5842 -203 -138 -91 -62 -105 54 -41 -38 39 -220 13 -23 14 89 -6 -48 -233 -136 -8 128 66 -41 -5 -32 -41 186 -4
5868 -4 -5 -40 159 50 3 -138 -61 18 -6 149 31 -66 -128 83 67 74 -36 -46 -97 -162 -277 92 -42 -301 -98 51
5894 51 71 48 -38 -139 126 78 99 112 -43 12 161 69 180 104 -160 -157 103 12 66 366 -177 151 153 31 61 192
5920 192 115 67 168 49 -52 56 26 42 -128 -238 -91 -121 2 -32 172 8 -34 -165 -8 209 -98 -121 -31
5943 -31 8 76 -48 -344 -165 12 90 119 90 117 -21 -59 187 220 -119 -73 -9 116 9 -168 242 -35 -109 -71
5967 -71 4 80 -87 -78 16 158 17 15 -40 -91 -111 81 37 -60 59 1 165 37 193 131 181 -23 -123 -247 65
5992 65 111 38 -67 87 -8 -9 46 103 -11 -87 -147 212 38 -16 -113 201 -68 -46 138 62 141 -39 145 -44 83
6017 83 -15 76 -12 158 -34 139 104 -61 -83 -38 -72 183 -244 -107 17 131 29 -30 -69 172 215 111 -52 159
6041 159 162 -160 -41 -11 164 -236 -17 -24 -116 -39 71 96 248 -276 95 277 110 -156 22 1 -39 115 19 290
6065 290 -42 107 -40 -245 175 -11 24 -19 225 179 148 -80 -165 -173 177 -136 -235 -113 0 -110 137 64 -19
6088 -19 -24 289 -157 -45 49 -42 109 71 9 59 -4 -74 11 16 -274 26 -30 -145 -421 -49 -103 1 -99 -167 82
6113 82 80 -10 -13 -86 -36 8 -65 -173 20 -61 -147 186 129 130 120 -6 -215 -186 -179 -23 -170 -182 20 186 91 -137 -283
6140 -283 142 -158 240 64 -163 16 144 331 -222 218 -195 83 81 32 112 97 -57 368 -71 144 35 -1
6162 -1 -248 -29 59 -5 -41 -169 -48 46 73 -2 331 0 186 42 84 57 56 -181 93 146 34 -30 24 -33 133
6187 133 163 -63 -198 191 -155 -94 15 -253 -169 141 21 -121 68 77 198 -2 47 122 -203 -84 1 -71 115
6210 115 -46 72 -157 -41 74 131 187 195 -128 -82 205 -397 -63 -297 116 69 -149 134 24 37 110 182 -55
6233 -55 159 142 -78 -62 61 -66 52 -27 -141 266 25 93 65 -50 254 46 185 -19 144 230 130 139 20
6256 20 6 235 42 -184 76 164 -13 -51 86 -168 -11 -25 -36 85 -87 70 -182 -252 -100 13 -46 -128 66
6279 66 -238 158 126 -84 -30 195 -94 252 -71 -132 96 46 -36 87 -147 15 -88 184 -150 -135 119 -145
6301 -145 75 -156 -8 43 -107 69 -116 106 67 91 66 88 1 -98 110 103 140 -27 -115 -326 26 -26 -268 -40
6325 -40 152 -28 -76 60 -7 -162 14 -114 18 -109 306 -116 -49 17 92 -115 38 77 7 -26 231 -74 -137
6348 -137 110 23 185 -92 -98 -110 -213 -102 -27 -13 -74 79 -78 -252 -24 -175 26 -111 22 120 -67 -37 159
6371 159 -34 209 23 142 110 -27 87 139 87 24 -148 41 120 32 -92 9 184 236 -251 -94 246 42
6393 42 186 -12 164 -73 -33 192 53 -17 39 -43 -115 -21 -153 -74 91 230 -180 124 -94 3 -299 -173 -82
6416 -82 -69 32 -103 -42 -202 51 -111 20 11 52 -57 32 19 130 -145 -54 249 -15 75 114 -15 101 138 -144
6440 -144 65 52 -199 13 -2 51 -64 97 14 -160 102 -109 289 88 -87 -14 258 121 -212 -194 2 129
6462 129 117 -106 -15 -196 44 174 -120 184 -109 -89 -146 -24 78 -124 -144 -309 -219 107 -314 154 79 -106
6484 -106 247 9 -29 91 120 62 65 19 -183 363 215 -18 56 -14 155 100 142 79 230 -161 -109 71 -19 -53 -23
6509 -23 193 -49 -102 6 -150 66 -198 116 -45 -210 -113 233 188 -46 -74 -229 -102 -115 164 101 -54 -44 28
6532 28 336 -50 75 28 138 37 -230 -50 -68 57 -187 -26 18 -13 38 -33 -27 65 -111 -82 -156 -163 75 -74 133
6557 133 -172 296 46 -57 261 -136 58 82 305 235 -57 190 -192 27 74 -283 -71 -134 -4 -212 -29
6578 -29 -75 -15 -184 141 -88 159 -6 -19 0 55 150 -301 234 13 143 13 -127 42 1 -68 12 -42 169 -288
6602 -288 47 -95 69 -15 117 -38 -126 17 101 97 -30 -27 -52 170 221 -56 131 174 187 2 -38 10 18 -63 135
6627 135 -294 -99 -155 -13 -223 -163 225 -4 -106 -152 -132 35 -30 193 -22 84 67 60 -167 -78 157 -17 64
6650 64 -24 60 -56 -185 168 -65 -190 -193 -168 77 190 130 20 -74 -61 14 57 10 356 -145 156 233 33 -126
6674 -126 -215 151 136 175 36 196 34 -331 -153 21 -11 -41 -172 33 -10 -66 45 87 -6 -58 88 7 52 67
6698 67 -78 93 13 5 124 96 -213 188 -131 -66 -150 -223 126 90 -11 -19 -100 -164 139 -135 -208 -30 111 -271 160
6723 160 110 124 -69 -80 8 182 -148 -149 -67 100 -42 -125 -85 -154 20 -214 -137 -83 -43 34 -38 8 -184 40 -35 218
6749 218 162 129 172 213 142 14 -92 265 -180 88 -19 -39 -144 115 -106 -325 123 132 107 -78 -173 -54 -262
6772 -262 -73 140 135 -129 52 44 102 191 134 78 -44 78 42 -115 224 129 371 -29 -89 -91 4 -18 -38 -151 94
6797 94 60 -156 121 -56 -168 -205 66 188 394 -100 -19 -108 131 -115 105 -28 -188 -101 -87 164 53 -262
6819 -262 -31 134 -36 -173 -136 -84 -82 -103 215 40 -48 -47 146 27 45 -153 178 -9 1 -125 -217 147 -121 212
6843 212 -74 90 -143 258 -136 -2 -28 -267 96 -32 -65 -12 -26 131 -89 34 -109 235 195 111 71 14 88
6866 88 -299 -83 98 3 188 120 -124 179 -96 -113 91 -263 3 -142 41 113 107 -83 22 144 -83 -278
6888 -278 -94 26 132 54 -97 66 204 74 -239 56 110 125 -88 -256 -157 -2 225 35 -159 -10 -137
6909 -137 156 36 -50 273 124 -149 118 -91 0 -171 199 -72 -33 -10 113 372 46 69 -30 68 -64 -259
6931 -259 -192 73 -198 141 -153 111 -212 77 -103 -63 234 111 195 10 137 -78 -60 105 -117 218 209 -32
6953 -32 76 188 -242 153 28 -341 -200 -127 54 66 110 87 99 -153 207 16 92 112 -11 186 304 -66 -86
6976 -86 211 -105 -50 38 44 252 2 104 0 -210 185 -112 -26 3 -10 81 -140 50 78 -177 173 -75 -136 119
7000 119 100 17 41 48 -59 40 136 88 -207 188 114 -76 -66 -195 -121 37 -62 -23 29 224 -57 26 138 -141 -142 231
7026 231 179 152 -152 141 77 17 -70 43 -101 42 28 -1 -10 270 -143 -77 36 -93 91 152 158 -119 125 -48
7050 -48 -59 -189 57 284 255 167 99 -87 -103 -49 -32 67 -126 -163 -42 -151 -84 -145 -61 -115 -363 -1 132 -91 -141
7075 -141 -162 -68 49 33 120 41 88 -106 55 64 -19 -182 159 -48 330 -211 -88 -37 32 -80 -56 -113 -310 -117
7099 -117 101 -82 -25 67 42 77 -402 200 35 -58 -43 81 39 228 -162 100 49 -38 -20 -105 -23 57 -236 -62
7123 -62 -40 -156 -74 -187 46 11 157 -175 75 -136 91 83 25 71 -30 -105 -178 263 -133 -140 -78 -207 -49 -85 114
7148 114 -122 88 170 -151 -256 165 -30 61 234 -59 -181 80 253 207 4 13 44 189 115 142 105 52 41 -66
7172 -66 -79 -210 -31 -70 -84 -145 70 72 -7 -11 -97 42 54 -134 -140 39 25 73 -114 -126 -47 -50 -16 212 166 148 10 -112
7200 -112 -116 -138 -54 -272 41 -93 29 190 -150 -102 -9 -180 -115 16 169 35 66 -51 69 309 69 95 -181
7223 -181 -21 1 11 181 -141 -185 -188 -276 98 -29 -10 -141 22 -51 -41 245 -76 67 -70 223 -151 -49 -4
7246 -4 -213 159 9 -55 -14 125 45 187 174 -85 38 47 70 262 -23 -238 12 78 112 -152 217 114 -40 -148
7270 -148 181 -149 75 29 49 -146 -200 -210 131 -2 -227 37 116 -96 -238 115 -158 -156 92 -31 -119 -52 -154
7293 -154 -86 -50 -114 104 -78 -105 183 13 76 -102 -136 -118 -1 194 -41 -129 -36 153 -96 -167 -172 10 -104 11
7317 11 -247 -19 -311 -22 -152 257 244 208 131 78 -217 164 -90 -91 -136 5 -122 39 -110 -11 25 282 -63
7340 -63 33 -37 110 104 -306 4 127 -135 -136 -82 -198 147 90 -152 -37 -16 -112 14 -44 -13 -82 -82 60 -215 -118 -40
7366 -40 -51 -81 -109 -169 -178 32 -196 -1 -74 8 223 -29 306 24 -55 -8 139 -3 87 113 104 30 197 42 -52 -111
7392 -111 -76 -341 -26 -55 63 -142 -361 -93 -37 -140 198 2 16 -156 -79 222 32 53 -37 347 -136 -50 55
7415 55 136 41 46 61 -305 135 -50 141 -58 -151 80 -32 2 19 -24 95 136 143 147 -72 110 80 205 -4 -26 117
7441 117 -76 -143 -60 56 -61 222 -12 -53 -120 193 -61 18 -32 -8 145 92 111 116 203 188 78 -62 56 -10 -36
7466 -36 -115 144 46 52 41 -86 176 227 140 71 143 -166 273 0 -49 182 -172 -14 104 98 80 -48 -127 129 -27
7491 -27 -96 132 -81 39 42 68 151 -54 -103 -81 -44 -93 -69 -104 -30 -211 -70 198 -234 -84 -201 7 16 6 -92 -42
7517 -42 117 69 -172 122 -47 -55 -42 -208 -131 118 -180 -67 -147 8 -210 -92 -22 317 -61 -64 -71 114 2 8 24
7542 24 -130 5 191 -28 86 72 116 103 51 351 -3 -145 -63 17 -86 -85 -79 -246 124 93 -106 -18 -295 27
7566 27 -133 66 -218 8 -184 -16 -35 -377 192 136 341 12 119 286 -200 -46 259 -3 -74 -72 3 -31 29
7589 29 52 160 70 -10 104 -127 -65 -10 -162 262 -39 171 78 -64 -98 -125 49 -253 -85 -24 37 197 -119 15
7613 15 -80 -73 -109 19 -42 38 45 -134 -230 44 105 -126 285 -38 53 -93 156 136 259 218 45 38 51 295 -9 23
7639 23 -83 -34 11 -128 -49 -147 -61 -60 -127 55 308 65 22 -47 -97 11 100 186 81 125 -179 -17 -116 -120 -9 129
7665 129 50 -77 -89 -26 166 -172 140 -158 -139 221 -32 115 153 28 97 108 -129 -112 140 37 97 102 -84 -63
7689 -63 -119 148 177 1 -89 -167 -56 -14 67 119 61 26 45 -185 151 -48 87 -156 -86 260 41 46 8 -78 22
7714 22 -29 20 44 97 32 -102 -122 -144 -42 5 -87 -236 -115 177 337 -273 44 -44 -259 -6 129 -9 111 -62
7738 -62 116 151 29 140 -87 105 -149 -66 257 20 -28 -89 -205 -41 1 -179 -104 -10 151 -108 64 41 -131
7761 -131 121 46 86 19 170 -173 145 30 131 14 188 -77 -30 56 -135 -10 30 191 -32 -96 -37 -268 16
7784 16 63 -86 -44 -101 94 -87 -29 -56 -68 -41 -100 75 124 40 -70 21 -105 29 136 -111 -156 260 55 -125
7808 -125 -57 103 42 105 81 -138 8 -200 -211 408 46 19 14 97 0 106 -30 83 -32 162 -206 -12 194
7831 194 18 -207 -66 -139 -102 81 33 -10 -21 255 151 106 -271 -139 -86 144 -77 -186 85 87 -193 78 127
7854 127 -98 -163 11 -210 39 32 -235 216 -145 -45 71 148 60 -202 46 -92 34 213 88 28 50 174
7876 174 37 -27 -81 151 -53 -99 30 30 -82 -114 -150 -199 114 -342 -76 -130 -7 61 -130 -2 -129 21 -132
7899 -132 36 -46 -79 170 82 135 -27 18 184 -182 -94 160 47 138 13 33 -86 101 -67 21 80 -91 -235
7922 -235 197 -32 115 118 117 -83 97 69 117 105 -7 5 -150 -236 -118 -39 -110 215 -78 156 72 -200 183 77
7946 77 -54 -121 -126 -77 13 205 31 -172 -70 -105 36 -130 50 84 -70 -4 -126 16 -49 -162 203 49 -21 -71
7970 -71 90 -303 23 74 231 97 240 -13 150 -102 49 118 116 174 -97 11 -89 120 49 125 100 -94 94
7993 94 -9 -122 156 11 -57 203 -62 -44 246 7 29 -76 144 102 20 54 107 -33 -60 -203 16 140 -279
8016 -279 101 171 -121 -205 -128 6 -34 -209 168 -51 -144 -14 186 168 -197 75 205 54 -47 -120 -113 125 -236
8039 -236 16 167 147 114 307 4 57 -160 -167 92 235 -183 23 -104 92 37 -31 290 -246 85 -222 76
8061 76 -55 -119 19 27 122 -96 -84 139 105 -155 -97 -229 -1 -160 -218 -96 200 -13 -82 49 -193 152 212 -50
8085 -50 194 39 -2 -159 103 -168 164 63 86 -92 -46 112 -99 17 -12 -120 97 34 223 -69 24 -69 68
8108 68 136 15 -33 95 -82 -40 10 87 133 -5 -105 50 78 -81 108 69 -83 -47 -36 119 171 75 18 88 -122
8133 -122 -86 -42 113 -142 -80 18 -235 -104 -53 -110 -53 51 109 42 69 91 70 44 -140 -21 -122 -54 34 -38 80
8158 80 -40 -39 -23 -56 117 303 132 143 49 264 -79 -123 41 -40 -77 107 216 -82 227 103 -106 160 -8
8181 -8 55 -116 -156 20 -95 -173 157 2 16 -150
8191a50
##END NTUPLES=NMR FID
##END=
