##TITLE=1H_Ser 6-5-V-2
 CDCl3
 8 sc, 
 28.10.2021
##JCAMPDX= 6.0         $$ Bruker NMR JCAMP-DX V2.0
##DATA TYPE= NMR FID
##DATA CLASS= NTUPLES
##ORIGIN= UXNMR, Bruker Analytische Messtechnik GmbH
##OWNER= root
$$ XWIN-NMR		Version 3.5
$$ Thu Oct 28 10:02:05 2021 Russian Standard Time (UT+4h)  she@DPX200
##.OBSERVE FREQUENCY= 200.1313468511
##.OBSERVE NUCLEUS= ^1H
##.DELAY= (6, 6)
##.ACQUISITION MODE= SIMULTANEOUS
##.ACQUISITION SCHEME= undefined
##.AVERAGES= 8
##.DIGITISER RES= 18
##SPECTROMETER/DATA SYSTEM= spect
##.PULSE SEQUENCE= zg30
##.SOLVENT NAME= CDCl3
##.SHIFT REFERENCE= (INTERNAL, CDCl3, 0, 15.7039)
##AUDIT TRAIL= $$ (NUMBER, WHEN, WHO, WHERE, WHAT)
$$ ##TITLE= Audit trail, XWIN-NMR		Version 3.5
$$ ##JCAMPDX= 5.01
$$ ##ORIGIN= Bruker BioSpin GmbH
$$ ##OWNER= she
$$ F:/spectra/data/she/nmr/H-F/1/audita.txt
$$ ##AUDIT TRAIL=  $$ (NUMBER, WHEN, WHO, WHERE, WHAT)
(   1,<2021-10-28 10:00:56.68 +0400>,<she>,<DPX200>,
      <created by zg, POWCHK disabled, PULCHK disabled
       configuration hash MD5:
       00 E9 B6 7A A2 85 ED C7 34 08 36 98 17 FE 4E 26
       data hash MD5: 16K
       38 03 D3 CB 8E 56 44 70 AA 5D 6F B4 FF 5A 26 0D>)
$$ ##END=
$$ 
$$ hash MD5
$$ B7 66 A4 03 D6 8B 44 BD 62 D2 B3 7E 9A 0E 12 69
##$RELAX= 
##$RELAX= 
##$RELAX= 
##$RELAX= 
##$RELAX= 
##$RELAX= 
$$ Bruker specific parameters
$$ --------------------------
##$DU= <F:/spectra>
##$EXPNO= 1
##$NAME= <H-F>
##$PROCNO= 1
##$TYPE= <nmr>
##$USER= <she>
##$AMP= (0..31)
100 100 100 100 100 100 100 100 100 100 100 100 100 100 100 100 100 100 
100 100 100 100 100 100 100 100 100 100 100 100 100 100 
##$AQSEQ= 0
##$AQ_mod= 1
##$AUNM= <au_zg>
##$AUTOPOS= <>
##$BF1= 200.13
##$BF2= 200.13
##$BF3= 200.13
##$BF4= 200.13
##$BF5= 200.13
##$BF6= 200.13
##$BF7= 200.13
##$BF8= 200.13
##$BYTORDA= 1
##$CFDGTYP= 0
##$CFRGTYP= 5
##$CHEMSTR= <none>
##$CNST= (0..31)
1 1 145 1 1 1 1 1 1 1 1 1 1 1 1 1 1 1 1 1 1 1 1 1 1 1 1 1 1 1 1 1 
##$CPDPRG= <>
##$CPDPRG1= <>
##$CPDPRG2= <>
##$CPDPRG3= <>
##$CPDPRG4= <mlev>
##$CPDPRG5= <mlev>
##$CPDPRG6= <mlev>
##$CPDPRG7= <mlev>
##$CPDPRG8= <mlev>
##$CPDPRGB= <>
##$CPDPRGT= <>
##$D= (0..31)
0 1.2 0 0 0 0 0 0 0 0.06 0 0.03 0 0 0 0 0.0002 0 0 0 0 0 0 0 0 0 0 0 0 
0 0 0 
##$DATE= 1635400856
##$DBL= (0..7)
120 120 120 120 120 120 120 120 
##$DBP= (0..7)
150 150 150 150 150 150 150 150 
##$DBP07= 0
##$DBPNAM0= <>
##$DBPNAM1= <>
##$DBPNAM2= <>
##$DBPNAM3= <>
##$DBPNAM4= <>
##$DBPNAM5= <>
##$DBPNAM6= <>
##$DBPNAM7= <>
##$DBPOAL= (0..7)
0.5 0.5 0.5 0.5 0.5 0.5 0.5 0.5 
##$DBPOFFS= (0..7)
0 0 0 0 0 0 0 0 
##$DE= 6
##$DECBNUC= <off>
##$DECIM= 32
##$DECNUC= <off>
##$DECSTAT= 4
##$DIGMOD= 1
##$DIGTYP= 9
##$DL= (0..7)
0 120 120 120 120 120 120 120 
##$DP= (0..7)
150 150 150 150 150 150 150 150 
##$DP07= 0
##$DPNAME0= <>
##$DPNAME1= <>
##$DPNAME2= <>
##$DPNAME3= <>
##$DPNAME4= <>
##$DPNAME5= <>
##$DPNAME6= <>
##$DPNAME7= <>
##$DPOAL= (0..7)
0.5 0.5 0.5 0.5 0.5 0.5 0.5 0.5 
##$DPOFFS= (0..7)
0 0 0 0 0 0 0 0 
##$DQDMODE= 0
##$DR= 18
##$DS= 0
##$DSLIST= <SSSSSSSSSSSSSSS>
$$ [...]
##$SUBNAM2= <"">
##$SUBNAM3= <"">
##$SUBNAM4= <"">
##$SUBNAM5= <"">
##$SUBNAM6= <"">
##$SUBNAM7= <"">
##$SUBNAM8= <"">
##$SUBNAM9= <"">
##$SW= 18.0517286264689
##$SWIBOX= (0..15)
0 0 2 0 0 0 0 0 0 0 0 0 0 0 0 0 
##$SW_h= 3612.71676300578
##$TD= 16384
##$TD0= 1
##$TE= 0
##$TE2= 300
##$TE3= 300
##$TEG= 300
##$TL= (0..7)
0 120 120 120 120 120 120 120 
##$TP= (0..7)
150 150 150 150 150 150 150 150 
##$TP07= 0
##$TPNAME0= <>
##$TPNAME1= <>
##$TPNAME2= <>
##$TPNAME3= <>
##$TPNAME4= <>
##$TPNAME5= <>
##$TPNAME6= <>
##$TPNAME7= <>
##$TPOAL= (0..7)
0.5 0.5 0.5 0.5 0.5 0.5 0.5 0.5 
##$TPOFFS= (0..7)
0 0 0 0 0 0 0 0 
##$TUNHIN= 0
##$TUNHOUT= 0
##$TUNXOUT= 0
##$USERA1= <user>
##$USERA2= <user>
##$USERA3= <user>
##$USERA4= <user>
##$USERA5= <user>
##$V9= 5
##$VALIST= <valist>
##$VCLIST= <CCCCCCCCCCCCCCC>
##$VD= 0
##$VDLIST= <DDDDDDDDDDDDDDD>
##$VPLIST= <PPPPPPPPPPPPPPP>
##$VTLIST= <TTTTTTTTTTTTTTT>
##$WBST= 1024
##$WBSW= 4
##$XGAIN= (0..3)
0 0 0 0 
##$XL= 0
##$YL= 0
##$YMAX_a= 84900
##$YMIN_a= -147994
##$ZGOPTNS= <>
##$ZL1= 120
##$ZL2= 120
##$ZL3= 120
##$ZL4= 120
##$ABSF1= 10
##$ABSF2= 0
##$ABSG= 5
##$ABSL= 3
##$ALPHA= 0
##$AQORDER= 0
##$ASSFAC= 0
##$ASSFACI= 0
##$ASSFACX= 0
##$ASSWID= 0
##$AUNMP= <proc_1d>
##$AZFE= 0.1
##$AZFW= 0.1
##$BCFW= 1
##$BC_mod= 2
##$BYTORDP= 1
##$COROFFS= 0
##$CY= 11.3945322036743
##$DATMOD= 1
##$DC= 2
##$DFILT= <>
##$DTYPP= 0
##$F1P= 2.36226072786647
##$F2P= -0.459571619588291
##$FCOR= 0.5
##$FTSIZE= 0
##$FT_mod= 4
##$GAMMA= 1
##$GB= 0.15
##$INTBC= 1
##$INTSCL= 1
##$ISEN= 128
##$LB= 0.24
##$LEV0= 0
##$LPBIN= 0
##$MAXI= 10000
##$MC2= 0
##$MEAN= 0
##$ME_mod= 0
##$MI= 1.114404
##$NCOEF= 0
##$NC_proc= 0
##$NLEV= 6
##$NOISF1= 3.799351
##$NOISF2= 2.8
##$NSP= 1
##$NTH_PI= 0
##$NZP= 0
##$OFFSET= 15.70392
##$PC= 1
##$PHC0= -15155.26
##$PHC1= 12.40082
##$PH_mod= 1
##$PKNL= yes
##$PPARMOD= 0
##$PSCAL= 0
##$PSIGN= 0
##$REVERSE= no
##$SF= 200.130013532006
##$SI= 16384
##$SIGF1= 3
##$SIGF2= 2
##$SINO= 400
##$SIOLD= 16384
##$SREGLST= <1H.CDCl3>
##$SSB= 0
##$STSI= 0
##$STSR= 0
##$SW_p= 3612.71676300578
##$SYMM= 0
##$S_DEV= 0
##$TDeff= 0
##$TDoff= 0
##$TI= <>
##$TILT= no
##$TM1= 0
##$TM2= 0
##$TOPLEV= 0
##$USERP1= <user>
##$USERP2= <user>
##$USERP3= <user>
##$USERP4= <user>
##$USERP5= <user>
##$WDW= 1
##$XDIM= 8192
##$YMAX_p= 0
##$YMIN_p= 0
$$ End of Bruker specific parameters
$$ ---------------------------------
##NTUPLES= NMR FID
##VAR_NAME=  TIME,          FID/REAL,        FID/IMAG
##SYMBOL=    X,             R,               I
##VAR_TYPE=  INDEPENDENT,   DEPENDENT,       DEPENDENT
##VAR_FORM=  AFFN,          ASDF,            ASDF
##VAR_DIM=   8192,          8192,            8192
##UNITS=     SECONDS,       ARBITRARY UNITS, ARBITRARY UNITS
##FACTOR=    0.0002768,     1,               1
##FIRST=     0,             0,               0
##LAST=      2.2672688,     0,               0
##MIN=       0,             -147994,         0
##MAX=       2.2672688,     84900,           0
$$ Real data points
##PAGE= N=1
##DATA TABLE= (X++(R..R)), XYDATA
0@%%%%%%%%%%%%%Qj6J6j6J6k4L2l3M1m9N7p2Q8j00J14j34J52j71J95k24K55k87
$$ 0 0 0 0 0 0 0 0 0 0 0 0 0 0 8 -8 8 -8 8 -16 16 -17 24 -25 32 -40 48 -52 62 -72 80 -91 104 -120 135 -152
35a52L23l64M09m56N08n67O32p01P76q59R50j049J157j277J409j551J709j884
$$ -152 171 -193 216 -240 268 -299 333 -368 408 -451 499 -550 607 -670 739 -812 897 -987
53i87K076k291K534k811L125l489L913m417N030n791O768q070R908j2715J7596
$$ -987 1089 -1202 1332 -1479 1646 -1843 2070 -2347 2683 -3108 3660 -4410 5498 -7217 10379
68A0379k8501J00274k9660j14830J14683J7965n1545j39K5878q2595l1663P4841
$$ 10379 -18122 82152 52492 -62338 52345 70310 18765 18626 44504 -38091 -69754 5087
80E087L5682o0078K487L8733k7176m5972M2809M4170m0171m8973L1302L0817j6671
$$ 5087 40769 -19309 -16822 21911 -5265 -51237 -8428 35742 -4429 -53402 -22100 8717 -7954
93g954o786L1245J3096j8683m515K4568j865k9129k154K1594p707k9549j0058
$$ -7954 -14740 16505 29601 10918 6403 30971 29106 -23 -2177 19417 11710 -17839 -27897
106b7897P001p64J4619K2595k6016m9022J6767O3213J4332m5662k6266J8563J5896
$$ -27897 -20896 -21660 -7041 15554 -10462 -59484 -42717 20496 34828 -10834 -37100 -18537 -2641
119b641L603J0134n25j7495q057R489J1945J2142J2813q905k8837m508K5844J7213
$$ -2641 962 11096 10571 -6924 -14981 -5492 6453 18595 31408 22503 -6334 -10842 15002 32215
133C2215q034k6273k3788M944J9214J341j0637K015L585j1629L814K9176N61k7897
$$ 32215 24181 -2092 -25880 -20936 -1722 -381 -11018 -9003 -5418 -17047 -13233 15943 16504 -11393
147a1393K690K1540j1872k1447J4997K0133r772j910J4091j3176j2306L0473J9619
$$ -11393 -8703 12837 965 -20482 -5485 14648 4876 2966 17057 3881 -8425 22048 41667
160D1667l5792l1039J7280J3624k1172n471K2019N69k0839O57K1337J2424o2N52
$$ 41667 5875 -25164 -7884 5740 -15432 -20903 1116 1685 -19154 -18497 2840 15264 15202 15754
174A5754q906k0595N681L1347M695k7845j2423J5508O930q290P805J0729j8742
$$ 15754 6848 -13747 -8066 23281 27976 131 -12292 3216 10146 1856 9661 20390 1648
187A648k1023R099J3803p255p620P474j041j4476N153J9239K983o795m18j453
$$ 1648 -19375 -10276 3527 -3728 -11348 -3874 -4915 -19391 -14238 5001 7984 1189 771 -682
201f82p641L584J9977L613k2220r510J4051O526r394k707Q270m739j5372m97R809
$$ -682 -8323 -4739 15238 18851 -3369 -12879 1172 7698 -1696 -4403 3867 -872 -16244 -16741 -6932
216f932M235K925N03q964p883R424J7637j96j3831l795N117K086J338O612P131
$$ -6932 -2697 228 731 -8233 -16116 -6692 10945 10749 -3082 -6877 -1760 326 1664 8276 15407
231A5407m565j0091J835P830J260k597k088o149j0542k217J2048O025n624l979
$$ 15407 10842 751 2586 10416 11676 9079 6991 842 -9700 -11917 131 6156 532 -3447
245c447k474l141M707J1399J980j2825q765O845O236J14L397N179j463q040j427
$$ -3447 -5921 -9062 -4355 7044 9024 -3801 -12566 -5721 515 629 4026 9205 7742 -298 -1725
260a725R626N595l980o471p908n127M230J0108J652j0617n844N045P98j725M874
$$ -1725 7901 13496 9516 3045 -4863 -9990 -5760 4348 6000 -4617 -10461 -5416 -4618 -6343 -1469
275a469L010o792p628K341Q046L875K496K262m186m489K984P159L657m498o586
$$ -1469 1541 -5251 -12879 -10538 -2492 1383 3879 6141 1955 -2534 450 7609 11266 6768 182
290A82k912j697L662P808J471o966o586J608M342r54K04J909n514p460J557Q277
$$ 182 -2730 -4427 -765 7043 8514 1548 -5038 -3430 912 -42 162 2071 -3443 -10903 -9346 -1069
306a069O352k1k747l583j982M819O757j77n428n052p39K257J888M044K714m982
$$ -1069 5283 5262 2515 -1068 -3050 1769 8526 8349 2921 -2131 -2870 -613 1275 5319 8033 3051
322C051o908r94M833L121k189k359m006n411K997Q599L669k243l947k375JL071
$$ 3051 -3857 -4851 -18 3103 914 -1445 -5451 -10862 -7865 734 4403 2160 -1787 -4162 -4161 -1090
338a090N342L06o394m042N01L817M677K189j02l776n486Q4N207K738k099n310
$$ -1090 4252 4558 -1836 -5878 -5377 -1560 3117 5306 5204 1428 -4058 -3974 1233 3971 1872 -3438
354c438l549J46L270P206K577m032l042n83J004K510K823k52m910m876J535M606
$$ -3438 -6987 -6841 -3571 3635 6212 2180 -862 -1445 -441 2069 4892 4640 -270 -5146 -3611 995
370I95L967K075l201m341k255Q34M281K297l632n076l280J387M267L924J758l790
$$ 995 4962 7037 3836 -505 -2760 -1926 2355 4652 1020 -4056 -7336 -5949 -1682 2242 4000 210
386B10m203Q13L389K763K443j547l635k614J158N263K649q52l635m589j124K614
$$ 210 -3993 -3180 209 2972 5415 3868 233 -2381 -1223 4040 6689 5837 2202 -2387 -3511 -897
402h97K469J119k247m008j410J397L725L542o19m000m869p94M911M422J374j521
$$ -897 1572 2691 444 -3564 -4974 -3577 148 3690 3071 -929 -5798 -6592 -1681 2741 4115 2594
418B594l746r52L983N448K818l318o420m664k62L488K666j872m226l328M58N699
$$ 2594 -1152 -2104 1879 7327 10145 6827 407 -4257 -4519 -1031 1635 -237 -4463 -7791 -7333 -1634
434a634L914J06k747m377k781Q66L180J962k254k462O20J345M123N238J549j407
$$ -1634 2280 2386 -361 -4738 -7519 -6653 -3473 -1511 -3765 -6227 -5607 -4262 -139 5099 6648 5241
450E241k169r59m05N40K594N8m626k957L26K496M155K108j800n003m088J791L670
$$ 5241 3072 2113 1708 2248 4842 4900 274 -2683 -2357 139 4294 6402 4602 -401 -4489 -2698 972
467I72J420j050m562m375R14O224O765O95m123k095m3L325O065J777m487o370
$$ 972 2392 1342 -3220 -7595 -6681 -457 6308 7003 2880 785 742 4067 10132 11909 7422 1052
483A052k357K239K830P03k233o825l668K402L182J632r51k229j715p66K030K816
$$ 1052 -1305 934 3764 4467 2234 -4591 -8259 -5857 -2675 -1043 -1994 -4223 -5938 -6704 -4674 -1858
499a858M19j71j716j849J229L660L456K794o79k517r78R42J463O11j447m409o222
$$ -1858 -1439 -1610 -3326 -5175 -3946 -286 3170 5964 5285 2768 1790 2732 4195 4806 3359 -1050 -7272
516g272j015M109L060J578o98l373j806L826N612J033l861m031l870n45N979N486
$$ -7272 -8287 -4178 -1118 460 -238 -3611 -5417 -1591 4021 5054 1193 -2838 -6708 -7253 -1274 4212
532D212j533l844r12K997L325L390J662m944o053q71J303J048J837o54l190l509
$$ 4212 2679 -1165 -2077 920 4245 7635 9297 4353 -1700 -2571 -1268 -220 1617 963 -2227 -5736
548e736K045N604J965j363j846k952j878J587L304J256k159j293n79L64L638M769
$$ -5736 -3691 1913 3878 2515 669 -2283 -4161 -2574 730 1986 -173 -1466 -2045 -1681 1957 6726
564F726L55k648l275o56J863J771J087j900m642k997L77L276K789j516l061j362
$$ 6726 7081 4433 1158 502 2365 4136 5223 3323 -1319 -4316 -3939 -663 2126 610 -2451 -3813
580c813m23K535L935J458j699l244o09L65J708L391N66n223l700J263K953K690
$$ -3813 -4236 -1701 2234 3692 1993 -1251 -1860 -1495 213 3604 4170 -1053 -4753 -3490 -537 2153
596B153P65k090m387k970K383K558M66p14l200l079J331N643M545J235k700k353
$$ 2153 2918 828 -3559 -6529 -4146 -1588 -1122 -1836 -5036 -8115 -6784 -1141 3404 4639 1939 -414
612d14m41L080L661n11l213l875k574K164L806J606j157l129j141Q38J373J574
$$ -414 -855 2225 5886 5375 2162 -1713 -4287 -2123 1683 3289 2132 -997 -2138 -1300 73 1647
628A647l26k339j992r26R88K703K549J613j669j891O97K223J814N09j913k157
$$ 1647 1321 -1018 -3010 -3936 -2948 -245 2304 3917 2248 357 1054 3277 5091 5600 3687 1530
644A530k474o56K752K297l39k776l844j177K487L332J000l963m478m27K528M155
$$ 1530 -944 -1600 1152 3449 3110 334 -3510 -4687 -2200 1132 2132 -1831 -6309 -6736 -4208 -53
660e3K574j723k557k608J734N252K733j255l111k401Q99K998K404M93l460l273
$$ -53 2521 798 -1759 -4367 -2633 2619 5352 4097 986 -1415 -516 2482 4886 5379 1919 -1354
676a354n54O05J182Q23j619l150j892J115K955J106J47q2j084j73Q08J178K290
$$ -1354 -1908 -1303 -121 702 -917 -4067 -5959 -4844 -1889 -783 -636 -718 -1802 -1975 -1167 11 2301
693B301O27j334j415m06K060K979J052j693l680k181J065J424R38p13l524k930
$$ 2301 2928 1594 179 -227 1833 4812 5864 4171 491 -1690 -625 799 1737 1024 -2500 -5430
709e430J96L349L159j85k458k200p18K745L378J269j561l001o20K373L041K106
$$ -5430 -5234 -1885 1274 1089 -1369 -3569 -4287 -1542 1836 3105 1544 -1457 -2077 296 3337 5443
725E443n24l659k130L64K284R87j361j677j730j067R17K252Q41p61k143j498K33
$$ 5443 4919 1260 -870 -506 1778 2765 1404 -273 -2003 -3070 -2153 99 940 179 -1964 -3462 -3229
742c229J460K642qj067j201j73K016K629M36m59j307k262p44J827J947p58k460
$$ -3229 -1769 873 865 -202 -1403 -1576 440 3069 3505 3046 1739 -523 -1267 560 2507 1749 -711
759g11j419o79J90L064J346j477k947j127R22J953J988Q37k209k232J505K653
$$ -711 -2130 -2809 -2619 445 1791 314 -2633 -3760 -2838 -885 1103 1940 -269 -2501 -996 1657
775A657J829P27j371k005j631L14K267P03j164k082k003l9K263J664l0j955k345
$$ 1657 3486 4213 2842 837 -794 -480 1787 2490 1326 -756 -2759 -2798 -535 1129 1099 -856 -3201
792c201P3J247K004J156n28r40q10Q11K659J666l13j800j819n29P84J402P67k068
$$ -3201 -3128 -1881 123 1279 751 -189 -999 -188 2471 4137 3824 2024 205 -324 460 1862 2629 561
810E61k191n27J81J200J184m58j916k049J29J896J082P53k34j300l50J254K256
$$ 561 -1630 -2157 -1976 -776 408 -50 -1966 -4015 -3886 -1990 -908 -155 -389 -1689 -2039 -785 1471
827A471J889l23j765j723k96J997J379k49j334k412o67J244J360L97j205j932
$$ 1471 3360 3037 1272 -451 -747 1250 2629 2380 1046 -1366 -2033 -789 571 968 -237 -2169
843b169j208l22J935K115o02j469n65K15J677K400Q55o45j733k00J445J287J163
$$ -2169 -3377 -3699 -1764 351 -251 -1720 -2285 -2070 -393 2007 2862 2217 484 284 1729 3016 4179
860D179l48j751j556j97J289O02o17j327j894j356O98J722P34l78j709m49M77
$$ 4179 3831 2080 524 327 1616 2218 1601 274 -1620 -2976 -2278 -556 178 -200 -1909 -2358 -1881
877a881J062J852K19j570j015Q5J539J669J016O9j450j538O95J170L95q02j986
$$ -1881 -819 1033 1252 -318 -1333 -1248 291 1960 2976 3045 1595 57 752 1922 2317 1515 -471
894d71j783l27L05J473K46q21j312n63J306J536O79j25j504j137N53J521J526
$$ -471 -2254 -2581 -2276 -803 -557 -1378 -2690 -3253 -1947 -411 268 143 -1361 -2498 -1945 -424 1102
911A102N27o86m06n45N89K198L71j449j544j548Q9J010P58M2j570j796M58J295
$$ 1102 1629 943 537 -8 581 2779 3150 1701 157 -1391 -1302 -292 466 508 -1062 -2858 -2400 -1105
929a105J126O49l84j299r26Q02K032J021k94j152q69K08J135J539k4j254j311
$$ -1105 21 670 286 -1013 -1939 -1137 895 1916 1622 470 -399 -191 944 2483 2459 1205 -106
946a06k92M85J161M25q37j180j189l36J846P43l55n38o46k27N86K006J578j279
$$ -106 -398 87 1248 1673 836 -344 -1533 -1869 -23 720 365 -173 -819 -1046 -460 1546 3124 1845
964A845j752p8p4R19J023J1j796j858N59J618M42P15p42j737r21L84J557L72j395
$$ 1845 93 15 -59 860 1883 1894 98 -1760 -1201 417 859 1574 832 -905 -1826 -1442 115 487 -908
983i08r66n10K02J476J451N03p84r91J97Q57N39L87j86j854j116K74J214Q03l36
$$ -908 -1874 -2384 -2182 -706 745 1248 464 -527 -330 527 1066 1453 1267 -587 -1703 -1429 -215 588 252
1002B52m63r80q53N20J625O73j307k017J15N99J143J585M98j366p40O84J403J369
$$ 252 -211 -1191 -2044 -1524 101 774 -533 -2550 -2435 -1836 -693 892 1390 24 -716 -32 1371 2740
1020B740L3m26j748j015Q68J924L5j537j284o17k8P83J067p38j216o86M2P44J046
$$ 2740 2773 2347 599 -416 452 2376 2411 874 -410 -1027 -1055 -272 795 57 -1159 -1845 -1803 -1059 -13
1039a3O40l65p43n60P20J074J220J16n29n05n30M02J419L99r15j921r51L13K23
$$ -13 627 262 -481 -1041 -321 753 1973 2089 1560 1055 525 927 2346 2745 1830 -91 -1042 -729 -506
1058e06P82n5j381j862K21J160J509K23n73r35j306R78K614Q26j353j146J69O29
$$ -506 276 221 -1160 -3022 -2801 -1641 -132 91 -482 -1417 -2723 -1745 869 1695 342 -804 -635 -6
1076fJ111J267J95j614j649O25O71M24m00p36j022j305P28J159L52k69q72l01
$$ -6 1105 2372 2567 953 -696 -71 600 1024 624 -112 -1134 -2439 -1711 -552 -200 -469 -1341 -1642
1094a642j23L32J316J002p82p39K47M45O88J124P23q81j671O1J162M76N2l04j739
$$ -1642 -1765 -1433 -117 885 103 -636 -389 56 744 1868 2591 1710 39 100 1262 1738 1790 1486 -253
1113b53j589M87J997N46j465r24p59m0J222J422K37j250r74M72J064J143O80n62
$$ -253 -1842 -1355 642 1188 -277 -1201 -1960 -2000 -778 644 881 -369 -1343 -871 193 1336 2016 1454
1131A454j493m71N76J553K26r04p58q37k92Q11Q08J73j030j195l01O56K91Q15
$$ 1454 -39 -510 66 1619 1845 941 183 -654 -946 -135 673 846 -184 -1379 -1680 -1024 -733 82
1149H2K33o98q29P7J301Q07K63j22j192q10O05J545P23r76j548k9l65N31J255
$$ 82 315 -383 -1212 -1135 166 973 1236 1114 -78 -888 -283 1262 1985 1009 -539 -568 -933 -402 853
1168H53K84j601j259j42O04J173N25p5j133j093R94J846O84l37p42o43k58R29
$$ 853 1137 -464 -1723 -1865 -1261 -88 437 362 -771 -1864 -870 976 1660 1323 581 -62 -320 609
1186F09J114K90j010j558r1N54L34M66K1j578j201J14J171P27o8k57q68l79Q93
$$ 609 1723 2013 1003 -555 -646 -92 242 708 729 -849 -2050 -1936 -765 -38 -106 -363 -1231 -1610 -717
1205g17J884K51o68n30k21K34N14J286J2j162j029m1J41P38L06p84j352j017K94
$$ -717 1167 1418 750 220 -1 233 747 2033 2045 883 -146 -187 -46 692 998 214 -1138 -2155 -1861
1224a861J124L53No36p94J05O72J422P27m61r82j73O86J091O82J26r01j451M7
$$ -1861 -737 -384 -379 -1015 -1809 -1704 -1032 390 1117 656 -326 -499 187 1278 1960 2086 1185 -266 -219
1243b19J227N86k58j025j067q44J69J550K99j080q74l03Q9R26J155K64p47r28
$$ -219 1008 1594 1336 311 -756 -1600 -1431 119 418 -662 -1536 -1839 -1750 -824 331 595 -152 -1080
1261a080M58R20P71Q21k81r81l36M15Q41M93q09m35j000m10M25M92M26p98j120
$$ -1080 -622 298 1069 1890 1609 628 292 707 1548 2041 1232 797 -203 -613 -188 304 730 -68 -1188
1280a188p4k0L90Q79k0p41p78J0J379P47M68q2j008m34P93J036M00o78q60l74
$$ -1188 -1262 -1282 -892 -13 -33 -774 -1552 -1542 -163 584 1052 970 -38 -472 321 1357 1757 1079 219 -155
1300a55m55N83J077n00j071q64n46R68L58M43j50j093l00N21R52O52k79j52l76
$$ -155 -610 -27 1050 550 -521 -1385 -1931 -963 -605 -162 -312 -1405 -1705 -1184 -232 420 141 -11 -387
1319c87r0N27J178K71n62p49o88O94N17J11K16j268o20p6O35O10m3m14o77m21
$$ -387 -477 50 1228 1499 937 188 -500 194 711 822 1038 -230 -850 -926 -291 319 276 -138 -815 -1236
1339a236P39J231L4k06m19n28M13N55P07M7o90n31j97M03P17K48n67q71q03N09
$$ -1236 -497 734 768 562 143 -385 28 583 1290 1337 647 116 -81 322 1039 1287 720 -151 -954 -445
1359d45N43K48l12m57o73k20P89J052J32o53n03j10M25P84M99j67r05o98K94O39
$$ -445 98 346 34 -423 -1096 -1316 -527 525 657 4 -499 -609 -184 600 1099 932 27 -671 -377 262
1379B62M26J74q46r30M6P4Q03K48n72n59o10J90O74P85L6k27q76K67Q87P04K37
$$ 262 688 862 16 -914 -868 -794 9 257 -315 -874 -1484 -1294 -620 165 201 -26 -902 -635 252 956 1193
1400A193n26k16l48J01O42J76k61l25j073m7M59K67K58q94n20j47J40P54M13j06
$$ 1193 667 451 103 204 846 1022 761 436 -637 -684 -225 42 300 -594 -1114 -1261 -1121 -367 46 -60
1420f0m94m00Q0J081N61K24k19m62k11M83P61J32k45q77k02j86N39N50m18p33
$$ -60 -554 -954 -874 207 768 992 773 311 100 583 1344 1476 1231 354 152 -34 505 1055 637 -96
1440i6p69jN37K82j1j49o58l15N93O00M39l22k18L7j54O43Q16R1l29p09l97N56
$$ -96 -865 -866 -329 -47 -58 -207 -865 -1180 -587 13 452 130 -88 -51 -205 438 1254 1345 1016 307 -90 466
1462D66K89K23m99n84p46l7K53P89m21n35n65l10O78M70K91l25k57k57N60M78
$$ 466 755 978 479 -105 -851 -888 -635 154 -267 -802 -1367 -1677 -999 -529 -238 -563 -820 -1077 -517 -39
1482c9O28K22o41l49K95L13N92K07m88m60n88J63N54j1j52o25l69j7P7P61P7m97
$$ -39 589 811 170 -179 116 429 1021 1228 740 280 -308 -145 409 398 246 -379 -748 -765 -688 73 150 -347
1504c47n76q7N68R69K43k36l69m44M24R66P9j23m02o59J40L9R59n00p23k51m47
$$ -347 -923 -1010 -442 527 770 534 165 -279 145 1111 1190 1067 665 6 146 185 1144 644 -79 -330 -777
1525g77N7O86K97l39m45m42M61L73L53Nk59l18lK96N47K56j67l00m20L6M58J64
$$ -777 -720 -34 263 -76 -521 -963 -502 -129 224 229 -30 -348 -351 -55 492 748 581 281 -139 -103 355 519
1547E19L8n52o73K46J6M70Lk34l28n93K39Q57J74K29l09m96J4N17O06J13m40p42
$$ 519 557 5 -668 -422 -406 64 67 -167 -495 -1088 -849 8 182 411 102 -394 -380 137 743 856 416 -326
1569c26l9N46J60L87j31q94o25K98O91J15j38o00n07J43L27M36L36j08m89J60
$$ -326 -365 181 341 728 597 -297 -922 -624 67 182 44 -556 -1063 -920 -593 -157 179 71 -418 -258
1589b58J56M42N50q5k71n66J96M81J20J14j01q45l71J38J45M51m25k84m82l12
$$ -258 -102 340 890 805 534 -32 164 645 765 879 778 -67 -438 -300 -155 296 -129 -413 -895 -1207
1609a207N38P80k86lm26l5N52N04N74N2n79j66j11P41J80k0n79l81n66K45M93
$$ -1207 -669 111 -175 -178 -604 -639 -87 417 991 1043 464 298 187 928 1108 1088 509 128 -438 -193 300
1630C00j19m06p55j48m1M33O42k59n35k19L7O40L74N14l0k64j89M05P34Q3J34
$$ 300 181 -225 -980 -1128 -1169 -736 -94 -353 -888 -1107 -1070 -430 -56 458 428 164 -25 380 1114 1197 1331
1651A331o00k74l35K61M39k83m90o48k84N13R7M7p1q01k66K23P06L35K44l15N
$$ 1331 731 457 122 383 822 539 49 -599 -883 -370 -273 -226 -297 -1098 -1364 -1141 -435 -100 144 -171 -166
1672a66k6N47O69L46l70m95m4M0L22J77P9q56p98J81K6N10k18l60l44m23kQ23
$$ -166 -192 355 1024 1370 1000 505 461 501 823 1000 1079 223 -575 -394 -368 142 -76 -436 -780 -1203 -1205 -382
1694c82M27k19l40j91J23L43Q49J84o66q9k5K96N82L2k29o24n06J71N40l8l92
$$ -382 45 -174 -514 -705 -582 -239 610 794 128 39 14 310 892 924 695 71 -435 -264 276 238 -154
1715a54k97l17k65J92O66J24j87l76k84M04N70L61L2m39NM0L35L80K47m04k24
$$ -154 -451 -768 -1033 -841 -175 -51 -238 -614 -898 -494 76 437 469 30 35 75 410 790 1037 633 409
1736D09k57j20M30L10m88l80n06j40O49J09K33n98k75j67N42M37L65k84k33l93
$$ 409 152 32 462 772 284 -96 -602 -742 -93 16 249 -349 -624 -791 -249 188 553 269 36 -357
1756c57J80N58L13%n85j90k89L77M43n1l14o08m32J11L70M35k47l06l91L92L95
$$ -357 -177 381 694 694 109 -81 -370 7 450 399 85 -523 -955 -844 -474 -39 -286 -592 -983 -591 -196
1777a96L88K20k80l37pL75M04L32j25n55p8k36L45J94K04p42n07l09K86L34r8
$$ -196 192 412 132 -205 -212 163 567 899 774 219 141 -95 250 444 648 -94 -601 -910 -624 -290 -388
1798c88kl98l03M42M29L18J28j56j78k03M96O38n4nl27l55P9L95Mn7m91o22K07
$$ -388 -390 -788 -1091 -649 -220 98 226 70 -108 -311 185 823 769 764 437 82 161 556 560 503 12 -610 -403
1821d03j47M31j38k38k76l88L31N02L42K8j64m05M97L70N41K71l78l22l9K90K34
$$ -403 -550 -119 -257 -495 -771 -1159 -828 -326 16 44 -120 -525 -28 342 883 1154 776 454 415 705 939
1842I39J08j75n70m15m6M50pj89j72o76j6J63K32J95k84q5k93K63N57M09l8r9
$$ 939 1047 872 302 -113 -159 291 284 95 -77 -753 -769 -606 -374 -179 -463 -548 -841 -578 -21 388 350 251
1864B51n97K21L09M10N3j44k48k22n7L36R6n69k77l18p9K64J39K2l36K2j86M08
$$ 251 -346 -125 184 594 647 503 255 33 -24 312 408 -161 -438 -756 -835 -571 -432 -410 -746 -724 -910 -502
1886e02K28M53R1k89k06L52L76M74j43k96k84k30K78M76n1k32o35k33J65K35J86
$$ -502 -274 179 270 -19 -225 127 503 977 834 538 254 24 302 778 727 495 -140 -373 -208 27 213
1907B13l73j53k42L1L29K06K35j37k69j23L37J68L95j40k72Ko7J70K60n3l08m17
$$ 213 -160 -313 -555 -524 -195 11 246 109 -160 -283 54 222 617 477 205 207 140 310 570 517 209 -208
1929b08j65J40L34j26n3l77l26K21L97M78q4l54j20p0L43K97K56m16j70k9L27
$$ -208 -373 -233 101 -25 -78 -455 -781 -560 -163 315 231 -123 -243 -313 30 327 583 167 -3 -32 295
1950B95m6J68K08n19k61j75J88K77n0l23j40l00N0M89J25L8j32m45K67M03L33
$$ 295 249 417 625 106 -155 -330 -142 135 85 -238 -378 -678 -628 -139 -14 24 -108 -553 -286 117 450
1971D50J13m12k20J64m0L87M5l33k94l08J20L46M4l0l62l40J72K12M6L99m36j59
$$ 450 563 151 -69 95 55 442 487 154 -140 -448 -328 18 62 32 -330 -670 -498 -286 -240 159 -277 -436
1993d36K11lL89K89P0m5k76J56K95QJ59n29j64j41Q4J95J52n40j2l20l2K53J11
$$ -436 -225 -228 161 450 520 475 199 355 650 658 817 288 124 -17 67 262 414 -126 -138 -458 -490 -237 -126
2016a26m5k32m00J45J66N14L02k58j88J2K52N50M6r8k23j79L9J77q1O4l72m05
$$ -126 -171 -403 -803 -658 -492 22 324 66 -122 -110 142 692 738 640 417 238 277 454 373 437 65 -340
2038c40j20J68N8N2k37j92j01J3L16K28m7R1k12J49O5K70L85l16J29l97K52K32
$$ -340 -460 -292 -234 -182 -419 -611 -712 -699 -383 -155 -202 -111 -323 -174 -109 161 546 230 359 -38 214 446
2060D46L29j87m12q4j70J66j7N4j84l42l09K05L43M8K4k06j0l8J46L80R3k13k33
$$ 446 775 588 176 92 -78 88 71 125 -59 -401 -710 -505 -162 -114 -90 -296 -306 -344 -198 182 275 62 -171
2083a71J76J40J23K82J08l91j15q7J33L15l01k02j27o10L26L14r3m7j10j30q5
$$ -171 5 145 268 550 658 267 152 65 198 513 212 10 -117 -727 -401 -87 -180 -227 -337 -467 -552
2104e52N11l6L7j71N2p4L57J12J20p7n4j94K09L48p7j52n12q1J7J99p0J46k14
$$ -552 -41 -77 -40 -211 -159 -233 124 236 356 279 225 31 240 588 511 359 -153 -234 -217 -18 -88 58 -156
2127a56j08p2P5K38J30j36j07J21J7J48J4K23k38k58j48L34M31k31N3l73mj35
$$ -156 -264 -336 -261 -23 107 -29 -136 -15 2 150 164 387 149 -109 -257 77 508 277 330 -43 -47 -182
2149a82M80r6j4m49j69N4J81L24J3k40L9j21J44L02J80j98k61j39J5K46K36On05
$$ -182 298 202 188 -261 -430 -376 -195 129 142 -98 -59 -180 -36 266 446 248 -13 -152 -137 109 345 351 -154
2172a54o7M7J11J20pk66m0j41l1L72J52j18k8j94q7L78R4J84n4j08j41J0K37J56
$$ -154 -221 -174 -63 57 50 -216 -256 -397 -428 -56 96 -22 -50 -244 -331 47 141 325 271 163 22 32 269 425
2196D25j84o5m00q0M73j90J47m35j77j30P3K32J04jj85n0m8N08K46j91K1NQ5O0
$$ 425 241 176 -224 -304 169 -21 126 -309 -486 -616 -543 -311 -207 -208 -393 -443 -491 17 263 72 93 98 183 243
2220B43L11j0p0j79k9j46M0N4o3k41k42j15K58J48j23K9l01O4J52K20OK36k30
$$ 243 554 544 474 295 266 120 160 214 151 -90 -332 -447 -189 -41 -164 -135 -436 -372 -220 0 6 242 12
2243A2N3J13m1N33k12p6j48k7K63j64J08m88J5j69j80J83J54j64l38L1L8M1K08
$$ 12 65 178 137 670 458 382 234 207 470 306 414 -74 -59 -228 -408 -225 -71 -235 -573 -542 -504 -463 -255
2266b55K91j94j12j80K22K00L87J33j63m00K17K77J92n6l33l33M2J24R4J15k32
$$ -255 36 -158 -270 -450 -228 -28 359 492 329 -71 146 423 615 559 226 -107 -65 59 153 268 36
2287C6n61n1L23K5K48J7j91l06N5K56J08K16j6N1m3K6M9L13j05j60j25k31K83
$$ 36 -525 -576 -253 -228 20 37 -154 -460 -405 -149 -41 175 159 210 167 193 242 555 450 290 165 -66 217
2310B17L1j0j40k22j30J6qK20j01q2k57J15J31L59j37j09jK9R5L32J52j78j40
$$ 217 248 238 98 -124 -254 -238 -246 -26 -127 -209 -466 -351 -220 139 2 -107 -108 -79 16 348 500 322 182
2333A82k41j02L36L2J93k98l80J72l3K38j28j73j85P8j03M56J8m1j50K83j98K2
$$ 182 -59 -161 175 207 400 102 -278 -106 -139 99 -29 -202 -387 -309 -412 44 62 21 -129 154 -44 -22
2355b2L13K1M5j12l26J35Q7Q2J31m03k84Q2P1l0Q8j24p1j85J85K93qJ1l9J44l29
$$ -22 291 312 357 245 -81 54 141 223 354 -49 -333 -251 -180 -210 -122 -246 -317 -502 -317 -24 -32 -21 -60 84 -245
2380b45L90K52Jr2k40j09J58J66j07J47k29l21P7K07P6Q9m31l52J42J46P2R9O1
$$ -245 145 397 398 306 66 -43 115 281 174 321 92 -229 -152 55 131 220 -211 -563 -421 -275 -203 -104 -43
2403d3oj79L31K0L38q6J97k93J8J68j64L52k73m30j06Q3K73k92o8k59j28J43n7
$$ -43 -49 -228 103 123 461 375 572 279 297 465 301 653 380 -50 -156 -73 200 -92 -160 -419 -547 -404 -461
2426d61L17j83r4j41L60j51M14R0P4p5l50M04K13O4J53l31k18J95k97J59K06m09
$$ -461 -144 -327 -421 -562 -202 -353 61 151 225 150 -200 204 417 481 634 303 85 280 -17 142 348 -61
2448f1k35j01j2M9K78j88O9j19j10J64K63J64j93m0J72l10N56K31j18j95l9j4
$$ -61 -296 -397 -409 -360 -82 -270 -201 -320 -430 -266 -3 161 -32 -72 100 -210 346 577 459 264 225 211
2470B11k7K94k44j91j84k7mj46N37n64j00j25K95K03j9N5p0J34k37M99j27J51
$$ 211 184 478 234 43 -141 -168 -172 -318 219 -345 -445 -570 -275 -72 -91 -36 -106 28 -209 290 163 314
2492C14J2j53P7Mm5P8J01k01j89j1j4Q6j55j6k76J00K14j25M0K28m45K87q9J38
$$ 314 326 173 250 254 209 287 388 187 -2 -13 -27 59 -96 -112 -388 -288 -74 -199 -159 69 -376 -89 -178 -40
2516d0K47o3n8k6j98J83P0Q2R3l88P5k7j6K35r9k18o2k67K34J72K59k68j79L9
$$ -40 207 144 86 60 -138 45 115 197 290 -98 -23 -50 -66 169 70 -148 -210 -477 -243 -71 188 -80 -259 -220
2540b20J9L66o6n9Qj26k5M59l5j01k82K01q4j00P0J57l42J84k42r2J73NK13m43
$$ -220 -201 165 99 40 48 -78 -103 356 321 220 -62 139 55 -45 25 182 -160 24 -218 -310 -137 -132 81 -362
2564c62o0K62j9L98N4k66K0O2k6K32J1Oj6k67n8K02j06K7j5j74K9k48J19J00P2
$$ -362 -422 -160 -179 219 273 7 27 89 63 295 306 312 296 29 -29 173 67 94 79 -95 -66 -314 -195 -95 -23
2589b3n6m2o6Q4K37p8j80J86L1kjJ44Q1j43j79M2K32o3j12n3j91n6o2J84J86k92
$$ -23 -79 -121 -187 -103 134 56 -124 62 93 91 90 234 315 172 -7 35 267 204 92 39 -152 -208 -270 -86 100 -192
2615a92p0n6K64j10J98k08l3O0J33J63Q7nQ2M3j52J22L8R7k05K7l22j09M4J07
$$ -192 -262 -318 -54 -164 34 -174 -207 -147 -14 149 236 231 313 356 204 326 364 461 256 283 -39 -148 -104 3
2639Cl6r7j60j74K51J53Q7p0k10P5M2K00RMK4P2N2K4K00j25q1l3j49j08J56J0
$$ 3 -33 -130 -290 -464 -213 -60 27 -43 -253 -178 -136 64 73 77 101 173 225 249 449 324 243 210 61 -47 109 119
2665A19j21k22rkP1J36j10j23q4j02J49J97K38k63J19N3n4K71P6j02r9j2n3J10
$$ 119 -2 -224 -233 -235 -164 -28 -138 -261 -345 -447 -298 -101 137 -126 -7 46 -8 263 339 237 138 126 73 183
2689A83N3m0k9m48P0K07qnl03N6J75N3r0K62l91L32k09j11L45L29k99oR5j17L9
$$ 183 236 196 167 -281 -211 -4 -12 -17 -320 -264 -89 -36 -126 136 -255 77 -132 -243 102 431 132 126 221 104 143
2714A43J3lN4j6j91j41Q3r2K24k6o8j57K19j10Q0l35L12p6k5O3J22J73r1j68k8
$$ 143 156 153 207 191 0 -141 -58 -150 74 48 -20 -177 42 -68 12 -323 -11 -87 -112 -49 73 246 155 -13 -41
2739d1LM49r6k33r6J39j43M3L8M1k64j43N6j48M14q2j19J18p2n4K45K08l20K18
$$ -41 -38 411 315 82 -14 125 -18 25 63 104 -160 -303 -247 -395 19 -63 -182 -64 -136 -190 55 263 -57 161
2763A61q8lLK86k78k00M25l58Jp3K10j02j00k18J38k9O4J33L4j98pJ69j06J95
$$ 161 73 70 73 359 81 -119 306 -52 -51 -124 86 -16 -116 -334 -196 -225 -161 -28 6 -192 -199 -30 -136 59
2787E9j30J84o0M1J50k0J06k4k15k3k0K53l48Q1l8j78R9m5J51j21q1j33j64N00
$$ 59 -71 113 53 94 244 224 330 306 91 68 48 301 -47 34 -4 -182 -83 -128 23 -98 -179 -312 -476 24
2811B4j5j47j74L53j40J8L48j80J71q5j30O8J10j15N0nm4l81K66j21P4k8l24J81
$$ 24 9 -138 -312 41 -99 -81 267 87 258 173 43 111 221 106 156 151 107 -274 -8 -129 -55 -83 -407 -226
2835b26m4J67J02k80m6L96j23K8PJ02J71l2j17J80k56J90j40o6k6q9J66J47k33
$$ -226 -270 -103 -1 -281 -327 69 -54 -26 -19 83 254 222 105 285 29 219 79 13 -13 -102 64 211 -22
2858b2lk79N4mJ22L5j9O7k46M2K07R9Q5j34R3j71K66K5jM1n1j14J5P1j1k59K17
$$ -22 -25 -304 -250 -254 -132 -97 -116 -49 -295 -253 -46 53 138 4 97 -74 192 217 216 257 206 92 107 178 167 -92 125
2885A25o5k18J61j43l5J85j46q9kL2L56k50K69r2j14j37J26M94m31j31K06m0J44
$$ 125 60 -158 3 -140 -175 10 -136 -225 -227 -195 161 -89 180 88 -26 -163 -37 457 26 -105 101 61 205
2908B05P0k65N8k85J67O0k75K24j5j59nK63r4J88n0k20mM2O7J23J52m5j48nP0
$$ 205 275 10 68 -217 -50 10 -265 -41 -56 -215 -220 43 -51 137 87 -133 -137 -95 -28 95 247 202 54 49 119
2933A19j02J87p9j80K8K16l04K94l7l16j16M7J85J47l1M8k8j96K73K1q9J57j62
$$ 119 17 204 125 -55 -27 189 -115 179 142 -174 -290 -243 -58 89 58 106 78 -118 155 176 87 244 82
2956H2j16J87P2J5p1J18j05k01nK5J13j49J3M3j49m3L45l06J37k34K76k47L75
$$ 82 -34 153 225 240 169 287 182 -19 -24 1 114 -35 -22 21 -128 -171 174 -132 5 -229 47 -200 175
2979A75r8%q7j8k9R7L52j08j39l73j2K24JM3j14k42J86J0J4J98J9l19J7pJ25J99
$$ 175 77 77 -10 -28 -57 40 392 284 145 -228 -240 -16 -15 28 -86 -328 -142 -132 -118 80 99 -220 -203 -210 -85 114
3005A14M1j60P8j58K87j72N61k54l53J2K14j1j77R2l10R8ko2N4K6j18j14o1K30
$$ 114 155 -5 73 -85 202 30 591 337 -16 -4 210 199 22 114 -196 -98 -100 -162 -108 -82 -200 -314 -375 -145
3029a45j97L84Q8j80n0k1K48J68J2k27J16j23l1m6N8J65j55j19N6j62N4k5O7k37
$$ -145 -342 42 130 -50 -100 -121 127 295 307 80 196 73 42 -4 54 219 64 -55 1 -161 -107 -132 -65 -302
3053c02P7j01J33M4O3j89R8L12p5Q1K0n1o0R3p5K7K07k75J11q7J27qj49q0p9l1
$$ -302 -225 -326 -193 -149 -86 -275 -177 135 60 141 161 110 50 143 68 95 302 27 138 51 178 170 21 -59 -138 -169
3079a69J53K8P2k24J17j41m2K27l2N1J81l33J50o3J27J07R1q2o4q0P4j54J40n6
$$ -169 -16 12 84 -140 -23 -164 -206 21 -11 40 221 -112 38 -25 102 209 300 218 154 74 148 -6 134 78
3103G8l26M9q5J70P2N3j99M1o4L09j65J63j29j16Nl4K42N7l2O6j94K09m9N8L2
$$ 78 -248 -199 -284 -114 -42 11 -188 -147 -211 98 -67 96 -33 -149 -144 -178 64 121 89 155 -39 170 121 179 211
3128B11m4j20l5j67J64K4o6j51J0J18P9qj66J35J2k8K4rL65l57J75j58J2J11j80
$$ 211 167 47 12 -155 9 33 -33 -184 -174 -56 23 15 -151 -16 -4 -32 -8 -17 348 -9 166 8 20 131 -49
3153d9J40j31N6j23J39k47K19k64J78m7K8L9K50r6k66P5K28m2kl6NN2q0mJ99l7
$$ -49 91 -40 16 -107 32 -215 4 -260 -82 -129 -101 -62 188 92 -174 -99 129 87 85 49 54 106 26 22 221 184
3179A84l8j75J48j73j31K68k02J4J34m2q7j04J08J16l44K09J82j34J17pK16j85
$$ 184 146 -29 119 -54 -185 83 -119 -105 29 -13 -100 -204 -96 20 -324 -115 67 -67 50 43 259 74
3201G4p9K07j53m7K00j71J15j83N9L6r3N2k87J17J04Qj26J81j27j18R8M2J80N
$$ 74 -5 202 49 2 202 31 146 -37 22 58 -35 17 -270 -153 -49 -41 -167 14 -113 -231 -133 -91 89 94
3225I4MR4L4j17k9R1j14N2Kj40l7J47l31K50o6p6P4k03j04K99j12j86L09Q0k3
$$ 94 98 192 226 109 80 171 57 109 111 -29 -66 81 -250 0 -66 -142 -68 -271 -375 -76 -188 -374 -65 15 -8
3250hl9m6j00J53J47J74p9R4j29j47J57N8j34J02k02jJ75p7k70R1j48N6j7J31
$$ -8 -47 -93 -193 -40 107 281 202 296 167 20 177 235 101 203 1 0 175 98 -172 -81 -229 -173 -190 -59
3274e9J65j49m7j13K1J33J41J20q6m8J8M1Q4j36J83n2k30J56j34p0j1K15l01J06
$$ -59 106 -43 -90 -203 -182 -49 92 212 126 78 96 137 221 85 268 216 -14 142 8 -62 -73 142 -159 -53
3298e3m8L5p0QR3j67K76j61K85R5l09j36K37J75j03j80J34q4p0J0K07j75m5Q1
$$ -53 -101 -66 -136 -128 -35 -202 74 -87 198 293 -16 -152 85 260 157 -23 111 27 -43 -33 174 -1 -46 35
3322C5j83qO8K62m10J61j46jR5J47Q8K0j26j21J85j65J67M1j14P6J28k51N2J8
$$ 35 -148 -156 -88 174 -236 -75 -221 -222 -127 20 108 128 2 -119 66 -99 68 109 -5 71 199 -52 0 18
3346A8J14k40j38K32o6P4l1Lk5j87J96K4J78n4k28K7J24L34k06m5j29J07Or4K3
$$ 18 132 -108 -246 -14 -80 -6 -37 -34 -59 -246 -50 -26 152 98 -130 -103 21 355 149 104 -25 82 88 -6 17
3371A7L8Pj86K07r0p6J33l0j99p7P8J30M6J38P0l55J87LJ8P6j3J28r6j89J24n7
$$ 17 55 62 -124 83 -7 -83 50 20 -179 -256 -178 -48 -2 136 206 -149 38 41 59 135 122 250 154 -35 89 32
3397C2o6M3OL3r7k14J28Q9j02J1j2Mq2J69R6j47J60J50l05O2R2K1J14r3J48P9
$$ 32 -34 9 15 48 -49 -263 -135 -46 -148 -137 -149 -145 -227 -58 38 -109 51 201 -104 -42 50 71 185 92 240 319
3423C19l25J55nj94J50m1M4q5n6J0j67J42L0j8k10J22o5N3L39o8k33O1J51J50
$$ 319 -6 149 144 -50 100 59 103 18 -38 -28 -195 -53 -23 -41 -251 -129 -194 -141 198 130 -103 -42 109 259
3447B59m4n6J37m7k55J04P5j85J87k47r0P2J67l2r5j05j24Q7N4J06J55K32m12
$$ 259 215 159 296 249 -6 98 173 -12 175 -72 -162 -90 77 45 -50 -155 -279 -192 -138 -32 123 355 -57
3470e7K37j93L7J51J18j25o9n5j87M48k5k58p8j85J0J99m7j57P2j23J53N3M7j53
$$ -57 180 -13 24 175 293 168 99 44 -143 305 280 22 -56 -241 -231 -32 -79 -236 -164 -287 -134 -81 -34 -187
3494a87J77J7Q4o3Q1J64j53K1p4J06J3J21j82N6j93J75k74J87o6l2J38j99O2j63
$$ -187 -10 7 91 28 109 273 120 141 67 173 186 307 125 181 -12 163 -111 76 10 -22 116 -83 -21 -184
3518a84Q2j1J59j42O6LJ60k9n4Lk65L87j63L8N3o7kj24k2n8L55l85J62O4j90J84
$$ -184 -102 -113 46 -96 -30 -27 133 104 50 53 -212 175 12 50 103 36 34 -90 -112 -170 185 -200 -38 26 -164 20
3544B0M0j13k1Q9r0K05k6l0n2K04l26J18J37k30J50k58J68K12k69J23N3j60p9
$$ 20 60 -53 -74 15 -75 130 104 74 22 226 -100 18 155 -75 75 -183 -15 197 -72 51 104 -56 -135
3567a35q2Q7n2J54j97O0l8J22O8J14j14p9K31M8j83K11k05k2J60k78K41K0m9r9
$$ -135 -217 -130 -182 -28 -225 -165 -203 -81 -13 101 -13 -92 139 187 4 215 10 -12 148 -130 111 131 82 -17
3591a7M1Rp1j96P1K7L6j46L73j94K92l95J49M8M6n7R7J7K6n5j19JP1j9N7j17j65
$$ -17 24 33 -38 -234 -163 -136 -100 -246 127 -67 225 -170 -21 27 73 16 113 130 156 101 -18 -17 54 35 92 -25 -190
3618a90J59l5O5j64P9J0K5j45K21j29R3p8n6P4J77P7m1j29J52l1J2r2J5J9k4N3
$$ -190 -31 -66 -1 -165 -86 -76 -51 -196 25 -104 -11 -89 -145 -71 106 183 142 13 165 134 146 54 69 88 64 117
3644A17j50J02L2n9j4n5k57J61j55J57K26k04j42L06j5o4m1J76j8Pj03K15j68
$$ 117 -33 69 101 42 28 -27 -284 -123 -278 -121 105 -99 -241 65 50 -14 -55 121 103 110 7 222 54
3667E4o0N7J82j67p3m7O0j46J53k54J70l9jJ00pj30J59j21M5O3k7j03M6Q4j21
$$ 54 -6 51 233 66 -7 -54 6 -140 13 -241 -71 -110 -111 -11 -18 -148 11 -110 -65 -2 -29 -132 -86 -2 -123
3692a23L65k15J9j06J85j58J32j59K4j2J15q0J65l00R1M0q3j08L04j13J16k62
$$ -123 242 27 46 -60 125 -33 99 -60 -36 -48 67 -13 152 -148 -57 -17 -100 -208 96 -17 99 -163
3714a63K72L8j64J18oN0l14L23j78K1P5J60k28j39M3J04k66J92J33k04J37j1k74
$$ -163 109 147 -17 101 95 145 -169 154 -24 -3 72 232 4 -135 -92 12 -254 -62 71 -133 4 -7 -281
3737b81L16K2MJ90k67r0J31j35K30J1k98J57J0J49j89Q0k26J58j00Q9J28k96p6
$$ -281 35 57 61 251 -16 -106 25 -110 120 131 -167 -10 0 149 -40 40 -186 -28 -128 -39 89 -207 -283
3760b83Q0J37O7J24j14j30j72M39J30j44n6k59J85k7L7J70K4l43jl0K46q9J45
$$ -283 -203 -66 1 125 11 -119 -291 148 278 134 78 -181 4 -23 14 184 208 -135 -136 -166 80 -9 136
3783A36j42q8k5J44r5J5P4rP3j12l8J5PK6N6Rn4J23L1q1j4oJ56j97R0j60K80l73
$$ 136 -6 -94 -119 25 -70 -55 19 10 83 -29 -67 -52 -45 -19 37 46 -8 115 146 65 51 45 201 4 94 -66 214 -159
3811a59L74j77j26j60K12K9r6J63j08qJ93k43Q8q4J12R2K7O5l68K81r5p6K57k36
$$ -159 215 38 -88 -248 -36 -7 -103 60 -48 -56 137 -106 -18 -102 10 102 129 194 -174 107 12 -64 193 -43
3835d3M7N2L2l60K43J29l95K49o8o1J00K09k50J8K7p2J91o2J51J64j86l04K19
$$ -43 4 56 88 -272 -29 100 -295 -46 -114 -175 -75 134 -116 -98 -71 -143 48 -14 137 301 115 -189 30
3858C0J4j06J44J20k58R8p9k5J40j20p2l2J98Jn8j57K46j32K0n8j9L12j43K8j54
$$ 30 44 -62 82 202 -56 42 -37 -62 78 -42 -114 -146 52 53 -5 -162 84 -48 -28 -86 -105 207 64 92 -62
3883f2K65K4j69r0Oj16L17l0j28j07J52j37J62p2m1j47J48L8l36L19m8n3N7Q6
$$ -62 203 227 58 -32 -26 -142 175 145 17 -90 62 -75 87 15 -26 -173 -25 13 -323 -4 -52 -105 -48 38
3907C8qJ1j68K88k68l2K31k28J55L09l00N7O9j90O9mj27O3O6j42N6O5J5R1M9o6
$$ 38 30 41 -127 161 -107 -139 92 -136 19 328 28 85 154 -36 33 29 -98 -35 31 -111 -55 10 25 116 165 99
3933I9Ln0j21P5J37j59j08J18k8J8q3mm8K0J66l38K18P9k7q0M2N9R3j20PqJ54
$$ 99 102 52 -69 6 143 -16 -124 -6 -34 -16 -99 -103 -151 -131 35 -303 -85 -6 -33 -113 -71 -12 81 -39 -32 -40 114
3960A14J06k47J00O2k42K00p9R0J53l7k44j39O3P3o7o8O8k63M17o9o6K85l48J07
$$ 114 220 -27 73 135 -107 93 14 104 257 220 -24 -163 -100 -27 -94 -162 -94 -357 60 -9 -75 210 -138 -31
3984c1J8n0pJ21j97P4Q5KokJ0J0rJ5j80J85L2j89kj3J25j32J10j77K26m4k51L19
$$ -31 -13 -63 -70 51 -146 -72 13 15 9 7 17 27 18 33 -147 38 70 -119 -121 -134 -9 -141 -31 -208 18 -26 -277 42
4012D2L7q9p0J1J72k1j17ppj03K26j15K49m2j93j2k05J5J00K1k70M86j69J06J6
$$ 42 79 -10 -80 -69 103 82 -35 -42 -49 -152 74 -41 208 166 -27 -39 -244 -229 -129 -108 -378 108 -61 45 61
4037F1k19J66R4j65J85o7L9k53J63K5J92o8j69J20K8L6k91O8pK83k77Q3N7j93
$$ 61 -158 8 102 -63 122 55 94 -159 4 29 221 153 -16 104 132 168 -123 -55 -62 221 -56 27 84 -109
4061a09R7K4j03J03P2j09RqJJ20j82K37j5O4j59k0kl6J21j37J34j21J14p8L3j32
$$ -109 -12 12 -91 12 84 -25 -16 -24 -23 97 -85 152 137 201 42 22 20 -16 105 -32 102 -19 95 17 50 -82
4087h2L03k13M1r7N2q1J96k61J32O3q5J43j34j03M8J17r7J56j65J22n9r5J12j35
$$ -82 221 8 49 -48 4 -77 119 -142 -10 53 -32 111 -23 -126 -78 39 -58 98 -67 55 -4 -99 13 -122
4111a22r0K75j27j53J55J0J13j56j19K22l4k0p8J44kk5j49J68J9J87j90J80k74
$$ -122 -212 63 -64 -217 -62 -52 61 -95 -214 8 -26 -46 -124 20 18 -7 -156 12 31 218 28 208 -66
4134f6P4J20p1k09K8K53k34J96q8P6J7k9p0k3R9J22l21J63K0J03o7j45K30j74
$$ -66 8 128 57 -152 -124 129 -105 91 3 79 96 67 -3 -26 73 195 -126 37 57 160 93 -52 178 4
4158DJ27r2q2l5K52j80M1j76Q6P9k10M30k07J08k27K59j37j41J1j18L76Q3k15
$$ 4 131 39 -43 -78 174 -6 35 -141 -55 24 -186 244 37 145 -82 177 40 -101 -90 -208 168 251 36
4181C6r7J93q9n7Q5P4j69m7J19m0j38J43j00J75k6k07K50p8k01L82l10Q5L6J8
$$ 36 -61 132 43 -14 71 145 -24 -71 48 8 -130 13 -87 88 62 -145 105 27 -174 208 -102 -17 19 37
4205C7J1m1j1J74J00j70O0j72P3j7J7qpO5j20O0J7j25k36J33R1L1J12j60M1J00
$$ 37 48 7 -4 170 270 100 160 -12 61 44 61 53 46 111 -9 51 68 -57 -293 -160 -69 -38 74 -86 -45 55
4231E5nj43R2k7R5j15O6J43k62K38j35j99K13j5k9J6j91K11j39q8Q7R3J04k62
$$ 55 50 -93 -1 -28 67 -48 18 161 -101 137 2 -197 16 1 -28 -12 -203 8 -131 -219 -132 -39 65 -197
4255a97K88j78K59n8j70L7J37m0j51J64K3j70J03J78j57P1J8q4L2j32J18Or9m
$$ -197 91 -87 172 114 -56 -19 118 78 -73 91 114 -56 47 225 68 139 157 73 105 -27 91 97 -2 -6
4279fk9k44K78j54K30j89J96j40p3J12nJ59r1J2N8j59K0J20J73l62m0J70k38K13
$$ -6 -35 -279 -1 -155 75 -114 82 -58 -131 -19 -24 135 44 56 114 -45 -25 95 268 -94 -134 36 -202 11
4303A1R7j72J1j12J37J9j5m0J15rr6N4q2K12k06K7K17n23L90J28j11k44J57Q2
$$ 11 108 -64 -53 -165 -28 -9 -24 -64 51 42 -54 0 -82 130 -76 -49 168 -355 35 163 52 -192 -35 47
4327D7J0k8j20J35N9M7j74J2N7k03NL3j20K92q9R5p1N6JK6K4J9k19N1J08p6J71
$$ 47 57 29 -91 44 103 150 -24 -12 45 -158 -153 -120 -240 52 -37 58 -13 43 44 70 94 113 -106 -55 53 -23 148
4354A48k34J77j80M4J37j52j28J19J64n2p0j44K03J30m5k38J43j5p2J39j19J45
$$ 148 -86 91 -89 -45 92 -60 -188 -69 95 43 -27 -171 32 162 117 -121 22 7 -65 74 -45 100
4376A00j46J85k70k5P9o5qJ50l7J62j44N2o6j18K88j06P7N6k67J09P7O7k38K28
$$ 100 -46 139 -131 -156 -77 -142 -150 0 -37 125 -19 33 -33 -151 137 31 108 164 -103 6 83 150 -88 140
4400A40k5j13j36M8K91j10%l09K05j61J18k1j0j6j59J56k2m6O2L7M2M3Rjk71L12
$$ 140 115 2 -134 -86 205 95 95 -214 -9 -170 -52 -73 -83 -99 -258 -102 -124 -170 -108 -71 -29 14 23 22 -249 63
4426F3j28J48MO8n5l0N0k08L23k49OLj35Mk6K03j02J62j73P4L0m4n3K9P6j13K56
$$ 63 -65 83 87 155 100 70 120 -88 235 -14 -8 -5 -140 -136 -162 41 -61 101 -72 2 32 -12 -65 -36 40 -73 183
4453A83j90k0J89j07k51L1J2N3J44j71Q2N9j01p3J13mJ02N0k01OM8o6J83j41M
$$ 183 -7 -27 162 55 -196 -165 -153 -100 44 -127 -45 14 -87 -160 -47 -51 51 101 -100 -94 -46 -112 71 -70 -66
4478f6N2J17k11J65k3n6J02O3k25J39M5k14J18m5Qr1J4J43K2k65K42j41J05J50
$$ -66 -14 103 -108 57 34 -22 80 143 -82 57 102 -112 6 -39 -31 -122 -108 35 57 -208 34 -107 -2 148
4502A48j61J24M1q1q6j9r6K7J25O3j65J16m6LJ16j13Q7k7J63l27J11j49J21J52
$$ 148 -13 111 152 71 -15 -34 -130 -103 22 85 -80 36 -10 -7 109 -4 83 56 219 -108 3 -146 -25 127
4526A27k83P1K97j41p3j23L5K73k46n8J3O4J89l00J13K93n91L63j36j0J94j15
$$ 127 -156 -85 212 71 -2 -125 -90 183 -63 -121 -108 -44 145 -155 -42 251 -340 23 -113 -123 71 -44
4548d4J27R3k2P5k48L0K03k81K39j37L2J40J35l79l0n5L04j44k26J82nJ06j76
$$ -44 83 176 154 229 -19 11 214 -67 172 35 67 207 342 -37 -67 -122 182 38 -188 -6 -11 95 -81
4571h1J74o0p3L8L8k34L21J7P3k16p4j3LJ7PN7J43j68O4l4L2J16j07j03N6J12
$$ -81 93 33 -40 -2 36 -198 123 140 213 -3 -77 -90 -87 -70 -63 -6 137 -31 33 -1 31 147 40 -63 -7 105
4597A05q9P0P5k59oQ0PP7k87Q0K43j09J4nj37K81k65L6K34q7n4m1J98j7l4j1j56
$$ 105 16 86 161 -98 -104 -24 -17 60 -227 -147 96 -13 1 -4 -141 140 -125 -89 145 58 4 -37 161 144 110 99 -57
4624e7J3O7J61l55J80M2j34L6O7O1l08J89N1p3r5K36k3j5J64j75m0jo7K24j53
$$ -57 -44 23 184 -171 9 51 -83 -47 20 81 -227 -38 13 -60 -155 81 58 43 207 32 -8 -9 -76 148 -5
4649eP5N4k4q4k3P4q7J12l96K70J58j31j14J74p5p6RJ50m9P4j22N7M8j87l4L47
$$ -5 70 124 100 16 -7 67 -20 92 -304 -34 124 -7 -121 53 -22 -98 -89 61 12 86 -36 21 69 -118 -152 195
4675A95j02k22J58NO1j0k04j7P6J32kj65J7J48j7N8j01j1R0O3l4k25J59k66M27
$$ 195 93 -129 29 34 95 85 -119 -136 -60 72 70 -95 -78 70 53 111 10 -1 89 152 118 -107 52 -214 213
4700B13k12l7J03j72J44R6j66p1J21n6j15J40M2j93J16Mn9O9O6q7K8L0jM9j10
$$ 213 1 -36 67 -105 39 135 -31 -102 19 -37 -152 -12 30 -163 -47 -43 -102 -33 33 -54 -26 4 3 52 -58
4725e8K21n1j10M3J6j2N4j29J58j33L4J7ll0j99L09k10j5P3m9j9M6k8P3nk11J52
$$ -58 163 112 2 45 61 49 103 -26 132 -1 33 50 47 17 -182 127 -83 -98 -25 -74 -93 -47 -75 -2 -7 -218 -66
4752f6J69j70N1Q6k3k9j69K82j4k18k7P5o2R1PJ72j65l1j22K29j12J29M6j87J9
$$ -66 103 -67 -16 70 47 18 -151 131 117 -101 -128 -53 -115 -24 -17 155 -10 -41 -163 66 -46 83 129 -58 -39
4777c9J31l6k23K38N2k45J43J08k49K22j13K64m27RJ57K1N0j26K3JK33qk04K19
$$ -39 92 56 -167 71 123 -122 21 129 -120 102 -11 253 -174 -165 -8 13 63 -63 -40 -39 194 186 -18 201
4801B01j27M7j82J17N6J06k63J38j17Q3j29J59j70J12N4o2j44K57k11Ql3R7p6
$$ 201 74 121 -61 56 112 218 -45 93 -24 59 -70 89 -81 31 85 23 -121 136 -75 -67 -100 -3 -79
4824g9L0N9j99N13k51pk63L34j03p9jj48K62j9Q1j78J50P0r6k9j12J33k07J70
$$ -79 -49 10 -189 324 73 66 -197 137 34 -45 -46 -194 68 49 130 -48 102 172 76 47 -65 68 -139 31
4848C1j9N9j02N5M9m0J6k9LK08k04o9O7n0L4N3q3L9Nj25P1k2k26J72j8m7J35P
$$ 31 12 71 -31 24 73 33 49 20 23 231 27 -42 25 -25 9 62 -21 18 23 -102 -31 -53 -279 -107 -125 -172 -37 -30
4876c0Q5m9q1J6J09j7r0q2J30N4J52l56L38rj73P0j53P8O1J91l16R5j57O9J80
$$ -30 55 6 -75 -59 50 33 -57 -139 -9 45 197 -159 179 170 -3 67 -86 -8 53 244 -72 23 -134 -65 115
4901A15Q3j85L6j63Nj6K1M9J64p8k16L4K65lr7On2q5J3J29K5q9P2l5j14k0O8O2
$$ 115 198 13 49 -114 -109 -125 -104 -55 109 31 -185 -151 114 111 14 20 -32 -117 -104 25 50 -39 33 -2 -116 -136 -68 -6
4929fL0k8J42j23N0j82MKN0q5J13J27j19j0j49R4J18l9R7m1p4M6K0M7j12J31n3
$$ -6 24 -4 138 15 65 -117 -113 -111 -61 -146 -33 94 -25 -35 -184 -90 28 -11 86 45 -29 17 37 84 -28 103 50
4956E0Rj05mJ20k79K61j13J24Q1j01o5j43K45n5m3n8J86J3K6J7j93J79J2l62L13
$$ 50 59 -46 -50 70 -209 52 -61 63 144 43 -22 -165 80 25 -18 -76 110 123 149 166 -27 152 164 -198 115
4981A15j64L48l44R5Qj26J95k34M7n6KJ56J01k30M1j55L42j97J13J48l09J4K0
$$ 115 -49 299 -45 50 58 -68 127 -107 -60 -116 -114 42 143 -87 -46 -201 141 -56 57 205 -104 -90 -70
5004g0rj3Nl0P3P9j34K45k15J12P3j51J21l3p7p2J61N4p8J40j30j36J65q1J5m9
$$ -70 -79 -92 -87 -117 -44 35 -99 146 -69 43 116 -35 86 53 -24 -96 65 119 41 181 51 -85 80 -1 14 -35
5030c5j07J60j19M3J52m6n3J51Lk29M2o3m3P7J02j39K23J07l04O3K31k85o9J58
$$ -35 -142 18 -101 -58 94 48 -5 146 149 -80 -38 -101 -144 -67 35 -104 119 226 -78 -15 216 -69 -138 20
5054B0j37P0L5j64J7L04j04J25j12j38J25N1J45j76J60j84J02J14l51K26k84L68
$$ 20 -117 -47 -12 -176 -159 145 41 166 54 -84 41 92 237 61 221 37 139 253 -98 128 -156 212
5076B12j14j47m7R5m6J51j42J28p6k11J80j85L2J65k2Q1j66J16R1j90J46j98J44
$$ 212 98 -49 -96 -1 -47 104 -38 90 14 -197 -17 -202 -170 -5 -27 54 -112 4 95 -95 51 -147 -3
5099cJ19p9l3J13n7o1J75k8m5k17L06k68J00K6j42M2j2j7J02J04m7K2j13J10m2
$$ -3 116 37 4 117 60 -1 174 146 101 -116 190 -78 22 48 -94 -52 -64 -81 21 125 78 100 -13 97 55
5124E5r6P8p4j10M34k38J31j74p6J86j94J29j41l1J44M8J14l08K52q9r3o4J61
$$ 55 -41 37 -37 -147 287 49 180 6 -70 116 -78 51 -90 -121 23 71 185 -123 129 40 -53 -117 44
5147D4j37J25q7QK5J68j89k17K72k16L04Q9j25J3n1J07j02N5m8mJ36j45j6k2J5
$$ 44 -93 32 -55 -47 -22 146 -43 -260 12 -204 100 189 64 77 26 133 31 86 38 34 170 25 9 -13 2
5172BJ11Rk19L13r2k33k99L15P7P0j03p7O1q9J80ON8J4r1k14J60L4J10j22J79
$$ 2 113 122 -97 216 124 -109 -408 -93 -16 54 -49 -126 -65 -154 26 32 90 104 13 -201 -41 -7 103 -19 160
5197A60k08J42j60K7K10m8k0l4J6Lk14J75P3k14l1J04l6L5j47mJ21J48k06L9n0
$$ 160 -48 94 -66 -39 171 123 103 69 85 88 -126 49 122 -92 -123 -19 -55 -20 -167 -171 -50 98 -108 -69 -119
5222a19J70j15M2l6J63l4j63K28j24m9K42j92k37K69N4k08o3K78Lk49J57k04K58
$$ -119 51 -64 -22 -58 105 71 -92 136 12 -37 205 13 -224 45 99 -109 -172 106 109 -140 17 -187 71
5245G1N7k31J46lp6lJ34q0q4j9J07l9l3j29K44j87K10O1j54Q5q9m1K78k76J20
$$ 71 128 -103 43 40 -36 -39 95 15 -69 -88 19 -20 -53 -182 62 -125 85 146 -8 77 -12 -53 225 -51 69
5270F9R7j88L1OQR3j97j5l0J71p0J83j14M5J52k24q3O3J1K0K09k60p1l7J26j07
$$ 69 166 -22 9 15 23 116 -81 -96 -126 45 -25 158 44 89 241 17 -66 -3 8 28 237 -23 -94 -131 -5 -112
5296a12J54j50J86j8j22q0K1O7l6L1r7J69K45j86p6J3N0n9o1j40L65k31J17j70
$$ -112 42 -108 78 60 -62 -142 -121 -54 -90 -59 -156 13 258 72 -4 9 59 0 -61 -201 164 -67 50 -120
5320a20q9K57j93K26P2j17J66l48J90j79K13j71L04n8j38qPm7P1o6K29k86J4K25
$$ -120 -209 48 -145 81 153 36 202 -146 44 -135 78 -93 211 153 15 7 14 -33 38 -28 201 -85 -71 154
5344A54j63q0R6J47k19K18j20r6N8o9j46ML59j94J42J8k30J52j91K91k00J06%
$$ 154 -9 -89 7 154 -65 153 33 -63 -5 -74 -220 -216 143 -51 91 109 -121 31 -160 131 -69 37 37
5367C7k9k4l1P1k6k4J19J3l3NRk47J49J13%k20q2L52m6N3k5o2Q0N1k57K39j90
$$ 37 8 -16 -47 24 -2 -26 93 106 73 78 87 -160 -11 102 102 -118 -200 152 106 159 134 72 152 203 -54 185 -5
5394eJ38k8j5J8k75Q8J05Q9mj52K20k95J82K9r5O5j28L02l06L0L2l2m5Q2qj10
$$ -5 133 105 90 108 -167 -79 26 115 111 -41 179 -116 66 95 0 65 -63 239 -67 -37 -5 -37 -82 0 -8 -118
5420a18M66m96J13JM8J41l60K79r7O1j48J69p1q3n2P4n2J03r7O6O8n8K15k13m5
$$ -118 348 -148 -35 -34 14 155 -205 74 -23 38 -110 59 -12 -95 -147 -73 -125 -22 -119 -53 15 -43 172 -41 -86
5445h6J35j7j10J10l0j52J80q4N4O5j5L0J87l07M1J3n1o6Q0k4pm9J82k63L53k40
$$ -86 49 32 -78 32 2 -150 30 -54 0 65 50 80 267 -40 1 14 -37 -103 -23 -47 -54 -103 79 -184 169 -71
5471g1m4K11l7K52l00k5Qo6J30J08j77P0K18l31L7O2n4K63l38J60j75N6J64k68
$$ -71 -115 96 59 311 11 -14 -6 -72 58 166 -11 59 277 -54 -17 45 -9 254 -84 76 -99 -43 121 -147
5495a47J11J54j78J03L0m6J24k34j08J25K83k82R5J7QN4o3p0r8K10j07m8n0K62
$$ -147 -36 118 -60 43 73 27 151 -83 -191 -66 217 -65 30 47 55 109 46 -24 -122 88 -19 -67 -117 145
5519A45l22P1J8P4N7j27O9n7J16N3k61J55j57R6R3Rj1k0r0K74r5j14j27J49o3
$$ 145 -177 -106 -88 -14 43 -84 -15 -72 44 97 -164 -9 -166 -70 23 32 21 1 -89 185 90 -24 -151 -2 -65
5544f5J01m9M1j86J44k2J26r3P6K24l50q5N7J45j00K65l06l6K02k69K39j56J84
$$ -65 36 -13 28 -158 -14 -36 90 -3 73 297 -53 -138 -81 64 -36 229 -77 -113 89 -180 59 -97 87
5567H7p1nN4j51J31m2n1K2J14p0o3J00J00l62K24j06J00qR8j06l1J1J88j54n5
$$ 87 16 11 65 -86 45 3 -48 -26 88 18 -45 55 155 -207 17 -89 11 3 101 -5 -36 -25 163 9 -46
5592d6J53k77L28k33P3J1j6j25L45n3r9N5k77K70l28K36J80k20qj17J7Q3j46K91
$$ -46 107 -170 158 -75 -2 9 -7 -132 213 160 61 116 -161 109 -219 17 197 -23 -31 -148 -131 -48 -194 97
5616I7j30O3j65J51J05l39J20J56j85K7K50j61M9K6j6j49J19j84K19j56J96K5
$$ 97 -33 30 -135 16 121 -218 -98 58 -127 -100 150 -11 38 64 48 -101 18 -166 53 -103 93 118
5638A18j14K1Q0N6k54J09m7O8j6P1j35Q7j89J76Qj18M5M9j01K3M0p5m9J41P4r8
$$ 118 4 25 105 161 -93 16 -31 37 21 92 -43 44 -145 31 39 -79 -34 15 -86 -63 -23 -98 -147 -6 68 -30
5664c0O4o1K75m08J05J5N8R7p5o4n0J0J56j85K61k88J68m4k7K2m1J42j40J03r5
$$ -30 34 -27 248 -160 -55 -40 18 115 40 -24 -74 -64 92 -93 168 -120 48 4 -23 -1 -42 100 -40 63 -32
5689c2L3K2r1n6o5J17J27j29m0K3J67o9j7J5k10N8K17j96K11J14k04rk49K80n3
$$ -32 1 23 -68 -124 -189 -72 55 -74 -114 -91 76 7 -10 5 -205 -147 70 -126 85 199 -5 -14 -263 17 -36
5714c6L6J5M0k6r3R3m8J1mJ15j59Q8m5r4J27n7j67J62O3K8J62k25k01J57o2l6
$$ -36 0 15 55 29 -64 29 -19 -8 -12 103 -56 32 -13 -107 20 -37 -204 -42 21 49 211 -14 -215 -58 -120 -156
5740a56K70j3k29K51n7Q4L6k99J72j37j21L15r1Q0j00j35P3K31k24j48K18k6n6
$$ -156 114 101 -128 123 66 150 186 -113 59 -78 -199 116 25 105 5 -130 -57 174 -50 -198 20 -6 -62
5763f2lrP4o1j1N6L2J33k22K07k33N1MJ21Rj03J52j10n3q2RJ13q7J58j69M9l2
$$ -62 -65 -74 0 -61 -72 -16 16 149 -73 134 -99 -48 -44 77 86 -17 135 25 -28 -110 -101 12 -75 83 -86 -37 -69
5790f9K5K3n1L5J52l38J95n5J06J66j68r7O6Q3Q4m8k00L26j79j7j7J57k33j54
$$ -69 -44 -21 -72 -37 115 -223 -28 -83 23 189 21 -76 -10 73 157 109 -91 235 56 39 22 179 -54 -208
5814b08O6M4J61j59Q1J00oqq8L4k5J18k31K49m3j50J72j66L19l48J35Q3l39K67
$$ -208 -142 -98 63 -96 -15 85 79 71 -17 17 -8 110 -121 128 85 -65 107 -59 260 -88 47 130 -209 58
5838E8j61Q6p2R2J04n0p4n2K8k7k02L49k63Q2J23Kp8P3q2J62o0K08k46K2P5j15
$$ 58 -103 -17 -89 3 107 57 -17 -69 -41 -68 -270 79 -184 -102 21 23 -55 18 -64 98 38 246 0 22 97 -18
5864a8K53j81j61K58j00j18K29n8j95Q2J51j49l8j85M00j44k6Qn5p4K13n1J49
$$ -18 235 54 -107 151 51 -67 162 104 -91 -9 142 -7 -45 -230 170 26 0 8 -47 -121 92 41 190
5887A90j96j38J91K7O2J9j77J1M3j37K16n2j08N4j36J15Q6p1j9n8J51q1J22n0
$$ 190 -6 -144 47 74 136 155 -22 -11 32 -105 111 59 -49 5 -131 -16 70 -1 -20 -78 73 -8 114 64
5911F4Q0j3m5o1K0j65K16j28R8j12J17j65Q1O5j70K80k11J19j10N5k74J87O4L9
$$ 64 144 131 86 25 45 -120 96 -32 66 -46 71 -94 -13 52 -118 162 -49 70 -40 15 -259 -72 -8 31
5935C1n3J07j36j13M26r6P1l15j4K54o5l61J42J41n4J31q9j02R5o5q1J07j37J02
$$ 31 -22 85 -51 -164 262 166 237 -78 -92 162 97 -264 -122 19 -35 96 7 -95 0 -65 -146 -39 -176 -74
5959g4J85j83J66j95L25k31n6O1J7K8j7j09P0j30K82m1j15j21R2q0J39j67J36
$$ -74 111 -72 94 -101 224 -7 -63 -2 15 43 26 -83 -13 -143 139 98 -17 -138 -46 -126 13 -154 -18
5982a8r0O7J84k15J61J88l17J09j90K97K4j60l4Q9l3L7K1j08nj5j1j2K5k03J15
$$ -18 -108 -41 143 -72 89 277 -40 69 -121 176 200 40 6 95 62 99 120 12 7 -8 -19 -31 -6 -209 -94
6007i4J16j08pR2r5J16j0j36K71k30J83j75K4j05J23J8J13j89O5N8j23k2J75k07
$$ -94 22 -86 -93 -1 -96 20 10 -126 145 -85 98 -77 -53 -158 -35 -17 96 -93 -28 30 -93 -115 60 -147
6031a47J1J16P3J5r3k4j10R2p3k7P7J31O2q2o4J89k8j95J35RQ0q2k34L35l48J07
$$ -147 -136 -20 53 68 -25 -49 -159 -67 -140 -167 -90 41 103 21 -43 146 118 -77 58 67 147 65 -169 166 -182 -75
6057g5M0m2K9l1O9j23P0K5m7N3R9k27O1n3J56j33r0K20o7J63l7n0J2m1o1O4J97
$$ -75 -35 -77 -48 -79 -10 -133 -63 -38 -85 -32 67 -160 -99 -152 4 -129 -219 1 -66 97 60 10 22 -19 -80 -16 181
6084A81k24m0J30o5N9p2O5k10J00j27K30Q3N4q2Q6j29r2Pj98K11J0l7K7J78j11
$$ 181 -43 -83 47 -18 41 -31 34 -176 -76 -203 27 110 164 82 168 39 -53 -46 -244 -33 -23 -60 -33 145 34
6109C4j25k2J92j71N6m3J56j11O4Kk9K0k42K15p0J62j6P7N0j99J35o6q7n6J10
$$ 34 -91 -113 79 -92 -36 -79 77 -34 30 32 3 23 -219 -4 -74 88 72 149 199 0 135 69 -18 -74 36
6134C6K36k03n7l33L96q2O9R7j72P2j74J9L1J02J12j65R0j88Q1J85O2k40R6M3
$$ 36 272 69 12 -321 75 -7 62 159 -13 59 -115 -96 -65 37 149 -16 74 -114 -33 152 214 -26 70 113
6158A13n5j1n0n4Mj3RJ0o6M6L8N0j18L2O8K25n16M15o8P0j44R3jj77K42j12mj17
$$ 113 58 47 -3 -57 -53 -66 -57 -47 -113 -67 -29 21 -97 -65 3 228 -288 127 59 129 -15 78 77 -100 142 30 26 -91
6186i1R8J3j26K13j16j20K39r1M8r9J02k17k8J17pk0N3J32n5L1N8J0o0J03n6j02
$$ -91 7 20 -106 107 -9 -129 110 19 67 -32 70 -147 -175 -58 -65 -85 -32 100 45 76 134 144 84 187 131 29
6212B9M7O3m2j15n6K00j19J00R6k92K75m27J04J56L9j08L7l4J03k69M02j60J23
$$ 29 76 139 97 -18 -74 126 7 107 203 -89 186 -241 -137 19 58 -50 -13 -47 56 -213 189 29 152
6235A52n8n9M8q0mJ7L63n38J23j9K0r6J90m6K28m38L46j02k76M11l51K68J62l59
$$ 152 94 35 83 3 -1 16 379 -159 -36 -55 -35 -131 59 13 241 -197 149 47 -229 182 -169 99 261 -98
6259i8J77j46K1q5J78Ro3o0J44j37K20k92R8n4J54n8l5r4l7K57j33j46P1m8J57
$$ -98 79 -67 -46 -131 47 56 -7 -67 77 -60 160 -132 -34 -88 66 8 -27 -121 -158 99 -34 -180 -109 -157 0
6284@J0j86J75L6l6N8j1J97m4k53N6L4j05J22j30J52J41j31o5n8j2J31j50o1K04
$$ 0 10 -176 -1 35 -1 57 46 243 199 -54 2 36 -69 53 -77 75 216 85 20 -38 -50 81 -69 -130 74
6309G4k12L8J43m8J6r7J74j6j43K90j24q2J3J02j86K7J00PJ2L7P2l01Q1q9k1R5
$$ 74 -138 -100 43 -5 11 -86 88 72 -71 219 95 13 26 128 -58 -31 69 76 88 125 197 -104 -23 -112 -133 -38
6335c8p8J61r5J99j93j24L87j78l8o4P5O6nJ03p1j66Jo2R7Kp6J12k3l8n0m4J28
$$ -38 -116 45 -50 149 -44 -168 219 41 3 -61 14 80 75 178 107 -59 -58 -120 -23 -21 -97 15 -8 -46 -96 -140 -12
6362a2j21j4J96M1o3k43J67J47m5Rm6K7J69m10K57km5L7O0k73J51M1J82l13N6
$$ -12 -133 -147 49 90 27 -216 -49 98 53 62 16 43 212 -198 59 57 12 49 109 -164 -13 28 210 -103 -47
6387d7Q8r2J74J15l46J92p1m2J01j06R6J07j03j85K51m4K7k02k0Q7K77k52j82
$$ -47 41 -51 123 238 -108 84 13 -29 72 -34 62 169 66 -119 132 88 115 -87 -107 -20 257 5 -177
6410a77L95j76J67j40k9K7n8j9J0j9nJ4r4J24q3J29l9n2K0O9n6R8L3p2K2M2K1
$$ -177 218 42 209 69 40 67 9 -10 0 -19 -24 -10 -104 20 -63 66 27 -25 -5 64 8 106 139 67 89 131 152
6437A52j25j58J23k0k39K22K07k55J16Q1j16j47M7J96K07j62j39J26L1r8K7l4
$$ 152 27 -131 -8 -28 -267 -45 162 -93 23 104 -12 -159 -112 84 291 129 -10 116 147 49 76 42
6459D2k5J10k46O5j3j03K57j07RJ75l08J38k27K93k17J18J41k73J50j9N6p8J11
$$ 42 17 127 -119 -54 -67 -170 87 -20 -11 164 -144 -6 -233 60 -157 -39 102 -171 -21 -40 16 -62 49
6482D9k5r1J90j56K38l14K03j86QOq5K5J86n1m3J19k71J89P5l25K61J7j43J92
$$ 49 24 -67 123 -33 205 -109 94 -92 -84 -78 -163 -138 48 -3 -46 73 -198 -9 66 -259 2 19 -124 68
6506F8J34k24j17L36j48m9j20J99k16J20k3j34N0J9rL49l47P9J97p9n8j46K16
$$ 68 202 -22 -139 197 49 0 -120 79 -137 -17 -40 -174 -124 -105 -114 235 -112 -33 164 85 27 -119 97
6529I7Q5k61Q9N9j52J93j47J39k06R5J42m9Q4j09r6JJ06j5l3j53J09K9l7K14k41
$$ 97 182 -79 10 69 -83 110 -37 102 -104 -9 133 84 168 59 -37 -36 70 55 22 -131 -22 7 -30 184 -57
6554e7L7j07J45n9j01Q1K47k73J67r3j03J64n9R5j21l6K08j19M0q8j27K16j91
$$ -57 -20 -127 18 -41 -142 -61 186 -87 80 -13 -116 48 -11 84 -37 -73 135 16 56 -32 -159 57 -134
6577a34J0N1O5jN7l2j01n5Q3o0K11q2R1j90P9N2l3L1O2j39o7K12o8p9j7M4J1R4
$$ -134 -124 -73 -8 -9 48 16 -85 -140 -57 -117 94 12 103 -87 -8 44 11 42 104 -35 -102 110 42 -37 -54 -10 1 95
6605I5k45K46k94J59j82K69k6r1RP2M8p7Rn5K91O6j91Q9K0m08J17K32j96J09P4
$$ 95 -150 96 -198 -39 -221 48 22 -69 -60 12 60 -17 -8 -63 228 294 103 192 212 -196 -79 153 -43 66 140
6630A40j48r8R6J70k61P3k67M01j90J17p6J5k6K3J15J06n2p8J66k28L4R6p7o9
$$ 140 -8 -106 -10 160 -101 -28 -295 106 -84 33 -43 -28 -54 -31 84 190 138 60 226 -2 32 128 51 -18
6654a8K95q2l38J97l5o5o1J70j68l7P2K1j02L06k01K49j29ok93J25L42k19K18
$$ -18 277 195 -143 54 19 -46 -107 63 -105 -142 -70 -49 -151 155 -46 203 74 68 -225 -100 242 23 241
6677B41o4l6l9K13l23Q8j05J13r9o4j34L11k41J01KO3l6j16K17j21K4j8Q9k77
$$ 241 177 141 102 315 -8 80 -25 88 -11 -75 -209 102 -139 -38 -36 27 -9 -125 92 -29 -5 -23 66 -211
6701b11R0M0KK46j17n8M3j68J97o6J39k44R0KL9m3J06j06J1J55k09J6K07k34N9
$$ -211 -121 -81 -79 167 50 -8 35 -133 64 -2 137 -107 -17 -15 24 -19 87 -19 -8 147 -62 -46 161 -73 -14
6726a4RJ27o9M4k15lR8J05l9K0nk23N2J54q7j0n7P6M4n3J40k57J17Q1j47K17o0
$$ -14 -5 122 53 97 -118 -121 -23 82 43 63 58 -165 -113 41 -46 -56 -113 -37 7 -46 94 -163 -46 35 -112 105 45
6753D5o1M0l8Ll9J24l2l7j2J25k33J17Jn3o4j29K46jj48R0J15l5j90J23J64L5
$$ 45 -16 24 -14 -11 -50 74 42 5 -7 118 -115 2 3 -50 -114 -243 3 2 -146 -56 59 24 -166 -43 121 156
6779A56j41N4P1J7m3j60K28k47R6J05q3k6k59K39jj32N9PQ9q0R8r6o2pJ79l1n4
$$ 156 15 69 140 157 114 -46 182 -65 31 136 53 27 -232 7 6 -126 -67 -60 29 -51 47 -49 -111 -118 61 30 -24
6806b4P7o7J01j40J49k8K10m77J77P3M8j23o6J9l9J10J15q8l2j39j0L1J76j41
$$ -24 53 -14 87 -53 96 68 278 -199 -22 51 99 -24 -90 -71 -110 0 115 27 -5 -144 -154 -123 53 -88
6830h8p3L7J12r7L4J64o2K50j07%k34J75O2k18J2l1Kk6K26r6R9j20m8L7j25K4
$$ -88 -161 -124 -12 -109 -75 89 27 277 170 170 -64 111 173 -45 -33 -64 -62 -88 138 42 141 21 -27 10 -115 -91
6856i1N6J20L7j21J60j18j33J49o0O5J82l27J30Q8L4k77M1P3K8o6O5l9N1l9K9
$$ -91 -35 85 122 1 161 43 -90 59 -1 64 246 -81 49 137 171 -106 -65 8 36 -30 35 -4 47 8 37
6881C7J3j12J27l8N0j06J90j18m2R4r6j03K24l24J05K5K22k7j82Q9O6q5P4n12
$$ 37 50 -62 65 27 77 -29 161 43 1 95 -1 -104 120 -204 -99 -74 148 121 -61 28 94 9 83 -429
6905d29L72J9J12K2k37J2K56K1j92l0L0J06m8p6K00l3j47J20rj16KJ85m07J19
$$ -429 -57 -38 74 96 -141 -129 127 148 -44 -74 -44 62 14 -62 138 105 -42 78 69 -47 -45 140 -267 -148
6929a48J56p0N4Q7N9j30J00k0k98K2K46R3k14J74j42J71j33o1K5K80k49Q3j90
$$ -148 8 -62 -8 79 138 8 108 88 -210 -188 58 151 -63 111 -31 140 7 -54 -29 251 2 85 -105
6952a05M6R2p3K5N6j24J13k19J59m3O3J50k65r7M35j39m3R0j25l6L7J37j43K10
$$ -105 -59 33 -40 -15 41 -83 30 -189 -30 -73 -10 140 -125 -222 213 74 31 121 -4 -40 -3 134 -9 201
6976B01k18L9j06L72k44m4N3j23J87l07K57k16K65l49J30P5j07n0K05j08J32J28
$$ 201 -17 22 -84 288 44 0 53 -70 117 -190 67 -149 116 -233 -103 -28 -135 -185 20 -88 44 172
6998A72j22j28K10j75K83k64n5N6n4J58o9m1N6N2k8l2l01M1K55o9o7K75o0l31
$$ 172 50 -78 132 -43 240 -24 -79 -23 -77 81 12 -29 27 79 51 19 -282 -241 14 -55 -122 153 93 -238
7022b38K76K7j24J11Pk8J82n2j1n0q8J20L2j94M2j50Q4j84k38M97j38K97k76K34
$$ -238 38 65 -59 52 59 31 213 161 150 100 12 132 164 -30 12 -138 -54 -238 -476 21 -117 180 -96 138
7046A38k95J78L9j03J34r4m7J14O5k8j41J71Q0m9J34m57K35K2m7k6j40n6Q5J24
$$ 138 -157 21 60 -43 91 -3 -50 64 129 101 -40 131 211 162 296 -161 74 96 49 23 -117 -173 -88 36
7070C6R3J1k02J41k9o2n5j43J66Q0j26J07o1K8Mq0Q8J03j50o1j2K11K5q8O6j71
$$ 36 129 140 -62 79 50 -12 -67 -210 -44 36 -90 17 -44 -16 -12 -92 -4 99 -51 -112 -124 87 112 24 90 -81
7096h1J52q4J2P9k03o0J32J92n0j05K17l13O2n6K75l31L16j84pP4j43J46j13K33
$$ -81 71 -13 -1 78 -125 -185 -53 139 89 -16 201 -112 -50 -106 169 -162 154 -30 -37 37 -106 40 -73 160
7120A60k17p5J70l9k8J4k6J06k03L08q2J7o2p4j9o8K11J18j61J23j14N9p6j36
$$ 160 -57 -132 38 -1 -29 -15 -41 65 -138 170 88 105 43 -31 -50 -118 93 211 50 173 59 118 42 -94
7144i4n1R2m3M3P7J46k47J03L5k71K69q9L8J18j60J64j21J8j12M6K96l96K64k47
$$ -94 -145 -53 -96 -53 24 170 -77 26 61 -210 59 -30 8 126 -34 130 9 27 -85 -39 257 -139 125 -122
7168a22L29j76n0l6J86j01j68O5J19j49J13j22j9N8k2R3J24k31J36j63K56j44
$$ -122 207 31 -19 -55 131 30 -138 -73 46 -103 10 -112 -131 -73 -95 -2 122 -109 27 -136 120 -24
7190b4J53k84J66L5Q7k67K42j42q2P6o0O8n6J0n7o8R6L25l97J06J16k77J20J40
$$ -24 129 -155 11 46 133 -134 108 -34 -116 -40 -100 -32 -88 -78 -135 -203 -107 218 -179 -73 43 -234 -114 26
7214B6pj02K33j89J34J53k70Q6J19j77n6m1J07k23J68j05K21j09R7k1k3q4J91
$$ 26 19 -83 150 -39 95 248 -22 64 183 6 -50 -91 16 -207 -39 -144 77 -32 65 44 21 -63 128
7237A28r4k4J00l1k0J6Kl4J04j46L8k4n1L46l08r1J96j71J3J24q3K12j62k15L48
$$ 128 34 10 110 79 59 75 77 43 147 1 39 15 -36 310 2 -89 107 -64 -51 73 -10 202 40 -175 173
7262A73k9l6k41J97J7rj1k18L00j53l2J17J47k52j34N6O6J74j31N3J46l38J7J65
$$ 173 144 108 -133 64 81 72 61 -157 143 -10 -42 75 222 -30 -164 -108 -42 132 1 54 200 -138 -121 44
7286D4j51M7R1j54J89k5r8J81j18j84L54l34L34l4j60O9r3K27k62K34k45J20j04
$$ 44 -107 -60 31 -123 66 41 -57 124 6 -178 176 -158 176 142 -18 51 -42 185 -77 157 -88 32 -72
7309g2J07M1nm0K5l4q3R2L1n6j2J89j93k6J07o4ML1K6j39K4J86J3n7j7J3M6K0
$$ -72 35 76 71 31 56 22 -61 31 62 6 -6 183 -10 -36 71 7 11 42 68 -71 -47 139 152 95 78 91 137 157
7337A57j58j27M2J72j58J15k28J95J05j95K83k11J21J00j47N0oj30K47K9j72p2
$$ 157 -1 -128 -86 86 -72 43 -185 10 115 -80 203 -8 113 213 66 116 110 -20 227 256 84 12
7359A2p6J21J07j11q1N0J7k20J65K3m8J18k24J61l5K2Q9N9k04K63j81jK22j08
$$ 12 -64 57 164 53 -28 22 39 -181 -16 7 -41 77 -147 14 -21 1 90 149 -55 208 27 26 248 140
7383A40J9k6p3r4J49j99J22o7j15J60j57J39l9q8K73j31r1K32k46N0J29j77J11
$$ 140 159 133 60 -34 115 -84 38 -29 -144 16 -141 -2 -41 -129 144 13 -78 154 -92 -42 87 -90 21
7406B1k03K58j76R6K29j84J77k52R7k7P2k58M4Q4R8j7j55j29L53j19m7l8J10j64
$$ 21 -182 76 -100 -4 225 41 218 -34 63 36 108 -150 -106 -22 76 59 -96 -225 128 9 -38 -76 34 -130
7430a30J61J33q7Mj77J36J14m7q9j82K47QN2p5r5N6o4mJ60r4J06j49k2r0Q1j5
$$ -130 31 164 77 81 -96 40 154 107 18 -164 83 91 143 68 -27 29 -35 -39 121 27 133 -16 -38 -128 -47 -62
7456f2L9j73K82j44J63j36R9j2k41K65J8j0o7p4M8L17m05K5J39m6m1o6j35K42
$$ -62 -23 -196 86 -58 105 -31 68 56 -185 80 98 88 21 -53 -5 312 -93 -68 71 25 -16 -82 -217 25
7480B5j03K06r7J0Q0j72J29q9j5K01k79L7L63k40J8j96J15j75M8L64k80R9k61
$$ 25 -78 128 31 41 121 -51 78 -11 -26 175 -104 -67 296 56 74 -122 -7 -182 -134 230 -50 49 -212
7503b12R7K40P8k62k49K21k7J77N7j13n6J68r3K34l79K19j54MJ04R2k8j01K5n6
$$ -212 -115 125 203 -59 -308 -87 -114 63 120 7 -49 119 26 260 -119 100 -54 -50 54 146 118 17 42 -14
7527a4nL3o2j41J01L9m4J38j55k9J15J62k41K48j59J68j41J42q2J40j66j9R6q7
$$ -14 -19 14 -48 -189 -88 -49 -93 45 -110 -139 -24 138 -103 145 -14 154 13 155 73 213 47 28 124 37
7551C7O2l1j76J78r8J25j48R6j50M5j4K48o2j30J13q1k4k31K16K2O8r8J9M5n5
$$ 37 99 68 -108 70 -28 97 -51 45 -105 -60 -74 174 112 -18 95 14 -10 -241 -25 -3 65 -33 -14 31 -24
7576b4k9N0kJ02o5o6n1J5m3J68k95O7n0L04j14l2J41j91M9P2O7n5o4l5m6J38J24
$$ -24 -53 -3 -5 97 32 -34 -85 -70 -113 55 -240 -173 -223 81 -33 -65 76 -115 -66 6 73 18 -46 -81 -127 11 135
7603A35n7P6k77J21oK15k61k1J28j57l6J90J30j50j36n0R2m4Q5K44j70q5l9J21
$$ 135 78 154 -123 -2 -8 207 -54 -75 53 -104 -140 50 180 30 -106 -156 -64 -108 -23 221 51 -34 -73 48
7627D8J0K4k26J93L9j8p7K5n6J9Q4r2L4j9L1j32Q6L9k5J41r6j35R2p0K63o1j99
$$ 48 58 82 -144 49 88 70 -7 18 -38 -19 65 -27 7 -12 19 -113 -27 12 -13 128 32 -103 -11 -81 182 121 -78
7654g8J99J91m25J21n7K4r2m4J70J2q7J75q6j37J70o6K6j48J81j15p9J75K4O0
$$ -78 121 312 -113 8 -49 -25 -117 -161 9 21 -66 109 23 -114 56 -10 16 -132 49 -66 -145 30 54 114
7678A14N8j77K3j15m5Q8N0q6J27L2kq6j47R8K21r7M9m6l38L67k4j09J00k0L7j52
$$ 114 172 -5 18 -97 -142 -54 -4 -90 37 69 67 -19 -166 -68 153 56 105 59 -279 88 64 -45 55 35 72 -80
7704h0K50j51p1Q3J52j62Ol06K78m7Q3j99R0O6l0O5Q5j99o5PJ73j05J4m1J15m4
$$ -80 170 19 -52 31 183 21 27 -279 -1 -48 35 -164 -74 -8 -38 27 112 -87 -152 -145 28 -77 -63 -104 11 -33
7730c3L4l8ML45m21J47Pq6L2j8L02m31J47M9j9j20q2K21j13J71q1j36j7J43k10
$$ -33 1 -37 -33 312 -109 38 45 -41 -9 -27 275 -156 -9 40 21 -99 -181 40 -73 98 17 -119 -136 7 -203
7755b03K42l2J12k29J75o0lJ03nl1j5j42J70l03M27k31J42j20Q3j85j2J04N4J44
$$ -203 39 7 119 -110 65 5 2 105 100 69 54 -88 82 -221 206 -25 117 -3 80 -105 -117 -13 41 185
7779A85m78K45L2QJ43k18P3j00J68n1L6K6l1L6k3m0j10K33l08kK27O2n6Q6k19
$$ 185 -293 -48 -16 -8 135 -83 -10 -110 58 7 43 69 38 74 51 11 -99 134 -174 -176 51 113 57 143 -76
7804g6J35k0j29K9J05j17m1O9J06L4o1%j1J11J4k8l5p9K05k71N2l7j7K8J05nj06
$$ -76 59 39 -90 -61 44 -73 -114 -45 61 95 34 34 23 134 148 120 85 6 211 -60 -8 -45 -62 -34 71 66 -40
7831d0J27n2O4k72J33r9K83j89k8R2l9Q9J9K7k13Q0K15j40p0J51K2k33K33j58
$$ -40 87 35 99 -173 -40 -139 144 -45 -73 19 -20 69 88 115 -98 -18 197 57 -13 138 160 -73 160 2
7855Bl0O3l8r7j4J06q7J61M9j75P8K5Nj60K21ln3q1N4O7o2k5Or2R3J1j4j1p2K7
$$ 2 -28 35 -3 -100 -114 -8 -95 66 115 -60 18 43 48 -112 109 106 53 -28 26 93 31 6 12 -80 13 24 10 -1 -73 -46
7885d6n8K45k70k0O7Q2j16J62M3j02N7n1J38k41M0K49q2l2k41N0J03K5j39K63
$$ -46 -104 141 -129 -149 -82 0 -116 46 89 -13 44 -7 131 -110 -70 179 97 65 -176 -126 -23 2 -137 126
7909A26q3j62R7o0JJ12l8Q5l0j56P7j88P6K16j84J98j10K67o6j64L7p9j14m5K64
$$ 126 43 -119 -22 -82 -81 31 -7 78 48 -108 -31 -219 -143 73 -111 87 -23 244 178 14 51 -28 -142 -187 77
7934G7P0mj02j43q7P6J68K2O9k28l6J29k3po9J79k1l7J19k04J07O7k4M1j33l5
$$ 77 147 143 41 -102 -189 -113 55 77 146 -82 -118 11 -12 -19 -88 91 70 33 152 -52 55 122 98 139 6 -29
7960b9J53j41K37k07j60l7J29rj16K90N6k67J2J62l5j0j89L3L27k07J68m8N4n1
$$ -29 124 -17 220 13 -147 -184 -55 -64 -180 110 166 -101 -89 73 38 28 -161 -128 199 -8 160 112 166 115
7984A15j0k36K2K34j28j21Q7O1L4L9p5j61q2K38NR8q7j32J57j86J28L6k8k9j01
$$ 115 105 -131 -109 125 -3 -124 -37 24 58 97 22 -139 -221 17 22 120 33 -99 58 -128 0 36 8 -21 -122
8009a22J76j60R8P7j49J6J06K23k07j73N5J80j24k6km0O7k07J74l1J12j48J92
$$ -122 54 -106 -8 69 -80 -64 42 265 58 -115 -60 120 -4 -30 -32 -72 -5 -212 -38 -69 43 -105 87
8032H7j00l4L2J28k6K9r2L8m6m0n6J34Jj62Q4N3R6p7jm6j32K04k00Q3lL8P6Kp8
$$ 87 -13 -47 -15 113 87 116 24 62 16 -24 -80 54 55 -107 -23 30 126 49 48 2 -130 74 -126 -43 -46 -8 68 70 -8
8061hr7R7jQ1J25j27RJ7j41J49j41J05O1k73K76k4k57J71J14K7l11K7Oo1OK58
$$ -8 -105 -8 -9 72 197 70 79 96 -45 104 -37 68 129 -144 132 108 -149 22 136 163 -148 -121 -115 -176 -170 88
8087H8j3J19j91j12N7J93l24L54j84R5o0j19J87j3j08JK09r7R2l4p1j42J50o6
$$ 88 75 194 3 -109 -52 141 -183 171 -13 82 22 -97 90 77 -31 -30 179 82 174 140 69 -73 77 11
8111A1J30ql30J95j06Q6n7P8q7o1K93k22J09j0r0q8J17N5j74p3J29K05k15J06
$$ 11 141 133 -197 -2 -108 -22 -79 -1 -88 -149 144 -78 31 21 -69 -157 -40 15 -159 -232 -103 102 -113 -7
8135gj08R6n3j00J13j7pL43j13k12L39l18L94l30Q8n6n0mk2j7k18L24p7j28R4
$$ -7 -115 -19 -72 -172 -59 -76 -83 260 147 -65 274 -44 350 20 108 52 2 -2 -24 -41 -259 65 -12 -140 -46
8160d6J78r1j66K35k67K41m3J93l08P5K86j11j13O6j70O3k1j5J26m4j85J22j0
$$ -46 132 41 -125 110 -157 84 41 234 -74 1 287 176 63 129 -41 22 1 -14 112 68 -117 5 -5
8183em3JK16r4r8J13p6r8
$$ -5 -48 -47 169 75 -23 90 14 -84
8191h4
$$ Imaginary data points
##PAGE= N=2
##DATA TABLE= (X++(I..I)), XYDATA
0@%%%%%%%%%%%%%%%jRj6J6j6J6j6K4l2L2m0M8n5O3p2Q4r3J05j20J36j53J70j90
$$ 0 0 0 0 0 0 0 0 0 0 0 0 0 0 0 0 -1 8 -8 8 -8 8 -8 16 -16 16 -24 24 -31 32 -40 44 -49 56 -64 72 -81 89 -101
38a01K13k38K67k98L31l64M01m43M89n39N93o54P21p94Q75r65J065j179J311j462
$$ -101 112 -126 141 -157 174 -190 211 -232 257 -282 311 -343 378 -416 459 -506 559 -620 691 -771
58g71J636j842K090k394K778l284L977m984O602r600J6954o7684r1472J59340
$$ -771 865 -977 1113 -1281 1497 -1787 2190 -2794 3808 -5792 11162 -56522 -147994 11346
72A1346P3554n8331p981M2291n0882l0749P2117K9577p8861k1601M4713j4235
$$ 11346 84900 26569 18588 60879 9997 -20752 51365 80942 2081 -19520 25193 10958
84A0958m0874L9389M4405m3305n3079L0442L2411k9442k2866K2544R686k0474
$$ 10958 -29916 9473 53878 10573 -42506 -12064 20347 -9095 -31961 -9417 269 -20205
96b0205l605L0331J0914j6698P395K9879l125k7924m873J6622K219j829M028k7362
$$ -20205 -23810 6521 17435 737 8132 38011 34886 6962 2089 18711 20930 19101 23129 -4233
110d233l9767K3025N8036k991n9081k3907L2618K4527m894l438n601j8174m072
$$ -4233 -44000 -20975 37061 34070 -25011 -48918 -16300 8227 3333 -105 -5706 -23880 -27952
123b7952J5329J1659K114p12j0472j8062R273L6419J6986j4225k0538p572J5367
$$ -27952 -12623 -964 1150 438 -10034 -28096 -18823 17596 34582 20357 -181 -7753 7614
136G614K0751o063k2310p636K154q971k34K2008Q51k6651L978K6706p439k3135
$$ 7614 28365 22302 -8 -7644 -5490 -14461 -14695 7313 8164 -18487 -14509 12197 4758 -18377
150a8377J1008J8201j5396j4277J1088l589p593K9964K2886k8721k2617K8180
$$ -18377 -7369 10832 -4564 -18841 -7753 -11342 -18935 11029 33915 5194 -17423 10757
162A0757K2816k1715j4726J3926n967k8458k651K1962Q311q722m433k243o922
$$ 10757 33573 11858 -2868 11058 5091 -23367 -26018 -4056 4255 -4467 -8900 -11143 -18065
175a8065J2164K9258j295l2637j0967K1957J2886q989K502J0886j2534j4017J6355
$$ -18065 -5901 23357 22062 -10575 -21542 415 13301 4312 6814 17700 5166 -8851 7504
188G504J8104r657j4925K066o60j3614J771J6354j836j3650j312L862j507M108
$$ 7504 25608 15951 1026 3092 2432 -11182 -9411 6943 5107 -8543 -9855 -5993 -7500 -3392
202c392J4639P13k1410n350J9699R796r630l553R104j747j3790L28J0892L69n766
$$ -3392 11247 11960 -9450 -14800 4899 14695 5065 1512 10616 8869 -4921 -4593 6299 6668 902
217I02m737q559m539J0322J4578l516j6526l333Q328K758j231K371K239n784p827
$$ 902 -3835 -12394 -16933 -6611 7967 4451 -12075 -15408 -7080 -4322 -5553 -3182 -943 -6727 -14554
232a4554O541J4070M120k019j263k582m452J969J0475J941j2515p869O72J295
$$ -14554 -8013 6057 10177 8158 6895 4313 -139 1830 12305 14246 1731 -6138 -5466 -4171
246d171N769Q215j965j3426o838R119P111m611k877O63k843m391L022J2654O970
$$ -4171 1598 9813 7848 -5578 -12416 -3297 3814 -797 -3674 -3011 -5854 -10245 -7223 5431 12401
261A2401n315m906j491Q03O147O429l159j2180n271P789L772k723J905J419p727
$$ 12401 7086 2180 689 1492 7639 14068 10909 -1271 -6542 1247 5019 2296 4201 5620 -2107
276b107p291K031O679m54l709j436l782k091O610Q819L328m668n534K91K254L870
$$ -2107 -9398 -7367 -688 -1142 -4851 -6287 -10069 -12160 -5550 3269 6597 1929 -3605 -3314 -1060 2810
292B810M925j601q451m495M979P928O93j727J24n561o447K323O857J609n866o167
$$ 2810 7735 6134 -2317 -6812 -1833 6095 6788 5061 5185 -376 -6823 -4500 2357 3966 -1900 -8067
308h067j225K273P140O944j988o509k951K039M499J656p1J17m453l924M291P834
$$ -8067 -9292 -7019 121 7065 5077 -1432 -4383 -2344 2155 3811 3740 3857 -596 -4520 -229 7605
324G605K840m138m270k356k909J985O076j069o017l905J95L442M540L616j535
$$ 7605 10445 6307 2037 -319 -3228 -1243 4833 3764 -2253 -6158 -5963 -2521 2019 5635 4100
339D100p114l215K636L205J956l47k178k239k072L652P314K275m075n742k843
$$ 4100 -3014 -6229 -3593 -388 1568 1221 -957 -3196 -5268 -1616 5698 7973 3898 -1844 -4687
354d687R46K757L269p27o455l079L289L803L862K045k276n404l614L325M914J802
$$ -4687 -3741 -984 2285 1558 -4897 -7976 -4687 -884 2978 5023 2747 -2657 -6271 -2946 1968 3770
370C770j590m238k495K238M718M632J186n368n033j032K710L557q5k656m595l082
$$ 3770 2180 -2058 -4553 -2315 2403 7035 8221 2853 -2180 -3212 -502 3055 2970 314 -4281 -7363
386g363L271M949J153o96k761k903m35K831N176J076k808k179j025K002M443J478
$$ -7363 -4092 857 2010 1314 -1447 -4350 -4785 -1954 3222 4298 1490 -689 -1714 288 4731 6209
402F209j169l335m059n05K599K867J760k184l766k693R27N121K444k977m672l943
$$ 6209 5040 1705 -2354 -2859 -260 2607 4367 2183 -1583 -4276 -3349 1772 4216 1239 -3433 -7376
418g376NN480N664J603k905l474R42M423M955J489n405o251k963J165M842K363
$$ -7376 -7371 -1891 3773 5376 2471 -1003 -61 4362 9317 10806 5401 -850 -3813 -2648 2194 4557
434D557k303l264j802J001L678K845o23n871n525n79P24J553K078j012k166M08
$$ 4557 2254 -1010 -2812 -1811 1867 4712 4089 -1782 -7307 -7886 -7162 -5609 -3531 -4543 -6709 -6301
450f301K615L157K571J983p19m755k395J832K218K482J76k831k838j9M643M670
$$ -6301 -3686 -529 2042 4025 3306 -1449 -3844 -2012 206 2688 2864 33 -2805 -2824 1819 6489
466F489l02l646n056l610J599M247K070l646o092j152L243M797N271P09l976l127
$$ 6489 6187 2541 -2515 -6125 -4526 -279 1791 -1855 -7947 -9099 -5856 -1059 4212 4921 945 -2182
482b182K204O191M195l9k754n187j898M029L471j135l541l984j512N65K190J965
$$ -2182 22 6213 10408 10369 7615 2428 530 4559 8030 6895 3354 -630 -2142 -1577 613 2578
498B578j347k564k837k128J456K192N17l61k279j479K265M364M299J676r27k284
$$ 2578 1231 -1333 -4170 -6298 -4842 -2650 -2133 -2494 -4773 -6252 -3987 377 4676 6352 5425 3141
514C141k723Q06L833j83l660l836l721l50N012N282J26m268k550P3J025L973J633
$$ 3141 418 1224 5057 4874 1214 -2622 -6343 -6693 -1681 3601 3727 -541 -3091 -3018 -1993 1980 3613
531C613n673o766l24M052L656K572J484k371k757K990M449Q52n43k493m640k964
$$ 3613 -2060 -8826 -9150 -5098 -1442 1130 2614 243 -2514 476 4925 5777 5234 2741 -1899 -4863
547d863J973N280M43k794j619r17L18L011K628j088m204l427l1J050K475L121
$$ -4863 -2890 2390 2833 39 -1580 -2497 -2179 832 3460 2372 -1832 -5259 -5290 -4240 -1765 1356
563A356j302l408o01K455M476K902K8k381l293n63L075K756O43l742m511m11J064
$$ 1356 54 -3354 -3955 -1500 2976 5878 5906 3525 232 -331 2744 5500 6143 2401 -2110 -2521 -1457
580a457K077K042r60l027j870R19K882K028J383n53m717k138L105L599R01r75
$$ -1457 620 2662 1702 -1325 -3195 -2276 606 2634 4017 3464 -1253 -3391 -286 3313 4214 3239
596C239k459k260P0M031K890j267l066l795l140Q82L280J398k474m336r82K609
$$ 3239 780 -1480 -1410 2621 5511 4244 1178 -2617 -5757 -4875 -1595 -197 -2671 -7007 -7989 -5380
612e380M728M405q06k924k338J56K856L140m56l389l379R3K969K352J321q98k847
$$ -5380 -652 3753 2947 23 -2315 -2159 697 3837 3381 -8 -3387 -3294 -325 2027 3348 2450 -397
629c97j954J10P34J220l98j492k237j571K525L730J806L03j626r84K63J322K836
$$ -397 -2351 -2241 -1507 -287 -685 -2177 -4414 -5985 -3460 270 2076 2379 753 -231 32 1354 4190
646D190J289j937k536j963J007L881K410j401m478l381N52L085J964j027l935
$$ 4190 5479 3542 1006 -957 50 3931 6341 4940 462 -2919 -2367 718 2682 1655 -2280
661b280l230l96K591M573R10l291l043k83K669L651J550m79k720j400K045K927
$$ -2280 -5510 -5906 -3315 1258 2168 -1123 -4166 -4449 -1780 1871 3421 2942 222 -1178 867 3794
677C794J522J4k506l017j215J017K266q23k283j514j116n5J556J078J232j137
$$ 3794 5316 5330 2824 -193 -1408 -391 1875 1052 -1231 -2745 -3861 -3916 -2360 -1282 -50 -1187
693a187k205j219R81K789K669O9j550j864J042L708K269p3j720l663j720J417
$$ -1187 -3392 -4611 -3630 -841 1828 1897 347 -1517 -475 3233 5502 5429 3709 46 -1674 -257
709b57K762J149k770l693j209R20K586K201j087l133k591L47L045K458O43j084
$$ -257 2505 3654 884 -2809 -4018 -3098 -512 1689 602 -2531 -5122 -4775 -1730 728 1371 287
725B87k304j84L102K778R57j897j871o03m07J580J387k41j483k389q99J341J512
$$ 287 -2017 -2201 901 3679 4636 2739 868 265 -142 1438 2825 2584 1101 -1288 -2187 -846 666
742F66Q39j252k851j278L48J828K244j18r19p50m03J452K947J675j392l217j035
$$ 666 1505 253 -2598 -3876 -3528 -1700 544 426 -493 -1243 -1646 -194 2753 4428 3036 -181 -1216
759a216J031J005K042J05k852k687L63J895J635j36j400k980j768K053K659Q57
$$ -1216 -185 820 2862 2967 115 -2572 -2209 -314 1321 1185 -215 -3195 -4963 -2910 -251 606
775F06m95j050o60N05K018K471L33j993j839p34J039K129M80j114k399j438Q12
$$ 606 111 -939 -1599 -1094 924 3395 3728 1735 -104 -838 201 2330 2810 1696 -703 -2141 -1329
792a329J539N67n30j965j579l14J059K851R56r70j041m34J205J806J481K80j832
$$ -1329 210 777 247 -1718 -3297 -3611 -2552 299 1255 285 -756 -1190 15 1821 3302 3582 1750
809A750j925L06J548J272L23j178k215j268P32K037r9j257j695j893k01J605J796
$$ 1750 -175 131 1679 2951 3274 2096 -119 -1387 -655 1382 1283 26 -1669 -3562 -3763 -2158 -362
826c62O23j300j597K99J451K426J368j410j432q36N49J953J665q91j776j217l21
$$ -362 261 -1039 -2636 -2337 -886 1540 2908 1498 66 -770 -221 1732 3397 2506 730 -487 -808
843h08P42R61P18k262k534m15N46J205Q81k03j515r30M77K055R81Q77l77j339
$$ -808 -66 895 1613 -649 -3183 -3598 -3052 -1847 -966 -1169 -2684 -3614 -3137 -1082 -101 776 399 -940
861i40P2J433K059J026m38j341p96n72J142J075n08j388k333k42R95J127R00r94
$$ -940 -868 565 2624 3650 3212 1871 1075 503 1645 2720 2212 824 -1509 -1751 -756 371 1271 277
879B77k129q77P53J393J059k72j071p28oK176K102Q57p21j538o12J134Q63M54
$$ 277 -1852 -2729 -1976 -583 476 204 -867 -1595 -1601 575 2677 3534 2813 1275 663 1797 2660 3114
897C114j080j952j401p1J113J190m96q14j428n76J046R93K39r19j257p17Q93Q71
$$ 3114 2034 82 -1319 -1390 -277 913 417 -397 -1825 -2401 -1355 -362 -123 -1042 -2299 -3016 -2123 -1252
915a252K339M72j091q35L18J075J193N20j048j854j408Q32J096L83l95j294j081
$$ -1252 1087 1559 468 -367 -49 1026 2219 2739 1691 -163 -1571 -739 357 740 345 -949 -2030
932b030n61J165J705R0j297q27p37J061J597P27q6j449o56O39J187J262L17j405
$$ -2030 -2591 -1426 279 369 -928 -1755 -2492 -1431 166 893 807 -642 -1298 -659 528 1790 2107 702
950G02q29l60M58J494M19j586j536o71L70Q45J193N77j650j310J129J339J289
$$ 702 -127 -487 -29 1465 1884 298 -1238 -1909 -1539 -694 499 1076 -574 -1884 -755 584 1873
967A873J98o50j470r32J025J669K57o41o38r37J17J203J546k52k054j025n2r5
$$ 1873 2071 1421 -49 -981 44 1713 1970 1329 691 -246 -129 1074 2620 2368 314 -711 -763 -858
985h58O94M45m42j358o69P77J575R56j07P7j253o48O92J551J70q85r97m98j55
$$ -858 -164 281 -161 -1519 -2188 -1411 164 1120 1013 1090 -163 -811 -119 1432 1602 717 -280 -778 -933
1004i33J096J730k95j680j716j05J190L67K11q12k109o66J331J946P96p13o07
$$ -933 163 1893 1598 -82 -1798 -1903 -713 -346 -135 -947 -3056 -3722 -2391 -445 351 -362 -969
1021i69n54j87K234J984m70j507q09K62J016Q55J63r26j664k22O14L90L76o33
$$ -969 -1523 -1710 524 2508 2038 531 -278 -16 1000 1855 2018 1092 -572 -794 -180 210 586 -47
1039d7q46r26l02Q84R88K84n52p57n3M28R24J690M68q27q33J73J021J017J0l84
$$ -47 -893 -1819 -2121 -1237 -249 35 -517 -1274 -1327 -899 25 1715 2183 1356 523 696 1717 2734 2744 2360
1059B360j609j356K72J397N35o17j865p47n35J197K036l76j874j646M24J297J060
$$ 2360 751 -605 -333 1064 1599 982 -883 -1630 -2165 -968 1068 692 -1182 -2828 -2404 -1107 -47
1076d7O58p0j447m10J912J324M16m19r02o48o16O62J468o00j427q49m46O76l5
$$ -47 611 541 -906 -1316 596 1920 2336 1917 1015 367 -249 413 1881 1281 -146 -995 -1441 -765 -800
1095h00Q61l5j864q51O86Q04K32O04J53q95p65J143K037J04q9o09p63l96J122
$$ -800 61 26 -1838 -2689 -2003 -1199 -967 -363 -210 -1105 -1870 -727 1310 1414 1325 716 -47 -443 679
1114F79J768j23j943j050R2J18J038O80j089j642q25O92J304N24J94q62j124M09
$$ 679 2447 2324 381 -669 -577 -459 579 1259 170 -1472 -2297 -1605 -301 223 417 -445 -1569 -1160
1132a160J324J344L99j285q80R8K93R85R92m52j307j036N33P37K35Jq70j349l44
$$ -1160 164 1508 1907 622 -258 -160 133 1118 2110 1658 351 -685 -152 585 820 821 -49 -1398 -1742
1151a742K00J627O36q76n42m28l11J381J488K79j780j048Q43N83O32P04k54j567
$$ -1742 -1542 85 721 -155 -697 -1125 -1436 -55 1433 1712 -68 -1116 -273 310 942 1646 1392 -175
1169a75o80M09J110K38l22q60j359m82J187J263K3q84q63P4M16J023J254j53j346
$$ -175 -855 -446 664 902 580 -280 -1639 -2121 -934 329 352 -532 -1395 -1321 -905 118 1372 1219 -127
1188a27n07K48J167P70k6o1j433p44O45J189Mo46j299q12j70R54J384l91j024
$$ -127 -634 -386 781 1551 1525 1464 31 -713 -68 1121 1125 479 -820 -1632 -1802 -848 536 145 -879
1207h79r10L38O46J010N74J00j003l61R79P61R19l36p16q26m25Q28R85k01j282
$$ -879 -1789 -1451 -805 205 779 879 -124 -485 494 1255 2174 1838 1122 296 -129 699 1684 1483 201
1226B01j293l44K46M28O92O4j444q37N51Q55P74L39l31q17j14N90J716P36o16
$$ 201 -1092 -1436 -1190 -762 -70 -6 -1450 -2287 -1736 -881 -107 232 -99 -916 -1030 -440 1276 2012 1396
1245A396o60p01J97O63J037j09j684q74J49K69N20L97o23j227j087O33R29N11
$$ 1396 736 35 232 895 1932 1823 139 -735 -586 -317 203 600 -23 -1250 -2337 -1704 -775 -264
1263b64J88p77q22J23J151J179N28n23n92J5K11Q71P54j10j089j097J35P91K29
$$ -264 -76 -853 -1675 -1552 -401 778 1306 783 191 206 417 1288 2042 1932 843 -254 -119 672 901
1282I01L19p77j479m23L22J196J33n93p47l42k0J206J097Q0p02m77K04O51P07
$$ 901 1220 443 -1036 -1459 -1137 59 192 -401 -1148 -1490 -1510 -304 793 873 171 -306 -102 549 1256
1301A256O89m73j007n28O1J021M69p16p29r06l49O87M82n3n97p72p9J34Q45P85
$$ 1256 1945 1472 465 -63 -2 1019 1488 772 43 -863 -1212 -525 -43 -96 -693 -1465 -1544 -1410 -565 220
1321B20k87m40n11R5R40P33J47l34r51k17N73Q00N73p98q07p75J11O09Q59l05
$$ 220 -67 -507 -1018 -923 17 750 897 563 -388 -605 -32 768 1341 543 -264 -1039 -928 -319 540 235
1341B35p76o51j21Q75N88M91j49j039k85N24R31O28j73q35m73K57N14Q63j44m72
$$ 235 -541 -1192 -1313 -438 150 641 492 -547 -832 -308 623 1251 1078 243 -230 27 541 1404 1260 788
1361G88r26l70J11O60M09l86r06m54J53N77P78J72n14n67n4N38P56K16lo75n73
$$ 788 -138 -508 -397 263 672 286 -620 -1074 -921 -344 434 606 92 -475 -529 9 765 981 978 303 -270
1382b70L04O30L86J15r60q72J87K26M58P1l43o80p41K26R89L95o6n97l45K32K82
$$ -270 34 664 1050 1165 205 -667 -480 -254 204 275 -68 -748 -1489 -1263 -274 121 55 -542 -887 -655 -373
1403c73J238j37n05l30p2L03Q01K76k70o78p17L50L29L86j77j027m70l20M52O27
$$ -373 865 728 223 -107 -179 124 925 1201 931 253 -464 -114 215 601 424 -603 -1073 -1393 -941 -314
1423c14l2k59m76l99L50P70M88K35l86k74L36K39P83J46k61o40j25J75M11P9j71
$$ -314 -346 -605 -1081 -1480 -1130 -360 128 363 -23 -297 39 278 1061 1207 946 306 181 356 767 846 675
1444F75n63r01L8P29K09r8m50o82j22J43M88J109l01n16j48L1J201L82j8k95n92
$$ 675 112 -789 -751 -22 187 89 -361 -1043 -1165 -1022 -534 575 274 -242 -390 -359 842 1224 1206 911 319
1465C19j3N55K77K74n09o09k93j62M11K98k57p89o58j48N99L28j85l44l24k12
$$ 319 306 861 1138 1412 903 294 1 -161 250 548 291 -498 -1156 -1304 -705 -377 -562 -906 -1230 -1442
1485a442P72N58N13k31j93j82j07N62O30j83k37n55p3M06L08K92n27p82o08J64
$$ -1442 -670 -112 401 170 -23 -205 -312 250 880 697 460 -95 -168 238 546 838 311 -471 -1079 -915
1505i15L88O44k13n71m51j80N68R52J05m34j87k55K75Q12N02J37p56j40p0L61
$$ -915 -527 117 -96 -667 -1118 -1298 -730 222 327 -107 -294 -549 -274 538 1040 1177 421 281 211 572
1525E72M46J32q94o35j03K73N44l4k77o78p2J70K17M97m8l75l06q9N65O67K8o2
$$ 572 1018 1150 256 -379 -482 -209 335 301 24 -654 -726 -556 -339 158 110 -265 -571 -660 -95 572 600 538
1547E38m46k48K48N20K60j9p35m42K10j86N68K75p42l43k3j18N37M72j51n26n88
$$ 538 92 -156 92 612 872 853 118 -324 -114 -300 268 543 -199 -542 -565 -683 -146 326 175 -351 -939
1568i39M97O50M04J95n65m57j92N85P09K1n66m32k90%L03L10j09m63p72J39N19
$$ -939 -442 208 612 807 242 -215 -407 178 887 908 342 -90 -380 -380 -77 233 124 -339 -1111 -972 -453
1589d53K31M91l89m68j36L28P83M08j89k44o00O0P69M92j61m44m81k83J82L36
$$ -453 -222 269 -120 -588 -724 -396 387 795 606 362 -238 -178 591 1083 922 478 -3 -286 -104 232
1609B32O07p18q73k92m7P58J3J02m56o25M49P41P17K03l34m95N5K01N21M69k54
$$ 232 839 121 -752 -1044 -1091 -333 -320 -218 -674 -1299 -850 -109 608 811 477 -18 37 238 759 1228 974
1630I74l09m20m8J76K65J69m83o99m83L49K7J55k61l98j06k55O40O23J62k20j48
$$ 974 665 245 197 373 638 807 324 -375 -858 -509 -482 -327 -588 -986 -1092 -1347 -707 -84 78 -142 -290
1651b90J1L56N99N54k12p53j53K1M59L47L2o47o96m08M49M22j13m57m57k06j2
$$ -290 -279 77 676 1230 1018 265 112 133 592 939 971 324 -372 -780 -331 91 -22 -479 -936 -1142 -1154
1672a154N73L74Q6m33j70K54K90Q15K11p5o41M6M23Q19j41k53m48o43J40K61P3
$$ -1154 -581 -207 -121 -554 -724 -470 -180 635 846 771 130 176 599 1418 1277 1024 576 -67 73 334 407
1693D07j14m62o95K12k1L83J30j25n54k03O16L87L73P2Mn96J8O54N45j1m21l41
$$ 407 293 -169 -864 -652 -673 -290 -160 -285 -839 -1042 -426 -39 334 406 410 -186 -168 486 1031 1020 599 258
1715B58m98n3O24J70k91n56n21J29j27R11p4l35l99l64K48Q29K07j10k89j95J54
$$ 258 -240 -293 331 501 210 -346 -867 -738 -865 46 -28 -363 -762 -1126 -878 -49 158 48 -241 -436 -282
1736b82O95L79J68n22m46O4J5N19M8l28n62m68L69M83r2J38n16j76J09K89L61
$$ -282 413 792 960 438 -8 56 71 590 638 310 -252 -720 -351 132 40 178 -338 -514 -405 -116 245
1757B45J64m89J33j34J23M75M15k14l78k31p8L53L53q5l90o53j66J50J54J48j77
$$ 245 409 -80 53 -81 42 517 932 718 340 109 31 384 737 652 262 -391 -557 -407 -253 -105 -282
1778b82l05q1k99M86L79K56j92m05N8M76L19N28n3o81j81R7M31K76l87n07l40
$$ -282 -587 -668 -967 -481 -102 154 -38 -443 -385 91 410 938 885 204 23 120 551 827 440 -67 -407
1799d07k62K43N11q5m89m71L1J22N16K33J39m58O0N8L72O09K41m23k63j25K06
$$ -407 -669 -426 85 0 -489 -960 -929 -807 -291 -58 81 -377 -317 -259 113 722 963 540 277 152 358
1820C58L33j71Q6o85l39r0J91L08J4m82o22jQ9N74J83L2k99j57L33K98P32n8j82
$$ 358 691 520 606 -79 -418 -508 -317 -9 5 -477 -1099 -1100 -1011 -437 -254 -222 -521 -678 -345 -47 685 627 445
1843D45j12j33N44M22K0j30o23k72J81J11K64l89l90o16L0O9M03K5l47J7k90K81
$$ 445 333 200 744 1166 1186 1056 433 161 342 453 717 328 -62 -678 -648 -579 -176 -151 -498 -481 -771 -490
1865d90M76K11Q1j40l66J07N93M31K5m73j68oj75M97p7k54m05j85j16K98J00n59
$$ -490 -14 197 278 138 -228 -121 472 903 928 455 287 281 106 603 526 272 -133 -318 -434 -136 -36 -595
1887e95o3k86n5M38M07K00m09j41Q3J06N40M12k53j19k32R5K66K41L1m25l90n2
$$ -595 -658 -944 -999 -561 -154 46 -363 -504 -421 -315 225 637 384 265 33 128 394 635 666 241 -149 -201
1909b01L2J81N23m93m28j80j39L39M74O1k52l47j29M93L90J26ll07j95L77R9L94
$$ -201 -169 12 535 42 -386 -566 -705 -366 108 169 -83 -430 -559 -66 324 450 447 140 -55 322 421 815
1931H15k41m51Nl83K34Q3K08k30o55j0L43J86J81P8m75j48J14M58L45j64o4r9
$$ 815 574 123 128 -255 -21 62 270 40 -615 -625 -282 -96 85 163 -312 -460 -346 112 457 293 229 130
1953A30j90K53K96q6R6l65l29J62j9K10O8l39l16m5J95J70j10J65l64J74k0L23
$$ 130 -60 193 489 403 499 134 -195 -33 -52 158 226 -113 -429 -474 -279 -109 -219 -54 -418 -244 -264 59
1975E9K97lj67k20K0L26K38l11R0m13q7J78J06k3N6o26k53J31K47L19r1l80j31
$$ 59 356 353 186 -34 -14 312 550 239 329 -84 -171 7 113 90 146 -480 -733 -602 -355 -36 -127 -507 -638
1998f38j13M00M94m6K07j39k66NN33L02j16k46m63L55%L8K60k85k54l44nJ62J24
$$ -638 -751 -351 143 97 304 165 -101 -96 437 739 623 377 -86 269 269 307 567 282 28 -316 -321 -159 -35
2021c5k88k0k29P4l7N03r8l1j28J76K07L03K71l1l45k51J99L16j9j22j94l83J39
$$ -35 -323 -343 -572 -498 -535 -32 -130 -161 -289 -113 94 397 668 637 292 41 240 556 537 415 221 -162 -23
2044b3j03M0J97k23l76j81K3M57j07J82j77m74M16J11M53J19j0k76j7J34L49J96
$$ -23 -126 -86 111 -112 -488 -669 -646 -189 -296 -114 -291 -765 -349 -238 215 334 324 48 31 165 514 710
2066G10j86l59k38kL55O0Nk67n59J37K58j2j8j20l50q2L10J07L84k01Lm45L38
$$ 710 524 165 -73 -75 280 340 345 78 -481 -344 -86 -98 -116 -236 -586 -668 -358 -251 133 -68 -65 -510 -172
2089a72M58J48K19k76j26J05j26m3M66o57J08l23P0K09M0P1l33l52M3J66qL57
$$ -172 286 434 653 377 251 356 230 187 653 -4 104 -219 -149 60 100 171 -162 -514 -471 -305 -313 44
2111D4j65l69J35j11L78N05k72M4n9K8P6O4R5j61m45J02k86J98K49J8k09j2k40
$$ 44 -121 -490 -355 -466 -88 417 145 189 130 158 234 298 393 232 -213 -111 -397 -199 50 68 -141 -153 -393
2134c93K73K74k67J19k97p7K36L79P3q4j53j27M8J46J11N0k07k32j07K59Q9J26
$$ -393 -120 154 -113 6 -291 -368 -132 247 320 236 83 -44 4 150 261 311 104 -128 -235 24 113 239
2156B39m7m36j18J43J29J62O3q6j51o0L75J99k41Pr2k35J58J49J3K02m16j34Q1
$$ 239 192 -244 -362 -219 -90 72 135 49 -102 -162 213 412 171 178 86 -149 9 158 171 373 -43 -177 -96
2179i6J24K43r8k37p2j74j45M59j35O2k56N6O4K24J28K96j31l42p6J73K94J78
$$ -96 28 271 173 -64 -136 -310 -455 4 -131 -69 -325 -269 -205 19 147 443 312 -30 -106 67 361 539
2201E39j56k40j15L5L08J88k85n22m15K5J91l5N35m37n1j30p2O45J93k76Q0j06
$$ 539 383 143 28 63 371 559 274 -248 -663 -638 -447 -482 53 -384 -435 -565 -637 8 201 -75 5 -101
2223a01J63M27o2R1j40j25%l04L93q9j64k56n3j38J61L2J05j48k81l8Q0L52J52
$$ -101 62 489 427 518 378 253 253 -51 342 253 89 -167 -220 -358 -197 -165 -60 -208 -489 -527 -447 -95 57
2246E7l6j53M0Q0p4O51p8l4j94J0N8J74J28j24k97k92l8P5J65j56j27l16j68K22
$$ 57 21 -132 -92 -12 -86 565 487 453 259 269 327 501 629 505 208 -84 -122 -47 118 -38 -165 -481 -649 -427
2270d27M15j41p1m66M9J97N11J3J82j46j49j90M43J10k0K1k59j92K58J32k08Q0
$$ -427 -12 -153 -224 -690 -641 -444 67 80 262 116 -33 -223 220 330 310 331 72 -120 138 270 62 142
2292A42l49j76J09N5J26J03m86p6R6O9K67M2R5j65Q2K67n0J60L91m31m9j02o8
$$ 142 -207 -383 -274 -219 -93 10 -476 -552 -456 -387 -120 -78 17 -148 -66 201 151 311 702 271 222 120 52
2315E2L36j8j96j02r7k05J09J00p9l26Q1q6P3L64J13jk48r4J42N50k54K11j48
$$ 52 388 370 174 72 -25 -230 -121 -21 -100 -426 -345 -431 -358 6 119 118 -130 -224 -82 468 214 425 277
2338B77k91J82L23j44j18j13k02P7KJ57q9k94O9j96M8L59p0j75L33l04Q0J28K58
$$ 277 -14 168 491 347 229 116 -86 -9 -7 150 61 -233 -164 -360 -312 47 -23 -198 135 -169 -89 39 297
2361B97j0k7k01N7j38K73J33j26j56k63j80J80J00P2K1m78k32N05j6J95o6r4k37
$$ 297 287 260 59 116 -22 251 384 258 102 -161 -341 -161 -61 11 32 -446 -678 -173 -189 6 -60 -154 -391
2384c91L48Q1J25K26l39l8n2J74L30j65k9k12j65L5K53o8k98j64j01l42L41L29
$$ -391 -43 38 163 389 50 12 -40 134 464 299 270 58 -107 -72 181 113 -185 -349 -450 -792 -451 -122
2406a22j2j53l2J13J02N3K63M8Pp3m6J75Q8J5k29J3k43K96j38R0pk34j87o9j4
$$ -122 -134 -287 -319 -206 -104 -51 212 260 267 194 148 323 411 426 197 210 -33 263 125 215 208 -26 -213 -282 -296
2431b96K70q0k53j52k3L56P4J30L3j63O4R5K05J48P2l04j17K33l32M61O2l50n7
$$ -296 -26 -106 -359 -511 -534 -178 -104 26 59 -104 -40 55 260 408 480 176 59 292 -40 421 483 133 76
2454G6l42k6O6J6j00p5l15J02J82L56N5l71N8P8m1N91O3j2o2J2m7J7J41j63M4
$$ 76 -266 -292 -226 -210 -310 -385 -700 -598 -416 -60 -5 -376 -318 -240 -281 310 373 361 299 311 264 281 422 259 303
2479C03m15J64j39OR0j62jk65K10j08J66m6j69j1L86m8J50N5j7K7j36O5K95j03
$$ 303 -112 52 -87 -81 9 -153 -154 -419 -209 -317 -151 -197 -366 -377 9 -39 111 166 149 176 40 105 400 297
2503B97M6k39j53L2R1q6J35k73k13L9J72n4K54k10j66M6J42Q7L2Q7j56o7m7K68
$$ 297 343 104 -49 -17 74 -12 123 -150 -363 -324 -152 -206 48 -162 -328 -282 -140 -53 -21 66 -90 -157 -204 64
2527F4K67k08m6N1L8R6j34K32l92K1k06J05j45P5Q9L6j54n0P9K48M3J21k66K1
$$ 64 331 123 77 128 166 262 128 360 -32 -11 -217 -112 -257 -182 -93 -57 -211 -261 -182 66 109 230 -36 -15
2551a5M2K13Q5k26J27j29o1o1J19O5j38k70R9o1K8J17J3J15m33K16R9J59n3l8
$$ -15 27 240 325 99 226 97 36 -25 94 159 21 -249 -150 -211 -183 -66 -53 62 -371 -155 -56 103 50 12
2575A2On7K76j41L40j68l9m4j45L3J33j02l0p9k37J49J03j74M9O4j73j1P2j69
$$ 12 18 -39 237 96 436 268 229 185 40 73 206 104 74 -5 -242 -93 10 -164 -115 -51 -224 -235 -163 -332
2599c32J38O1J53k30K14L51j65j4j25r2k7K12J73k1m79J68m7j3O3j31j76PQ4p3
$$ -332 -194 -133 20 -210 4 355 190 176 51 -41 -68 144 317 296 -183 -15 -62 -75 -12 -143 -319 -312 -228 -301
2623c01k1k7K06k24K07J2K1K84Jm4Q7RJ6K45k04k12J2M8nN9O1j66n6j71J57j83
$$ -301 -322 -349 -143 -367 -160 -148 -127 157 158 114 201 210 226 471 267 55 67 115 110 169 230 64 8 -163 -6 -189
2649a89J28j46j55J43r1O0K41J9m5L5KR0J45Q9o1M8j07P7j79J04Q1k60k23K03
$$ -189 -61 -207 -362 -219 -310 -250 -9 10 -35 0 2 92 237 326 265 313 206 283 104 208 289 29 -194 9
2673Ij27J18j5p3j55j52o2J99K15j11K2m9J12J74P2j79J48p8j01jL48j34O3l7
$$ 9 -118 0 -15 -88 -243 -395 -457 -258 -43 -154 -132 -181 -69 105 177 -2 146 68 -33 -34 314 180 243 206
2697B06j25n1r1K51j66r0j17r0J57j4J38k12J5j22O9R6J93k10K29J30l03K2L04
$$ 206 81 30 -61 190 24 -66 -183 -273 -116 -130 8 -204 -189 -311 -242 -146 47 -163 66 196 -107 -85 219
2720B19n5J0K08l11k7j91M08k72p2k21k6L03j00r1K75l30K09j81L19q6o3J32j39
$$ 219 164 174 382 71 44 -147 261 -11 -83 -304 -330 -27 -127 -218 57 -273 -64 -245 74 -12 -75 57 -82
2743h2j87K39K52Q0n8k82J47k37J31J50n7q7j75O4R1q7J00k02K8j37O8L98q0j76
$$ -82 -269 -30 222 302 244 -38 109 -128 3 153 96 9 -166 -102 -11 -98 2 -200 -172 -309 -241 157 77 -99
2767i9J48r3J51q3K74j52K6o5j68K06m0J3j88j00J4j29J17q3J01j05k2K8J02R4
$$ -99 49 -44 107 24 298 146 172 107 -61 145 105 118 -70 -170 -156 -285 -168 -251 -150 -255 -277 -249 -147 -53
2791e3KJ69j13j50P3L15P4j13L0k83N9j71N80k27j01pn5j07Ko1o6L22m19n6J92
$$ -53 -51 118 5 -145 -72 243 317 204 234 -49 10 -161 419 192 91 84 29 -78 -76 -137 -203 119 -300 -356 -164
2816a64j0K10k59j48N0K04L37N3j45Q5J7k68J71L32k12k05j18K47k55%J77j89
$$ -164 -174 36 -223 -371 -321 -117 220 273 128 213 230 -38 133 465 253 48 -70 177 -78 -78 99 -90
2838i0l5j62PJ97j70J60k32j52L24J39J35Q1j21j19K24r3N1J92k12k5o6o2P7M4
$$ -90 -125 -287 -280 -83 -253 -93 -325 -477 -153 -14 121 202 81 -38 186 93 144 336 124 99 33 -29 48 92
2862I2J6j62Kp4n9J26M4r4j58m2L0J92J17j16M1R0n6j10K14K26j35N1j46Q6L3
$$ 92 108 -54 -52 -126 -185 -59 -15 -109 -267 -309 -279 -87 30 -86 -45 45 -11 -121 93 319 184 235 89 175 208
2887B08m8l5j13L7j55l1J38q1M6j92r6K07J22r9Pk5p0P0L83j40J3K67k70m3LK57
$$ 208 160 125 12 49 -106 -137 1 -80 -34 -226 -322 -115 7 -92 -85 -110 -180 -110 273 133 146 413 143 100 103 360
2913C60j74m1j40l3J08j31J38j17k47n9J38J48J11q6J89j64p4J1j47K81k1k6P1
$$ 360 186 145 5 -28 80 -51 87 -30 -277 -336 -198 -50 61 -25 164 0 -74 -63 -210 71 50 24 95
2936I5k34J57K28o0L6j69j20l1Q9l1J43k67M4j7j5p5J45j10q1J0J73J42J05j57
$$ 95 -139 18 246 186 222 53 -67 -98 -9 -40 103 -164 -120 -137 -152 -227 -82 -192 -273 -263 -90 52 157 0
2960@O9l03K20J14R3k2Rk28l8J29J00k05j62M9j25J41pn5J51r5J8q7J55Rm0L61
$$ 0 69 -234 -14 100 193 171 180 -48 -86 43 143 -62 -224 -175 -300 -159 -166 -221 -70 -165 -147 -234 -79 -70 -110 251
2986B51l09L5J03J13J30k64j1P9j62M0J51Q0j65l47l8J40K08n8J8j08q5%L17M0
$$ 251 -58 -23 80 193 323 59 48 127 -35 5 156 236 71 -276 -314 -174 34 -24 -6 -114 -199 -199 118 158
3010A58j90k97J87L20k09K19J61j22j01k1J5J47k3j01j30k5o6N0j88K37k57J12
$$ 158 -32 -329 -142 178 -31 188 349 227 126 105 120 267 244 143 13 -12 -78 -28 -216 21 -236 -124
3032a24l49K28J68k02K98j32j57J52J02L00N9k93K9R5J32J29k64K0j45N3Rj78
$$ -124 -473 -245 -77 -279 19 -113 -270 -118 -16 284 343 50 79 174 306 435 171 191 46 99 108 -70
3054g0J89k26p5l4RM4O0j52n6K33j76J70J17M8J08j00M6j72K49j04O5J01k00N5
$$ -70 119 -107 -182 -216 -207 -163 -103 -255 -311 -78 -254 -84 33 81 189 89 135 -37 212 108 173 274 74 129
3078A29L4J48l35OQ1j11k46M7K27j6p0k52Q6J43j03J14K03J32k06n5K70K6m6j13
$$ 129 163 311 -24 -18 63 -48 -294 -247 -20 -36 -106 -358 -272 -129 -232 -118 85 217 11 -44 226 252 206 93
3102I3j24q7K93M0j66K0k49K70l38M05q2j17o3L4J5J6q4J27p2Q7J17j86K98k29
$$ 93 -31 -118 175 215 49 69 -180 90 -248 157 75 -42 -105 -71 -56 -40 -124 3 -69 18 135 -51 247 18
3126A8R1J6kM4O6o1j05j7j7j34P2j00p5M7p0R4k6L9J76J7j53l5M9J78j52M00l1
$$ 18 109 125 123 167 233 172 67 50 33 -101 -29 -129 -204 -157 -227 -133 -159 -120 56 73 -80 -115 -66 112 -40 360 329
3153C29j63j34J9R2l9k3L4l02J76j28K29j95R1l1j49K58j57N8q5n7o0J19PJ78
$$ 329 166 32 51 143 104 81 115 -187 -11 -139 90 -105 -14 -45 -194 64 -93 -35 -120 -177 -237 -118 -111 67
3177F7k7KK72k44K9J24q3J32l21L8n5L5mM0r1J3j43P2L7j15j5p0J17J02K59m1
$$ 67 40 42 314 70 99 223 140 272 -49 -11 -66 -31 -35 5 -86 -73 -216 -144 -107 -222 -237 -307 -190 -88 171 130
3203A30r1j06J4L74j85m2K13j84J22k59L18j87L8j41l7k26n5L2J04J80k47KJ67
$$ 130 39 -67 -53 321 136 94 307 123 245 -14 304 117 155 14 -23 -249 -304 -272 -168 12 -235 -233 -66
3226f6N8j06j63K62o9O0q9K04j4O4J02l07J05R7p7P3o6j69K42o9Mj18L2j48j48
$$ -66 -8 -114 -277 -15 -84 -24 -113 91 77 141 243 -64 41 138 61 134 68 -101 141 72 76 -42 -10 -158 -306
3251c06K7K8Q5J73k07L6Q3J5J78J14j18j17R2J25k06K13o0j82J1k9R5j24J2l0
$$ -306 -279 -251 -166 7 -200 -164 -81 -66 112 226 108 -9 83 208 2 215 155 -27 -16 -45 50 -74 -62 -92
3275i2j31K40k17qJ62l7j54k3J62m9L3O1J60j18K83j47k6J33j38O3k36J19JM9
$$ -92 -223 17 -200 -208 -46 -83 -237 -260 -98 -147 -114 -53 107 -11 272 125 99 232 94 157 -79 40 41 90
3299I0J6k35J63o0r8R4j0M9J9j16j96J82K55j49q8J39L0P0N4j9j16k36L92j36
$$ 90 106 -129 34 -26 -124 -30 -40 9 28 -88 -284 -102 153 4 -84 55 85 155 209 190 74 -162 230 94
3323I4j30Mj96M5K19j87J37j95R5p6O4J13k9L5r6J69k68K48k03L00l4j11L9M6
$$ 94 -36 -32 -228 -183 36 -151 -14 -209 -114 -190 -126 -13 -42 -7 -103 66 -202 46 -157 143 109 -2 37 83
3347H3n6o5n1K26k2k65P7m6M5o5K9L3k9P2j26K39LP2k43Q1K13j07l7l4P4j93Q1
$$ 83 27 -38 -89 137 115 -150 -73 -119 -74 -139 -110 -77 -106 -34 -160 79 82 154 -89 -8 205 98 61 27 101 -92 -11
3374a1nL3n7o4m3j83J15J38m2jJ78m20K61k0OR9k9J93nk61J93Q7j8j8p6J80K5
$$ -11 -16 17 -40 -104 -147 -330 -215 -77 -119 -120 58 -362 -101 -121 -115 -16 -45 148 143 -118 75 162 144 126 50 230 255
3401B55J08k32k18J6K06M5k00l0J4q4k09N1Q8K73k43J84%k73J86J45M9o7J35j36
$$ 255 363 131 -87 -71 135 180 -20 -50 -36 -120 -329 -278 -190 83 -160 24 24 -249 -63 82 131 64 199 63
3425F3J96l16J92j24J0J17n6J46k27oL46n13R8J24M1j52j33p0%J31J50K3m0RK2
$$ 63 259 -57 135 11 21 138 82 228 1 -5 341 -172 -74 50 91 -61 -194 -264 -264 -133 17 40 0 9 31
3450C1l3l5J96k48J34K45q5k41nK21q0j93n6r2J48K43j87M4p6l9J9j75J60L3l5
$$ 31 -2 -37 159 -89 45 290 205 -36 -41 180 100 -93 -149 -241 -93 150 -37 7 -69 -108 -89 -264 -104 -71 -106
3475a06j2O6j60K99K4N8j30L7J76j08k2j11pJ59l09K3K62o9j65J8j52J15J68j37
$$ -106 -118 -52 -212 87 111 169 39 76 252 144 122 11 4 163 -146 -123 139 70 -95 -77 -229 -114 54 -83
3499h3O4k70O0P6J38N9m9j5lJ94m3P0j2k14K22k03r2P4k0L6k19J49K40K4l33P7
$$ -83 -19 -289 -229 -153 -15 44 -5 -20 -23 171 128 198 186 -28 194 -9 -101 -27 -47 -11 -230 -81 159 183 -150 -73
3525g3k8M9P3L8k8L8j55L57k46L3K60m21M06l52l7K62r0r0m3k5j26J51k3j48K29
$$ -73 -101 -52 21 59 31 69 -86 271 25 58 318 -103 303 -49 -86 176 86 -4 -47 -72 -198 -47 -70 -218 11
3550A1j06q4K5oJ88n8K65l66J07k25K25J77j45J98m5j81J07J12j32j43J37j84
$$ 11 -95 -179 -154 -160 28 -30 235 -131 -24 -249 -24 153 8 206 161 -20 87 199 67 -76 61 -123
3572a23m3L79l53N8j89jK02m9J61o0J3K28k29O0j34J44k1J64k05q7m0R1M8r9J92
$$ -123 -166 213 -140 -82 -271 -272 -70 -119 42 -18 -5 223 -6 54 -80 64 43 207 2 -85 -125 -34 14 -85 107
3597A07j00j08K50j23j77J9P8o7j7Q6K12j21j5p2l4L06o3j03J8R8j21K15m2J0
$$ 107 7 -101 149 26 -151 -132 -54 -121 -138 -52 160 39 24 -48 -82 224 161 58 76 174 53 268 226 236
3621B36l6Lk30k44M08L2j98J80k15On1mL4j5j06J87j32K43k08%K23j42K35L1p7
$$ 236 200 203 -27 -271 137 169 -29 151 -64 -58 -109 -113 -79 -94 -200 -13 -145 98 -110 -110 113 -29 206 237 160
3646A60k9M1M3j36k53K70k15R4k73o2K45L0OJ7j24j11M25j63k10K35k9mJ32j31
$$ 160 131 172 215 79 -174 96 -119 -25 -298 -360 -115 -85 -79 -62 -186 -297 128 -35 -245 -10 -39 -43 89 -42
3670d2L1r4O5K3J26M1k56Q8M2R4k51K25j00nJ41j5j29p9j24M3J13M4J64l27M2
$$ -42 -11 -105 -40 -17 109 150 -106 -18 24 118 -133 92 -8 -13 128 113 -16 -95 -219 -176 -63 -19 145 -182 -140
3695a40K37m3j59J49R8l2k79J88J1L1%k38K26n9O9P2k16P0K9j19Q6m9J95j36K29
$$ -140 97 54 -105 44 142 110 -169 19 30 61 61 -177 49 -10 59 131 -85 -15 14 -105 -19 -68 127 -9 220
3720B20l44K86k19J47J48r3k82J38k12K60K7Nj96J8L01j64N4j46r1J55l3q1L6
$$ 220 -124 162 -57 90 238 145 -137 1 -211 49 76 81 -115 -97 204 40 94 -52 -143 12 -21 -102 -66
3743f6qO1j78K92o1J19p5q9l8J99j33O0J1j49J21k70L51j47L1j1nl1N8j00J24
$$ -66 -74 -13 -191 101 40 159 84 -5 -43 156 23 83 94 -55 66 -204 147 0 31 20 15 -16 42 -58 66
3768F6j11j78J79o9J09J22k11k6K57q4J3k0K3j26q4J01M6P3n8p3l1j66J15K09
$$ 66 -45 -223 -44 -113 -4 118 -93 -119 138 54 67 47 70 -56 -140 -39 7 80 22 -51 -82 -248 -133 76
3792G6j37k75K34j57J04J17K3j18%L46k59nO1R3j92K60k1j34J19j04Rj51K19j27
$$ 76 -61 -336 -102 -259 -155 -38 -15 -133 -133 213 -46 -51 10 103 -89 171 150 16 135 31 40 -111 108 -19
3816a9j40J14j03J43j58J35o4m7J81n7J56k35J21P2m8J69j34j05j22J71J74j52
$$ -19 -159 -45 -148 -5 -163 -28 -92 -139 42 -15 141 -94 27 99 51 220 86 -19 -141 30 204 52
3838E2J20L6k38J21k23J10J13j06q9q8J93m6l1J93j55n5L9K2M6R7K0j44J25j32
$$ 52 172 208 -30 91 -132 -22 91 -15 -104 -192 1 -45 -76 117 -38 -93 -54 -32 14 111 131 -13 112 -20
3862b0j3K23o6j17J36l0j83J5O1L1n3j0o4l6R7j31j0O8K9p3p2L50k17P1K0J15
$$ -20 -33 190 124 7 143 113 -70 -55 6 37 -16 -26 -90 -126 -29 -160 -170 -102 -73 -146 -218 132 -85 -14 6 121
$$ [...]
8191B
##END NTUPLES=NMR FID
##END=
