##TITLE=1H_Ser 6-4_k2
 CDCl3
 8 sc, 
 19.09.2022
##JCAMPDX= 6.0         $$ Bruker NMR JCAMP-DX V2.0
##DATA TYPE= NMR FID
##DATA CLASS= NTUPLES
##ORIGIN= UXNMR, Bruker Analytische Messtechnik GmbH
##OWNER= root
$$ XWIN-NMR		Version 3.5
$$ Mon Sep 19 15:38:30 2022 Russian Standard Time (UT+4h)  she@DPX200
##.OBSERVE FREQUENCY= 200.1313499994
##.OBSERVE NUCLEUS= ^1H
##.DELAY= (6, 6)
##.ACQUISITION MODE= SIMULTANEOUS
##.ACQUISITION SCHEME= undefined
##.AVERAGES= 8
##.DIGITISER RES= 18
##SPECTROMETER/DATA SYSTEM= spect
##.PULSE SEQUENCE= zg30
##.SOLVENT NAME= CDCl3
##.SHIFT REFERENCE= (INTERNAL, CDCl3, 0, 15.7039)
##AUDIT TRAIL= $$ (NUMBER, WHEN, WHO, WHERE, WHAT)
$$ ##TITLE= Audit trail, XWIN-NMR		Version 3.5
$$ ##JCAMPDX= 5.01
$$ ##ORIGIN= Bruker BioSpin GmbH
$$ ##OWNER= she
$$ F:/spectra/data/she/nmr/H-F/1/audita.txt
$$ ##AUDIT TRAIL=  $$ (NUMBER, WHEN, WHO, WHERE, WHAT)
(   1,<2022-09-19 15:37:29.46 +0400>,<she>,<DPX200>,
      <created by zg, POWCHK disabled, PULCHK disabled
       configuration hash MD5:
       00 E9 B6 7A A2 85 ED C7 34 08 36 98 17 FE 4E 26
       data hash MD5: 16K
       A7 37 01 6C 50 1E 8C 6D 0B E4 F4 72 91 54 C4 A3>)
$$ ##END=
$$ 
$$ hash MD5
$$ 2E 66 56 C7 39 5C 13 F5 D5 B3 18 F4 8C 1F BA 58
##$RELAX= 
##$RELAX= 
##$RELAX= 
##$RELAX= 
##$RELAX= 
##$RELAX= 
$$ Bruker specific parameters
$$ --------------------------
##$DU= <F:/spectra>
##$EXPNO= 1
##$NAME= <H-F>
##$PROCNO= 1
##$TYPE= <nmr>
##$USER= <she>
##$AMP= (0..31)
100 100 100 100 100 100 100 100 100 100 100 100 100 100 100 100 100 100 
100 100 100 100 100 100 100 100 100 100 100 100 100 100 
##$AQSEQ= 0
##$AQ_mod= 1
##$AUNM= <au_zg>
##$AUTOPOS= <>
##$BF1= 200.13
##$BF2= 200.13
##$BF3= 200.13
##$BF4= 200.13
##$BF5= 200.13
##$BF6= 200.13
##$BF7= 200.13
##$BF8= 200.13
##$BYTORDA= 1
##$CFDGTYP= 0
##$CFRGTYP= 5
##$CHEMSTR= <none>
##$CNST= (0..31)
1 1 145 1 1 1 1 1 1 1 1 1 1 1 1 1 1 1 1 1 1 1 1 1 1 1 1 1 1 1 1 1 
##$CPDPRG= <>
##$CPDPRG1= <>
##$CPDPRG2= <>
##$CPDPRG3= <>
##$CPDPRG4= <mlev>
##$CPDPRG5= <mlev>
##$CPDPRG6= <mlev>
##$CPDPRG7= <mlev>
##$CPDPRG8= <mlev>
##$CPDPRGB= <>
##$CPDPRGT= <>
##$D= (0..31)
0 1.2 0 0 0 0 0 0 0 0.06 0 0.03 0 0 0 0 0.0002 0 0 0 0 0 0 0 0 0 0 0 0 
0 0 0 
##$DATE= 1663587448
##$DBL= (0..7)
120 120 120 120 120 120 120 120 
##$DBP= (0..7)
150 150 150 150 150 150 150 150 
##$DBP07= 0
##$DBPNAM0= <>
##$DBPNAM1= <>
##$DBPNAM2= <>
##$DBPNAM3= <>
##$DBPNAM4= <>
##$DBPNAM5= <>
##$DBPNAM6= <>
##$DBPNAM7= <>
##$DBPOAL= (0..7)
0.5 0.5 0.5 0.5 0.5 0.5 0.5 0.5 
##$DBPOFFS= (0..7)
0 0 0 0 0 0 0 0 
##$DE= 6
##$DECBNUC= <off>
##$DECIM= 32
##$DECNUC= <off>
##$DECSTAT= 4
##$DIGMOD= 1
##$DIGTYP= 9
##$DL= (0..7)
0 120 120 120 120 120 120 120 
##$DP= (0..7)
150 150 150 150 150 150 150 150 
##$DP07= 0
##$DPNAME0= <>
##$DPNAME1= <>
##$DPNAME2= <>
##$DPNAME3= <>
##$DPNAME4= <>
##$DPNAME5= <>
##$DPNAME6= <>
##$DPNAME7= <>
##$DPOAL= (0..7)
0.5 0.5 0.5 0.5 0.5 0.5 0.5 0.5 
##$DPOFFS= (0..7)
0 0 0 0 0 0 0 0 
##$DQDMODE= 0
##$DR= 18
##$DS= 0
##$DSLIST= <SSSSSSSSSSSSSSS>
$$ [...]
##$SUBNAM2= <"">
##$SUBNAM3= <"">
##$SUBNAM4= <"">
##$SUBNAM5= <"">
##$SUBNAM6= <"">
##$SUBNAM7= <"">
##$SUBNAM8= <"">
##$SUBNAM9= <"">
##$SW= 18.0517283424941
##$SWIBOX= (0..15)
0 0 2 0 0 0 0 0 0 0 0 0 0 0 0 0 
##$SW_h= 3612.71676300578
##$TD= 16384
##$TD0= 1
##$TE= 0
##$TE2= 300
##$TE3= 300
##$TEG= 300
##$TL= (0..7)
0 120 120 120 120 120 120 120 
##$TP= (0..7)
150 150 150 150 150 150 150 150 
##$TP07= 0
##$TPNAME0= <>
##$TPNAME1= <>
##$TPNAME2= <>
##$TPNAME3= <>
##$TPNAME4= <>
##$TPNAME5= <>
##$TPNAME6= <>
##$TPNAME7= <>
##$TPOAL= (0..7)
0.5 0.5 0.5 0.5 0.5 0.5 0.5 0.5 
##$TPOFFS= (0..7)
0 0 0 0 0 0 0 0 
##$TUNHIN= 0
##$TUNHOUT= 0
##$TUNXOUT= 0
##$USERA1= <user>
##$USERA2= <user>
##$USERA3= <user>
##$USERA4= <user>
##$USERA5= <user>
##$V9= 5
##$VALIST= <valist>
##$VCLIST= <CCCCCCCCCCCCCCC>
##$VD= 0
##$VDLIST= <DDDDDDDDDDDDDDD>
##$VPLIST= <PPPPPPPPPPPPPPP>
##$VTLIST= <TTTTTTTTTTTTTTT>
##$WBST= 1024
##$WBSW= 4
##$XGAIN= (0..3)
0 0 0 0 
##$XL= 0
##$YL= 0
##$YMAX_a= 127329
##$YMIN_a= -251060
##$ZGOPTNS= <>
##$ZL1= 120
##$ZL2= 120
##$ZL3= 120
##$ZL4= 120
##$ABSF1= 10
##$ABSF2= 0
##$ABSG= 5
##$ABSL= 3
##$ALPHA= 0
##$AQORDER= 0
##$ASSFAC= 0
##$ASSFACI= 0
##$ASSFACX= 0
##$ASSWID= 0
##$AUNMP= <proc_1d>
##$AZFE= 0.1
##$AZFW= 0.1
##$BCFW= 1
##$BC_mod= 2
##$BYTORDP= 1
##$COROFFS= 0
##$CY= 11.3945322036743
##$DATMOD= 1
##$DC= 2
##$DFILT= <>
##$DTYPP= 0
##$F1P= 2.36226072786647
##$F2P= -0.459571619588291
##$FCOR= 0.5
##$FTSIZE= 0
##$FT_mod= 4
##$GAMMA= 1
##$GB= 0.15
##$INTBC= 1
##$INTSCL= 1
##$ISEN= 128
##$LB= 0.24
##$LEV0= 0
##$LPBIN= 0
##$MAXI= 10000
##$MC2= 0
##$MEAN= 0
##$ME_mod= 0
##$MI= 1.114404
##$NCOEF= 0
##$NC_proc= 0
##$NLEV= 6
##$NOISF1= 3.799351
##$NOISF2= 2.8
##$NSP= 1
##$NTH_PI= 0
##$NZP= 0
##$OFFSET= 15.70392
##$PC= 1
##$PHC0= -18045.76
##$PHC1= 26.20069
##$PH_mod= 1
##$PKNL= yes
##$PPARMOD= 0
##$PSCAL= 0
##$PSIGN= 0
##$REVERSE= no
##$SF= 200.130013532006
##$SI= 16384
##$SIGF1= 3
##$SIGF2= 2
##$SINO= 400
##$SIOLD= 16384
##$SREGLST= <1H.CDCl3>
##$SSB= 0
##$STSI= 0
##$STSR= 0
##$SW_p= 3612.71676300578
##$SYMM= 0
##$S_DEV= 0
##$TDeff= 0
##$TDoff= 0
##$TI= <>
##$TILT= no
##$TM1= 0
##$TM2= 0
##$TOPLEV= 0
##$USERP1= <user>
##$USERP2= <user>
##$USERP3= <user>
##$USERP4= <user>
##$USERP5= <user>
##$WDW= 1
##$XDIM= 8192
##$YMAX_p= 0
##$YMIN_p= 0
$$ End of Bruker specific parameters
$$ ---------------------------------
##NTUPLES= NMR FID
##VAR_NAME=  TIME,          FID/REAL,        FID/IMAG
##SYMBOL=    X,             R,               I
##VAR_TYPE=  INDEPENDENT,   DEPENDENT,       DEPENDENT
##VAR_FORM=  AFFN,          ASDF,            ASDF
##VAR_DIM=   8192,          8192,            8192
##UNITS=     SECONDS,       ARBITRARY UNITS, ARBITRARY UNITS
##FACTOR=    0.0002768,     1,               1
##FIRST=     0,             0,               0
##LAST=      2.2672688,     0,               0
##MIN=       0,             -251060,         0
##MAX=       2.2672688,     127329,          0
$$ Real data points
##PAGE= N=1
##DATA TABLE= (X++(R..R)), XYDATA
$$ [...]
1899h42R59R5o17J68L71l60J65P17O24j084p27M93P61L15r72K4n9k67k7R16K41
$$ -842 117 212 -405 -237 134 -226 -61 656 1280 196 -531 -38 723 1038 66 90 31 -236 -263 653 894
1920H94j337l54P54M49n51P2j8l09n78Q79R04k84p16j70N60J10J32J49j96k53
$$ 894 -443 -797 -43 406 -145 -73 -91 -400 -978 -99 805 521 -195 -365 195 305 437 586 390 137
1940A37m59M64J135j20q67q1ol55L99P96n39p78o39P38M98P8l1o76j20k78J09
$$ 137 -322 142 1277 1157 290 209 203 -152 247 1043 504 -274 -913 -175 323 401 370 -306 -426 -704 -595
1961e95J041k3o73o21P57M35k20L67K57r65l58J003L03m23l78M79q17K23N09L42
$$ -595 446 423 -250 -871 -114 321 101 468 725 -240 -598 405 708 285 -93 386 -431 -208 301 643
1981F43m93n30m50O23N00m3o74PJ00o28M82R41m02j172M62K59j54R50K86p42r00
$$ 643 150 -380 -830 -207 293 250 -424 -417 -317 -945 -463 478 76 -1096 -634 -375 -529 421 707 -35 -935
2002i35L70K22N36O05o23m16Q3l5J66J324q10j091m38P99J29j4M16j58j046j38
$$ -935 -565 -343 193 798 175 -241 -158 -193 -27 1297 487 -604 -1042 -243 -114 -128 288 130 -916 -1054
2022a054N70P67o29l51j33L9M51K55K5p9j2k53P05M64l78p07M97n5n03N98O84
$$ -1054 -484 283 -346 -697 -830 -791 -340 -85 -60 -139 -151 -404 301 765 387 -320 177 122 -381 217 901
2043I01q18q95N72J77j36N11j75o88m58R9O42P98k38r90m05Q87j41K95O36M5j257
$$ 901 83 -812 -240 -63 -199 312 137 -551 -1009 -910 -268 530 292 -698 -1103 -216 -357 -62 574 619 -638
2064f38m73J292N73l84o3k07j094O93N75O05j02r27m92M56N27k38m15O42p36o94
$$ -638 -1111 181 754 370 307 100 -994 -301 274 879 777 -150 -642 -186 341 103 -312 330 -406 -1100
2084a100O53R42o60o96L77N22o04J14R72n19p43r7J002N42l59n88J51J02k34J70
$$ -1100 -447 495 -165 -861 -484 38 -566 -452 520 1 -742 -839 163 705 346 -242 -91 11 -223 -53
2104e3Q69k21j579J58J411P7m87M06n94q74j62J341L29q00l99j51MP04M74k23
$$ -53 816 595 -984 -826 585 662 175 581 -13 -887 -1049 292 621 -179 -578 -729 -725 -21 453 230
2124B30M5q79p35J062R76p60n79O57k17m01P87R97n74j006M92K76j17l0K8n80
$$ 230 275 -604 -1339 -277 699 -61 -640 17 -200 -601 186 1183 609 -397 95 371 254 224 252 -328
2144c28j46L80l6O47j03j403J86J253m50n09M35oj102N56J272m40l32n8j9L7M27
$$ -328 -474 -94 -130 517 414 -989 -803 450 0 -509 -74 -80 -1182 -626 646 206 -126 -184 -203 -166 261
2165B61N98j65o78m23l03J140N47q18l45O05n91m26J000O40j052p25M10P8j30
$$ 261 859 694 16 -407 -710 430 977 159 -186 419 -172 -598 402 1042 -10 -735 -325 -247 -377
2184c77L81K20p77k14N44K09J07o9r27N03N53k52O5M93m4q80L49J373n37q47L96
$$ -377 4 224 -553 -767 -223 -14 93 24 -903 -400 153 -99 -34 459 415 -465 -116 1257 720 -127 269
2205B69j08k95J74M60l03l62n76K25P12J71n31l73J98k46K9Q11K13j115K6P00
$$ 269 161 -134 40 500 197 -165 -741 -516 196 367 -164 -537 -339 -585 -556 255 468 -647 -621 79
2225G9K19m30P61Oq54L2N68N5k03pj50k02L92k53J48N88r45m62P21K52o60J77
$$ 79 298 -132 629 635 -219 -187 381 436 233 226 76 -126 266 13 161 749 -196 -658 63 315 -345 -168
2247a68j22J66o26N08N36m98j30K1L53j21k5M06k40k14j50L08N94j7m24m3R1k47
$$ -168 -290 -124 -750 -242 294 -204 -334 -313 40 -81 -106 300 60 -154 -304 4 598 581 157 114 205 -42
2269d2n9O17l79p89M7N46J1Q6p7r8k38j26J65M44k08o59R8N11L22j83J48K10m31
$$ -42 -101 516 137 -652 -605 -59 -48 38 -39 -137 -375 -501 -336 108 -100 -759 -661 -150 172 -11 137 347 -84
2292h4j22L82L90l90k90M45q3J4q1N30m88n16nL44N1m45K01J40l48j09J84N86
$$ -84 -206 176 566 176 -114 331 248 262 181 711 223 -293 -298 46 97 -348 -147 -7 -355 -464 -280 306
2314C06k95m86P6M22Qo7L30n3o11R6M31K54k17k77NR9j52M06M97l24q97P3O03
$$ 306 11 -475 -399 23 31 -36 294 241 -370 -274 157 411 194 -83 -78 21 -131 275 772 448 -449 -376 227
2337B27J47j2k73l21j11k14M48Q73p04o87M3N88Lj8L08j07o75j99R94M58l96p72
$$ 227 374 362 89 -232 -343 -557 -109 764 60 -627 -584 4 7 -11 297 190 -485 -684 310 768 372 -400
2359d00N66L8j75J46L47K44j102o9N07N11n14k91K61l94m12N44Q20p23o89n6M57
$$ -400 166 204 29 175 522 766 -336 -405 102 613 99 -192 69 -325 -737 -193 627 -96 -785 -841 -384
2380c84K96O7K23L2q76n4J093K89m75m51J66p2K99M06K62k26r56L3O87L85o27
$$ -384 -88 -21 202 234 -642 -696 397 686 211 -240 -74 -146 153 559 821 595 -361 -328 359 744 117
2401A17j9J28l93j27M86M94n53o82j21O46Q9Q6K22m52l39J35P28L80n35o82J77
$$ 117 98 226 -167 -294 192 686 133 -549 -670 -24 65 151 373 -79 -418 -283 445 825 290 -392 -215
2422b15N70Q1k52M90k92p32MP27L63k77p62K72N5m0O4M46n51p18M07L98L20k14
$$ -215 355 436 184 674 382 -350 -346 381 744 467 -295 -23 32 -8 56 502 -49 -767 -360 38 358 144
2444A44j74k35j09p4N41M35n37n63L29N22M1J13J29m31k75P3L64Jj52j07l06K70
$$ 144 -30 -265 -374 -448 93 528 -9 -572 -243 279 320 433 562 131 -144 -71 293 294 142 35 -271 -1
2466aj51L79J21j66m80j82O00j58k07M47j80p11J71Q21k36n5O8q0j49M01K9j97
$$ -1 -152 227 348 182 -298 -480 120 -38 -245 202 22 -689 -518 303 67 12 80 0 -149 252 281 84
2488H4J14j27l04M71L85p18k38M73Jl56M89J63m80n93L94K00k32J95j98j02L38
$$ 84 198 71 -233 238 623 -95 -333 140 141 -215 274 437 -43 -636 -242 -42 -274 -79 -277 -379 -41
2509d1r1K3K18M3n50k6N57j14j95M38J17o87L84M71j85m28J20L35p87M97M59m45
$$ -41 -132 -109 109 152 -398 -424 133 19 -176 262 379 -308 76 547 362 -66 54 389 -398 99 558 113
2531A13Q1l30o0K44k5P9q1J84l84m55M78K55n82P3R44o72j84M53K68n35j64P86
$$ 113 194 -136 -196 48 23 102 21 205 -179 -634 -156 99 -483 -410 534 -138 -322 131 399 -136 -300 486
2553D86K6r5n16k57K33M88K8j56L81o05n01N74O05p79m55P00l59l98N16N58n30
$$ 486 512 417 -99 -356 -123 365 393 237 618 13 -488 86 691 -88 -543 157 -202 -600 -84 474 -56
2574e6m24Q3L53j54M38k36l18O42p48K4R76M7q29N1O75p84j7Q57m2q13J18M33
$$ -56 -480 -397 -44 -198 240 4 -314 328 -420 -396 580 627 -202 -151 524 -260 -277 580 538 -275 -157 276
2596B76l03k1K95m12m17P15m64J31J24m32k90Q45N59p06k00L59l36l96J016L62
$$ 276 -27 -48 247 -165 -582 133 -331 -200 -76 -508 -798 47 606 -100 -300 59 -277 -673 343 705
2616G05q07m03Q29j42J26J83j61l22Q0k57L4N98n5q55J96Ol28J05P81o6j087M62
$$ 705 -102 -505 324 182 308 491 330 8 88 -169 -135 463 408 -447 -251 -245 -573 -468 313 247 -840 -378
2638c78M31m23L11K75j75l82M09k0L41j02k16n1N08r2k75j01J02l58l10J143P1
$$ -378 53 -370 -59 216 41 -341 68 48 389 287 71 20 528 436 161 60 162 -196 -506 637 708
2659G08r84J44j17k3J0M37L90q85o9J22K62K22n0n58J36L22m29M93N49o92m09
$$ 708 -276 -132 -249 -272 -262 175 565 -320 -389 -267 -5 217 167 -391 -255 67 -362 131 680 -12 -421
2680d21R5O04k55L76K06j29j005N03L18J16k50j67l21M55l11Q2L08j01l33j33
$$ -421 -326 278 23 399 605 476 -529 -26 292 408 158 -9 -330 125 -186 -104 204 103 -230 -363
2700c63O36O5o57NK34l11O0P29q5l76J45R0OL15j76k01m9k04M3K01K87j84o30
$$ -363 273 338 -319 -314 -80 -391 -331 398 313 -63 82 172 178 493 317 116 67 -137 -94 107 394 210 -420
2723d20L25K1r9K53K47n38l74m1Q11j46o0N0n2m68M17K70M64q66j11K24p0P04
$$ -420 -95 -74 -173 80 327 -211 -585 -626 185 39 -21 29 -23 -491 -74 196 660 -206 -317 -93 -163 541
2745E41m89K13j16n20J4N72M51l82m14j1J10k39K49K06m78l43m6J128m42k46P5
$$ 541 52 265 149 -371 -357 215 666 284 -130 -141 -31 -270 -21 185 -293 -636 -682 446 4 -242 -167
2766a67J92j58l25N47J51m73j46K23J15L53k10n1O9j89p3L56O0k18k22K19K1j62
$$ -167 25 -133 -458 89 240 -233 -379 -156 -41 312 102 51 120 -69 -142 214 274 56 -166 53 74 -88
2788h8L05M1k28l84K8J62J42j80L74k08k72J56M93j48k09j54l5L11k54M64j94
$$ -88 217 258 30 -354 -326 -164 -22 -202 172 -36 -308 -152 341 193 -16 -170 -205 106 -148 316 122
2809A22J33n33N7M70L01k80Lk06o1K44j88L49l54o43J68L21J06P5l87M77m46J56
$$ 122 255 -278 -221 249 550 270 273 67 6 250 62 411 57 -586 -418 -97 9 84 -303 174 -272 -116
2831a16L51j37l61J21j02L31j79J16J38k54j52MM09M5l18j57M19o5N9O1K42n74
$$ -116 235 98 -263 -142 -244 87 -92 24 162 -92 -244 -240 169 214 -104 -261 158 93 152 213 455 -119
2853a19l32N62K77l22l73O0K08K5k69J34K89l55Q8j46L28j57J1J98j10k32M03
$$ -119 -451 111 388 66 -307 -247 -39 -14 -283 -149 140 -215 -127 -273 55 -102 -91 107 -3 -235 168
2874A68j7J41k07j59M17j15J34o1R5m26k36M13o8J63n46L73j98j18L07o3J16l56
$$ 168 151 292 85 -74 343 228 362 301 396 -30 -266 147 79 242 -304 69 -129 -247 60 -3 113 -243
2896b43J40n0K08Q0l11J70j17K00o4L92J27r01L55L88M8n13M66l7l94M5K24K34
$$ -243 -103 -153 55 135 -176 -6 -123 77 13 405 532 -369 -14 374 422 -91 375 338 -56 -11 213 447
2918D47l85j66J54M0j63j65J06k00j51J11L87J97m80L2L96j11k61N02Qj41l09
$$ 447 62 -104 50 90 -73 -238 -132 -332 -483 -372 15 212 -268 -236 160 49 -212 290 298 157 -152
2939a52L40j02L1P1j44J99P1n22L17k69M69o88J38L55k40J55m1J7m71P0N09k97
$$ -152 188 86 117 188 44 243 314 -208 109 -160 309 -379 -241 114 -126 29 -12 5 -466 -396 113 -184
2961a84J0k70K12J48n2Q2K82j00l64L9L11J81l75j62M64j9l35K71L45m16j56K2
$$ -184 -174 -444 -232 -84 -136 -54 228 128 -236 -197 114 295 -80 -242 222 203 -132 139 484 68 -88 -66
2983f6J34k46K63j36k26j0l9L59J79k01k73J09K07j99J13R3rm03L53M59l74J9
$$ -66 68 -178 85 -51 -277 -287 -326 33 212 11 -262 -153 54 -145 -32 61 52 -351 2 461 87 106
3005A06L9k6j60Q8L32k25P1n3k92L37J17l39k22L16l85m5L88J23o21j00M86k34
$$ 106 145 119 -41 47 379 154 225 172 -120 217 334 -5 -227 89 -296 -341 47 170 -451 -551 -65 -299
3027b99J0N73o2l28o5l1L46K13j46j19k09Q4l5J20N40o64l12N37K0o33O16j25
$$ -299 -289 284 222 -106 -171 -202 144 357 211 92 -117 -33 -68 52 592 -72 -384 153 173 -460 156 31
3049C1j5n26L76J96M0j90K5j33J22K12k36P0j95J6L2O35j8o25J72K81l09P2N14
$$ 31 16 -510 -134 62 102 -88 -63 -196 -74 138 -98 -28 -223 -207 -175 460 442 -183 -11 270 -39 33 547
3072E47j54n48p5K92mN7J00k05m1j4k8J58J50k18l41J14r5j21L71N60n84k63J81
$$ 547 393 -155 -230 62 58 115 215 10 -31 -45 -73 85 235 17 -324 -210 -305 -426 -55 505 -79 -342 -161
3095a61N87n53J87J0K51o59K11K18K01j80j57K16n6J47k30K8q8k31k8L99j20m38
$$ -161 426 -127 60 70 321 -338 -127 91 292 112 -45 171 115 262 32 60 -28 -259 -287 112 -8 -446
3117d46M22q5K99k74m7L95k33m85N91J14j6j54j06J39k71K39J97M77r63K11R7
$$ -446 -24 -109 190 -84 -131 264 31 -454 137 251 235 81 -25 114 -157 82 279 756 -207 4 101
3138A01J21k96K66P5m19k30K80K31J70k22m82J35j85M50L55q4j94m69K18L87k90
$$ 101 222 -74 192 267 -152 -382 -102 129 299 77 -405 -270 -455 -5 350 266 72 -397 -179 208 -82
3159h2k61M80m7n9k73P14K3o56K76J62r9j41N8K5P5k6pK6m5k5k59J21J43j08n5
$$ -82 -343 137 90 31 -242 472 495 -161 115 277 178 37 95 120 195 169 162 188 143 118 -141 -20 123 15 -40
3184d0K03k20k31M16J3k27j3K67l68qj5L90Q4p4l88K72K95j73m47M31J31o13K52
$$ -40 163 -57 -288 128 141 -86 -99 168 -200 -208 -223 167 251 177 -211 61 356 183 -264 167 298 -315 -63
3207f3O43k58m11j55K57l0J70q0l42k44K27J68R3n4k53K01J34k2J11R2j4k02l08
$$ -63 580 322 -89 -244 13 -17 153 73 -269 -513 -286 -118 -25 -79 -332 -131 3 -19 92 184 170 -32 -340
3230c40O61K4j90n9J61k99N7M11k86j59M5P8J47l39l6j04m2M75n58R6L95l17j91
$$ -340 321 345 155 96 257 -42 15 426 140 -19 26 104 251 -88 -124 -228 -270 205 -353 -257 138 -179 -370
3253c70K95J46l24L76j63j7J66j15L75j29j11L0k37O9K35k04K34j56j66j92N40
$$ -370 -75 71 -253 123 -40 -57 109 -6 369 240 129 159 -78 -9 226 22 256 100 -66 -258 282
3274B82j70j61K29r1j84j20L13j63r7J05J65j03l7J56Q0m10k4J03L81p2j77J10
$$ 282 112 -49 180 89 -95 -215 98 -65 -162 -57 108 5 -32 124 204 -206 -230 -127 254 182 5 115
3296A15O0J4j8J62j6m44PK51K25o8j09j53j39P3K6K95k91j23j44j05K97j49l1
$$ 115 175 189 171 333 317 -127 -120 131 356 288 179 26 -113 -40 -14 281 -10 -133 -277 -382 -85 -234 -265
3319b65K26J2k44J10N27j71j52K9K43m83m9N51j56qj33k95K52J92l38J9L21j04
$$ -265 -39 -27 -271 -161 366 195 43 72 315 -168 -217 334 178 170 37 -258 -6 186 -152 -133 188 84
3341H4j76L43q1n65K30L76j22J11j21J13l82k34K79L54k00N4l20L30j9l4K58j44
$$ 84 -92 251 170 -395 -165 211 89 200 79 192 -190 -424 -145 209 9 63 -257 73 54 20 278 134
3363A34p5k66Q7K51p1k5K0K6m62K4N12J8k86j83J80J23p2K9K8j41l65L37K17R0
$$ 134 59 -207 -120 131 60 35 55 81 -381 -357 155 173 -113 -296 -116 7 -65 -36 -8 -149 -514 -177 40 130
3387A30j48K8J97k62k1M11j82j10m12K64L21Rl9j38J45o04K03K19L5j55k63J42
$$ 130 -18 10 207 -55 -76 335 153 43 -369 -105 216 225 186 48 193 -411 -208 11 46 -109 -372 -230
3409b30K35j32l7K11nk52K59L0p9j45K62p4j04J63K14k31l07j4J9L92M3l11J29
$$ -230 5 -127 -164 47 42 -210 49 79 0 -145 117 43 -61 102 316 85 -222 -236 -217 175 218 -93 36
3432C6R4J82l16M00l18l97J66K11j64J44m9Lm11m3K64M93k38k75L01j4k7k04L31
$$ 36 130 312 -4 396 78 -319 -153 58 -106 38 -11 -8 -419 -462 -198 295 57 -218 83 69 42 -162 169
3455A69q6k91l25P48N6j75j93K74j75r1K01Q0j11k09k73L63Ol5m4J59k01j16M19
$$ 169 83 -208 -533 215 271 96 -97 177 2 -89 112 192 81 -128 -401 -38 -32 -67 -111 48 -153 -269 150
3478A50R0j00k72L48k12n6N2M00l87j90J38K04J84k92o8NJ87k47J23L5K42l97
$$ 150 240 140 -132 216 4 -52 0 400 13 -177 -39 165 349 57 -11 -6 181 -66 57 92 334 -63
3500f3k28K81J02r5M4J38j66k58RL78j81j45R3o5K11k08J73j8K2m4J61J60k29
$$ -63 -291 -10 92 -3 41 179 13 -245 -236 142 -39 -184 -91 -156 55 -153 20 2 24 -20 141 301 72
3523G2j43J67P7M4m32M30k95qo1J42R4j66k8k40J46PN7K7J87j36J45j7j85K14
$$ 72 -71 96 173 217 -215 215 -80 -88 -149 -7 87 -79 -107 -347 -201 -194 -137 -110 77 -59 86 69 -116 98
3547I8l9J14n20K57K09P0j25qP0j52N1R9K19k14j14J04n9K8j03k40L10L57p39
$$ 98 59 173 -347 -90 119 189 64 56 126 -26 25 124 343 129 15 119 60 88 -15 -255 55 412 -327
3570c27N79j0l16k27L73j47k20L70jl08J72J67j19M0K76l56j99K16J20oQ0J2k06
$$ -327 252 242 -74 -301 72 -75 -295 75 74 -234 -62 105 -14 26 302 -54 -253 -37 83 77 157 169 -37
3593c7K12j16P2j72k11K44m62K06J67N7L2N6m22J95L50m49O1O0J31j38Q5j4J43
$$ -37 175 59 131 -41 -252 -8 -470 -264 -97 -40 -8 48 -374 -179 171 -278 -217 -157 -26 -164 -79 -93 50
3616E0k25L39M5k34L4M74o80J90K6J70k97J10K69m02K33j68L47m53K57j84k22
$$ 50 -175 164 209 -25 9 483 -197 -7 19 189 -108 2 271 -131 102 -66 281 -172 85 -99 -321
3637c21%L76j23L91k79j04j26M38l0j65J5j11p5Q9P6n8R7J13j11n6O33o79K1J73
$$ -321 -321 55 -68 323 44 -60 -186 252 222 57 72 -39 -114 -25 51 -7 90 203 92 36 669 -10 11 184
3661A84k69N4j81N53n86j25N03M4m54K31K58j50m15L29r0J13J27l79L30K14j84
$$ 184 -85 -31 -212 341 -245 -370 133 177 -277 -46 212 62 -353 -24 -114 -1 126 -253 77 291 107
3682A07m7J49m6o32O55K28m83o6L84l94o0K99k5k2l36K03j03K05J06j00l42K31
$$ 107 60 209 163 -469 186 414 -69 -135 249 -145 -205 94 69 47 -289 -86 -189 16 122 22 -320 -89
3704h9J6j88L71k4j61j53J15J6l4M09L5m38N7J70j00J1K22k37j9K45l37L30j34
$$ -89 -73 -261 110 86 -75 -228 -113 -97 -131 278 313 -125 -68 102 2 13 235 -2 -21 224 -113 217 83
3727H3k39r4K38J47l21R4K27j46j65L34j39l37J63R2J03N4j18j19q8K23j04K21
$$ 83 -156 -250 -12 135 -186 -92 135 -11 -176 158 19 -318 -155 -63 40 94 -24 -143 -231 -8 -112 109
3749A09J71q9k40K9K7p2j22M13k61m55K40L38j60j25J11j06O0r8kK70J42j64j60
$$ 109 280 191 -49 -20 7 -65 -187 226 -35 -490 -250 88 -72 -197 -86 -192 -132 -230 -232 38 180 16 -144
3772a44K14N9n2j74K18n3j89R1J11m5J8j90K07M1o5J57n8j02k03L60k96N8j48
$$ -144 70 129 77 -97 121 68 -121 -30 81 36 54 -136 71 112 47 204 146 44 -159 201 -95 -37 -185
3795a85K01o5J05J61n4j60Q8l56L58j42JK1N5M9J7L66j87k43n6J05N1k27J12J62
$$ -185 16 -49 56 217 163 3 91 -265 93 -49 -48 -27 28 77 94 460 273 30 -26 79 130 -97 15 177
3819A77J4k09J84j41J48m06K75J1k34q2Q8Q8j12p3J25o2j51J98J40k2j69J03K9
$$ 177 191 -18 166 25 173 -233 42 53 -181 -263 -175 -87 -199 -272 -147 -209 -360 -162 -22 -44 -213 -110 -81
3842h1K91j48J32J31l43m1R8J12k20j11J46O0R5n7M8o2m8k19J25j47K50Q9k89
$$ -81 210 62 194 325 -18 -59 39 151 -69 -180 -34 26 121 64 112 50 2 -217 -92 -239 11 100 -189
3865a89K15k65K43K2j13L1j63K68K0R1k29L0L26l09J92o6J87m26J01J19j00jJ41
$$ -189 26 -239 4 26 -87 -56 -219 49 69 160 -69 -39 287 -22 170 104 291 -135 -34 85 -15 -16 125
3888A25K3j27j09O3K00L1k04k28K44r2l8J01k0l71J78Q7M38k74L7j09J85K2j21
$$ 125 148 21 -88 -25 175 206 2 -226 18 -74 -112 -11 -31 -402 -224 -137 301 27 64 -45 140 162 41
3911D1J44m9j99J99J21j84j9r6R0J41l49R8M9l5k04J78Q4O1k88%R2K34k24J38
$$ 41 185 136 -63 136 257 73 54 -42 48 189 -160 -62 -13 -48 -252 -74 10 71 -217 -217 -125 109 -115 23
3935B3P7r1r8n3N9j81N88l49J23l92N83k74L49k58l32L13o3k70J01J94k72j05
$$ 23 100 9 -89 -142 -83 -264 324 -25 98 -294 289 15 364 106 -226 87 24 -246 -145 49 -223 -328
3957c28K18K30n9j14L86m75jJ88l2N4M0l81L24M6j82L05J2k83l1J29r8K19j98
$$ -328 -110 120 61 -53 333 -142 -143 45 13 67 107 -274 50 96 -86 219 231 -52 -83 46 -52 167 -31
3980c1J60N0M5j32r5J31r5r6o4J73o5J84k65K6r5L00j87lJ51l39R4J90J22j64
$$ -31 129 179 224 92 -3 128 33 -63 -127 46 -19 165 -100 -74 -169 131 -56 -59 92 -247 -153 37 159 -5
4004ek20L65k18J7K97k22R9Q4O9m72K37J7MJ38j66Q2p3K30l82M9O5J80m55ON56
$$ -5 -225 140 -78 -61 236 14 113 197 266 -206 31 48 52 190 24 106 33 263 -119 -70 -5 175 -280 -274 282
4029B82m24J19p7K04j40K43J13l73K6M2l9M11l72q7K71M7Lqj58J06k25m3K54k06
$$ 282 -142 -23 -100 104 -36 207 320 -53 -27 15 -24 387 15 -72 199 246 249 241 83 189 -36 -79 175 -31
4053c1j94J41j02K56j68J69k12J12j37K43K1J91l13N6K57j09l20K19J30l25R1
$$ -31 -225 -84 -186 70 -98 71 -141 -29 -166 77 98 289 -24 32 289 180 -140 79 209 -116 -25
4074b5J82k5l2M4nk23q3K51q4k16L21m55M82j29k94K50K14j99j17J70j00J55k50
$$ -25 157 132 100 144 139 -84 -167 84 0 -216 105 -350 132 3 -291 -41 173 -26 -143 27 -73 82 -168
4097a68J83L8k03P0L80j40r5J95q7j49N%m2J52k13k06L41K4k48J61L53k55n0j63
$$ -168 15 53 -150 -80 300 160 65 260 173 24 29 29 -13 139 -74 -280 61 85 -163 -2 351 96 46 -117
4121a17J39p5q6K82k68k7KJ96k0R9L7k68K7L5N5J98q9L0l13K22j39l16P61k81
$$ -117 22 -53 -139 143 -125 -152 -150 46 26 125 162 -106 -79 -44 11 209 120 150 -163 59 -80 -396 365 84
4145H4j60Q9J7k11Lk0L09k59j5j96J36K54P0n11O06k6l03Q9J60J29l68L47r8k15
$$ 84 -76 13 30 -181 -178 -198 111 -148 -163 -359 -223 31 101 -410 196 170 -133 -44 116 245 -123 224 126 -89
4169h9L48l30R8k1P2J60l27K41j9l48L69j9k11k7J64k56m4J36J54r7K2K09l30
$$ -89 259 -71 27 6 78 238 -89 152 133 -215 154 135 -76 -103 61 -195 -239 -103 51 -46 -24 185 -145
4192a45J36J3pl31Q2R4J05K78l52J49p5K10j95J33jp0J37l45J02K52j77M8k50
$$ -145 -9 4 -3 -334 -252 -158 -53 225 -127 22 -53 157 -38 95 94 24 161 -184 -82 170 -7 41 -209
4215b09P2J88k4j83K9K65l25R2n3j4J76k5n8m8J15m9p4K1n4L8L23mq6l00K29K57
$$ -209 -137 51 27 -156 -127 138 -187 -95 -148 -162 14 -11 -69 -117 -2 -51 -125 -104 -158 -120 203 199 113 -187 42 299
4241B99l98R7j9j11J17j06K26kl84Q2O5J95r0L20Q0k98K1k67L30l50K74j07K32
$$ 299 -99 -2 -21 -132 -15 -121 105 103 -281 -199 -134 61 -29 291 371 73 94 -173 157 -193 81 -26 206
4264B06j92j7K2J88o8J5j42k86J31j91N39j93k02J95o9J98j2k45J27J25j34j87
$$ 206 14 -3 19 207 139 154 12 -274 -143 -334 205 12 -190 5 -64 134 122 -123 4 129 -5 -192
4286a92J91l8j26J6K87j65R4j9o9J92J1j53J41K2j04K25l46Q3K02j00k30L6M5
$$ -192 -1 -39 -165 -149 138 -27 67 48 -21 171 182 29 170 192 88 313 -33 50 252 152 -78 -42 3
4309Cl5j60j1j02L63j19J18j23j00J33q2k8J65j24K93j00k8nk86k1M63q2k47p
$$ 3 -32 -192 -203 -305 58 -61 57 -66 -166 -33 -115 -143 22 -102 191 91 63 58 -228 -249 214 132 -115 -122
4333a22J45K58j70K4k22j34J59J22j8R2Oj17Q9K1k85J53k44L46j89j5K99k60j10
$$ -122 23 281 111 135 -87 -221 -62 60 42 134 140 23 112 133 -152 1 -243 103 -86 -101 198 -62 -172
4356a72L03P8J10m10L37j81m9r3K1oL48P3k35j14j7J4L0J02RJ41k14m5K4n8m5
$$ -172 131 209 319 -91 246 65 16 -77 -56 -62 286 359 124 10 -7 7 37 139 148 289 75 30 54 -4 -49
4381d9k45LK49J18P9k73j3J04Lk48O43k83j83J23k9P4R7N7k25r7J52J6J05k28
$$ -49 -294 -291 -42 76 155 -118 -131 -27 -24 -272 371 88 -95 28 -1 73 170 227 2 -95 57 73 178 -50
4405e0o4j84k04N93j5M1Pk75J12J91Jo3l52M35j06J2j7q3M9M8J62k71O7N5p3J85
$$ -50 -114 -298 -502 91 76 117 124 -151 -39 152 153 90 -262 173 67 79 62 -21 28 76 238 -33 34 89 16 201
4431B01l50L1L08O4k07j36L2J98l27K65j66L29k95j49J63J50k49k8J36m4q6K53
$$ 201 -149 -118 190 254 47 -89 -57 141 -186 79 -87 242 -53 -202 -39 111 -138 -166 -30 -74 -160 93
4453I3N5j12J32j40M7J17l5k01K00r9%Q4J12k02l63M70k64j51L08J44p1r9L0l71
$$ 93 148 36 168 28 75 192 157 -44 156 57 57 141 253 51 -312 158 -106 -257 51 195 124 25 55 -316
4477c16M52j43j5j21J96J22k56M4N4j88J66k17J98N5p9M4k7M2J36j94j4k00J61
$$ -316 136 -7 -22 -143 53 175 -81 -37 17 -171 -5 -222 -24 31 -48 -4 -31 11 147 -47 -61 -261 -100
4500a00K08l2O6j23j50J2j1K61k42N5j43K53j17J19KQ1j18l4O2j85K64k76L29
$$ -100 108 76 142 19 -131 -119 -130 131 -111 -56 -199 54 -63 56 58 139 21 -13 49 -136 128 -148 181
4523A81j70J20p0n5R0K57o14J04Q0j67J43K41Q2m11K32k04J36l9j94K03k42L07
$$ 181 11 131 61 6 96 353 -261 -157 -77 -244 -101 140 222 -189 43 -161 -25 -64 -258 -55 -297 10
4545A0N3Oj38J30j60J60Q3O3j14j38n5K8M13j60l46K14l5K08o8j32q7K9P9r5P6
$$ 10 63 69 -69 61 -99 61 144 207 93 -45 -100 -72 341 181 -165 49 14 222 154 22 -65 -36 43 -52 24
4570B4J8J39r8j1J3k3n4pp2Op6L58j56j38L12ql15J79J28j50Q2j39L0n6K6j54
$$ 24 42 181 83 72 85 62 8 1 -71 -65 -141 217 61 -77 235 227 -88 91 219 69 151 12 42 -14 12 -142
4596a42J06p0J24K55q8j27k76Q9O51o80R2J47KM6k77M22l14K57n4k75L31j57k17
$$ -142 -36 -106 18 273 185 58 -218 -129 522 -158 -66 81 83 129 -148 274 -40 217 163 -112 219 62 -155
4619a55J61J11k55N5K50kk90K36l22L39k33M8L44n22L10J47k26m2k36J99j15P9
$$ -155 6 117 -138 -83 167 165 -125 111 -211 128 -105 -57 287 -235 75 222 -4 -46 -282 -83 -198 -119
4641a19k8l4J74l7O3K57j93j58J32n6L48m59J9K18J56n06K90j54KJ41oj52l1K8
$$ -119 -147 -181 -7 -44 19 276 83 -75 57 1 349 -110 -91 127 283 -223 67 -87 -85 56 50 -102 -133 -105
4665a05P9m5l12M15R8j21j35k11L92j66J32k67J62L3J24J04P5m37K87l55K71q1
$$ -105 -26 -71 -383 32 130 9 -126 -337 55 -111 21 -246 -84 -51 73 177 252 -185 102 -253 18 -63
4687f3K87j31L1J63l0k98j96L39l17K07J3j54j25L49j20k09K91J11m0K3k02j22
$$ -63 224 93 124 287 257 -41 -237 102 -215 -8 5 -149 -274 75 -45 -254 37 148 108 131 -71 -193
4709a93J58LL41m72K39K07n54L57J63k06l8k9j9K95k32l8j66L39l22J15k2J70
$$ -193 -35 -32 309 -163 76 283 -271 86 249 43 5 -24 -43 252 20 -18 -184 155 -167 -52 -74 96
4731I6N1k4j17j12%J93J64k92nK74k80J94p7r4Q7Kp1K64j46Q2m5p9j06n4J24j72
$$ 96 147 123 6 -106 -106 87 251 -41 -46 228 -52 142 65 -29 58 60 -11 253 107 189 144 65 -41 -95 29 -143
4757a43J91o8j3K73k31J24J09m22q0K54j08o5J69p8R1l10K41l0J49j08j5J80J58
$$ -143 48 -20 -33 240 9 133 242 -180 -260 -6 -114 -179 -10 -88 3 -307 -66 -96 53 -55 -70 110 268
4780B68j02j47j05J72q2m13M42jp4O9n3l6J93j64L08m42J92P6l27RN22j49k73
$$ 268 166 19 -86 86 4 -409 33 32 -42 27 -26 -62 131 -33 275 -167 25 101 -226 -217 305 156 -117
4803a17j6J61%R6j05j01r4K19l4j0J79j22jM8j4m09M84k53j04J78r1J92o9k1L0
$$ -117 -133 28 28 124 19 -82 -176 43 9 -1 178 56 55 103 89 -320 164 -89 -193 -15 -106 86 17 -4 26
4828B6J37j20p1K6l82K62Nj8Q1LK72j05j34M7k04K86j45L2k3r0M16j76l63K03
$$ 26 163 43 -28 -2 -384 -122 -117 -135 -54 -51 221 116 -18 29 -175 111 -34 -2 -25 -115 301 125 -238 -35
4852c5J10k09L35l15J0Q1M3j25M80m75K12k56M02l59J43J75k02j96K23p4J42M6
$$ -35 75 -134 201 -114 -104 -23 20 -105 375 -100 112 -144 258 -101 42 217 15 -181 42 -32 110 156
4874A56J45n60L39j84J97n2m9j81j14M21k24M7J5M4J04r9l9K2j83P0K64Rl29L04
$$ 156 301 -259 80 -104 93 41 -8 -189 -303 118 -106 -59 -44 0 104 5 -34 -12 -195 -125 139 148 -181 123
4898A23k01mJ59q0J15j9l19L15J35k68J2J49o1m6j6q2L22Q4k79K45j22O3m93M99
$$ 123 -78 -82 77 -3 112 93 -226 89 224 -44 -32 117 56 10 -6 -88 234 318 39 284 162 225 -268 231
4922B31j49j01J2j01k18J29M6R3o9j6J33L05m17RR0k23J47r1k2K67q3l2K32k73
$$ 231 82 -19 -7 -108 -326 -197 -151 -58 -127 -143 -10 295 -122 -113 -23 -246 -99 -190 -212 55 -28 -60 172 -101
4946a01J44k47K93l9j71L3M1k74K08J26k21M07l51p3K46L65m11j49K40j55j89
$$ -101 43 -204 89 50 -121 -88 -47 -321 -113 13 -208 199 -152 -225 21 386 -25 -174 66 -89 -278
4967b78K75J66j09j93K13R2r1j34M51m28j22P5P1J92k76K3M7L18j10j33j4J23
$$ -278 -3 163 54 -139 74 166 75 -59 392 -36 -158 -83 -12 180 -96 -73 -26 292 182 49 35 158
4989A58k4r6o3Mk63L13j32Q3p4K64k46J05j81J75Jl9J57l2K57k42j89J31j19J82
$$ 158 134 38 -25 -21 -284 29 -103 -20 -94 170 -76 29 -152 23 24 -15 142 110 367 125 -64 67 -52 130
5013A30n5j06j87J78k29J27R9k3K72m32J18j07L11r7o0q0l7J92j37K67K03l66
$$ 130 75 -31 -218 -40 -269 -142 -43 -66 206 -226 -108 -215 96 -1 -61 -141 -178 14 -123 144 347 -19
5035a9J30k69R1J67l22K87L3q2J5L7o9K20k82K06P4r0j55k60J68J09M4J58k55
$$ -19 111 -158 -67 100 -222 65 98 16 31 68 -1 219 -63 143 217 127 -28 -288 -120 -11 33 191 -64
5058f4J35l1k12m5K59k14K62J83k16l7k24N03l59q8M9o5K19N2j8J18l86K41j10
$$ -64 71 40 -172 -217 42 -172 90 273 57 20 -204 299 -60 -148 -99 -164 55 107 89 207 -179 62 -48
5081d8K20j17l50M94j82l22L78K54l82j68J62o7j2J70N6J1r9k80K77o7L9Mk62
$$ -48 172 55 -295 199 17 -305 73 327 -55 -223 -61 -128 -140 30 86 97 -2 -282 -5 -72 -33 -29 -291
5104b91K64j11J01K20m09j15M12j08J7j17j68M13l03K13k0j35J32m5k2J14Rl05
$$ -291 -27 -138 -37 183 -226 -341 71 -37 -20 -137 -305 108 -195 18 -2 -137 -5 -50 -72 42 51 -254
5126b54N6M20l04j13L51k30j32K44j96K11p8K23n0n4j17Q3j51j62M02l30K08r
$$ -254 -198 222 -82 -195 156 -74 -206 38 -158 53 -25 198 148 94 -23 60 -91 -253 149 -181 27 18
5148A8J54k01O6q6k78L50N7p1J05r3M0j72K81m0r9K5L8j76J10J28j28O3Qk72J04
$$ 18 172 -29 37 -49 -327 23 80 9 114 21 61 -111 170 130 31 56 94 -82 28 156 28 91 99 -173 -69
5173f9O7L1j52k1M0J15J46n3qmO7l88J57j35J21j05j39K40J23R8k21J34k79N44
$$ -69 -2 29 -123 -144 -104 11 157 104 96 92 159 -229 -72 -207 -86 -191 -330 -90 33 131 -90 44 -235 309
5197C09l23k9K6J18j13j38K91l7k01J22L67k62J28o4k68mJ65k14P9J2l8j93J60
$$ 309 -14 -43 -17 101 -12 -150 141 104 -97 25 392 130 258 194 -74 -78 87 -127 -48 -36 -74 -267 -107
5220a07J68l02K28q8J20k34K52J25k70K34M7r2l07o8L99J51k72N8K62j75o4j80
$$ -107 61 -241 -13 -101 19 -215 37 162 -108 126 173 81 -226 -294 105 256 -16 42 304 129 65 -115
5242a15L34k51J23O1j67L2K9j79K57j36j17j08K10J38k96Q4j60L33j03l1L06j35
$$ -115 219 -32 91 152 -15 17 46 -133 124 -12 -129 -237 -27 111 -185 -101 -261 72 -31 -62 244 109
5264A09j02J49k89K96l10k2K12J5j56M8Q5K69m14R2L84k88k17K06k6n5l81M88
$$ 109 7 156 -133 163 -147 -169 43 58 -98 -50 35 304 -110 -18 366 78 -139 67 41 -14 -395 93
5286I3j61lk87L54j11K28j35q8J4L7L97m78K49j46k7J0q3J64j43J55p4Q0K3p0
$$ 93 -68 -71 -358 -4 -115 113 -22 -110 -96 -59 338 -140 109 -37 -64 -54 -137 27 -116 39 -35 45 68 -2
5310bQ2O9l07O5kP6O5M2j62K80k15r2J97l17J78o1Q1N6k9j08J72kk6k31M07k76
$$ -2 80 149 -158 -93 -95 -19 46 88 -74 206 -9 -101 96 -221 -43 -104 -23 33 4 -104 68 66 40 -191 216 -60
5336f0K54j41l25J17J89N6k31J67k10Q8K25Lk31P7o1J00l7j94J0O2K14k27Q2J49
$$ -60 194 53 -272 -155 34 90 -141 26 -184 -96 129 132 -99 -22 -83 17 -20 -214 -204 -142 72 -155 -73 76
5360G6k98K57K64k74j44J33Q7j2j02J84p9q8k4j59K18j54K40m0J40j97k49O1O5
$$ 76 -222 35 299 25 -119 14 101 89 -13 171 92 4 -20 -179 39 -115 125 85 225 28 -221 -160 -95
5383i5Q9j17k10L25O4j91L20l32Q2L11j97P7k22K49J20k27k3r3j1R4m9K45j6n7
$$ -95 -6 -123 -333 -8 56 -135 185 -147 -65 246 49 126 -96 153 273 46 23 -70 -81 13 -36 209 193 136
5407A36m29J8M03o2m88J94J97K57m40K91k51J48k16L84J29l44K24l55o7K15j02
$$ 136 -293 -275 128 66 -422 -228 -31 226 -214 77 -174 -26 -242 142 271 -73 151 -204 -271 -56 -158
5428a58K47N6k5k47J55J0j74J47l9J7q7J62k35K15k30L47M0K1m39K29K03j89j43
$$ -158 89 145 120 -127 28 38 -136 11 -28 -11 -98 64 -171 44 -186 161 201 222 -217 12 215 26 -117
5451a17J20k3J51k70J4L47k21p7j65L19j0mj41J91j53j28K57l1m88M65Mj88k9
$$ -117 3 -20 131 -139 -125 222 1 -76 -241 78 68 64 -77 114 -39 -167 90 59 -429 36 40 -148 -177
5474a77j51L49l5P2k11O5n3K18k72K05j20o6K23K1p9N4J90k52K20L1j18L1j27
$$ -177 -328 21 -14 58 -153 -88 -141 77 -195 10 -110 -176 47 68 -11 43 233 -19 201 232 114 145 18
5497A8M4NN2O8l06J78k46J16j01M68j56j89J7l39N48k61M4O9jk52L26l3J9l13
$$ 18 62 67 119 187 -119 59 -187 -71 -172 296 140 -49 -32 -371 177 -84 -40 29 28 -224 102 69 88 -225
5521b25M07j77J93j66j77P1j91K66J75j73j8j95K06j72J72L6m1J05k48L50j89
$$ -225 182 5 198 32 -145 -74 -265 1 176 3 -15 -210 -4 -176 -4 32 -9 96 -152 198 9
5542Il7k9j12J45l7j37K34k44M82k95qo4Q4J18j18k3q2J06o5J31j81K58k10M2
$$ 9 -28 -57 -169 -24 -61 -198 36 -208 274 -21 -29 -93 -9 109 -9 -32 -114 -8 -73 58 -123 135 -75 -33
5566c3P1n5P3l0k14J75L0K7j03J16o6k30J31R1J71k99M3J50R2j89P2L1j74J43
$$ -33 38 -17 56 26 -188 -13 17 44 -59 57 -9 -239 -108 -17 154 -145 -102 48 140 -49 23 54 -120 23
5590B3kM3nj31m5K10L3o2L9o0O7j98oJ0J51j52N7J8P7j47J46j53j41O40k38j86
$$ 23 21 64 59 -72 -117 93 126 64 103 43 110 -88 -94 -84 67 -85 -28 -10 67 -80 66 -87 -228 412 174 -12
5616a2j25J46K78o21L62M1j68K62N5k9r1P0pr3J55j92l29M35l99K36J96l4k99
$$ -12 -137 9 287 -334 28 69 -99 163 218 189 98 168 161 68 223 31 -298 137 -262 -26 170 136 -163
5639a63N9q9K65K09Pl18K07n0j34K9P9l6q3O0k21R8J39J68k89P4NP0k02nM87j48
$$ -163 -104 -193 72 281 288 -30 177 127 -7 22 101 65 -18 42 -179 -81 58 226 -63 11 16 86 -116 -121 366 218
5665B18l72K38M6j23k64L5K47N5P8j78K79k60L09m33O8L68k66j61L86l93l9O6
$$ 218 -154 84 130 7 -257 -222 25 80 158 -20 259 -1 308 -125 -57 311 45 -116 270 -123 -162 -96
5687i6K90k0l29L98q2j91J14k43K40j60J06j12J18p1J46l04r4J47J92j76K92j71
$$ -96 194 174 -155 243 161 -30 84 -159 81 -79 27 -85 33 -38 108 -196 -290 -143 49 -127 165 -6
5709fkM7j43J51J68m77N89l90J11qJ53K23l48J71r8O4k40J63j12k20L3J20j27
$$ -6 -8 39 -104 47 215 -262 327 -63 48 40 193 416 68 239 141 205 -35 128 16 -204 -171 -51 -178
5732a78J35j50K60j50Q0J7l8J47j96k31K64j07kR4L2J05m7k33J38K84j74r4P6
$$ -178 -43 -193 67 -83 -3 14 -24 123 -73 -304 -40 -147 -149 -55 -23 82 35 -198 -60 224 50 -44 32
5755C2J8J16Lj41j28J5L0LP3j7k51J96L07k57j30k9K27L9o5k16K09k30k4K01l2
$$ 32 50 166 169 28 -100 -85 -55 -52 21 4 -247 -51 256 -1 -131 -160 67 106 41 -175 34 -196 -220 -19 -51
5780e1J07m7K4O2N2k83J93l06K58m8J29l38K31K74k04j82J18l0j28K25J26k88
$$ -51 56 9 33 95 147 -136 57 -249 9 -39 90 -248 -17 257 53 -129 -11 -41 -169 56 182 -106
5802a06j06N31j23k73J06K8j32K19k80L61j95J2j99K56N8o7k17J42P0Q8J88l83
$$ -106 -212 319 196 -77 29 57 -75 144 -136 225 30 42 -157 99 157 90 -127 15 85 173 361 -22
5824b2K10j63j96K40r0k8j49J66J22j53P6J0k5K17j15p5K14m00Q3N2m7K3N3K7
$$ -22 188 25 -171 69 -21 -49 -198 -32 90 -63 13 23 -2 215 100 25 239 -161 -78 -26 -73 -50 3 30
5848C0k00O2J30J60l28K38k33K37N6j53O7l2k40O3o3K52j87R1K54m88J48R4KR4
$$ 30 -170 -108 22 182 -146 92 -141 96 152 -1 66 34 -206 -143 -206 46 -141 -50 204 -284 -136 -42 -40 54
5872E4j39J80J12j05k7P6k24J89J42l22k8j3J54j91K95k70L1j08o1L87j49L5l15
$$ 54 -85 95 207 102 75 151 -73 116 258 -64 -92 -105 49 -142 153 -117 -86 -194 -255 132 -17 18 -297
5895b97L33oj33J04J6NL0j24l37M04J09m9j15M0J47k95K72Kl21L99k01Pj61K11
$$ -297 36 30 -103 1 17 22 52 -72 -409 -5 104 55 -60 -20 127 -168 104 106 -215 184 -17 -10 -171 40
5919D0L1j83J86Q1l76K62j01r2O2P2R9M4o6k86P8J65M1m46J83K75r8l3J36l6j25
$$ 40 71 -112 74 155 -221 41 -60 -152 -90 -18 81 125 59 -227 -149 16 57 -389 -206 69 -29 -62 74 38 -87
5944h7j34N17j82k22M2rJ85J38k51r3j78J84K01k38K40N0k88J74k26K84j99oK80
$$ -87 -221 296 114 -108 -66 -75 110 248 -3 -96 -274 -90 111 -127 113 163 -125 49 -177 107 -92 -98 182
5967A82j71j54J25j7o9K00J51l89L07n7j65J69O3k01J26nn71L98J39l6J83o28
$$ 182 11 -143 -18 -35 -104 96 247 -142 165 108 -57 112 175 -26 100 95 -476 -78 61 25 208 -420
5989d20O57m1n16L68m25M29p9L9J0OK04k72KN0m8k1K7K1K02j31kj59K60O5j12
$$ -420 237 196 -320 48 -377 52 -27 12 22 28 232 -40 -38 12 -36 -57 -30 -9 193 62 60 -99 161 226 114
6014A14k74K30L3j13R6k24J69J80m00Q2m3j29R6J17J45j85K61j04J05k74L90j74
$$ 114 -160 70 103 -10 86 -138 31 211 -189 -107 -150 -279 -183 -66 79 -106 155 51 156 -118 272 98
6036I8n5J89q8n7J53l51L75r9m74J98k46N43j71j43R4L10k88J60p0q4j8O9J36
$$ 98 43 232 144 87 240 -111 264 165 -309 -111 -357 186 15 -128 -34 276 -12 148 78 -6 -24 45 181
6059A81m83K41q4K12k39J98K5Q3O0m1l13K29jJ90j44m5j12Pk51L74J24j90m3p3
$$ 181 -302 -61 -145 67 -172 26 51 134 194 153 -160 69 68 258 114 69 -43 -36 -287 87 211 21 -22 -95
6083i5J20j45O1P4Q6k19r9K26O6k25N8K80k0k11J41j64K82p2k07N1L34m59R7N2
$$ -95 25 -120 -59 15 101 -118 -217 9 75 -150 -92 188 168 -43 98 -66 216 144 -63 -12 322 -137 -40 12
6107A2j08K12k01L26m27l9M57q6Q3k34j0o4j76M55l64J29l0k16o8J80K77k97L36
$$ 12 -96 116 -85 241 -186 -225 232 146 229 -5 -15 -79 -255 200 -164 -35 -65 -281 -349 -169 108 -189 147
6130A47Qj89J30j52J7j86M22j35j55K61J6k51o5L56k42J7j96N2Q4J60m7l17K47
$$ 147 155 -34 96 -56 -39 -225 197 62 -93 168 184 -67 -132 224 -18 -1 -197 -145 -61 99 52 -265 -18
6153a8j30KL43k43J41n8j51J91M3k16K00k05L7J53J00k10Km5P3J7J54k42L39j94
$$ -18 -148 -146 197 -46 95 37 -114 77 120 -96 104 -101 -64 89 189 -21 -19 -64 9 26 180 -62 277 83
6177H3j65k65M36M0k43K1J96k69n2K56j33j18J98Q9j28K9J77k13M6J47p3o3k8
$$ 83 -82 -347 89 129 -114 -93 103 -166 -218 38 -95 -213 -15 74 -54 -25 152 -61 -15 132 59 -4 -32
6200c2J57P1k05Q1O6j61J59P9k34l5Q4M4j63J64k47K56l0j5Q4j43j36R1K18j33
$$ -32 125 196 -9 72 138 -23 136 215 -19 -54 30 74 -89 75 -172 84 54 39 123 -20 -156 -65 153 20
6224B0k08N5N52m11P1j4j76j34L21j32J70L07m10N2j00l6P7r2L5L34k46J33k63
$$ 20 -188 -133 419 8 79 65 -111 -245 76 -56 114 421 11 63 -37 -73 4 -88 -53 281 35 168 -95
6247i5R5P7j34O4q1j43K57p9N0J54k00K09j72NL52l57k2Mj04M7J5L75m26J97r1
$$ -95 0 77 -57 7 -74 -217 40 -39 11 165 -35 174 2 7 359 2 -20 -16 -120 -73 -58 317 -109 88 -3
6272cO1k0k67N08O4l20R4k8j55m2Q3J78j68m3K34j53j17j21J76j0R3J88k30p7
$$ -3 58 38 -229 279 343 23 117 89 -66 -108 -25 153 -15 -58 176 23 -94 -215 -39 -49 44 232 2 -75
6296g5R9q9N1J73k18m1p6N47o53M88qo6K50k94j76L09j87Q1j02l94J73J94K6j98
$$ -75 24 -65 -14 159 -59 -100 -176 371 -282 206 198 132 382 88 -88 221 34 115 13 -381 -208 -14 12 -186
6320a86L0j80Q9K99j47J6K31m28M39k20J22Kn5K04l38R6n1LK39j78K6L1O4p7Q6
$$ -186 -156 -336 -247 52 -95 -79 152 -276 163 -57 65 67 12 216 -122 -26 -77 -74 165 -13 13 44 108 31 117
6345A17q4j16O2j37O1L17m30J62k42L07q1J01O7l15K20m3%J2L7N9j2j50J67m7
$$ 117 33 -83 -21 -158 -97 220 -210 -48 -290 17 -64 37 104 -211 9 -34 -34 -22 15 74 62 -88 79 32
6369C2O5L2o2j36J08M5j10m4O4j62k9J74R2R9k93Q2J19K0p8o4oK31l46J13j98
$$ 32 97 129 67 -69 39 84 -26 -70 -6 -168 -197 -23 69 168 -125 -43 76 96 18 -46 -52 179 -167 -54 -252
6394b52J74K35l2j66n7mJ72k50J40o1L14R1j67l71J75K6P4N0k38J43L5O0j41J39
$$ -252 -78 157 125 -41 -98 -102 70 -180 -40 -101 213 304 137 -234 -59 -33 41 91 -147 -4 31 91 -50 89
6418H9j60K14r2j6N6j94J0J09M8j28J20M4k27K47m7k68M65j22L9m16K33l5o8q3
$$ 89 -71 143 51 35 91 -103 -93 16 64 -64 56 100 -127 120 73 -195 270 148 187 -229 4 -31 -99 -182
6442a82j17L77k01M0J70r8j0R5r0K50k78J57o2K6j52j9J75J82k41K42j06k95N6
$$ -182 -299 78 -123 -83 87 -11 -21 74 -16 234 -44 113 51 77 -75 -94 81 263 22 264 158 -137 -81
6465h1L25N7l2k86j58J65K4J52m28K39l6L1j20L31m2k85J48k06N4L35k00q5L23
$$ -81 244 301 269 -17 -175 -10 14 166 -262 -23 -59 -28 -148 183 141 -144 4 -202 -148 187 -13 -98 225
6488B25m28K49k6J39k30J21L8l16J64j2M7J47J11m2j06p3J36l1k67L16k75J0P1
$$ 225 -203 46 20 159 -71 50 88 -228 -64 -76 -29 118 229 187 81 8 144 113 -154 162 -113 -103 -32
6511c2j9l5J09O7l10K91j04J24qM0m4j31j37R5lj49L26O1k39n3J74j6Q0j65K03
$$ -32 -51 -86 23 90 -220 71 -33 91 83 123 79 -52 -189 -94 -97 -246 80 141 -98 -151 23 7 87 -78 125
6536A25k37r7K97j37N5K8j14j28K40k9M9%K48l22j60P2j08J03J57j90K11l00L31
$$ 125 -112 -209 88 -49 6 34 -80 -208 32 3 52 52 300 -22 -182 -110 -218 -115 42 -148 63 -237 94
6559I4L1j94J53l94K80p7r1J24N5k36R5L89l41k91M96K4k26J4N8L1j16M9m0K86
$$ 94 125 -69 84 -310 -30 -107 -198 -74 -19 -255 -160 229 -112 -403 93 117 -109 -95 -37 -6 -122 -73 -113 173
6583A73k5j92R8q2p4Q5k04K50J41k36p2O2p2K07J92k35l3J39k33K56j04QL5k2
$$ 173 148 -44 54 -28 -102 -17 -221 29 170 -66 -138 -76 -148 59 251 16 -17 122 -111 145 41 49 84 62
6607F2R9j54j77L4J07RL1k11L45j79j12r4K67J45l65J14J89m7k76m0L12Qn3l2
$$ 62 161 7 -170 -136 -29 -20 11 -200 145 -34 -146 -240 27 172 -193 -79 110 63 -213 -253 59 67 14 -18
6631a8J96l28K21l54M67l27R0N8N5OR1j98KJ73j72J53k47J24k58N33l56jN0L99
$$ -18 178 -150 71 -283 184 -143 -53 5 60 66 157 -41 -39 134 -38 115 -132 -8 -266 267 -89 -90 -40 359
6655C59j27j90p6J02P7j16p8m2K2J20j14K77j00m4r7J20k09o0J47Lj32j36K94
$$ 359 232 42 -34 68 145 29 -49 -91 -69 51 -63 214 114 70 -27 93 -116 -176 -29 -26 -158 -294 0
6678@n4J37j75M5k7qK65l2l08L34o5jr5k7J92j89J6l51K47L62q5q6j38M6j66J26
$$ 0 -54 83 -92 -47 -74 -82 183 151 -157 177 112 111 16 -11 181 -8 8 -343 -96 266 181 95 -43 3 -163 -37
6704c7k6J76l5k18j39L05j01R4l14M59l40K75j97J78J56j65j37Q6J33O7k01R8
$$ -37 -63 113 78 -140 -279 26 -75 19 -295 164 -176 99 -98 80 236 71 -66 20 153 220 19 117
6726A17j99J33j03K23k59k19L65O4n3j55L49m58L94k55k18K82J61l2l8L05m55
$$ 117 -82 51 -52 171 -88 -307 58 122 69 -86 263 -195 199 -56 -274 8 169 137 99 404 -51
6747e1k0%RJ47j0J39k92J63J7K2n5q3J0l82K27L05k27J71L7l80M33L0k74J37j69
$$ -51 -71 -71 -62 85 75 214 -78 85 102 124 69 -14 -4 -386 -159 146 -81 90 127 -253 180 210 -64 73 -96
6772i6O7l1m4J31L9K95k08n5L5K2j02k18K75k20J76J54m18L70j46o6R0J43k55
$$ -96 -29 -60 -104 27 66 361 153 98 133 155 53 -165 110 -110 66 220 -198 172 26 -40 50 193 -62
6795f2J02Oj89O7K73n63K61L7J28k13K28P4M7K06j55k60q1M4O6j28K17o0J6O1
$$ -62 40 46 -143 -76 197 -366 -105 -68 60 -153 75 149 196 402 247 -13 -94 -50 16 -112 105 45 61 122
6819A22j85J93j3J82l78J2J64p9Qm9Q2j16J51m9j27j29K48j95j3J31k6m3J07j17
$$ 122 -63 130 117 299 -79 -67 97 18 26 -23 59 -57 94 45 -82 -211 37 -158 -171 -40 -66 -109 -2 -119
6843a19J93j70n8J68r9K91j18J68j46q5J05J21j53j82Q4Q4m1N39o32J26j54Q7
$$ -119 74 -96 -154 14 -85 206 88 256 110 25 130 251 98 -84 0 84 43 582 -50 76 -78 9
6865Ik1r9K09j1m23L64r6j0q8j8L63k17o4J55J0j39J80k36J25l8l8L54k51J00
$$ 9 -12 -111 98 87 -336 28 -68 -78 -166 -184 179 -38 -102 53 63 -76 104 -132 -7 -45 -83 271 20 120
6889A20Q0o2o6Q1k51J45k61K08J82j49L3m6o8N9q0l13M33j95J07K50L3k43j06
$$ 120 200 138 72 153 -98 47 -214 -6 176 27 60 14 -54 5 -75 -388 45 -150 -43 207 240 -3 -109
6912a09K04j7k44P5j00J93m4J88k23J84k32J93q6j42L88k93K87l70Q2k2K7j81
$$ -109 95 78 -166 -91 -191 2 -42 146 -77 107 -125 68 -18 -160 228 -65 222 -148 -66 -88 -61 -242
6934b42L12J6J62m36K31J48k63K51j17M2k17l0mN60k11l94M04k49Pq7Ll5r9K40
$$ -242 70 86 248 -188 43 191 -72 179 62 104 -113 -143 -147 413 202 -192 212 -37 -30 -117 -114 -149 -248 -8
6958hJ15q5j22O4l1p2K03R2Mm1p1j54O4J82L1l24K69k69R0p6J55Pj8L9L5j1M0
$$ -8 107 22 -100 -36 -67 -139 64 156 160 119 48 -106 -42 140 171 -153 116 -153 -63 -139 16 23 5 44 79 68 108
6985A08k19QK60k20K18l19K5J9r3K51J1j67J18j24Q1r4J47j23K17n8k48N98n44
$$ 108 -111 -103 157 -63 155 -164 -139 -120 -213 38 49 -118 0 -124 -43 -137 10 -113 104 46 -202 396 -148
7008a48K29R7j91j2J26J28j31J0j80MP7J59k11P9j41j13K19K8k9J32n63L56L27
$$ -148 81 178 -13 -25 101 229 98 108 -72 -68 9 168 -43 36 -105 -218 1 29 0 132 -431 -75 252
7031B52n46L66j6l43R2L14j91o3L18l34K70k2l78N39j64k5k10JL41O6j92j47J9
$$ 252 -294 72 56 -287 -195 119 -72 -135 183 -151 119 97 -281 258 94 69 -141 -140 201 267 75 -72 -53
7054e3m2L0j26K08k76J69n4J0J23MQ9m02L65j24j43J44J14Lo2p5K4L1j18L31k92
$$ -53 -95 -65 -191 17 -259 -90 -144 -134 -11 -7 82 -320 45 -79 -222 -78 36 39 -23 -98 -74 -43 -161 170 -122
7079a22K48j08L5k02L7J2J73j15JR8m0j31K1M26l15l9p9K10j91P7J65j81q2J09
$$ -122 126 18 53 -149 -112 -100 73 -42 -41 57 17 -114 -93 333 18 -21 -100 110 -81 -4 161 -20 -102 7
7103GO2J18j60K84l62K91l77J40q5J40J00Nn1r4k2K26k72J2OJ5L2j42K28j97J36
$$ 7 69 187 27 311 -51 240 -137 3 -82 58 158 163 112 18 -4 222 -50 -38 -32 -17 15 -127 101 -96 40
7128D0L3Lj31j56L36k06P9P3L7k2rj39K6N1R7R6k37j69K41k68P7L0K59M3l19K36
$$ 40 73 76 -55 -211 125 -81 -2 71 108 86 77 -62 -36 15 112 208 -29 -198 43 -225 -148 -118 141 184 -135 101
7154A01l77j2K74j52K86p1j32K68l5j89J03o3J28j07q5J08l10M05j89l6j0J13
$$ 101 -276 -288 -14 -166 120 49 -83 185 150 -39 64 1 129 22 -63 45 -265 140 -49 -85 -95 18
7176A8p3J02J19k32R2k94NN9J04J5J32k10K75r6J34K3k07K1j12q0J00K74j73r4
$$ 18 -55 47 166 -66 26 -268 -263 -204 -100 -85 47 -163 112 16 150 173 -34 -13 -125 -205 -105 169 -4 -98
7200i8L01l49K97k41Q0K7J21l02J43K40k43j61rq4L73l58J90J45Q1qM7k54R6p
$$ -98 203 -146 151 -90 -10 17 138 -164 -21 219 -24 -185 -194 -278 95 -263 -73 72 153 145 192 -62 34 27
7224B7p9J24l55L04j83J98l4N4l3p7j14RJ81K30j70n3j58J41r3o8R3l9k9j08J96
$$ 27 -52 72 -283 21 -162 36 2 56 23 -54 -168 -159 22 252 82 29 -129 12 -81 -149 -56 -95 -124 -232 -36
7249c6o9OL29l11Q5Nm7R7N4j23J64j13K3%J56j51l10L68j25MQ3K8J02k48j07K88
$$ -36 -105 -99 230 -81 4 9 -38 59 113 -10 154 41 64 64 220 69 -241 127 2 6 89 117 219 -29 -136 152
7275A52p5j98M82j95j44J73m14N09l28l4J11p5k29K02J63n00P1L63J14m3j82M
$$ 152 77 -121 361 166 22 195 -219 290 -38 -72 39 -36 -265 -63 100 -400 -329 34 148 105 -77 -73
7297g3P9O7J33j73j53J64o5N8K11Lk20k03K71j07Q1Kk35L28m00Q1M68k41N3j61
$$ -73 6 73 206 33 -120 44 -21 37 248 251 31 -172 99 -8 73 75 -160 168 -232 -151 317 76 129 -32
7321c2k79M14j93J08j14J76n4k67K90l01K38J8J73l54J02Q9p8L92m13K81k62l8
$$ -32 -311 103 -90 18 -96 80 26 -241 49 -252 -14 4 177 -177 -75 14 -64 328 -85 196 -66 -104
7343a04M2M3M8J14k60mJ67r4J44n4j13J54Rn0J4n7q8J47K88k45k78J85K89k17
$$ -104 -62 -19 29 143 -117 -121 46 -48 96 42 -71 83 92 42 56 -1 -89 58 346 101 -177 8 297 80
7367H0j24K29l04M7P0j54K04m36L58n5L60r9k94K65j69O0k10K18k5K55O0m22q9
$$ 80 -44 185 -119 -72 -2 -156 48 -388 -30 -85 275 176 -118 147 -22 38 -172 46 21 276 336 -86 -175
7390a75K72j59J6K44k68J20NN6l00Q8J89k82J03k5K68j44r7O0Q4J08k87J19k3
$$ -175 97 -62 -46 198 -70 50 55 111 -189 -101 88 -194 -91 -116 152 8 -89 -29 55 163 -124 -5 -28
7413b8M7j29P3J94r6P8k04q1M7K4K20j85M26j63k54K02K52l41M8p4j39K82j38
$$ -28 19 -110 -37 157 61 139 -65 -146 -99 -75 145 -40 386 223 -31 171 423 82 130 56 -83 199 61
7436F1M5r5J95k57K4K2Q0j01n4J15j67K45J4j63n4J46p5Q6o7J10k00Oj8J61RK76
$$ 61 106 11 206 -51 -27 -5 75 -26 -80 35 -132 113 127 -36 -90 56 -19 67 0 110 -90 -84 -102 59 68 344
7462C44l67L21j89n8jJ19k28J04O0k55J38j35L27j74j25O0JMP9J15m4o8q5j90
$$ 344 -23 298 109 51 50 169 -59 45 105 -150 -12 -147 180 6 -119 -59 -58 -54 25 140 96 28 -57 -247
7486b47N89m31J59M3p7k82J50P0K32j41j41J87Np2o5J68j39R7k6m4q0j4n6J63
$$ -247 342 -89 70 113 36 -246 -96 -26 206 65 -76 111 116 44 -21 147 8 105 79 35 -45 -59 -115 48
7510D8j12J09j23p9m3K49N4j25J35m0j66J10n3r9M3Q2J66m18L53k9jp2J72k22
$$ 48 -64 45 -78 -157 -200 49 103 -22 113 73 -93 17 -36 -135 -92 -10 156 -262 91 62 61 -11 161 -61
7534f1K7j4R6J05J1l24J87km4qm4j4J25n5M3l18K10l6O1K13K43j15k88k45M83
$$ -61 -34 -48 48 153 164 -160 27 25 -19 -27 -71 -85 40 -15 28 -290 -80 -116 -55 158 401 286 -2 -247 236
7559B36l76J64q6K06j25O0k6j27lJ91O3j04Ll38K35l08J74K53p5k80K82J9P8m55
$$ 236 -140 24 -62 144 19 79 53 -74 -77 114 177 73 76 -262 -27 -335 -161 92 17 -263 19 38 116 -339
7583c39M25Q3k92J74j40J91j16k4N8j6j71K16k85L79m7j2L4j80M0k2o8J74m83
$$ -339 86 169 -123 51 -89 102 -14 -38 20 4 -167 49 -236 143 96 84 118 -62 -22 -44 -112 62 -421
7606d21K60pK61p3K57m34J70qPj08J34J04j0l9j34o0J26j98N9q3K28N5k00J32
$$ -421 -161 -168 93 20 277 -157 13 5 12 -96 38 142 132 93 -41 -101 25 -173 -114 -197 31 86 -114 18
7630A8M7k32P8r8J20r2J10K7N9j92K85j37L57m94p4K03m8j0J63J12l29K56j67
$$ 18 65 -167 -89 -187 -67 -159 -49 -22 37 -155 130 -7 350 -144 -218 -15 -63 -73 90 202 -127 129 -38
7653c8J60o2k82J90o0k1J81Mj80p2J99L4Kj40K85j29k66j7K36qR1j99p0M82m09
$$ -38 122 60 -222 -32 -92 -113 68 72 -108 -180 19 53 55 -85 200 71 -195 -212 24 16 107 -92 -162 320 -89
7678h9p5K83k91k8J93J29k23K9p4K52p8K1n8j26L83k84K67rk90J77K1j25n2l11
$$ -89 -164 119 -172 -200 -7 122 -101 -72 -146 106 28 49 -9 -135 248 -36 231 222 -68 109 130 5 -47 -358
7702c58N01l03r0K65J04l33K10L3l2r7J34J5j06j8Q8J12k72J41NJ07n6n5m0m9
$$ -358 143 -160 -250 15 119 -214 -4 29 -3 -100 34 49 -57 -75 13 125 -147 -6 -1 106 50 -5 -45 -94
7726i4Q9j01N7p8J49K95k58l07K23R2k36q3L09M8m2K44j13j39L9q0K94l71K99
$$ -94 -5 -106 -49 -127 22 317 59 -248 -25 67 -169 -252 57 105 63 307 194 55 94 14 308 -63 236
7749B36k03j94kN9J69RJ2l11J56j5n9K88j14n2j12K40k66L08j93j23K31Kk42O0
$$ 236 33 -161 -163 -104 65 74 86 -225 -69 -84 -143 145 31 -21 -133 107 -159 149 -44 -167 64 66 -176 -116
7773a16K54J3p1j15L5k4P0j40Q0J32j07r7J18q1j2k0P6K1j5qL60m40RJ2L7J00
$$ -116 138 151 80 -35 0 -24 46 -94 -14 118 11 -86 32 -49 -61 -81 -5 16 1 -7 353 -87 -78 -66 -29 71
7799G1m1k01J25j51K45l4q4L4J41m36K88K4K2j26J18j64J88o5Q2J33p5j60j17
$$ 71 30 -171 -46 -197 48 14 -70 -36 105 -331 -43 -19 3 -123 -5 -169 19 -46 36 169 94 -66 -183
7822a83o2M32j18j52j01K19j31K77j73j68K25k11L33p3j50J45p1J18k33k10mM57
$$ -183 -245 187 69 -83 -184 35 -96 181 8 -160 65 -146 187 114 -36 109 38 156 -77 -287 -291 166
7844A66o7n42N97N7k29p0o0J0J89Kl32R8K29K63k7k36m8J7J13l43J72Q3k80L23
$$ 166 99 -443 154 211 -18 -88 -148 -138 51 53 -279 -181 48 311 284 48 0 17 130 -213 -41 42 -238 85
7868H5l9k08Q2Q5L3k81J65r0K56k57J65j49L9l2K95O5k36q7l07N33k17P9p0o7
$$ 85 46 -162 -80 5 38 -243 -78 -168 88 -169 -4 -153 -114 -146 149 214 -22 -109 -416 117 -100 -21 -91 -158
7892a58p2J04R2j64K06j64J23L66k26j28J46j51K44l80K37J93p4l58L4P6O9J6
$$ -158 -230 -126 -34 -198 8 -156 -33 333 107 -21 125 -26 218 -162 75 268 194 -164 -130 -54 15 31
7914C1j87m5K24p4K23m55L72q9k06L90k05l13L18R3k37J24m8R4J14k20K26o0q7
$$ 31 -156 -201 23 -51 172 -283 89 0 -206 184 -21 -334 -16 77 -160 -36 -84 10 124 -96 130 70 -17
7937a7r2J42p2J12j24k0L4J51Lk16k2L14r3j9j92J28M1k57K17m5n0j1K46j29j08
$$ -17 -109 33 -39 73 -51 -71 -37 114 117 -99 -121 193 100 81 -111 17 58 -199 18 -27 -77 -88 158 29 -79
7962g9j14Q7P8k7l2M0k8J49j18K51k06j55L8j55M70k98P6J20k73K57P7j97J5j36
$$ -79 -193 -106 -28 -55 -87 -47 -75 74 -44 207 1 -154 -116 -271 199 -99 -23 97 -176 81 158 -39 -24 -160
7986a60J66R6j00n9r3J93l31K53P2m5Q6k11J83N9k08J77l7p4J93j69J52l41L09
$$ -160 6 102 2 -57 -150 43 -288 -35 37 -8 78 -133 50 109 -99 78 41 -33 160 -9 143 -198 111
8009A11k01J42Qp4L04k99m6m0P7k01J79k03J34K1J4J00j69J0j57M00k53P6J14
$$ 111 -90 52 60 -14 290 -9 -55 -95 -18 -219 -40 -243 -109 -88 -74 26 -143 -133 -290 110 -143 -67 47
8032D7k4J3R1J05k02P3k28M06m11m5j79L36J89j31J59l44L4J72J40m80J56PL40
$$ 47 23 36 127 232 30 103 -125 281 -130 -175 -354 -18 171 40 199 -145 -111 61 201 -279 -123 -116 224
8055B24k08k25K10k95K68R0p4L9k19K22l2J12l07L33o5j70P0m0J60k47K09l7j93
$$ 224 16 -209 1 -294 -26 64 -10 29 -190 32 0 112 -195 138 73 -97 -27 -67 93 -154 55 18 -175
8078a75M40k61L20k43k05J42K01j70J26Lk16j56M55m24J29L78k59OPj56J00j88
$$ -175 265 4 324 81 -124 18 219 49 175 178 -38 -194 261 -163 -34 344 85 91 98 -58 42 -146
8100a46J65k71M33k6j48J65m28j5K47L32m48k34N55K6l3l41Q5J40J30j87q0m9
$$ -146 19 -252 181 155 7 172 -256 -271 -24 308 -140 -374 181 207 174 -167 -82 58 188 1 -79 -128
8122a28J91L20m94J70r0Q0j31L19m10J27r4K64j53J38O8j71J29L4k92J90k19K80
$$ -128 63 383 -111 59 -31 49 -82 237 -173 -46 -140 124 -29 109 177 6 135 169 -123 67 -152 128
8144A28O1o8j64p8J91j38k8K17j79j39n4J24J19j07q7pO6K82J60k85k28K58Jj57
$$ 128 189 121 -43 -121 70 -68 -96 121 -58 -197 -251 -127 -8 -115 -202 -209 -143 139 299 14 -214 44 45 -112
8168a12K06k67J42J34l35M21k69J58k5r7m5q4J03J82J31l46K39j79J1P0l1O4p4
$$ -112 94 -173 -31 103 -232 189 -80 78 53 -44 -89 -173 -70 112 243 -103 136 -43 -32 38 7 71 -3
8191c
$$ Imaginary data points
##PAGE= N=2
##DATA TABLE= (X++(I..I)), XYDATA
0@%%%%%%%%%%%%%%Qj6J6j6J6k4L2l2M0m8N6o4P2q8J03j17J33j51J71j93K18k46
$$ 0 0 0 0 0 0 0 0 0 0 0 0 0 0 0 8 -8 8 -8 8 -16 16 -16 24 -24 32 -32 40 -48 55 -62 71 -80 91 -102 116 -130
36a30K75l09L46l85M29m76N26n82O44p14P89q69R58j054J160j278J409j556J720
$$ -130 145 -164 182 -203 226 -250 276 -306 338 -376 413 -456 502 -552 608 -670 739 -817 903
55I03j905K114k357K640k970L370l862M481n293O405q029J0628j5445K7283j08704
$$ 903 -1002 1112 -1245 1395 -1575 1795 -2067 2414 -2879 3526 -4503 6125 -9320 17963 -90741
70i0741j60319K34351J17401q6253l7599M4204n2647l712J09909K4838j16399
$$ -90741 -251060 -16709 100692 14439 -23160 21044 -31603 -35315 74594 99432 -16967
81a6967l5801N6044M899l2373K6531J8466l8106k3095L8475K4798k2972k1028
$$ -16967 -52768 3276 8175 -24198 2333 20799 -17307 -40402 -1927 22871 -101 -21129
93b1129J3866L823k2077q292K7060J7537j4991j6595J5442K8658P530j7246q320
$$ -21129 -7263 -3440 -25517 -33809 -6749 10788 -4203 -20798 -5356 23302 30832 13586 5266
106E266J4060L648k4697j5258J3450J5758K229j5556l1531N142O0956K6141n3902
$$ 5266 19326 22974 -1723 -16981 -3531 12227 14456 -1100 -32631 -27489 33467 59608 5706
119E706l2098K9122J538j6806L3859J1108o8571k8452N8487K5367k0688J4922
$$ 5706 -26392 2730 4268 -12538 21321 32429 -36142 -64594 -6107 19260 -1428 13494
131A3494L152n3364J799Q0448J2464p0366j7818L5896m694j3792L3560J2266m9525
$$ 13494 16646 -36718 -34919 45529 57993 -12373 -30191 5705 1011 -12781 20779 33045 -16480
144a6480k0922N1822L7404l1929l8162R985K0849n359j1836n590j1022k042K0628
$$ -16480 -37402 14420 51824 19895 -18267 -8282 12567 7208 -4628 -10218 -21240 -23282 -2654
157b654N125k6876l146M0087J7333l0746j8079K2989J9256r109j2244j944n286
$$ -2654 2471 -24405 -27551 12536 29869 -877 -18956 4033 23289 14180 1936 -8 -5294
170e294p462Q586J9419l302k3901k317K0935L871j0020N570J772k0315n824J6491
$$ -5294 -12756 -4170 15249 11947 -11954 -14271 6664 10535 515 6085 7857 -12458 -18282 -1791
184a791p46j0579J3377M928k7464l047M3103J4856l5169j7341J9686R327q673
$$ -1791 -2537 -13116 261 5189 -22275 -25322 17781 32637 -2532 -19873 -187 9140 467
197D67j00j986j4126j299J7003M186j1858K116J2273l119j1195P927J3929r011
$$ 467 367 -1619 -15745 -17044 -41 4145 -7713 -5597 6676 3557 -7638 289 14218 5207
211E207j6369L124P870p099k818J1889J325j5959l007J5368Q588n984o442l493
$$ 5207 -11162 -8038 -168 -7267 -10085 1804 3129 -12830 -15837 -469 8119 2135 -4307 -7800
225g800k861L448Q012N46p378m859R22K965N840Q180m04j2444r439J1260J6244
$$ -7800 -10661 -7213 799 1345 -6033 -10892 -9970 -7005 -1165 7015 6611 -5833 -15272 -4012 12232
240A2232m072j5303l608M863J039K985M153o544q109P469O868q252j998J2828
$$ 12232 8160 -7143 -10751 -5888 -4849 -1864 2289 -4255 -12364 -4895 1973 -6279 -8277 4551
254D551k28j6894q91J4232j35r256M827M036j3409n933K0126J3999j5669j5530
$$ 4551 4323 -12571 -13462 770 635 -8621 -3794 242 -13167 -19100 1026 15025 -644 -16174
268a6174P055J1070o06J183K999r987j2409P423J7265L51j1996l884P42k131M489
$$ -16174 -9119 1951 1345 2528 5527 -4460 -16869 -9446 7819 8170 -3826 -7710 -6968 -9099 -4610
283d610J3722M18k0000j3173J2946J8512j561j2737n722J005J071P684R924l798
$$ -4610 9112 9530 -10470 -23643 -10697 7815 6254 -6483 -12205 -11200 -10129 -2445 7479 3681
297C681j5389m087J3564R065l802m312n16j853j709M590M871j672n698l108M24
$$ 3681 -11708 -15795 -2231 6834 3032 -1280 -1796 -3649 -5358 -768 4103 2431 -3267 -6375 -5951
312e951J111K308L395P98n358p385J188J0549N915o524q071j161M51P37Q773Q119
$$ -5951 -4840 -2532 863 1661 -3697 -11082 -9894 655 6570 46 -8025 -9186 -8735 -7998 775 8894
328H894r115j6025K403J8819Q681o747q102m901m037N526J5036K852j8477j4813
$$ 8894 -221 -16246 -13843 4976 13657 6910 -1192 -6093 -10130 -4604 10432 13284 -5193 -20006
342b0006Q964J6658L533m652m879p082l733R702J3549m203j7172o796R190P098
$$ -20006 -11042 5616 9149 4497 -382 -7464 -11197 -1495 12054 7851 -9321 -16117 -6927 171
356A71m56O91J226n753m945Q332J2091k534j0798j093L789k612j241O644K941
$$ 171 -285 406 1632 -4121 -9066 -734 11357 8823 -1975 -3068 721 -1891 -3132 3512 6453
371F453q084n070M371N105J734K046K22n585p073J562J0079L937p999j0269j218
$$ 6453 -1631 -6701 -2330 2775 4509 6555 6777 1192 -5881 -4319 5760 9697 1698 -8571 -9789
386i789N166O300N957n24j0090p561O946J4284L263r149j0274k116N301P137L570
$$ -9789 -4623 1677 7634 7110 -2980 -10541 -3595 10689 13952 4803 -5471 -7587 -2286 4851 8421
401H421k883q271m659O516J3132K862q921o266m92M56K650M054m147r572k731
$$ 8421 5538 -2733 -7392 -876 12256 15118 6197 -69 -561 -105 2545 6599 2452 -7120 -9851
416i851M973M336J641k6l82r86q7K11K705L270k748n649r94M34M0N348O271m469
$$ -9851 -4878 -542 1099 1073 691 -295 -382 -171 2534 5804 3056 -2593 -3587 -3153 -3113 2235 8506 4037
434D037p531J222O054M172J025m903r608l915N337N648L04m529o687j249Q348
$$ 4037 -3494 -2272 3782 7954 8979 4076 -5532 -9447 -4110 1538 1842 -2687 -9374 -10623 -2275
449b275P510J93m520n319l559N035Q191k596p728l244r5K551P692M125n813m338
$$ -2275 5235 5428 908 -4411 -7970 -2935 5256 2660 -5068 -8312 -8407 -5856 1836 5961 148 -4190
465d190L010K496K345L245k575p064k452Q58J058L135M93m676l060J682N70J691
$$ -4190 -1180 1316 3661 6906 4331 -2733 -5185 -4327 -3269 -134 359 -4317 -7377 -5695 -5125 -3434
481c434O679r90r543k719N229J623N68K763k615o514J528Q475M536N02l310m912
$$ -3434 3245 2255 -7288 -10007 -4778 -3155 -2587 176 -2439 -8953 -7425 1050 5586 6088 2778 -2134
497b134K70M771J424j159l243q666l824R012P252o603n880K283J447J822O562
$$ -2134 -1864 2907 4331 3172 -71 -8737 -12561 -3549 3703 -2900 -8780 -6497 -5050 -3228 3334
512C334J341q441n290L228N727J793k180m880l80L192M82K954O778k636q931J96
$$ 3334 4675 -3766 -9056 -5828 -101 1692 -488 -5368 -5748 -2556 -2074 880 7658 5022 -3909 -3713
528c713N378j207o69L834l476r320L69R319N128j241m376l734J087L696K022J720
$$ -3713 1665 458 -211 3623 147 -9173 -8804 515 5643 4402 26 -3708 -2621 1075 3097 4817
544D817j944r061l741R696N672o652k886M877n79k454P002M333o232m886L200
$$ 4817 2873 -6188 -9929 -233 5439 -1213 -4099 778 199 -2255 4747 9080 2848 -2038 1162
559A162L828K15j269k778j573N32J50L282M445m744q183K435P729j257k435K436
$$ 1162 4990 5205 3936 1158 -415 117 267 3549 7994 3250 -4933 -2498 5231 3974 1539 3975
575C975k525p775J968J0060J457n814k657J472J251J762K147K436j962o805k346
$$ 3975 1450 -6325 -4357 5703 7160 1346 -1311 161 1412 3174 5321 7757 5795 -1010 -3356
590c356N514L956l379j720M48m251j491Q036O107n301o735J24M177L255L05l294
$$ -3356 2158 6114 2735 1015 1463 -2788 -4279 3757 9864 4563 -2172 -2048 2129 5384 5689 2395
606B395m477k204K571O254K722p242q299M771R712k47n747j81j845l633M586P374
$$ 2395 -2082 -4286 -1715 4539 7261 19 -8280 -3509 6203 5956 209 28 -1817 -5450 -864 6510
622F510k927p122K6L789J257O40K112J28k530l909n79M172K815k759k810L85l072
$$ 6510 3583 -3539 -3513 276 1533 2173 4285 4413 1883 -2026 -2605 1567 4382 1623 -1187 -802 -3874
639c874j304O841M901o387o339K196L463N95J543J098l727m061J106O158L453
$$ -3874 -5178 1663 6564 177 -6162 -3966 -503 92 1635 2733 -994 -5055 -3949 2209 5662
654E662l227m834o82K697J993K469J088m711o116K839P847R72m285l585k384k15
$$ 5662 2435 -2399 -3081 -384 1609 4078 5166 455 -5661 -2822 5025 5997 1712 -1873 -4257 -4472
670d472O288M665l884o655k592L335O273K642m087n188KK034J636L556j36n601
$$ -4472 1816 6481 2597 -4058 -6650 -3315 2958 5600 1513 -3675 -3673 -1639 -3 3553 3417 -2184
686b184j504L585K044p74J512O70k578j920J020M51J822K285k413m609j311K735
$$ -2184 -3688 -103 1941 1167 2679 3349 771 -1149 -129 322 2144 4429 2016 -2593 -3904 -1169
702a169L661K396l575o226r34M829L424J94k071m749j857M790N755J96l905l520
$$ -1169 2492 4888 1313 -4913 -5847 -1018 2406 2600 529 -4220 -6077 -1287 4468 4664 759 -2761
718b761m08L062M628Q52l168m048j005K333M850Q84l925k590j148O8L331L793
$$ -2761 -3169 -107 4521 5373 2205 -1843 -2848 -515 4335 5219 1294 -1296 -2444 -2376 955 4748
734D748k817n900l26L344J401P63J026j635l549J65L426J734q37j138j175q79
$$ 4748 1931 -3969 -4295 -951 450 1213 2239 604 -2945 -2780 646 2380 1543 405 -770 -1649
750a649k0J852L756N04m523k835K231K618J207O13j222n513k544N827O026k453
$$ -1649 -1669 183 3939 4443 -80 -2915 -684 1934 3141 3754 2532 -2981 -5525 302 6328 3875
766C875n672j878J590K192K631J198l079n604q63O005M211k553l937m72O56Q80
$$ 3875 -1797 -3675 -2085 107 2738 3936 857 -4747 -5610 395 4606 2053 -1884 -2356 -1700 -820
782h20L049K786k925m569K45L992J520j012m65l80k681j224L370L481j788m269
$$ -820 2229 5015 2090 -2479 -2234 1758 3278 2266 1801 1421 -1260 -2484 886 4367 2579 -1690
798a690j396K390L28O77K137p21m616k523M229N140j223l657j382K69M05K796
$$ -1690 -3086 -696 -368 309 2446 1725 -2891 -5414 -1185 3955 2732 -925 -2307 -2038 -1633 1163
814A163L698j703n773j861N379M074j063l207j159j254p24L765M467k879o405
$$ 1163 4861 3158 -2615 -4476 903 4977 3914 707 -452 -1706 -2430 1335 5802 2923 -3482
829c482l83N010K058j737p28o69k817q71M158L379l542m144J495L239m65m29K369
$$ -3482 -3865 1145 3203 1466 738 69 -2748 -3619 539 3918 376 -3768 -2273 966 501 72 2441
846B441k41l442j062L738K568k162j613Q85m53j815K656L959j869n182j249L519
$$ 2441 2200 -1242 -2304 1434 4002 1840 227 1112 659 -1156 1500 5459 3590 -1592 -2841 678
862F78J759r73m37o39k915j141M515M104l145m906p08L677J613O21N56k334l225
$$ 678 2437 1464 1027 388 -2527 -3668 847 4951 1806 -3100 -3808 -131 1482 2103 2659 325 -2900
879b900R37M803K932l196l813K34K122J081M29K60k291l164R71M764M93l099j838
$$ -2900 -1963 2840 5772 2576 -1237 -1003 1119 2200 2629 2889 598 -2566 -1595 3169 3662 563 -1275
896a275O99o7q6J189O48j738k263O99K545R88j348j91J095j322j126K610K289
$$ -1275 -576 -643 -729 460 1108 -630 -2893 -2194 351 1339 -9 -200 895 -427 -1553 1057 3346
913C346k194k657O85J123l76J657J294k449k901L86L142J585j396k713j493K95
$$ 3346 1152 -1505 -820 303 -73 1584 2878 429 -2472 -2086 1056 2641 1245 -1468 -2961 -2666
929b666J568K110J280k960m140J261M266J546k078j080j121j178K584L085p20
$$ -2666 -1098 1012 2292 -668 -4808 -3547 719 2265 187 -893 -2014 -3192 -608 2477 1757
944A757l157q14J053J632R93j02j177j425l23J247J613r3k148l73Q67j44l19J090
$$ 1757 -1400 -2214 -1161 471 1464 1362 185 -1240 -1563 -316 1297 1204 -944 -1317 -450 -594 -913 177
962A77j1k334q76J967M72K93O10k47k267J7J938J385N08j070k417j060J957K296
$$ 177 166 -2168 -3044 -1077 -605 -312 298 51 -2216 -2199 -261 1124 1632 562 -1855 -2915 -958 1338
980A338J180q26k607k315K804L041l36j745j364j993kK886K486k140k691q3P37
$$ 1338 2518 1692 -915 -3230 -426 2615 2279 534 -830 -2823 -2825 61 2547 407 -2284 -2367 -1630
997a630J832J403p89j834o14k21Q76J602K36k217o60J876L95o24J438P09k919
$$ -1630 202 1605 816 -1018 -1632 -1853 -977 625 861 -1356 -2016 -140 255 -369 1069 1778 -1141
1014a141n88K490R56j096O1k61j298m3J050J709L06l038k488J648L093o37n41
$$ -1141 -1729 761 1717 621 682 421 -877 -920 130 1839 2145 -893 -3381 -1733 1360 723 182
1031A82O5k369k691L908M944j955l501n69P91R6K831K337k049l440p77K612L094
$$ 182 247 -2122 -4813 -905 4039 2084 -1417 -1986 -1195 -1099 1732 4069 2020 -1420 -2197 415 3509
1048C509L6l137q06M50j080O85L715m53n123k59M052m41j570J760Q3l124l27K658
$$ 3509 3545 408 -398 52 -1028 -343 3372 2919 -2204 -2463 1589 1148 -422 1338 1421 -1703 -2030 628
1066F28Q52o81q18j609J030J503L28N66Q10k789k395L643L819k336k944M08o78
$$ 628 1480 799 -19 -1628 -598 905 1233 1799 2609 -180 -2575 1068 4887 2551 -393 15 -663
1083f63p27L655K472k893l790r65K150L018P40k892j984n0o74J429M742q41n526
$$ -663 -1390 2265 4737 1844 -1946 -2911 -761 2257 2997 105 -1879 -1929 -2603 -1174 3568 2727 -2799
1100b799p07L573N48k18K248j180l616k31L276J460o3j839j462N98J075m41Q88
$$ -2799 -3506 67 615 397 2645 1465 -2151 -2382 894 2354 2291 452 -1010 -412 663 222 1110
1117A110J314l448k873L983K888l652q85K119j696k438L487K914k732k642J42
$$ 1110 2424 -1024 -3897 86 2974 -678 -1563 556 -1140 -3578 -91 2823 91 -2551 -2409
1132b409Q77J867J483o29j485j419p08K730M250j731m821k68K164m3J840J840
$$ -2409 -1532 335 1818 1189 -296 -1715 -2423 307 4557 2826 -1995 -2263 -99 -142 1698 3538
1148C538k997m215J574L544M23j000j208j841Q7J353M15O15M06k412q16K709J048
$$ 3538 541 -3674 -2100 1444 1867 867 -341 -2182 -2095 -742 -327 288 694 -1718 -2534 175 1223
1165A223j580Q7J180j795q79K466J161j978K31L06q94O97J423o41p80m44p90O17
$$ 1223 -357 -270 910 -885 -1764 702 1863 -115 116 422 -472 225 1648 1007 227 -217 -1007 -390
1183c90K023l08k157n2R52r64N77J953j082k888K70J970O63M28l19j814n27J090
$$ -390 1633 1325 -832 -884 68 -896 -319 1634 552 -2336 -2066 -96 567 995 676 -1138 -1665 -575
1201e75J627J169o09k468o25J886J339q36L80o29j521O02K062M1k106m8J12j32
$$ -575 1052 2221 1612 -856 -1481 405 1744 908 1288 659 -862 -260 1802 1843 -263 -311 -199 -331
1219c31o6N10l0r35k45M18M98K78l00l8O64q25o18R74J389j072o67N07j53j35
$$ -331 -397 113 83 -852 -1097 -679 -181 97 -203 -241 423 -402 -1020 -46 1343 271 -396 111 -42 -177
1239a77J123J204j687j654J097J142J40m96q26p08m27J302J162q1j887j273R07
$$ -177 946 2150 463 -1191 -94 1048 1188 692 -134 -842 -1269 33 1195 1114 -773 -2046 -1139
1256a139J464l71j23j34n59p95J257J655l67j632p3O15O14M58J84o3j085q09J394
$$ -1139 325 -46 -169 -303 -862 -1657 -400 1255 888 -744 -817 -202 412 870 1054 991 -94 -903 491
1275D91J611q58j425P8K66j44k10R57l1j542q02P70J117l39J2L66o66r22L66K083
$$ 491 2102 1244 -181 -103 163 19 -191 766 735 -807 -1609 -839 278 -61 -49 317 -349 -1271 -905 1178
1295A178L28j644r33M31Q75N28J059J44k139j287J741K851q40k362m86J32J18
$$ 1178 1506 -138 -1071 -640 235 763 1822 1966 -173 -1460 281 3132 2292 -70 -556 -424 -306
1312c06N63J646n05k512r99K084J626n60j579J7l22p04J461K043n76k592k72J890
$$ -306 257 1903 1398 -1114 -2113 -29 1597 1037 -542 -525 -847 -1551 -90 1953 1377 -1215 -1487 403
1330D03J295q30M41N2j548o64J468J946l61k127j81O48K2J11J539k86k619j620
$$ 403 1698 868 1309 1361 -187 -851 617 2563 2202 75 -106 542 564 675 2214 1928 -691 -2311
1348b311K336J919m27j435p39k51m69J378K290n65k704j111K158J551J30k75o13
$$ -2311 25 1944 1517 82 -657 -908 -1377 1 2291 1726 -978 -2089 69 1620 1750 1475 862
1365H62j343o41K674K259j368k943o44J502Q33K36K40p27k086o94K351K067j320
$$ 862 -481 -1122 1552 3811 2443 -500 -1144 358 1191 1427 1667 940 -1146 -1840 511 2578 1258
1382A258k026j21M80m49R41J150k15k438p35K236J541l75r12Q3j151o56J811K022
$$ 1258 -768 -889 -409 -858 83 1233 1018 -1420 -2155 81 1622 1247 335 418 -733 -1389 422 2444
1400B444p66k338o49J188Q51L95M24j003j825p41J881J851r42j983q16P59L28
$$ 2444 1678 -660 -1309 -121 730 1125 1549 546 -1279 -2020 -139 1712 770 -1213 -2029 -1270 -942
1417i42Q59R64o53k618k02K439J110p17m05q41m83P26J049J170q42j638N5P50
$$ -942 -83 881 228 -2390 -2592 -153 957 240 -165 -1006 -1489 -763 286 1456 614 -1024 -969 -219
1435b19R43k91m11j16p34p24J202J494o66j337kj22j31P24P21p51r19k61M42J186
$$ -219 724 433 22 -94 -828 -1552 -350 1144 478 -859 -861 -983 -1114 -390 331 -420 -1339 -1600 -1158 28
1455B8O46p93m05k23l61Q78J415L3k008k08J007N89j17P12n96j557L01J679N7
$$ 28 674 -119 -524 -747 -1108 -230 1185 1218 -790 -998 9 598 481 1193 597 -960 -659 1020 1077
1474A077j099l83q07L28J092M23n67m67o18k12J632N13j310n63J113m03p02J819
$$ 1077 -22 -405 -1212 -884 208 631 64 -403 -1021 -1233 399 912 -398 -961 152 -251 -953 866
1492H66L95q36o02Q24k86rR06J87j184o04n3M37J522j16j533q2J85j023R30J799
$$ 866 1261 425 -177 647 361 352 1258 1445 261 -343 -396 41 1563 1447 -86 -168 17 -1006 -76 1723
1512A723q28k450Q06J065m79J74J226j213j039O89J480j88p98j99j22O07J059
$$ 1723 895 -1555 -749 316 -163 11 1237 24 -1015 -326 1154 966 168 -31 -153 454 1513
1529A513j199K26O69j235n4K426n72k639M73J066q09j55J452o26j908L69R90K20
$$ 1513 314 540 1209 -26 -80 2346 1774 -865 -392 674 -135 -290 1162 536 -1372 -1003 -13 207
1547B07M65q8j140p3Q9m25J373J365j225j710J230O12r03J053J193j701j646J276
$$ 207 672 584 -556 -629 -540 -965 408 1773 548 -1162 68 680 -223 830 2023 322 -1324 -48
1565d8J031Pk71m80n84pM64J89L34p35j561L39K266m15j753L33P90j189Q30J777
$$ -48 983 990 719 239 -345 -352 112 301 635 -100 -1661 -1322 944 529 -1224 -891 -101 -1290 -460 1317
1585A317q85k017L97J193O28L33n37j102J3O67J27J416J77k335j138J935N49r25
$$ 1317 432 -1585 -1188 5 633 966 429 -673 -660 7 134 1550 1727 -608 -1746 189 738 -187
1603a87J59J082k319r40J691J246r12l4R3j282L18N58J028Rp51j383O27J615l49
$$ -187 -28 1054 -1265 -2205 -514 732 -180 -214 -121 -1403 -1085 -527 501 510 -241 -1624 -997 618 269
1622B69m96O78j00j452J029J986r70k011K69J041J3M2K22p10r78K35R74R69k67
$$ 269 -227 451 351 -1101 -72 1914 944 -1067 -798 243 256 298 520 -190 -1168 -933 41 1010 743
1641G43k160n54J449P29k63O27l88k002k18K193J050j210l02k55l37K46J282O56
$$ 743 -1417 -1971 -522 207 -56 571 183 -1819 -2037 156 1206 -4 -306 -561 -898 -652 630 1286
1659A286m68j153m52O01J108k41p53L65q07p03L88J737m36j504O4O42n15P86L04
$$ 1286 818 -335 -787 -186 922 681 -72 293 -514 -1217 -829 908 472 -1032 -968 -326 -841 -55 249
1678B49n30j073r8R24R84j28n79n04N40L16J23R45j66j870k51J499P68p08l92
$$ 249 -281 -1354 -1452 -528 456 328 -251 -755 -215 101 224 1169 1003 -867 -1118 381 1149 441 49
1697D9l34o07J22J483N59j116j292J85O36J09L20l75n49m06j95P98J329p45o11
$$ 49 -285 -892 -770 713 1272 156 -1136 -951 -315 -206 114 -261 -810 -1216 -1411 -613 716 -29 -640
1716f40K6J20q4P28P55o52j192K57J093j23Q7M40p93q55J80J030L19n99o76j94
$$ -640 -614 -494 -578 150 905 253 -939 -682 411 288 375 815 22 -833 -653 377 696 97 -579 -773
1736g73K53J83J67N28q29j089J40J347O96o23j67m69J0L46J156lq09q46M25M48
$$ -773 -520 -337 -170 358 -471 -1560 -1420 -73 623 0 -167 -636 -626 -280 876 873 64 -782 -357 91
1756I1N34J84l45o94l72K60O34J158j299o91k0J22n0L59N92p64o55R1J011M13
$$ 91 625 809 464 -230 -602 -342 292 1450 151 -540 -560 -438 -488 -129 463 -301 -956 -865 146 559
1776E59j32n71j16k58J8O30Q57n97r85K79O62J88J78K62l80r34j20J418M89j061
$$ 559 427 -144 -260 -518 -500 130 987 390 -595 -316 346 534 712 974 594 -340 -460 958 1447 386
1796C86j208M27J9J31L66L84q00p96j52J580K08r18j95L0k87R9J130P66j242p99
$$ 386 -822 -395 -376 -245 121 505 -295 -1091 -1243 337 545 -373 -568 -538 -825 -726 404 1170 -72 -871
1816h71L66J035O6m82L49P5q00k17J566lq73o87O4K33k76N79M99p47j418P5J584
$$ -871 -505 530 596 114 463 538 -262 -479 1087 1084 211 -476 -412 -179 -455 124 623 -124 -1542 -1467 117
1837A17J93o40j32K18n71n5J131M21j117r56J126O44j4j88J44r8n92R4J150K14
$$ 117 310 -330 -462 -244 -815 -870 261 682 -435 -1391 -265 379 365 177 321 223 -369 -275 875 1089
1857A089j107q51M06O23k46N1Q7m16q87M78J182m6j165k2L36k53j07Q33O36q73
$$ 1089 -18 -869 -463 160 -86 -35 52 -364 -1251 -773 409 363 -802 -824 -488 -741 -848 -15 621 -252
1877b52p69O39J233j56q64L89Q6p08K44J129k10j082o04O74R39k15m17j19l11
$$ -252 -1021 -382 851 695 -169 220 306 -402 -158 971 761 -321 -925 -251 688 473 56 -63 -374
1896c74q12O89P81J04j134l92P90J98k40O89j36j078k09Q76J226o73n77j55N33
$$ -374 -1186 -497 284 388 -746 -1138 -348 -150 -390 299 163 -915 -1124 -248 978 305 -272 -427 106
1915A06j18k8P41Jp50r74J162N82m27p28L72q4o72Q39O38m86q35L5J74K38K2K69
$$ 106 -12 -40 701 702 -48 -1022 140 722 295 -433 -61 -145 -817 22 660 174 -661 -626 -452 -214 -192 77
1937G7l20k42k15L50J117J20j686K23M79r0M05Q22l57j274J57Q01O07m96l9p89
$$ 77 -243 -485 -700 -350 767 887 -799 -576 -97 -187 218 1040 683 -591 -434 367 974 478 439 -350
1957c50m25N27L92K17j39j111j27P36O15m88j10M03p91Q8Q06L21q74o7N18l63
$$ -350 -775 -248 144 361 222 -889 -1016 -280 335 -153 -263 140 -651 -563 243 564 -310 -377 141 -222
1977b22L76N51j1m69n63L18M01M98l83m69m3P5m68O40P10p83r46J41P00l37M42
$$ -222 154 705 694 225 -338 -20 381 879 496 27 -16 59 -409 231 941 158 -788 -647 53 -284 158
1998A58M8q51o39O55Q26L15m0q77k76L82O23j20M91j45r78l69J217M37n33j70
$$ 158 206 -645 -1284 -629 197 512 472 -405 -681 -299 324 204 695 550 -428 -797 420 857 324 154
2018A54J96p64n4J267o0q69m03L86j9K53l8l42M8k64K14L07N56p06m55N84R8n15
$$ 154 350 -414 -468 799 739 -130 -533 -147 -166 87 49 -293 -245 -509 -295 12 568 -138 -593 -9 89 -426
2040d26O24O56q74n67P23O77k91j9k40l08j96O5O71M37m48r46n68J029M37m47
$$ -426 198 854 -20 -587 136 813 522 503 263 -45 -241 -176 495 932 484 -462 -1030 -1 436 -11
2060a1P99n80j616J54J553K97n29m59M62o07j25J350Q6p61n70J9N44Q55k09n60
$$ -11 788 208 -1408 -1254 299 596 67 -392 70 -537 -662 688 774 13 -557 -538 6 861 652 92
2080I2L09l59n46Q02Q82q34j421R51L61n41L2P04o45m79K04J040l50j79p25M9
$$ 92 401 42 -504 298 1180 346 -1075 -124 237 -304 -272 432 -213 -692 -488 552 202 23 -702 -653
2100f53O19l6p2R80o54j298M94J633K1r57J91o3o99J97J292M3j252k31k27O20
$$ -653 -34 -70 -142 838 184 -1114 -620 1013 1034 77 268 205 -494 -297 995 1038 -214 -445 -672 -52
2120e2L69J9j57k33j82o33R59R33j198p02Q83k13n61Q86P39q65q47N90P16j40
$$ -52 317 336 179 -54 -236 -869 90 1023 -175 -877 6 -207 -768 118 857 -8 -855 -265 451 311
2140C11q7K42m26Q9K57j2L42j61j194K42J009k3q73R7J6n46L41R82M9j442J18
$$ 311 224 466 40 129 386 374 716 555 -639 -397 612 589 -284 -187 -171 -717 -376 606 655 -787 -669
2161f69N1K67M05L09l63n61J48J45M93R77q94q23P67j66m37R63L00q39p20P31
$$ -669 -618 -351 54 363 0 -561 -413 -268 225 1202 308 -515 252 86 -351 612 912 73 -647 84
2181H4N36o76J38L72n89j97K74J30J8k15m63Q2N47l60m1K29j40m61M55J098m83
$$ 84 620 -56 82 454 -135 -332 -58 72 90 -125 -588 -506 41 -319 -360 -131 -271 -732 -277 821 338
2202C38p91L83K01k86N15N66o17k65l09M09N45L1m67n57P8J33l6N51k69p10k87
$$ 338 -453 -70 131 -155 360 926 309 44 -265 144 689 720 253 -304 -226 -93 -129 422 153 -557 -844
2223h44R42K1m72K63om15N8N86J82k79j6n1P5N94k56n0K1l05l70N58N58l24l99
$$ -844 98 119 -353 -90 -96 -511 -453 133 315 36 20 -31 44 638 382 332 353 48 -322 236 794 470 71
2246G1K72k39n4O7K47l26k90k8K25j12J56J00l35K51j15L00O04k24p92j53M80
$$ 71 343 104 50 117 364 38 -252 -280 -55 -167 -11 89 -246 5 -110 190 794 570 -222 -375 105
2267A05J15j46N15n7p96M36N75J08k36m50J66l14J1K43K10m44m84R2P52j27m46
$$ 105 220 74 589 532 -264 172 747 855 619 169 335 21 32 275 485 41 -443 -351 401 274 -172
2288a72p5Q6k28j15O92J6j53l03J46L55l23M79J41k06k88O4K56J59k43m11K63
$$ -172 -247 -161 -389 -504 188 204 51 -252 -106 249 -74 405 546 340 52 116 372 531 288 -123 140
2309A40k08J07K19K72k73p81pR42l17j64l38M17o16J20P02O71r17o37K90J68K05
$$ 140 -68 39 258 530 257 -524 -531 411 94 -70 -408 9 -607 -487 215 886 -31 -668 -378 -210 -5
2330eJ26M52n34m32J7P88L01n50j33J47j86o3O76J56m29q87J83O75n5j97pp2l57
$$ -5 121 573 39 -393 -376 412 713 163 30 177 -9 -72 604 760 331 -556 -373 302 247 50 43 -29 -386
2353c86m06J040J8m74n28L04L61k55K30M36k06m98k16R26M07n87k75jJ07K0K10
$$ -386 -792 248 266 -208 -736 -432 -71 -326 -96 340 134 -364 -580 346 753 166 -109 -110 -3 17 227
2374B27L57m19q10K93N57J2m81Q0j13m23n1Q91L18m17q80M94L37L7j19J78k70
$$ 227 584 165 -645 -352 205 217 -264 -184 -297 -720 -771 120 438 21 -859 -365 -28 9 -110 68 -202
2395b02k93J68O59J95n39j95K74L47m58K83O37q40p11N51N10M5n00J24r9m26J6
$$ -202 -495 -327 332 527 -12 -207 67 414 -44 239 876 36 -675 -124 386 431 -69 55 -44 -470 -454
2416d54O71K4n91l25K51O05O3l63L30j86m27K98Q25K8n62m53M36M9l8L02J0j67
$$ -454 217 241 -350 -675 -424 181 244 -119 211 25 -402 -104 721 749 187 -266 170 219 181 483 493 326
2438C26o72O76P2J32o27j40L28k32R5J80K10m50o16M48N19k46L2K02l47k51L48
$$ 326 -346 330 402 534 -93 -233 95 -137 -42 138 348 -102 -718 -270 249 3 35 237 -110 -361 -13
2459a3O75k18j35m27J44J45J24L96k70j60n92M1P31J37n55l2J22m22j32J083k60
$$ -13 662 444 309 -118 26 171 295 691 421 261 -331 -290 441 578 23 -9 113 -309 -441 642 382
2480C82p30j2J33Q3K15k16K09n3k31r6M37K76o25J14M50k42k93K29L88k45m65
$$ 382 -348 -360 -227 -144 71 -145 64 11 -220 -316 121 397 -228 -114 336 94 -199 30 418 173 -292
2501b92N97K40k64j55j79j09l74M80L96m85k20j50N0O64k02m73J49K74n89L08
$$ -292 305 545 281 126 -53 -162 -536 -56 340 -145 -365 -515 -465 199 -3 -476 -327 -53 -642 -334
2521c34P41l53n26K57K49j46K66M20k95l18R6jj56L61n0k80K73mj94J04K69l68
$$ -334 407 54 -472 -215 34 -112 154 574 279 -39 57 56 -100 261 211 -69 204 200 6 110 379 11
2543A1k50M07n1o39L40K89o41J24M80j00j52j73J75J6L93l27M19m52K62m86N57
$$ 11 -239 168 117 -522 -182 107 -534 -410 70 -30 -182 -355 -180 -164 229 -98 321 -131 131 -355 202
2564B02M16m20l14L51l4m99K86O31n30m17L65k00J50L6l2m66L96k62q4P50J93
$$ 202 618 198 -116 235 201 -298 -12 619 89 -328 37 -163 -13 23 -9 -475 -79 -341 -425 325 518
2585E18q55o8P77p08K4P14O5q63M43M38r8n56K88K2k85L41j56j61K10j23l83Q15
$$ 518 -337 -405 372 -336 -312 402 467 -396 47 485 387 -169 119 141 -144 197 41 -120 90 -33 -416 399
2607C99M5p47k05L48J4p63O81O53p46m60N12N23k75M66k90l14k50L09j17R15j98
$$ 399 444 -303 -508 -160 -146 -909 -228 425 -321 -781 -269 254 -21 445 155 -159 -409 -100 -217 698 500
2628E00p36o7M16j59j5R45m11r47m16J153k21n11J40J69n93M78M16k61J78k91
$$ 500 -236 -303 113 -46 -61 884 473 -474 -890 263 42 -469 -329 -160 -753 -275 141 -120 58 -233
2648b33k46O03Q4j94j97L72j96j48M06L38n11k59L09Q4k32L75r0o63j7j0P38o4
$$ -233 -479 124 208 14 -183 189 -7 -155 251 589 78 -181 128 212 -20 355 265 -398 -415 -425 313 249
2670B49l8o69J72K8J62k4M20m45o93M54N19r2K3L80l61l44O5O69m6j76l05j56
$$ 249 211 -458 -286 -258 -96 -120 300 -145 -838 -384 135 43 66 446 85 -259 -194 475 429 253 -52 -208
2692b08M88L5j83K31J11n88n1N28Q7p30J24J09l84J69M51Q8o13l76L87L78L20
$$ -208 280 315 132 363 474 -114 -165 363 450 -280 -156 -47 -431 -262 189 277 -336 -712 -325 53 373
2713C73l82m00M04J28m4L59K86n10o16N40K61l45j2L10l73j92J79M40k06J4l09
$$ 373 -9 -409 -5 123 79 438 724 214 -402 138 399 54 42 352 -21 -213 -34 406 200 214 -95
2734i5K09j96K36k0J26m73k14R7L63K35o28K41n2R8q0O83p2o39J5L48j31P2j29
$$ -95 114 -82 154 134 260 -213 -427 -330 33 268 -360 -119 -171 -73 -153 530 458 -181 -166 182 51 123 -6
2757fK10j35l37M61K7O6l23O9k25O7R5J94m7m88M9J64J54j84K40j60O3j23K01
$$ -6 204 69 -268 193 220 286 -37 32 -193 -126 -31 163 116 -372 -323 -159 -5 -189 51 -109 -46 -169 32
2780C2J95lj92j42M41k07l0J58L9k94l28M18J14k0k16k0K34j72n0J49J1l37j18
$$ 32 227 224 32 -110 331 124 94 252 291 -3 -331 87 201 181 -35 -55 179 7 -43 106 117 -220 -338
2803c38K90j0l6no0M0k18K7M71k11k80P5L36J0j69M83j69j23l05K05M21oq08N29
$$ -338 -48 -58 -94 -99 -159 -119 -337 -310 161 -50 -330 -255 81 91 -78 405 236 113 -192 13 434 428 -380 149
2827A49l4l02K89J16N9o28L7K06J47n9j9L2l36M3l9L79o5m34R7N67j83J73j40
$$ 149 115 -187 102 218 277 -351 -314 -108 39 -20 -39 -7 -343 -300 -339 40 -25 -459 -362 205 22 195 55
2850E5K14j96j24K02Q2jm18n5L70k02M5L52j49l24m35N57J70j82l31O0Q7P3j25
$$ 55 269 73 -51 151 233 232 -186 -241 129 -73 -28 324 175 -149 -584 -27 143 -39 -370 -310 -223 -150 -275
2873b75L97L6o61L39L67M3l80K2P0n5N1J37N03l52m28L35q7J04n9M6o5m39J5L93
$$ -275 122 158 -503 -164 203 246 -134 -112 -42 -97 -46 91 594 242 -186 149 62 166 107 153 88 -351 -336 57
2897E7P9k35j45m9L07j54J4O56n33k66k35P05m6m7J12Q7k71K19m9R9k55k42L42
$$ 57 136 -99 -244 -293 14 -140 -126 530 -3 -269 -504 201 155 108 220 307 36 255 206 305 50 -192 150
2920A50j51K74j57J48L1m55O9L43R8l78l09J98m6kP1Q9Ol88J09M61j01R0j75m3
$$ 150 -1 273 116 264 295 -160 -91 252 350 -28 -337 -139 -185 -187 -116 -27 -21 -409 -300 161 60 150 -25 -68
2944f8K58K6k66M68j70m55L11J88Pl56K25L3l02l5L49R9m50J64p9K67o10L72n8
$$ -68 190 216 -50 418 248 -207 104 292 299 -57 168 201 -101 -136 213 312 -138 26 -53 214 -396 -24 -82
2967h2j85o9LL63L46m05l77K50p8L25M1K21k84j41R5K06k72M82r0m87J15o9L49
$$ -82 -267 -336 -333 30 376 -29 -406 -156 -234 91 132 353 69 -72 23 229 -43 439 349 -138 -23 -92 257
2990B57m7k59k39K81n5K89n02K31j17n94M71N55k24l35J06K9R4O9K24k12m6K1
$$ 257 210 -49 -288 -7 -62 227 -275 -44 -161 -755 -284 271 47 -288 -182 -153 -59 10 234 22 -24 -3
3012cmM53p8k15n2k9j78J54K65J33m89l00J78K43k92L55r3j61O4K11l02R9k3J8
$$ -3 -7 446 368 153 101 72 -106 48 313 446 -43 -343 -165 78 -214 141 48 -113 -49 162 -140 -41 -64 -46
3036d6m83M96j66J25N36k67n70N49O7k36NK6L17o59N58N5k79K19j29k97J33M9
$$ -46 -529 -33 -199 -74 462 195 -375 174 241 5 10 36 353 -306 252 307 28 247 118 -179 -46 3
3058Ck0l31K57r6J06L93k38k13j52L98j29k45P79m29k88%M04J22j30P4n7l24K53
$$ 3 -17 -348 -91 -187 -81 312 74 -139 -291 107 -22 -267 512 83 -205 -205 199 321 191 265 208 -116 137
3081A37r%L26l73k23P2J81l45M60M4o34l7L15K08Ql15K88k44J0k01N72k43J2o1
$$ 137 128 128 454 81 -142 -70 111 -234 226 270 -364 -401 -86 122 130 -185 103 -141 -131 -332 240 -3 9 -52
3105e2K33k86J94l44K91M16n94J06L13O1o21K67Pj64j17N48k41k13j49L92R6j34
$$ -52 181 -105 89 -255 36 452 -142 -36 277 338 -283 -16 -9 -173 -290 258 17 -196 -345 47 143 9
3127Ij87k40K32L62m58M78K2n27j75N87J54l83M57r8l66k09N02K60j07l31J58
$$ 9 -178 -418 -186 176 -282 196 218 -309 -484 103 257 -126 331 233 -133 -342 160 420 313 -18 140
3148A40m14K17O7K70j97l73N1j88N25r9l90M57j36p8J0K46m1m71J57K05K02j28
$$ 140 -274 -57 10 280 83 -290 -239 -427 98 -1 -391 66 -70 -148 -138 108 67 -404 -247 -42 160 32
3170C2J4p2L6j09M07j92K4p3oR5n6K0n8K04n48J90r5M56n73K32O3L8l12J71J39
$$ 32 46 -26 10 -99 308 116 140 67 61 156 100 120 62 266 -282 -92 -187 269 -304 -72 -9 29 -283 -112 27
3195B7n1k49j01L90R5o5p5M2N7j80J8O77l94l06j90M81q5k39M05o8l07K82K8j08
$$ 27 -24 -273 -374 16 111 46 -29 13 70 -110 -92 585 191 -115 -305 176 91 -148 257 189 -118 164 192 84
3219H4k17J19m8o0M6l9l0J75m70K51L49j63r4j14P9k7L64K08k46j63j64K98J48
$$ 84 -133 -14 -62 -122 -76 -115 -145 30 -440 -189 160 -3 -97 -211 -132 -159 205 413 167 4 -160 138 286
3242B86J68j79k56J07q0K8o6J53k29l81K98K7q0J56N2J5p22M33K41L06k08l16
$$ 286 454 275 19 126 46 74 8 161 -68 -449 -151 -124 -204 -48 4 19 -703 -270 -29 277 69 -247
3264b47J48q4L12p0R0l07Q6O4J36J48k7l13pp5l0N46n25J8J4K3K82j56j5l4r9
$$ -247 -99 -183 129 59 149 -158 -72 -8 128 276 249 -64 -71 -146 -176 370 -155 -137 -123 -100 182 26 11 -23 -122
3289a22j92J40J81Mo8m08L07LK92p8L40n62J19K00r7J62j24J31m09L4K61j62L59
$$ -122 -314 -174 7 11 -57 -465 -158 -155 137 59 399 -163 -44 156 59 221 97 228 -181 -147 114 -48 311
3312C11l92L1j66K59j5k60K04j43J5q5J47j45k0QL92l95J23K25j9j72j06M5L95
$$ 311 -81 -50 -216 43 28 -232 -28 -171 -156 -241 -94 -239 -259 -251 141 -254 -131 94 75 -97 -203 -158 237
3335B37o2l12L01j5n7P7J2j81J16k17l5J99k47L29L3j63m19P4M21J0l41P7J7K41
$$ 237 175 -137 164 149 92 169 181 0 116 -101 -136 63 -184 145 178 15 -404 -330 91 101 -240 -163 -146 95
3359I5l1M9L9m10k69M89K18Q9l74J61j47j98L43o9K80m11k91L65L69j40O0J9l58
$$ 95 64 113 152 -258 -527 -38 180 269 -105 56 -91 -289 54 -15 265 -146 -437 -72 297 157 217 236 -122
3382a22n6j63L30J91r3k22J17L0kr0R7k80J20J47lJ34K1k3k24O9J84n2M1k63J40
$$ -122 -178 -341 -11 180 87 -135 -18 12 10 -80 17 -263 -143 4 1 135 156 133 -91 -22 162 110 151 -112 28
3407B8J54N2j17o6K06m45L43k16M13k44k55j69K50j11K32M0j72j99J46M0M8K82
$$ 28 182 234 117 51 257 -188 155 -61 352 108 -147 -316 -66 -177 55 95 -77 -276 -130 -90 -42 240
3429B40n1J4j35j01K1M36q8k45q7K22J06j88J68o6m37J9L5j7K39k58j08J47L55
$$ 240 189 203 68 -33 -12 424 336 91 4 226 332 144 312 246 -191 -172 -137 -154 85 -173 -281 -134 221
3452B21l77J24Jl04o6L96Q4J46l98L21j84L8J18J30l4m32N36k24R7r9n2R3n4q4
$$ 221 -156 -32 -31 -335 -401 -5 79 225 -173 148 -36 2 120 250 216 -216 320 96 193 94 42 135 81 -3
3476cq5J68J70m37K58j07l51k5L60N2j18j52K96q5m5J38l56K85J74J9m35L74j76
$$ -3 -88 80 250 -187 71 -36 -387 -412 -52 0 -118 -270 26 -59 -104 34 -322 -37 137 156 -279 95 -81
3499h1k49M30K46l91K58j78j26j90K28J61l8j33l1J16Mj42j93J26J17K0kj87K16
$$ -81 -330 100 346 -45 213 35 -91 -281 -53 108 70 -63 -94 22 26 -116 -309 -183 -66 -46 -48 -235 -19
3522a9l12L02K2l06K81L04l39j79L04K82m03L58j68ok3J54k58m6K9r6j41K47J82
$$ -19 -331 -29 -7 -313 -32 272 -67 -246 58 340 -63 295 127 121 98 252 -6 -52 -23 -119 -260 -13 169
3545A69k39J35j11k62j4M04R9k55k16J37p2m1L95j11k41L31J80R8j89j09q2P6
$$ 169 -70 65 -46 -308 -322 82 181 -74 -290 -153 -225 -266 129 18 -223 108 288 386 197 88 6 82
3567H2Lj44K97l44K3k16L31j32l4rJ75Kl63N95k76m8k17J87m8J97n5J5j32K19
$$ 82 85 -59 238 -106 -83 -299 32 -100 -134 -143 32 34 -329 266 -10 -58 -275 -88 -136 61 6 21 -111 108
3591A08j71m9K05J15j22K57l07r6l50N83N9m43J17n3J71J48k37L5j00K84n47K88
$$ 108 -63 -112 93 208 86 343 36 -60 -410 173 232 -211 -94 -147 24 172 -65 -30 -130 154 -393 -105
3613a05L14k58j78K47L10p75M25K03k68k7M5L20m06J67K23j45L9J26j87j93M13
$$ -105 209 -49 -227 20 330 -445 -20 183 -85 -112 -67 253 -153 14 237 92 131 257 70 -123 290
3634B90k49j58L12o2l20L6L22p32L04L62p4m07M13L07n36K47J77l03j68P5p1M80
$$ 290 41 -117 195 133 -187 -151 171 -561 -257 105 31 -376 37 344 -192 55 232 -71 -239 -164 -235 245
3656B45N3k95k1n6K21npJ96k05kj66K97k34j64K45m7l8q8M0N0Q9l49K36L20l38
$$ 245 298 3 -18 -74 147 142 135 331 126 124 -42 255 21 -143 102 55 17 -71 -31 19 108 -241 -5 315 -23
3681b3P3l0J44n50K77J72L7k81K42J43k01J3MJ78n21J93J10NL53j64k27q1L37
$$ -23 50 20 164 -386 -109 63 100 -181 61 204 3 16 20 198 -323 -130 -20 -15 338 174 -53 -134 203
3704B03k82J7J55m02K83j8J31k48K64j2j58j0K90O6m2k65l74L79J49p0j08J59
$$ 203 -79 -62 93 -309 -26 -44 87 -161 103 91 -67 -77 213 279 237 -28 -402 -23 126 56 -52 107
3726A07n0q4K58m4l4L0k6j13j03j84N09m62o2J63K2l9K21J06r1j40Kn5J65J51
$$ 107 57 -27 231 187 153 183 157 44 -59 -243 266 -196 -258 -95 -73 -112 109 215 124 -16 -14 -69 96 247
3750B47o31P8L83j13J54m4O2n08K69M30k51J35l49K03k15J15N8k10J96k99J34
$$ 247 -384 -306 77 -36 118 74 136 -372 -103 327 76 211 -138 65 -150 -35 23 -187 9 -290 -156
3771a56K05o0k51K02qq9m7J10K87k00r0j0L41l27J38K53k73P2N3o0K29l83J04
$$ -156 49 -11 -262 -60 -68 -157 -204 -94 193 -7 -97 -107 234 -93 45 298 25 97 150 90 319 -64 40
3794D0J09j27J37k3l8J38k18P2J40k5l39J77Kj19j90K00J01l04L98k95J47L3K9
$$ 40 149 22 159 136 98 236 18 90 230 205 -134 43 45 -74 -264 -64 37 -267 131 -164 -17 16 45
3817D5J02o9r7p9K89j84J63k09L10j14m99N07J79k96k12M1K17k83J38M0K7m3o7
$$ 45 147 78 -19 -98 191 7 170 -39 271 157 -342 165 344 48 -164 -123 94 -189 -51 -11 16 -27 -94
3840i4P6J1j41J10J73o9j22N8J23J41m2l70R3QM24l79L18l29K30k79M09m20R6
$$ -94 -18 -7 -148 -38 135 66 -56 2 125 266 224 -146 -53 -45 379 0 318 -11 219 -60 349 -71 25
3863B5J17k51J9k43L07o8j30K01k0J0om2K60j13J07j60m5J6R7M8j70J42J30l40
$$ 25 142 -109 -90 -333 -26 -94 -224 -23 -43 -33 -39 -81 179 66 173 13 -32 -16 81 129 -41 101 231 -109
3887a09P8J45k71J52K32k36M0J82j02p0k91L06p0N2k61K94j83R7rR9J21l69K81
$$ -109 -31 114 -157 -5 227 -9 31 213 111 41 -250 56 -14 38 -223 71 -112 -15 -24 75 196 -173 108
3910A08j87J33j5Lp7R6L5j31M78m97j26L00J1l24r4K89J52k37k81M09l30K55l2
$$ 108 -79 54 39 42 -35 61 96 -35 443 -54 -180 120 131 -193 -287 2 154 -83 -364 45 -285 -30 -62
3933f2p7K96m31J72JL7R9r4J3N7m2j4OJ74l3k13J15R3K51k62NK4k86K19o6J90
$$ -62 -139 157 -274 -102 -101 -64 35 -59 -46 11 -31 -45 -39 135 102 -111 4 97 348 86 91 115 -171 48 -18 172
3959A72k91R9J59j93j34L50M6m28J59j44K7Q9j43L19k42K71j01JL4j82J32K7J20
$$ 172 -119 -20 139 -54 -188 162 208 -220 -61 -205 -178 -89 -232 87 -155 116 15 16 50 -132 0 27 147
3982A47j97K40j5L5k17J22j37j5O6J97j40j88j4J47j94J95m08K78Q9Q7j49k4J72
$$ 147 -50 190 175 210 -7 115 -22 -37 29 226 86 -102 -116 31 -163 32 -376 -98 -9 78 -71 -95 77
4005G7k62j86K66K39k66K03j26M7j16K69j72l9j74M61k90j7J94r2Q3N6k53p9L25
$$ 77 -185 -371 -105 134 -132 71 -55 -8 -124 145 -27 -66 -240 221 -69 -86 108 16 99 155 -98 -177 148
4028A48j89k89K72j04P0pJ16j94p3K33J98j94m74O83j23m3K65j84j37R6RJ68j75
$$ 148 -41 -330 -58 -162 -92 -99 17 -177 -250 -17 181 -13 -487 196 73 30 295 111 -26 70 79 247 72
4051G2L1r8n7L3lK36k32n5n01N08K70R4l46R5j92L8L4p7J09P9k92M6L09j86j07
$$ 72 103 5 -52 -19 -22 214 -18 -73 -574 -66 204 298 -48 47 -145 -107 -73 -150 -41 38 -254 -208 101 -85 -192
4076a92L28o0q6L5M2m32J21J59n9J5K49P0j62k54M82k80k13M45m74K72j81M4j4
$$ -192 136 76 -10 25 67 -365 -244 -85 -144 -129 120 190 28 -226 256 -24 -237 208 -266 6 -175 -131 -145
4099a45J53R1p4j54J06%m3oJ84j05j95J43L8M39l04m9qk7l7p2K55r2l31J43K84
$$ -145 8 99 25 -129 -23 -23 -66 -72 112 7 -188 -45 -7 432 128 79 71 44 7 -65 190 98 -233 -90 194
4124A94k01j88L9K75m45J32L32j49Q3R4j81K1l8p8J78N8j63n2J91m9K6L1j38J2
$$ 194 -7 -195 -156 119 -326 -194 138 -11 72 166 -15 6 -32 -110 68 126 -37 -89 102 53 79 110 -28 -16
4148a6m1L51k72r1o0J04N7J20j26P2k49Kj2j22L39k28J18N4J68k19J3J72Q7l32
$$ -16 -57 294 22 -69 -129 -25 32 152 26 98 -151 -149 -161 -283 56 -172 -54 0 168 -51 -38 134 221 -111
4172a11j61L72j10K1J51o7j00J13O2q1J55j40k93J78L7p8KJ18j74l5M8M3p0J10
$$ -111 -272 100 -10 11 162 95 -5 108 170 89 244 104 -189 -11 26 -52 -50 68 -106 -141 -93 -50 -120 -10
4196a0J87l69M9K94N9j87k4j05j3K03Ok21l23N83k93L94j41j1l47L63j43o0j16
$$ -10 177 -192 -143 151 210 23 -1 -106 -119 84 90 -131 -454 129 -164 230 89 78 -269 94 -49 -109 -225
4219b25k6J22J44k84J34N6J90k32J80k4k73R9o8K18k14L27k57J80j46J70J85O
$$ -225 -251 -129 15 -269 -135 -79 111 -121 59 35 -238 -139 -207 11 -203 124 -133 47 -99 71 256 262
4241B62k06j94o9L91k75K15k21K25k4j86J38j87P5k10O80m02j21o8J16M5k54K68
$$ 262 56 -138 -207 184 -91 124 -97 128 104 -82 56 -131 -56 -266 414 12 -109 -177 -61 -16 -270 -2
4263bP5O6k47J48J42l77J22K65k30n6K90P8j90l7p4j6P8q3o4J38K01m6j81L0k23
$$ -2 73 139 -108 40 182 -195 -73 192 -38 -94 196 274 84 47 -27 -43 35 -48 -112 26 227 181 0 30 -193
4288a93O4j9pJ27k46K46k28K17J61j91j62J24L2P7O1R6l19K02n6J4L9K45k60M5
$$ -193 -129 -148 -155 -28 -274 -28 -256 -39 122 -69 -231 -107 -75 2 63 159 -160 42 -14 0 39 284 24 69
4312F9j7L2k64J90j45J97o1p6M0r6j0q5J07p9p8J01J97Qo0P4ol23M30l70M26j61
$$ 69 52 84 -180 10 -135 62 1 -75 -35 -131 -141 -226 -119 -198 -276 -175 22 30 -30 44 38 -285 145 -225 201 40
4338D0k0n4j7Q4ok9o5M1M4J26q2o1k2K27j26j19j86M7J12q9l1J03J6K89j55r5
$$ 40 20 -34 -51 33 27 -2 -67 -26 18 144 62 1 -21 206 80 -39 -225 -178 -66 -155 -186 -83 -67 222 67 -28
4364b8J32P2l0l7J4o4j97J45J11O1lL1j20m7M6k00n6J32q5J74O0%l40J80Q5L7
$$ -28 104 176 146 109 123 59 -138 7 118 179 176 207 87 40 86 -114 -170 -38 -123 51 111 111 -229 -49 36 73
4390G3j31J34k47R8k4J41j55j57L91j22k75L86j86J51l50M17j13j25L08l31K21
$$ 73 -58 76 -171 -73 -97 44 -111 -268 123 1 -274 112 -74 77 -273 144 31 -94 214 -117 104
4411A04j52m1K93J30L7p24L69j12RJ0J05O3l47L58L0m6j95K26N6l3J61l23K50
$$ 104 -48 -89 204 334 371 -353 16 -96 -87 -77 28 91 -256 102 132 86 -109 117 173 140 301 -22 228
4434B28K2k46J32j75L2J0J11l6N0k80q7K90q6J36j54j44K0K88p1r6J9j7J60j83
$$ 228 250 4 136 -39 -7 3 114 78 128 -152 -239 51 -35 101 -53 -197 -177 111 40 -56 -37 -54 106 -77
4458g7P8k3p8J49m5r8K75k04K00r9L45l09n8J03m8m03J59J66l1l2J15j23K63k63
$$ -77 1 -22 -100 49 4 -94 181 -23 177 78 423 114 56 159 111 -292 -133 33 2 -30 85 -38 225 -38
4482c8K88k72k45L53j57J46l81J83J96O0r5J44k67K21k24L68k30j00M18l95J7
$$ -38 250 -22 -267 86 -71 75 -306 -123 73 133 38 182 -85 136 -88 280 50 -50 368 -27 -10
4503a0J82j83l2J16j44l26L72J04j94L02k59Q4k99l0K30L6l69L94j55K59n0O1
$$ -10 172 -11 -43 73 -71 -397 -25 79 -115 187 -72 12 -287 -317 -87 -51 -420 -26 -181 78 28 89
4525H9k73K36L6l17J13M5QN4O6J85j25o1N6O7k44j62P9o5K73J00o6k16L7M12l95
$$ 89 -184 52 88 -229 -116 -71 -63 -9 57 242 117 56 112 179 -65 -227 -148 -213 60 160 94 -122 -85 327 -68
4550f8J5j8l3J20p8lL37j06m27K98J00k19O1M1J72k15n1M0n4j44J87J22j06K85
$$ -68 -53 -71 -104 16 -62 -65 272 166 -261 37 137 -82 -21 20 192 -23 -74 -34 -88 -232 -45 77 -29 256
4574B56k70j4L57l47j38J68p1N4k62L00j70J32n7K52n5j96l7Q0J75q6j38oK1Q5
$$ 256 -14 -28 329 -18 -156 12 -59 -5 -267 33 -137 -5 -62 190 135 -61 -98 -18 157 71 -67 -73 -52 33
4598C3K22j19J53k73Q1P2k82J89k19J05k75M84J48l45J06q0j21LN8l0J49j4o1
$$ 33 255 136 289 16 97 169 -113 76 -143 -38 -313 171 319 -26 80 0 -121 -118 -60 -90 59 45 -16
4621a6J34j61K36r9q4qj42N9J70R1j34r4j29K41k07J00o2R2R7m2l79K40M1p7Q7
$$ -16 118 -43 193 94 10 2 -140 -81 89 180 46 -48 -177 64 -143 -43 -105 -13 84 42 -337 -97 -56 -133 -46
4646d6O2j07o4R4p9K92l52L49k95J20J40n0j27K31j8k48O7K21j19l13L43k04J21
$$ -46 16 -91 -155 -61 -140 152 -200 149 -146 -26 114 64 -63 168 150 -98 -31 190 71 -242 101 -103 18
4669A8K14k13l07L88J84n12R1L92j97r3k62M39l24J7N9J66j07P1m6L2o6M4j33
$$ 18 232 19 -288 100 284 -228 -137 255 58 -35 -297 142 -182 -165 -106 60 -47 24 -22 10 -56 -12 -145
4692a45k6KK67%n2j53J3P0j1n3KJ10J81M3m16K37r2J5R5K7j70J52j61K22k39k3
$$ -145 -171 -169 98 98 46 -107 -94 -24 -35 -88 -86 24 205 248 -168 69 -23 -8 87 114 -56 96 -65 157 -82 -105
4718a05J18J64j85n1N5j01K08LJ50k11R7j58j33J13k49L53k81M06q4k61j54L23
$$ -105 13 177 -8 -59 -4 -105 103 106 256 45 142 -16 -149 -36 -285 68 -213 193 109 -152 -306 17
4740A7K4j41K09j66O8J82l13J08J38k12Pj2J04j10J84LJ2j51K48J50n16K07K2
$$ 17 41 -100 109 -57 11 193 -120 -12 126 -86 -79 -91 13 -97 87 90 102 -49 199 349 -167 40 62
4763F2j1J08j20j5K87m26L19m33J45K76l01J83j01k24J83J35j41k59J43K95j99
$$ 62 51 159 39 24 311 -115 204 -229 -84 192 -109 74 -27 -251 -68 67 -74 -333 -190 105 -94
4784i4M0L94m52MM97m50k8J92j00o8j2J14m9R8j40J1q0K74k42N4J96l04M9o4j35
$$ -94 -54 340 -112 -108 389 -61 -89 103 3 -65 -77 37 -12 86 -54 -43 -123 151 -91 -37 159 -145 -96 -160 -295
4809b95K45n8k53L34J18k43J06l25M28M6MM8jO1N0P6jj08l57L76o58J37O5M63
$$ -295 -50 -108 -361 -27 91 -152 -46 -371 57 103 107 155 154 215 265 341 340 232 -125 251 -407 -270 -205 258
4833B58m72K31J58j64Om4J36k26J37r9k2P5no2J6K5P9j8N6Kr9R6q5K18r9k67K41
$$ 258 -214 17 175 11 17 -27 109 -117 20 -79 -101 -26 -31 -93 -77 -52 27 9 65 67 -32 64 -21 197 98 -169 72
4860G2k6k13j0J83n0LK09p9k32N6J39k11j18J1K72j48J52P5L5j35K36r8j02j50
$$ 72 46 -167 -177 6 -44 -41 168 89 -143 -87 52 -159 -277 -266 6 -142 10 85 120 -15 221 123 21 -129
4884a29M6J65p9n6m6R6Jj8R9n4J10k32q0J90k2j29k31M44l26j7K54K52j65j98
$$ -129 -83 82 3 -53 -99 -3 -2 -20 79 25 135 -97 -177 13 -9 -138 -369 75 -251 -268 -14 238 73 -125
4908a25L5K6rJ42j83J15k15K52N3%k40L19Mj08K5j29o0j35N14m26M2L51n05N06
$$ -125 -90 -64 -73 69 -114 1 -214 38 91 91 -149 170 174 66 91 -38 -98 -233 281 -145 -103 248 -257 249
4932B49k41q2J28O7L9l34M5J45j08N4P3j12J48j47N4j66K34j51K19l2k06K13n3
$$ 249 8 -74 54 121 160 -174 -129 16 -92 -38 35 -77 71 -76 -22 -188 46 -105 114 82 -124 89 36
4955C6M14l88R4j57qJ34Lk91K26n4K6j85j13J02J69L3Q5R5l89J74K70l67O6k6
$$ 36 450 62 156 -1 -9 125 128 -163 63 9 35 -150 -263 -161 8 41 126 221 -168 6 276 -91 -25 -51
4979e1R2nj02K23j26l5J21L0Kj42j03j38K73l33L76j41K13l37L12m94J87k9K03
$$ -51 41 36 -66 157 31 -4 117 147 149 7 -96 -234 39 -294 82 -59 154 -183 129 -365 -178 -207 -4
5002dj17J45k60J22K54j37J36j9j29K15j30J98k99q9L58j9j05j60k3k2J58k23
$$ -4 -121 24 -236 -114 140 3 139 120 -9 206 76 274 -25 -114 244 225 120 -40 -63 -85 73 -150
5024a50K20k64R1J21k40K46j2r1p7k7L08k38Q6Q0r6j6L08l32o3L21k59P7J81j88
$$ -150 70 -194 -103 18 -222 24 12 -79 -156 -183 125 -113 -27 53 -43 -59 249 -83 -146 175 -84 -7 174 -14
5048a4M5l9L4n2Q6j25n0K24L0J5l59O3L0K40k92qJ27k9q2J58K50m65L22k94J30
$$ -14 31 -8 26 -26 60 -65 -115 109 139 154 -205 -142 -112 128 -164 -172 -45 -74 -156 2 252 -213 109 -185 -55
5073e5K36l44R3L30k06j29J75J70q4j05N3K1k08R2k8q7K07l01k38M73n4q4j33
$$ -55 181 -163 -70 260 54 -75 100 270 186 81 134 155 -53 39 11 -76 131 -170 -408 65 11 -73 -206
5096b06L56l00J44kJ23m04J39M3J78j22K24l8j67p7L28j55o5L14m07O3O2J99j41
$$ -206 150 -150 -6 -8 115 -289 -150 -107 71 -51 173 135 -32 -109 219 64 -1 313 -94 -31 31 230 89
5119H9l16K25N1l67M41J50k32m5j86K0J20lk1J41l9j5k05L29j85J97k81L52j93
$$ 89 -227 -2 49 -318 123 273 41 -4 -190 -170 -50 -53 -74 67 28 13 -192 137 -48 149 -132 220 27
5142B7L0j05J21k20K79mp5m9P0P3j90J62j33J03K3K0m37L47j69J12q2J07j14n6
$$ 27 57 -48 73 -147 132 128 53 4 74 147 -43 119 -14 89 112 132 -305 42 -127 -15 -97 10 -104 -160
5166a60J5l5K06o7j43J42K09K29n89K27R1k74lK11k49N5P3K60m39K89rL3k76o1
$$ -160 -145 -180 26 -41 -184 -42 167 396 -193 34 125 -149 -152 59 -190 -135 -62 198 -241 48 39 72 -204 -265
5190b65L99k78J97j04k02L27l2j97M6J79r5R8m6o4J17n3K75k98j3K44j92J36p3
$$ -265 134 -144 53 -51 -253 74 42 -155 -109 70 -25 73 27 -37 80 27 302 4 -9 235 43 179 106
5213A06j03j7M0r7L2j45K33J7j32L85m56O0k1N7n1j57K90Nk14K88J09j68k00K72
$$ 106 3 -14 26 -71 -39 -184 49 66 -66 319 -137 -77 -98 -41 -92 -249 41 46 -168 120 229 61 -139 133
5237A33m28M29J87l25J79o2k06K02mj09k3j04L01j39n9Q5j71l3J83j13J3n0L22
$$ 133 -295 134 321 -4 175 113 -93 109 105 -4 -27 -131 170 31 -28 57 -114 -147 36 -77 -64 -114 208
5260B08k18Pj01K6K56j26j44n8j09J80J46J0p2j40J00N4J0M35m34l3J52j55J33
$$ 208 -10 -3 -104 -78 178 52 -92 -150 -259 -79 67 77 5 -135 -35 19 29 464 30 -3 149 -6 127
5283A27O6k2p9Q1j38m7l1n7q6K87k30j6R5J10k12PK22K8l65L60j69j30K06j22
$$ 127 193 171 92 173 35 -12 -43 -100 -186 101 -129 -145 -50 60 -152 -145 77 105 -260 100 -69 -199 7 -115
5307a15L33J22j43j55k67K21r4M3J77k31J94j09M1j22M6L61k82j9j75LK44k17
$$ -115 218 340 197 42 -225 -4 -98 -55 122 -109 85 -24 17 -105 -59 302 20 1 -174 -171 73 -144
5329a44N2j66K79j59J78K5k17M9o9J30J47j24j86L02p7K1k4j49K55k73J17j98
$$ -144 -92 -258 21 -138 40 65 -152 -103 -172 -42 105 -19 -205 97 20 41 17 -132 123 -150 -33 -231
5351b31K28O2r6R0j20Q9K10j67k03K06l87K02L83m60Q4K81l04J89J02q3o8K4n5
$$ -231 -3 59 -37 53 -67 22 232 65 -138 68 -319 -117 266 -194 -110 171 -133 56 158 75 7 31 -24
5374b4o7J12Q0k0q6j64Q7P6J30j33k81K00Q7j67M19l22k68K58J9j11L4J69M1k23
$$ -24 -91 21 101 81 -5 -169 -82 -6 124 -9 -290 -90 -3 -170 249 -73 -341 -83 -64 -175 -141 28 69 -154
5398a54R4Q9J7N5%k4n3j1m4J16J1j99q8J50J25P6r0k79M6p3K40K47q8j74q3K56
$$ -154 -60 29 46 101 101 77 24 13 -31 85 96 -103 -191 -41 84 160 70 -209 -163 -236 4 251 163 -11 -94 162
5424A62r7rj71J42J30L7j10Q8l36j03J60J19l77M19j36K56j93J6Q1p8j70p7M89
$$ 162 65 56 -115 27 157 194 84 172 -164 -267 -107 12 -365 54 -82 174 -19 -3 78 0 -170 -247 242
5447B42m93L4N47j33R1m93N1K53K4j87J52j90lq9L58l3k16J72k52K10J27m41J67
$$ 242 -251 -217 330 197 288 -205 -154 99 123 -64 88 -102 -105 -194 164 131 -85 87 -165 45 172 -269 -102
5470a02L7J46l72L12Q6k87M04j87j77J89o0j81L12k61j35P3J78L5J21j78J06l9
$$ -102 -65 81 -291 21 107 -180 224 37 -140 49 -11 -192 120 -141 -276 -203 -25 10 131 -47 59 20
5492B0P6k7rMj69L05j11J30m6j01j35o1M19k29l9k81K56J1Jj5J11l39L1p0J75
$$ 20 96 69 60 64 -105 200 89 219 173 72 -63 -124 295 66 27 -254 2 13 14 -1 110 -229 -198 -268 -93
5517i3K6LJ88j24O4l53L09n8l02L05J28r9m1kJ98m2K3k81nJ54J21k96K06J36O4
$$ -93 -67 -64 124 0 64 -289 20 -38 -340 -35 93 -6 -47 -49 149 107 130 -151 -156 -2 119 -177 29 165 229
5542B29j68m5J09k95J96K9j78j30K08q9J7M7m7J94l54L75k92L30O1l9k47L07m0
$$ 229 61 16 125 -170 26 55 -123 -253 -45 -134 -117 -70 -117 77 -277 98 -194 136 197 158 -89 218 178
5565A78j20o3P8j74K75m9m94N88K3k92J0R9k90K14O8O2oo1J55m43L8J26k79J7
$$ 178 58 -5 73 -101 174 125 -369 219 242 -50 -40 59 -231 -17 51 113 107 46 201 -242 -204 -78 -357 -340
5589c40K91J23l12N7J64k3J38J61j13k39R6R7j68L3J51J3Mj83j1m7J88k48J68
$$ -340 -49 74 -238 -181 -17 -40 98 259 146 -93 3 100 -68 -35 116 129 133 -50 -61 -108 80 -168 0
5612@p9K56j31K49l74k69L71j14k6J59p8K9J28j77J30Q3r8P3k84k4K7K39m1k25
$$ 0 -79 177 46 295 -79 -348 23 -91 -117 42 -36 -7 121 -56 74 157 59 132 -152 -176 -149 90 49 -176
5636a76K01m2j19J28K07O5l13J44j31j04LJ66j05lr4N8m60O01o9R2j6p6J23K9
$$ -176 25 -17 -136 -8 199 264 -49 95 -36 -140 -137 29 -76 -79 -173 -115 -575 26 -43 49 33 -43 80 109
5660A09j23j09J50m7J63l2n4L94n57K15K4r6j0Q9k4R8p2j23K31j87k08K41J04
$$ 109 -14 -123 27 -20 143 111 57 451 -106 109 133 37 27 116 92 190 118 -5 226 39 -169 72 176
5683A76j91j6P6j75L38k78j5R4K2p0J68n26O13k98K9M9k08L08l48K12M7J46j97
$$ 176 -15 -31 45 -130 208 -70 -85 9 31 -39 129 -397 216 -82 -53 -4 -212 96 -252 -40 7 153 -44
5706d4J58k23K59k06j25J21o3K72j40j48j45K34J1L26k25k6l7J35p9J89k55k73
$$ -44 114 -109 150 -56 -181 -60 -123 149 9 -139 -284 -50 -39 287 62 36 -1 134 55 244 -11 -284
5728b84N45l34J53q4L35l63K12k65J35j70J32n8M8%M0P7l32K31J14k10k1n9K36
$$ -284 261 -73 80 -4 331 -32 180 -85 50 -120 12 -46 2 2 42 119 -213 18 132 -78 -99 -158 78
5751G8j63J39J30q2K35m08QL36l67K6Lq6K33k62L87k06P7K7o5r5n2M29k4m82L62
$$ 78 -85 54 184 102 337 -71 -63 273 -94 -68 -65 -151 82 -180 207 1 78 105 40 -55 -107 322 298 -184 178
5776A78j7l13J95oR6k10p7P5P8kK4k41K64J71l59r3L74k27K47J6k99m0K27K8k37
$$ 178 161 -152 43 37 133 -77 -154 -79 -1 -3 21 -220 44 215 -144 -237 137 -90 157 173 -126 -166 61 89 -148
5801a48L30j02l08L53K0Kj86Q1k9P7j23K21l76L44l25J65J40kk5l39P1J90j17
$$ -148 182 80 -228 125 145 147 -39 42 13 90 -33 188 -188 156 -169 -4 136 134 109 -230 -159 31 -86
5824h6MK44m7Ml0J23j04P5k86K4o9J42j56J69k07L05p6l3q2J76r9Q2l3j23q4L32
$$ -86 -82 162 115 119 89 212 108 183 -103 -79 -148 -6 -162 7 -200 105 29 -4 -86 90 -9 73 40 -83 -167 165
$$ [...]
8191h9
##END NTUPLES=NMR FID
##END=
