##TITLE=1H_Ser 6-4-V-3
 CDCl3
 8 sc, 
 16.11.2021
##JCAMPDX= 6.0         $$ Bruker NMR JCAMP-DX V2.0
##DATA TYPE= NMR FID
##DATA CLASS= NTUPLES
##ORIGIN= UXNMR, Bruker Analytische Messtechnik GmbH
##OWNER= root
$$ XWIN-NMR		Version 3.5
$$ Tue Nov 16 11:24:40 2021 Russian Standard Time (UT+4h)  she@DPX200
##.OBSERVE FREQUENCY= 200.131346
##.OBSERVE NUCLEUS= ^1H
##.DELAY= (6, 6)
##.ACQUISITION MODE= SIMULTANEOUS
##.ACQUISITION SCHEME= undefined
##.AVERAGES= 8
##.DIGITISER RES= 18
##SPECTROMETER/DATA SYSTEM= spect
##.PULSE SEQUENCE= zg30
##.SOLVENT NAME= CDCl3
##.SHIFT REFERENCE= (INTERNAL, CDCl3, 0, 15.7039)
##AUDIT TRAIL= $$ (NUMBER, WHEN, WHO, WHERE, WHAT)
$$ ##TITLE= Audit trail, XWIN-NMR		Version 3.5
$$ ##JCAMPDX= 5.01
$$ ##ORIGIN= Bruker BioSpin GmbH
$$ ##OWNER= she
$$ F:/spectra/data/she/nmr/H-F/1/audita.txt
$$ ##AUDIT TRAIL=  $$ (NUMBER, WHEN, WHO, WHERE, WHAT)
(   1,<2021-11-16 11:23:23.26 +0400>,<she>,<DPX200>,
      <created by zg, POWCHK disabled, PULCHK disabled
       configuration hash MD5:
       00 E9 B6 7A A2 85 ED C7 34 08 36 98 17 FE 4E 26
       data hash MD5: 16K
       73 A4 8B 2B 42 CF A5 32 90 60 F3 D8 FB 31 FD F7>)
$$ ##END=
$$ 
$$ hash MD5
$$ B7 44 2A B3 70 C4 E4 6A 31 02 AA EF 93 F9 07 8B
##$RELAX= 
##$RELAX= 
##$RELAX= 
##$RELAX= 
##$RELAX= 
##$RELAX= 
$$ Bruker specific parameters
$$ --------------------------
##$DU= <F:/spectra>
##$EXPNO= 1
##$NAME= <H-F>
##$PROCNO= 1
##$TYPE= <nmr>
##$USER= <she>
##$AMP= (0..31)
100 100 100 100 100 100 100 100 100 100 100 100 100 100 100 100 100 100 
100 100 100 100 100 100 100 100 100 100 100 100 100 100 
##$AQSEQ= 0
##$AQ_mod= 1
##$AUNM= <au_zg>
##$AUTOPOS= <>
##$BF1= 200.13
##$BF2= 200.13
##$BF3= 200.13
##$BF4= 200.13
##$BF5= 200.13
##$BF6= 200.13
##$BF7= 200.13
##$BF8= 200.13
##$BYTORDA= 1
##$CFDGTYP= 0
##$CFRGTYP= 5
##$CHEMSTR= <none>
##$CNST= (0..31)
1 1 145 1 1 1 1 1 1 1 1 1 1 1 1 1 1 1 1 1 1 1 1 1 1 1 1 1 1 1 1 1 
##$CPDPRG= <>
##$CPDPRG1= <>
##$CPDPRG2= <>
##$CPDPRG3= <>
##$CPDPRG4= <mlev>
##$CPDPRG5= <mlev>
##$CPDPRG6= <mlev>
##$CPDPRG7= <mlev>
##$CPDPRG8= <mlev>
##$CPDPRGB= <>
##$CPDPRGT= <>
##$D= (0..31)
0 1.2 0 0 0 0 0 0 0 0.06 0 0.03 0 0 0 0 0.0002 0 0 0 0 0 0 0 0 0 0 0 0 
0 0 0 
##$DATE= 1637047402
##$DBL= (0..7)
120 120 120 120 120 120 120 120 
##$DBP= (0..7)
150 150 150 150 150 150 150 150 
##$DBP07= 0
##$DBPNAM0= <>
##$DBPNAM1= <>
##$DBPNAM2= <>
##$DBPNAM3= <>
##$DBPNAM4= <>
##$DBPNAM5= <>
##$DBPNAM6= <>
##$DBPNAM7= <>
##$DBPOAL= (0..7)
0.5 0.5 0.5 0.5 0.5 0.5 0.5 0.5 
##$DBPOFFS= (0..7)
0 0 0 0 0 0 0 0 
##$DE= 6
##$DECBNUC= <off>
##$DECIM= 32
##$DECNUC= <off>
##$DECSTAT= 4
##$DIGMOD= 1
##$DIGTYP= 9
##$DL= (0..7)
0 120 120 120 120 120 120 120 
##$DP= (0..7)
150 150 150 150 150 150 150 150 
##$DP07= 0
##$DPNAME0= <>
##$DPNAME1= <>
##$DPNAME2= <>
##$DPNAME3= <>
##$DPNAME4= <>
##$DPNAME5= <>
##$DPNAME6= <>
##$DPNAME7= <>
##$DPOAL= (0..7)
0.5 0.5 0.5 0.5 0.5 0.5 0.5 0.5 
##$DPOFFS= (0..7)
0 0 0 0 0 0 0 0 
##$DQDMODE= 0
##$DR= 18
##$DS= 0
##$DSLIST= <SSSSSSSSSSSSSSS>
$$ [...]
##$SUBNAM2= <"">
##$SUBNAM3= <"">
##$SUBNAM4= <"">
##$SUBNAM5= <"">
##$SUBNAM6= <"">
##$SUBNAM7= <"">
##$SUBNAM8= <"">
##$SUBNAM9= <"">
##$SW= 18.0517287032376
##$SWIBOX= (0..15)
0 0 2 0 0 0 0 0 0 0 0 0 0 0 0 0 
##$SW_h= 3612.71676300578
##$TD= 16384
##$TD0= 1
##$TE= 0
##$TE2= 300
##$TE3= 300
##$TEG= 300
##$TL= (0..7)
0 120 120 120 120 120 120 120 
##$TP= (0..7)
150 150 150 150 150 150 150 150 
##$TP07= 0
##$TPNAME0= <>
##$TPNAME1= <>
##$TPNAME2= <>
##$TPNAME3= <>
##$TPNAME4= <>
##$TPNAME5= <>
##$TPNAME6= <>
##$TPNAME7= <>
##$TPOAL= (0..7)
0.5 0.5 0.5 0.5 0.5 0.5 0.5 0.5 
##$TPOFFS= (0..7)
0 0 0 0 0 0 0 0 
##$TUNHIN= 0
##$TUNHOUT= 0
##$TUNXOUT= 0
##$USERA1= <user>
##$USERA2= <user>
##$USERA3= <user>
##$USERA4= <user>
##$USERA5= <user>
##$V9= 5
##$VALIST= <valist>
##$VCLIST= <CCCCCCCCCCCCCCC>
##$VD= 0
##$VDLIST= <DDDDDDDDDDDDDDD>
##$VPLIST= <PPPPPPPPPPPPPPP>
##$VTLIST= <TTTTTTTTTTTTTTT>
##$WBST= 1024
##$WBSW= 4
##$XGAIN= (0..3)
0 0 0 0 
##$XL= 0
##$YL= 0
##$YMAX_a= 104899
##$YMIN_a= -169809
##$ZGOPTNS= <>
##$ZL1= 120
##$ZL2= 120
##$ZL3= 120
##$ZL4= 120
##$ABSF1= 10
##$ABSF2= 0
##$ABSG= 5
##$ABSL= 3
##$ALPHA= 0
##$AQORDER= 0
##$ASSFAC= 0
##$ASSFACI= 0
##$ASSFACX= 0
##$ASSWID= 0
##$AUNMP= <proc_1d>
##$AZFE= 0.1
##$AZFW= 0.1
##$BCFW= 1
##$BC_mod= 2
##$BYTORDP= 1
##$COROFFS= 0
##$CY= 11.3945322036743
##$DATMOD= 1
##$DC= 2
##$DFILT= <>
##$DTYPP= 0
##$F1P= 2.36226072786647
##$F2P= -0.459571619588291
##$FCOR= 0.5
##$FTSIZE= 0
##$FT_mod= 4
##$GAMMA= 1
##$GB= 0.15
##$INTBC= 1
##$INTSCL= 1
##$ISEN= 128
##$LB= 0.24
##$LEV0= 0
##$LPBIN= 0
##$MAXI= 10000
##$MC2= 0
##$MEAN= 0
##$ME_mod= 0
##$MI= 1.114404
##$NCOEF= 0
##$NC_proc= 0
##$NLEV= 6
##$NOISF1= 3.799351
##$NOISF2= 2.8
##$NSP= 1
##$NTH_PI= 0
##$NZP= 0
##$OFFSET= 15.70392
##$PC= 1
##$PHC0= -15510.5
##$PHC1= 8.20081
##$PH_mod= 1
##$PKNL= yes
##$PPARMOD= 0
##$PSCAL= 0
##$PSIGN= 0
##$REVERSE= no
##$SF= 200.130013532006
##$SI= 16384
##$SIGF1= 3
##$SIGF2= 2
##$SINO= 400
##$SIOLD= 16384
##$SREGLST= <1H.CDCl3>
##$SSB= 0
##$STSI= 0
##$STSR= 0
##$SW_p= 3612.71676300578
##$SYMM= 0
##$S_DEV= 0
##$TDeff= 0
##$TDoff= 0
##$TI= <>
##$TILT= no
##$TM1= 0
##$TM2= 0
##$TOPLEV= 0
##$USERP1= <user>
##$USERP2= <user>
##$USERP3= <user>
##$USERP4= <user>
##$USERP5= <user>
##$WDW= 1
##$XDIM= 8192
##$YMAX_p= 0
##$YMIN_p= 0
$$ End of Bruker specific parameters
$$ ---------------------------------
##NTUPLES= NMR FID
##VAR_NAME=  TIME,          FID/REAL,        FID/IMAG
##SYMBOL=    X,             R,               I
##VAR_TYPE=  INDEPENDENT,   DEPENDENT,       DEPENDENT
##VAR_FORM=  AFFN,          ASDF,            ASDF
##VAR_DIM=   8192,          8192,            8192
##UNITS=     SECONDS,       ARBITRARY UNITS, ARBITRARY UNITS
##FACTOR=    0.0002768,     1,               1
##FIRST=     0,             0,               0
##LAST=      2.2672688,     0,               0
##MIN=       0,             -169809,         0
##MAX=       2.2672688,     104899,          0
$$ Real data points
##PAGE= N=1
##DATA TABLE= (X++(R..R)), XYDATA
$$ [...]
1917D97L93j27j87K77Q9K02j61j46n56M8k35K05j22l10k00n90K22K82j41p9J00
1938e39k67M0L11O34K93o5n92P5N59J82K82l99R9l37k24M34k96o0j47l25l2k60
1960f34J38J51k11l60K71m4K04O49j75O0k28K06M06K2K58j16k51j57J73J78L07
1981H47m64l24l38N4l9l2Q5M8m60n1M23rO28l07l29J70N7L02M69k66J61k27l49
2004D9N00j35j41q9m71p6M7L5J85r4k62L11k75N0L04M5K50m29QL03K70K48J08
2027G41n40Kk51N44k2l1n13j38m49O8K26j53J80n56N4L26J80L83L12m91k5N3J82
2050H2N09j32J97J4l33R9L72p2Qj031r6K79m31M36j45n14P7k77K76K27j2J50j4
2073c31l92M21N01K26K55m13K91PJ75J63m4m11L7k15j33J11j17k87k62m77J07
$$ plain form
1917 497 890 763 576 853 942 1144 983 837 281 329 94 299 177 -133 -333 -923 -701 -419 -560 -639 -539
1938 -539 -806 -766 -455 179 472 407 -185 -110 449 631 913 514 613 276 52 486 190 130 -17 -342 -374 -634
1960 -634 -496 -345 -556 -916 -645 -689 -485 164 -11 49 -179 27 433 455 713 597 346 189 362 540 847
1981 847 383 59 -279 -225 -264 -296 -211 -163 -623 -674 -251 -260 368 61 -268 -98 -41 261 730 464 625 398 49
2004 49 549 414 273 184 -287 -363 -316 -281 -96 -190 -452 -141 -416 -366 -62 -17 233 -196 -188 115 385 633 741
2027 741 201 203 -48 496 474 443 -70 -208 -657 -589 -363 -516 -336 -892 -838 -512 -332 51 363 -128 -153 -100 82
2050 82 591 459 656 670 337 436 808 736 744 -287 -383 -104 -535 -99 -244 -758 -681 -958 -682 -455 -467 -317 -331
2073 -331 -723 -302 199 425 680 267 558 565 740 903 859 448 485 270 137 248 131 -156 -418 -895 -788
2094g88L22o1L21m55k36J24J09Q28j02K14M9n0J13M81j50N17n95m30K11k89K69
2115D02l1l34m78l2o2L0J9k87R4m27J29P21L6L04l56J16J50L93K99L02j72j50
2137F66j15j07L96k71j52j14m83K1p3l8J85l89j62N5m30P39J30j74k2L08j47L75
2159A98L7J62M8l87J96M1K93N5k86J7k07m32K61m6n11Q9k90L04j68K43M86m1m85
2182d23K33K48o0M32l4N9k35J27K06m2j61R3l22j94k7J60Q2j61m15R7l18M04J34
2205a17k46p1P9o8M99J58R5K40l78R3kJ11J74O9l41l63j65J02J27M4l67k16k01
2228g44M74k09N22l67k22N4J08K65N53P5q1j43O1L01L60j92o0k32o60J55M2j2
2250D8q4m66j23k45o7N40J39j58kn01K58K65L78L68l57J64K86K19L56n2l16k13
$$ plain form
2094 -788 -466 -527 -206 -661 -897 -773 -664 164 62 276 325 275 388 869 719 1236 641 211 422 133 402
2115 402 371 37 -441 -473 -535 -505 -486 -773 -679 -1106 -977 -256 -220 84 -272 -156 -6 387 686 988 816 666
2137 666 551 444 840 569 417 303 -180 -159 -232 -270 -85 -474 -636 -581 -1011 -272 -142 -316 -338 -30 -177 198
2159 198 235 397 445 58 254 295 588 643 357 374 167 -265 -4 -50 -561 -472 -762 -458 -626 -383 103 62 -423
2182 -423 -190 58 -2 430 396 455 220 347 553 511 350 443 121 -73 -100 60 142 -19 -434 -337 -655 -251 -117
2205 -117 -363 -434 -355 -423 76 234 329 569 191 284 282 393 567 636 295 -68 -233 -131 -4 40 -327 -543 -744
2228 -744 -270 -479 43 -324 -546 -492 -384 -119 434 509 428 285 346 647 1007 815 755 523 -137 18 60 48
2250 48 -36 -502 -625 -870 -937 -397 -258 -416 -418 -919 -661 -396 -18 350 -7 157 443 662 1018 966 650 437
2272D37k53L1K38k76j96j83k84q1L45j62K20l74k56L81k82M73J30K39R2j72K00
2293B67j50N26L36k67n37L43Q0J93J3o18j94k02k6P8L2k37j34m74R7K78L52N9
2315a85k01j5J12L36K08K98l45J30l7l10M12LoM4m86j4n9J26j32j93l67P0J05
2338e06J75n2Q7J33p1M4K05M18n6M2l65J63J48J93K70m15m82K98k81P9K13k42
2360bj03n9p05N00J01K57J82l46k62K29L03M00k40P1J09l96J23M93p2m12r8l27
2382b54K98m1K33l87l40P7k41N39J6k31K04K4j48K98q4P9K65j95l7K95o8L88l01
2405C89k12j94j87K04K46k93m20J40m69J19L08J66k7l56Q2R7K01L58J95m37J93
2426A03o5K91L07K23k00l41l3J76Ol8j24o28j02J51j9%j61j75L16l24J67M82K
$$ plain form
2272 437 184 215 453 177 -19 -202 -486 -567 -222 -384 -164 -538 -794 -413 -695 -222 -92 147 239 67 267
2293 267 117 643 979 712 175 518 598 791 804 186 -8 -210 -236 -158 -126 -363 -497 -971 -874 -596 -244 -185
2315 -185 -386 -401 -289 47 255 553 208 338 301 -9 403 406 400 444 -42 -56 -115 11 -121 -314 -681 -611 -506
2338 -506 -331 -383 -296 -163 -234 -190 15 433 377 419 54 217 365 558 828 413 -69 229 -52 27 240 -2
2360 -2 -105 -164 -869 -369 -268 -11 171 -175 -437 -208 95 495 255 326 435 39 162 655 583 171 73 -254
2382 -254 44 3 236 -151 -491 -414 -655 -116 -100 -331 -127 -103 -251 47 -37 42 307 112 75 370 302 690 389
2405 389 177 -17 -204 0 246 -47 -467 -327 -796 -677 -369 -203 -230 -586 -504 -407 -206 152 347 -90 103
2426 103 38 329 636 859 659 318 285 461 467 429 305 -323 -425 -274 -293 -293 -454 -629 -313 -637 -470 12 14
2449A4J84p5J52o4J0J77M52l10J09m10j6J61N4j29k00m56J02J70k62J23k04l00
2471g18L49k58J81K07J46k99J40J17N93K1J72n1m58K76J08o9j3q3m22J94k02J64
2493I5Q5n98M0k03k49N33j77M49l18j76K32K86K23J53l5j35l11K76K78M81l89
2514E40j93j95j35J63K2L1k33m52M1j63J36J86P9l29K45k44Q13k0N2l12q3r5M48
2537C02r3L17l6j78k74j5M6L96j77k86j82m36K25j5L44j25m4j29j1K70J01J26
2559A26L4o1J02mK23r1K05k88l37M08l29O7J96m39l13J44p7N02O0k88j61m0K67
2582i4J95J25J60m05Q3l1M59J16k1n95J44p8J29k15Pj35j65k07K6P6J70p0O0j05
2606c71J21l15L83J30k4Q0r1L96J59J27N8k26l25Pj13M80k54j64j69j61n0K85
$$ plain form
2449 14 198 123 275 211 221 398 850 540 649 239 223 384 438 309 109 -347 -245 -75 -337 -214 -418 -718
2471 -718 -369 -627 -446 -239 -93 -392 -252 -135 458 479 651 600 142 418 526 457 444 361 -61 133 -69 95
2493 95 180 -418 -378 -581 -830 -297 -474 -25 -343 -519 -287 -1 222 375 340 205 -106 170 448 929 540
2514 540 347 152 17 180 202 233 0 -452 -411 -574 -438 -252 -173 -502 -257 -501 312 292 344 32 -51 -146 302
2537 302 209 526 490 312 38 23 69 465 288 2 -180 -616 -391 -406 -62 -187 -231 -360 -371 -101 0 126
2559 126 160 99 201 197 420 329 534 246 -91 317 -12 55 251 -188 -501 -357 -434 68 128 -160 -321 -361 -94
2582 -94 101 226 386 -19 64 33 492 608 587 -8 136 58 187 -28 -21 -156 -321 -528 -502 -426 -256 -326 -266 -371
2606 -371 -250 -565 -182 -52 -76 4 -87 309 468 595 653 427 102 109 -4 476 222 58 -111 -272 -322 -37
2628c7J52o66K59l27JK25P5J68j68K9NL42L69R9k29J89j74J76J27m8r2j57m27
2651a09J20j52J46j20j43k75R4PNJ29o5l5j15K73K13J93J48j3k88R2L08j35N33
2674H11k65m39n8j53J77J38j80k29j52k71j37L25K91P8l34l7J89K21K46k16j66
2695a61L6J8K92L32J88m48l97N6R9L18o7o2o64J36J73j38K70l8l6p1m43P21l58
2718b44K83k2l90J57M14j1M06j21m39J34l59J79L39k45j93Q5j16O5n5N0j07n2
2740b42j59L6J98K88m9k62m9J58K9K81J52J9j20m55J78J11J71o7k93k26N0l9J02
2763a88L41o02j4k6J26J44M27J40l54k53P24k53J07J12m2k06k58J33L07O0o73
2784b48L11k86p9K52o9j23k36k0q1O8L05J01m7n1l7K36L00J20j3j74J05M7J14
$$ plain form
2628 -37 115 -551 -292 -619 -618 -393 -318 -150 -318 -289 -284 58 427 526 297 486 312 488 615 567 475 318 -109
2651 -109 11 -141 5 -115 -258 -533 -439 -432 -427 -298 -363 -398 -513 -240 -27 166 314 301 13 105 413 278 811
2674 811 546 107 49 -104 73 211 31 -198 -350 -621 -758 -433 -142 -64 -398 -435 -246 -25 221 5 -161
2695 -161 -125 -107 185 517 705 257 -140 -84 15 333 266 204 -460 -324 -151 -289 -19 -57 -93 -164 -607 114 -244
2718 -244 39 17 -373 -216 198 187 593 472 33 167 -192 -13 326 81 -112 -27 -143 -78 -133 -83 -190 -242
2740 -242 -401 -365 -167 121 72 -190 -239 -81 -52 229 381 400 280 -175 3 114 285 218 -75 -301 -251 -290 -188
2763 -188 153 -449 -463 -489 -363 -219 208 348 -6 -259 465 212 319 431 389 183 -75 58 365 425 -248
2784 -248 63 -223 -302 -50 -119 -242 -478 -498 -579 -511 -206 -105 -152 -203 -240 -4 296 416 403 229 334 381 495
2807D95N6J74m11o6k55K42mj36k19l99J5M7J01k1r1L78k06n2J30J38M97m15L08
2830C06L6J55P2P3j36p9l22kN3ll9l01k82j24K27j04M1K1l38L44j29J76L09j36
2854a82K78j49J39K3M27p5J43l26k89N90m09K40l5m34J12j94r0J10J51q8j70j38
2876c66J69m7J10J20j04N3j16M75P8n8K79l86k8J02J64J65m37j53q0m1m3J14J74
2899A44l96j04J3j39K59P1j51Q9j09K27L49k3J03j81o0JJJ02j57J72l79J4N0O8
2923c6j8n8j72k5J95k59K42L23m21l8K50L6J39K60j41N1l30j6J54P9n0K09k32
2946A42l23P3k0J80n35L51l78N3M99l16m8K53k91L59J96R7K22jj84M0j54K20J07
2969E42j81l15O9j30K85j79q4j17j49q1Ro6J63j07j39JL49K30L59m85M27k67q1
$$ plain form
2807 495 551 725 314 248 -7 235 231 95 -124 -523 -508 -461 -360 -381 -472 -94 -300 -352 -222 -84 413 -2 306
2830 306 342 497 569 642 506 427 105 103 156 153 114 -187 -469 -593 -366 -470 -429 -408 -746 -402 -531 -355 -46 -182
2854 -182 96 -53 86 109 536 461 604 278 -11 579 170 410 375 -59 53 -141 -231 -121 30 -58 -228 -366
2876 -366 -197 -244 -134 -14 -118 -65 -181 294 372 314 593 207 179 281 445 610 173 20 -60 -101 -144 -30 144
2899 144 -252 -356 -343 -482 -223 -152 -303 -214 -323 -96 253 230 333 152 92 93 94 196 39 211 -168 -154 -104 -36
2923 -36 -54 -112 -284 -309 -114 -373 -131 192 -229 -267 -17 19 158 418 277 328 -2 -18 136 215 165 374 142
2946 142 -181 -108 -128 52 -483 -132 -510 -457 42 -274 -322 -69 -360 -1 195 292 514 513 329 369 215 435 542
2969 542 361 46 115 -15 270 91 7 -110 -259 -340 -331 -397 -234 -341 -480 -479 -130 100 459 -26 401 134 53
2992E3K60J57N4k21j46K1Q8J2l5n45J88k20j35J0K21r7j30L9K07L2J28J57J58
3015B56j72K8J33J49J37o7J26n3j60l5J90l66J25n75Q0K8r7n6q1Q5j22PpK50J17
3040h0J11J26m08L55Q9J77lK0Rk22J82J12j14j89j5l72J68o6R7k25k85m9J61J83
3064b38J76k2j88j58N14j27L93J0m15K38p1L92Q7l1j53o4m52J99O8r4l49J17m7
3087b15j66l2M83k14m8kl0K76K32q0p5k7L1Q1j19K73K71o38K44l93J29R7k3R9
3111A54m19J3m1lj5N10k44k23J43q2K94K6Q7J83j45l93M35o6K0J08l72L2j08J43
3135C7j12n2k3k26J04O2K16P1k78k57K19L55k50K95J48j35L8j51J63L27j85j57
3157B09k3q0L5M0o3k10j95P3m7j0r4J69k51Q8K15J79J68j14Q3k63M14j32J18J90
$$ plain form
2992 53 313 470 524 303 157 178 266 278 243 -302 -114 -334 -469 -459 -238 -335 -465 -426 -219 -187 -59 98 256
3015 256 84 112 245 394 531 464 590 537 377 342 532 166 291 -284 -204 -176 -273 -329 -410 -325 -447 -440 -447 -197 -80
3040 -80 31 157 -251 104 193 370 367 387 396 174 356 468 354 165 150 -222 -54 -120 -23 -248 -533 -582 -421 -238
3064 -238 -62 -84 -272 -430 84 -43 350 360 -55 183 112 504 591 560 407 343 -109 90 158 64 -285 -168 -215
3087 -215 -381 -413 70 -144 -192 -194 -224 52 284 204 129 102 133 214 95 368 639 1 245 -148 -19 78 55 154
3111 154 -265 -252 -293 -296 -311 199 -45 -268 -125 -207 87 113 200 383 238 -155 280 214 234 342 -30 2 -106 37
3135 37 -75 -127 -150 -376 -272 -210 6 77 -201 -458 -239 116 -134 161 309 174 212 61 224 551 366 209
3157 209 186 106 141 181 118 -92 -287 -214 -261 -271 -365 -196 -447 -359 -144 35 203 89 172 -91 323 191 309 499
3181D99j34m77O62k54j48K58j08k39m35j55K71j21OR4j34j09K56k9o6K43k16K21
3203a15K97j42J85K46k73oL33j56n6j43K17j66l19K81n57L39j51k41J65k05J48
3224c19J84On8j32l4K66K76k37N28m09j55L12p3L41J76q2o03K57k80J84j75o7
3246i4j15p8J57j83K3J51l27J80K00J00J04O0J66k13r6L0J19q3J25p0qJ22p0j34
3270F6j90J22j10l2j01L21k91J80l55J52j7J92J04J7j70J23p4P5K02Oj74J04j52
3293bk31J46K52j03k72O8K27l92J18j28J23Q1j80R0M9L29j78J09r3J64M9P5k9
3316B72K8j23J54k67jJ78j44k78j3m25N28q8j88J42J54k95o1M63j18J98j17J8
3338A7J15J86K73om07K9J32k50L85n45K03k20l9l5j68J58j06l00K92k02P9L37
$$ plain form
3181 499 365 -112 550 296 148 406 298 59 -376 -531 -260 -381 -375 -281 -415 -524 -268 -297 -363 -120 -336 -115
3203 -115 182 40 225 471 198 192 525 369 313 170 387 221 -98 183 -374 -35 -186 -427 -262 -467 -319
3224 -319 -135 -129 -187 -319 -353 -87 189 -48 480 71 -84 228 155 496 672 590 -13 244 -36 148 -27 -94
3246 -94 -209 -287 -130 -313 -290 -139 -466 -286 -86 14 118 178 344 131 35 65 184 101 226 156 148 270 200 66
3270 66 -124 -2 -112 -144 -245 76 -215 -35 -390 -238 -255 -63 41 58 -112 11 -63 12 214 220 46 150 -2
3293 -2 -233 -87 165 62 -210 -142 85 -307 -189 -317 -194 -113 -293 -203 -154 175 -3 106 13 177 226 301 272
3316 272 300 177 331 64 63 241 97 -181 -194 -619 -91 -179 -367 -225 -71 -366 -427 36 -82 116 -1 17
3338 17 132 318 591 585 178 207 339 89 474 -71 132 -88 -127 -162 -330 -172 -278 -578 -286 -488 -409 -72
3360g2q8m9L11J59l24K06n2L14k85K87J09l13L45l49k86o1K45o5k46K30k75l00
3382e59J17J90K9O9J24l47J02K07n8N42n2o3j14j83K98NM5qj71l03K54kj4k52
3406a44q9K0j43L5P0M3J51o5k83R5L17%J47j73K26K3P5k0P2j4J64l93Q4j8j13
3431F7k2Q7k05l08K84l41L49k06m3j07K88R0M7m5K44j45J14N5q3o0r2L44j73J14
3455B53n6j05J80m16J00j99N2Q7O1n2K4k41J61K01j08L23k37j18K65P2J27j59
3477B15m3o2Pp2J74k06k8N3j57J05r0n5r8p1J22O0O6L9N2P7L3k30K5K67K5O2q7
3504A83l2M5J25q6k06J05k59J14o2N8j17k83K86j45K18j35K99k88M3J17J39j1
3526A08L6L11j82k4j36L47k38J2k1k31p3j2J83l53o4J75j91p2M62n6m5j56J96
$$ plain form
3360 -72 -160 -209 102 261 -63 143 91 405 120 407 516 203 548 199 -87 -148 97 32 -214 16 -259 -559
3382 -559 -442 -252 -223 -154 -30 -377 -275 -68 -126 416 364 301 187 4 302 307 352 344 173 -130 124 122 108 -144
3406 -144 -233 -213 -356 -321 -251 -208 -57 -122 -405 -310 7 7 154 -19 207 230 305 285 357 343 507 114 198 180 67
3431 67 45 132 -73 -381 -97 -438 -89 -295 -338 -445 -157 -67 -20 -65 179 34 148 203 120 60 -32 312 139 253
3455 253 197 92 272 -144 -44 -243 -191 -104 -43 -95 -71 -312 -151 50 -58 265 28 -90 175 247 374 215
3477 215 172 110 117 45 219 13 -15 38 -119 -14 -104 -159 -257 -328 -206 -146 -80 -41 11 88 121 -109 -84 183 208 270 183
3504 183 151 196 321 235 29 134 -125 -11 -73 -15 -132 -415 -129 -274 -56 -191 108 -180 -137 -20 119 108
3526 108 144 455 273 249 113 460 222 234 213 -18 -91 -103 80 -273 -337 -162 -353 -425 37 -19 -64 -220 -24
3549b4k31K29r3J05K97j29k01J73R1P4Pk27j7k00L05K0j02k30j42K4o4R6J38n5
3573a56k06k3J65J24kL03q7N0k95J76L62L3k39K15l94J62j99K05Q1m76Q9j78o
3596b96J55n3j18l1k9N2K46o8J63J91j47k5k5J15J88k04PM2J82k69J79j38P3k90
3620a00K81m10j1j1K56k79j6L6M1m4J98j01O6K14j48K53J10r2j63O5o6q9K69k02
3644E7R9j64P4R3p9j14j48J28k06%L04j26P0j92J21Q7rM18l49J43q2R0j59K87
3668C43j08o5J12k76j6l1l9N4L3j35p0J42J0P8j57J31P2K2J92k95K7J41N8r1P4
3693B06J22k21o2K0j07J03k09K42k51j56o5L14k14K41r0j30J31l4J61Q9Q8K7J59
3716C64o5o2J12q1J7k6n41L22J0m0j14k21K4P5j33P6K02l00J47J09j45K87j31
$$ plain form
3549 -24 -255 -26 -119 -14 283 154 -47 126 217 291 298 71 54 -146 159 179 77 -153 -295 -271 -335 -239 -101 -156
3573 -156 -362 -385 -220 -96 -98 205 118 168 -127 49 411 444 205 420 26 188 -11 194 275 -201 -112 -290 -296
3596 -296 -141 -194 -312 -343 -372 -320 -74 -142 21 212 65 40 15 130 318 114 121 163 345 76 255 117 190 -100
3620 -100 181 -229 -240 -251 5 -274 -290 -254 -213 -257 -59 -160 -94 120 -28 225 335 243 80 145 79 -10 259 57
3644 57 156 -8 66 159 80 -34 -182 -54 -260 -260 44 -82 -12 -204 -83 4 -5 413 64 207 125 215 56 343
3668 343 235 170 282 6 -10 -41 -80 -26 7 -128 -198 -56 -46 32 -125 6 78 100 292 -3 24 165 223 132 206
3693 206 328 107 45 65 -42 61 -148 94 -157 -313 -378 -64 -278 -37 -127 -257 -126 -160 1 90 178 205 364
3716 364 299 237 349 268 285 259 -282 40 50 10 -104 -325 -301 -226 -359 -283 -81 -381 -234 -125 -270 17 -114
3739a14J40J55j24J97n4K50k59l8J40j21j09M8m7l09Q0Kk50J57Q1J37j17j38Q8
3762b05N3j06L53k08J37K35j22K2M8O3k09k08L25N8OJ65l38j07K19l26jj61J47
3785a60K1Mj54p3Q5J41R5j67K31J13r2J61j30j64M62n7k66R9j92K28K40m60k75
3808c10M45j00P5k29j53O4j2L50p3q4M8j11K00k0J15j45q5J07J79k33J84j2l69
3831a69M94k96k7j04l7k5k55J63K75k62K72j7j67J70k8P4k65N09j11%j70K56l3
3854B47P8j39R4p8m8l39K14j3j51Q2k90K98P6k62J8K42k51J63K2NL7j50J66J62
3878A83j3k8K56l48l1m5j84K54k11J05j07j7L1N3j03P3J7q8K01q7M6k4K89j24
3902I8J44k59R5j75M76k07N1L0k32l5O6J3j50rp8j37K58j81jl9o4K6L32J32Ml39
$$ plain form
3739 -114 26 181 57 254 200 450 191 153 293 172 63 111 64 -245 -165 -163 -413 -256 -175 -38 -155 -293 -205
3762 -205 -152 -258 95 -113 24 259 137 159 207 270 61 -147 178 236 242 407 69 -38 181 -145 -146 -307 -160
3785 -160 -139 -135 -289 -362 -277 -136 -41 -208 23 136 44 205 75 -89 373 316 50 149 -43 185 425 -35 -310
3808 -310 135 35 110 -119 -272 -208 -220 130 57 -27 21 -90 110 90 205 60 -25 82 261 28 212 200 -169
3831 -169 325 29 2 -102 -139 -164 -419 -256 19 -243 29 12 -155 15 -13 61 -204 305 194 194 24 280 247
3854 247 325 186 280 202 154 -185 29 16 -135 -53 -343 -45 31 -231 -213 29 -222 -59 -37 -32 5 -145 21 183
3878 183 170 142 398 50 19 -26 -210 44 -167 -62 -169 -186 -155 -102 -205 -132 -115 -203 -2 -89 -43 -67 222 98
3902 98 242 -17 78 -97 379 172 223 253 21 -14 52 65 -85 -94 -172 -309 -51 -232 -233 -272 -336 -310 22 154 158 -181
3928a81L79l07J46J74j4J07j54K94l72M30l12k0k56J53j50k01K21k20R8k83K63
3949b05J82j69J54p0O5k16L82j53K93Q5l0n8j10j03K46j70k24J74k07J91L07n51
3971a87J57j31k15K18J77k51j6R7jJ50N5j83K82p0K1J1J4L05n11K46Ll32M0k6
3995a47J24j26J9J20l19N4M07k82K16k97J41R7j48L18o9j4J44k03Q1M7j8k13O1
4018gK13l31K06j51l8m5j78K64j38N1M5l2J36j40K36O7j78O9M0q2k7K32j35P0
4042A47J49m14J20K20j17j35j48J0l7K40j08j2J11l23N20m02J96J6J15r8r9K36
4064A87J5J42j18P0j28p8K11l01L7n9q2J63k58r9j76M82j88R2k74J32l2L98j38
4087bj94J57J97m8K87q8j69Q5k6N2k79K03r6j74L65m03n9J85k57oN6j15J15O6
$$ plain form
3928 -181 198 -109 37 211 197 304 150 444 72 502 190 170 -86 67 -83 -284 -63 -283 -185 -468 -205
3949 -205 -23 -192 -38 -108 -43 -259 123 -30 263 348 318 260 150 47 293 123 -101 73 -134 57 364 -187
3971 -187 -30 -161 -376 -158 19 -232 -248 -151 -152 -2 53 -130 152 82 103 114 128 433 -78 168 171 -161 -121 -147
3995 -147 -23 -149 -130 -10 -329 -275 132 -150 66 -231 -90 7 -141 177 108 94 238 35 116 163 145 -68 -7
4018 -7 206 -125 81 -70 -108 -153 -331 -67 -205 -154 -109 -141 -5 -145 91 158 -20 49 89 7 -20 212 77 147
4042 147 296 -118 2 222 105 -30 -178 -168 -205 35 -73 -85 26 -297 223 -179 17 33 148 50 -49 187
4064 187 202 344 226 296 168 90 301 0 37 -22 -104 59 -199 -298 -474 8 -180 -88 -362 -230 -262 136 -2
4087 -2 -196 -39 158 110 397 309 140 225 199 251 -28 175 79 -95 270 -133 -192 -7 -264 -270 -214 -329 -214 -148
4111a48J98k56L9O7K34j60L65j40J01q2j96K44k9J0n8O1k0r9k25j3n9Pk3j37l1
4136c50O9m8J03N7p1J24K52q4J92k43K31R3p7N5J89l84J4L9r5r6J33k11j02N1
4160a59J09j36Q1N3j97l4J84q6L9K93lO0j58o8L55m6J0r6k93K58j59J60j67j7
4184a7j8r3P3r4J72Pk2j32j13J19K10l68M01j94J85M3j00J71l5N1q6o0J85j52
4208A33j01pn8K6k26n8O7K6kJ60k2J95P7j83P3j07j98K89m1N2J05o7L29j90l34
4233f2J5Q8p6n0k0j4j6P9k3r6L6K7m9q7J03m2K04K4J39L1j01O7r0o9K72J07k42
4260A55k5k27P4l1L4k67P7J11p0q4J60k44K51J35L8oRM9q9J74k18N8J83%P0j20
4286A97l83K52j7P7j55n5j18J60l89J53n5p6m6K42N1J03J07J54q1k19K49p3J71
$$ plain form
4111 -148 50 -206 -167 -100 134 -26 339 199 300 218 22 266 237 247 189 250 230 131 -94 -107 -166 -159 -182 -319 -350
4136 -350 -281 -329 -226 -169 -240 -116 136 52 244 1 232 325 248 303 492 108 122 161 66 -30 103 -108 -210 -159
4160 -159 -50 -186 -105 -52 -249 -283 -99 -185 -146 147 144 204 46 -22 333 287 297 201 -92 166 7 167 0 -17
4184 -17 -35 -128 -55 -149 23 30 8 -124 -237 -118 92 -276 125 -69 116 159 59 230 195 246 160 100 285 133
4208 133 32 25 -33 -7 -233 -291 -224 -198 -200 -40 -62 133 210 27 100 -7 -205 84 43 95 200 133 462 272 -62
4233 -62 -47 41 -35 -85 -105 -119 -135 -56 -79 -175 -139 -112 -161 -248 -145 -187 17 41 180 211 110 177 87 18 290 397 155
4260 155 130 -97 -23 -54 -20 -287 -210 -99 -169 -253 -93 -337 -86 49 87 81 90 139 50 224 6 64 247 247 317 197
4286 197 -186 66 49 126 -29 -84 -202 -42 -431 -278 -333 -409 -455 -213 -162 -59 48 202 121 -98 151 78 249
4309B49L1M5k15L72m98L8J32r1r6j5J9K1j72j70M9J42j7j15K94j08M9r9oK67j31
4334b5K94M7O5m35K76J16j06Q6k08k67K06r5j61K08j04M9l11K19jJ9J93l16J28
4357a23K94q5M9q1K55j64q1J91j94J59j75J22j53Q9J4j85j5j77J62k28J04M52
4379B30j88k19o8J59q4Q3J42K22j15j56J00l7JK6O0j9k6k94K34j20j4j73M04l48
4403b00k7K87k11K85j31P5r5n4J0J81K69j27r3j09K09l08L9J24k2j9K9l37J34
4426i1Mk45J42K04k89J64L9o6P4J12l74Q5L75k10L13q9J38k06K4J9J2r7k7oK9
4451C4j60J90J3l91m1J94J78j87Q0n5q0J27J42j68K73J07oM2o9L0N7k37j27K05
4475A51j75j4n7k51K82m74O39k23l2J22j12j19L74m68L29J14P4j89J36j04K10
$$ plain form
4309 249 280 325 110 482 -16 22 154 63 -33 -48 -29 -8 -180 -350 -301 -159 -176 -291 3 -105 -56 -155 -161 106 -25
4334 -25 269 316 381 -54 222 338 232 318 110 -157 49 -46 -207 1 -103 -54 -365 -146 -147 -128 65 -251 -123
4357 -123 171 86 135 54 309 145 64 255 61 220 45 167 14 103 117 -68 -83 -260 -98 -326 -222 230
4379 230 42 -177 -245 -86 -170 -87 55 277 162 6 106 69 70 96 156 137 111 -183 51 -69 -83 -256 148 -200
4403 -200 -227 60 -151 134 3 78 -17 -71 -61 120 389 262 169 60 269 -39 0 124 102 83 112 -225 -91
4426 -91 -87 -332 -190 14 -275 -111 -72 -138 -64 48 -326 -241 134 -76 237 148 286 80 104 123 135 38 11 5 34
4451 34 -126 64 77 -314 -355 -161 17 -170 -90 -145 -225 -98 44 -124 149 256 250 292 223 253 310 73 -54 151
4475 151 -24 -38 -95 -346 -64 -538 101 -122 -154 -32 -144 -263 111 -357 -28 86 160 -29 107 3 213
4496B13m4K63o6j45r6Q1j56l9P4k48K8o2J88J7j10k17J61r9J04R2P2L2j48Q8L27
4521C10l08K88j41JK01k50r3P9n8K68n77M09j88k46J06%k27L52k80R1K59k2j74
4544b00L09k33K54l6J8M7LJ99l18j16J8L69j92J9j3j94j20M7J45j12j15J62q4
4567a43mm8K78k99M38L0j60L00k55J31J19k63L9j37Q7k58K33j63L19l28o5J47
4589bq6o7P9n9O0J59l72K25J79j8ko4K18k25j71M03j61r5j17J25J56n32L63j90
4613a94l2J99k22J83k70K22p0K4J47k34J49J76j3j00J32N4K31k9k4p9q8r0K9j33
4637c2j02K34l07K1O3L03l15j44j16K55j86K04j10J35K80l3q8J68r6qL8j2q0P9
4661A51n0k7j38k2M81l85OJ6r6k87M56k88K20l65L40j75j1J85k23K18N5J27k31
$$ plain form
4496 213 169 432 366 221 125 206 50 11 85 -163 -135 -197 -9 8 -102 -319 -158 -257 -153 -61 11 43 -105 -17 310
4521 310 2 290 149 150 351 101 8 87 29 297 -280 129 -59 -305 -199 -199 -426 -74 -354 -263 -4 -26 -200
4544 -200 109 -124 130 94 112 159 162 361 43 -73 -55 314 122 141 128 -66 -186 -139 6 -106 -221 -59 -143
4567 -143 -147 -195 83 -216 222 252 92 392 137 268 387 124 163 26 113 -145 88 -75 244 -84 -149 -2
4589 -2 -88 -155 -76 -135 -75 84 -288 -63 116 98 96 32 250 25 -146 257 96 1 -116 9 165 -367 -4 -194
4613 -194 -226 -27 -249 -66 -336 -114 -184 -160 -13 -247 -98 78 65 -35 97 151 382 353 329 250 162 72 101 -32
4637 -32 -134 100 -207 -186 -123 180 -135 -279 -395 -140 -326 -122 -232 -97 183 150 62 230 134 126 164 152 72 151
4661 151 101 74 -64 -86 395 10 16 32 -64 -351 105 -183 37 -328 12 -163 -174 11 -212 6 61 188 -43
4684d3Q9qO2J19k87J21Q6j10j56O7J12r3Q7l70J02l6P1m7JJ18n9lK24j60J28j19
4710a04J58lJ40M7J93l02q9j50jJ20l72L1L96l04K1J98j31K6j32l9K01L7k6P6
4734iJ83k86K64n8J43q2o6J55j62j73N2J92j80l84K7P15m25n6j09L7K60o5j24
4757a51r5J33K90j94P6l3m6K17P3j27j55J77j50J24j09k6L9k25J29jL3k21K43
4780Ap0k9Nr6L55r3J4m1K0J04L13o09L84k09J20J5m4r2j34p5J33N7k01k15J91
4805a96J50k45J64J02J11j17O5j92K10J40mJ70j6j01j47l6p4N2Q2k48J24j38R1
4828e3k23K02q8m8j50L18m0n6j36J70m9K2J49QK62JJ47l38Q6KQJ16n9k24k01K49
4854G5r1K0Pj95j20j04J25J78k86N03j27k14K86j64M79k81M0J10J17R0l07M0j20
$$ plain form
4684 -43 46 38 100 219 -68 53 139 29 -127 -60 52 -41 46 -324 -222 -258 -187 -234 -233 -115 -174 -177 47 -113 15 -104
4710 -104 54 51 191 238 431 129 40 -110 -111 9 -363 -332 64 -240 -219 -21 -152 -126 -258 -297 -96 -59 -85 -9
4734 -9 174 -112 152 94 237 155 89 244 82 -91 -39 153 -27 -411 -384 331 -94 -150 -259 -222 38 -27 -151
4757 -151 -246 -113 177 -17 59 26 -20 197 270 143 -12 165 15 139 30 4 43 -182 -53 -54 -21 -242 1
4780 1 -69 -98 -93 -189 166 73 87 46 66 170 483 -126 258 49 169 184 140 48 -86 -161 -28 29 -172 -387 -196
4805 -196 -46 -291 -127 -25 86 -31 34 -158 52 192 188 358 342 241 94 58 -16 36 118 -130 -6 -144 -53
4828 -53 -276 -74 -162 -210 -360 -42 -82 -138 -274 -104 -153 -131 18 26 288 289 436 98 184 186 194 310 251 27 -174 75
4854 75 -16 4 11 -184 -304 -408 -283 -105 -391 112 -15 -229 57 -107 372 91 131 241 358 448 141 181 61
4877F1l7J73j57M1l73L99k14J80l74k3P2j22K68q6L57k95Q8K9J12q3L0N4K0O4
4901A84j72P7k9Q3n1K09j22p3l07K00j53l44M53q5j35J5K97M3l6j09r0K12k42
4924a75N85l95N6M6l4J54m24M13j84k13J07K26j06k60J09k04K57LJ04l55K48J89
4946A47O7m99J73K34l8L21j91j36j75K65k02R3j08n7Q2N0L2j02Q4j61r6J01NJ64
4970E3J29j50J56p7j5m8R9J95l9j68K0m8K3o4k18l2J14R1l12L13Ok83J84R8j85
4995a58N1j63J72q7J81m6J29M5R2k12M8K19q8J01k45r7J39m4k07J67k50J84k03
5018b72K07n3q5R9l8M3O5Q9j33J17n7O7J21j75L98j60j21K58k84j98L60k23j92
5041a67O7j36K5J22j77J56j04NL18l09jO1J78K07q3k6l4J66k09j09K91K9j8p6
$$ plain form
4877 61 24 197 40 81 -292 107 -107 73 -301 -324 -252 -374 -106 -192 165 -130 -42 -13 99 16 46 100 120 184
4901 184 12 89 60 143 92 301 179 106 -201 -1 -154 -498 -45 -130 -265 -250 47 90 54 -55 -145 67 -175
4924 -175 410 15 71 117 83 237 -187 226 42 -171 -64 162 56 -204 -95 -299 -42 -39 65 -290 -42 147
4946 147 214 -285 -112 122 84 405 214 78 -97 168 -34 59 -49 -106 -24 26 58 -44 40 -121 -217 -116 -111 53
4970 53 182 32 188 111 96 48 147 342 303 135 155 107 130 66 -152 -184 -70 21 -291 22 28 -255 -71 27 -158
4995 -158 -107 -270 -98 -185 -4 -50 79 124 216 4 52 271 183 284 39 -58 81 37 -170 -3 -253 -69 -272
5018 -272 -65 -118 -203 -104 -142 -99 -34 55 -78 39 -18 49 170 -5 393 233 112 370 86 -112 248 25 -167
5041 -167 -100 -236 -211 -89 -266 -110 -214 -209 109 -200 -201 -140 38 245 162 136 102 268 59 -50 241 270 252 176
5065A76j24P7k31J39O4m16J71J80n5m3j69q9R0L65k96K31Q5j85L22j29J73Qj80
5088A64J19j05j32M8l3j49r0K91kk08M0j50J54m0j01n4j87J73L18m6r9K21m1j25
5112c4p8K48j34K28n5J21j41k25k4o1m8M6K91j44k20L24j86j12K07j3N9k79R3
5135a37J73L8P2J39j69o0J42P3j73o4P8j28j10p5L00k35l4P2J20k77J44k2k07
5158c40J27K5J34J8L14k30R8K51k67j26J05J10m5Nk11l1j20J77O0l46L06k61J24
5181a23L35l49l1N2J94o5K72k36J49j36L55j51l17K27j9J6j07l04J71K87k37M7
5203C0j35q0K99j41j61K04l96J48m7J5K39j24O5j17M76r7lj11P7j10j9J27J16
5226B55p6m00J13K7%m5lN2k54L03l41J42K40M6j46L6K29k45PK96J42j65L4J18
$$ plain form
5065 176 52 129 -102 37 101 -315 -144 36 -19 -62 -231 -320 -230 135 -161 70 155 -30 292 163 336 344 164
5088 164 283 178 46 94 61 -88 -178 113 111 -97 -57 -207 -53 -93 -194 -248 -435 -262 56 10 -89 132 91 -34
5112 -34 -112 136 2 230 175 296 155 -70 -94 -155 -203 -157 134 -10 -230 94 -92 -204 3 -10 49 -230 -137
5135 -137 36 74 146 285 116 56 198 271 98 34 112 -16 -126 -201 99 -136 -170 -98 22 -255 -111 -133 -340
5158 -340 -213 -188 -54 -36 278 48 146 397 130 4 109 219 174 179 -32 -63 -183 -6 54 -292 14 -247 -123
5181 -123 212 -137 -168 -116 78 13 285 49 198 62 417 266 -51 176 157 173 66 -238 -67 220 -17 30
5203 30 -105 -185 114 -27 -188 16 -380 -232 -279 -264 -25 -149 -84 -201 275 178 175 64 141 31 12 139 255
5226 255 179 -221 -108 -81 -81 -126 -129 -77 -331 -28 -369 -227 13 59 -87 -51 178 -67 -60 236 378 213 247 365
5250C65l04J56l6j70O9kr1r9J84O3l84J61r1J31K7j22N5L48k38L6kp2K87j90j24
5275d3R8K11n9p8j79R9lK50p1m10J75k94P2K43q0k8n4k42K28J58n5o3J19J71L3
5300A98j01Q6o4J01j92m8M7j67J48k17J90J62j91k11J51P1L2k60J15Q0n8J33Q8
5323I3J3k0P8r9j44m1K16q0J82n1l16P5J01j58j16K85qn9p2Jj1j68J34P5j14K11
5349Gj9o6J21J19J07k23J01J71l92K34N8j60q0j20P2n0j31O2J41k83K01q7j01
5372c18K59K26j22q8O2j17L09k75L52O3k83K44j36K5k44R4r0J00l22J51k5q8K5
5395a98j27O9m5K67L7J19m34J19M5J98L0J25j61M9K0K05j24k15J91k10k7J74o5
5418D2P6m48L52J8j91J00o1j05K90q1J28k87J26K76k39K66j70J81j69l5K25l78
$$ plain form
5250 365 61 217 181 11 80 78 -13 -112 72 135 -249 -88 -179 -48 -21 -143 -88 260 22 58 56 -16 271 81 -43
5275 -43 55 266 207 129 -50 49 46 296 225 -185 -10 -304 -232 11 -69 -97 -151 -393 -165 -7 -62 -125 -6 165 198
5300 198 97 183 119 220 28 -20 27 -140 8 -209 -19 143 -48 -259 -108 -37 -5 -265 -150 -70 -128 5 93
5323 93 106 86 164 65 -79 -120 96 16 198 147 -169 -94 7 -151 -267 18 10 -49 -121 -120 -131 -299 -165 -90 -204 7
5349 7 -12 -78 43 162 269 46 147 318 -74 160 218 58 -22 -142 -70 -120 -251 -189 -48 -331 -130 -217 -318
5372 -318 -59 167 45 -43 19 -98 211 -64 288 351 68 312 176 201 -43 51 -39 61 -261 -110 -135 -223 -198
5395 -198 -325 -256 -301 -34 3 122 -312 -193 -148 50 80 205 44 93 113 318 194 -21 170 -40 -67 107 42
5418 42 118 -330 22 40 -151 -51 -112 -217 73 -8 120 -167 -41 235 -4 262 92 273 104 69 294 -84
5440h4J83O6j38k6kj10J64k48K07k06KR4k2j19L40j43J64l96J49N08k23p3k7L63
5464D23r8j47k16L02j73Mm6J01j31k19K28j87J02pn5R9J05j48K92j74k4j32J04
5487CJ43j77J38j10L40l34J00j76R7k07J68j66L43k49l22J95r4L55j8j20J32m7
5509fM3L6j60k4J27J95n67M16K1j17K85j54l28L51j51q9jQ5j44K17j78L3J50Q1
5533A21k50o9J5l5L51n8R0p5o9K20j74L0M9o1j20P2r3O1p1m5J80j14k08K74J18
5558A39m6j59j37J37J79K17k36m6o5K05K9j21P3K37m49j26K29J6o9j11j2P7j94
5581b33n0J54q3j63N1L37j17m2J11r7K10j36K69j0J22O6q5k44M0O8k36n0n1J80
5605A1l7k83J56r9J94l7j49pj48K33J97NJ46Mm89L50J05k11L83k73p9L8mP6qj13
$$ plain form
5440 -84 99 165 27 1 -1 -111 53 -195 12 -194 -192 -98 -120 -239 101 -42 122 -274 -125 383 160 87 60 423
5464 423 325 178 -38 264 91 95 49 150 19 -200 28 -159 -57 -64 -119 -20 85 -63 229 55 31 -101 3
5487 3 146 -31 107 -3 337 3 103 -73 24 -183 -15 -181 162 -87 -409 -214 -308 47 29 -91 41 -6
5509 -6 37 73 -87 -111 16 211 -356 60 81 -36 249 95 -233 118 -33 -122 -123 -38 -182 35 -143 -110 40 121
5533 121 -129 -198 -183 -218 133 75 165 90 21 241 67 97 146 85 -35 37 -56 5 -66 -111 69 -45 -253 21 139
5558 139 93 -66 -203 -66 113 330 94 48 -17 188 217 96 169 406 -43 -169 60 76 7 -104 -116 -39 -233
5581 -233 -283 -129 -212 -375 -324 13 -104 -146 -35 -132 78 -58 211 201 323 389 304 60 100 168 -68 -118 -169 11
5605 11 -26 -309 -153 -252 -58 -95 -244 -251 -399 -166 31 36 182 186 -303 47 152 -59 324 51 -28 10 6 82 74 -39
5631c9J51k60J87j85j0K42l80NL4J75j07K51L0k76M36kj36M3j81L26k27k9J43
5654A91j82L9j07Nk4j6K15j25M3q0J10k3k33K01j76J44K7l6P6J42J28l42J42J06
5678B25l14J45m3J69l49K95k06J07q3K0n0k9Q0LK00k8k14n5K9J56P6k0J33j68
5702G9K5J40j08j25R6K5k3k31j2M5n7J19k5n5J55r3m5k60K74q1J1R5K00j20J85
5727B14p0M2m1j02m0QN6P6j88j63J12k37K27J37j98j56J45J19n7j09J47k58K77
5750e9n2j80M57n8k38J12K84l06M14m4k21j9j26K44j31r5J49j2m29L06k16k16
5772d36L71J51N1j79k17J46K29k07L01j45j3j04M27k36k99M30k12J24l48L20k34
5793h0J42r5m5K11m41K92k64l7qN02j73j83L83l0J45r3j76J53j27J22j49q3n1
$$ plain form
5631 -39 112 -148 39 -146 -156 86 -294 -289 -255 -80 -187 64 94 -182 254 252 116 159 -22 304 77 48 191
5654 191 9 48 -59 -54 -78 -94 121 -4 39 -41 69 46 -187 14 -162 -18 9 -27 49 191 319 -23 119 225
5678 225 -89 56 13 182 -167 128 -78 29 -54 -34 -84 -113 -33 -30 170 142 -72 -127 -98 58 134 114 247 79
5702 79 104 244 136 11 107 132 109 -122 -134 -89 -146 -27 -52 -107 48 -45 -90 -350 -76 -157 -146 -51 149 29 214
5727 214 144 186 145 43 3 11 67 143 -45 -208 -96 -333 -106 31 -167 -323 -178 -59 -116 -225 -78 -336 -59
5750 -59 -111 -291 166 108 -130 -18 266 -40 374 330 109 90 -36 208 77 -18 131 119 -310 -4 -220 -436
5772 -436 -65 86 137 -42 -259 -113 116 -91 210 65 52 -52 375 139 -160 270 58 182 -166 154 -80
5793 -80 62 -33 -78 133 -308 -16 -280 -317 -325 177 4 -179 204 174 319 226 50 203 76 198 49 -34 -85
5816h5J62Oj29j21l1L3J43k2Q3L1j57p0K49l94L2L27n2L8J85k88J82m7J27k81
5840g9K75l0j78R2j64J19k26J02J39l19K36m1j31K62o2l9j43M13k40Qq6K01k77
5863a68K19L6j63j24R4O1J94j42nm7k5K7j17N4J61j0ml9l3O7j9k46L27q8K06K13
5889D29n27M60j14k79J44jo0o4k7m5j56K8K03j99J03m9K59l47K7N0J21q0J03N5
5913C4j7o7q3K30m5J16J27j55j16Q9j57J5m2j04l1J34Pl34K49q4J05R5L4rQ5r3
5939a7P1P6k03K45ol0j64J85pj41k2o9K69m9k67L35k90J83l21J68k58J91j03k28
5963d52O36k29J17j7K21l09N8J47J46k33p7L69m82N4K6J14r7n0j92K66q1j51n8
5986b74J71l6J12j84J59J08l15L94k52J46n0j3J00MR6m4k9r8N7J76j85j84J69
$$ plain form
5816 -85 77 83 -46 -167 -198 -165 -22 -44 39 70 -87 -157 92 -302 -270 57 5 43 228 -60 122 75 202 -79
5840 -79 196 166 -12 80 -84 35 -191 -89 50 -269 -33 -74 -205 57 -5 -44 -187 226 -14 -6 -92 109 -168
5863 -168 51 87 -76 -200 -106 -45 149 7 2 -45 -70 -43 -160 -106 55 45 41 2 -31 36 17 -229 98 10 216 429
5889 429 -98 362 248 -31 113 112 52 -12 -39 -84 -240 -212 -9 -208 -105 -154 105 -242 -215 -165 -44 -124 -21 34
5913 34 17 -50 -133 97 52 168 295 140 24 113 -44 -29 -71 -175 -206 -72 -65 -399 -150 -234 -129 -34 0 -9 76 -17
5939 -17 54 130 -73 172 166 136 -28 157 150 9 -13 -82 187 138 -129 206 -84 99 -222 -54 -312 -121 -224 -452
5963 -452 184 -45 72 55 276 -33 25 172 318 85 8 377 -105 -51 -25 89 -8 -58 -250 16 -65 -216 -274
5986 -274 -103 -139 -27 -211 -52 56 -259 135 -117 29 -21 -34 66 70 166 122 93 -5 52 228 43 -141 28
6009B8k25K28k58J11J82j51l54K44J82R4k21J33j28K94k32J08J39j83j05J31R8
6030A15k35K09j47q2L31l60J74n5j69L6J61j81K77L8j31J87r6n3J04j92J03j3
6052B1K47j11j95J50k84L61L2m02J44k33K59j00j03M8o6K74J13j01N9j23KJ45
6074A37j53L9K2J04r8k36N6oJ02j2J8J38k05j29q7K84Jj64Q2M6J64k44L5o0J71
6099Ej02J60j44J90J02m0Kj99K23j71j08o1R5J44k74J17r0q7K17k64J29K24q2
6122a4j57L1K07N4r4q5J12j83L56on8j59R5k00J07q5K14k76K11n5l10J91J07r3
6146i0J39k87J38J68r8o0K5J22o5j41K64p2rj11l8M92j63k73J39r4j54L2rj4j14
6171b73O2L40l11L72l76j08L28r0J08k12M57n22J91Q7J26j39l1p6oL20j36l85
$$ plain form
6009 28 -197 31 -227 -116 66 -85 -439 -195 -13 81 -140 -7 -135 159 -73 35 174 -9 -114 17 115
6030 115 -120 89 -58 -140 191 -169 5 -50 -219 -183 -22 -203 74 112 -19 168 72 19 123 -69 34 21
6052 21 268 157 -38 112 -172 189 221 -181 -37 -270 -11 -111 -214 -166 -232 42 155 54 113 -10 -8 137
6074 137 -16 23 45 149 51 -185 -129 -135 -33 -45 -27 111 -94 -223 -310 -26 -25 -189 -107 -61 103 -141 -106 -166 5
6099 5 -97 63 -81 109 211 171 173 -26 197 26 -82 -143 -48 96 -178 -61 -151 -238 -21 -285 -156 68 -14
6122 -14 -171 -140 67 121 27 -58 54 -129 227 221 163 4 99 -101 6 -79 135 -141 70 15 -295 -104 3 -90
6146 -90 49 -238 -100 68 -30 -90 -65 57 -8 -149 115 43 34 -77 -115 377 214 -59 80 -14 -168 -136 -145 -159 -273
6171 -273 -211 129 -182 190 -186 -294 34 -56 52 -160 297 -225 -34 53 179 40 9 -67 -73 247 111 -274
6193b74L16j95L01k98Q6J18k6j82Q5J37j82K00k51L87k53j37K07m1j43L10P2k17
6215B0O5K3j3j4n9q5LJ6K3j33n5O1J08l9j03P0J98k49L34j53r3J20l7l1J85j27
6241C5J89l21K16k02q8K09j52P9j5m4k6J2KJ60k01J11Q1k3Q9l09K37j42J52mK13
6266B58p2j93J00l56K53l8J21k27r2j92N39k74K4k4K69k35q6J55o6L41l05P1J77
6289A48R4r6j49O8R1J19l33J12J22k86J0M4m0J54P8j66j15p3J33k79N1J43K05
6312C5j76R8k67L50R0J7L09l56J12l31K39M1j12P8R2r7J19n00J55M0r9k2K30m9
6336dJ92l20J80q6J1J73j95pP5P4p8K88k30j92J49J23j22K05o4j71Q2J21k48q5
6360a29R0r7Q6j72J46J39Mo3M68m09k01R3L5P6N6L2k66mj76L07j17K07q5j45O0
$$ plain form
6193 -274 42 -153 148 -150 -64 54 28 -154 -69 68 -114 86 -165 222 -31 -168 39 -2 -145 165 237 20
6215 20 85 108 95 81 22 -63 -60 -44 -21 -154 -209 -148 -40 -79 -182 -112 86 -163 171 18 -75 45 8 -23 162 35
6241 35 224 -97 119 -83 -171 38 -114 -35 -50 -94 -120 -108 -106 54 -147 -36 45 22 111 -198 39 -103 49 45 258
6266 258 186 -7 93 -263 -10 -48 73 -154 -246 -438 101 -173 -149 -173 96 -139 -225 -70 -136 205 -100 -29 148
6289 148 242 146 -3 65 156 275 -58 54 176 -110 -100 -56 -96 58 136 -30 -145 -218 -85 -364 -313 -170 35
6312 35 -141 -43 -310 40 130 147 456 100 212 -119 120 161 49 127 219 122 241 -259 -104 -64 -163 -185 45 -4
6336 -4 188 -132 48 -38 -27 146 -49 -56 19 93 15 303 73 -119 30 153 31 236 172 1 83 204 -44 -129
6360 -129 -39 -136 -50 -222 -76 63 67 4 472 63 -138 -45 -10 66 122 154 -112 -116 -292 15 -102 105 20 -125 -65
6385f5M7k77N1O6j65M91k34J13l24K65J82ok48K02N9o6j66RN5L20k08M9r5k12
6409a57L61q3j03J24l16J70k05J07K12j76M1P7j37J28J96k41k5Q3M6O6k06J05
6431F7j62Q3k03K66j34M6jP6o0j32M5k06L80j52J41P1L5l85L15J41l92L04p4l13
6455b44M05k54L69l36K37m45K94k12L9P5M9M8m15M11k3j57nK71j05j17K75M0j54
6478D6j66J4J67j54K60m9r8J59k06k1l6J12j29q4K8J36l0k32L46k3m0n7m7J95
6502I1l9k6Q8P8J23k77J05j6o9o0J6j28J90j15Q7k18j62K21J80j37j38M5K61j71
6526g1q3Q9J94k18j1K83m5j10n2k00J66K38j77n2k0L05j71q3k09o2Q7N5K22j91
6550a16o6n2J69o2j1P6j1J25K22k26R6k85J49m1r6K06j40J9P0j72J84j66J17J70
$$ plain form
6385 -65 -18 -295 -244 -178 -343 148 -86 27 -297 -32 150 144 -104 98 157 91 -75 -66 -11 309 101 150 55 -157
6409 -157 204 121 18 142 -174 -4 -209 -102 110 -66 -25 52 -85 43 239 -2 -27 56 102 168 -38 67
6431 67 -95 -12 -215 51 -83 -37 -38 38 -22 -154 -109 -315 65 -87 54 125 160 -225 90 231 -161 143 69 -244
6455 -244 161 -93 276 -60 177 -268 26 -186 -147 -72 -23 25 -390 21 -2 -159 -164 107 2 -115 160 200 46
6478 46 -120 -106 61 -93 167 118 20 179 -27 -48 -84 28 -101 -185 -157 -21 -51 -283 63 40 0 -57 -104 91
6502 91 52 26 114 192 315 38 143 127 58 -2 14 -114 76 -39 48 -170 -332 -111 69 -68 -206 -161 100 -71
6526 -71 -154 -65 129 -89 -100 183 138 28 -24 -224 -58 180 3 -49 -69 236 65 -18 -227 -289 -202 -147 75 -116
6550 -116 -182 -234 -65 -127 -138 -62 -73 52 274 48 144 -141 8 -33 -129 77 -63 -44 26 -146 38 -128 -11 159
6574A59j14o9Q7j16M6R0j66J29k6K26j84n4J82k69M7j76J21K53k27L8K16k26j29
6597a62q9K13J4p2l5K33l89R6J31j2K26l20J81J5K52l28J03Ll2o4M9K2k9p1p9
6622a44K02k94L17k71K27k6k9J20n0k00K19L1J6r1J46J69j68q3k74K16J47R2k35
6645C7J64l18mP6J00J29k28m0M7l26L43j16J99q5k61L60N9N4k17P9K8Q4p8%J24
6670B10j2Qk45J30J39l04Mm13J98J73R0q5JJ0J39j85%P5k21L16j65J42K4L2j50
6695h9K55k14L2Q6p5j89L11k21J70k72J93R8j82j31J93j64K79o3j60J59M9K47
6717C12m1j64k41J84M9O2Q2k02Pp2K17l82K34N7J03j89p6j77K67l7l8J6J86k65
6741a08J12RM1r8j06J03P1j64J48J08j46p2M8R4p0K03l64K07j18Q3l13M59k73
$$ plain form
6574 159 45 -24 63 -53 -7 83 -83 46 20 246 62 8 190 -79 -32 -208 -87 166 -61 -23 193 -33 -162
6597 -162 -251 -38 -24 -96 -131 102 -287 -191 -60 -72 154 -166 15 30 282 -46 57 60 28 -36 13 35 6 -65 -144
6622 -144 58 -236 81 -190 37 11 -18 102 52 -148 71 102 118 27 173 342 174 91 -183 33 180 272 37
6645 37 201 -117 -121 -45 55 184 -44 -84 -37 -363 -20 -136 63 -22 -283 77 136 190 -27 52 80 164 86 86 210
6670 210 198 206 -39 91 230 -74 -70 -483 -285 -112 -22 -107 -106 -96 43 -142 -142 -67 -288 28 -137 5 29 61 -89
6695 -89 166 -48 -16 70 -5 -194 117 -104 66 -206 -13 85 -97 -228 -35 -199 80 17 -143 16 65 312
6717 312 271 107 -134 50 99 161 243 41 48 -24 193 -189 45 102 205 16 -60 -237 30 -7 -45 -29 157 -108
6741 -108 4 13 54 -44 -150 -47 24 -140 8 116 -30 -102 -54 40 -30 173 -191 16 -102 -19 -332 127 -146
6764a46J66J20l36J91j15J44l1K16j31l8q0K16k10j04K01j46M7j93J72NJ8l4m0
6787a08j03J86P4j27K6J64j76%J80J26O4o56L62k41L40k0M7k82J46j44J26M6j19
6810h9k6Q5k11K02k24o5K01J88O1l45K15J11j21k0J39l14K96j14J75k63j3J41
6832Iq1O8O7N4m8j09J09J3k86J05J77m3j77P1K5nP2m0j14J91R4o1M6j29j48R7
6858d3Rp7K26K4n7j58k9L03k41j3J54k54J01P8J66l84K40o6J0K31m97K68L48j18
6882B21r4j02J11o8j02k0J90l7j17J83j42K00l48Q3K59k82m9J7K21j82Q8j23M08
6905C15k19k28J71j89K80k34M54j09l44q1K55qN6j82J3J46q3j30j92L38j30J40
6927C9j2J49l2j60J57J14k10J14Ol15K65k77R8K10j98k55M04j30K99j90k26J30
$$ plain form
6764 -146 20 140 -196 -5 -120 24 -7 209 78 40 -40 176 -34 -138 63 -83 -36 -229 -57 -52 -34 -68 -108
6787 -108 -211 -25 49 -78 -52 112 -64 -64 116 242 306 -350 12 -229 111 91 138 -144 2 -142 -16 30 -89
6810 -89 -115 -30 -241 -39 -263 -328 -127 61 122 -223 -8 103 -18 -38 101 -213 83 -31 144 -119 -132 9
6832 9 -72 -4 63 117 69 -40 69 82 -204 -99 78 35 -142 -71 -46 -51 21 -19 -133 58 152 91 137 8 -140 -43
6858 -43 -34 -111 115 139 82 -76 -105 198 -43 -56 98 -156 -55 23 189 -195 45 -21 -11 220 -277 -9 339 221
6882 221 127 25 136 68 -34 -54 136 99 -18 165 23 223 -125 -42 217 -65 -114 -97 124 -58 30 -93 315
6905 315 96 -132 39 -150 130 -104 350 241 -103 -184 71 63 119 -63 -50 96 13 -117 -309 29 -101 39
6927 39 27 176 144 -16 141 255 45 159 165 -150 115 -162 -64 146 -52 -307 97 -33 266 76 -150 -20
6949b0k8J08l41K52O0J67l75J33N1qL4M2p9n4j39J96Lo8K58n0P2l03kL4j95J84
6975f8L2L1k46J53m9pL8J95N5k17N4q8L54k14L1R1r6%j32n0J07q3jQ8K45l77j10
7002b64L58j70j39J76L1J94j11l8j57J24j43K54j52r1K77j67n2J34P6l93P2J85
7024Dk32L4J94K1P2k39K06j85J78kR4j88J8J23j7R9O0k55K64l49K36K00l26k1
7048a1J13m84J99K11k1q6K9O7j01K05m04R6K73p7p2J0j1J50k68J45nK05l36K53
7072H0j61J02p8K03k71K16p3k09J09O8k30K82k60M0K01j48J94j2m1J18k65J3r8
7095b20L51K9j84m8M2J56j43P8J45j02m3l09J76j38J43J50r8J15L8N0l44K36k28
7118a48L5K14j32K15l4j62J79k84L6K86k46Q7N5O4j68n7j02M02m41J64N5q7j11
$$ plain form
6949 -20 -48 60 -281 -29 31 198 -177 -44 7 -1 33 75 -4 -58 -197 -1 2 -66 192 142 214 -89 -91 -57 -252 -68
6975 -68 -36 -5 -251 -98 -147 -154 -116 79 134 -83 -29 -117 237 23 54 145 49 49 -83 -133 -26 -109 -110 -22 223 -154 -264
7002 -264 94 -76 -215 -39 -8 186 75 37 -120 4 -139 115 -37 -128 149 -18 -70 64 140 -253 -181 4
7024 4 -228 -194 0 21 93 -146 60 -125 53 51 145 -43 -25 98 81 180 240 -15 249 -100 136 336 10 -11
7048 -11 102 -382 -183 28 7 -79 -50 17 -84 121 -283 -187 86 9 -63 -53 -64 86 -182 -37 -42 163 -173 80
7072 80 -81 21 -57 146 -125 91 18 -191 -82 -14 -244 38 -222 -182 19 -129 65 53 12 130 -135 -122 -220
7095 -220 131 160 -24 -72 -30 126 -17 61 206 104 61 -248 -72 -210 -67 83 -15 100 138 188 -156 80 -148
7118 -148 -113 101 -31 184 150 -12 167 -117 -81 205 -41 46 101 165 -3 -60 -162 240 -201 -37 18 -69 -180
7141a80P7J39j40L08j93K06j75j36K18o8k15K11J14j61J3j41K84p8n0L7k18k2
7163a70R9J69j01r0k1J21nN1r1J76L5j6L0p7K08l97J76j14J8l19K31J19p4J1k05
7188b36LK39p4n1m8J48r1L31k76L0P3j4N3j26p6J49K01k81L3j31J50L1j9l3j33
7213a48j11K76j77R8P7r2J67Rr9l3K52k32j0m2J06j58K15j40r8K39M6J52j48k71
7237a22J80Q4n2K2m2m6j74J12J02j31J29p1j94J50r9J42K9J04j24O5J05l8L0q5
7261G6j70K22l5q6p5J78j56o4J31k25lL18n6o6j30J60M1K4j69K18k29J59O7j60
7285c0J09K47k33kJ64l48J02kr7K26j15J70k25L7M4p2Q1m5q9K15j79N3J09j81
7309f1L3K61j93j83J27k9N2J4J84l11J07K2j9j66J71k26J49j3M9L3k04K69k38
$$ plain form
7141 -180 -103 36 -104 204 11 217 42 -94 124 56 -159 52 166 5 18 -123 161 83 33 70 -148 -170
7163 -170 -71 98 -3 -93 -114 7 2 53 -38 138 173 157 187 110 318 -79 97 -17 1 -318 -87 32 -42 -31 -236
7188 -236 -233 6 -68 -119 -167 -19 -110 221 -55 -25 48 34 87 -39 -115 34 235 -46 -13 -144 6 37 18 -15 -148
7213 -148 -259 17 -160 -62 15 -77 90 99 0 -33 219 -13 -23 -65 41 -117 98 -42 -140 99 145 297 149 -122
7237 -122 58 142 90 112 70 24 -150 -38 64 -67 62 -9 -203 -53 -152 -10 19 123 -1 64 169 131 161 76
7261 76 -94 128 93 7 -68 110 -46 -110 21 -204 -207 111 55 -11 -141 19 60 84 -85 133 -96 63 130 -30
7285 -30 79 326 93 91 255 -93 9 7 -90 136 21 191 -34 3 47 -25 56 11 -78 137 -42 11 120 -61
7309 -61 -28 233 40 -143 -16 -45 7 21 205 -106 1 23 4 -162 9 -217 -68 -81 -32 1 -203 66 -172
7332a72K78J02l48L61k06R5j37j19J7J97j12K30j14N6J7k48M6k9K0p6J4J63p0
7355c5J26J66k34J07j51P4j37K40m5K4l41J78J08J74j70J62k60p8N7r4j8O8K11
7378A32k20J03p4N5j4k3j99M52k07K9j1j75J00O8J79K2K3m11J95J09j28J17k24
7401a02o5k3L49k23j1J81k7r2J03j64k9J04j59K71q4K9j64J0L22k57J24k20K29
7424A02j12L4k21P0Q0r2K62j81J33q5p0O4k8p2k7rK64m1J06j33J29j43N8J00q3
7449A05j28J48j74J04m0j93L18k67K54l71J42J67j81K19j53Q3m0mj8j31j67J96
7471a31J56J57M3j25rj79K69q8k25Q5J24j17K7O3k32J73j9r4O3PJ04j74j33J89
7495f6j5J89k3k21N7J49pL9k82J86j4J17j47j41P3L12j86l3K8J74j78l7Qj48K19
$$ plain form
7332 -172 106 208 -140 221 15 110 -27 -146 -129 68 -44 186 72 128 145 -103 -57 -86 -66 -142 -128 35 -35
7355 -35 91 257 23 130 -21 53 -84 156 111 135 -206 -28 80 254 84 246 -14 -92 -35 -129 -147 -79 132
7378 132 -88 15 -59 -4 -18 -41 -240 212 5 34 23 -152 -52 16 195 217 240 -171 24 133 5 122 -102
7401 -102 -167 -190 159 -64 -75 106 79 -13 90 -74 -103 1 -158 113 29 58 -106 -96 226 -31 93 -127 102
7424 102 -10 24 -197 -127 -47 -139 123 -58 75 -10 -80 -16 -44 -116 -143 -152 112 71 177 44 173 30 88 188 105
7449 105 -23 125 -49 55 15 -178 140 -127 127 -244 -102 65 -116 103 -50 33 -7 -11 -29 -160 -327 -131
7471 -131 25 182 225 100 91 -88 181 93 -132 -47 77 -40 -13 50 -182 -9 -28 -122 -59 -52 52 -122 -255 -66
7495 -66 -81 108 85 -136 -79 70 63 102 -180 6 -8 109 -38 -179 -106 206 20 -13 15 189 11 -26 -18 -166 53
7520E3r9J74k11L7L5O3R4n5j59J45K06n05L48k09J70j31k45M46j14l0p9j12J09
7543f9L2P9j76L40k11j14P1J46j46mM4L31m02NRl40M82j46J34j07j32K82k16J17
7567Io6j2J57j86J8oR5j75K07l9%LO9M8n6j53l6J26J80l02J7K38J43o26K54K08
7593A15o1p3j1K29j42k7o4m2j9L96l92J52j39Jk74O66l75j57M52j40L5k03J57
7616H4j44rj9j57J89Rl6K09k68oK80j90L9k6J53j5p0J58l2j33J0o9Nm7K2J69j07
7643aP9o3no0k49L14k27J39QM8J62l4q0P7Jl43J45J68j0j74m0J01J81p8N3l6m0
7670C6j92K2K30N6k19J63k50K79k35j6j1o4K4N6NM4K70j86k1j05L4K9j8n7P6J0
7696d0n5j64K13P2k43J39K06k61K11j36K15k32k7K67Kk15L8j24K58j51j08J69
$$ plain form
7520 53 -46 128 -83 -46 -11 52 146 91 -68 77 283 -222 126 -83 87 -44 -289 157 43 13 -66 -178 -69
7543 -69 -37 42 -134 206 -5 -119 -48 98 -48 -52 -8 323 -79 -74 -65 -405 77 -69 65 -42 -174 108 -108 9
7567 9 -57 -69 88 -98 -80 -86 9 -166 41 2 2 5 74 122 66 -87 -123 3 183 -119 -102 136 279 -347 -93 115
7593 115 54 -19 -30 199 57 30 -34 -76 -95 301 -91 61 -78 -77 -351 315 -60 -217 235 95 130 -73 84
7616 84 -60 -69 -88 -245 -56 -47 -83 126 -142 -148 132 -58 -19 -45 108 93 23 181 149 16 26 -43 -38 -85 -63 106 -1
7643 -1 78 15 10 -50 -299 15 -212 -73 -65 -17 145 111 31 108 109 -234 -89 79 69 -105 -145 -44 137 59 112 76 36
7670 36 -156 -134 96 152 -67 96 -154 125 -110 -126 -137 -201 -177 -121 -116 -72 198 12 -9 -114 -80 -51 -69 -126 -50 -40
7696 -40 -95 -259 -46 26 -217 -78 128 -133 78 -58 157 -75 -102 165 167 -48 -10 -134 124 -27 -135 34
7718C4l1p2L35m20O5n4J32j50P6J99o5j56M4Q2L2o2J37k77QJ91k01L45k62J8j64
7743b16K79o9L4j72N6J5j03J0K09k6K9j60Q0j95N12j72k31J55L8q0n8m9J06O2
7767E4m6J41j65k26L13r8kk0J11j20L8J59j94j18K13j41n6J49j47K62l7n6J5O1
7791I0K1m2j58K36P2k40J24k09m1K66jk08j36M43j85p7k6J2O3RJj07P5Km2Q2k10
7818a86K63J01r6Q8r1j32J93k42R7J08j40kk14O2J54N2k07J35M2J20n5Q5O2n4
7842A43j0j40q6J04J45Jj19j22J19M9%k40M30k86l34K67K5j13J39j82L93k08J48
7865A23K6K8k00q0k1m4o0K70n0J39q9k50K32K12l15r7J51j10R7j42K25j55k33
7888c43K44K04o0j75J8J08O9K87k31j0k0k14K74j49j68j12N14k90j37J95j55K68
$$ plain form
7718 34 3 -69 266 -154 -89 -143 -11 -161 -85 114 49 -107 -63 19 51 -11 126 -151 -143 48 -153 192 -70 -52 -216
7743 -216 63 -6 28 -144 -88 -73 -176 -166 43 17 46 -114 -34 -229 283 111 -120 35 73 -7 -65 -114 -8 54
7767 54 8 149 -16 -242 71 -27 -29 -49 62 -58 -20 139 -55 -173 40 -101 -157 -8 -155 107 70 14 29 90
7791 90 111 69 -89 147 219 -21 103 -106 -147 119 118 -90 -226 217 32 -45 -71 -59 4 13 14 -93 -18 -16 -58 24 -186
7818 -186 77 178 82 170 79 -53 140 -102 -5 103 -37 -39 -253 -191 -37 15 -192 -57 -15 105 50 135 197 143
7842 143 133 -7 -93 11 156 157 38 -84 35 84 84 -156 274 -12 -346 -79 -54 -167 -28 -210 183 -25 123
7865 123 149 177 -23 -103 -124 -168 -228 42 -8 131 42 -208 24 236 -79 -176 -25 -135 -38 -180 45 -110 -343
7888 -343 -99 105 45 -130 -112 -4 65 352 121 111 91 -123 151 2 -166 -278 236 -54 -191 4 -151 117
7910A17n0l04L95j91j14J92k3K26k75K1O5NQ7k60R6J34M2k07P6JR0k89L16j21
7934B9j3k5j20J99l93J86Q7K41l2l33K14P8j14m4L18k23M8l9o8J19p1N6m33L24
7958iR6l6j28J09ll36K75l6R2rr9J49m6k56K08Q4QJ4j75K12j02L5J01k02Lq6L12
7985A75l71L23j68J43l7mm8J1k2j65J35J63n3j62N5j59R7L67j90N2k51M71l98
8008c6kK89l92O7J32J39j27k9j68m3J09P7Lk77K89k09J54P0k8j77J68j49l0k9
8032a99K62J7n2j4K25k12j12J82j64J45k26j1P0K39j00J24j57l5K25k67r8L25
8054A67m19n9M70k30j20K81j17J58j89K37j70J12o0M7r5o6j98O5R3q2K66j80j3
8077a02J10M2M6l9j71J77l9M6j47R1p3J30o6o1M5m9r0J05K2J26K4j36j9j34J05
$$ plain form
7910 117 67 -237 158 -33 -147 45 22 248 -27 -6 59 64 151 -109 -13 121 163 -44 32 33 123 -166 150 29
7934 29 16 -9 -129 70 -323 -137 -50 191 159 -174 40 118 4 -40 278 55 103 64 -4 115 44 100 -333 -9
7958 -9 87 51 -77 32 29 -307 -32 -68 24 15 -84 65 19 -237 -29 55 63 77 -98 114 12 47 148 -54 -51 -137 175
7985 175 -196 127 -41 102 65 61 13 24 2 -163 -28 135 82 -80 -25 -184 -87 280 90 142 -109 362 -36
8008 -36 -38 251 -141 -74 58 197 70 41 -127 -170 -61 16 19 -258 31 -178 -24 46 18 -159 9 -140 -170 -199
8032 -199 63 80 28 14 239 27 -85 97 -67 78 -148 -159 -89 150 50 174 17 -18 207 -60 -158 167
8054 167 -252 -311 159 -71 -191 90 -27 131 -58 179 9 121 61 108 13 -53 -251 -186 -93 -175 91 -89 -102
8077 -102 8 50 96 57 -114 63 24 70 -77 14 -59 71 5 -56 -11 -60 -150 -45 -23 103 127 -9 -28 -162 -57
8102e7K21l51L08m4j36J40o7L40j80r4r2O7o9PK2k6k0k37L77j21l56L28k0qJ89
8127A21o7m4ok97K71k4J88o2k85K18M5l3q8K52k55j3K08k20J31m0R4l21K28j08
8151a07K8J4j69R0l9J49k7r6qJ06J0Q0r3OK98j52Lj04J55j68m0k7J48k97N1J08
8177h1n0J19o2J74j68M5O6J8j45N6j55J57O7q6
$$ plain form
8102 -57 164 -187 121 77 -59 81 14 354 174 80 -12 55 -14 -7 15 -11 -31 -268 109 -12 -368 -40 -60 -68 121
8127 121 54 10 4 -293 -22 -46 142 80 -205 13 58 25 -63 189 -66 -79 129 -91 40 0 94 -227 1 -107
8151 -107 -79 -65 -234 -144 -183 -34 -61 -157 -165 -59 -49 31 -62 -56 242 90 93 -11 144 -24 -64 -91 57 -240 -189 -81
8177 -81 -131 -12 -74 100 -68 -23 43 61 -84 -28 -183 -26 41 -45
8191d5
$$ Imaginary data points
##PAGE= N=2
##DATA TABLE= (X++(I..I)), XYDATA
0@%%%%%%%%%%%%%%%qJ6j6J6j6J6k4L2l2M0m8N5o3P2q1Q9j04J20j36J52j72J95
37A03k19K44k71L02l35L71m11M55n03N56o12O74p44Q20r03R94j098J214j343J491
57G85j660J858k093K374k719L156l726M506n644P461j0828J9080p5381j06978
71a69809J71502J03206m1453l0322L5627l5391n1814M6294N4801o5036m6675M4222
83A5152J2796n4269J2279P2830j8909r6751J0737P6426k1623o1271K2386L7938
95G721k8585j9593N7593K6091n0641l240N6774K802l9790j680J8454j9026j2287
108e407L4257q353o6108N26O9286J5633n9275l3557L7013K7055j6324k343Q015
121D18j7977j5223J4269J7698l122N76J2899j8950k3854L7786N2605r546m7709
$$ plain form
0 0 0 0 0 0 0 0 0 0 0 0 0 0 0 0 0 -8 8 -8 8 -8 8 -16 16 -16 24 -24 31 -32 40 -41 48 -56 64 -72 80 -92 103
37 103 -116 128 -143 159 -176 195 -216 239 -264 292 -320 354 -390 430 -473 521 -577 637 -706 785
57 785 -875 983 -1110 1264 -1455 1701 -2025 2481 -3163 4298 -6530 12550 -62831 -169809
71 -169809 1693 104899 63446 33124 68751 33360 -18454 27840 82641 17605 -29070 15152
83 15152 27948 -26321 -14042 58788 39879 -56872 -46135 30291 8668 -52603 -30217 7721
95 7721 -20864 -40457 17136 43227 -7414 -10654 46120 48922 9132 7452 25906 6880 -5407
108 -5407 28850 20497 -45611 -45085 24201 39834 -19441 -52998 -15985 11070 -5254 -7597 418
121 418 -17559 -32782 -18513 -815 -3937 -3361 9538 -9412 -33266 4520 57125 47579 -130
134a30j6168K4376J3817o816k983j4673k3711p52J9345J6629l629j5129k823K218
148a0429K531O102m92n383n011q20P579K183L110J9513R437j6013j3881R423J9149
163B6998p932k6947n276J0185j971j1433j941J4046P453n216j876n234j595K1169
177A0430J4897j7679k3290Q197K7474J356j2627P161J139j6738l691J4458O645
190A7732j6058j3301M419m753n633J5610J0428j3286j6706K943J4433J509K616
203d7J0727j1409j9485J3489K9284K516k3616n642J2687p119r412J0927M158j2182
217e124p867L447K021k812J1243J0414j9472j8771J3683J8737l113j1498M960
230d152R140p975J760J8253L488j0610k020L874n187p410J0875Q812j6940j2067
$$ plain form
134 -130 -16298 8078 21895 15079 12096 -2577 -26288 -27040 -7695 8934 5305 -9824 -12647 -10429
148 -10429 -7898 -1796 -2288 -7671 -12682 -13502 -5923 -3740 -630 18883 28320 12307 -1574 7849 26998
163 26998 19066 -7881 -13157 -2972 -4943 -16376 -18317 -4271 3182 -2034 -3910 -9144 -10739 10430
177 10430 25327 7648 -15642 -7445 20029 21385 8758 15919 17058 320 -3371 11087 17732
190 17732 1674 -11627 -7208 -11961 -17594 -1984 8444 -4842 -21548 -18605 -4172 -2663 -47
203 -47 10680 -729 -20214 -6725 22559 25075 1459 -4183 8504 1385 -8027 2900 7058 -5124
217 -5124 -12991 -9544 -7523 -10335 908 11322 -8150 -26921 -13238 5499 2386 -9112 -4152
230 -4152 4988 -2987 -1227 17026 20514 9904 7884 11758 6571 -839 10036 18848 1908 -10159
244a0159P802L291l082K225M392j0689j6919P284J7585k290p577K171L792p25
258b899P3J2228P022j0034n041J231k920K871R869L253j3967j4290R337J2227
272H960n403n765k171o306n979K660J0553K812n708O05O29j423P637R421J574
287A2096q963q510M830O243J330L918q42p981n529L646R180p12r322k900l569
302g085l275M801N605J508l725m094J393J300M223P335k388q035l448L446Q391
317E952M140k941j562m020l225K322K048Q99m286o959k230J68M377Q642N93n543
333a625l961m82M972M193M13j718o988k346N252O161O067k22o389k601p03K024
349B047L967k173n902o877l683N000O297L059J010o005l505M079N708M676j924
$$ plain form
244 -10159 -2357 934 -2148 77 4469 -6220 -23139 -15855 1730 -560 -8137 -5966 -2174 -2899
258 -2899 -2826 9402 16424 6390 1349 2580 -340 2531 12400 15653 1686 -12604 -3267 8960
272 8960 3557 -2208 -4379 -10685 -16664 -14004 -3451 -639 -6347 -5742 -5113 -6536 1101 10522 12096
287 12096 3133 -5377 -547 5696 7026 10944 10102 2121 -3408 238 9418 8706 -616 -3516 -7085
302 -7085 -10360 -5559 46 1554 -2171 -6265 -4872 -3572 651 7986 5598 -2437 -5885 -2439 5952
317 5952 10092 7151 5589 1569 -1656 666 2714 3613 -673 -7632 -9862 -9694 -5317 3325 3918 -1625
333 -1625 -5586 -6068 -1096 3097 3510 1792 -5196 -7542 -2290 3871 9938 9716 3327 726 23 2047
349 2047 6014 3841 -2061 -8938 -12621 -7621 -1324 1735 2745 -3260 -6765 -2686 3022 7698 5774
364E774o136k484r09M316O330Q70j444m756m050L807L546J230j211o824n492l52
380g785L126M330o16l833j971k524L119P465L582o9k337k521K877L087M002J093
396A1025n436m974k589N16N553J618k169l346m995P26M881K308k263o893n957
411a1995p48J791O053M068k225j414M09L580P643L808j852n508p006n27L406K629
427B112P23m278m094J728K303N255K420m096m810m511n61L735J194L37j578l204
443g325L094N184M860M130j831l160j702l73L777K096j693k505m132q55L839K001
459E405J292j172o211l227K60K282L031k172m009l947j886N539N168K69j607l757
475d742m79M867M337L878j479n399k669j59L244L009j944m108m719j776N332M767
$$ plain form
364 5774 -362 -2846 -3755 561 6891 7761 6317 1561 -2489 1318 4864 6094 4883 -1941 -7433 -7785
380 -7785 -4659 -329 -945 -4778 -6749 -9273 -6154 1311 4893 4824 2487 -34 2843 5930 9932 11025
396 11025 5589 615 -1974 -1458 4095 5713 3544 198 -4797 -4071 810 3118 855 -6038 -11995
411 -11995 -12743 -10952 -4899 -831 -3056 -4470 -4061 -481 7162 10970 9118 3610 -3396 -3923 -517 2112
427 2112 2835 -1443 -5537 -3809 -1506 3749 6169 2073 -2737 -7248 -7809 -4074 -2880 -2543 -4121 -7325
443 -7325 -4231 953 5813 9943 8112 4952 3250 2877 6654 8750 7057 4552 420 -435 3404 5405
459 5405 6697 5525 -686 -3913 -3653 -1371 1660 -512 -4521 -8468 -10354 -4815 353 622 -985 -4742
475 -4742 -5221 -354 3983 7861 6382 983 -1686 -1845 1399 4408 2464 -1644 -6363 -8139 -2807 1960
491A960O4k265m289j442J754K818L121k591m334N02R04L528N031J549j067l098
507B145j642K146R65M43n86n419l267O48K776M218J76k280q71k565J242L775Q47
524B751q82l819k795J644K363M683K442m117l797k05K190L769L09k468l433l652
540e017K771N048J628j70l538k856R32J720L051R44l824k889q65K409M280J447
556E071j397l275m063J554L684J41j042k785k367K55J330L764J013k768k227j956
572e068l66L266J375j39k215l145J980L594K360K365j456k165j262K68L459J319
588D170j521j549k650r23K977J922O80k499m001q02J75K858L600j107l289j274
604c233P40N112L134r77j392k833jK252K440J998j723m264j266n29K450K719k826
$$ plain form
491 1960 2024 -241 -4530 -5972 -4218 -1400 1721 -870 -5204 -4702 -3798 -270 4761 6310 5243 2145
507 2145 503 2649 3614 4057 3471 -1948 -5215 -4567 -1791 2427 2603 323 -548 -3113 -1871 1904 2751
524 2751 1869 -1950 -4745 -3101 -738 3945 6387 2270 -1527 -1732 458 4227 4536 2068 -1365 -5017
540 -5017 -2246 2802 4430 4260 722 -2134 -1202 518 3569 4513 689 -2200 -3065 -656 3624 5071
556 5071 3674 399 -3664 -2110 1574 1715 673 -2112 -4479 -4224 -2894 870 1883 -885 -3112 -5068
572 -5068 -5434 -2168 -793 -932 -3147 -6292 -4312 -718 1642 4007 2551 386 -876 -608 2851 4170
588 4170 2649 1100 -1550 -2473 504 2426 3106 607 -3394 -4196 -4021 -1163 2437 1330 -1959 -3233
604 -3233 -2493 2619 5753 4776 3384 551 550 2802 5242 7240 5517 1253 -13 -542 1908 4627 1801
621A801m905l801k16L914J775M7p86k195R0K656J984K405q77l315q58K59L106
638A084L224l51j206j740j046K465J093m55j120m079k450J03J537K727p63k327
654c304n84j0J823K454L38K35k007k693J474K874K765J347k839k071N56K403K966
671E727j586k781j701k293K98K285J240n6l408k671J246J717K784O97l313j573
687c388L17K870L175N09o16q00k264P07K925J029r31l530k077J010M14K081P03
704B134k655j763j047O63J909P42J66j877k801J872L444J778M66j920p30M25p54
721E2K005J135j845j563k262J29J990J333O61k617k862N96J694J029N38l96r88
738a371r35K62L421K049k54j089k275j3K086J215J121j895l184L0N63J049J553
$$ plain form
621 1801 -3104 -6905 -7121 -3207 -1432 -1385 -2171 -4366 -4276 -1620 364 2769 1892 -1423 -2281 -2022 1084
638 1084 4308 3957 2751 1011 -35 2430 3523 3068 1948 -2131 -4581 -4478 -2941 -214 -977 -3304
654 -3304 -3888 -3898 -2075 379 717 952 -1055 -3748 -2274 600 3365 4712 1873 -198 358 2761 5727
671 5727 4141 1360 -341 -2634 -2336 -51 1189 1133 -2275 -4946 -3700 -1983 801 1498 -1815 -3388
687 -3388 -3071 -201 2974 3483 2867 2067 -197 510 3435 4464 3533 3 -2074 -1064 -650 1431 2134
704 2134 -521 -2284 -3331 -2668 -759 -17 149 -1728 -4529 -2657 787 2565 3031 1111 381 806 52
721 52 2057 3192 1347 -216 -2478 -2349 -359 974 1635 -982 -3844 -3248 -1554 -525 13 -383 -1371
738 -1371 -2306 -2044 1377 3426 3172 2083 -192 -205 1881 3096 4217 2322 -862 -832 -269 780 2333
755B333j479k694k511m96L173J484r30k27j486L07K366K149J783r84k176j32M0
772E20J767K128j330j692j761n09K335L46q57j192k872j404K01P39J638n15j122
789c580m48L45K737K730M63n64j110n44J437J189J613J4k602r09K58R66J807j081
807B721k539j988j589R82J262K34k57j928j107J461J867K239M02j833r44O26J926
824A535K420L16j333p15j586J317J509j62n68k731k335O78K44J155R2k234r68
841c366p69Q74K366j31j89o50j563J626K174J612N52j654m37N92K87J480L69j944
859A229j063k009N79J665K11m52j502k129O21J169J199K67j280l79j62N94K652
876A210J655q56o00j270N29J700P23J05j903k076K34L90J259P42j184j663j131
$$ plain form
755 2333 854 -1840 -4351 -4847 -1674 -190 -1120 -1347 -2833 -2526 -160 1989 3772 2788 612 480 520
772 520 2287 4415 3085 1393 -368 -877 1458 1804 947 -245 -3117 -4521 -4320 -3581 -1943 -2458 -3580
789 -3580 -4028 -3683 -946 1784 2247 1683 573 29 1466 2655 4268 4282 1680 771 1029 1995 3802 2721
807 2721 182 -1806 -3395 -2413 -1151 -917 -1174 -3102 -4209 -2748 -881 1358 1760 -73 -1017 -391 1535
824 1535 3955 4271 2938 2223 637 1954 3463 3301 2733 2 -2333 -1655 -1411 -256 -164 -2398 -3366
841 -3366 -4135 -3261 -895 -1026 -1215 -1865 -3428 -1802 372 1984 2536 882 445 1037 1324 2804 3173 1229
859 1229 166 -1843 -1264 401 612 160 -1342 -3471 -2850 -1681 -482 -215 -1495 -1874 -2036 -1442 1210
876 1210 2865 2009 1409 139 668 2368 3091 3196 1293 -783 -549 -159 1100 1842 658 -1005 -2136
893b136k9J904P08p97n49j483J055J688J190J467q57j433R5J19J170Q83j110j338
911E47j818M25J552L08n35r30j894j50M12N63J239o18j891K80L24J957J921N5
929A747p07r84j67J877K69O3m09k289j001L70P29J246j058j766o61p96J345J054
947a138q2J62j499o02K158J281J371J41j349J51J41J782J688j033p36p10j107
964F19M99O58j75o25k677r65J195R2J011k9j397o07JJ850J635p20L49l40r96Q37
984B15J710J303k90j582J44L57k01J145k86k258j717o51N04N78o79K91q78j783
1002d078R52J924N50k19p48M7K93l9K486R87q64k95n10R39Q03J54O29k117k184
1021a290N91O30k18l72p11o66j248J73K376L59q16J37n69L85J061J454J386j663
$$ plain form
893 -2136 -2165 -261 447 -350 -899 -2382 -1327 361 1551 3018 2161 728 823 942 2112 2995 1885 547
911 547 -1271 -846 706 1014 479 -451 -2345 -2495 -2083 -1520 -281 -899 -2790 -2510 -2186 -229 1692 1747
929 1747 1040 56 -111 1766 2035 2098 1689 -600 -1601 -1231 -502 744 -314 -2080 -2741 -3537 -2192 -1138
947 -1138 -1220 -1058 -2557 -3159 -1001 280 1651 1792 443 594 735 2517 4205 3172 2436 1726 619
964 619 1118 1776 1601 976 -1701 -2666 -1471 -1379 -368 -397 -1794 -2401 -2400 -550 1085 365 714 374 -622 215
984 215 1925 3228 2938 1356 1500 1857 1656 2801 2515 257 -1460 -2111 -1607 -1029 -1708 -1417 -2295 -4078
1002 -4078 -3126 -1202 -652 -871 -1619 -1572 -1279 -1318 1168 2155 1291 996 486 1425 2228 2382 3011 894 -1290
1021 -1290 -699 -69 -287 -659 -1370 -2036 -3284 -3111 -735 -376 -1192 -1055 -1624 -1239 -178 1276 2662 999
1039I99j105J559M37M03N29o30j206j172O3J432m69q36l80j074k71M87Q50O47
1057B63j495l10N87k7J360J240l80n65j122R23J247k28K27l92j481o05R30N49
1075G21L38j287p62m03q15Q71J506o41r11p22N74J161M01R99j78j211L44M50O81
1094A116J033p06q93o06o82J024N89j81m75j714n38J220n8L48m44p50K68K5J101
1113c23J444m92j69J8M6R10M04N85j98j697l07J052k37M50n96j254r82o27J028
1132i45N52j005Q3o51k53P28R99J019lj087N79N64R1J433L56r48n92m76J099N55
1152B098j188K42o82j888P6O20J49p43j079K28k42j64J678R00q99n70L24J179
1170C9O09N79J243j070j238J211J012J00o67p74l4j333n82J397o0j257j129PJ59
$$ plain form
1039 999 -106 1453 1890 2293 2822 2192 986 -186 -123 1309 840 4 -376 -1450 -1721 -1234 -384 263
1057 263 -1232 -1542 -955 -982 378 1618 1238 673 -449 474 1721 1493 1720 1328 -153 -758 172 721
1075 721 1059 -228 -990 -1393 -2208 -1337 169 -472 -1383 -2105 -1531 -370 31 1030 852 -359 -15 435 1116
1094 1116 2149 1443 550 -56 -738 286 875 694 219 -1495 -2033 -813 -871 -523 -967 -1717 -1449 -1424 -323
1113 -323 1121 629 460 478 524 1434 1838 2423 2225 528 221 1273 1036 1486 890 -364 -1346 -1973 -945
1132 -945 -393 -1398 -1315 -1966 -2219 -1491 -492 527 524 -563 16 580 671 2104 2460 1512 920 444 1543 2098
1152 2098 910 1152 470 -1418 -1342 -722 -573 -1316 -2395 -2167 -2409 -2573 -895 5 -894 -1464 -1140 39
1170 39 648 1227 2470 1400 162 1373 2385 2485 1818 1044 1010 -323 -905 492 432 -825 -1954 -1947 -1788
1189a788J53L24R15r46j106J284J073K52N28J90J37q68R27J507n69l07k11l89
1207A106n77m87O19O21j735q62O2m39L52P49m17m62j069P34J562k85M60N27k85
1226A74JR6J072J031j221m69k14k19M80M07k28j123j230K53J008n22J80k05q04
1245a533m54O86J328N33o90M8j11K0J007O65o7m05p03Q9K53J58M82m95j342j24
1265f55o1N50K47q31m9m05m05P17Q33K18M10j003L87K90M26R23l36o82j99K1N61
1286I57l4n14k00p82r14P18J0O1j23j050j10L81M99R47J67m11j65J61J175N01
1306A274j89N95n82n29L21M06J17l94q10j66l61j08N23n82m04r20l91J091N69
1325e40l5K30m74K15M67O36R42K6m95O20l42J26R79k61n97p87o06Q7k27r3j00
$$ plain form
1189 -1788 -1635 -1311 -396 -1342 -2448 -1164 -91 161 689 879 1016 148 1075 2582 2013 1706 1495 1106
1207 1106 529 42 661 1282 -453 -1315 -1253 -1692 -1340 -591 -1008 -1470 -2539 -1805 -243 -528 -68 459 174
1226 174 175 271 1343 2374 1153 684 470 251 731 1138 910 -213 -1443 -1190 -182 -704 -524 -729 -1533
1245 -1533 -1987 -1301 27 560 -130 -82 -193 -173 834 1499 1432 1027 324 413 666 824 1306 811 -531 -655
1265 -655 -716 -166 81 -750 -799 -1204 -1609 -892 -59 159 569 -434 -47 243 669 1592 1256 574 375 396 957
1286 957 923 409 209 -573 -1487 -769 -759 -698 -821 -1871 -1981 -1600 -1101 -154 13 -398 -563 -402 773 1274
1306 1274 1085 1680 1098 569 890 1296 1413 1019 209 43 -318 -426 97 -485 -889 -1809 -2200 -1109 -540
1325 -540 -575 -345 -819 -604 -137 499 1441 1467 972 1592 1250 1376 2355 2094 1497 710 104 191 -36 -129 -229
1346b29j092l28J08K26O63k79k88o8l6M81J182K75n9j5k25R95n8O07K87r40q57
1367C50J70k8J65k39o57p54r68L61N53k33l5l08l73J65N62O92N92m14K52J10L16
1388B79P90L69l2k14o34M54K51l1l20o90o20J3m20O04o3p29k30m69L49R43J18
1409b82K83J85q99P90N50P01L94k98m03m15K4P81J17o29n04k96n23O26o09L20
1429h7l46r24R5K13L76N87q8m70L5K56J020m5qj6m47O0L38J76k6l94j056K97K53
1452b01l67L98m24o09J12n03Q96N25k94K43m32l3R57L32Q31p74k61J37k54M51
1472G30N60o16j13r20k10N69k17q5o6q42n3M78q5P77j31l69N1J16O74Q01J0l30
1494G29J36j19M63L34j16j69q80k70q9n8J69m61o78m96l87P29O65k38k7j70j39
$$ plain form
1346 -229 -1321 -1649 -1541 -1315 -652 -931 -1219 -1287 -1323 -842 340 615 556 541 316 1311 1253 1860 2147 1207 350
1367 350 520 492 657 418 -239 -993 -1961 -1600 -1047 -1280 -1315 -1623 -1996 -1831 -1269 -577 15 -399 -147 -37 279
1388 279 1069 1438 1406 1192 558 1012 1263 1232 912 222 -398 -385 -805 -201 -264 -993 -1223 -1692 -1343 -400 -282
1409 -282 1 186 -713 77 627 1328 1722 1424 1021 606 630 1411 1528 899 395 99 -424 202 -407 -87
1429 -87 -433 -1357 -1262 -1049 -673 -86 -174 -644 -609 -353 667 622 614 598 151 211 549 725 699 305 -751 -454 -201
1452 -201 -568 -170 -594 -1203 -1091 -1594 -698 -173 -467 -224 -656 -689 268 600 1431 657 396 533 279 730
1472 730 1290 674 561 -359 -569 0 -217 -302 -368 -1210 -1263 -785 -870 -93 -224 -593 -542 -426 248 1049 1059 729
1494 729 865 746 1209 1543 1427 1258 378 108 19 -39 130 -331 -1009 -1505 -1892 -1163 -498 -736 -763 -933 -1072
1515a072O56K61P31J49n8l47N87P5P48j87n09k78o32K70K43o42k10o26m26l29
1535a596L34K42n1n11N1k17P24N54M84J6Nm5O82N60K29O7m85M3k06j00M34j98
1557A016r13k71m94J99O8L0m27m43j43M04J74M38K61j37n3J54M92O99L21n12K30
1578A093k72R3L08l75J96m03r89J37J66o9r5n97n36J71j61O17L66l51l2k84M70
1599e47P72J81K80j93n68O29q9N73j81n20r9m45j7N22qo70j06m74P7M77j0M51
1621C5o53k49O93L46P8K65M1L9l99o1N94N4n5l01n71q6L04J1M71q06m06P1j89
1644g74N93M5Q6j81o20N89L62K14L14N3o53K76J25L76L60m90l11Qo56K52J95l23
1666a60k98n91K1L16J53M49l01m46K17N5M49O61j50K6k50k33R70L26j2l78k41
$$ plain form
1515 -1072 -416 -155 576 725 667 320 907 982 1730 1543 1034 756 124 394 637 -5 -215 -841 -1267 -1596
1535 -1596 -1262 -1020 -1071 -1582 -1531 -1748 -1024 -470 14 30 35 -10 672 1232 1461 1528 1043 1086 880 780 1214 1016
1557 1016 103 -168 -662 -463 -395 -365 -792 -1235 -1378 -974 -800 -362 -101 -238 -291 -137 355 1054 1375 863 1093
1578 1093 821 914 1222 847 1043 640 -349 -212 -46 -115 -210 -807 -1343 -1172 -1333 -716 -350 -701 -733 -1017 -547
1599 -547 225 406 686 493 -75 554 465 1038 857 337 238 -207 -224 298 290 -380 -486 -960 -883 -406 -416 35
1621 35 -618 -867 -174 172 250 515 556 595 196 135 729 783 728 427 -144 -230 74 85 556 -250 -656 -585 -774
1644 -774 -181 -136 -50 -231 -851 -262 100 314 628 681 28 304 429 805 1165 675 364 372 -284 -32 163 -160
1666 -160 -458 -1049 -1028 -712 -559 -110 -411 -857 -640 -585 -136 525 375 401 151 -82 888 1214 1202 824 583
1687E83o0j45J39K6o24q60K63j19k87K72j00j49j04n8M91P06K20q1K06k20N37
1708F36K44K92j41l39K53o04L88K73l14k81q08j36M9J0j64K95p64n0J04K92N17
1729b48j87P7K29k13L73P51j90L23k70k32o6K92J99j02o00p2k10N8J00k49m84
1750g21l26k14J33L21K21K27p12J83L44L97L82M28p45M22k2K44L78QJ03m86k82
1771B83O3j33K94j86o35j30l35J25O77m02j53k3L9L88J01K79M9J23m34L77l2N22
1793H57J66n88Q4q7l17M38k03l31k45m64l2L72p7j98J10j21kq8M87L96l25j9k
1816a89J12K60N32l61L9n32J64L48k33K40o16k91r6j75L20L38l42P4j59R9M09
1837e9L08n3j34J54o2L42N0L62l13l29J6j07L49Rj46p3p72k8K71j38lJ36n57P8
$$ plain form
1687 583 523 378 517 543 -81 -941 -678 -797 -1084 -812 -912 -1061 -1165 -1223 -732 -26 194 113 319 99 636
1708 636 880 1172 1031 692 945 341 729 1002 688 407 -401 -537 -488 -478 -642 -347 -1111 -1161 -1057 -765 -248
1729 -248 -435 -358 -129 -342 31 782 592 915 645 413 347 639 838 736 136 64 -146 -88 12 -237 -721
1750 -721 -1047 -1261 -1128 -807 -586 -359 -1071 -888 -544 -147 235 663 -82 340 318 562 940 948 1051 565 283
1771 283 346 213 507 321 -314 -444 -779 -654 23 -379 -532 -555 -516 -128 -27 252 301 424 -10 367 335 857
1793 857 1023 435 519 432 115 553 350 19 -226 -690 -722 -350 -427 -625 -515 -636 -638 -726 -239 157 -168 -187 -189
1816 -189 -77 183 715 354 393 -139 25 373 140 380 -236 -527 -623 -798 -478 -140 -482 -408 -567 -468 -59
1837 -59 249 196 62 216 154 496 546 908 595 266 282 175 524 533 387 314 -458 -486 -215 -353 -356 -220 -777 -699
1861f99K23j8P40j97k44K90k11O59K37k99L95k80k97K92P7n0p0l13k96l26J93
1882a94M54n17n95K06n24N09J68J31j11QOL62K36O70m9m28J12j3O4L70k48j49
1904D68l57l03L9J67j71N2o17l29K93j28J95J52l91K51o5L71N36J42j80J85J77
1925D87M20K9Q3K75n86j96K2q7Q9J67m21n06j30k73R8J32N0m93M1L78R6J07M52
1948B34k76M6j72K18O35O3q5j87l4k69N83l29J81n25n75L66k97M35j44o14M9J25
1970e72p7N26J05M9k31JR6L17P5J54pr3k30K01J17O0k89k27K9l61L46P0j19j2
1994g2o21J38J19J31L30m0l16L04j22L34J98j7J14k76o2J72K43k12j22n70J53
2015a94k47K02L55J8n84p4j91O97j35j14K20n43K13O34M0L75J21m48J07n3K72
$$ plain form
1861 -699 -476 -494 246 49 -195 95 -116 543 780 481 876 596 299 591 668 618 548 235 -61 -387 -194
1882 -194 260 -257 -852 -646 -1170 -661 -493 -362 -473 -465 -459 -97 139 809 760 332 444 431 495 865 617 468
1904 468 111 -192 -153 14 -157 -105 -722 -1051 -758 -886 -691 -539 -930 -679 -744 -373 163 305 125 310 487
1925 487 907 936 1019 1294 708 512 534 447 536 703 282 -224 -354 -627 -529 -397 -347 -840 -799 -421 -325 -218 234
1948 234 -42 4 -168 50 685 748 663 476 442 173 756 427 608 83 -492 -126 -423 12 -132 -746 -697 -572
1970 -572 -649 -123 -18 31 -200 -199 -103 214 289 443 436 343 113 314 431 491 202 -25 4 -357 -11 59 -60 -72
1994 -72 -693 -555 -436 -305 25 -15 -331 -27 -149 185 383 366 480 204 142 314 557 345 223 -347 -194
2015 -194 -441 -239 116 134 -450 -524 -715 -18 -153 -267 -47 -590 -377 257 297 672 793 345 452 399 671
2036F71P2m92n1m15l12M79k90J77P4n27k09L14k35O56k81J20M8p9K07N46J11m24
2058A60K01K52N3M1J7pp21P2P2k64J90O5m89j84m97J17N91j60nj21M9K92J8M50
2082A92K67l18L32mK09J92j02J19j74n70N15k50J05K6m77o99N3P6K44j79o70j02
2104a215L33R3L75J52K52J30l81O07J39K32K29l64k19K32JP2M5o66L9j39j23j3
2126a89k63l38k69%L88j6J19M77m51R3M32k32P92m6J07L7l31L68K24k89Q2l04
2148C91k81N4q8j9J37n52k52L5j29L32K53k43K25l87J92M99l0K99j64l15L10Q6
2170C53K88L17p17j62k37J28n0K04l07O5m97L9Q0J13K72l31j23J18J80K68J15
2191A16q0k6j02K3M01J02J63Q1q81L06J98j88J28k15m64j62L0K60J55k26R8m04
$$ plain form
2036 671 743 251 200 -215 -527 -48 -338 -161 -87 -614 -823 -509 -744 -88 -369 -249 -201 -280 -73 473 584 160
2058 160 361 613 666 707 724 717 -4 68 140 -124 66 131 -358 -542 -1039 -922 -331 -491 -496 -617 -568 -276 -258 192
2082 192 459 141 473 469 678 870 768 887 713 143 658 408 513 539 62 -637 -584 -508 -264 -443 -1113 -1215
2104 -1215 -882 -789 -414 -262 -10 120 -261 346 485 717 946 582 363 595 596 668 713 47 86 -53 -176 -189
2126 -189 -452 -790 -1059 -1059 -671 -687 -568 -91 -542 -449 -17 -249 543 497 604 641 310 678 902 613 695 391
2148 391 110 164 76 57 194 -358 -610 -575 -704 -372 -119 -362 -137 -524 -332 167 137 436 272 -43 267 353
2170 353 641 958 241 79 -158 -30 -80 124 -183 -118 -615 -576 -496 -383 -111 -442 -565 -447 -267 1 116
2191 116 36 10 -92 -69 332 434 597 678 -203 103 301 113 241 26 -438 -600 -570 -310 -155 -381 -283 -687
2213f87K88j01K79N28l4l52P8M84J60P8m1l09j21l24M19R2k10l61m36J33p6q5
2235e98R9p2n8QL9J97L35L23j48J98RK55L33l7o5l18l49J38K1k21K88p06L04j58
2259a83l77J62m05L27n06J84J25K85L21K46m97K13M46j11P61l50j09J70m78J07
2279C31J11j38o8k21n27R7L51jj22m52j26J65M6K90n0j42M34k57K21M11K19N4
2301F26m7j35J32K20m2R9k93m25L8q7K91k44k96j15m99K51K71j17J13k01l23L12
2323d71J27L95J26p1K06l8j02N33O7l4j76n72nJ0k2L2l42j20J5k58K78O6P9n5
2347c32j75R7L90L43jom8R1M3Q3K67n0l13l02k00L31J28k40m4p66N06j76L15J02
2371D3k00l22Q9K4M06Q9N0r1O9K6K68L85k82l6j75k45K1J37k31Q9m67k6N8%K05
$$ plain form
2213 -687 -399 -500 -221 307 273 -79 -1 483 643 721 680 371 250 -74 345 437 227 -134 -570 -437 -513 -598
2235 -598 -499 -571 -629 -621 -582 -385 -50 273 125 323 332 587 920 883 818 500 151 289 310 89 377 -329 -25 -183
2259 -183 -560 -398 -803 -476 -982 -798 -673 -388 -67 179 -318 -105 341 230 991 641 532 702 224 331
2279 331 442 304 236 15 -512 -415 -64 -65 -187 -639 -765 -600 -554 -264 -314 -456 -22 -279 -58 353 572 626
2301 626 579 444 576 796 754 853 560 135 173 86 377 133 -163 -278 -777 -526 -255 -372 -259 -460 -783 -471
2323 -471 -344 51 177 106 312 274 172 705 772 738 562 -10 -15 -5 -27 5 -337 -457 -442 -700 -422 -356 -277 -332
2347 -332 -507 -410 -20 323 322 316 268 359 402 485 752 702 389 87 -113 218 346 106 62 -704 -198 -374 -59 43
2371 43 -157 -479 -390 -366 40 129 179 88 157 183 451 836 554 518 343 98 119 256 25 114 -353 -379 -321 -321 -116
2396a16j28Q2m01J36J36M72J17q3k17J62N8J89K63q0k38j68l35K42K15k30k22
2417a46k43j38J69m6J51j61k50j76J05K62K79J07J60n0N8J85L27J05J53j89k38
2438D24j06K02m2ql74l78LJOj93L8j66j70J95L23K27J33l74j13N68l9M95m6j16
2462D90J8j28J26N0P8l33n1j95j37J05N9j52l77k84L1O7M7L5K57k1j02J90N04
2485B77o5N1k0k14K75J91K50M0k99j09l08p5J26Kj76m30P8j58L03q0O1r9j26J32
2509c73q3N68K8k79K04J39k37M18M43j71j16k47J15k4l36K13k62j74j84R8oJ01
2531a65j35l2J32k98L57K76j89P6p3O1J9L28J57j18k07j14J61n4J33m2k94k60
2553b81q2K69K48j00j62k94j60L36N1M09k19P9j97Q6K11K55K2J03m16j0J67j91
$$ plain form
2396 -116 -244 -162 -563 -427 -291 181 298 215 -2 160 218 407 670 590 352 184 -151 91 306 76 -146
2417 -146 -389 -527 -358 -404 -253 -414 -664 -840 -735 -473 -194 -87 73 23 81 266 593 698 851 662 424
2438 424 318 520 478 470 96 -282 -279 -278 -272 -465 -427 -593 -763 -568 -245 -18 115 -259 -372 196 157 652 606 490
2462 490 508 380 506 556 634 301 250 55 -82 23 82 -70 -447 -731 -700 -633 -586 -551 -294 -315 -417 -227 277
2485 277 212 263 243 29 304 495 745 785 486 377 69 -6 120 122 -54 -484 -406 -564 -261 -341 -280 -379 -505 -373
2509 -373 -456 112 140 -139 65 204 -33 385 828 657 541 294 409 385 49 262 0 -174 -358 -260 -266 -165
2531 -165 -300 -332 -200 -498 -141 135 -54 22 -51 10 29 357 514 396 189 75 236 182 315 273 -21 -281
2553 -281 -363 -94 154 54 -108 -402 -562 -226 -175 234 15 94 -103 -17 194 449 471 574 158 148 315 124
2575A24K70l19l16nq0m4J99j22o4P9l79M62L22J23k92j5J29R1L1L73Ql93l1l5
2599A16j22O99n15kj01j99K26k14K18k0l61k21j08r2N60j73J17j39LM33L96n9
2621D42L0k77L5J40j13J17K35m55J27k50J70q1j9q3l62k00nj4K04k8j02%o5M57
2645i7N92q8l74K70q3J30N04j11l36nl06J01j22K85q7l34j27l85K11L7r4q5J79
2668c25j18N7N69j97J66L6j90J74K89j5J58m8k90j9ML4m7l2o1m00j33K78q4L0
2692a64m38R8J92J69k5R2K23k06j79n3M13J74Lk5k06Q2n7j02J56K6k81P4l44N71
2716A93K7k22k49J0j99M73j77rl14L47J4L52M7K1K2l67K51p2q0L13j23j71j11
2739b4j85o3L32L7p8l13j96L84k07K64L6M2j10l3K80L94n0r9k13k79K49O6J49
$$ plain form
2575 124 394 75 -241 -246 -326 -370 -171 -293 -357 -278 -657 -195 127 250 -42 -57 72 163 194 567 575 182 151 116
2599 116 -6 693 178 176 75 -124 102 -112 106 86 -275 -496 -604 -696 -136 -309 -192 -331 -328 105 501 442
2621 442 472 195 230 370 257 374 609 154 281 31 201 120 101 18 -344 -544 -549 -563 -359 -387 -489 -489 -554 -97
2645 -97 495 407 33 303 220 350 854 743 407 402 96 197 75 360 273 -61 -188 -573 -362 -325 -419 -504 -325
2668 -325 -443 -386 183 -14 152 188 -2 172 461 446 604 556 266 247 251 285 238 206 145 -255 -388 -110 -194 -164
2692 -164 -602 -504 -312 -143 -168 -76 147 -59 -238 -291 122 296 299 274 68 150 93 -9 147 173 -108 -34 -378 193
2716 193 220 -2 -251 -241 -440 33 -144 -153 -467 -120 -106 246 293 314 336 -31 220 148 68 381 258 87 -24
2739 -24 -209 -272 60 97 19 -294 -490 -106 -313 -49 -13 29 -81 -114 166 560 510 411 198 -81 168 234 383
2762C83k81l8j58q8q2M22k88k86Mk02J69L37m9Rr2m8M05j93K54L69k75p9j74J96
2786B15K18Q5k29n2l44o9K79m60K06k54m03K18J97J60j4j54j0K04j7M57m5K8J09
2809C25k86J79J51L49j1m40J96k75J2l9k88m4J2m68K30J85P7J07m83Q0J39q0N01
2832A29J57l59O3J64J28J05K58k65P0k91J21J05j4M4O6n77k49N5L3J9j44q5M9
2855d18j70M30J35k21J06r7K31N4J17M48k77J44N8j19K73k26j43k89n4O2j24j51
2877b31P1J0l07J8R3j9J86N4m21L44j56J92O51m17K51k96J36K82j36J03j17r5
2899A96O4k74K34l5k49k66J04j96N1M66k29J9q6j89K02l5O28k90KqJ23k00L50
2922C82M7j21m18j78K13O8j05k05L17n51J50K07K47P2j67k58l8K51J38K31O4k68
$$ plain form
2762 383 102 64 -94 -182 -264 158 -130 -416 -412 -614 -445 -108 -157 -148 -240 -288 117 -76 178 547 272 193 19 215
2786 215 433 518 289 237 -107 -176 103 -357 -151 -405 -808 -590 -393 -233 -247 -401 -411 -207 -224 233 188 216 325
2809 325 39 218 369 718 707 267 463 188 200 161 -127 -171 -159 -627 -397 -212 -135 -28 -511 -431 -292 -372 129
2832 129 286 -73 -10 154 282 387 645 380 450 159 280 385 371 415 481 -96 -345 -290 -257 -238 -382 -467 -418
2855 -418 -588 -158 -23 -244 -138 -235 -4 50 167 615 338 482 540 421 694 468 325 36 -18 44 -80 -231
2877 -231 -160 -150 -457 -439 -346 -365 -179 -125 -546 -202 -358 -166 485 68 319 23 159 441 305 408 291 196
2899 196 260 -14 220 185 -64 -330 -226 -422 -371 95 -134 -115 -201 -390 -188 -223 405 115 117 109 232 32 382
2922 382 429 308 -110 -288 -75 -7 -112 -317 0 -551 -401 -194 53 125 -42 -300 -338 -87 51 282 346 78
2944G8J01q3q0M01M7l27l81O7q5J74J54l06l1k69K08K18k63j01K46%L7M19Q0j07
2968A97j20P5l9k2M14K10l12j67R9l37J79O5l03k00K0m9k39M49k49K29k35l8L4
2991c39K99L0j62K94o9J6K04R8J07j80j8j9N2J5j67P8m67K84l08j6N5N0m19l0
3015f12K14l7J00K35k24R5Q1J26J65L45K9J54m51p9K74N3m2j17n48J95J42k29
3037a31m1k34JJ4p6J33J78k34K33j81N8M91P1j97K47k52L24k53J30J46k94J26
3059B59j63j71K67J53m44k2k98R4P8J24P1k89r3J3R0K34J01J19j34J68n3n3J44
3082A95J45p0k9l29L80k35O6K4k71p3j33J96M7l70K36j15j47L20J38K33o6K00
3104C42l27l4J83L28l71J94j1j28k21K52m1P5m91K4j25L51l1J7k47J31J31l37
$$ plain form
2944 78 179 96 16 417 464 137 -244 -177 -262 -88 66 -240 -271 -540 -332 -114 -377 -478 -232 -232 -195 224 304 197
2968 197 77 152 113 91 505 715 403 236 335 -2 177 242 -61 -261 -241 -290 -529 -80 -329 -100 -335 -373 -339
2991 -339 -40 -10 -172 122 53 69 273 371 478 298 280 261 313 328 161 239 -228 56 -252 -268 -213 -163 -582 -612
3015 -612 -398 -435 -335 -100 -324 -229 -148 -22 143 488 517 671 220 141 415 468 426 309 -239 -44 98 -131
3037 -131 -172 -406 -405 -391 -467 -334 -156 -390 -157 -338 -280 211 282 85 332 80 404 151 281 427 133 259
3059 259 96 -75 192 345 -99 -121 -419 -325 -247 -123 -52 -341 -434 -421 -331 -97 4 123 -11 157 104 51 195
3082 195 340 270 241 -88 292 57 123 147 -124 -197 -330 -134 -87 -457 -221 -336 -483 -163 -25 208 142 342
3104 342 15 -19 164 492 121 315 304 176 -45 207 166 241 -250 -226 -351 0 -31 -14 -261 -130 1 -336
3126c36M65N1j8m41L28R0k8L39J07l62j10K06j54Kl0k28r1j91J10l5o8k5Qk55
3150f66N27J09j05J84k06J28JJ85k1L92k56J90n07J82J88J77k19k98j51j11Q0
3171a97rR4m2l97K26J58J3J2o4L7j00M3K18K28L07k50l09M48J2Q6j65%n2k1l40
3196f4kJ19j19l20Q8j07%%J73O7j25R3PJ67K97m3J40j15J98r2j8K45k41n2j85
3221A11o9j2p6Kj67j8j40O3O4k00J31O8n8K71j03n5K51J7q1K40mR4J43k28K1m12
3247a47L78J5j90j78j40r9K1J64J83m09K13l48K88J23M67l02J92N0l65L82J7J40
3269D55j16j11Oj96O2J37J69l50P1m53J35M1K55l02R5l70L53R1M4%k16M2K92l3
3293A01KL62l61k4N1n0P9j60L93m56j94L42o35O21m66J51j55k23L44L29k30J71
$$ plain form
3126 -336 129 180 162 -279 49 139 111 450 557 195 85 291 137 139 109 -119 -210 -401 -291 -326 -394 -419 -411 -666
3150 -666 -139 -30 -135 49 -157 -29 -28 157 136 528 272 462 -45 137 325 502 283 -15 -166 -277 -197
3171 -197 -206 -112 -154 -551 -325 -167 -154 -142 -206 -169 -269 -226 -8 220 527 277 -32 416 428 514 349 349 297 276 -64
3196 -64 -66 53 -66 -386 -298 -405 -405 -405 -232 -165 -290 -197 -190 -23 274 231 371 256 454 362 344 589 348 296 111
3221 111 42 30 -46 -44 -211 -229 -369 -306 -242 -442 -311 -243 -301 -30 -133 -188 63 80 -1 239 235 329 472 244 265 -147
3247 -147 231 246 56 -122 -262 -361 -340 -176 7 -402 -189 -537 -249 -126 341 39 231 281 -84 298 315 455
3269 455 339 228 234 38 100 237 406 56 127 -326 -191 -150 105 -197 -102 -472 -119 -28 16 16 -200 -158 134 101
3293 101 103 465 104 80 131 81 160 0 393 -63 -257 85 -550 71 -395 -244 -399 -622 -278 51 -179 -8
3315hJ7m1MK75j40J4j64K5J49Q3R1J5k62k27N3k38L29l5p7j80J40j66J08J13m1
3340a63R7k24J78M0L86J6ON3j34J9N0r0M5r6j95l29L26k69L74k51k40K37j75K51
3364h8J09k00k52J22J64j36N66q3J85j00k0o9J84J29k53J50l05J29j58P1l13j03
3386b71M3j9l4J6k0m3j30lL99k5K11r1L32j39j20K04l15N45n6k02j42K80j90j91
3410C9J94k79p5nL9K9j76j05m1j02K17L2K45p2r9k1J31K57lJ12j65R0PR1J57l22
3436A75m3L2n64K91J41k49J61m45J80J82j48J70K01k88n1j8L85L72l12R8l71J90
3458H9RK13j86J34l93r3K78p7J75j38nk62p4J36J68k48L53J01n5L7j26k19M21
3481B38K4J03k77P7K92k11k17J66l03L22j99j35R9K3k63J8R4j67K44M8Nk08j55
$$ plain form
3315 -8 9 -32 -28 247 107 121 -43 -18 131 214 305 320 58 -169 -116 -354 -25 -60 -137 -317 -177 -343 -235 -122 -163
3340 -163 -66 -290 -112 -72 314 330 336 389 255 274 324 234 279 183 -12 -341 -15 -284 90 -161 -401 -164 -339 -88
3364 -88 21 -179 -431 -309 -145 -281 285 202 387 287 267 198 382 511 258 408 103 232 74 145 -168 -271
3386 -271 -228 -247 -281 -265 -285 -328 -458 -461 -62 -87 124 33 365 226 106 310 -5 540 484 282 140 420 230 39
3410 39 233 -46 -121 -126 -87 -58 -234 -339 -380 -482 -265 -233 12 -60 -159 -180 -49 208 205 317 152 242 249 340 497 175
3436 175 132 164 -400 -109 32 -217 -56 -501 -321 -139 -287 -117 84 -204 -255 -273 112 484 172 270 -101 89
3458 89 98 311 125 259 -134 -227 51 -26 149 11 6 -256 -330 -194 -26 -274 79 180 125 162 36 -183 238
3481 238 262 365 88 165 457 246 29 195 -108 214 15 -120 -21 2 -261 -243 -149 -316 -72 -24 -19 -227 -382
3504c82N01J11j47K37l21L88l33m7M64j79k60R7k55J33n5l85R5J78j25K01l2j18
3526b34R1j57K53j20K05J86J7Nj64L07j04j35K22k39k84J25Q1p1j96J15l42J31
3548c08J51M4q8j63O4J77j80K37l6J61J75j73J06l2q7M55j31j37J70k57J83j70
3570A61N3k58j86K09j47mj11J27j63j31P1K06M23l33q1L1J41J50mQ2k9Rj77J18
3594A57J66o6k67l13L02j58n9J60N5k93J47j90%NJ46L49j46l28K83J98k07L48
3616B89l01J84J56j80P5P0j93J28k12r8K53k59m4j29JJ46Q8o4J65l30P4L8J09
3639c4M61l11J94l4j66J57k04k60M94j23k02J19j91L4M1j48Q0l31K49o1K55K12
3661B31j75j63R8j40R4J78m3p4J40o1j15M38l09M6J08l70J9m2K27m12J60n2j10
$$ plain form
3504 -382 119 230 83 320 -1 387 54 7 471 292 32 129 -126 7 -48 -433 -338 -160 -285 -84 -116 -234
3526 -234 -143 -300 -47 -167 38 224 241 246 82 389 285 150 372 133 -151 -26 55 -16 -212 -97 -439 -308
3548 -308 -157 -113 -201 -364 -300 -123 -303 -66 -102 59 234 61 167 135 48 503 372 235 405 148 331 161
3570 161 214 -44 -230 -21 -168 -172 -283 -156 -319 -450 -379 -173 250 -83 -164 -133 8 158 154 236 207 216 39 157
3594 157 323 257 -10 -323 -21 -179 -238 -78 -23 -316 -169 -359 -359 -354 -208 141 -5 -333 -50 148 -59 289
3616 289 -12 172 328 148 223 293 100 228 16 -82 171 -88 -132 -261 -260 -114 -26 -90 75 -255 -181 -143 -34
3639 -34 427 116 310 276 110 267 63 -197 297 174 -28 91 -100 -66 -25 -173 -93 -424 -175 -236 19 231
3661 231 56 -107 -9 -149 -55 123 80 6 146 85 -30 408 99 145 253 -117 -98 -140 87 -325 -165 -217 -327
3684c27J71O4N6j34p7J03J09L49j22J08k40J08J42k66K43J73n45N1j03K96r2p2
3706eo9j63m1J72j68L69j93k61J15J15K25R9j09k81L6L50j82M61k30j45o9O7R9
3729A92J04m22R1r1k27L44j01k23l49K61L88n22P2L69O8J17k49J11L6m5L44l4
3751B34O5p3K09n8j62k57J89Nj88N4O4J3m10K4r3J40M5l2K47o0K2j39L18ll56
3776b02L36J41j14K00P7k37K4O0k06Qj24nj01o1J62j84Q0R2m32K22J82l52L58
3799g6J1J15K62m86K90K36k81J49m4R1j28P7q4r8k81L37j86l5m0k13J29M16j87
3822b6l03K79j00l4J90n5J37k09K46J48j64J58o8K2j9l68Q1R9J00l42K1j8k4M17
3846A68k11k1l4N6O9K5l3K1j12J07p8L15r8J19k75P3j62J58j23N4K5k14J31k07
$$ plain form
3684 -327 -156 -92 -36 -170 -247 -144 -35 314 192 300 60 168 310 44 287 460 -85 -34 -137 159 67 -5
3706 -5 -74 -237 -278 -106 -274 95 -98 -359 -244 -129 96 195 86 -195 -159 191 9 470 240 95 26 93 192
3729 192 296 -126 -35 -126 -353 -9 -110 -333 -682 -421 -33 -555 -483 -114 -46 71 -178 -67 -31 -76 268 234
3751 234 299 226 435 377 215 -42 147 152 -36 18 82 95 -315 -291 -384 -244 -199 -231 16 -44 -22 -161 157 154 -202
3776 -202 134 275 161 361 438 201 225 285 79 87 -37 -42 -143 -204 -42 -226 -146 -54 -486 -264 -82 -434 -76
3799 -76 -65 50 312 -174 116 352 71 220 176 267 139 216 132 34 -247 90 -96 -131 -171 -384 -255 161 -26
3822 -26 -329 -50 -150 -184 6 -49 88 -121 125 273 109 267 199 221 202 -166 -85 14 114 -228 -207 -225 -249 168
3846 168 -43 -64 -98 -42 27 52 19 40 -72 35 -43 272 174 293 18 91 -71 87 -36 18 43 -171 -40 -247
3870b47J76n2q0j88M09k83M20q3j41M6l16L66L12j28j64J37jj11P7M18j67k06
3892A94j38n5n3j08K24l64K32k55K45j60K38j09O7l6p8p5L49M8q6J82n2k31J81
3915A60K49m36K03l9L6j78O1l08J26Ll27J81J3K15J29l00n0K93j27J05J72P4k5
3938B30M7O2j75K59j14n8j38Q3J3k96mJ13m0k56o6l7K30q2J94p9Q5L0j44R6J42
3963I5q5J00n5J22L7J8K9K5k09MM4Jo3k21k01j13N02j54k65J0R0p8M46k48J71
3988Bj92J55N2J65n4N9K36j88Q3r3m7P2j56R1k53j25L60k06j6k63K04K13k80N1
4012a30M2k4K13J88n62L08K02L3j51l0J50m06K49K2o5K2m44K31J90q8k81K6J43
4035a62n5K24k96J83J15L8k31J34j86O89k83j04J36k67M82m31PJ79k56O7J23l57
$$ plain form
3870 -247 -71 -123 -203 -391 18 -265 155 72 -69 -23 -339 27 339 211 47 184 183 72 149 567 400 194
3892 194 56 1 -52 -160 64 -300 -68 -323 -78 -238 0 -109 -42 -78 -156 -231 118 166 80 262 210 -21 160
3915 160 409 -27 176 137 173 -5 56 -252 -126 -123 -450 -269 -256 -41 88 -212 -262 31 -96 9 181 255 230
3938 230 277 339 164 423 309 251 113 196 209 -87 -91 22 -18 -274 -340 -377 -147 -229 -35 -114 -29 1 -143 -47 95
3963 95 10 110 55 177 214 232 261 286 77 81 125 126 63 -158 -359 -472 30 -124 -389 -379 -289 -367 79 -169 2
3988 2 -190 -35 17 182 128 187 423 235 318 225 178 250 94 185 -68 -193 167 -39 -55 -318 -114 99 -181 -130
4012 -130 -88 -112 101 289 -273 35 237 270 119 89 239 -167 82 104 39 61 -383 -152 38 -50 -331 -305 -162
4035 -162 -217 7 -289 -106 9 47 -184 -50 -236 453 170 66 202 -65 417 -14 -7 172 -84 -17 106 -251
4057b51K46l6k3l23K61J94l71L70P5l0j56L7J41k2K8k9Ro4J21R4L1m66M20k19
4081C7J41k65M8J02k62n7P6j23M24m21J04K31m2j59J94P4j01J73K6L06k31Q8r1
4104B72r9J7q6l0m25M08l6j92M2J05l88L67l31M28k67J59k8l2L13q3RM1k39N23
4128D48j22k58j10N6K43k90K02k20J45k95J18l72Q7J94nL4k73J58L87j31J2J06
4150A14j0P9k23L42L8q5N1o1rk8J0j20r3N0J4K05o11J61L83k84m25L17K6p4M11
4175A78k34K70j12mL1J74k09k3J34N9q6k5l31J70k70K17kJ51l24K5KQ4L3L2j80
4200b40k1J83K05k29L0J94j46J19Q2O7j75J63j44K32j57l30j01K11k17K78k37
4221b33J70J60k21M4J2k93L22N7j07K55R3Jo1J00l35K81mj79k24M07l23J52j50
$$ plain form
4057 -251 -5 -41 -64 -387 -126 68 -303 67 142 112 -44 -7 134 112 140 111 120 56 177 271 302 -164 256 37
4081 37 178 -87 -39 63 -199 -256 -180 -303 121 -300 -196 35 -7 -166 28 102 1 174 200 506 275 363 272
4104 272 173 190 104 74 -351 57 21 -171 -129 -24 -412 -45 -376 52 -215 -56 -84 -116 197 114 123 164 -75 448
4128 448 326 68 -42 14 257 -33 169 -51 94 -201 -83 -455 -368 -174 -179 -145 -418 -260 127 -4 8 114
4150 114 104 183 -40 302 340 255 306 245 236 208 218 98 5 55 69 274 -337 -176 207 -77 -502 -185 -159 -233 178
4175 178 -56 214 102 98 129 303 94 71 205 264 178 153 -178 -8 -278 -61 -63 88 -236 -211 -209 -125 -92 -60 -240
4200 -240 -261 -78 127 -102 -72 122 -24 95 177 244 69 232 88 320 163 -167 -268 -57 -274 4 -233
4221 -233 -63 97 -124 -80 -68 -361 -39 18 -89 166 259 260 199 299 -36 245 241 62 -162 245 -78 74 -76
4244g6K00k44K73l72j78K03J41J53n67L70R3k64L61K74j70N8j33j47J56j21J34
4265A44j51l5k7J12j40K46l93J14j14L58m30J10K62k39j35k0K68L4J08j68J82
4286H6j7J29R3J11L4l38J89L0k26J81l73J80j89k42L56M2l91K82r7l8K56p9j27
4309a48J19K06J11j93k0L15k41J88k6J20m41R0Q2k72J41k54K15P0ok04k6Pj92
4332c59K86o3k0J4j28K97J70q1o1M0J71j13K9M8k6J22j83j44J64p6r4j6n2p0q5
4357b30J00o7J34j73J49L24m48J82K19k47J33K61P7l17m7J95P2j24j64R9L7j01
4379F4m7p0k33K50K0k1j14K59l02O8O4J11m0L1j2Nj9NJ09n8l0J2j39K54j71J13
4405A09m2m1k73p5K49j22P1q5N7J50l26M42K2n6J37p3K10o6K2r8Nj41n0n0J09
$$ plain form
4244 -76 124 -120 153 -219 -397 -194 -53 100 -467 -97 -4 -268 93 367 197 255 122 -25 131 10 144
4265 144 -7 -42 -69 43 -97 149 -244 -130 -244 114 -316 -206 56 -183 -318 -338 -70 -36 72 -96 86
4286 86 69 198 291 402 436 98 287 317 91 272 -101 79 -110 -352 4 46 -345 -63 -160 -198 58 -21 -148
4309 -148 -29 177 288 95 75 390 149 337 311 431 -10 80 162 -110 31 -223 -8 62 56 -148 -174 -167 -359
4332 -359 -73 -136 -156 -142 -270 27 197 116 55 95 266 153 182 230 204 326 143 -1 163 87 -7 -23 -75 -145 -230
4357 -230 -130 -197 -63 -236 -87 237 -211 -29 190 -57 76 337 414 97 50 245 317 193 29 128 165 64
4379 64 17 -53 -286 -36 -16 -37 -151 108 -194 -126 -62 49 9 40 28 33 14 19 128 70 40 52 -87 167 -4 109
4405 109 67 26 -247 -322 -73 -195 -124 -209 -152 -2 -328 114 136 80 217 144 354 288 310 212 217 76 26 -24 85
4430H5K8j49lk9l68N85l46K2K06K6j4k38J86J70k25J92J01N9l37K51J0k08K27
4453B31r5J62q1l92p7K52k2j96J87N6k61j02L42n3j44J93r3L31l27J41Q6k46L36
4476B28j18j01L80l94J18N68n77qk60N0m9j20J02K6K09l57J6P2J17j00L07j31
4498b2p8P8L8J90oK3j60K54j95J91q1l31j5o5J20O3k83K39j52J45jk68j12O00
4522A72k31K00m8k22J2J28J36l2J70O4k77P6Q8j16j15Pk45L2K88q7j67J27L6k00
4546b04J01K05k70q1L32j24N5P4j61J74l8N4O6R1k88K08n2j96pr7J42P2j35k2
4570a01J72j54m0j70K44j03j07L28R1O3l22L8J94p5n0J41o4K3Q6l56L86q2J4k06
4594e0k89K58m6r3j05J73n4K7Q9M5j14J14K75j15Q9k87J43N2j41J70j29M0r5J37
$$ plain form
4430 85 113 -36 -39 -68 -436 149 -197 -175 31 57 43 -195 -9 161 -64 128 229 288 -49 202 212 4 231
4453 231 136 298 217 -175 -252 0 -22 -218 -31 25 -236 -338 4 -49 -193 0 -93 238 -89 52 138 -108 228
4476 228 110 9 389 -5 113 681 104 96 -164 -114 -163 -283 -181 -155 54 -303 -287 -215 -98 -198 109 -22
4498 -22 -100 -22 16 206 200 223 63 317 122 313 232 -99 -114 -179 -59 4 -279 -40 -192 -47 -48 -316 -428 172
4522 172 -59 141 93 -129 -117 11 147 115 285 349 72 148 236 120 5 12 -233 -201 87 0 -167 -40 -4 -204
4546 -204 -103 102 -168 -249 83 -41 14 88 -73 101 63 117 183 274 -14 194 142 -54 -61 -158 -16 56 -79 -101
4570 -101 71 -83 -123 -293 -49 -152 -259 69 160 223 -99 -61 133 58 8 149 85 108 194 -162 224 142 156 -50
4594 -50 -339 -81 -127 -220 -325 -152 -206 -179 -90 -45 -159 -45 230 115 204 -83 60 112 -29 141 12 52 -43 94
4618I4J5j86k45J15L15m26J48K1k95K41R4J26J14k39K24J3Q0K14o4j47J7l7j08
4641H4Q6k2kk09j34O3J62m3n7j41K0J31j23O0J3n6J0J63L07j29L4k45K16J38p3
4666B53l05L43l84L39j93Q4m68K89r0jk52M0L0NQ3l9Q6R2J92k44J37j24K82P8
4690B33r2k2K47j58j28L29l16j70m3K77k92J51j54O1Q4j82J02n7l4L2M4k4q8K21
4714B1j32J09rO7l6P4m3j04K54q1j22o2k47K50rK73n02J63k2j22L9K12r6K10m73
4739c88L14OJ78j0J61J7Jj03j43J33k63K06j00M6Qj59j94L30k65J76Qj41J47k40
4763b75o0M77k04K31j83J56q5j92K17k33L76rk15r1J82J41j98m14K53k5P7J34
4785F0k30L30o0K6J10k90P3J50k01N0O0J15j63K95j06kJ37m8l69k4K03k31M0k10
$$ plain form
4618 94 109 -77 -322 -207 108 -318 -170 -149 -444 -203 -109 17 131 -108 116 129 209 423 359 212 229 192 84
4641 84 170 148 146 -63 -197 -134 28 -15 -72 -213 -193 -62 -185 -125 -112 -168 -158 5 312 183 217 -28 188 326 253
4666 253 -52 291 -93 246 53 137 -331 -42 -132 -133 -385 -345 -315 -310 -227 -266 -180 -88 104 -140 -3 -127 155 233
4690 233 141 119 366 208 80 409 93 -77 -120 157 -135 16 -138 -77 7 -175 -73 -130 -164 -132 -88 -112 -200 21
4714 21 -111 -2 -11 56 20 94 51 -53 201 120 -2 -64 -311 -61 -70 203 -299 -136 -158 -280 -241 -29 -125 85 -388
4739 -388 -74 -68 110 100 261 278 279 176 33 166 -97 109 9 55 63 -96 -290 40 -225 -49 -41 -182 -35 -275
4763 -275 -335 142 -62 169 -14 142 57 -135 82 -151 225 216 1 -90 92 233 35 -379 -126 -151 -74 60
4785 60 -170 160 100 126 236 -54 19 169 -32 18 78 193 30 325 219 217 354 306 -63 -87 116 -115 -75 -285
4809b85M8J78O8j74o4L55k38m7K57k44J50n5K5J29J01O3j32Q6j1j51J24j10j55
4832h2K09j99L5j12j9K4j73J17j46K79JK66l21K89k61K44q7j8K48k70K72J5j00
4855B11J66j14j44k9p9n2n8J0J8q7R4r2j2j42lK88j28J21j41N25j52j31J99j17
4879A51p7P4JP3J3k05o4l3J52m6J03j88OM3m0k0k6j57J57j40J11j31L38K9k23
4904i9M25j64q7J24N6j42J1j60l0J83O4j52M4k12J09j28n6K90l09J90m9j81M09
4927A36j87k73N51P4p2P3n55L09o8J86k6k55K14k63pK24j37L5N4j14n9K06k41
4950a95Q3K34k00R7K73m82K87oK06m8Kp4p5r3M0k03O2j57R2J93l7j33o8L7J55
4975a0L6k13m4L09j60J66j47P6J00j46R9Q4P6k7m7l12J25k8m0N6j59L78l91J08
$$ plain form
4809 -285 -237 -59 9 -165 -229 126 -112 -159 98 -146 4 -51 -26 103 204 267 135 221 210 59 183 73 -82
4832 -82 127 -72 -37 -149 -168 -144 -317 -200 -346 -67 -66 200 -121 168 -93 151 64 46 294 24 296 311 211
4855 211 377 263 119 90 11 -41 -99 -89 -71 -158 -64 -156 -168 -310 -313 -25 -153 -32 -173 352 200 69 268 151
4879 151 74 148 149 222 235 30 -34 -67 85 39 142 -46 -40 3 -37 -57 -83 -240 -83 -223 -112 -243 95 124 -99
4904 -99 326 162 75 199 255 113 124 -36 -66 117 181 29 73 -139 -30 -158 -214 76 -233 -43 -92 -273 136
4927 136 -51 -324 227 301 229 302 -253 56 -12 174 148 -107 107 -156 -163 61 -76 -41 13 -101 -160 46 -195
4950 -195 -112 122 -78 19 292 -190 97 91 297 249 251 177 102 9 49 -154 -92 -249 -157 36 -1 -134 -202 -165 -10
4975 -10 26 -187 -231 78 -82 84 -63 13 113 -33 66 150 226 199 152 -160 -35 -63 -103 -47 -206 172 -219 -111
4999a11j30J17M2r7J27J81J33M1j97r1K37j90L4o4R8O9l8j56J36m2j36J89j64
5022a2l2j9j70j51J56j10M5K99j85P3K13j97L65j46k7O1r4O5q2Q5j40nj18K10
5046H4K0p6J18k78NJ27q2j02j35J61J25J8l4P6L5j34j59M74N9o7J9J19k03R3p8
5071A85l39K80k19M9J65j60Rj86K79j86n9j07J55J52P4j84K70k29J62l5N3M9J24
5094C02Pj09J42k31l0Q3k40J91j85J74k23j49k8L75k56J39J04lk7J06l45K94j07
5117a6J16l8p4j23K17j85K6L17p7O3l34JJ67k2q1pk06J41n6J49n7J55j67k0j06
5142b17L7M37m80K55R3N1q7p3J32n4L0k1k48P7k82K53J8k3K8J16j27J47nr8J17
5167G6j03k0OJ59J73r0l6k03L5J13J12l03J14Q8p3j48M7k46K54J32l72L7P6m8
$$ plain form
4999 -111 -241 -124 -82 -179 -52 129 262 303 106 15 252 62 96 32 130 199 161 5 141 99 -37 152 -12
5022 -12 -44 -63 -233 -384 -228 -338 -293 6 -179 -106 107 -90 275 129 102 163 69 134 52 137 -3 -8 -126 84
5046 84 104 28 146 -132 -127 0 -82 -184 -319 -158 -33 -15 -49 27 62 -72 -231 243 302 235 254 373 170 263 185
5071 185 -154 126 -93 -44 121 -39 -30 -216 63 -123 -182 -289 -134 18 92 -92 178 -51 111 76 129 178 302
5094 302 309 200 342 111 81 164 -76 115 -70 104 -119 -268 -296 79 -177 -38 66 63 36 142 -203 91 -16
5117 -16 100 62 -12 -135 82 -103 -77 240 163 226 -108 -107 60 38 -43 -50 -256 -115 -171 -22 -79 76 -91 -111 -217
5142 -217 -180 257 -223 32 125 176 89 16 148 94 124 103 -145 -68 -350 -97 -79 -102 -74 42 -85 62 57 -41 76
5167 76 -27 -47 -41 118 291 201 165 -38 -3 110 222 -81 33 121 48 -100 -53 -299 -45 87 -285 -248 -172 -220
5191b20J91K19l50L87k04q7J75K1J53j52j28Q0J20o2l54K59M4l10M4J44j71K28
5213B7l55K89M7no3O4j89K05l58L94J62j57J64N6k22K54j94M5j90J09j86J80N4
5236A31j39Q7k17J98m3k50J32J33J3j22J11k16J21O3Q7j25j30K95J77j75j42R9
5258H8j15J26j48J59k00qJ9j13J02n2k05J77o6k61L57P2J56mp1J53r5J30k31J45
5282A15n9J05k93J98j5m8J34j3k67J62k45J02Q7j09J02k26M20m2j35j12J10l0
5304e9K95j56j33J89N0q8j70K38j66R5j51r2P3p2O3O9R6j63N8l51J58J40J22O7
5328A12j15K7q5K50N0j00j80J88j54K41j85j71K73P4k71m3M5k60L03p7n0j1K33
5351I4p0j43J35O8K79l27O2rj8J07J4K18n72J82NK12l06m7J8l8J72k37J17Q2k84
$$ plain form
5191 -220 -29 190 -160 227 23 -64 111 132 285 133 5 85 205 143 -211 48 92 -218 -174 -30 -201 27
5213 27 -328 -39 8 3 -60 4 -185 20 -338 56 218 61 225 281 59 313 119 164 -26 83 -103 77 131
5236 131 -8 79 -138 60 17 -233 -101 32 45 -77 34 -182 -61 2 89 -36 -166 129 306 131 -11 88
5258 88 -27 99 -49 110 -90 -98 -79 -192 -90 -142 -347 -170 -236 -497 -140 -68 88 84 13 166 71 201 -30 115
5282 115 56 161 -132 66 51 3 137 124 -143 19 -226 -124 -37 -146 -44 -270 150 108 -27 -139 -29 -59
5304 -59 236 80 -53 136 186 98 -72 166 0 95 -56 -148 -75 -147 -84 -15 81 -82 -24 -375 -217 -77 45 112
5328 112 -3 24 -61 189 239 139 -41 147 -7 234 49 -122 151 225 -46 -89 -44 -304 -1 -78 -128 -139 94
5351 94 24 -119 16 84 363 36 98 89 71 178 192 410 -162 20 25 237 -69 -116 -98 -136 36 -201 -84 -2 -286
5376b86K8M11j88j8O6L9j0q0K17j00j0O3mL8N8m05L06J34k76j27J55J44j56o9
5400g0m4k41J78L44l22Q4n0mm8J32J7Q3J07q1P8P3m61N16m40K37j08P0l8j33J48
5425B7k06J45j49J66o8q3n2K02P4j88L6J30j18J99l5k36L29J29j58J16j82r9k70
5448b91K64m5k2n6j04K29m52M09k29K38j34J35J32j50k9M4J82k12L20j35K7J59
5470B80k87K54r4j93K50k25J10j66Q8M6q4Q4p7l7k05K77j2k35L21N2j75M7j3r8
5494i2J40J46k23J51M1jj91J49m08L02q3j65K36k08k8M6K84k08k8J05L6P9M9J14
5518B43l19J09J29j98J24k27L02j40l28K95K0K14k45Q1Mj21j89J76N7l1l0J34
5540F0k59m5M51j11j07k3M6L51j22j72m1K30j5j05J51l69L2M2Q2m8j25Q5j20k9
$$ plain form
5376 -286 -258 153 -35 -53 13 52 42 -38 179 79 69 132 128 166 224 -181 125 259 -17 -144 11 155 -1 -70
5400 -70 -114 -355 -177 167 -155 -71 -121 -125 -173 -41 -24 59 166 85 163 236 -225 291 -149 88 -20 50 12 -121 27
5425 27 -179 -34 -183 -17 -85 -168 -220 -18 56 -132 -96 34 -84 115 80 -156 173 302 144 260 78 -21 -291
5448 -291 -27 -72 -94 -150 -254 -25 -477 -68 -297 -59 -193 -58 74 -76 -105 -61 121 -91 229 94 121 280
5470 280 -7 247 153 -40 210 -15 95 -71 17 63 -21 63 -14 -51 -256 21 9 -226 95 147 -28 19 6 -92
5494 -92 48 194 -29 122 163 162 -29 120 -288 14 -69 -234 2 -206 -234 -188 96 -112 -140 -35 1 80 129 243
5518 243 -76 33 162 -36 88 -139 163 23 -305 -10 10 224 -21 60 64 -57 -246 -70 -13 -44 -74 60
5540 60 -199 -244 207 96 -11 -34 12 363 241 69 28 258 243 138 289 -80 -48 -6 76 28 -97 -12 -132 -161
5564a61J95j89J9JK1L31k40k5Q6K83j86J01l9N3Q0j77R3L2j62r4P9m30J39J75
5588a5n6j96kp0K83n0K0r2P3n2j38M02j5Q7J09j95J58j67P8j55J34j60o9J09q8
5613f7P8r5j13k8L16k83l8J71L02m24L24l7j43J44k1j63L00j94K65L8j55o2j30
5636a5J81j22r0k4%q8rj55M33m13R2Q6o0K52Rj24J01n9J24n4J5J10P7l62L25j18
5662A12l9l9L9l20R2J81j04J2K4M1k73L49Q5N7k78K0J30N8q4K17j47j97J89K3
5686A48k76L03j25R6k63j41j54P10j28j29m7k79J88J4R4j00J68lK9k3q6K0K18
5709B34K24k22k88K03j60N8p9Q5l70K49k50K28p8m2l5L7J62j0k13K47lj7J78q8
5733E0q0O9j0j6K42j94N8j72K35k46O9j13J60K5R4n25L03R3j06j07Q6K64k1r1
$$ plain form
5564 -161 34 -155 -136 -135 -114 217 -23 -48 38 321 135 236 197 250 330 153 246 278 116 22 101 -329 -190 -15
5588 -15 -71 -267 -269 -339 -56 -106 -86 -178 -105 -157 -295 107 92 179 288 93 251 84 162 7 141 -19 -88 21 -67
5613 -67 11 -84 -197 -225 91 -192 -230 -59 243 -181 143 106 -37 107 86 -77 223 29 294 332 177 115 -15
5636 -15 166 44 -46 -70 -70 -158 -167 -322 111 -302 -210 -124 -184 68 77 -47 54 -5 119 65 80 190 267 -95 230 112
5662 112 73 34 73 -247 -155 26 -78 -66 -42 -1 -274 75 160 217 -61 -41 89 147 63 280 133 -64 125 148
5686 148 -128 175 50 146 -117 -258 -412 298 170 41 -6 -285 -97 -83 11 -89 79 76 105 82 -4 16 234
5709 234 458 236 -52 151 -9 49 -30 55 -315 -66 -316 -88 -166 -208 -243 -206 -44 -54 -267 -20 -23 -40 138 50
5733 50 -30 39 29 13 255 61 119 -53 182 -64 5 -108 52 77 171 -354 -51 42 -64 -171 -85 179 158 67
5757F7K3J03M2j23L2J20l86J11J22O0p4Rk5j26j41J29M6P8k90k60N88k86J79k82
5781b84K8K34j17N8J78K6l61J84M34p7k45q2P5j0j23L5J12J39m44K25k96R4K8
5804a89j41n9j00O73k94k8K65j26pl8J94k1Q1k05J04l7j1k9J69j96L1Q8j19K6
5828C1k2k11J74k76L58k85J07M37j89j97Q6J54l1j63J27J31r0l8N5P4r1n8J5j87
5852h9j10J38j36J14n8J22k85K13J32O5j90J49j59r7J23q4O81m12l01M54j09l49
5874a88K29KL6r8J55q3O9j14k52M50k96P6M0j1j36Q4J26p9j12J37K31K7m37N7
5898h7J59J58l03N4J6l78M75m2l70l2L14k08K45l9n7j26J38j28j49M51q4J53k0
5921A40O6j29k35L31k04R8l3P5j9J29j61Q2l32j6J69j7l86M63j31n5K27L8J65
$$ plain form
5757 67 90 193 235 112 144 264 -122 -11 111 171 97 106 81 -45 -186 -57 -11 67 -223 -483 105 -181 -2 -284
5781 -284 -256 -22 -139 -81 97 123 -238 -54 380 303 58 -24 51 41 -82 -47 65 204 -240 -15 -311 -217 -189
5804 -189 -330 -389 -489 184 -110 -138 127 1 -6 -44 150 129 210 5 109 72 61 32 201 5 36 124 5 31
5828 31 9 -202 -28 -304 54 -231 -124 313 124 -73 13 167 136 -27 100 231 141 103 158 232 141 83 98 -89
5852 -89 -199 -61 -197 -83 -141 -19 -304 -91 41 106 -84 65 -94 -191 -68 -152 529 117 -184 270 161 -188
5874 -188 41 43 79 -19 136 53 122 8 -244 206 -90 -14 26 15 -121 -37 89 10 -102 35 266 293 -144 -87
5898 -87 72 230 -73 -19 -3 -381 94 52 -318 -350 -36 -244 1 -38 -95 -221 -83 -211 -360 91 7 160 140
5921 140 206 77 -158 173 -31 67 34 109 90 219 58 140 -192 -208 -39 -56 -442 21 -110 -165 62 100 265
$$ [...]
8191d5
##END NTUPLES=NMR FID
##END=
