##TITLE=1H_Ser 6-3-V
 CDCl3
 8 sc, 
 9.11.2021
##JCAMPDX= 6.0         $$ Bruker NMR JCAMP-DX V2.0
##DATA TYPE= NMR FID
##DATA CLASS= NTUPLES
##ORIGIN= UXNMR, Bruker Analytische Messtechnik GmbH
##OWNER= root
$$ XWIN-NMR		Version 3.5
$$ Tue Nov  9 13:36:12 2021 Russian Standard Time (UT+4h)  she@DPX200
##.OBSERVE FREQUENCY= 200.1313468511
##.OBSERVE NUCLEUS= ^1H
##.DELAY= (6, 6)
##.ACQUISITION MODE= SIMULTANEOUS
##.ACQUISITION SCHEME= undefined
##.AVERAGES= 8
##.DIGITISER RES= 18
##SPECTROMETER/DATA SYSTEM= spect
##.PULSE SEQUENCE= zg30
##.SOLVENT NAME= CDCl3
##.SHIFT REFERENCE= (INTERNAL, CDCl3, 0, 15.7039)
##AUDIT TRAIL= $$ (NUMBER, WHEN, WHO, WHERE, WHAT)
$$ ##TITLE= Audit trail, XWIN-NMR		Version 3.5
$$ ##JCAMPDX= 5.01
$$ ##ORIGIN= Bruker BioSpin GmbH
$$ ##OWNER= she
$$ F:/spectra/data/she/nmr/H-F/1/audita.txt
$$ ##AUDIT TRAIL=  $$ (NUMBER, WHEN, WHO, WHERE, WHAT)
(   1,<2021-11-09 13:34:30.75 +0400>,<she>,<DPX200>,
      <created by zg, POWCHK disabled, PULCHK disabled
       configuration hash MD5:
       00 E9 B6 7A A2 85 ED C7 34 08 36 98 17 FE 4E 26
       data hash MD5: 16K
       A1 A9 A9 EC D1 CD FB AF 57 65 D0 95 80 08 F3 96>)
$$ ##END=
$$ 
$$ hash MD5
$$ 1F FF 51 8C 43 0F D1 0B 66 E1 A1 87 05 4F F4 7A
##$RELAX= 
##$RELAX= 
##$RELAX= 
##$RELAX= 
##$RELAX= 
##$RELAX= 
$$ Bruker specific parameters
$$ --------------------------
##$DU= <F:/spectra>
##$EXPNO= 1
##$NAME= <H-F>
##$PROCNO= 1
##$TYPE= <nmr>
##$USER= <she>
##$AMP= (0..31)
100 100 100 100 100 100 100 100 100 100 100 100 100 100 100 100 100 100 
100 100 100 100 100 100 100 100 100 100 100 100 100 100 
##$AQSEQ= 0
##$AQ_mod= 1
##$AUNM= <au_zg>
##$AUTOPOS= <>
##$BF1= 200.13
##$BF2= 200.13
##$BF3= 200.13
##$BF4= 200.13
##$BF5= 200.13
##$BF6= 200.13
##$BF7= 200.13
##$BF8= 200.13
##$BYTORDA= 1
##$CFDGTYP= 0
##$CFRGTYP= 5
##$CHEMSTR= <none>
##$CNST= (0..31)
1 1 145 1 1 1 1 1 1 1 1 1 1 1 1 1 1 1 1 1 1 1 1 1 1 1 1 1 1 1 1 1 
##$CPDPRG= <>
##$CPDPRG1= <>
##$CPDPRG2= <>
##$CPDPRG3= <>
##$CPDPRG4= <mlev>
##$CPDPRG5= <mlev>
##$CPDPRG6= <mlev>
##$CPDPRG7= <mlev>
##$CPDPRG8= <mlev>
##$CPDPRGB= <>
##$CPDPRGT= <>
##$D= (0..31)
0 1.2 0 0 0 0 0 0 0 0.06 0 0.03 0 0 0 0 0.0002 0 0 0 0 0 0 0 0 0 0 0 0 
0 0 0 
##$DATE= 1636450470
##$DBL= (0..7)
120 120 120 120 120 120 120 120 
##$DBP= (0..7)
150 150 150 150 150 150 150 150 
##$DBP07= 0
##$DBPNAM0= <>
##$DBPNAM1= <>
##$DBPNAM2= <>
##$DBPNAM3= <>
##$DBPNAM4= <>
##$DBPNAM5= <>
##$DBPNAM6= <>
##$DBPNAM7= <>
##$DBPOAL= (0..7)
0.5 0.5 0.5 0.5 0.5 0.5 0.5 0.5 
##$DBPOFFS= (0..7)
0 0 0 0 0 0 0 0 
##$DE= 6
##$DECBNUC= <off>
##$DECIM= 32
##$DECNUC= <off>
##$DECSTAT= 4
##$DIGMOD= 1
##$DIGTYP= 9
##$DL= (0..7)
0 120 120 120 120 120 120 120 
##$DP= (0..7)
150 150 150 150 150 150 150 150 
##$DP07= 0
##$DPNAME0= <>
##$DPNAME1= <>
##$DPNAME2= <>
##$DPNAME3= <>
##$DPNAME4= <>
##$DPNAME5= <>
##$DPNAME6= <>
##$DPNAME7= <>
##$DPOAL= (0..7)
0.5 0.5 0.5 0.5 0.5 0.5 0.5 0.5 
##$DPOFFS= (0..7)
0 0 0 0 0 0 0 0 
##$DQDMODE= 0
##$DR= 18
##$DS= 0
##$DSLIST= <SSSSSSSSSSSSSSS>
$$ [...]
##$SUBNAM2= <"">
##$SUBNAM3= <"">
##$SUBNAM4= <"">
##$SUBNAM5= <"">
##$SUBNAM6= <"">
##$SUBNAM7= <"">
##$SUBNAM8= <"">
##$SUBNAM9= <"">
##$SW= 18.0517286264689
##$SWIBOX= (0..15)
0 0 2 0 0 0 0 0 0 0 0 0 0 0 0 0 
##$SW_h= 3612.71676300578
##$TD= 16384
##$TD0= 1
##$TE= 0
##$TE2= 300
##$TE3= 300
##$TEG= 300
##$TL= (0..7)
0 120 120 120 120 120 120 120 
##$TP= (0..7)
150 150 150 150 150 150 150 150 
##$TP07= 0
##$TPNAME0= <>
##$TPNAME1= <>
##$TPNAME2= <>
##$TPNAME3= <>
##$TPNAME4= <>
##$TPNAME5= <>
##$TPNAME6= <>
##$TPNAME7= <>
##$TPOAL= (0..7)
0.5 0.5 0.5 0.5 0.5 0.5 0.5 0.5 
##$TPOFFS= (0..7)
0 0 0 0 0 0 0 0 
##$TUNHIN= 0
##$TUNHOUT= 0
##$TUNXOUT= 0
##$USERA1= <user>
##$USERA2= <user>
##$USERA3= <user>
##$USERA4= <user>
##$USERA5= <user>
##$V9= 5
##$VALIST= <valist>
##$VCLIST= <CCCCCCCCCCCCCCC>
##$VD= 0
##$VDLIST= <DDDDDDDDDDDDDDD>
##$VPLIST= <PPPPPPPPPPPPPPP>
##$VTLIST= <TTTTTTTTTTTTTTT>
##$WBST= 1024
##$WBSW= 4
##$XGAIN= (0..3)
0 0 0 0 
##$XL= 0
##$YL= 0
##$YMAX_a= 110963
##$YMIN_a= -166936
##$ZGOPTNS= <>
##$ZL1= 120
##$ZL2= 120
##$ZL3= 120
##$ZL4= 120
##$ABSF1= 10
##$ABSF2= 0
##$ABSG= 5
##$ABSL= 3
##$ALPHA= 0
##$AQORDER= 0
##$ASSFAC= 0
##$ASSFACI= 0
##$ASSFACX= 0
##$ASSWID= 0
##$AUNMP= <proc_1d>
##$AZFE= 0.1
##$AZFW= 0.1
##$BCFW= 1
##$BC_mod= 2
##$BYTORDP= 1
##$COROFFS= 0
##$CY= 11.3945322036743
##$DATMOD= 1
##$DC= 2
##$DFILT= <>
##$DTYPP= 0
##$F1P= 2.36226072786647
##$F2P= -0.459571619588291
##$FCOR= 0.5
##$FTSIZE= 0
##$FT_mod= 4
##$GAMMA= 1
##$GB= 0.15
##$INTBC= 1
##$INTSCL= 1
##$ISEN= 128
##$LB= 0.24
##$LEV0= 0
##$LPBIN= 0
##$MAXI= 10000
##$MC2= 0
##$MEAN= 0
##$ME_mod= 0
##$MI= 1.114404
##$NCOEF= 0
##$NC_proc= 0
##$NLEV= 6
##$NOISF1= 3.799351
##$NOISF2= 2.8
##$NSP= 1
##$NTH_PI= 0
##$NZP= 0
##$OFFSET= 15.70392
##$PC= 1
##$PHC0= -15508.44
##$PHC1= 5.40082
##$PH_mod= 1
##$PKNL= yes
##$PPARMOD= 0
##$PSCAL= 0
##$PSIGN= 0
##$REVERSE= no
##$SF= 200.130013532006
##$SI= 16384
##$SIGF1= 3
##$SIGF2= 2
##$SINO= 400
##$SIOLD= 16384
##$SREGLST= <1H.CDCl3>
##$SSB= 0
##$STSI= 0
##$STSR= 0
##$SW_p= 3612.71676300578
##$SYMM= 0
##$S_DEV= 0
##$TDeff= 0
##$TDoff= 0
##$TI= <>
##$TILT= no
##$TM1= 0
##$TM2= 0
##$TOPLEV= 0
##$USERP1= <user>
##$USERP2= <user>
##$USERP3= <user>
##$USERP4= <user>
##$USERP5= <user>
##$WDW= 1
##$XDIM= 8192
##$YMAX_p= 0
##$YMIN_p= 0
$$ End of Bruker specific parameters
$$ ---------------------------------
##NTUPLES= NMR FID
##VAR_NAME=  TIME,          FID/REAL,        FID/IMAG
##SYMBOL=    X,             R,               I
##VAR_TYPE=  INDEPENDENT,   DEPENDENT,       DEPENDENT
##VAR_FORM=  AFFN,          ASDF,            ASDF
##VAR_DIM=   8192,          8192,            8192
##UNITS=     SECONDS,       ARBITRARY UNITS, ARBITRARY UNITS
##FACTOR=    0.0002768,     1,               1
##FIRST=     0,             0,               0
##LAST=      2.2672688,     0,               0
##MIN=       0,             -166936,         0
##MAX=       2.2672688,     110963,          0
$$ Real data points
##PAGE= N=1
##DATA TABLE= (X++(R..R)), XYDATA
$$ [...]
2520I57j147j58J385P0n88n64k86P8n54J71J67n7K6K03o07K18k87R39l05m62P66
$$ 957 -190 -348 1037 1107 519 -45 -331 -253 -807 -636 -469 -526 -500 -297 -904 -686 -973 -34 -339 -801 -35
2541c5J268j170J269j03p17k73j57n25J030p24M32j040j79L87L65J01n78n42O74
$$ -35 1233 63 1332 1229 512 239 82 -443 587 -137 295 -745 -924 -537 -172 -71 -649 -1191 -517
2560e17O82j150O75l48R4P38J49K71Q65q52J08k2M6M50k1n20qj27j149M98j19
$$ -517 165 -985 -310 -658 -564 174 323 594 1459 607 715 693 739 1189 1168 648 640 513 -636 -138 -257
2581b57l6l35k30J6l17n8M65M29o03K88O24N16p06J214o19J75P17L1J49m8l0q68
$$ -257 -293 -628 -858 -842 -1159 -1217 -752 -323 -926 -638 -14 502 -204 1010 391 566 1283 1314 1463 1415 1385 517
2603E17m72k71M76l47K08p98n68J13j87O14j24M52j264j39Q91M02M70J33K79k61
$$ 517 45 -226 250 -97 111 -687 -1255 -1142 -1329 -715 -839 -387 -1651 -1790 -899 -497 -27 106 385 124
2623A24J064k73M84n55j7o66Q89o82k86O28j109N73j398O66k79Q24n33q70N85
$$ 124 1188 915 1399 844 827 161 1050 368 82 710 -399 174 -1224 -558 -837 -13 -546 -1416 -831
2642h31O57m47K81m7L13m07J49R22Q3o22M81J40k02k38j340J057N48k28j152O82
$$ -831 -174 -621 -340 -387 -74 -481 -332 590 673 51 532 672 470 232 -1108 -51 497 269 -883 -201
2662b01k84L30J60n15M42k35N01m01P74j270P93N81q83R6j18L41M47K95p76O25
$$ -201 -485 -155 5 -510 -68 -303 198 -203 571 -699 94 675 -208 -112 -230 111 558 853 77 702
2682G02K1M3j360J68N05j61m81O99r75O57k4p75j43J411j448M00q18J813J25k3
$$ 702 723 766 -594 -426 79 -82 -563 136 -839 -182 -206 -981 -1124 287 -1161 -761 -1579 234 359 336
2702C36Q47k0p51j22K7l6L61J304j628l79k78L7L19q31M25j192P39M32n70L65
$$ 336 1183 1163 412 290 317 281 642 1946 318 -61 -339 -302 17 -814 -389 -1581 -842 -410 -980 -615
2722f15M80j15j62k19L30J366m10n65O70K00K73j491R81l23l31M7l53J431j845
$$ -615 -135 -250 -412 -631 -301 1065 655 90 760 960 1233 -258 723 400 69 116 -237 1194 -651
2741f51p3P31o18L1o03J078m38o29lL76J162o77m85R22Q6o66M23P08L91m6k40
$$ -651 -724 7 -611 -580 -1183 -105 -543 -1172 -1175 -799 363 -314 -799 123 209 -457 -34 674 1065 1019 779
2762G79r75N17N46l13o86R0m72K30j59K03m47O69j075QJ96Q84k25J5O16l06o3
$$ 779 -196 321 867 554 -132 -42 -514 -284 -443 -240 -687 -18 -1093 -1085 -889 -5 -230 -215 401 95 32
2783C2l64P36n9K94o06J73M40L5M84l10q46m29l23O26O1r89M52o67K5O3J132O4
$$ 32 -332 404 345 639 33 206 646 681 1165 855 9 -420 -743 -117 -56 -1045 -593 -1260 -1235 -1172 -40 24
2805B4p3R0j55M74k18O48K0m49N83o68L93J83l88n02n2N14n69K66K17J7j255K84
$$ 24 -49 41 -114 360 142 790 810 361 944 276 669 852 464 -38 -90 424 -145 121 338 355 -900 -616
2827f16m14M99NK44k25J20K6P35j30K02l26k00Q04j6j47K00n30J99J15M13j080
$$ -616 -1030 -531 -526 -282 -507 -387 -361 374 244 446 120 -80 724 708 561 761 231 430 545 958 -122
2848a22K60r20K85J54j03K4l73K79J97n59L78O32n92P75j71k30M33J51n44M88
$$ -122 138 -782 -497 -343 -446 -422 -795 -516 -319 -878 -500 132 -460 315 144 -86 347 498 -46 442
2868D42j9R7k54K42l0q9m02L45p99k19m0L23Q7o3l33J60P66r92P64M59n95K46
$$ 442 423 520 266 508 478 389 -13 332 -467 -686 -726 -403 -316 -379 -712 -552 214 -778 -14 445 -150 96
2890I6j49J40L93J46R3p17J45j65M49j33l79L3j62n42M49M75p01o9O08l62l8Q0
$$ 96 -53 87 480 626 719 2 147 -18 431 298 -81 -48 -210 -752 -303 172 -529 -598 10 -352 -390 -310
2912c10K25n19L48n1K27J35K81K25j83L08O4p6k80l05M4n31RM62k43j86n6m2k28
$$ -310 -85 -604 -256 -307 -80 55 336 561 378 686 750 674 394 89 133 -398 -389 73 -170 -356 -412 -454 -682
2935f82L43l14M41m71M42K83l50M73M59m16K13k77L32j18J69M67q59N9l26O2j37
$$ -682 -339 -653 -212 -683 -241 42 -308 165 624 208 421 144 476 358 527 994 135 194 -132 -70 -207
2956b07j63O07p70p9N41n30j08p9P08m81J5M58m20Q22p93Q18N9j91N54o49N50
$$ -207 -370 237 -533 -612 -71 -601 -709 -788 -80 -561 -546 -88 -508 314 -479 339 398 207 761 112 662
2977F62q37K22k85j31J053p27j29m0j34J54J4n4j96o4m33K78K62k79N93L7l68
$$ 662 -175 47 -238 -369 684 -43 -172 -212 -346 -192 -178 -232 -428 -492 -925 -647 -385 -664 -71 -34 -402
2998d02P27J3k23L22k41K50J51K55r51O80j121M35l20N34N2j6o08j17M2p1P32
$$ -402 325 338 115 437 196 446 597 852 -99 581 -540 -105 -425 109 161 145 -463 -580 -538 -609 123
3019A23K4l45O0m82k57O90P09k63M48L9o76K71J59L72p16o3k87J89K8j60m42K14
$$ 123 147 -198 -138 -620 -877 -187 522 259 707 746 70 341 500 872 156 93 -194 -5 23 -137 -579 -365
3041c65M0m11N40m65Q44k46r2n64P37l44Q50M61m95J58r19O85n21R31p44m78J91
$$ -365 -325 -736 -196 -661 183 -63 -155 -719 18 -326 524 985 490 648 -271 414 -107 824 80 -398 -207
3062b07M14M3K6l27R1m29M2k36n0N54r38J104l24n09M29K96k04M15j57P1L39J18
$$ -207 207 250 276 -51 40 -389 -347 -583 -633 -79 -1017 87 -237 -746 -317 -21 -225 190 33 104 443 561
3084E61l19m13J10k36L18l01K22l91N0l67M96K19l09N0M65o14l04Q42j49M36k75
$$ 561 242 -171 -61 -297 21 -280 -58 -449 -399 -766 -270 -51 -360 -310 155 -459 -763 79 -70 366 91
3105I1j67J61J16L3K50J28r63J014n06j08L99l13M0m89J10K51o23k10M99n25L99
$$ 91 -76 85 201 234 484 612 -351 663 157 49 448 135 175 -314 -204 47 -576 -786 -287 -812 -413
3126d13P1L36l5k26R0k23L93P55r2o22Q02k83m05M58p63P28K9l30n49L36k75L73
$$ -413 -342 -6 -41 -267 -177 -400 -7 748 656 34 836 553 148 606 -157 571 600 270 -279 57 -218 155
3148A55p56K61p8n26J099n23j68M47j58K99J2L43j07m18N82q08P19K39o42J54
$$ 155 -601 -340 -418 -944 155 -368 -536 -89 -247 52 64 407 300 -118 464 -344 375 614 -28 126
3168A26l91O03j95k5k37J38l43n82M15J20m46P58k90l23O42n0j17J72K20l39N26
$$ 126 -265 338 143 118 -119 19 -324 -906 -491 -371 -817 -59 -349 -672 -30 -80 -197 -25 195 -144 382
3189C82j32P20K0k88l84K51j28k90l84K67N25j14q85j69J07M8P49j285M45J99
$$ 382 250 970 990 702 318 569 441 151 -233 34 559 445 -440 -609 -502 -454 295 -990 -545 -346
3209c46M71J96l02j66L98j03j43L20j34M22p1l33L71k91J55N9O1n12k70j72L33
$$ -346 125 321 19 -147 251 148 5 325 191 613 542 209 580 289 444 503 564 52 -218 -390 -57
3230e7n57O54k66m49O04M90l94q4K27l68K26j8O44l21j75K66p69J129k78j80n4
$$ -57 -614 40 -226 -675 -71 419 25 -59 168 -200 26 8 652 331 156 422 -347 782 504 324 270
3251B70j01m01j57Q7q9k89Q21p81M07l95M20M81m20K94j29J06R5R9m8O7o3l01
$$ 270 169 -232 -389 -302 -391 -680 141 -640 -233 -628 -208 273 -147 147 18 124 219 318 270 337 274 -27
3273b7k92J146q69L2L91p45M00l01Q3k67k34O01m38K34K5L23o86L08M9J92L47
$$ -27 -319 827 -42 -10 381 -364 36 -265 -182 -449 -683 -82 -520 -286 -261 62 -624 -316 -267 -75 272
3294B72K9m5l16N33m00P6l44O16l33J96p6R6J17m43o69M13l28J71K3qL1L57L48
$$ 272 301 256 -60 473 73 149 -195 421 88 284 208 304 421 -22 -691 -278 -606 -435 -412 -420 -389 -32 316
3317C16j74J14l86j20O17l09L71l43k6N90n75k49J45J52q74L45J90N09n71o8J48
$$ 316 142 256 -130 -250 367 58 429 86 60 650 75 -174 -29 123 -751 -406 -216 293 -278 -346 -198
3338a98j05N7r83J078m04l00J021m11k7N14J77j12L90m17N82k66k95M2m60K47
$$ -198 -303 -246 -1229 -151 -555 -855 166 -245 -272 242 419 307 697 280 862 596 301 343 -117 130
3358A30m41P5L65J00q81Q88k1q93M5N01j69J30p88R92mj89N32K5k19M6N65n49
$$ 130 -311 -236 129 229 -652 236 215 -678 -633 -132 -301 -171 -959 33 29 -160 372 397 178 224 789 240
3380B40K44m88M53q47L93J76j39M56n45m3r3n27P98m94J29L32N71j076N55m28
$$ 240 484 -4 449 -398 -5 171 32 488 -57 -100 -193 -720 78 -416 -287 45 616 -460 95 -333
3400c33M46k20P04p20K03K75n5k0Q7k81L5k14J46k68j043J724o76l71LL04q6j053
$$ -333 113 -107 597 -123 80 355 300 280 367 86 121 -93 53 -215 -1258 466 -210 -581 -578 -274 -360 -1413
3422a413R55O54m34M22p18J044n21P47j86P5p03K16o09P12j10j98l14L93n8l06
$$ -1413 -458 196 -238 184 -534 510 -11 736 550 625 -78 138 -471 241 131 -67 -381 12 -46 -352
3442c52P3L14j65l97N13m58K83r2M0M14m12l43O52L55m33M59j38l87N94m38K16
$$ -352 -279 35 -130 -527 -14 -472 -189 -281 -241 173 -239 -582 70 425 -8 451 313 -74 520 82 298
3463B98j38N99q92q0k19r2J87r4K81q5o0M52k12j72J84j57j05J52j40QJ159p21
$$ 298 160 759 -133 -213 -432 -524 -337 -431 -150 -235 -295 157 -55 -227 -43 -200 -305 -153 -293 -285 874 153
3485A53K33j74K42j2l32M0r6J48k35r2N08m49n45J81O9k26K82L88K65m28n3r5
$$ 153 386 212 454 442 110 150 54 202 -33 -125 383 -66 -611 -430 -361 -587 -305 83 348 -80 -133 -228
3507b28M00r3k25L44j93j65M95P2Q9l31j75n72n6L51N68m9k42j41o36O61j27l2
$$ -228 172 79 -146 198 5 -160 335 407 496 165 -10 -582 -638 -287 281 232 -10 -151 -787 -126 -253 -285
3529b85J78k8N8l63M81n69P39o98J128j01j99k28j10K68K71l68K46n55M60q8m28
$$ -285 -107 -135 -77 -440 41 -528 211 -487 641 540 341 113 3 271 542 174 420 -135 325 237 -191
3550a91Q4n1l48L44J32j83L43p31J0Q3O33J04J50L1o79P54l99J77r6K92K80n12
$$ -191 -107 -158 -506 -162 -30 -213 130 -601 -591 -508 125 229 379 410 -269 485 86 263 167 459 739 227
3572B27M40l58l18j92k18K13N3K22J84o22J46j73N38p29L45O71p49L41n9L32K9
$$ 227 667 309 -9 -201 -419 -206 -153 69 253 -369 -223 -396 142 -587 -242 429 -320 21 -38 294 323
3593C23M84o84j02k5L92l48j07k75M76l82P7N4K8p00m2O47k4p2M39n50J59L78
$$ 323 807 123 21 -4 388 40 -67 -342 134 -248 -171 -117 -89 -789 -831 -184 -208 -280 159 -391 -232 146
3615A46l16O2K13M47p46J07L42m73N66l73J23k07K90k37N53m25K3l06J9K77r6
$$ 146 -170 -108 105 552 -194 -87 255 -218 348 -25 98 -109 181 -56 497 72 95 -211 -192 85 -11
3636a1m14m34K81M29N35J9q43L99M84o84K19K98M59p40J16K16k0j31o55K92K63
$$ -11 -425 -859 -578 -149 386 405 -438 -39 445 -239 -20 278 737 -3 113 329 309 178 -477 -185 78
3657G8l19M69p66M09l10m14J012J61l98o0M69n94L98M2j24k08N82l01L18J9l56
$$ 78 -241 228 -538 -129 -439 -853 159 320 -78 -138 331 -263 135 177 53 -155 427 126 444 463 107
3678A07n57Q01n62M12l66j7q4qj30m5k92L36N15o55L95J54r7J1k30K77L70Kj69
$$ 107 -450 351 -211 201 -165 -182 -266 -274 -404 -449 -741 -405 110 -545 -150 4 -93 -82 -312 -35 335 337 168
3701A68j91o8K91J09N75o71J41m88L65k23N7j86nl66J12K4j62L05J22K9k74r4
$$ 168 -23 -91 200 309 884 213 354 -134 231 8 65 -121 -126 -492 -380 -356 -518 -213 -91 -62 -336 -430
3723d30N36r6K75j95J91L30l33J5J3k48q7R3K89l87M1j37m02J59k52K67K88m7
$$ -430 106 10 285 90 281 611 278 293 306 58 -29 64 353 -34 7 -130 -532 -373 -625 -358 -70 -117
3745a17J91k84K94k35O09m73k09K25K88l68k53L44K11p38P39K26o63M39K27k65
$$ -117 74 -210 84 -151 458 -15 -224 1 289 -79 -332 12 223 -515 224 450 -213 226 453 188
3765A88j47k03M32n70K14j18O3k9N98q5q21O06m39P43J60j36j27k9k75J2L48j45
$$ 188 41 -162 270 -300 -86 -204 -141 -170 428 343 -478 128 -311 432 592 456 329 300 25 37 385 240
3787B40J18k42L5k99J39m4r4P9k47P0K72j61J69J30l13K10L8j77L45L2N2J26m38
$$ 240 358 116 151 -148 -9 -53 -147 -68 -315 -245 27 -134 35 165 -148 62 100 -77 268 300 352 478 40
3810D0K44l49K0J45M44q38L2L44q88L12K93M27k66m16k77Q3J70rN13M30n06O39
$$ 40 284 -65 -45 100 544 -294 -262 82 -806 -494 -201 226 -40 -456 -733 -650 -480 -489 24 454 -52 587
3832E87p66J021r8K15m36n79L01K5m75k3K69j32l0Kk07M79j01p05k0K68j99M69
$$ 587 -179 842 744 959 523 -56 245 270 -205 -228 41 -91 -121 -119 -326 153 52 -653 -673 -405 -604 -135
3854a35p86R83M49r89Q08J88q82R0J309q00m00N92n4k91K93m61n99M50J072r32
$$ -135 -921 62 511 -478 330 518 -364 -274 1035 235 -165 427 373 82 375 -86 -685 -235 837 -95
3874i5r6m61K4Q3r2N47j99N64k6m41J32n71N96N75K8o04N11o50P86n60p4j84k03
$$ -95 -191 -652 -628 -545 -637 -90 -289 275 249 -192 -60 -631 -35 540 568 -36 475 -175 611 51 -23 -207 -410
3897d10J201j480J145l18o05n1Q3K78N27r24L56L83j75O01n55n00J201l69l02
$$ -410 791 -689 456 138 -467 -518 -435 -157 370 -554 -198 185 10 611 56 -444 757 388 86
3916H6L35m51m08J90L9N53m26Q0m90L35m33j67Q10n52K96N8L49l49J75J45k88
$$ 86 421 -30 -438 -248 -209 344 -82 -2 -492 -157 -590 -757 53 -499 -203 -145 204 -145 30 175 -113
3937a13j35N45j153p1J239m32k50N10J61p70J229j466L79Q51l30K24J80m92j48
$$ -113 -248 297 -856 -927 312 -120 -370 140 301 -469 760 -706 -327 524 194 418 598 106 -42
3956d2n92M83l08M66L14k9n34p40J115j93j285J065J156r95q59L24J12M39o06
$$ -42 -634 -151 -459 7 321 292 -242 -982 133 -60 -1345 -280 876 -119 -978 -654 -542 -103 -709
3975g09R48o07N95j165Q23n55p17J993j34P0k126J969p91J63K53o52P79K55n77
$$ -709 239 -368 227 -938 -115 -670 -1387 606 472 542 -1584 385 -406 -243 10 -642 137 392 -185
3994a85J996j396L3p67R43o55K45J85K63q24l29N49K72o61P01j294K02Q69k65
$$ -185 1811 415 448 -319 624 -31 214 399 662 -162 -491 58 330 -331 370 -924 -722 147 -118
4013a18m47M45n02R31k20L49j51l1l29L43O14o09L76l42m95O64nO17j247r70J164
$$ -118 -565 -120 -622 309 89 438 287 256 -73 270 884 275 651 309 -186 478 473 1090 -157 -1127 37
4034C7l32J131j909J365j229N07j22K92K74j81o8N86J12o83mr27J36L59O05J3
$$ 37 -295 836 -1073 292 -937 -430 -552 -260 14 -167 -235 351 463 -220 -224 -1151 -1015 -656 -51 -38
4054c8J49k21N76r94R73k81P44k179J032l80J663q56q78RM2M41J85N25k16o84
$$ -38 111 -110 466 -528 445 164 908 -1271 -239 -619 1044 188 -690 -681 -639 -198 -13 512 296 -388
4074c88j49J276k84N46j035O78j78O86l42q70L11l66m53P23M91k76m84K15n30
$$ -388 -537 739 455 1001 -34 644 466 1152 810 -60 251 -115 -568 155 646 370 -114 101 -429
4093d29L15n46L33qM84M86j111K97P75n61N3l63q01J626l75O83r33j027J565k32
$$ -429 -114 -660 -327 -335 149 635 -476 -179 596 35 88 -275 -1076 550 175 858 -75 -1102 463 231
4113B31q99J039J83n6n13P1J111r37o33L21J41NM8m65n49K060j563o55P35J50
$$ 231 -668 371 554 498 -15 56 1167 230 -403 -82 59 64 112 -353 -902 1158 -405 -1060 -325 -175
4133a75J469k123J622j674Q53r25J467k46J80k95n96N50P18j650j72P54N64k74
$$ -175 1294 -829 793 -881 -28 -953 514 268 448 153 -443 107 825 -825 -997 -243 321 47
4151D7P54j184O97o02M82q4n94K10J85J612j391P9o46Q50j165K99J062k44J73
$$ 47 801 -383 314 -288 194 110 -484 -274 -89 1523 132 211 -435 415 -750 -451 611 367 540
4170E40j706J442j082M97J25K48M49m31l67J99K86j60L54L53j93k13j11l82k49
$$ 540 -1166 276 -806 -309 -184 64 513 82 -285 -86 200 40 394 747 554 341 230 -152 -401
4189d01O12l40J32J84K0j047R09k86J28J33l95q21J341p68P08k4k71N35j76q34
$$ -401 211 -129 3 187 207 -840 69 -217 -89 44 -351 -1172 169 -599 109 85 -186 349 173 -661
4209f61Q78l91j155J434m61N64r15J576j26p26l4n0p24N4L02L13Q3M1j16R77r43
$$ -661 217 -174 -1329 105 -356 208 -707 869 743 17 -17 -67 -791 -737 -435 -122 -39 2 -114 863 -80
4230h0K58k12l49P13R52j271L75J51l24J16K79k62N01j172J042r13K27L84n30
$$ -80 178 -34 -383 330 1282 11 386 537 213 329 608 346 847 -325 717 -196 31 415 -115
4249a15L81n11L96o11l48M58N5N59j051Q11%p6n7n98Q29j23l60l14K53Q70n94
$$ -115 266 -245 151 -460 -808 -350 -295 264 -787 24 24 -52 -109 -707 122 -1 -361 -675 -422 448 -146
4270a46P54n45J5M26N6o5q12N82j296J125m52O89j467J197J01k35J37n22J67J21
$$ -146 608 63 78 504 560 495 -317 265 -1031 94 -358 331 -1136 61 162 -73 64 -458 -291 -170
4290a70K19j91k49R36K01j493P31m52R83r14r0J32J501j210M07o75L74n98L97
$$ -170 49 -142 -391 545 746 -747 -16 -468 515 -399 -489 -357 1144 -66 341 -334 40 -558 -161
4309a61q42J947p42l8O89j373J096j091J128j62m53k22L37R5p65Q63o97q32J228
$$ -161 -1003 944 202 164 853 -520 576 -515 613 451 -2 -224 113 208 -557 306 -391 -1223 5
4328EJ36j72J00q5o37k01J624r89J085q00m81Q94k06j236J393k11m8k73J74O96
$$ 5 141 -31 69 -16 -653 -854 770 -219 866 66 -415 479 273 -963 430 219 171 -102 72 768
4348G68j161N39L85K86m05q00r5Q29o05n1P52J77r54K39j30O52j132J799p62l14
$$ 768 -393 146 531 817 412 -388 -483 346 -259 -310 442 619 -335 -96 -226 426 -706 1093 331 17
4368A7M56j332J334r83O20k39NK51o51R4Q17l07n67L14l24N28k32l40J351n05
$$ 17 473 -859 475 -508 112 -127 -122 129 -522 -428 389 82 -485 -171 -495 33 -199 -539 812 307
4388C07n97P99n76o0l64J59N92l1K30l99M9l48K61oP7m2p35O36J65m53K075j796
$$ 307 -290 509 -67 -127 -491 -332 260 229 459 60 109 -239 22 16 93 51 -684 -48 117 -336 1739 -57
4410e7k60O46n29L2J82J78m87L62K66n07L5N24q69M67M56n15j60N93p07M5M10
$$ -57 -317 329 -200 -168 14 192 -295 67 333 -174 -139 385 -484 -17 439 -76 -236 357 -350 -305 105
4431A05n11M20p2L93P8o90j02m66N45J42L86n94l15k86J142p0O30j036J105j082
$$ 105 -406 14 -58 335 413 -277 -379 -845 -300 -158 228 -366 -681 -967 175 105 735 -301 804 -278
4451b78L60N91j95j02p82O51mJ080j389o57J42J060p48k0j021J288n63Q03P07
$$ -278 82 673 478 376 -406 245 241 1321 -68 -725 -583 477 -271 -291 -1312 -24 -587 216 923
4470I23n62m30J47r35Q14J54J0Q66j603J63k7O52n2m5M12M55j615Q29o65N8N6
$$ 923 361 -69 78 -857 -43 111 121 987 -616 -453 -480 172 120 75 487 942 -673 156 -509 -451 -395
4491c95R73q65R06j005l60J215j678R88l41R76n7l96o11N83l32L14r4M67l48M18
$$ -395 578 -287 619 -386 -746 469 -1209 -221 -562 414 357 -39 -650 -67 -399 -85 -179 288 -60 358
4511C58k32O3m01N62o02o6N30J28r19L63O1l20L1P87n68p06J236n41J67R8K82
$$ 358 126 189 -212 350 -252 -318 212 340 -579 -216 -155 -475 -444 343 -225 -931 305 -236 -69 29 311
4532C11L29Q6q51J51n02N49L98o17j98N26m02O34J88o87N34p00L48qp3J00l23
$$ 311 640 726 -125 26 -476 73 471 -146 -344 182 -220 414 602 -85 449 -251 97 89 16 116 -207
4553b07O1L89o85J604j126K15m7k77q20J065K86p2k29l84Q45q52j68K65J54O36
$$ -207 -146 243 -442 1162 36 251 204 -73 -893 172 458 386 157 -227 618 -234 -402 -137 17 653
4573F53o24j03k21K24K62j43l09M1Q28K99o97l60j10L14J4p1R74o69o63P64q0
$$ 653 29 -74 -295 -71 191 48 -261 -220 608 907 210 -150 -260 54 68 -3 971 302 -361 403 323
4594C23k89n88M2M47J85q5j04l0J26L32n43K30J66L90r81O36l67O83j060R04l58
$$ 323 34 -554 -512 -65 120 35 -69 -99 27 359 -184 46 212 602 -379 257 -110 573 -487 417 59
4615E9j12M1j54P57n08N81k03p84K75J8l0j12j00M3P14l86k79J34K68k03m63K72
$$ 59 -53 -12 -166 591 83 664 461 -323 -48 -30 -60 -172 -272 -229 485 99 -180 -46 222 19 -444 -172
4637a72L4J69k72K31l56q9J035n64J16R9j07L79p02P1J50J09o74J90Q01q43L02
$$ -172 -138 31 -241 -10 -366 -455 580 16 132 231 124 503 -199 -128 22 131 -543 -353 448 -395 -93
4658i3K53j11o0J07l64N95r70P80m1p20J113n87O99K5m29p38M2M31k31O08r91
$$ -93 160 49 -11 96 -268 327 -643 137 96 -624 489 -98 601 626 197 -541 -499 -68 -299 309 -682
4679f82L61Q44j022O78j69R47p72k25l22J044o70m3m9L57L11j12J30p67k11l9
$$ -682 -321 523 -499 179 10 957 185 -40 -362 682 12 -31 -80 277 588 476 606 -161 -372 -411
4699d11O39m77P06n37m72N52N35J52j062R82j14r27K9l48O46r9k35L30K2m92R98
$$ -411 228 -249 457 -80 -552 0 535 687 -375 607 493 -434 -405 -753 -107 -206 -441 -111 -89 -581 417
4720D17o99l61Q77q25J158n1q96O90J80j44n96J298j031J74m90J46O4o99J002
$$ 417 -282 -643 234 -591 567 516 -380 310 490 346 -250 1048 17 191 -299 -153 -89 -788 214
4739B14j006N20K6N80m42M30m10M48j08m44O19L50p74m79R34p15N69l12j65K2
$$ 214 -792 -272 -246 334 -108 322 -88 360 252 -192 427 777 3 -476 458 -257 312 0 -165 -143
4759a43O38m97l10R79p80l03O79K0j93k47O73q37P17M51j504L85M39j26n87K85
$$ -143 495 -2 -312 667 -113 -416 263 283 90 -157 516 -321 396 847 -657 -272 167 41 -546 -261
4779b61J88J04n7L17k15J5p6J37K41m04j38P2M3oj03N24k98o48P90k64r3K91J18
$$ -261 -73 31 -26 291 76 91 15 152 393 -11 -149 -77 -34 -40 -143 381 83 -565 225 -39 -132 159 277
4802B77n70M65K3q61M99J82M75q7m46j57j38N73q58N32l49J63j14N98l67n2N91
$$ 277 -293 172 195 -666 -167 15 490 403 -43 -200 -338 235 -623 -91 -440 -277 -391 207 -160 -212 379
4823C79j36j9M38n05q19P30N1l18L02n7q7l2Q21j073l1m37J390l99m66R35r43
$$ 379 243 224 662 157 -662 68 119 -199 103 46 -41 -73 748 -325 -356 -793 597 198 -268 667 -276
4844b76j40N88k38n36N34o94P77n81O24l92j21P53l35K4K39j52j81j90N20p5J4
$$ -276 -416 172 -66 -602 -68 -762 15 -566 58 -334 -455 298 -37 -13 226 74 -107 -297 223 148 162
4865A62o37J048m99n79J63L20L59J59m66N66r19M83j7p62Q18K62n01o35Q37j25
$$ 162 -475 573 74 -505 -342 -22 337 496 30 596 -323 160 143 -619 199 461 -40 -675 162 37
4885C7mR9L24n26nj096J915q08k31j92P31k87m68l03L78j47j09R04k49O31m76
$$ 37 33 132 456 -70 -75 -1171 744 -64 -295 -487 244 -43 -511 -814 -436 -583 -692 212 -37 594 118
4906A18q1L17J54l96R28p36o09L08j61O79k84m24K76K08m7k67Rj12j394J268j82
$$ 118 37 354 508 112 1040 304 -305 3 -158 521 237 -187 89 297 250 -17 -8 -120 -1514 -246 -428
4927d28k95J058O63j375N10M58q63j86L08P71q25L03Q39l50q35O89j092m3O12
$$ -428 -723 335 998 -377 133 591 -272 -458 -150 621 -204 99 938 588 -247 442 -650 -693 -81
4946h1P5q1p6M13K68n86N64j81L00q36O52J41l28j83k07o24R16j01N54K7M05j574
$$ -81 -6 -87 -163 250 518 -68 496 315 615 -221 431 572 244 61 -146 -770 146 45 599 626 1031 -543
4968e43N57M41m13o10J188j578R81p43P79Q96j419N5j47M79l98Q71n04N93j256
$$ -543 14 455 42 -568 620 -958 23 -720 59 955 -464 -409 -556 -77 -475 396 -108 485 -771
4987g71Q77K82k91k07J57l86M18K64m38K69J47K36p06j050J134m94J55Q92q80
$$ -771 106 388 97 -110 47 -339 79 343 -95 174 321 557 -149 -1199 -65 -559 -404 488 -392
5006c92L12M30k9m16j080J832K9l37M11j050K80q76J765j486O48J33p05Q81N42
$$ -392 -80 350 321 -95 -1175 657 686 349 760 -290 -10 -886 879 -607 41 174 -531 350 892
5025H92j026K29m89J027p34N0L96L32j172K10k92M19R1n0J85l63M21L19j308L79
$$ 892 -134 95 -394 633 -101 -51 345 677 -495 -285 -577 -158 -67 -117 68 -295 126 445 -863 -484
5045d84J477j127J47L58l34n92J019K94r89r84K012j113M55j479J442M22n62M60
$$ -484 993 -134 13 371 37 -555 464 758 -231 -1215 797 -316 139 -1340 102 524 -38 422
5063D22n08m16M60M39m30p7j111R41n23m01K701j367j36r50N35L23l53P70j514
$$ 422 -86 -502 -42 397 -33 -110 -1221 -280 -803 -1204 1497 130 -6 -956 -421 -98 -451 319 -1195
5082a195J214J138j700J899q85j047J200q67M19q74J290q22Q14j10j009q9J754
$$ -1195 19 1157 -543 1356 471 -576 624 -243 176 -698 592 -230 584 474 -535 -624 1130
5099A130j189R5J026j639K87L34J9J07n18J071n90j079J794o26M15q31m11J662
$$ 1130 -59 36 1062 -577 -290 44 63 170 -348 723 133 -946 848 222 637 -194 -605 1057
5117A057k161J422k21j95L45p84P51J87P98j132j96j27K83j030J287J49j122J600
$$ 1057 -1104 318 97 -98 247 -537 214 401 1199 67 -129 -256 27 -1003 284 433 -689 911
5135I11j74j371J164k77P0n16m58M87M93M9L43j103m33O30k02P27q52o58J029
$$ 911 737 -634 530 253 323 -193 -651 -164 329 378 721 -382 -815 -185 -387 340 -512 -1170 -141
5154a41K64l55M00J65N72j224P12j180O99N56j25j38m26P8J031r11M04m21l20
$$ -141 123 -232 168 333 905 -319 393 -787 -88 468 343 205 -221 -143 888 -23 381 -40 -360
5173c60K23m35M69K07k86o95J114j013J86O23j018J473j307J266p38p09J500j627
$$ -360 -137 -572 -103 104 -182 -877 237 -776 -590 33 -985 488 -819 447 -291 -1000 500 -1127
5191a127K109j446R55q82l01J052l51K70J34o50k75O90R3K45p68N0M46o68M54
$$ -1127 982 -464 491 -391 -692 360 9 279 413 -237 -512 178 271 516 -252 -202 244 -424 30
5210C0l50J532o64p12N58l03n70Q36l77J170l65r37L95j044J248N71j998O42O35
$$ 30 -320 1212 548 -164 394 91 -479 357 -20 1150 785 -152 243 -801 447 1018 -980 -338 297
5229B97K23j291M87j43M87m62m34L37L03l05k49N58J73M8m77K14r73J443j8r52
$$ 297 520 -771 -284 -427 60 -402 -836 -499 -196 -501 -750 -192 -19 29 -448 -234 -1207 236 218 -734
5249g34j22J064Q5J65J010k078L45O21m17p6R70j70j377O10J43L41n44n89K90
$$ -734 -856 208 293 458 1468 -610 -265 356 -61 -137 833 663 -714 -104 39 380 -164 -753 -463
5268d63q6R4J552j249k03J106M2l08N73j210N51m03M81K21m68k92K02P24q67L67
$$ -463 -549 -455 1097 -152 -355 751 793 485 1058 -152 399 -4 477 698 230 -62 140 864 -3 364
5288C64o02L33j250Q30N3q8J77j15n31K15R74p03M76m30l26O14R6k39L90r8j68
$$ 364 -238 95 -1155 -325 -272 -360 -183 -298 -829 -614 360 -343 133 -297 -623 -9 87 -152 238 140 -28
5309b8j1N09j158J220j298R31n1n66L89M62p85K02O99j411J567n15p44kN28k15
$$ -28 -39 470 -688 532 -766 165 114 -452 -63 399 -386 -184 515 -896 671 156 -588 -590 -62 -277
5329b77L54k32R70q56p12J44J333q07L39k5P2m27J89k20O12n09L34l89m90Q17
$$ -277 77 -155 815 -41 -753 -609 724 -83 256 231 303 -124 65 -155 457 -52 282 -107 -597 220
5349B20o09kL64K72k52k28L44L77k32o69L58o45P16m03R5L47m80J08K22R8m39
$$ 220 -389 -391 -27 245 -7 -235 109 486 254 -415 -57 -702 14 -389 -294 53 -427 -319 -97 1 -438
5370d38K64J03k46M0q8N94m43O40m26m99L95K9N11m12O7p3O3L2j80M4N8l51L39
$$ -438 -174 -71 -317 -277 -365 229 -214 426 0 -499 -104 -75 436 24 91 18 81 113 -67 -23 35 -316 23
5393B3K87p96M56l29J55N88n99K63N18r07O22J9q45P89J22p12L36o8O7n71M15
$$ 23 310 -486 -30 -359 -204 384 -215 48 566 -341 281 300 -545 244 366 -346 -10 -78 -11 -582 -167
5414a67k59M05J89j39j69Q2K24l93J40J77m28P08m55N28o25l0L34J30m97P7M29
$$ -167 -426 -21 168 29 -140 -58 166 -227 -87 90 -338 370 -85 443 -182 -212 122 252 -245 -168 261
5435B61p81Q44m68J94R5l47L8k94N12l86P02k37p7L38n35j20O26o72R8j44L06
$$ 261 -520 324 -144 50 145 -202 -164 -458 54 -332 370 133 56 394 -141 -261 365 -307 -209 -353 -47
5456d7K93l7K73l65OK20n04N18k63l72P9p2M04O2l55J04l58N23R1k60q8k40M68
$$ -47 246 209 482 117 123 343 -161 357 94 -278 -199 -271 133 195 -160 -56 -414 109 200 -60 -148 -388 80
5479H0n07N44q46N67N78J1p24P65m89N66k94m34O61q98K83J88M79o47o65M37J163
$$ 80 -427 117 -729 -162 416 427 -297 468 -21 545 251 -183 478 -420 -137 51 530 -117 -782 -345 818
5500H18r53L1l45Q61l71M0J4L1P2J21n03k14L60p85O88L28k14N28K77j442Q69
$$ 818 -135 -104 -449 412 41 81 95 126 198 319 -184 -398 -38 -823 -135 193 -21 507 784 -658 211
5521B11m51J61R03l67k06j43M14q67L38L5M2L47n28K27R6n97L80P23q66j14M16
$$ 211 -240 -79 824 457 251 108 522 -345 -7 28 70 417 -111 116 212 -385 -5 718 -148 -262 154
5542A54m68K9O87q96k38P01O34m80K4Q7j013J07L41N5L99m71M84j07q15J241o09
$$ 154 -314 -285 402 -494 -732 -31 603 123 147 234 -779 -672 -331 -276 123 -348 136 29 -786 455 -154
5563a54q20Q87l28L76M12p82J49K08j6J17N94j043N75K64j95o06N87l44k04R21
$$ -154 -974 -87 -415 -39 373 -409 -260 -52 -68 49 643 -400 175 439 244 -362 225 -119 -323 598
5583E98r33O54p10m0M70n90L99p37J048m12K66ro24P48k80K47N87j185M35J05
$$ 598 -335 319 -391 -431 39 -551 -152 -889 159 -253 13 4 -620 128 -152 95 682 -503 -68 37
5603C7J50m82j7k31N07M8k11L48k16j02k68L7M94j72j34J105j400J21N42j059
$$ 37 187 -295 -312 -543 -36 12 -199 149 -67 -169 -437 -400 94 -78 -212 893 -507 -386 156 -903
5623i03O34M17J38o63O43K55m76k22N80m70P7m01J30P67o37n53O54M09l68m26
$$ -903 -269 148 286 -377 266 521 45 -177 403 -67 10 -391 -261 506 -131 -684 -30 379 11 -415
5643d15R60j60L7l45N4j08l83P90K17n76P2m84K23L75k12J36o03L95N17Kl63O51
$$ -415 545 385 422 77 131 23 -360 430 647 71 143 -341 -118 257 45 181 -422 -27 490 492 129 780
5665G80r29j41j308J624j97O08o02K17k39M18J38L92o86j98m04J406q91O07q32
$$ 780 -149 -290 -1598 26 -171 437 -165 52 -187 231 369 761 75 -123 -527 879 -12 595 -237
5684b37P99k94n05P28m76J35J08j92q52R98q81J381q92N90l87n10K15J48J03l42
$$ -237 562 268 -237 491 15 150 258 66 -786 212 -669 712 -180 410 23 -487 -272 -124 -21 -363
5704c63N94m3l56m91K80J18J126q53m15K93p33N90kl27R27p80J053K7j274Q86
$$ -363 231 188 -168 -659 -379 -261 865 12 -403 -110 -843 -253 -255 -582 345 -435 618 645 -629 257
5724B57j69j2M5K31j83m84N01M6K88o43M5J314k656R66K51k77R04L06k26m17n75
$$ 257 88 76 121 352 169 -315 186 232 520 -123 -78 1236 -1420 -454 -203 -480 424 730 504 87 -488
5745d88M45p80J043M7k75L86m25L60p15Q89q26P77j192J365l65j88q34Q76J848
$$ -488 -43 -823 220 267 -8 378 -47 313 -402 487 -339 438 -754 611 246 58 -776 100 1948
5764A948k113j70L41l05K54J01N76k18n00m55J647j235M4J249j253l29Q50o40
$$ 1948 -165 -335 6 -299 -45 56 632 414 -86 -541 1106 -129 -85 1164 -89 -418 432 -208
5782b08k5K96k95O99p03K59k00l11K96r7o55J882n93p71J008q72j9P06j366J098
$$ -208 -233 63 -232 467 -236 23 -177 -488 -192 -289 -944 938 345 -426 582 -290 -309 397 -969 129
5802A29m86m6l1K36L12k03P30l00o0k61K36Q61j415J76K21l17P86n94l70q7O39
$$ 129 -357 -403 -434 -198 114 -89 641 341 281 20 256 1117 -298 -122 99 -218 568 -26 -396 -483 156
5823A56p93M81K80R38j692K01O96q92N65k62L77K65l02J13l55N10L96m27R1l14
$$ 156 -637 -156 124 1062 -630 -429 267 -625 -60 -322 55 320 18 131 -224 286 682 255 346 32
5843C2m63J063p55k35N38n96R56j80n05n05L0J295j160P45l04K49K82m19p43Q06
$$ 32 -431 632 -123 -358 180 -416 540 360 -145 -650 -620 675 -485 260 -44 205 487 68 -675 131
5863A31k18k52J63N01r9o09M47n00R94o54n6N81M19j206L32n39Q73l20j147O30
$$ 131 -87 -339 -176 325 226 -383 64 -436 558 -96 -152 429 848 -358 -26 -565 308 -12 -1159 -529
5883e29P95l19m45J085p00O1k62R87j048M58J52p64P22l42p3O37n86m32N28N90
$$ -529 266 -53 -498 587 -113 -52 -314 673 -375 83 235 -529 193 -149 -222 415 -171 -603 -75 515
5903E15L84j397M07m12J75M50r4k74j15O45o26P50m76j15L34L8m10j95M70P46
$$ 515 899 -498 -91 -503 -328 122 28 -246 -361 284 -342 408 -68 -183 151 189 -221 -416 54 800
5923H00j624O88J41o55K78J55L82L43o77l59M13n44O53K76q56Q85J8j33k54n98
$$ 800 -824 -136 5 -650 -372 -217 165 508 -169 -528 -115 -659 -6 270 -586 299 317 184 -70 -668
5943f68N41n17J061j075L99K81M83j231P55k37k26R31n57P0L7j13K00j9j45o98
$$ -668 -127 -644 417 -658 -259 22 505 -726 29 -208 -434 497 -60 10 47 -66 134 115 -30 -728
5963g28O23N56m24K22j45K1l87M03j50J72n2m64L69N2L58j3j385J541o33J69k02
$$ -728 -105 451 27 249 104 125 -262 141 -9 163 111 -353 16 68 426 413 -972 569 -64 105 -97
5984i7k14M71J20r52N46K70k59o3N22l37L31m6m33J01Ko2N4L59l81k83J28N72
$$ -97 -311 160 280 -672 -126 144 -115 -178 344 7 338 292 -141 -40 -38 -100 -46 313 -68 -351 -223 349
6006C49m32P5k4j13M6L46l25K21Q8r0q6j32l6j96M86m50K87j56j68j42L29J34
$$ 349 -83 -8 -32 -145 -99 247 -78 143 231 141 55 -77 -113 -309 177 -273 14 -142 -310 -452 -123 11
6028A1K84l95K27r9n9q8j63M93k74k75M07j69k79M64l29K09l2O2J10l59K20J87
$$ 11 295 -100 127 28 -31 -119 -282 211 -63 -338 69 -100 -379 85 -244 -35 -67 -5 105 -254 -34 153
6050A53j65K31k49o1K3j17J49J00k08J5K30K42l3k84M96l43k12Qo2k4o7J06J68
$$ 153 -12 219 -30 -91 -68 -185 -36 64 -144 -129 101 343 310 26 522 179 -33 -25 -87 -111 -178 -72 96
6073I6r8q4K4K24r2N4k44l0N17j04K4l02R3k43N57l30r8p3k1J28K92n90R7J79
$$ 96 -2 -86 -62 162 70 124 -120 -150 367 263 287 -15 78 -165 392 62 -36 -109 -130 -2 290 -300 -203 -24
6097b4L74k74J00k85j58J72pK04n5JJ14J49k93J94K10l64J69q3J96k93k41L48
$$ -24 350 76 176 -109 -267 -95 -102 102 47 48 162 311 18 212 422 58 227 144 340 47 -194 154
6119A54j71m00P8K95n15M89k31K70l29L60j89l8P90o43L07J47q83N82j26K81j85
$$ 154 -17 -417 -339 -44 -559 -70 -301 -31 -360 0 -189 -227 563 -80 227 374 -509 73 -53 228 43
6140D3j05K20K0j89k37O7J52J5j27o0l1L13q9j36j37P3L37l57j42M95O1N0l91
$$ 43 -62 158 178 -11 -248 -181 -29 -14 -141 -201 -232 81 -8 -144 -281 -208 129 -228 -370 125 186 236 -155
6163a55N25n40L52l69M2M5p5K66J40k74M69n07M27o73N25Pl51j47L40j61J42Q5
$$ -155 370 -170 182 -187 -145 -100 -175 91 231 -43 426 -81 346 -327 198 205 -146 -293 47 -114 28 113
6185A13l36K26j84L55l99J67J52j01K89N3J63l42k27j39J31r7K27k3k33Q6K23
$$ 113 -223 3 -181 174 -225 -58 94 -7 282 335 498 156 -71 -210 -79 -176 51 28 -205 -119 104
6206A04pl24J84K8q2K85k94L13j57l34M89K12k12k47k03K98P7k08K73k91J20k0
$$ 104 97 -227 -43 -15 -97 188 -106 207 50 -284 205 417 205 -42 -245 53 130 -78 195 -96 24 4
6228Dj31K10m73K26K36m17J59M48p7J17m13J7Q4J56L6N4l22K05M9L0P4n09P1L78
$$ 4 -127 83 -390 -164 72 -345 -186 262 185 302 -111 -94 -10 146 182 236 -86 119 168 198 272 -237 -166 212
6252B12j2k69m45P66l05q40J029k16n1L52p46N42o7M81n60J7K45q4j44J05OO7
$$ 212 200 -69 -514 252 -53 -893 136 -80 -131 221 -525 17 -50 431 -129 -112 133 49 -95 10 16 83
6274H3K52j41k98L49l74J14N2j53j73K18j4L36m09K45n5Q4k05j3j43P5m3N02k57
$$ 83 335 194 -104 245 -129 -15 37 -116 -289 -71 -85 251 -158 87 32 116 -89 -102 -245 -170 -213 289 32
6297C2n94K63N17m40O62P2j178J061o59N21n09L06j62k17M88nJ53j048M37N22
$$ 32 -562 -299 218 -222 440 512 -666 395 -264 257 -252 54 -108 -325 163 158 311 -737 -300 222
6317B22o37j6L49n43N96j01K41K61o65l2N51k68p3K11J85j6n64K91K9m40J8l0
$$ 222 -415 -431 -82 -625 -29 -130 111 372 -293 -325 226 -42 -115 96 281 265 -299 -8 21 -419 -401 -431
6339d31O3N15n7m18K69N56m18L9l59L15n61M00J67R8j0K27j80k51M68n41K91J50
$$ -431 -368 147 90 -328 -59 497 79 118 -241 74 -487 -87 80 178 168 395 215 -36 432 -109 182 332
6361C32J80l10j41p26Q47Ln71M14Q2j97j18L67o76O72k93K6O7l3L76l11N6J94
$$ 332 512 202 61 -665 182 185 -386 28 110 -87 -205 162 -514 158 -135 -109 -42 -75 301 -10 46 240
6383B40m89K94l19N49k90K96M6l95M12j121M32N16o09L20M54l91n2J84O15m98
$$ 240 -249 45 -274 275 -15 281 327 -68 344 -777 -345 171 -438 -118 336 -55 -107 77 692 194
6403A94l27L7N18J7j95N26kj46n24l56R5L69m82M10n56K59k31P23j187J161q7
$$ 194 -133 -96 422 439 244 770 768 622 98 -258 -163 206 -276 134 -422 -163 -394 329 -858 303 216
6424B16j67P43p56n0m03M48J61l96J55L52n90k22N62O90j134O31n55l06M68M4
$$ 216 49 792 36 -14 -417 31 192 -204 -49 303 -287 -509 53 743 -391 240 -315 -621 -153 -109
6444a09J81p06n60P63M01Q59m00l99n47j52J42l62J040L60o94J4M95K02m83M52
$$ -109 72 -634 -1194 -431 -30 829 429 30 -517 -669 -527 -889 151 511 -183 -169 326 528 45 497
6464D97o76M86l4j320J276o18L89L57j52J3j157J649q28K2m7J49m95K77J63L17
$$ 497 -179 307 273 -1047 229 -389 0 357 205 218 -939 710 -118 -96 -143 6 -489 -212 -49 268
6484B68j322Q59j23M32o74J12R34q38oK48K47J2K47q40M08n78L50l08p45J061
$$ 268 -1054 -195 -318 114 -560 -448 486 -352 -358 -110 137 149 396 -444 -36 -614 -264 -572 -1317 -256
6504b56k18N8Q74p77K49Q05j9p8q83j56j5K66L76J93m89k4N29n50m16Q1J40m4
$$ -256 -474 -416 458 -319 -70 735 716 638 -245 -401 -416 -150 226 419 -70 -94 435 -115 -531 -450 -310 -354
6526c54K07P76k009Q76P82j400J606o93m76J085k41j04K76j415Q65O31l42K66
$$ -354 -147 629 -1380 -504 278 -1122 484 -209 -685 400 159 55 331 -1084 -219 412 70 336
6544C36Q7p10N75j091J061K42q95J91K90k03K47l07Q9o05J429P6J90n74j345R40
$$ 336 423 -287 288 -803 258 500 -395 -204 86 -117 130 -177 -88 -693 736 812 1002 428 -917 23
6564B3K7M72q66M30L90j042J99k92J068n74M93O6p74J464j156l67L83j039L22
$$ 23 50 522 -344 86 476 -566 -367 -659 409 -165 328 394 -380 1084 -72 -439 -56 -1095 -773
6583g73O73k3L86J90o64M16l93j69l91M76L58K52o26Q4K37n37L13L83K82R2l72
$$ -773 -100 -123 263 453 -211 205 -188 -357 -748 -272 86 338 -288 -204 33 -504 -191 192 474 566 194
6604A94L4r67L01j7M98p18J37P53n87K21K48L16m02K35o04k89O71O0k36L6l98
$$ 194 228 -739 -438 -455 43 -675 -538 215 -372 -151 97 413 11 246 -358 -647 24 84 -152 -116 -514
6625e14M74N09p74L87L51j224N42j86l45J07r6O19M40k70k90j82K35l06O65m04
$$ -514 -40 469 -305 82 433 -791 -249 -435 -780 -673 -769 -150 290 20 -270 -452 -217 -523 142 -262
6645b62L62J96J80n19K90o02k3P49o77j41P07J51n08l17J074j338M15N22j210
$$ -262 100 296 476 -43 247 -355 -378 371 -306 -447 260 411 -97 -414 660 -678 -263 259 -951
6664i51M33K28n50J141J7m9j079M00N10L95j113Q25M41k66o8k26k32L17n36j06
$$ -951 -518 -290 -840 301 318 269 -810 -410 100 495 -618 207 648 382 314 88 -144 173 -363 -469
6684d69L95o9K65j0M23j646J190k99q05J138o51L88r7J78k10P51o76r01P30qO22
$$ -469 -74 -143 122 112 535 -1111 79 -220 -1025 113 -538 -150 -247 -69 -279 472 -204 -1105 -375 -383 239
6705B39m55Q64K05l90j95k24p14J446n58L34n28j047O31N49k22P4N59j311R46
$$ 239 -216 648 853 463 268 44 -670 776 218 552 24 -1023 -392 157 -65 9 568 -743 203
6724B03j82M77m91R58j530M43nO73l68l68L97m79l72J38N77L62n66J25q9o10J242
$$ 203 21 498 7 965 -565 -122 -127 546 178 -190 207 -272 -644 -506 71 433 -133 -8 -97 -707 535
6745E35J1j63q28N77R5q28L75O31p83l59P37J726j512q04O26L88n35J90lm80R89
$$ 535 546 383 -445 132 227 -601 -226 405 -378 -737 0 1726 214 -590 36 424 -111 79 76 -404 585
6766E85o65p81K84N79m97p33Q7J126j208J628q41J71N51M32j025K94q48J508p46
$$ 585 -80 -861 -577 2 -495 -1228 -1141 -15 -1223 405 -436 -265 286 718 -307 -13 -861 647 -99
6785i9M0N36n0l82j88P00j125J283j308J000r27Q09j427J006q24J570p65j362
$$ -99 -59 477 427 45 -143 557 -568 715 -593 407 -520 289 -1138 -132 -956 614 -151 -1513
6803a513J157Q72j892J693O80L16j266j126J826o20O2N30j170M03k79P47r66K55
$$ -1513 -356 516 -1376 317 997 1313 47 -1079 747 127 189 719 -451 -48 -327 420 -546 -291
6821b91n08K62K59P09m59o75O01n43M55k49O48l96L70q66Q41k56o64J278K89o37
$$ -291 -799 -537 -278 431 -28 -703 -102 -645 -190 -439 209 -187 183 -683 158 -98 -762 516 805 168
6841A68k33R2n32K40J82J91l03O30p95j34J185p62k77j02r5J89K56M81j524L56
$$ 168 -65 27 -505 -265 -83 108 -195 435 -360 -494 691 -71 -348 -450 -545 -356 -100 381 -1143 -787
6861g87K81K58J147j215J42R0K76l05P13r42R04q2j269J283p1J24q09k17J232
$$ -787 -506 -248 899 -316 -174 -84 192 -113 600 -342 562 480 -789 494 423 547 -262 -479 753
6880G53j413O07P61q01M51n90M0J39NR2n38P25l08q33J513q32L49j23q3k28L67
$$ 753 -660 -53 708 -93 358 -232 -192 -53 -48 44 -494 231 -77 -910 603 -229 120 -3 -86 -314 53
6901E3K62m13l56j12J653r63r72J50P25J30l37N14n10R81q94L29m51K42J09N60
$$ 53 315 -98 -454 -566 1087 124 -848 -698 27 157 -180 334 -176 805 -89 240 -211 31 140 700
6921G00N90j239l49l48N82L26j076J9J040q48J005n08L87k10j297J544L79q40
$$ 700 1290 51 -298 -646 -64 262 -814 -795 245 -603 402 -106 281 71 -1226 318 697 -143
6939a43Q0m58N82P48j398k37J360q36N08k54O3j238M98M09K43j24L94j129P75
$$ -143 -63 -521 61 809 -589 -826 534 -302 206 -48 15 -1223 -725 -316 -73 -197 197 -932 -157
6958a57j50q59R93J25n52N60R7o73O78N80r13M15p6n74J97j1L43k99N27N55q12
$$ -157 -307 -1166 -173 -48 -600 -40 57 -616 62 642 -271 144 68 -506 -309 -320 23 -276 251 806 -6
6979fJ61K08m35L32l98l7j15J1k50L17L07o34N88M11J25M47j193K85l34J126j114
$$ -6 155 363 -72 260 -138 -175 -290 -279 -529 -212 95 -539 49 460 585 1032 -161 124 -210 916 -198
7000a98P53j138Q29l18k28NM11n55O9M66q09K09J201l92j13j87p97J308q54M42
$$ -198 555 -583 246 -72 -300 -295 116 -439 -370 96 -713 -504 697 305 192 5 -792 516 -338 104
7020A04m76L25l12O11L0l53K55p69N58N48k92n96N3l96k78R17o82O18o73M87N71
$$ 104 -372 -47 -359 252 282 -71 184 -585 -27 521 229 -367 -314 -710 -988 -71 -753 -135 -808 -321 250
7041B50k44n91M85Q19r34o65Q52L24j080R27J60J07q3K36k65j14m60O84l97m14
$$ 250 6 -585 -100 719 -215 -880 -28 296 -784 143 303 410 327 563 298 184 -276 408 11 -403
7061d03K94L04j04r9L86o88m64l1J512p25l50K74P97r11J76j92P11q7L7p18P23
$$ -403 -109 195 91 -8 378 -310 -774 -805 707 -18 -368 -94 703 -208 -32 -224 487 400 437 -281 442
7082D42P0n56K99K74j175J123q03l07J262j258Q9K31k53N40J02MM64p62k05k57
$$ 442 512 -44 255 529 -646 477 -326 -633 629 -629 -540 -309 -562 -22 80 84 548 -214 -419 -676
7102f76J051K44j96J31m58Q3Qn33M75l83k36L66J56j37P5K1k18k23L49o73L82
$$ -676 375 619 423 554 96 179 187 -346 129 -254 -490 -124 32 -105 -30 -9 -227 -450 -101 -774 -392
7123c92O70j42n55K24n11O09K20m75J91qN81M14o32j54M40p58j7M89k42m48O53
$$ -392 278 136 -419 -195 -706 -97 123 -352 -161 -169 412 826 194 40 480 -278 -295 194 -48 -496 157
7144A57l23j48K94J14o14J29R10n54j04M15J03m38K62k55k44J6O39J95m07O85
$$ 157 -166 -314 -20 94 -520 -391 519 -35 -139 276 379 -59 203 -52 -296 -280 359 554 147 832
7164H32o26J99P3p65J4j32k37Q59l41j14oJ62L32j12m4p84O56J72q58K89m95Q22
$$ 832 206 405 478 -287 -273 -405 -642 217 -124 -238 -244 -82 250 138 94 -690 -34 138 -720 -431 -926 -104
7186a04q3M90j3r3M93r35Q28o78n69O93j13Q2k85j32Q08pm16K17p13N54m27M22
$$ -104 -187 303 290 197 690 -245 583 -95 -664 29 -84 -2 -287 -419 389 382 -34 183 -530 24 -403 19
7208A9q17P01o30J189l80J31K94k90j77O54l99j29L69p48K73o0r6P88r39N41l16
$$ 19 -798 -97 -727 462 82 213 507 217 40 694 295 166 535 -213 60 0 -96 692 -247 294 -22
7229b2L29k16k52J34P5m85K28K21K80J82M05j326k65J027o06N48j21n62R97j136
$$ -22 307 91 -161 -27 48 -437 -209 12 292 474 879 -447 -712 315 -291 257 136 -426 571 -565
7249e65K24L04r1J17l26j00J231j156n18P93m09J45O62j048O34P94p45o5N59m5
$$ -565 -341 -37 -128 -11 -337 -437 794 -362 -880 -87 -496 -351 311 -737 -103 691 -54 -119 440 395
7269C95K82m89J04l3o6L38j37j76p05K15P22j115L51M21J95j64O55p66p47J065
$$ 395 677 188 292 259 193 531 394 218 -487 -272 450 -665 -314 107 302 138 793 27 -720 345
7289C45lj37j54Q6l40q8m40J383k78n34L32l9o95Q95l2j34n01L78o67J290j111
$$ 345 342 205 51 137 -203 -291 -731 652 374 -160 172 133 -562 333 301 167 -334 44 -623 667 -444
7310d44L99K41j357J662q73M59K13M31j238Q71p22n37L85m23J112n66O9K44j65
$$ -444 -45 196 -1161 501 -372 87 300 731 -507 364 -358 -895 -510 -933 179 -387 -318 -74 -239
7329b39j03J19J101o76l10N17p88J67L17j25l9j67Q14k80K41o12k76q4N62m4k12
$$ -239 -342 -223 878 202 -108 409 -379 -212 105 -20 -59 -226 588 308 549 -63 -339 -423 139 95 -117
7350a17K99j140J101m54P04p96M61J0m91M67k92J61k88kO88J32j485l85J258M02
$$ -117 182 -958 143 -311 393 -403 58 68 -423 44 -248 -87 -375 -377 311 443 -1042 -1427 -169 233
7370B33K37mq92K83M29j71j58J23k37k47O70l72M37p02N20K71r85L17P3N38l70
$$ 233 470 466 -426 -143 286 115 -43 80 -157 -404 266 -106 331 -371 149 420 -565 -248 -175 363 -7
7391gj57n51Q22k70R5k44O2L88o5J07l98N67n01L64j43K67n52L50m35N50n55j32
$$ -7 -164 -715 107 -163 -68 -312 -250 138 73 180 -218 349 -152 212 69 336 -216 134 -301 249 -306 -438
7413d38L14k51K49Q9o17Q46o85O95k56K00m67K43O11l93l93M23L9j31Q5K50k93
$$ -438 -124 -375 -126 -37 -654 192 -493 202 -54 146 -321 -78 533 140 -253 170 209 78 163 413 120
7434A20M44n85M1L69n74K10P9j24j62N21l12j00P19n30m7J96m78j18M79j38Q4
$$ 120 564 -21 20 389 -185 25 104 -20 -182 339 27 -73 646 116 69 265 -213 -331 148 10 94
7455I4k71K35l77O53j11m07k52K00k50K5O49m86Q0j27JQ94q64JL56K24k48J48
$$ 94 -177 58 -319 334 223 -184 -436 -236 -486 -461 188 -298 -218 -345 -344 550 -314 -313 43 267 19 167
7477A67m77M51N7N86m09Q8k79r3L27N2L04q03l1J43q9J80k78K57r3o95P45n05
$$ 167 -310 141 198 784 375 463 184 91 418 470 774 -29 -60 83 -6 174 -104 153 60 -635 110 -395
7499c95J31R5j20O22n73L46L46L0n31L62K7m54K46k36K82N70p81O91m88k16P36
$$ -395 -264 -169 -289 333 -240 106 452 482 -49 313 340 -114 132 -104 178 748 -33 658 170 -46 690
7520F90m63n31J43O74l75K81o13j58L91L0r4J97l40M18K55n62K34j94r5L48K58
$$ 690 227 -304 -161 513 138 419 -194 -352 39 69 -25 172 -168 250 505 -57 177 -17 -112 236 494
7541D94p67M97l75l9J21K83J6l10k90N61q8j44J27J69j95m96K41K5K10N02n9n7
$$ 494 -273 224 -151 -190 -69 214 230 -80 -370 191 103 -41 86 255 60 -436 -195 -170 40 542 483 426
7563D26p72J64M46k08K27o30L70M57j92m75l52O22O2l66L33p5j11k84O4J03L16
$$ 426 -346 -182 264 56 283 -347 23 480 288 -187 -539 83 145 -221 112 37 -74 -358 -294 -191 125
7584A25k10N3K28l95l7q3O89m07J98J64k9n65N00l62J64J69k21k28O2mM1o0L52
$$ 125 -85 -32 196 -199 -236 -319 370 -37 161 325 296 -269 231 -131 33 202 -19 -247 -185 -189 -148 -208 144
7607A44r29R13k36K12k55k22ON70M7j58j50K72J90M28r36%M3N7L29m81R3P3n8
$$ 144 -785 128 -108 104 -151 -373 -367 203 250 92 -58 214 404 832 -104 -104 -61 -4 325 -156 -63 10 -48
7630d8m28L67P74r26L57l67M0J33j77R24r38k36J106q38m95R62M6j93J36L34l75
$$ -48 -476 -109 665 -261 96 -271 -231 -98 -275 649 -289 -525 581 -257 -752 210 256 63 199 533 158
7651A58l44j07L74m13R10r55J096o41m99L29q9j202J492o78j35Q39Q7l99N64j76
$$ 158 -186 -293 81 -332 578 -377 719 78 -421 -92 -181 -1383 109 -569 -704 135 222 -177 387 211
7671B11N7k20k34P72m78q71N64J38l25J063m07j34l00N09p46Oj9R1n56J534k86
$$ 211 268 48 -186 586 108 -763 -199 -61 -386 677 270 136 -164 345 -401 -395 -414 -323 -879 655 369
7692C69o30L44j38N53k76M36l71K4k24k98N35k92O24j005P95r76J263l38n57R0
$$ 369 -261 83 -55 498 222 658 287 311 87 -211 324 32 656 -349 446 -530 733 395 -162 -72
7712g2qo48R61n86J008j749L32M63L39o65K61M87m51Q83q68K23L67o18O80J34
$$ -72 -80 -728 233 -353 655 -1094 -762 -299 40 -625 -364 123 -328 555 -313 -90 277 -341 339 473
7732D73j120M14k66l7N94N26l17l3p10L86k20Q9K40M71K6m73N83k96o77Q60n52
$$ 473 -647 -233 -499 -536 58 584 267 234 -476 -90 -310 -221 19 490 516 43 626 330 -347 513 -39
7753c9k83m3L03M1o54K5J127l85J19k47Q2K37n63J58q46R37l3M33p38M92R37n49
$$ -39 -322 -365 -62 -21 -675 -650 477 92 211 -36 46 283 -280 -122 -968 -31 -64 369 -369 123 1060 511
7775E11j232P93M00p83K52P65n74N60m56j71m04K68m97M66j29K18M45m55k02L25
$$ 511 -721 72 472 -311 -59 706 132 692 236 65 -339 -71 -568 -102 -231 -13 432 -23 -225 100
7795A00O17o92k01k57P77j17n23l45O80M03p19L31N2K8m72N01l90R97j074m62
$$ 100 717 25 -176 -433 344 227 -296 -641 39 442 -277 54 106 134 -338 163 -227 770 -304 -766
7815g66O48Q33o80l25N09K24o64k83L03n47M51K73P0k31m04Q02n85J066r60J273
$$ -766 -118 715 35 -290 219 443 -221 -504 -201 -748 -297 -24 46 -185 -589 213 -372 694 -266 1007
7835A007j816J227J11l32N49o03k00n61R00r32P57K14n96K17l0M89j18k19q0j02
$$ 1007 -809 418 529 197 746 143 -57 -618 282 -650 107 321 -275 -58 -88 401 283 64 -16 -118
7855a18K72m63k16J92L21l2m05N78oj088P67R35m76k04O46l26p74L00L38p40P8
$$ -118 154 -309 -525 -333 -12 -44 -449 129 123 -965 -198 737 261 57 703 377 -397 -97 241 -499 -421
7876d21L59o40M27O89m39n87J168j096N58M00j31J80j80P95j374j71j7O51P86
$$ -421 -62 -702 -275 414 -25 -612 556 -540 18 418 287 467 287 1082 -292 -463 -480 171 957
7895I57j232R18m04K54j014L67N14k08p36Q62M4m87P4N1l1OM54l99L02k93K8o99
$$ 957 -275 643 239 493 -521 -154 360 152 -584 278 322 -165 -91 -40 -71 -65 389 -10 292 -1 27 -672
7917f72P06P01j061M93O23n80L79o92K3J40M0N4K08L78r12j59N93J35m10j10M20
$$ -672 34 735 -326 167 790 210 589 -103 -80 60 100 154 362 740 -172 -331 262 397 -13 -123 297
7938B97J20o20J029o8J53j576M72N4M44r55J084n41k91K95J91l19k53N82Q56j048
$$ 297 417 -203 826 758 911 -665 -193 -139 305 -650 434 -107 -398 -103 88 -231 -484 98 954 -94
7958i4M30q73M88K34M02r33J21o33J388o36n2R43o52n10j12q4J580j728L72J290
$$ -94 336 -537 -49 185 587 -346 -225 -858 530 -106 -158 785 133 -377 -489 -573 1007 -721 -349 941
7978I41j097O12l07m3P4L35j117R82j133N55q7J079j100N80L3p16P58k16q08J543
$$ 941 -156 456 149 106 180 515 -602 380 -753 -198 -285 794 -306 274 307 -409 349 133 -675 868
7998H68p76k77L40k19J92J18J7K9L34r17O98m80L32N9j272J414n77Q92N2j155
$$ 868 92 -185 155 -64 128 246 263 292 626 -291 407 -73 259 318 -954 460 -117 775 827 -328
8018c28K16J07M35J04m57K68j29k11l21K35J241q32j33l47M14K41j003O92l13
$$ -328 -112 -5 430 534 77 345 216 5 -316 -81 1160 328 195 -152 262 503 -500 192 -121
8037a21k42K04l06Q52l44J74J91q16R39P2J23j046m38J615o61k56K52J91k57o04
$$ -121 -363 -159 -465 387 43 217 408 -408 531 603 726 -320 -758 857 196 -60 192 383 126 -478
8057d78K38k53M94L7Q45j109K60k45Q30l86J20n00L62j86L81j024J417l11p79
$$ -478 -240 -493 1 38 883 -226 34 -211 619 233 353 -147 215 29 410 -614 803 492 -287
8076b87K09J30k84J105j418N77M10K33o72p99M92O63p12L84J65K54o06K92o40
$$ -287 -78 52 -232 873 -545 32 442 675 3 -796 -304 359 -353 31 196 450 -156 136 -504
8095e04J63Q90j103M62O0L95K39K46p30J78k56k98J52K55J71J36L24l71j68ko13
$$ -504 -341 549 -554 -92 -32 363 602 848 118 296 40 -258 -106 149 320 456 780 409 241 239 -374
8116c74q1P91o62P2p86J023m60oR94m84P03J18o65n12J339p06r59Q84k83k38J20
$$ -374 -455 336 -326 -254 -1040 -17 -477 -483 511 27 730 848 183 -329 1010 304 -655 229 -54 -292 -172
8137a72J41R14q29n56O15n2L79j51n42M14l0K83r96J345j041l05M74O28m51l04
$$ -172 -31 883 54 -502 113 61 440 289 -253 161 131 414 -582 763 -278 -583 -109 519 68 -236
8157b36R75j029N78m87q4L67l30M12k87K16J25p10J036j293R93M87j129P44J88
$$ -236 739 -290 288 -199 -283 84 -246 166 -121 95 220 -490 546 -747 246 733 -396 348 536
8176E36L79j435J085j45M3l43L43q89K48N59n51M51j148R60p09
$$ 536 915 -520 565 420 463 120 463 -426 -178 381 -170 281 -867 93 -616
8191f16
$$ Imaginary data points
##PAGE= N=2
##DATA TABLE= (X++(I..I)), XYDATA
0@%%%%%%%%%%%%%%%oJ4j6J6j6J6k0K8l2L5m3M9n7O7p5Q7r9J11j26J42j60J81k02
$$ 0 0 0 0 0 0 0 0 0 0 0 0 0 0 0 0 -6 8 -8 8 -8 8 -12 16 -16 19 -24 25 -32 35 -40 47 -52 59 -67 75 -85 96 -106
38a06K25k51K79l11L45l81M22m67N14n65O23o88P57q33R18j012J118j239J375
$$ -106 119 -132 147 -164 181 -200 222 -245 269 -296 327 -361 396 -437 481 -531 587 -652 723
57G23j530J714j931K189k508K912l438M158n211O900j0029J7717p0877j07725
$$ 723 -807 907 -1024 1165 -1343 1569 -1869 2289 -2922 3978 -6051 11666 -59211 -166936
71a66936J48414J10678j7223k8778K9310j9513m0539K9801M9758m5894o0786L739
$$ -166936 -18522 92156 74933 46155 75465 55952 15413 45214 94972 49078 -11708 -7969
83g969J1211j8945K7871O6854j8237j12217l3970O6862K7895l3139j1594P271
$$ -7969 3242 -15703 12168 79022 60785 -51432 -85402 -18540 9355 -23784 -35378 -28107
95b8107k3235n218P1485N6885l5278m2648J3052K3890J0680J2589o216l9405k2462
$$ -28107 -51342 -56560 14925 71810 36532 -6116 6936 30826 41506 54095 47879 8474 -13988
108a3988K0184L642k3567J4201K4539k8062m5320Q951M6260O251l8965k2749M516
$$ -13988 6196 9838 -13729 472 25011 -3051 -48371 -39420 6840 13091 -25874 -48623 -44107
121d4107J3786K8414J4042k4058k2058K9274L5662k6911k9208M1014L1915l3117
$$ -44107 -30321 -1907 12135 -11923 -33981 -4707 30955 4044 -25164 15850 47765 14648
133A4648k3256K8987J7065l0208j2862J9242j2439l0227J3726K2103j6239j8185
$$ 14648 -8608 20379 37444 7236 -5626 13616 1177 -29050 -15324 6779 -9460 -27645
145b7645K0614J6306k6091j3383K8451R611k0629M108K0510j0176k5777K4295
$$ -27645 -7031 9275 -16816 -30199 -1748 7863 -12766 -8658 11852 1676 -24101 194
157A94M6927j3848m4612N395L0868L341j6373n620q960k0138K01J5066l471n006
$$ 194 47121 33273 -11339 -5944 24924 28265 11892 6272 -2688 -22826 -22625 -7559 -11030 -16036
171a6036J2052N84j9025m605L2123K6793j9138k9448L654K2913K0599P487p288
$$ -16036 -3984 -3400 -22425 -27030 5093 31886 12748 -16700 -13046 9867 30466 37953 30665
184C0665j4870j0440Q615J1580m526q380r577j8637j1733J2040J6525m372j8403
$$ 30665 15795 5355 13970 25550 21024 12644 3067 -15570 -27303 -15263 1262 -3110 -21513
197b1513n046J421k210J5298J8505n637k1293n313J8405K0248J2280K928j3863
$$ -21513 -26559 -25138 -27348 -12050 6455 818 -20475 -25788 -7383 12865 25145 28073 14210
210A4210j5535R910J9936m14k0754j5086O72n206j1910J1124J7490n782k2089
$$ 14210 -1325 8585 28521 28107 7353 -7733 -7061 -12267 -24177 -13053 4437 -1345 -23434
223b3434p118J2030J2180N240n05j4976j2942J5504K4097Q026n770J885N733l404
$$ -23434 -30552 -18522 -6342 -1102 -1607 -16583 -29525 -14021 10076 18102 12332 14217 19950 16546
237A6546O33J3600L634j5020j5882o814K342L057J820J176j2788j2194L007R235
$$ 16546 17179 30779 34413 19393 3511 -3303 -961 2096 3916 5092 -7696 -19890 -16883 -7648
251g648M151k450p141q554m087J1955J9218K538p591J437M357L237L378P774J552
$$ -7648 -3497 -5947 -13088 -21642 -25729 -13774 5444 7982 391 1828 6185 9422 12800 20574 22126
266B2126j1128j1540q0K628P044L320j1278j4997n083Q701R186o942q324k778
$$ 22126 10998 -542 -622 2006 9050 12370 1092 -13905 -18988 -10287 -1101 -8043 -16367 -19145
280a9145j971K042Q572J2346M074o009k250O021L843Q908L933p743j0809k616
$$ -19145 -21116 -19074 -10502 1844 5918 -91 -2341 3680 7523 16431 20364 12621 1812 -804
294h04P604O221J134k570o201j1120j240N466M837n523j2990m296J474M518R575
$$ -804 6800 13021 14155 11585 5384 -5736 -6976 -1510 3327 -2196 -15186 -19482 -18008 -13490 -3915
309c915P132k146l176k861O182Q553L858R70q338j1231K644J2332M495k475q998
$$ -3915 3217 1071 -2105 -4966 1216 9769 13627 14597 6259 -4972 -2328 10004 14499 12024 3026
324C026m600m272kO087R32p583q982n269L111R551P266K431o757n814M245Q444
$$ 3026 -1574 -5846 -5848 239 1171 -6412 -15394 -20663 -17552 -8001 -735 1696 -5061 -10875 -6630 1814
340A814Q162J964n343n331l222M541J0704M408q602p640m778m09L269L039k034
$$ 1814 9976 11940 6597 1266 -1956 2585 13289 17697 9095 1455 -3323 -3732 -463 2576 542
355E42r913p105J685N349P818M952l332o059l637N924J1395L974k925n571m259
$$ 542 -9371 -16476 -14791 -9442 -1624 3328 -4 -6063 -9700 -3776 7619 11593 8668 3097 -1162
370a162L076P662O386J740q150r816k116K094L498J111p106q998o140M473P974
$$ -1162 1914 9576 15962 17702 9552 -264 -2380 -286 3212 4323 -2783 -11781 -17921 -13448 -5474
385e474L884N16n133n464J520Q438P656L020n009l702n07N597P731M897l536p277
$$ -5474 -1590 -1074 -6207 -11671 -10151 -1713 5943 8963 3954 252 -255 5342 13073 17970 14434 7157
401G157n786n17M509L157j450q941q943k350N547N489P27q598o467l009L811R170
$$ 7157 1371 854 5363 8520 7070 -1871 -10814 -13164 -7617 -2128 -1401 -9999 -16466 -19475 -15664 -6494
417f494N853j816k504j475L690R479P127J021o367r180l44K966M734J798m918
$$ -6494 -641 -2457 -4961 -6436 -2746 6733 13860 14881 8514 -666 -1010 1956 6690 8488 3570
432C570p199l451K876O910K519m528q084q711k93N438M414L124k424l694N847
$$ 3570 -3629 -7080 -4204 2706 5225 697 -7387 -16098 -16391 -10953 -6539 -3415 -5839 -9533 -3686
447c686P628R797N832k303n888n306J3O080Q15m053n649o418K272N518N257j596
$$ -3686 3942 13739 19571 17268 11380 6074 6087 12167 12982 8929 3280 -3138 -866 4652 9909 8313
463H313o681p147l491P57J955K913l110m726l430M432J0206P461ol430k679p21
$$ 8313 1632 -5515 -9006 -8249 -6294 -3381 -6491 -11217 -14647 -10215 -9 7452 7446 4016 1337 616
479F16L273L661j415p635m813k026K209M600J985j524k868l294P68M247K412j143
$$ 616 3889 7550 6135 -1500 -6313 -8339 -6130 -1530 455 -1069 -3937 -7231 -6463 -2216 196 -947
495i47l286l914J36L177N818L586l75m075q96K358N802K588k558k261m281m89
$$ -947 -4233 -8147 -8011 -4834 984 4570 4195 120 -776 1582 7384 9972 7414 5153 872 383
511C83k75K111K972l195o358k663J367M741M694j203n240l878J593O382K658j978
$$ 383 108 2219 5191 1996 -4362 -7025 -5658 -917 3777 2574 -2666 -6544 -4951 1431 4089 2111
527B111j776l164r06K530O325N084L6o639k396J882M112L102l554o491q999k013
$$ 2111 335 -2829 -3735 -1205 5120 10204 10240 3601 1205 3087 7199 10301 6747 256 -8743 -10756
543a0756P208L875j281m542m257m05L599O431M661j884p745j085M407O625M024
$$ -10756 -3548 327 -954 -5496 -9753 -10158 -6559 -128 4533 2649 -5096 -6181 -1774 4851 8875
558H875J10k504m377m56O445N479k374r692p770j757K148L308m11m796o155j323
$$ 8875 8985 6481 2104 1648 8093 13572 11198 1506 -6264 -8021 -5873 -2565 -2976 -7772 -13927 -15250
574a5250L870O621J419k726j352j648l96Q036Q536K088n663m067M276N934K624
$$ -15250 -11380 -4759 -3340 -6066 -7418 -9066 -9462 -1426 7110 9198 3535 -532 3744 9678 12302
589A2302o26n000o056k850R56N366j4m766l867j756R28K470L617j25m674o148
$$ 12302 11676 6676 620 -2230 -1274 4092 4078 -688 -4555 -6311 -5383 -2913 704 579 -4095 -10243
605a0243L842N030K904K870l38j131j030K984P215K521o484n867k687K899J794
$$ -10243 -6401 -1371 1533 4403 4065 2934 1904 4888 12103 14624 8140 2273 -414 2485 4279
620D279k777J189k998l543j379J862K561Q55l515m361l338R10N164M296p39m024
$$ 4279 1502 2691 -307 -3850 -5229 -3367 -806 49 -3466 -7827 -11165 -10255 -5091 -795 -1534 -5558
636e558K64N481M268N21R96J67l045l538K098M200J003n218j689r89k225J171
$$ -5558 -5294 187 4455 4976 5972 6139 3094 -444 1654 5854 6857 1639 -50 -1039 -3264 -2093
652b093J982J580m197n728o14L731K411J187l88j533j496M699M709N26p67R2L10
$$ -2093 -111 1469 -2728 -8456 -9070 -5339 -2928 -1741 -2129 -3662 -5158 -459 4250 4776 4009 4101 4411
669D411k259M62M021K861l017p742j841K566K466Q17l825m674k307m90M194M159
$$ 4411 2152 2614 6635 9496 6479 -1263 -3104 -538 1928 2745 -1080 -5754 -8061 -8551 -4357 -198
685a98m60j237o20Q0O21L780L879m35n880n81J851N559K081k476l601l140r50
$$ -198 -658 -1895 -2515 -2435 -1814 1966 5845 5410 -470 -1051 800 6359 8440 5964 2363 -777 -1727
702a727K544K042n13m378n691k21M155J691N98q57p56j999J46N698N014k524l266
$$ -1727 817 2859 2346 -2032 -7723 -7944 -3789 -2098 -1500 -2357 -3113 -5112 -4966 732 5746 3222 -44
719d4j129n91M562N228J269o022l400j468M472r46K31j903m949k392K71K704M747
$$ -44 -1173 -1764 2798 8026 9295 3273 -127 -1595 2877 1931 2162 259 -4690 -7082 -6811 -4107 640
736F40k053l279k145L27N168L507J802j816n131K199L949L869J641j968k801k469
$$ 640 -1413 -4692 -6837 -6510 -1342 2165 3967 2151 -2980 -781 3168 7037 8678 6710 3909 1440
752A440j996M176K585l965n013l694M63J534L570q15j415l987k114L868M930K851
$$ 1440 -556 3620 6205 2240 -2773 -6467 -6004 -4470 -900 -1715 -3130 -7117 -9231 -5363 -433 2418
768B418l554k689J68K560N982L679q76k371k979LK735P78K27m552m122k584L01
$$ 2418 -1136 -3825 -3657 -1097 4885 8564 7688 5317 2338 2341 5076 5854 6081 1529 -2593 -5177 -4876
785d876L030J099k691m142o13J66K990L080l09J35k958J636M353M892K085j615
$$ -4876 -1846 -747 -3438 -7580 -8193 -8027 -5037 -1957 -2266 -2131 -5089 -3453 900 5792 7877 6262
801F262l121l67J460J746K112l188k272k608j270J168J315P91m277l663p72J086
$$ 6262 3141 2774 4234 5980 8092 4904 2632 24 -1246 -78 1237 2028 -2249 -5912 -6684 -5598
817e598K440J84l23j633Q70M42M476L646P20j110k866N87K710K809o18k762m197
$$ -5598 -3158 -2974 -3297 -4930 -4060 -3618 858 4504 5224 4114 1248 1835 4545 7354 6736 3974 -223
834b23o7J723r0K772k604l589k596l90O92J337q82k127k617k09M219K641L557
$$ -223 -290 1433 1343 4115 1511 -2078 -4674 -5064 -4372 -3035 -3917 -6044 -8661 -8870 -4651 -2010 1547
851A547M94k292J96K606J630L001j816m005n86p68J233K707m08l359k144j086
$$ 1547 2041 -251 -55 2551 4181 7182 5366 1361 775 7 1240 3947 3539 180 -1964 -3050
867c050J226J724j49k585k015j706M38M424K692Q52k244m14J569K509L488r6j197
$$ -3050 -1824 -100 -249 -2834 -4849 -6555 -6117 -1693 999 1851 -393 -807 762 3271 6759 6663 5466
884E466k720q27J181J263k29j593l595j358j227K171J754j027j948k312k08L836
$$ 5466 2746 1919 3100 4363 4134 2541 -1054 -2412 -3639 -1468 286 -741 -2689 -5001 -5209 -1373
900a373K07J712j565j387K91K172K373K769j661n06j947J359K337L36j697k245
$$ -1373 -1166 546 -1019 -2406 -2115 57 2430 5199 3538 3032 1085 2444 4781 5117 3420 1175
916A175m074j636K077J861j707r83k382j436K274K482J323j161r95j74J435J599
$$ 1175 -2899 -4535 -2458 -597 -2304 -3287 -5669 -7105 -4831 -2349 -1026 -2187 -3182 -3356 -1921 -322
932c22K696J237j086p15q97K837J909J37j813l501q09k60J16L06k147k403j053
$$ -322 2374 3611 2525 1810 913 3750 5659 5796 3983 482 -327 -587 -471 -165 -2312 -4715 -5768
949e768l69K077K200K88k239l30J159L248J819J613J96k473N38J508K539K628
$$ -5768 -6137 -4060 -1860 -1572 -3811 -4141 -2982 266 2085 3698 3894 1421 1959 3467 6006 8634
965H634k088l041j287j376J138J307j009k761m142L12J132N06J696r92m297K83
$$ 8634 6546 3505 2218 842 1980 3287 2278 -483 -4625 -4313 -3181 -2675 -979 -1971 -6268 -5985
981e985J919K312K028N60q72j500J864L189J706J627j862k840j421K64N29J238
$$ -5985 -4066 -1754 274 834 -38 -1538 326 3515 5221 6848 4986 2146 725 989 1518 2756
997B756k555k148k380N40K230R58j136k811k121L78J832K401M93l80j269J451
$$ 2756 201 -1947 -4327 -3787 -1557 -599 -1735 -4546 -6667 -6289 -4457 -2056 -1563 -1943 -3212 -1761
1013a761K141J843L017j648j349j369P71J961R20j450k484j633j309K060O89m53
$$ -1761 380 2223 5240 3592 2243 874 1645 3606 4526 3076 592 -1041 -2350 -290 399 -54
1029e4j634j250j842J194J824P42q61k41k74j70L524L788K46j235k408J326K056
$$ -54 -1688 -2938 -4780 -3586 -1762 -1020 -1881 -2122 -2396 -2566 958 4746 4992 3757 1349 2675 4731
1046D731P5j104R89m604o79L25J189J299k603j521k332M29K393J090p87n49k590
$$ 4731 4806 3702 4691 87 -592 -267 922 2221 -382 -1903 -4235 -3806 -1413 -323 -1110 -1659 -4249
1063d249R66J496K525K060j061k895N17J345K340J131j92j807j918k030K148J370
$$ -4249 -3283 -1787 738 2798 1737 -1158 -641 704 3044 4175 3983 2176 258 -1772 376 1746
1079A746j360j468l296j229J383M06L133j514k206K28K246J990L193j391L22k577
$$ 1746 386 -1082 -4378 -5607 -4224 -3818 -685 -2199 -4405 -4177 -1931 59 3252 1861 2183 -394
1095c94j007K562J701J145j058j486j129K34P99K005k736k301k507k78K201K076
$$ -394 -1401 1161 2862 4007 2949 1463 334 568 1367 3372 636 -1665 -4172 -4450 -2249 -173
1111a73j329q56j768L16K206J039K063j276j346O11J352J704J760M36j111k059
$$ -173 -1502 -2358 -4126 -3810 -1604 -565 1498 222 -1124 -513 839 2543 4303 4739 3628 1569
1127A569o05K685O86p62k700k061q35M37n83L25o3k174q06K46J951J698J284k913
$$ 1569 964 3649 4335 3573 873 -1188 -2023 -1586 -2169 -1844 -1907 -4081 -4887 -4641 -2690 -992 292 -2621
1145b621M74R2M120J280J117j772p51L90J191J6ro36k618q00J9j29k67l90j325
$$ -2621 -2147 -2055 2065 3345 4462 2690 1939 2329 3520 3536 3527 2891 273 -527 -508 -637 -904 -1294 -2619
1164b619n58j396O19K110M38j234j344L74J865J806K303P97r39j233J794R84J291
$$ -2619 -3177 -4573 -3954 -1844 -1406 -2640 -3984 -3610 -1745 61 2364 3161 2222 989 2783 3767 5058
1181E058j814j023m96k929Q62J608k14p02k741j201K183q55L86K45k303m19J940
$$ 5058 3244 2221 1725 -1204 -342 1266 1052 350 -2391 -3592 -1409 -2264 -1878 -1633 -3936 -4355 -2415
1198b415J827L31J193q16O99r10J061J416J194p6j831o90L98K55n40R4j579j576
$$ -2415 -588 -257 936 120 819 -91 970 2386 3580 3504 1673 983 1381 1636 1096 1190 -389 -1965
1216a965j238O62J806n64j434j256l68J795M84K506l50j087K86N37J504J050M66
$$ -1965 -3203 -2541 -735 -1299 -2733 -3989 -4357 -2562 -2078 428 78 -1009 -723 -186 1318 2368 2834
1233B834n87q80o26M94J150M11k671r93l93Q14m2K70p19k456k70J066M68J542
$$ 2834 2247 1367 741 1235 2385 2796 125 -868 -1261 -447 -489 -219 -938 -3394 -3664 -2598 -2130 -588
1251e88N2l22l05J14J708J312R54k14j849r73K310L13M04o56j219r55j883K187
$$ -588 -536 -858 -1163 -1049 659 1971 2925 2711 862 -111 2199 2512 2916 2260 1041 86 -1797 390
1269C90k67j95l147k64k7J580M25Q71n75j035k51J019J952J395m26m63j04k97
$$ 390 123 -72 -3219 -3483 -3510 -1930 -1505 -634 -1209 -2244 -2495 -1476 476 1871 1445 982 878 581
1287E81J658k0L1j160p77j395Q95m11M34n05k718j372J135J332J449o75j882J573
$$ 581 2239 2219 2250 1090 313 -1082 -187 -598 -164 -669 -3387 -4759 -3624 -2292 -843 -1518 -3400 -1827
1305a827q7Q73K690N84m90r82R68P94J078O25l47k074j518L66P04j24j200j112
$$ -1827 -1914 -1041 1649 2233 1743 761 1729 2523 3601 4226 3879 1805 287 653 1357 1233 33 -1079
1323a079r81r97P35Q72j05o28p31m16J395J077J405l77k94K53R57J861R94L9j707
$$ -1079 -2060 -3057 -2322 -1450 -1555 -2183 -2914 -3330 -1935 -858 547 170 -124 129 1086 2947 3941 3980 2273
1342B273M73j833R36J235j953o94j301j560N5P57J056j196k867K62L59N03K198
$$ 2273 2746 913 1849 3084 1131 437 -864 -2424 -2369 -1612 -556 -1752 -4619 -4357 -3998 -3495 -1297
1359a297J49n65K05M54K673J226KM1n38m92N3J093R55r32k734p87j015M96J152
$$ -1297 -1148 -1713 -1508 -1054 1619 2845 2847 2888 2350 1858 1911 3004 3959 3027 293 -494 -1509 -1013 139
1378A39r13j055j459o83N62J582J79p49L42J02J217J295J815k01j349K13n90J562
$$ 139 -774 -1829 -3288 -3971 -3409 -1827 -1648 -2397 -2055 -1953 -736 559 2374 2173 824 1037 447 2009
1396B009J890r89k41j773j863O39J082m15K1k381m79R27K31L34p20O11j826J023
$$ 2009 3899 2910 2669 896 -967 -328 754 339 360 -2021 -2500 -1573 -1342 -1008 -1728 -1117 -2943 -1920
1414a920R64J816R49k15j139P03J037J235q56J77o57j888O7J150j083R06j932
$$ -1920 -956 860 1809 1594 455 1158 2195 3430 2574 2751 2094 206 273 1423 340 1246 -686
1431f86j843k60LJ021O98N1j498m38Q92K043n5l47K48o66M68P87K154M59j431
$$ -686 -2529 -2789 -2786 -1765 -1067 -1016 -2514 -2952 -2060 -17 -72 -419 -171 -837 -369 418 2572 3031 1600
1450A600q91n83Q0K438o56j714j224j990L34J330K78j12j261K90j570J667K217
$$ 1600 709 126 206 2644 1988 274 -950 -2940 -2606 -1276 -998 -1110 -2371 -2081 -3651 -1984 233
1467B33L51j15n47p81K504K6J275j30r93m81o1J131k59O2j639j502rq03N13J293
$$ 233 584 469 -78 -859 1645 1671 2946 2816 1823 1342 1281 2412 2153 2215 576 -926 -935 -1738 -1225 68
1487F8j551j454p00L29J370J828Q24j175l79r6K794k25M6J00j14M2m08J714j086
$$ 68 -1483 -2937 -3637 -3308 -1938 -110 714 -461 -840 -936 1858 1633 1679 1779 1665 1707 1299 3013 1927
1506A927j71j883n56n70L50R57j042j341j147m85J523J68O93o97K3M62R28K219
$$ 1927 1756 -127 -683 -1253 -903 54 -988 -2329 -3476 -3961 -2438 -2270 -1577 -2274 -2251 -1789 -861 1358
1524A358L23J08j461O29Q18R03m8K89r52j034p50r9M10l48j678n19j025l50J461
$$ 1358 1681 1789 328 957 1775 2678 2630 2919 1967 933 183 84 494 146 -1532 -2051 -3076 -3426 -1965
1543a965R92q5j564q61J204P94J790N72n69N42o8M73J845n63n07o47j411P90J309
$$ -1965 -973 -1058 -2622 -3483 -2279 -1485 305 877 308 850 782 1255 3100 2537 2030 1383 -28 762 2071
1562B071q94l14j429j245K89K03Q60q99K30j499L61n82K685J98k73n58P68N57
$$ 2071 1177 863 -566 -1811 -1522 -1319 -459 -1358 -1128 -2627 -2266 -2848 -163 35 -238 -796 -28 529
1580E29J164m92R74j545K05N24k57Q79k26j481q86r07J85J448n89j307m74q3l27
$$ 529 1693 1201 2175 630 835 1359 1102 1981 1755 274 -612 -1519 -1334 114 -475 -1782 -2256 -2339 -2666
1599b666J653K38P1N7M78p57J594O74R65q38k47j19L22j9L5o71j460m59N09N08
$$ -2666 -1013 -775 -704 -647 -169 -926 668 1342 2307 1469 1222 1103 1425 1406 1441 770 -690 -1149 -640 -132
1619a32m20n35j376K67L36O22K86P44J3o93m89J001J057Q77N09o39o28k61J103
$$ -132 -552 -1087 -2463 -2196 -1860 -1238 -952 -208 -195 -888 -1377 -376 681 1558 2067 1428 800 539 1642
1638A642m6J04j015K4p14o07J54J79j962j61l18N13L14J055n21Oq27J075O82J473
$$ 1642 1596 1700 685 709 -5 -612 -458 -279 -2241 -2402 -2720 -2207 -1893 -838 -1359 -1353 -2180 -1105 -423 1050
1658A050N51m64r69K62J205P89q24J80n39j099O38j62K8k30j788o99L38J8r4K17
$$ 1050 1601 1137 168 430 1635 2424 1600 1780 1241 142 780 618 646 416 -1372 -2071 -1733 -1715 -1809 -1592
1678a592l87K01l29J182R84J67L79k20J98P55K67Q99o3p70J31r94N65q7K7j313
$$ -1592 -1979 -1778 -2107 -925 59 226 605 385 583 1338 1605 2504 2441 1671 1802 808 1373 1286 1313 0
1698@j334K7Kl25O61p84r05J08K0J921J02N84k31K12l94J317J377J51n60m78n10
$$ 0 -1334 -1307 -1305 -1630 -969 -1753 -2658 -2550 -2530 -609 -507 77 -154 58 -336 981 2358 2509 1949 1471 961
1719I61o15J493J46o71j404j298N72L64j68m5r22q74j49R68R14K60j199M15K02
$$ 961 346 1839 1985 1314 -90 -1388 -816 -452 -620 -665 -1587 -2461 -2610 -1642 -728 -468 -1667 -1252 -1050
1738a050Q40J011O91M76q50j31O12K80K21k47j160j70r55Q85M69q54l63r53o11
$$ -1050 -210 801 1492 1968 1118 987 1599 1879 2100 1853 693 523 -432 453 922 68 -295 -1248 -1859
1757a859O8P34N27k21n47l46N70Q77N39N16k29m12K32N13Q31J61o05p70k95l03
$$ -1859 -1791 -1057 -530 -751 -1298 -1644 -1074 -197 342 858 629 217 449 962 1793 1954 1349 579 284 -19
1777a9P06L42q83p38q63J12N29L20k6o62n5n55R99O76Q06j13m87l31P64P08O22
$$ -19 687 1029 146 -592 -1455 -1343 -814 -494 -520 -1182 -1237 -1792 -793 -117 689 576 89 -242 522 1230 1852
1798A852l30o89n34m06L93M92O9p59r63l41l95M60N93l76r22m60N17O40J112J46
$$ 1852 1522 833 299 -107 286 778 847 88 -875 -1216 -1611 -1151 -558 -934 -1856 -2316 -1799 -1159 -47 99
1818I9k56O9K29M73R61L05l13k43p02r1Q33Pl01r57j058R0J78M28j38n65n86N
$$ 99 -157 -88 141 614 1575 1880 1567 1324 622 531 1364 1371 1070 113 -945 -855 -677 -249 -387 -952 -1538 -1533
1840a533K01J221P62o28J8m72P40J010M20P2l39n45Q3N11M7j12p86j72j333J60
$$ -1533 -1332 -111 651 23 41 -431 309 1319 1739 1811 1472 927 1010 1521 1568 1456 670 498 -835 -675
1860f75K08K9n31p73l15k14O97O60%m32j43O26P93M60J016p66J50q7L40P71k1
$$ -675 -467 -438 -969 -1742 -2057 -2271 -1574 -914 -914 -1346 -1489 -863 -70 390 1406 640 790 703 1043 1814 1793
1881A793j16j029m78k98L77j2m16m13r17J18Q7M78J5l39m91J85J61J084O80L12
$$ 1793 1677 648 170 -128 249 237 -179 -592 -1509 -1391 -1304 -826 -811 -1150 -1641 -1456 -1295 -211 469 781
1901G81n01k11R73K00P02J71p54k47l70j30O79o67n05p99k01j27J87J38j19l99
$$ 781 280 69 1042 1242 1944 2115 1361 1114 744 614 1293 626 121 -678 -879 -1006 -819 -681 -800 -1199
1921a199k53J00L94M65P51k06k28J60L92R79M23m53l43j59L09n1L05P0q37j115
$$ -1199 -1452 -1352 -958 -493 258 52 -176 -16 376 1355 1778 1325 982 823 1132 1081 1386 1456 619 -496
1941d96j12K94J12l92j68L8o75J44P00L45k06m85k39R28P73M10k4l74l8k07P9
$$ -496 -608 -314 -202 -594 -762 -724 -1399 -1255 -555 -210 -416 -901 -1140 -212 561 971 947 573 535 328 407
1962D07O00R8p28m17l86j12K01K5k05o46k70J83J78N51P3l14j95N23M16O97J44
$$ 407 1007 1105 377 -40 -426 -538 -337 -312 -517 -1163 -1433 -1250 -1072 -521 -448 -762 -957 -434 -18 679 823
1983H23l9k83J73K98K4K52k36k94q54L00K72L11l90r00o76j59K10Q28k3l86l70
$$ 823 784 501 674 972 996 1248 1012 718 -136 164 436 747 357 -543 -1219 -1378 -1168 -340 -363 -749 -1119
2004a119K07L82J112K02k62r3k86N70L35L47J45o82q01j22O2N76j53o55o90m44
$$ -1119 -912 -530 582 784 522 429 143 713 1048 1395 1540 858 57 -65 -3 573 420 -235 -925 -1369
2024a369L16j37K45J76n65k07L75K80P23M78J54k49qL64O54L6O1m11n07M59M63
$$ -1369 -1053 -1190 -945 -769 -1334 -1541 -1166 -886 -163 315 469 220 212 576 1230 1266 1327 916 409 868 1331
2045A331l16l57o74n00k37N9L4K03q24R8m79k4J121K93Q6r3q5O90O31J6M60k9
$$ 1331 1015 658 -16 -516 -753 -694 -660 -457 -1281 -1183 -1662 -1686 -565 -272 -186 -279 -364 326 957 973 1433 1404
2067A404m07Q4k14M18K21j147L3o63M85m0l49l84m02n35k02N82L21Q2L6n72J5
$$ 1404 997 1081 867 1285 1506 359 392 -271 214 174 -175 -559 -961 -1496 -1698 -1116 -795 -713 -677 -1249 -1234
2088a234R39P78K95K76n3n92J64Q08M8K35q44k94n35M12N9m56j11p71m82k76J494
$$ -1234 -295 483 778 1054 1001 409 573 1381 1429 1664 820 526 -9 403 462 6 -105 -876 -1358 -1634 -140
2109a40o92M11m57j84PQ03J72L24Q80r79L01L52L84j73J73q88J06p7K54J51l36
$$ -140 -832 -421 -878 -1062 -1055 -252 -80 244 1124 145 446 798 1182 1009 1182 294 400 323 577 728 392
2130C92o26N7m46M46M14q15J55p34k27P73K63R1O77o49j56N26M67K66N55p96l79
$$ 392 -234 -177 -623 -177 237 -578 -423 -1157 -1384 -611 -348 -257 420 -229 -385 141 608 874 1429 633 254
2151B54L34m15L63L89m81l08p36K02j46M29o53P5m02k34N33O35K4m8M6P42m49
$$ 254 588 173 536 925 444 136 -600 -398 -544 -115 -768 -693 -1095 -1329 -796 -161 -137 -185 -139 603 154
2172A54M97J18k8m33K91j54M52J65k53o05p54j6m90O43J2l85m87m13P69N2N36
$$ 154 651 769 741 308 599 445 897 1062 809 204 -550 -566 -1056 -413 -401 -786 -1273 -1686 -917 -865 -329
2193c29l56L60K53M95R36m23M97n59l45P43k06K96j6o19n20K30l53q6k33p52J64
$$ -329 -685 -325 -72 423 1359 936 1433 874 529 1272 1066 1362 1346 727 207 437 84 -2 -235 -987 -823
2214h23k76R2j87L70m02P19j078J410L97N32M98j004M0O34K80N19j09q68M38j154
$$ -823 -1099 -1007 -1194 -824 -1226 -507 -1585 -175 222 754 1252 248 288 922 1202 1721 1612 744 1182 28
2234B8m06L16k86N0l89k15l70j14O31L28o93L79q30P00O19P8K81M53n86Q27j03
$$ 28 -378 -62 -348 -298 -687 -902 -1272 -1386 -755 -427 -1120 -741 -1571 -871 -252 -174 107 560 -26 801 698
2255F98Q25m06k69M35m48r9K72o6m67n62p8l98N9j81J14L15p67o6P20L69k93L03
$$ 698 1523 1117 848 1283 835 736 1008 942 475 -87 -165 -563 -504 -685 -571 -256 -1023 -1089 -369 0 -293 10
2277A0K07p7K67N48N18o67o16L83K55J57j39r6n14qm32K51m74J89k27j009L50
$$ 10 217 140 407 955 1473 806 190 573 828 985 846 750 236 228 -204 47 -427 -238 -465 -1474 -1124
2298a124L74K86K86l01j10j42k65J331K58K95k94N38n39K75Q05q58k97o79L50
$$ -1124 -750 -464 -178 -479 -589 -731 -996 335 593 888 594 1132 593 868 1673 815 518 -161 189
2317A89j97n07M96k33m27m76m41O07N41k62j39K17O04p05J167P5R0m40P41j85
$$ 189 -8 -515 -19 -252 -679 -1155 -1596 -989 -448 -710 -849 -632 -28 -733 434 509 599 159 900 715
2337G15K21l3k36J6p27J81K03k42n38K74m45N83j002K06K26m2K16M00j25Q03N9
$$ 715 936 903 667 683 -44 137 340 98 -440 -166 -611 -28 -1030 -824 -598 -640 -424 -24 -149 654 713
2358G13l53N3J23m7k4J094q32l5n30K84m88N88l93n05O6q60J57O47Q52p15r25
$$ 713 360 413 536 489 465 1559 727 692 162 446 -42 546 153 -352 -286 -1146 -989 -342 510 -205 -1130
2379a130j3k05O05R32K26n25J24qQ62M24J78n47j60k34l40J95K12l70L00j128
$$ -1130 -1143 -1348 -743 189 415 -110 14 6 868 1292 1470 923 763 529 189 384 596 226 526 -602
2399f02m09K40O42j91o39o3J68J86J22O96j27j012J005O4L00P58rj40l88N00J40
$$ -602 -1011 -771 -129 -320 -959 -1022 -854 -668 -546 150 23 -989 16 80 380 1138 1129 989 601 1101 1241
2420A241k39J95q58J40j072J39K92M21q38r1k29k42M70k58J77N00n63R81l83R55
$$ 1241 1002 1197 339 479 -593 -454 -162 259 -579 -670 -899 -1141 -671 -929 -752 -252 -815 166 -217 738
2440G38m1k79r5L93M44l66O91k69m26n87K03L16j55m20n27n31N4N4j65L08k64
$$ 738 697 418 323 716 1160 794 1485 1216 790 203 406 722 567 147 -380 -911 -857 -803 -968 -660 -924
2461i24J50K70K24P15o18M24L34l14M93K36J94K90o84o86M17L55q13j06K7q68
$$ -924 -774 -504 -280 435 -183 241 575 261 754 990 1184 1474 790 104 521 876 63 -43 -16 -884
2481h84o4P95j14l40j96n4N58r64J140k04N77P33p27L21k42P50j06k70m76M34
$$ -884 -948 -153 -267 -607 -803 -857 -299 -1263 -123 -327 250 983 256 577 335 1085 979 709 233 667
2501F67j94j51K79j16n34n53J6K00M65l76m13N85n02k16J293J33p24L60M85n59
$$ 667 473 322 601 485 -49 -602 -586 -386 79 -297 -710 -125 -627 -843 450 583 -141 219 704 145
2521A45K82K01K39%l26Mr3j80L79m17K19k01m44L49M0o06j36n04P0Q63J79O9J97
$$ 145 427 628 867 867 541 545 452 272 651 234 453 252 -192 157 197 -409 -545 -1049 -979 -116 63 132 329
2544C29o43L89m93N34J90K48R03n41l46N71K4J36j212n7K3L6K46m28q04J83J1
$$ 329 -314 75 -418 116 306 554 1457 916 570 1141 1165 1301 89 32 55 91 337 -91 -895 -712 -701
2565g01n29O41M35m00j83N19n88P38M91L09M56l27r5l09J323q64l79n21M41k53
$$ -701 -1230 -589 -154 -554 -737 -218 -806 -68 423 732 1188 861 766 457 1780 916 537 16 457 204
2585B04q2P1L57j049N3n84J09J24O80j197P3N80k38J705m53j81Q64l94N75n31
$$ 204 122 193 550 -499 -446 -1030 -921 -797 -117 -1314 -1241 -661 -899 806 353 172 1036 642 1217 686
2605F86N82j069L17K61j24Kn61J080j316n10O96L8Q9n37k43j05j14K33o2N92n86
$$ 686 1268 199 516 777 653 655 94 1174 -142 -652 44 82 171 -366 -609 -714 -828 -595 -657 -65 -651
2626f51J357j589J425j10l51J707j159Q76n49J099j725M38n16Q99j323L89o3k5
$$ -651 706 -883 542 432 81 1788 629 1505 956 2055 330 768 252 1151 -172 217 154 129
2644A29l75l00l57N89J25o71L47l22J94r3L42J652q66P59k18r45Q72o72P59n84
$$ 129 -246 -546 -903 -314 -189 -860 -513 -835 -641 -734 -392 1260 394 1153 935 -10 862 190 949 365
2664C65o7j05K72m78o23j88O03J92q08R49r51O78l10p40M98M90k1K65N28m51K82
$$ 365 298 193 465 -13 -636 -824 -221 -29 -837 112 -839 -161 -471 -1211 -713 -223 -244 21 549 98 380
2685C80R69l23j96R5J20j482l19J114p41N10j449J189n51l65J057O3p73l09O3
$$ 380 1349 1026 830 925 1045 -437 -756 358 -383 127 -1322 -133 -684 -1049 8 71 -702 -1011 -948
2704i48J450r48n0Q45M04K87k98L69m99N71k21L21l69l20k78p3q6J59j090l58
$$ -948 502 -446 -496 349 753 1040 742 1111 612 1183 962 1283 914 594 316 243 157 316 -774 -1132
2724a132J089J71l27m61M39j361J006P21M11l84M71k90o05J325m85P25o96M53
$$ -1132 -43 128 -199 -660 -221 -1582 -576 145 556 172 643 353 -252 1073 588 1313 617 1070
2742A070J68p50m05Q29k41q29o07K90k34N17N73j124o23J82L23Q5O67p97P20N10
$$ 1070 1238 488 83 912 671 -158 -765 -475 -709 -192 381 -743 -1366 -1184 -861 -776 -109 -906 -186 324
2762C24K32M14n63R08r73J95K20j27K44o50j97O1K54m29p8j07p33N23j183M76
$$ 324 556 970 407 1315 342 537 757 630 874 224 27 88 342 -87 -165 -272 -1005 -482 -1665 -1189
2782a189R80N55p58j33J5R12m56J42M14n4L39K20n81O19l62M4N0r28N34m40L22
$$ -1189 -209 346 -412 -545 -530 382 -74 68 482 428 767 987 406 1025 663 707 757 -171 363 -77 245
2803B45m76l81K5j21N20l14j13L14j55N2rL66K27n42N52q9m15J028q4K59J51j161
$$ 245 -231 -612 -587 -708 -188 -502 -615 -301 -456 -404 -413 -47 180 -362 190 101 -314 714 630 889 1040 -121
2825a21J82N58k53k79M96r98l44k17j40Q16m9m82o2L87r7Q07j15n73M57K14L80
$$ -121 61 619 366 87 583 -415 -759 -976 -1116 -300 -349 -831 -893 -506 -603 204 89 -484 -27 187 567
2846E67O2J15K51p00M4m88L62K77m5k09m94m09Q21n41J64K8q78mP83j83P27n76
$$ 567 629 744 995 295 339 -149 213 490 445 236 -258 -667 154 -387 -223 -195 -1073 -1077 -294 -477 250 -326
2868c26K72k72N56q7O8N85m80K40K0p5J68n26L68n29k07k99R52n71m51j72N36
$$ -326 -54 -326 230 143 211 796 316 556 576 501 669 143 511 -18 -225 -524 428 -143 -594 -766 -230
2889b30p1n32L50O14j15n86J51N55N18j9j88j63M30k01m31M61n6l21m33K3L81
$$ -230 -301 -833 -483 131 16 -570 -419 136 654 635 447 284 714 513 82 543 487 166 -267 -244 137
2910A37k64m12K21l46p8K69L38l18J18j35j24L00J008m6k86l6r5k09O13l58O10
$$ 137 -127 -539 -318 -664 -742 -473 -135 -453 -335 -470 -594 -294 714 668 382 346 251 42 655 297 907
2931I07L4n79k50L30l88n12L93n83l87J23P04m01K5J86j40m4M48p23R13k96l5
$$ 907 941 362 112 442 54 -458 -65 -648 -1035 -912 -208 -609 -584 -398 -538 -582 -134 -857 56 -240 -275
2952b75J003j61j72K52M2K72q43J92l90M22n36L53J92m75p83N05o0K53k94L58
$$ -275 728 567 395 647 689 961 118 310 -80 342 -194 159 351 -124 -907 -402 -462 -209 -503 -145
2972a45k55m5M54K29L84k96l51K83J268q61M06o38m30M12nl06Q6n59o55P09j34
$$ -145 -400 -445 9 238 622 326 -25 258 1526 665 1071 433 3 415 410 104 190 -369 -1024 -315 -449
2993d49K46l76J2k82M33J95k84J69j02M52n78O73M03o94P66l14K67j12r8k34Q83
$$ -449 -203 -579 -567 -849 -416 -221 -505 -336 -438 14 -564 109 512 -182 584 270 537 425 327 93 976
3014I76j279O5N0J96L04m2l93o10k38K69Q64n31Mk68P64m25M98O49l52j85j01
$$ 976 -303 -238 -188 8 312 270 -123 -733 -971 -702 162 -369 -365 -633 131 -294 204 853 501 316 215
3035B15l93N28K20n4L06q72K45l51K28j56L4m48L21m15nL54L38j67o51J267n17
$$ 215 -178 350 570 516 822 -50 195 -156 72 -84 -50 -498 -177 -592 -597 -243 95 -72 -723 544 27
3056B7j46K41j77k20P61N11o14J24K02q38J83j90J62K57k69m97M67r20R29k10
$$ 27 -119 122 -55 -275 486 997 383 507 709 -129 54 -136 26 283 14 -483 -16 -936 -7 -217
3076b17M65j019L53J36K71m21M13P49l18k02j74K54O10o45j72N82m94L00k41q5
$$ -217 248 -771 -418 -282 -11 -432 -19 730 412 210 36 290 900 255 83 665 171 471 230 145
3096A45M91j063J29M68k3n4n28L69m96K13r8Q48O2j099N82J37K29J90O34q39R1
$$ 145 636 -427 -298 170 147 93 -435 -66 -562 -349 -447 401 463 -636 -54 83 312 502 1136 297 388
3117C88j88K3l01M68P3j42m26l23M95L04j70l82R5j39k86J40M43l31l27N14m48
$$ 388 200 223 -78 390 463 321 -105 -428 67 371 201 -181 -86 -225 -511 -371 72 -259 -586 -72 -520
3138e20P61N71o37O26m06L11l74L41m11m30N0Q54k74p19K2O82r88j16J70O4P50
$$ -520 241 812 175 801 395 706 332 673 262 -168 -118 736 462 -257 -235 447 -541 -657 -487 -423 327
3159C27j37n12k79L89P52n41k27J185q54K10K62QL3l45M7P6j37l1n09j6J16j80
$$ 327 190 -322 -601 -212 540 -1 -228 957 103 313 575 583 616 271 318 394 257 226 -283 -299 -183 -363
3181c63p0p3K37K06n82M26j2L8K67K73o77M10j14L96l59J106n11p9l72q7J36M99
$$ -363 -433 -506 -269 -63 -645 -219 -231 -193 74 347 -330 80 -34 362 3 1109 598 519 147 60 196 695
3203F95n36K59l52j30j33j61Q1N2R0L11o37K25n63Q85m02K50M22k38L5O4L23j33
$$ 695 159 418 66 -64 -197 -358 -277 -225 -135 176 -461 -236 -799 86 -316 -66 356 118 153 217 540 407
3225D07l6o6L72p32K56j81K87p65J90p6L6L36l20o37P43r3M57o73K97M39k50m54
$$ 407 371 305 677 -55 201 20 307 -458 -268 -344 -308 28 -292 -929 -186 -279 178 -495 -198 241 -9 -463
3247d63O62J22O9J42j55J39k73K45k3k45R2l26j80j45J95j3L65n86j59M71r1l43
$$ -463 199 321 390 532 377 516 243 488 465 220 312 -14 -194 -339 -144 -157 208 -378 -537 -66 -157 -500
3269e00O05m26J29M82k83l61R74l51q9J47r3K04K14p94N38j26l32M27l42r81N13
$$ -500 105 -321 -192 290 7 -354 620 269 180 327 234 438 652 -142 396 270 -62 365 23 -958 -445
3290d45m3Q85j023M8K11nJ35K4L24k83J34J76j27L43K28k34L71l82j42k29N80
$$ -445 -488 397 -626 -578 -367 -372 -237 -213 111 -172 -38 138 11 354 582 348 719 337 195 -34 546
3311E46q9m63j28P3P3n80L63j13PQ5k92M70K77P6j18j20Qn2N46o78J213m64mm28
$$ 546 457 -6 -134 -61 12 -568 -205 -318 -311 -226 -518 -48 229 305 187 67 75 23 569 -109 1104 640 636 208
3335B08l62O29m46K70o42j41j58P49m52J04o67N08Pl14P32K96n05k81Q22oP62
$$ 208 -154 475 29 299 -343 -484 -642 107 -345 -241 -908 -400 -393 -707 25 321 -184 -465 357 351 1113
3356A113j426N56o67M84J82m16Q0K43N8L98m47jo7j58n88N40n40N11p90J186o19
$$ 1113 -313 243 -424 60 242 -174 -94 149 207 605 158 157 90 -68 -656 -116 -656 -145 -935 251 -368
3377c68n26Q10J41l09k64M13K37k22O32P0k48L7J45p62j57j77L64l8j07M08l75
$$ -368 -894 -84 57 -252 -516 -103 134 -88 544 614 366 403 548 -214 -371 -548 -184 -222 -329 79 -296
3398b96k52L35Q6j11J76j2J18L93p4J88p2n98j45P46r9r9m1j63MJ001o28k57l45
$$ -296 -548 -213 -127 -238 -62 -74 44 437 363 551 479 -119 -264 482 383 284 243 80 84 1085 457 200 -145
3421a45j32J26j88O24M54o84p92N07m20M02K91J17K4o09L05P98q57N95L15j9K5
$$ -145 -277 -151 -339 285 739 55 -737 -230 -650 -248 43 160 184 -425 -120 678 -179 416 731 712 737
3442G37l99k33P6L9k09j05R9j29p95Q20l9r7o45N35K76P9M00k22k78J1k6O2O9
$$ 737 338 105 181 220 11 -94 5 -124 -919 -99 -138 -235 -880 -345 -69 10 410 188 -90 -79 -105 -43 26
3465B6K30l27J6M09j80j08M56j74p25j37N47k44K58j033O30J170j165pk24M01
$$ 26 256 -71 -55 354 174 66 522 348 -377 -514 33 -211 47 -986 -356 814 -351 -358 -582 -181
3485a81J53L15o42N2N31p3J22n17M70k23M03o06L28n8j50j99J22K81J19o57Q85
$$ -181 -28 287 -355 -303 228 155 277 -240 230 7 410 -196 132 74 -76 -275 -153 128 247 -410 475
3506D75j047M43N9m0k87L91J13m66R10l54N82k77M4R1m37M29j70m23K96L74p09
$$ 475 -572 -129 -70 -110 -397 -6 107 -359 551 197 779 502 546 637 200 629 459 36 332 706 -3
3527ck53l58M42n4n03N01q4j62J97N88J29m31L9k38k48M67l44Q65o00LK83j74
$$ -3 -256 -614 -172 -226 -729 -228 -312 -474 -277 311 440 9 48 -190 -438 29 -315 550 -50 -47 236 62
3549F2K13J23m51N3M85J75r68K70J46Oj37l22l0j59m7J23K99M16j19m72L01J36
$$ 62 275 398 -53 0 485 660 -308 -38 108 114 -23 -345 -375 -534 -581 -458 -159 257 138 -334 -33 103
3571A03J4m50L61M96l69N03j86p22M57L25j094O16O3m71Q76n09L74l95n8K37k67
$$ 103 117 -333 28 524 155 658 472 -250 207 532 -562 54 117 -354 522 13 387 -8 -66 171 -96
3592i6n38N99J55M76n53O1O15n02r87Q13l11O51J02l98K95j145R13r6j87N15q08
$$ -96 -634 -35 120 596 43 104 719 217 -770 43 -268 383 485 87 382 -763 150 54 -133 382 -426
3613d26J11j05N22j52q2L25j78m52O51j96K68m95O00n3k55K27O1l94J27l87R83
$$ -426 -315 -420 102 -50 -132 193 15 -437 214 18 286 -209 391 338 83 310 371 -23 104 -283 700
3634G00q07L34k92m27J22l8n1O48l18K64o46M60k32J63L15o3J9j55M33n17K40
$$ 700 -107 227 -65 -492 -370 -408 -459 189 -129 135 -511 -51 -283 -120 195 132 151 -4 429 -88 152
3655A52J27n03L27j15oK86N40q32J4M96O4n29m27L39l23N20m58N2K70L46j24k
$$ 152 279 -224 103 -12 -18 268 808 -24 -10 486 550 21 -406 -67 -390 130 -328 -276 -6 340 216 214
3677B14n97L16N02n43M83O5m90K26l99J80N77k43k8l86k62J60R6l19J61J11n6
$$ 214 -383 -67 435 -108 375 440 -50 176 -223 -43 534 291 263 -123 -385 -225 -129 -448 -287 -176 -232
3698b32J94l81O89l20l27L91JL47m42O61o81L43J15R0k57J79k32m23N65m55O45
$$ -232 -38 -419 270 -50 -377 14 15 362 -80 581 -100 243 358 448 191 370 138 -285 280 -175 470
3719D70l50j18q5J20k83mMR0M20j92J74p1j27N03k87k18M23j24m11R0n6M9J18
$$ 470 120 2 -83 37 -246 -250 -246 -156 264 72 246 175 48 551 264 46 469 345 -66 24 -32 17 135
3742A35l19K79j83M00m08j80K37L8J20M9m36m29P82N87r00R0M17j26k64J102j162
$$ 135 -184 95 -88 312 -96 -276 -39 -1 119 168 -268 -697 85 672 -228 -138 279 153 -111 991 -171
3763a71Q65n71m7l4k47j16M87l99K71l65J99k42n9K74M57k52n03J188o86K90k8
$$ -171 694 123 76 42 -205 -321 166 -233 38 -327 -128 -370 -429 -155 302 50 -453 735 49 339 311
3784C11k20j73P90r88R06o96R5j06P3L7L67m56L40o8R7p95L3R86n84r2K0k2L74
$$ 311 91 -82 708 -280 626 -70 25 -81 -8 29 396 -60 280 212 309 -486 -453 533 -51 -143 -123 -145 229
3807B29q3k58L11l47k97Q05J93m34j40j81M32j16L47j68k95K92k2m4m37N28o15
$$ 229 146 -112 199 -148 -445 360 553 119 -21 -202 230 114 461 293 -2 290 268 224 -213 315 -300
3828c00N32j99p59J086q3Lk8l5o89J008n11k58K31K00j80K78K57l84l40N03m34
$$ -300 232 33 -726 360 277 280 252 217 -472 536 25 -233 -2 198 18 296 553 169 -171 332 -102
3849a02O03J17q61K09L7K52j215O07m4L53M07n44lO58k47P20l38j97j40J29N3
$$ -102 501 618 -243 -34 3 255 -960 -353 -397 -44 363 -181 -184 474 227 947 609 412 272 401 454
3870D54L95o34j33O27j415J102m70J3L29k63M95j165J67p4M72K22m21j5L40p4
$$ 454 849 215 82 709 -706 396 -74 -61 268 5 500 -665 -498 -572 -100 122 -299 -314 26 -48
3890d8q85J146o6P79r67M38k37m3L14q70O72N70M15j670J117q21k93J09Q97k50
$$ -48 -933 213 147 926 -41 397 160 117 431 -439 233 803 1218 -452 665 -156 -449 -340 557 307
3910C07q05o38K27J751k91j210P76j03K4k55K88K35N5k45k31P75l50j75M56j194
$$ 307 -498 -1136 -909 842 551 -659 117 14 38 -217 71 306 361 116 -115 660 310 135 591 -603
3930f03N48o25q37J950j1p49L24K75q29L47j09J391p76N26q71n27j99P93J112
$$ -603 -55 -680 -1517 433 422 -327 -3 272 -557 -210 -319 1072 296 822 -49 -576 -775 18 1130
3949A130r81L85j091L28M56k9R1o78J197j69p01j24M40j551J930j157Q29Q4r12
$$ 1130 149 534 -557 -229 227 198 289 -389 808 639 -62 -186 254 -1297 633 -524 305 389 -523
3968e23O31n76J63R56j060R1J54J038j2k23Q23j691P12l33J19j16k26J092j714
$$ -523 108 -468 -305 651 -409 -318 -164 874 862 639 1462 -229 483 150 269 153 -73 1019 -695
3987f95P75l88P02Q15q85r52O93o93Q01k07M24K76k68J33j428J746k1j281O17
$$ -695 80 -308 394 1209 324 -628 65 -628 173 -34 390 666 398 531 -897 849 828 -453 164
4006A64Q55P1n26k72N08p12L65k89M13m59q42R0M15J53M27l79n51Q0M03N51m24
$$ 164 1019 1090 564 292 800 88 453 164 577 118 -724 -634 -219 -66 361 -18 -569 -489 -86 465 41
4027D1k02j27p39P21J494j131j335J277L26l04k13j28M99m12M69r00P92r36R31
$$ 41 -161 -288 -1027 -306 1188 57 -1278 -1 325 21 -192 -320 179 -233 236 -664 128 -808 123
4046A23j40mo66N10k66K2J288k6r02n12J139%O08j363M31n49J64K0P42p63j053
$$ 123 -17 -21 -687 -177 -443 -421 867 841 -61 -573 566 566 1174 -189 242 -307 -143 -123 619 -144 -1197
4067a197J274P27o86j56k82J287j062m85j80K55K63R01j864J611l03J27J99kJ27
$$ -1197 77 804 118 -38 -320 967 -95 -580 -760 -505 -242 659 -1205 406 103 230 429 427 554
4086E54p50MJ095p82J01k53L28m93J13M31N45k79K4j041L4P89r06N98k31K75j02
$$ 554 -196 -192 903 121 222 -31 297 -196 -83 348 893 614 638 -403 -369 420 -486 112 -119 156 54
4107E4M40m85N21m86JQ79j941M25Q34j322J718p43N12k44j185J135J3L80l49j003
$$ 54 494 9 530 44 45 924 -1017 -592 242 -1080 638 -105 407 163 -1022 113 126 506 157 -846
4127h46J037n74J85j39k7O80j413J232K2J78k123J799o32R89n01j76J122m00m59
$$ -846 191 -383 -198 -337 -364 316 -1097 135 157 335 -1788 11 -621 368 -133 -309 813 413 -46
4146d6l5rp51J29J441r33l91N39N5P69o16j68K84o15l71Q15M94m35m86N06k64
$$ -46 -81 -90 -841 -712 729 -204 -595 -56 -1 768 152 -16 268 -347 -718 97 591 156 -330 176 -88
4167h8p8O60p05K41j97k52o15J438j16j219R95o84J89J16L55m39L61K46J44p72
$$ -88 -166 494 -211 30 -167 -419 -1034 404 288 -931 64 -620 -431 -315 40 -399 -38 208 352 -420
4187d20j81J105q0n5L1k86N10q86MM64p35M94o83O32k17Q7L99k71r00P82N0k33
$$ -420 -601 504 424 369 400 114 624 -262 -258 206 -529 -35 -718 -86 -303 -216 183 -88 -988 -206 -156 -389
4209c89Q01j203J197l48K87k3J58o46J257j180J23K42o69R72j48J97J04q83K3
$$ -389 412 -791 406 58 345 322 480 -166 1091 -89 34 276 -393 579 431 628 732 -151 -128
4228a28M52o68N25k75j52o7O19n2k98k00J60K91k08Q88p61p8k6o09Q47P64k54
$$ -128 324 -344 181 -94 -246 -313 306 254 -44 -244 -84 207 -1 887 126 48 22 -587 260 1024 770
4249G70J86L41j282k0j64Q60m08p3o90K73L46m26L79J95j46M36k87o36O62L86
$$ 770 956 1297 15 -5 -169 691 283 210 -480 -207 139 -287 92 287 141 577 290 -346 316 702
4269G02j71q50N98n15p8K51K19o50M03J181q86J83q53J04O42l2j97j67j67j03
$$ 702 531 -319 279 -236 -314 -63 156 -494 -91 1090 204 387 -466 -362 280 248 51 -116 -283 -386
4289c86N60j442R91J91L13j65p88Q09n39M15M06r72R33k14J33k83o57R79J87j390
$$ -386 174 -1268 -277 -86 227 62 -726 83 -456 -41 365 -607 326 112 245 -38 -695 284 471 -919
4309i19k53L48M03n99J646j342J80J313j408O05l95O3L23j099J600m08M13p33
$$ -919 -1172 -824 -421 -1020 626 -716 -536 777 -631 -26 -421 -358 -35 -1134 466 58 471 -262
4327b62M23k69J00R25q28p95Q81R27j303J274j259Q44r59n91J475l55m0j80O82
$$ -262 161 -108 -8 917 89 -706 175 1102 -201 1073 -186 658 -301 -892 583 228 188 8 690
4346F90l15o82Q21m15N13m41J41m69M30K45k50r57N37N13m46L25l72K37J48J77
$$ 690 375 -307 514 99 612 171 312 -157 273 518 268 -689 -152 361 -85 240 -132 105 253 430
4366D30m35n5j53l50J262j770J839j581O85K68P38o42Qm81m25P12M96n17O53n59
$$ 430 -5 -60 -213 -563 699 -1071 768 -813 -128 140 878 236 244 -237 -662 50 546 29 682 123
4386A23j304J830j041L72rm39P16o69Q17p70M03j54m24j86M61J135n76j014J791
$$ 123 -1181 649 -392 -20 -29 -468 248 -421 396 -374 29 -125 -549 -735 -274 861 285 -729 1062
4405A062p63k24k63l48R74j050L11L24L24k92m71n1Q9N34m75N63o52J30M07r34
$$ 1062 299 75 -188 -536 438 -612 -301 23 347 55 -416 -467 -378 156 -319 244 -408 -278 129 -805
4425h05M03o74J851j680J514j007L25l64L17L77j267R30M12q2P3n42L58k24L89
$$ -805 -402 -1076 775 -905 609 -398 -73 -437 -120 257 -1010 -80 332 250 323 -219 139 -85 304
4444C04j97N0r44R61l57K35J041n54j817J386M56l88L5N2n11m2j88J154n52k19
$$ 304 107 157 -787 174 -183 52 1093 539 -1278 108 564 176 211 263 -248 -290 -478 676 124 -95
4464i5j68Q99j50r70K36O28J259j033p65J532j419M18p35K38o95Q32J235j020
$$ -95 -263 636 486 -484 -248 380 1639 606 -159 1373 -46 372 -363 -125 -820 12 1247 227
4482B27l13j38j058J283O70p01m45J56J133j148m9P27k30J66J10p62P83o41J169
$$ 227 -86 -224 -1282 1 671 -30 -475 -319 814 -334 -383 344 114 280 390 -372 411 -230 939
4501I39o76r93J364r06K16j84n68J234p27l77Q8l49J266j88l37J35L13o48N01
$$ 939 263 -730 634 -272 -56 -240 -808 426 -301 -678 -590 -939 327 139 -198 -63 250 -398 103
4520A03k30R16q76N65J34k63j004r9M52K17j99M81q99Q57l43K3j9k84P88L2p0
$$ 103 -127 789 -87 478 612 349 -655 -754 -302 -85 -284 197 -702 155 -188 -165 -184 -468 320 352 282
4541B82k0L49j019Q78o39Q5o37J380p09J8J75j018J732m32p18M75n26N6o65O81
$$ 282 262 611 -408 470 -169 -84 -721 659 -50 -32 143 -875 857 425 -293 182 -344 -288 -953 -272
4561b72N70l80N4Q4o39K26L96N12l41J334j156k72L51o4m63P04r68K11o54O59
$$ -272 298 -82 -28 56 -583 -357 39 551 210 1544 388 116 467 403 -60 644 -324 -113 -767 -108
4581a08k93O89j35K76l08m47L88O23j151N72j037L04Q34o44K59p4P11j9m29m9
$$ -108 -401 288 153 429 121 -326 62 685 -466 106 -931 -627 207 -437 -178 -252 459 440 11 -38
4601c8l69L83j22K13m5O46o04o0q2m2j49P33l19k02J85j200J327J38J36j29p6
$$ -38 -407 -24 -146 67 22 668 64 4 -78 -120 -269 464 145 -57 128 -1072 255 393 529 400 324
4622C24n91M41M61%j76r73O29o40P18M8r42M60N47m9j37k15n5q1M38j56M1k06
$$ 324 -267 174 635 635 459 -514 115 -525 193 241 -701 -241 306 257 120 -95 -150 -231 207 51 92 -114
4644a14K15m30Q40l66j96L26q09R88M10r59N1K50L99o91n7J37l21M84o59K63J97
$$ -114 101 -329 511 145 -51 275 -534 454 864 -95 -44 206 605 -86 -143 -6 -327 157 -502 -239 -42
4665d2K12l30K17k30L2m51N02l11R23k37q62P79N11r72L57l18J34p9L19K76q39
$$ -42 170 -160 57 -173 -141 -592 -90 -401 522 285 -577 202 713 -259 98 -220 -86 -165 154 430 -409
4686d09M69m11K09O41j24Mm83J19M48m87j89N60k87l34l07O77k45L96n06N69k68
$$ -409 60 -351 -142 499 375 379 -104 15 463 -24 -213 347 60 -274 -581 96 -149 247 -259 310 42
4707D2k23M01O8l89n1N44o60L35J81q45J62P14l70O66j373N39N30m69J056j159
$$ 42 -181 220 288 -101 -152 392 -268 67 248 -597 -435 279 -91 575 -798 -259 271 -198 858 -301
4727c01J91j048M49J42R95r00M03P86j136L13l98J197r38Q23n82j50k3N1J04j6
$$ -301 -110 -1158 -709 -567 428 -472 -69 717 -419 -106 -504 693 -245 578 -4 -154 -177 -126 -22 -38
4747c8J08l75p1J88M10j2k97M4k43K17J74J13K50n81J26L81L93o59q8l01k09N26
$$ -38 70 -305 -376 -188 222 210 -87 -43 -286 -69 105 218 468 -113 13 394 787 128 40 -261 -470 56
4769E6j45k06N62j44p4l56L57n1k44L8M38Q3j0n68M9P24p4l44m56L64J53k2n6
$$ 56 -89 -295 267 123 49 -307 50 -1 -245 -207 231 314 304 -264 -215 509 435 91 -365 -1 152 130 74
4792G4k7k29M7l48L38l03Q93l90k30n86J204m20o09M41k0M36j06l5j156P37L00
$$ 74 47 -182 -135 -483 -145 -448 445 55 -175 -761 443 23 -586 -145 -165 271 165 130 -1026 -289 11
4813A1m62M16P0QM04j010N83q40P84k79P73j00k85k70o6K36n48K25p2L42L08j48
$$ 11 -451 -35 35 43 447 -563 20 -820 -36 -315 458 358 73 -197 -263 -27 -575 -350 -422 -80 228 80
4835H0l14P25j054P20J05O54j446K83N11m64j14J04NL95j28K12l94l46p8N99m46
$$ 80 -234 491 -563 157 262 916 -530 -247 264 -200 -314 -210 -205 190 62 274 -120 -466 -544 55 -391
4856c91O84N0p00KP72m48m69J048m60nL64o56O7K43J0l64M06R3L59j147J089q26
$$ -391 293 343 -357 -355 417 -31 -500 548 88 83 447 -209 -142 101 111 -253 153 246 605 -542 547 -279
4878b79m9j98l27J106o60N81n06O55q9J98r28O18J35l26m7O22k26m20K00j9R88
$$ -279 -328 -526 -853 253 -407 174 -332 323 234 432 -496 122 257 -69 -116 506 280 -140 60 41 1029
4899A029j496L38L06k41L61p60J115n6k80o07l31j002J384M23k08K80l33n70M68
$$ 1029 -467 -129 177 -64 297 -463 652 596 316 -291 -622 -1624 -240 183 -25 255 -78 -648 -180
4918a80Rn09K61N77q5N58o91k04q6J14L21k40O45l18J83J6j086l40J033L91q1
$$ -180 -171 -680 -419 158 73 631 -60 -264 -350 -236 85 -155 490 172 355 371 -715 -1055 -22 369 288
4939B88K09n86M08p5r98L71j23O3L72K05N38j209M93n9k46M20l70L25L80j52p12
$$ 288 497 -89 319 244 -754 -383 -506 -443 -71 134 672 -537 -44 -103 -349 71 -299 26 406 254 -458
4960d58L24O44p59N24o70Q0L05P62j386L27j027Q02J211q93M59p19Q1R80n27j96
$$ -458 -134 510 -249 275 -395 -315 -10 752 -634 -307 -1334 -532 679 -214 245 -474 -393 587 60 -136
4980a36M85p35O53j068j15J431j226N71M43Q4m02K31M02m39l15q72J180J59N14
$$ -136 349 -386 267 -801 -916 515 -711 -140 303 387 -15 216 618 179 -136 -1008 172 331 845
4999H45j052L99j96K71n46r87J342L38l00q01M45P7O68k65p5p43Q96j03k47l81
$$ 845 -207 192 -4 267 -279 -1266 76 414 114 -687 -242 -165 503 238 163 -580 316 213 -34 -415
5019d15m5J013j597J312K90n11L61l02k93l31M46N89k63nq28P98J24m50q3p23
$$ -415 -460 553 -1044 268 558 47 408 106 -187 -518 -72 517 254 249 -579 219 343 -107 -190 -913
5039i13L32M80J09o52M26J211j164O47p97m49R67L32o56O6J470j823Q52l62J78
$$ -913 -581 -101 8 -644 -218 993 -171 476 -321 -770 197 529 -127 -61 1409 -414 438 76 254
5058B54j97J81jn97M97j79j590R06L87J079k94j146J04L17l77J957j441M98L54
$$ 254 57 238 237 -360 137 -42 -1632 -726 -339 740 446 -700 -596 -279 -656 1301 -140 358 712
5077G12m46k00O81J11p16o45J78R68p71M47n73M65n59P76j271M97Q3M07j09j77
$$ 712 266 66 747 858 142 -503 -325 643 -128 319 -254 211 -348 428 -843 -346 -263 144 35 -142
5097a42n02J964j911J010j373J039m56J49l39N38K40p38J095j40j374L03K32L12
$$ -142 -644 1320 -591 419 -954 85 -371 -222 -561 -23 217 -521 574 434 -940 -637 -405 -93
5115i3o34q4O32r6P36o43n01M62k61N95N02L02j554O45P64q18O04l90O37o80N10
$$ -93 -727 -811 -179 -275 461 -182 -683 -221 -482 113 615 917 -637 8 772 -46 558 168 805 125 635
5136F35o60J90j84m02J42M39L43p12m17O22J189j039M48m20l01j80k02Q58j689
$$ 635 -25 165 -19 -421 -279 160 503 -209 -626 -4 1185 146 594 174 -127 -307 -509 349 -1340
5155a340K426m28j17k12q16P3J5Q76o41K42o27l56R99Q3l39n78J108p69J30j18
$$ -1340 1086 658 541 329 -487 -414 -399 477 -164 78 -549 -905 94 177 -162 -740 368 -401 -271 -389
5175c89L04M31k68j260K301r90k28J71R41r14m22k59m9J34M74M21r79P07n03J297
$$ -389 -85 346 78 -1182 1119 129 -99 72 1013 99 -323 -582 -631 -497 -23 398 -581 126 -377 920
5195I20n27j63M71q53Q11p63K40l67l62O50o6j21O6R8J17j11m13M92m34O38m80
$$ 920 393 230 701 -152 659 -104 136 -231 -593 57 -9 -130 -64 34 151 40 -373 119 -315 323 -157
5216a57N08m49r6M4N09l18O7J63M00q38n55O76M6k28O28m29Q74j795J130K13o13
$$ -157 351 -98 -194 -150 359 41 108 271 671 -167 -722 -46 0 -228 400 -29 845 -950 180 393 -220
5237b20R35m26J56o77J100o16r62J656j10j745Q46K1p63L03N91J39O08p29l12
$$ -220 715 289 445 -232 868 252 -710 946 836 -909 -63 -42 -805 -502 89 228 836 107 -205
5256b05J46M5Q7q3m55R27J96j81r43J391m70m77m29P87pJ7m13k30M88N34n00N74
$$ -205 -59 -14 73 -10 -465 462 658 477 -466 925 455 -22 -451 336 329 346 -67 -297 191 725 225 799
5278G99p08l40Q36k46m55Pk09o91R93j72K60n86O65R5J38n75L26j61p22J099m1
$$ 799 91 -249 587 341 -114 -107 -316 -1007 -14 -186 74 -512 153 248 386 -189 137 -24 -746 353 312
5299C12J93n17k50K23N44p09K50L55jk77k4n6k74j21N02o09J131m08nM8r01N56
$$ 312 505 -12 -262 -39 505 -204 46 401 400 123 99 43 -231 -352 150 -459 672 264 259 307 -594 -38
5321c8l49R6PL14J77m83r7O41m24r9k19R97o17k48K32l52L57L0m01O45o52N08
$$ -38 -387 -291 -284 30 207 -276 -373 268 -156 -255 -474 523 -94 -342 -110 -462 -105 -75 -476 169 -483 25
5343B5m62j76O40L49j84j90K61l79l56Q18k65j36L44k56P6n20O61P4l31m49K2
$$ 25 -437 -613 27 376 192 2 263 -116 -472 346 81 -55 289 33 109 -411 250 324 -7 -456 -434
5364d34K77N87j44q5k50N86m96M00q8l53k87K86J84K7K86o55K7k06L28L38K05
$$ -434 -157 430 286 201 -49 537 41 441 353 0 -287 -1 183 210 496 -159 -132 -338 -10 328 533
5385E33j100N09j42O85o42M00l69M94K63q69K90p5J94k81m35M94L83o14J309j617
$$ 533 -567 -58 -200 485 -157 243 -126 368 631 -238 52 -23 171 -110 -545 -51 332 -282 1027 -590
5405e90O63m63K70k00k18M05J80n8J89K3k03l3L32N03n77L64l2m56j77K0L78K24
$$ -590 73 -390 -120 -320 -538 -133 47 -11 178 201 -2 -35 297 800 223 587 555 99 -78 -58 320 544
5427E44m61Q4o60M32j2N6j16Q26p09m77M71K6J22J58j02n65R95m81m48L91K02
$$ 544 83 167 -493 -61 -73 -17 -133 693 -16 -493 -22 4 126 284 182 -383 612 131 -317 74 276
5448B76m70K96l2p2l80N53k58K51p1j83L2k10L92k93M66n96N53k45o5N18k21n11
$$ 276 -194 102 70 -2 -382 171 -87 164 93 -90 -58 -268 124 -169 297 -299 254 9 -56 462 241 -270
5470b70K12k30O37l11kj28K80N5M36k97j76k95O4k24O19n41j21O4r5L82M03k72
$$ -270 -58 -288 349 38 36 -92 188 243 679 382 206 -89 -25 -249 370 -171 -292 -228 -323 59 462 190
$$ [...]
8191B4
##END NTUPLES=NMR FID
##END=
