##TITLE=1H_Ser 6-3-V-2
 CDCl3
 8 sc, 
 10.11.2021
##JCAMPDX= 6.0         $$ Bruker NMR JCAMP-DX V2.0
##DATA TYPE= NMR FID
##DATA CLASS= NTUPLES
##ORIGIN= UXNMR, Bruker Analytische Messtechnik GmbH
##OWNER= root
$$ XWIN-NMR		Version 3.5
$$ Wed Nov 10 10:32:56 2021 Russian Standard Time (UT+4h)  she@DPX200
##.OBSERVE FREQUENCY= 200.1313468511
##.OBSERVE NUCLEUS= ^1H
##.DELAY= (6, 6)
##.ACQUISITION MODE= SIMULTANEOUS
##.ACQUISITION SCHEME= undefined
##.AVERAGES= 8
##.DIGITISER RES= 18
##SPECTROMETER/DATA SYSTEM= spect
##.PULSE SEQUENCE= zg30
##.SOLVENT NAME= CDCl3
##.SHIFT REFERENCE= (INTERNAL, CDCl3, 0, 15.7039)
##AUDIT TRAIL= $$ (NUMBER, WHEN, WHO, WHERE, WHAT)
$$ ##TITLE= Audit trail, XWIN-NMR		Version 3.5
$$ ##JCAMPDX= 5.01
$$ ##ORIGIN= Bruker BioSpin GmbH
$$ ##OWNER= she
$$ F:/spectra/data/she/nmr/H-F/1/audita.txt
$$ ##AUDIT TRAIL=  $$ (NUMBER, WHEN, WHO, WHERE, WHAT)
(   1,<2021-11-10 10:31:25.59 +0400>,<she>,<DPX200>,
      <created by zg, POWCHK disabled, PULCHK disabled
       configuration hash MD5:
       00 E9 B6 7A A2 85 ED C7 34 08 36 98 17 FE 4E 26
       data hash MD5: 16K
       F0 9C C2 FD 79 5D 97 3A D8 62 13 F1 A2 4D 3A 3E>)
$$ ##END=
$$ 
$$ hash MD5
$$ E5 21 F4 6D BF C4 55 59 8E 21 90 86 EB 1B 62 5A
##$RELAX= 
##$RELAX= 
##$RELAX= 
##$RELAX= 
##$RELAX= 
##$RELAX= 
$$ Bruker specific parameters
$$ --------------------------
##$DU= <F:/spectra>
##$EXPNO= 1
##$NAME= <H-F>
##$PROCNO= 1
##$TYPE= <nmr>
##$USER= <she>
##$AMP= (0..31)
100 100 100 100 100 100 100 100 100 100 100 100 100 100 100 100 100 100 
100 100 100 100 100 100 100 100 100 100 100 100 100 100 
##$AQSEQ= 0
##$AQ_mod= 1
##$AUNM= <au_zg>
##$AUTOPOS= <>
##$BF1= 200.13
##$BF2= 200.13
##$BF3= 200.13
##$BF4= 200.13
##$BF5= 200.13
##$BF6= 200.13
##$BF7= 200.13
##$BF8= 200.13
##$BYTORDA= 1
##$CFDGTYP= 0
##$CFRGTYP= 5
##$CHEMSTR= <none>
##$CNST= (0..31)
1 1 145 1 1 1 1 1 1 1 1 1 1 1 1 1 1 1 1 1 1 1 1 1 1 1 1 1 1 1 1 1 
##$CPDPRG= <>
##$CPDPRG1= <>
##$CPDPRG2= <>
##$CPDPRG3= <>
##$CPDPRG4= <mlev>
##$CPDPRG5= <mlev>
##$CPDPRG6= <mlev>
##$CPDPRG7= <mlev>
##$CPDPRG8= <mlev>
##$CPDPRGB= <>
##$CPDPRGT= <>
##$D= (0..31)
0 1.2 0 0 0 0 0 0 0 0.06 0 0.03 0 0 0 0 0.0002 0 0 0 0 0 0 0 0 0 0 0 0 
0 0 0 
##$DATE= 1636525885
##$DBL= (0..7)
120 120 120 120 120 120 120 120 
##$DBP= (0..7)
150 150 150 150 150 150 150 150 
##$DBP07= 0
##$DBPNAM0= <>
##$DBPNAM1= <>
##$DBPNAM2= <>
##$DBPNAM3= <>
##$DBPNAM4= <>
##$DBPNAM5= <>
##$DBPNAM6= <>
##$DBPNAM7= <>
##$DBPOAL= (0..7)
0.5 0.5 0.5 0.5 0.5 0.5 0.5 0.5 
##$DBPOFFS= (0..7)
0 0 0 0 0 0 0 0 
##$DE= 6
##$DECBNUC= <off>
##$DECIM= 32
##$DECNUC= <off>
##$DECSTAT= 4
##$DIGMOD= 1
##$DIGTYP= 9
##$DL= (0..7)
0 120 120 120 120 120 120 120 
##$DP= (0..7)
150 150 150 150 150 150 150 150 
##$DP07= 0
##$DPNAME0= <>
##$DPNAME1= <>
##$DPNAME2= <>
##$DPNAME3= <>
##$DPNAME4= <>
##$DPNAME5= <>
##$DPNAME6= <>
##$DPNAME7= <>
##$DPOAL= (0..7)
0.5 0.5 0.5 0.5 0.5 0.5 0.5 0.5 
##$DPOFFS= (0..7)
0 0 0 0 0 0 0 0 
##$DQDMODE= 0
##$DR= 18
##$DS= 0
##$DSLIST= <SSSSSSSSSSSSSSS>
$$ [...]
##$SUBNAM2= <"">
##$SUBNAM3= <"">
##$SUBNAM4= <"">
##$SUBNAM5= <"">
##$SUBNAM6= <"">
##$SUBNAM7= <"">
##$SUBNAM8= <"">
##$SUBNAM9= <"">
##$SW= 18.0517286264689
##$SWIBOX= (0..15)
0 0 2 0 0 0 0 0 0 0 0 0 0 0 0 0 
##$SW_h= 3612.71676300578
##$TD= 16384
##$TD0= 1
##$TE= 0
##$TE2= 300
##$TE3= 300
##$TEG= 300
##$TL= (0..7)
0 120 120 120 120 120 120 120 
##$TP= (0..7)
150 150 150 150 150 150 150 150 
##$TP07= 0
##$TPNAME0= <>
##$TPNAME1= <>
##$TPNAME2= <>
##$TPNAME3= <>
##$TPNAME4= <>
##$TPNAME5= <>
##$TPNAME6= <>
##$TPNAME7= <>
##$TPOAL= (0..7)
0.5 0.5 0.5 0.5 0.5 0.5 0.5 0.5 
##$TPOFFS= (0..7)
0 0 0 0 0 0 0 0 
##$TUNHIN= 0
##$TUNHOUT= 0
##$TUNXOUT= 0
##$USERA1= <user>
##$USERA2= <user>
##$USERA3= <user>
##$USERA4= <user>
##$USERA5= <user>
##$V9= 5
##$VALIST= <valist>
##$VCLIST= <CCCCCCCCCCCCCCC>
##$VD= 0
##$VDLIST= <DDDDDDDDDDDDDDD>
##$VPLIST= <PPPPPPPPPPPPPPP>
##$VTLIST= <TTTTTTTTTTTTTTT>
##$WBST= 1024
##$WBSW= 4
##$XGAIN= (0..3)
0 0 0 0 
##$XL= 0
##$YL= 0
##$YMAX_a= 167671
##$YMIN_a= -252314
##$ZGOPTNS= <>
##$ZL1= 120
##$ZL2= 120
##$ZL3= 120
##$ZL4= 120
##$ABSF1= 10
##$ABSF2= 0
##$ABSG= 5
##$ABSL= 3
##$ALPHA= 0
##$AQORDER= 0
##$ASSFAC= 0
##$ASSFACI= 0
##$ASSFACX= 0
##$ASSWID= 0
##$AUNMP= <proc_1d>
##$AZFE= 0.1
##$AZFW= 0.1
##$BCFW= 1
##$BC_mod= 2
##$BYTORDP= 1
##$COROFFS= 0
##$CY= 11.3945322036743
##$DATMOD= 1
##$DC= 2
##$DFILT= <>
##$DTYPP= 0
##$F1P= 2.36226072786647
##$F2P= -0.459571619588291
##$FCOR= 0.5
##$FTSIZE= 0
##$FT_mod= 4
##$GAMMA= 1
##$GB= 0.15
##$INTBC= 1
##$INTSCL= 1
##$ISEN= 128
##$LB= 0.24
##$LEV0= 0
##$LPBIN= 0
##$MAXI= 10000
##$MC2= 0
##$MEAN= 0
##$ME_mod= 0
##$MI= 1.114404
##$NCOEF= 0
##$NC_proc= 0
##$NLEV= 6
##$NOISF1= 3.799351
##$NOISF2= 2.8
##$NSP= 1
##$NTH_PI= 0
##$NZP= 0
##$OFFSET= 15.70392
##$PC= 1
##$PHC0= -15515.34
##$PHC1= 19.20082
##$PH_mod= 1
##$PKNL= yes
##$PPARMOD= 0
##$PSCAL= 0
##$PSIGN= 0
##$REVERSE= no
##$SF= 200.130013532006
##$SI= 16384
##$SIGF1= 3
##$SIGF2= 2
##$SINO= 400
##$SIOLD= 16384
##$SREGLST= <1H.CDCl3>
##$SSB= 0
##$STSI= 0
##$STSR= 0
##$SW_p= 3612.71676300578
##$SYMM= 0
##$S_DEV= 0
##$TDeff= 0
##$TDoff= 0
##$TI= <>
##$TILT= no
##$TM1= 0
##$TM2= 0
##$TOPLEV= 0
##$USERP1= <user>
##$USERP2= <user>
##$USERP3= <user>
##$USERP4= <user>
##$USERP5= <user>
##$WDW= 1
##$XDIM= 8192
##$YMAX_p= 0
##$YMIN_p= 0
$$ End of Bruker specific parameters
$$ ---------------------------------
##NTUPLES= NMR FID
##VAR_NAME=  TIME,          FID/REAL,        FID/IMAG
##SYMBOL=    X,             R,               I
##VAR_TYPE=  INDEPENDENT,   DEPENDENT,       DEPENDENT
##VAR_FORM=  AFFN,          ASDF,            ASDF
##VAR_DIM=   8192,          8192,            8192
##UNITS=     SECONDS,       ARBITRARY UNITS, ARBITRARY UNITS
##FACTOR=    0.0002768,     1,               1
##FIRST=     0,             0,               0
##LAST=      2.2672688,     0,               0
##MIN=       0,             -252314,         0
##MAX=       2.2672688,     167671,          0
$$ Real data points
##PAGE= N=1
##DATA TABLE= (X++(R..R)), XYDATA
$$ [...]
1948A909p22n04p72p8K31l0n7p26o78J13K04J79L95j71o08K21J04O67P55P1k24
1969B79j80L27K74R44l9m97n41n20K08p8K50m11r84k56J44J94L03m69k08m53N95
1990a118L10Q78J76j77j27N18O67J53L58l02l51j03j17L42J32n34n28o93k19L43
2010c92O1l72k57o00j50N98L07M99j13l12M14L89P92L20Ol67j14R7K38L07k24
2031A127o00m59j06j49N15l38m16q23j42KN01K58j27l50k9O53L50N31L81Q8k61
2052F06J84k0P93N1p56j61l53K17j05M0m45p17k47j46L71J68l5k51n12L56L90
2073e72L25O37j93j60J59o2Q53M40k89j82n38L88r6L9k22o05l48j65L74n9Q9m96
2095f83j65k72L93J80M49m7r7k78M20N09N54P8l65l55K38J79K60L36p98p19l63
$$ plain form
1948 1909 1187 683 -89 -167 64 34 -23 -749 -1427 -1314 -1110 -931 -536 -707 -1315 -1094 -990 -323 432 503 279
1969 279 99 426 700 1644 1605 1108 567 47 255 177 427 16 -968 -1224 -1080 -886 -583 -1052 -1260 -1713 -1118
1990 -1118 -808 70 246 69 -58 460 1127 1280 1638 1336 985 882 765 1107 1239 705 177 -516 -735 -392
2010 -392 -331 -703 -960 -1560 -1710 -1112 -805 -306 -419 -731 -317 72 864 1184 1190 823 709 806 1044 1351 1127
2031 1127 527 68 -38 -187 328 -10 -426 -1249 -1391 -1389 -888 -630 -757 -1107 -1136 -483 -133 398 779 867 606
2052 606 790 770 1563 1614 858 697 344 561 456 496 51 -666 -913 -1059 -688 -520 -555 -806 -1318 -962 -572
2073 -572 -247 390 197 37 196 134 987 1427 1138 956 418 806 710 749 527 -78 -426 -591 -217 -276 -187 -683
2095 -683 -848 -1120 -727 -547 -98 -145 -242 -520 -100 409 963 1041 676 321 559 738 998 1334 536 -183 -546
2116e46M7N46m3n16k42k59K56K72J93J51j96n56M97J18P91L03l63k09K28J43M27
2137A042M8j32m71n47M9r1J96j46k72n59j1r1L60K83l20j13k48P37P62NJ2L2l11
2160B14M21M59L21k55m08l00l21K06J84q4p85k72m24L13L20j97l4m60m58P23M89
2181c48K85L11k36j83N50L30O46j44n7k97p69J54M12r1m44k19n77K12j46M26n11
2202f96n13J2j06N52K21K53j51J56P0K69L75L50J38j70n57M46M04P4J0m11n04
2223B22k20J21J27j87k89k00k66J85R4N0k84j71J01K74M53N17n9m40K81K7M47
2244G83K81lm50k26lj39J55n9k13o40l56Q6L21O0m39j60K2j86N89Q07l04l1mj24
2268b33P23J58K57k56l87r2N10p3J31q3n90m61J82q8K35n65K44m92p5M50L44J17
$$ plain form
2116 -546 -499 47 4 -512 -754 -1013 -757 -485 -292 -141 -337 -893 -396 -278 513 816 453 244 472 615 1042
2137 1042 1090 958 487 -60 -11 -102 94 -52 -324 -883 -894 -985 -625 -342 -662 -775 -1023 -286 476 481 493 525 214
2160 214 635 1094 1415 1160 752 452 131 337 521 437 -348 -620 -1044 -731 -411 -608 -642 -1102 -1560 -837 -348
2181 -348 -63 248 12 -171 379 709 1355 1211 1154 857 88 242 654 563 119 -100 -677 -465 -611 -185 -696
2202 -696 -1209 -1197 -1303 -751 -530 -277 -428 -272 -202 67 442 792 930 760 203 649 1053 1127 1137 726 222
2223 222 2 123 250 63 -226 -426 -692 -507 -413 -363 -647 -818 -717 -443 10 527 468 28 309 336 783
2244 783 1064 1061 611 385 382 243 398 339 126 -514 -870 -784 -463 -403 -842 -1002 -980 -1166 -577 230 -74 -105 -109 -233
2268 -233 490 648 905 649 262 170 680 607 738 655 65 -396 -214 -302 -67 -632 -388 -880 -955 -505 -161 -44
2290d4R3l67r2N84L78L6J78j73J12k83L88K0m49K30n66l32K10M3J26n62k87K7
2312g30J4J68M08m2m4k21J19M67N13q7j28p0j11M70k26M58o94j71j16J67j51K26
2334B19l17k03k67j75L03K48k13k05j99R1O88j24N48m12j07K59J45O82k41N7k87
2355D90m97K3J45M3j98k27k50k37M72l9k65M2l61n3K62L57L52l10K36l8L49K08
2377E04K18O2J40n30j00M74k21K4k12k40k50J0R0r6j91m16j09J93J73J73j67J15
2399c56k48L08O70J75J79l25j42J02L90J06o2n0m74k08p7K53n8k55l88m30j5J22
2421g83L66P8j94k18O9K37N02J75j01j23K68k0K47L54j17l04j86l3Q6m9J57j27
2443B84n58j80q3L35k76J4m0j25K3K99J21L29k52J7Q9M16K31J7l27n5K22k34L34
$$ plain form
2290 -44 49 -318 -410 174 552 588 766 593 705 422 810 830 381 611 45 -287 -77 -34 92 -470 -757 -730
2312 -730 -716 -548 -140 -182 -226 -447 -328 139 652 565 437 367 256 726 500 958 264 93 -23 144 -7 219
2334 219 -98 -301 -568 -743 -440 -192 -405 -610 -809 -718 -30 -154 394 -18 -125 134 279 961 720 777 490
2355 490 -7 16 161 204 6 -221 -471 -708 -236 -275 -540 -498 -859 -912 -650 -293 59 -251 -15 -53 296 504
2377 504 722 784 924 394 294 768 547 571 359 119 -131 -121 -31 -127 -318 -734 -843 -650 -477 -304 -471 -356
2399 -356 -604 -296 374 549 728 403 261 363 753 859 797 747 273 65 -12 241 183 -72 -460 -890 -905 -783
2421 -783 -417 -339 -533 -751 -682 -445 57 232 131 8 276 256 503 857 740 436 250 217 303 254 411 284
2443 284 -274 -454 -537 -202 -478 -464 -504 -629 -606 -307 -186 143 -109 -92 -3 413 644 661 334 279 501 267 601
2466F01K10l01l63l29K06j82p3k96K35m96O5J44N26k72Q4n40K36M39K53L18J13
2487E78l18j43L08Q0N8M3l06k24k76J28J30M8k50n50L87k24N27k61p8j58j34M33
2509b02P8L15J7p7J71K58n0j27K33k06k49r3J24L0j62j10j81p8nJ93N6l64j44
2532e73j81J79L60K18k2l6J41j87K12L65L11m20L70l32r7J68j39k9m07l03K86
2553a16K7k60nm14J32J42j32K30K01O8L23o8k07Q02p0j07k99J51J60k12K02k44
2575C04j94n8k73K07k54K11l11k06k08l4L80J81J35k28L40j59K86J89J7k21L25
2596D29k69M57k43K45P4n73J11k40L3J66m17j31j29rK13O9k61q7K53k18k2P89
2618B40j05l8Q9j79O61j24K30j17l27m8k2M9K54k62l79j83l22J91Jj92K2q0OJ2
$$ plain form
2466 601 811 510 147 -182 24 -158 -231 -527 -292 -788 -723 -579 -53 -325 -241 -781 -545 -106 147 465 578
2487 578 260 117 425 505 563 606 300 76 -200 -72 58 106 -144 -694 -307 -531 -4 -265 -343 -501 -635 -202
2509 -202 -124 191 208 131 302 560 510 383 616 410 161 68 192 222 60 -50 -231 -309 -314 -121 -65 -429 -573
2532 -573 -754 -575 -215 3 -19 -55 86 -101 111 476 787 367 737 405 308 476 337 308 -99 -402 -116
2553 -116 -89 -349 -354 -768 -636 -494 -626 -396 -195 -127 196 128 -79 723 653 546 247 398 558 346 548 304
2575 304 110 52 -221 -14 -268 -57 -368 -574 -782 -816 -436 -255 -120 -348 -8 -167 119 308 325 104 429
2596 429 160 617 374 619 693 120 231 -9 24 190 -227 -358 -487 -496 -283 -214 -475 -562 -309 -527 -549 240
2618 240 135 97 186 7 668 544 774 657 330 282 260 309 563 301 -78 -261 -583 -392 -391 -583 -561 -641 -635 -623
2642f23M04J12j70J41LJ31P4L80k9l5j32L1K16N0J04j93n65j57L3k2J16N0m15
2665d96o2j32K37K94q7k14K87l1L85j54K85q7p2K39J8L60l9k40j36k19j30J87
2687A93k97j36K86m96n3J18R3K41k44j06j10K51J81M05k21J4J41J02Q9q2j21M1
2709B89o3j15j70J69k08k2j15j91J62M6k7j63lK11q3K81j16L37j75j02J20L17
2731C79k04L89j71k71J2J24o8L38n91k20n9r9J47K75j62k31O0q4M6K04k2p8J69
2754a17J2M17k4J84k44N4k1q5K77q7k90k13O8j31L1L7k59N4Q0k46J47j8K71J64
2778F1l89K34QL82l3j70N00n11M39o0J0L49l77k81j78l7N0J29j27J8n91o5K83
2801c56j37K09j25k67M15N5O8J90k6k0J73L9K30j0n4MJo1j60K07p9j93m53j41
$$ plain form
2642 -623 -219 -107 -277 -136 -133 -2 72 452 423 388 256 287 503 553 657 464 -101 -258 -225 -247 -131 -81 -496
2665 -496 -558 -690 -453 -159 -246 -460 -173 -204 181 27 312 225 153 392 410 770 731 491 355 136 6 193
2687 193 -104 -240 46 -450 -503 -385 -292 -51 -295 -401 -511 -260 -79 326 105 119 260 362 451 369 248 289
2709 289 226 111 -59 110 -98 -120 -235 -426 -264 -218 -245 -408 -411 -200 -283 -2 -118 219 44 -58 62 379
2731 379 175 564 393 122 134 258 190 528 -63 -283 -342 -441 -294 -19 -181 -412 -352 -436 -390 -186 -208 -286 -117
2754 -117 -105 312 288 472 228 282 261 176 453 366 76 -137 -69 -200 -169 -132 -391 -337 -257 -503 -356 -374 -103 61
2778 61 -328 -94 -86 296 263 93 593 82 521 461 471 820 443 162 -16 -53 -3 126 -1 17 -574 -639 -356
2801 -356 -493 -284 -409 -676 -261 -206 -138 52 26 6 179 218 448 438 384 388 389 328 168 375 296 103 -350 -491
2825d91J83M2K07l86K5j41Q1L58l60L47K47j03J0J81L29k2j16L7j76L9J29k32
2847A88o1n5Ml33L28k30J59j95k02j17M36l29J04J43M9L09j54K95Q7j29Kr8JK18
2871D20m1J8K13j003L68J71m0k33j68k5k56J04K60K8j0qo3J93K44m8j68K2L14
2894B92j88J37QJ65k29p9Q5m2o0j13r2O1k68J63NMk17k56L21k34M02M2K55k3N1
2919A90k50L57K61N8l74M2k12L24l70J03k65O7q9n7mJ85k73k85Q2O8k7L64l3j68
2943c06L92l39K50K41m1K14j48J25k23J19R9P7m55j2p4j34L14r9k09j45k80J40
2965d94J99n0J10P0M3J88p0J93l2Q5mk3O7K72k20l24J48K2k61K56k35m3O6l74
2989d11%L8K26m6j41K30J20J24l43K71j34K11P8N9J78Q8r4k94oR9J60j11j71k55
$$ plain form
2825 -491 -308 -266 -59 -445 -420 -561 -480 -122 -482 -135 112 9 19 200 529 507 391 428 252 291 420 188
2847 188 127 72 76 -257 71 -159 0 -195 -397 -514 -78 -407 -303 -160 -111 198 44 339 426 297 299 201 202 420
2871 420 379 397 610 -393 -25 146 106 -127 -295 -320 -576 -472 -212 -184 -194 -202 -265 -72 172 124 -44 -22 292
2894 292 104 241 249 414 185 106 191 149 89 -24 -116 -55 -323 -160 -155 -151 -368 -624 -303 -537 -135 -93 162 139 190
2919 190 -60 297 558 616 242 284 72 396 26 129 -136 -69 -158 -215 -219 -34 -307 -592 -510 -442 -469 -105 -138 -306
2943 -306 86 -253 -3 238 197 411 263 388 165 284 383 460 5 -7 -81 -215 99 0 -209 -354 -634 -494
2965 -494 -295 -345 -235 -165 -122 66 -4 189 157 242 238 215 282 554 334 10 158 180 -81 175 -60 -103 -37 -411
2989 -411 -411 -373 -147 -193 -334 -104 16 140 -203 68 -66 145 223 282 460 548 454 160 154 253 413 302 131 -124
3013a24k7j73K16n25J30K50j36J06K4K7K2rK08J26m2K13J78k61J65J96k48R0j94
3036B12j99R7l1j24o6O2m1J47j55l10J42j03L29k07J05J4J11j39L06N3J89k56
3058A36n9K10K26l81K93k14o1R5m42K9j20J73j05M8k68K60j77R3K07p5P9p5J14
3081a4J55k35K45K40j87K01r4j63J13j21n16N84k38K44l48q5O1j43O1k1K04j16
3103a73P7K75k77P6J40j94P4L92L55m00L61m76p5j47J64j9q2l97j28K92l3M5j54
3126c04j2J60k68L89j15K45j45J35m4J08J42J23l33L47k22K66k82K0p8j16N6k81
3148b09J00R1k01j80L5O1J22J66j00m3j11K68J3J20J50P9k92R4R0k2K89l58K86
3171D48m24Kq5R2Kn44J25J10j67N8M7J53j89K06K33N8j26J22j40J52j6N8J30M2
$$ plain form
3013 -124 -151 -324 -108 -633 -503 -253 -389 -283 -259 -232 -210 -219 -11 115 73 286 464 203 368 564 316 406 212
3036 212 13 110 79 -45 -111 -49 -90 57 -98 -408 -266 -369 -40 -247 -142 -128 -17 -156 150 203 392 136
3058 136 77 287 513 132 425 211 150 245 -197 -168 -288 -115 -220 -172 -440 -180 -357 -264 -57 -132 -53 -128 -14
3081 -14 141 -94 151 391 204 405 311 148 261 140 -376 208 -30 214 -134 -219 -158 -301 -240 -261 -57 -173
3103 -173 -96 179 -98 -22 118 -76 -2 390 745 345 706 230 155 8 172 153 71 -326 -454 -162 -195 -150 -304
3126 -304 -316 -156 -424 -35 -150 95 -50 85 41 149 291 414 81 428 206 472 190 210 132 16 72 -209
3148 -209 -109 -18 -219 -399 -364 -303 -181 -15 -115 -158 -269 -1 12 132 282 361 69 163 253 231 520 162 448
3171 448 24 26 -59 33 35 -509 -384 -274 -441 -383 -336 -183 -372 -166 67 125 -1 121 -19 133 117 175 305 347
3195C47l36K72J12l17p1J39l8k32l4Nj27R7j26K22j12j70J77j31K66J55j33m5
3217h0M72L3k41M39m59J66j73J42k09Q3k02k55J22J67J3J28l80J18j81j06J57
3238b46N3j57K50J56j73K32J5L0r8j1K25P4j18L7j06J07j51k51J20l10L33m0j38
3261a67j23L9q6K16j33k02L05K34m5L4K41m86M10M8J21j38k14L13m70O9O0j89
3283a63j84L29k41K12J29l87K66k33K99k56J44K40j66j13M06j65j34J77O5L82
3303F07l35p1J06k18J8mj76j36j35J78Q3k93J38L9J9l89N53k3L20k59j89M63k57
3326C9M23j83O2j40m8R4J57m68J80m3l24j06L2j08L07k18K1J42j35J98k03P4K63
3349A6M9j32K70j73J23Q0j36Q9P6J0L9k15P0j26j94J26J28o10K29k57M25j98K0
$$ plain form
3195 347 11 283 395 78 7 146 108 -124 -158 -153 -280 -183 -309 -87 -199 -369 -192 -323 -57 98 -35 -80
3217 -80 392 425 184 623 164 330 157 299 90 173 -29 -284 -162 5 18 146 -234 -116 -297 -403 -246
3238 -246 -193 -350 -100 56 -117 115 130 160 62 51 276 350 232 269 163 270 119 -132 -12 -322 11 -29 -167
3261 -167 -290 -251 -337 -121 -254 -456 -151 83 38 72 313 -173 237 285 406 268 54 367 -103 -34 26 -163
3283 -163 -347 -18 -259 -47 82 -305 -39 -272 27 -229 -85 155 -11 -124 282 117 -17 160 225 607
3303 607 272 201 307 89 107 103 -73 -209 -344 -166 -83 -376 -238 -199 -180 -569 -16 -39 281 22 -167 296 39
3326 39 462 279 341 201 153 247 404 -64 116 73 -251 -357 -325 -433 -126 -344 -323 -181 -316 -118 -321 -247 16
3349 16 65 -67 203 30 153 233 97 186 262 272 311 96 166 40 -154 -28 100 -510 -281 -538 -113 -311 -291
3372b91M9K2L12k27O2J68J22N2O6J20p2N6j11Q7k09j81J83j12k16L66k27l03j2
3395b96J27q5K1j22R5P5k0K22L9m9j89P7M03k66J77lm2R7j9n7K45p00L09K2l96
3420c35N7J94J1n7j37j4J65p7%L22k01K4o0K9K88mp0K91m06K30j37o6L7o4j52
3445a32J15k72K15j38J67m5l5j98j13J39J23R3M8Lo6K58J81o64M18J65k6N8k96
3468bK21l01J02J48q8k81M9j26J97N8j02j08M2j42J25K3K40j50L62l36l4j6K65
3491A46j6L0J62l50K03n5o2P7k04l6l9r0K1O2N6K61n48L82r4L4p4J22L48j58j92
3516a4RJ71j2K7j43l9J8O9j02J41k84pNPn5K36j32q6J23K89l37J86j00L8K03k25
3542a4l7J49M7P8n0K0J0mL4J1o1k69k69M76k94j78j53L35R0j49J89m3j73J04L4
$$ plain form
3372 -291 -242 -220 92 -135 -73 95 217 269 335 455 383 439 328 415 206 25 208 96 -120 246 19 -284 -296
3395 -296 -169 -254 -233 -355 -260 -185 -205 17 56 7 -182 -105 298 32 209 206 164 261 242 185 430 -270 39 61 -335
3420 -335 -278 -84 -73 -130 -267 -281 -116 -193 -193 129 -72 -48 -108 -79 209 205 135 426 20 250 113 47 84 20 -132
3445 -132 -17 -289 -74 -212 -45 -90 -125 -323 -436 -297 -174 -81 -33 -30 -96 162 343 -321 97 262 236 294 -2
3468 -2 219 -82 20 168 80 -201 -152 -278 -81 -23 -125 -233 -191 -333 -208 -185 55 -95 267 -69 -103 -119 146
3491 146 130 160 322 -28 175 120 58 135 -69 -105 -144 -234 -213 -151 -95 166 -382 0 -94 -60 -134 -12 336 178 -14
3516 -14 -5 166 154 181 38 -1 17 86 -16 125 -159 -166 -161 -154 -209 27 -105 -191 -68 221 -116 70 -30 8 211 -14
3542 -14 -51 98 145 223 173 193 203 199 233 244 183 -86 -355 121 -173 -351 -504 -169 -79 -228 -39 -82 -255 -151 -117
3567a17K47j93K08M2l1J7o2p3R4j74K44M6l27N3J90l93O8J3n0K1J2l08M6M82j07
3592e2K77k53J04m7N6J84K83l11k8qK30k90k82K42l13K03J32n1Om12J1R0R3pJ27
3617a6J5Pj92J70J19l5J67m7j67J27Pnk7P2J07l63KN4k47K00j59P9N1M9M6k62
3643b48J32r2K99j22q6J73j6N8O9R9m0k84K5L83l32O3O3j55k3m5M3K05m74R0r7
3668c12J84J26k33J98J3k2K10j25n7J92j32L02m24L3K14n3j1r4J08j67j67J19
3690i8m3j18J88L4M9j03N1L6j80M0J65M0J00j08K8j24K67j65O4q9J93j71L4k60
3714a70N5J14p2k18R7K29k94J60J2l0J28j13L3j82P2K84j68J44o1nJ89k57K00
3737A47K25j35k83l7K67l02j6K12M5k83M9j32K1l7j66L78J2j40L61j00R1J0J54
$$ plain form
3567 -117 130 -63 145 187 156 173 111 38 132 -42 202 248 -79 -26 164 -229 -161 -148 -198 -177 -165 -473 -427 55 -52
3592 -52 225 -28 76 29 85 269 552 241 213 205 435 145 -137 105 -208 -5 127 76 82 -330 -319 -229 -136 -143 -16
3617 -16 -1 6 -186 -16 103 68 235 188 21 148 155 150 123 195 302 -61 -59 -5 -252 -52 -211 -132 -81 -32 14 -248
3643 -248 -116 -208 91 -31 -117 56 40 98 167 266 226 -58 -33 350 18 81 144 -11 -34 -79 -36 169 -305 -215 -312
3668 -312 -128 -2 -235 -37 -24 -46 164 39 -18 174 42 344 -80 -47 167 114 103 9 117 -50 -217 -98
3690 -98 -141 -259 -71 -37 12 -91 -40 -4 -184 -144 21 61 161 53 81 -43 224 59 123 34 227 56 90 -170
3714 -170 -115 -1 -73 -291 -194 35 -259 -99 -87 -117 11 -102 -69 -251 -179 105 -63 81 20 15 204 -53 147
3737 147 372 237 -46 -83 184 -118 -134 78 123 -160 -111 -243 -222 -259 -425 -47 -35 -175 186 86 177 187 341
3760C41j47M2o1j34K16o3m01M25j79Q5r2n7m9j41r1J45K30n34M70j8r6oM24m51
3784a42K81k3j22P3K02j95K6M9o6j33L1K67k40J85n9j71r8K22j14j16J2k5J06
3807e0rJ71j30n9n8K17j5o9KK28Q2jm5q9p5k46K47n8k58J31J7j79J90N4l10K60
3833e2j27l9J99K67k68k02M28Q3r8J4j60J42P8M4O4j98j34l9K28O5m04l0K20k61
3857a80o4J29j46O8P6r3MJ99P9M2l16J71J58o0K25k17K10l2r5j39or5P3k72L5
3882b46J94k51J98p7J7N8o1mK40J25j10j95J51j26j2L07j12K40l45N0l6k97J48
3905a44J35l4J6nj01J56k68QJ31K8O4l1J90k75J01L2J70p4j06J11p7K26j69M6
3929A30n4J19n1j5m6J5L7k09l8m0Q1K05n09K01J52j12L0K18j40J10J12M7j18j06
$$ plain form
3760 341 194 236 175 41 257 194 -207 218 39 124 32 -25 -74 -215 -306 -161 69 -465 5 -13 -109 -115 309 -142
3784 -142 139 116 -6 67 269 74 100 149 83 -50 -19 248 8 193 134 -37 -135 87 -27 -143 -131 -156 -50
3807 -50 -59 112 -18 -77 -135 82 67 -2 0 228 310 309 264 175 100 -146 101 43 -215 -84 -67 -246 -56 -2 -312 -52
3833 -52 -179 -218 -19 248 -20 -222 206 289 191 205 45 187 265 309 373 175 41 2 230 295 -109 -139 81 -180
3857 -180 -244 -115 -261 -193 -117 -210 -206 -7 72 114 -202 -31 127 67 292 75 285 253 158 19 13 -82 -9 -281 -246
3882 -246 -52 -303 -105 -182 -165 -107 -168 -172 68 193 83 -112 39 -87 -99 208 96 336 -9 41 5 -292 -144
3905 -144 -9 -43 -27 -32 -133 23 -245 -237 -106 -78 -14 -45 145 -130 -29 3 173 99 -7 104 27 253 84 130
3929 130 76 195 144 129 83 98 135 -74 -112 -152 -71 134 -375 -174 -22 -134 -104 114 -26 84 196 243 125 19
3953A9K84k5j87M5j80J71j09J80j45l12m0j44L94k92N4j27J45K02k17O6J68Q6
3975C6L7J16n4M3j25PP4K5n7J39q4P3k10Jm4k88j53M09o5K6r9K07j12R2k00j03
4001c09L23nJ98n3K07k40J05L0R0l02j65K70r5q0J53k49J6k7O9K07l17J90J07
4024A23k63n0O4J22K01Oj4J0n6o9J19Oj47j39K33Lj10j60N4L8j48Qn1Rn7L0K95
4051E7k94K84k95J11j7J75j29L22j18J03j9k04L21o0j97q6J70j4j16k42K82k82
4073b48Q1p7J53l49J8J12L36J03o6j36K68PJ45p1k94LJ48j10K90k21j66K48k55
4096h1O1L6k14J52J67q3k90q7L51j06J22j95P5K60k19J38r5P6q6K36j72K27L8
4119C11l67K9K4O7l1k08j1j8j73J92j02J78J82m22J28K11J54l19L92l6q2K45j98
$$ plain form
3953 19 303 278 91 136 -44 127 18 198 53 -259 -299 -443 -49 -341 -287 -414 -269 -67 -284 -218 -50 36
3975 36 73 189 135 178 53 60 134 159 102 241 157 230 20 21 -23 -311 -464 -55 -120 -94 -193 14 -98 -6 -206 -309
4001 -309 14 9 207 154 361 121 226 256 346 44 -121 149 54 -26 127 -122 -106 -133 -64 143 -174 16 123
4024 123 -140 -190 -126 -4 197 203 189 199 143 74 193 199 52 -87 146 149 39 -121 -67 -29 -177 -169 -220 -211 -268 -238 57
4051 57 -237 47 -248 -137 -154 21 -108 214 96 199 180 -24 297 237 40 -46 124 110 -6 -248 34 -248
4073 -248 -167 -244 -91 -440 -422 -310 26 129 63 -73 195 202 347 276 -18 -15 133 23 313 92 -74 174 -81
4096 -81 -20 16 -198 -46 121 38 -252 -339 12 -94 28 -167 -92 168 -51 87 -8 68 -18 218 46 273 311
4119 311 -56 -27 -3 64 33 -175 -186 -204 -377 -185 -287 -109 73 -349 -221 -10 144 -175 217 181 99 344 146
4142A46P7k30L78k75l9j68K79k71K20l1j57j11J99l42K15J6J5J3j32J77k19L30
4164I0L5R1n5K5j96L04Q7km00J65j78m9J73j31o3M5l1j90L07j09o6o7K75j95j12
4189b47R5N9j5J71P9j04j03K18J55n0m7K2j98o1k6r1K61k77L67l26K08o04K35
4212b79J42K03n2j46m0K86l7r0N2J24j70K68J49k71m0n4J38k8j91K69l77R1k50
4235c03L02j48Q9Q4j98r7J29R8j02K8L68k41P6r2K47j52k3K30k03J00k27J39j80
4258g6K1K10m4K1j93m2Q2k04K54j17k4J1j17K87n8J10m9j20P2K87l0k73J35l13
4282a70M63k20J3L6k81K98m52M06j00m9J05l82K27J73p5L2K2k67M25k48J54R4
4304B04k63L05j88J7O4L3Pr7j42m3n4jJ77l68J75l6L50j93j41L64k50j03J50K28
$$ plain form
4142 146 223 -7 371 96 57 -111 168 -103 117 86 -71 -182 17 -325 -110 -94 -79 -66 -198 -21 -240 90
4164 90 125 216 161 186 -10 294 381 379 -21 144 -34 -83 90 -41 -104 -59 -90 -280 27 -82 -148 -215 60 -135 -247
4189 -247 -152 -93 -108 63 142 38 -65 153 308 258 211 233 35 -26 -52 -143 118 -159 208 -118 90 -514 -279
4212 -279 -137 66 14 -132 -172 114 77 -13 39 163 -7 261 410 139 99 45 183 155 -36 233 -144 -53 -303
4235 -303 -1 -149 -60 24 -174 -271 -142 -44 -146 -118 250 9 85 -7 240 88 65 295 92 192 -35 104 -76
4258 -76 -55 155 111 132 -61 -103 -21 -225 29 -88 -112 -101 -218 69 11 121 72 -48 24 311 281 8 143 -170
4282 -170 293 73 86 122 -159 139 -313 93 -7 -56 49 -333 -106 67 -8 24 46 -221 204 -44 110 204
4304 204 -59 246 58 75 139 172 179 82 -60 -103 -157 -158 19 -349 -174 -210 140 -53 -194 170 -80 -183 -33 195
4328A95P9m52L62k20J50j72j20L30k67k01N85j53l28K10P0j11j64j73J08J75l18
4349d15K63r9K45j80N7J62q1J89jJ50k24j1K14K8j48j50J74j63J53k8m36K04K2
4372g5j83j2M42m10j76N56j29j74N3P9J21j16K39j17K28J15l26k85K13J12k07
4393e2M5J13k29J31N9k00J71k36O8r4kR9K7q8Q7J69j1J42N7k11j3J47J05j57Q1
4418B08O8l89P6o7J15J18l13J09R0J77r9l63J45L0K2M6OK47l16R9J8j14M2P8J67
4443B00q1O1j43k27J95J41n9K6n9n6kQ2k28j05J74k43J34O8K87o4l1j95L03J28
4467C06j68q8oP5k1K47n23K58j59rJ76l87N2L1JJ07P7r8j35Q0L59o5k28J58J58
4492A98j19NJ21P8k36J7J0j03Q1j4k22K11j66k4j14K24p1n7J3M4N7J01q5k82L58
$$ plain form
4328 195 274 -178 184 -36 114 -58 -178 152 -115 -316 269 116 -212 -2 68 -43 -207 -380 -272 -97 -415
4349 -415 -152 -251 -6 -186 -129 33 -48 141 140 290 66 55 269 297 149 -1 173 10 163 135 -301 -97 -75
4372 -75 -258 -270 172 -238 -414 142 13 -161 -108 -29 92 -24 215 98 326 441 115 -170 43 155 -52
4393 -52 -7 106 -123 8 67 -133 38 -198 -130 -224 -226 -127 -100 -188 -101 68 57 199 256 45 32 179 284 127 208
4418 208 276 -113 -37 -104 11 129 -184 -75 15 192 93 -270 -125 -95 -73 -27 -21 226 -90 9 27 -87 -45 33 200
4443 200 119 180 37 -190 5 146 87 113 54 -2 -4 78 -150 -255 -81 -324 -190 -122 165 101 70 -125 178 306
4467 306 138 50 44 119 98 345 -178 80 -79 -88 88 -299 -247 -216 -215 -108 -31 -129 -264 -184 175 110 -118 40 198
4492 198 79 84 205 283 47 64 74 -29 52 38 -184 27 -139 -163 -277 -53 -124 -181 -168 -124 -67 34 -51 -333 25
4517B5o0K03j61J03o4K31k43J64j50K57k69OJ65j43k87q5qJ19J43N3r5k21K53
4540f4j21J64j42J45j29M44l62L67j35m7k41P3L88m52pM06j91j56j06m6J10o9
4562a71j12pR9K10l31L91j21K0J39j21J4R4n6k6Q0J60N7m57J62o2n2j58L52K03
4586C07m02j06L35k50j68L38q3j66l4K88j82J88j28K13Q6l05J36K33j70J30q4
4607A76J3l63K04K25m0k04J74l77K78l36J08l9RJ30j78L47k74l2L7J64j0J28k07
4630f7K12P8J12n56L87O7k42p5L21k71J8j33MJ5q8K10j04M6P7P1k57M7L57j49
4654H0j28J41j28L78k52O8J11p9Mj43m37L84j12J54N5l16J88l31Q3J32k3l4J10
4677i5J72J05K2l6PO5J02l84K54N9l72J55r4p7L74l64K0J7O3k1j52J93k21K01
$$ plain form
4517 25 -35 168 7 110 46 277 34 198 48 305 36 42 207 64 -223 -308 -316 -197 -54 -1 -96 -317 -64
4540 -64 -185 -21 -163 -18 -147 297 -65 302 167 120 -121 -48 340 -112 -119 287 96 -60 -166 -212 -102 -171
4562 -171 -283 -290 -191 19 -312 79 -42 -22 117 -4 10 104 48 22 102 262 319 -138 24 -38 -90 -248 104 307
4586 307 -95 -201 134 -116 -284 54 -29 -195 -229 59 -123 65 -63 150 236 -69 67 300 130 260 176
4607 176 189 -174 30 255 215 11 185 -192 86 -250 -142 -181 -172 -42 -220 127 -147 -179 -142 22 12 140 -67
4630 -67 145 223 335 -221 166 233 -9 -84 237 -34 -16 -149 -145 -130 -218 -8 -112 -66 11 82 -175 -128 229 80
4654 80 -48 93 -35 343 91 159 270 191 195 52 -385 -1 -113 41 96 -220 -32 -363 -280 -148 -171 -205 -95
4677 -95 77 182 204 168 175 240 342 -42 212 271 -101 54 -40 -117 257 -107 -87 -70 -7 -28 -180 13 -208 -7
4701gk44L45k84L19m21M69j52P9j10J58O1k60M37l53NM9K1p3j49j52J83K3N1K01
4725A96l90J31R1j33J03K9j62L89j98k50N95l80rN0J97J25k55l69K37L5o1J77
4747A48j62K1j11J90n49K49k22K39L8j40K35j24p7K30q4J06J52J85o2k53J5Q0
4769A04J66k02j44J59q6M9l75P9J16j66J11j11N1M62m54QL60l53L08j03L93j73
4791A99j02J46RK5K7j05j27p6K91j1r3j63j22l7M9j67K99J8j11m31K32R2P4K90
4815B06k94NO7K62l27M01j55j17J31N3l48L40k13p0KQ1K3k33K58j1j40k16J36
4838a59K59r5P2k02J54O4k1N4J59j67m7L07m05O1J07J46m89Q7L35j73R4m21L41
4861F1j94j72L3J25R4k24L00j78K80n3j5L55m05R4R4Q3k53j41K04Nj91j79N30
$$ plain form
4701 -7 -251 94 -190 129 -292 177 25 104 -6 152 213 -47 390 37 42 91 112 39 -110 -262 -79 -56 -5 196
4725 196 -194 -63 28 -105 -2 27 -135 254 56 -194 401 21 12 62 259 384 129 -240 -3 32 -29 148
4747 148 -14 7 -104 86 -463 -214 -436 -197 -159 -299 -64 -188 -265 -35 -119 -13 139 324 262 9 24 104
4769 104 270 68 -76 83 -3 46 -329 -250 -134 -300 -189 -300 -249 213 -241 -233 127 -226 82 -21 372 199
4791 199 97 243 252 277 304 199 72 -4 287 276 183 20 -102 -139 -90 -257 42 60 -51 -482 -250 -158 -84 206
4815 206 -88 -83 -16 246 -81 320 165 48 179 232 -116 224 11 -59 -57 24 47 -186 72 61 -79 -295 -159
4838 -159 100 5 77 -125 29 93 72 126 285 118 71 378 -27 34 141 287 -202 -115 220 47 141 -280 61
4861 61 -133 -305 -272 -147 -53 -277 23 -155 125 72 57 412 7 101 195 278 25 -116 88 93 -98 -277 253
4884B53k07j04j82J99j53lJ45j18J69j79J01J8n5K17j26J61J79k91K12pj06N5
4906A78j26J10Q0m72J43R5l81L03Pj23L1J24k06J91j54J12J81q0J50j28j02L82
4928C15k02J4J38m3k07n1R9j72J85k09J41k46K45k03j33j6o8PK31O0o3R8K6K50
4952A96p2Q3o6o6rJ81o9m1L5j29o7K99o36K17j39R5j53J15J35o0q4J35k20K70
4976e0r7K55l04K87j00j45L93J5J5k05qL31j56l6J04j62J73k84k61m7K55j87M6
4999a68j14m7O7J42K7J10J2R8P9r8j53K16k8p3J07j07J60n7j30j01J62k15L2r4
5023a73j2r1K07p3n4J28j18J07K43j03j86Q2M6J60N6K20k42j94K47l9K9r0J37
5046B87j83j84M7l01J77J2qL7j81J19K11j91R9m2N07l49Q4J76k81J84k2j55J59
$$ plain form
4884 253 46 -58 -240 -41 -194 -197 -52 -170 -1 -180 -79 -61 -116 101 -25 136 315 24 236 229 123 178
4906 178 52 162 242 -230 -87 8 -373 -70 -63 -186 -155 -31 -237 -46 -200 -88 93 13 163 35 -67 315
4928 315 113 127 265 222 15 -36 63 -109 76 -133 8 -238 7 -196 -329 -345 -413 -406 -175 -115 -178 -80 -54 196
4952 196 124 207 141 75 66 247 178 137 172 43 -24 275 -361 -144 -283 -188 -341 -226 -91 -151 -235 -100 -320 -50
4976 -50 -147 108 -196 91 -9 -154 239 254 269 64 56 387 231 195 299 137 310 26 -235 -282 -27 -214 -168
4999 -168 -282 -329 -262 -120 -93 17 29 127 206 108 -45 171 143 70 177 70 230 173 43 -58 104 -111 -79 -173
5023 -173 -185 -276 -69 -142 -196 -68 -186 -79 164 61 -125 -43 3 163 219 439 197 3 250 211 240 150 287
5046 287 104 -80 -33 -334 -157 -145 -153 -116 -297 -178 33 -158 -59 -101 406 57 141 317 36 220 198 43 202
5069B02r9j79L5R1J93l54P4o2j10J10k3j34R8N3K15j1k14L88j46K10k91J84k24
5092FJ03O7r2J6m6R7k05J5j01L04q9m02pP5K20m32K42k00N04j01J1k8p1J31N2
5117F9M34m01PJ16j39k35L78k36p5J7K2q3J00m59O9K42p1L3K98j38j68K84R0j93
5141c9l2K86l9R5k96L31j71M2k61K8K93k27J75q8l53J33j48K38j65j49J39j4M3
5164a79J76j09J29J14j08K41j42J63j46O8r3J4K89k04j02J42m28J21r2J24m4m4
5186a10j12L0OJ26m6k5m8k9L67j70j26L00o4K49l2r7r7K21k14N6PL1j34K7j68
5211e2J39O6j67J54l06o1J62l3k6K8J34r3l7J54j13K35J14l33J10J66r8nn6k32
5235a50K19l9j72J63n5M2q3n4k46L42p6O4J35k17L56k12J26j06J11J23j23j40
$$ plain form
5069 202 103 -76 -41 50 243 -111 -37 -99 -209 -99 -122 -256 -158 -105 110 99 -115 273 127 337 46 230 6
5092 6 109 176 84 100 54 151 -54 -39 -140 164 75 -327 -334 -259 -39 -471 -229 -429 75 -26 -15 -43 -114 17 69
5117 69 503 102 109 225 86 -149 229 -7 -82 -65 -43 -126 -26 -485 -416 -174 -245 -212 86 -52 -220 64 154 -39
5141 -39 -71 215 176 271 -25 306 135 177 -84 -56 237 10 185 97 -256 -123 -271 -33 -198 -347 -208 -222 -179
5164 -179 -3 -112 17 131 23 264 122 285 139 207 114 128 417 213 111 253 -175 -54 -146 -22 -66 -110
5186 -110 -222 -192 -186 -60 -106 -131 -179 -208 159 -11 -137 163 99 348 316 219 122 343 129 185 192 223 89 116 -52
5211 -52 87 153 -14 140 -166 -227 -65 -98 -124 -96 38 -55 -92 62 -51 184 298 -35 75 241 143 138 82 -150
5235 -150 69 30 -142 21 -34 8 -75 -129 -375 -33 -109 -45 90 -127 229 17 143 37 148 271 148 8
5257HK24P7k48O7P3j22j00O4M4j02j08J77k67k1J33j47L7K17Nj38O3N0L39l82
5281e7o0K45P5n0J5lk59L0L0n8j35Pj75L8L74l94k0L93K79l68K55k02K6K53K8
5306B67k01RJ30ko8p5J5j04K14n0k4J07m73J21l68J06J93k3J14Q4k4J49j56k70
5330c29M75k73L69j54K33k73L17m2j32J40k88J96k52J29k48m8k4k30L63j31j23
5351c25M25k62o5L5Q7J82j54J74j96J72L12l16Q9o5j49l9J74K23m23o8Q6K14j03
5374Hr6r1j1RK11j97j94K25M5J25n8J20K8j06K48j62j57K23j40K9M2O2J35m28
5398a30j23L11j16j7j5O3k74K33P0j76J32j22J00j43K92m7J64P7j75K30k63k15
5420a44J63K37k76Ml9M0J67j04j47j34O0N6m8K76k58K0o8J00l8L8L00j61M0M17
$$ plain form
5257 8 232 309 61 128 201 79 -21 43 87 -15 -123 54 -213 -234 -101 -248 -211 6 11 -127 -64 -14 325 -57
5281 -57 -117 128 203 153 168 165 -94 -64 -34 -92 -227 -220 -395 -357 17 -377 -397 -4 275 -93 162 -40 -14 239 267
5306 267 66 75 205 203 135 60 75 -29 185 135 111 218 -255 -134 -502 -396 -203 -226 -112 -28 -52 97 -59 -329
5330 -329 146 -127 242 88 321 48 365 323 191 331 43 239 -13 116 -132 -180 -204 -434 -71 -202 -325
5351 -325 100 -162 -227 -192 -105 77 -77 97 -99 73 385 69 158 93 -56 -95 79 302 -121 -189 -103 111 8
5374 8 -88 -179 -190 -181 30 -167 -361 -136 -91 34 -24 96 124 18 266 104 -53 170 30 59 101 163 298 -130
5398 -130 -253 58 -58 -75 -90 -27 -301 -68 2 -174 -42 -164 -64 -207 85 38 202 279 104 334 71 -144
5420 -144 19 256 -20 -16 -55 -15 152 48 -99 -233 -173 -117 -165 111 -147 -127 -195 -95 -133 -95 205 44 84 501
5444E01m96K73o6j17J43j53j2K28k93Q1j92k4j88J32K06j71K2k40L49j30l5J03
5466g9J74kJ18p8K59o0j74k0J63j22k15J46j46L47n19K04o3J95l29j31M1J34J55
5489bk64M33m4j96J64k4N3J41OJ04j76m0n2J4n2J12Lj70m4l4r1K05p5m23K35k34
5515d51L41j88J82q4L64j38J42O8j21k2KQ6J59L6q0j72j21j15K43k48j52J28J5
5538a26l02K89l11J8L4K40K5L05k62J80o1lJ41j38L26k00J18k01L00l30K17j45
5560A14j40r8K0J00l96J39J97K72k92j71L21j17M7J74p7j0P3P3j42k2L36j98L40
5583E43m30J45j47q6L16k57K8k17k73L79O2j09j35l4L3PJ55l2k02K01pK25j91
5606b6K75k33J79j99L8J25m2j52J27q5o1P3l57L36k64J19k3Km9J99j00K18j58
$$ plain form
5444 501 5 278 212 95 238 85 73 301 8 89 -103 -127 -315 -183 23 -148 -126 -366 -17 -147 -182 -79
5466 -79 95 93 211 133 392 332 158 138 301 179 -36 110 -36 311 -208 -4 -67 128 -201 -332 -291 -157 -2
5489 -2 -266 167 123 -73 91 67 120 261 267 371 195 155 103 117 65 177 180 10 -34 -68 -159 46 -29 -452 -217 -451
5515 -451 -110 -298 -116 -200 164 26 168 236 115 93 95 181 340 376 296 124 3 -112 131 -117 -269 -141 -126
5538 -126 -428 -139 -450 -432 -398 -158 -133 172 -90 90 29 26 167 29 355 155 273 72 372 42 259 114
5560 114 -26 -124 -104 -4 -400 -261 -64 208 -84 -255 66 -51 -4 170 93 83 156 229 87 65 401 203 543
5583 543 113 258 111 25 341 84 112 -105 -378 1 63 -46 -181 -215 -182 -175 -20 -52 -254 -53 -60 165 -26
5606 -26 249 16 195 -4 34 159 117 -35 92 7 -54 19 -338 -2 -266 -147 -170 -168 -217 -18 -118 100 -58
5629e8l9K53J84l82K86J49l06L3P4j42j62M12k78L2p1r3p6Oj47J41L9K17n52K19
5653b61L01o3m3K45l9j15J39k10J68M8j30K4mJ45k00k04K15j02J5j71K35j58J37
5676b8o6J9j18K77l95J36OL8K59j6J72o1j47j7L42l92R7l17J58r9P9J13j06q9
5700a55R5k46r9M63l20m9J41J4K07J20J09k33j76L50k39M22j85j9J75k10N8l94
5722a71K39%k26J87k09J6m3J5K40k1l18nJ68J69j69J88J37j25O4j32J40J17k92
5745c1M47l33L5J22l40O8O0J12m08J76Qp2J26r9K4J39q1j10J97l79L30q7qM6L27
5770B69l7R0j81k62L90J5j37j33m0j85R9j43N8j91K02l0Q3J47r2j4K8J03j52N3
5794f0J06M1J37j28K49k80J12O8L8l02j59K58k07J42k41q2M10o5q2k43Q7K36j99
$$ plain form
5629 -58 -97 156 340 -42 244 393 87 120 194 52 -110 302 24 56 -15 -108 -184 -178 -325 -184 -145 72 -480 -261
5653 -261 40 -23 -66 179 140 25 164 -46 122 170 40 64 60 205 5 -199 16 -86 -71 -242 -7 -165 -28
5676 -28 -94 -75 -193 84 -311 -175 -169 -131 128 112 284 223 76 59 401 9 106 -211 -53 -152 -73 40 -66 -155
5700 -155 -60 -306 -405 58 -262 -311 -170 -156 51 171 280 47 -129 221 -18 404 219 200 375 165 223 -171
5722 -171 68 68 -158 29 -180 -164 -207 -192 48 27 -291 -296 -128 41 -128 60 197 72 136 4 144 261 -31
5745 -31 416 83 118 240 -100 -32 28 140 -268 -92 -84 -156 -30 -129 -105 34 -47 -157 40 -339 -9 -96 -104 -58 269
5770 269 232 322 141 -121 269 284 147 14 -26 -211 -112 -255 -197 -388 -186 -216 -133 14 -78 -92 -64 39 -113 -60
5794 -60 46 87 224 96 345 65 177 245 283 -19 -178 80 -127 15 -226 -308 102 37 -45 -288 -201 35 -164
5817a64L82l88L14j00L08k23j4k1L66k63J82J6l98J89j09j27lP3j77p9R8Q0rl5
5841a02j04L01k32K41N3q6J22j44R6j23J86j04j02J41j22N8n4J48k92q3K02j58
5863a58k8J07j8N0l01J79l8J98NL67j32j18L7K07k13n6j55J67l3m3J40j88J78
5886A54P1m14K02k09o0k7o4N4j50M14Q2n3j00J0N2Nm6j9L49J29j80Mj40J25j20
5911F9j67K74n1j4l9l07r3k7L14n9j04l8m8K75j20r8N8K18O9J43K2l15M21o5j91
5936A27J93k32j42R7O1m0j62k4j87m5J20j56J94l2K59nj2k45q5M30p9R8l84L82
5960A31J20k46K02j51J55q1n2m2j47L2n1J63r2m9J3j48j17R3J10P0k2J48j92L00
5984A47k45J28r3P7O4R3k8j56M1j9K37m23M15k98R3j51j07J43j12J90r6J6q1J13
$$ plain form
5817 -164 218 -170 144 44 352 129 115 94 460 197 379 395 -3 186 77 -50 -53 20 -157 -236 -138 -58 -67 -102
5841 -102 -206 95 -137 104 157 71 193 49 145 22 208 104 2 143 21 79 25 173 -119 -202 0 -158
5863 -158 -186 -79 -97 -47 -348 -169 -207 -9 -4 363 231 113 150 357 144 88 -67 100 67 24 164 -24 154
5886 154 225 -189 13 -196 -256 -283 -347 -293 -443 -29 53 0 -100 -90 -38 -33 -79 -98 251 380 200 204 64 189 69
5911 69 -98 176 125 111 72 -235 -328 -355 -41 -100 -204 -242 -290 -15 -135 -233 -175 43 112 255 277 -38 383 318 127
5936 127 320 88 -54 43 104 64 -98 -122 -309 -354 -234 -390 -196 -228 31 26 14 -231 -316 114 35 133 -251 131
5960 131 251 5 207 56 211 130 78 36 -111 -79 -130 33 -59 -108 -95 -243 -360 -267 -157 -87 -109 39 -153 147
5984 147 -98 30 -63 14 78 171 143 -13 28 9 246 -177 238 -60 33 -118 -225 -82 -194 -4 -100 -84 -165 -52
6008e2j4n8M5J3J57J20J56j68j39k7J1L08n6j07j00m61L90Pl6l7Rp3p1K43l14
6033b54K90o9j63N08m52L37j62J58P5m45M89j28k72P7o4J43j58LJ7J03k65L1o8
6056b69K66j89J48J78n2q2j51J4J70K93j1kR3k60j30P7q8J00j2O5l11M6l6P4j6
6081h5m2j7k42L89m10M82k56O3J60Q9K2k05J63o1J57R8k57k5K9P7K22k97p2J56
6105A38R4j21k18j65j49L42r1lm8o9K18q5J28K41j25K2l6j5j5K22k73J26J31L7
6129B86m85K08N2j75j58o9J12J80k19r7J89J8K30m79M59K5j14O9K76k98O7J28
6151B05k5Q1K6p4n5k73J60j19j9J90k70j06L68k27o0P6l3j57R6K74j54j56K95
6174D3P8J41k13M7K76n3o9l4k86K28j4j97n7J49J05k44K3j77K27j58J45k52M22
$$ plain form
6008 -52 -66 -124 -79 -66 91 211 367 199 60 33 44 352 296 189 89 -372 18 25 -11 -48 -39 -112 -183 60 -254
6033 -254 36 -33 -196 312 -140 197 35 193 268 -177 312 184 -88 -11 -75 68 -90 -87 -70 33 -232 -201 -269
6056 -269 -3 -192 -44 134 82 0 -151 -137 33 326 315 313 406 146 16 93 5 105 93 158 -153 -107 -143 -69 -85
6081 -85 -127 -144 -386 3 -407 75 -181 -118 42 131 153 -52 111 50 207 305 48 23 52 129 351 54 -18 138
6105 138 232 111 -107 -272 -421 -79 -170 -173 -221 -290 -72 -157 -29 212 87 109 73 58 43 265 -8 118 249 286
6129 286 -199 9 61 -114 -272 -341 -229 -49 -268 -365 -176 -158 72 -407 52 77 -37 32 308 10 77 205
6151 205 180 261 287 213 158 -115 45 -74 -93 97 -173 -279 89 -138 -198 -122 -155 -312 -216 58 -96 -252 43
6174 43 121 262 49 96 372 319 250 216 -70 158 144 -53 -110 39 144 -100 -77 -254 -27 -185 -40 -292 130
6197A30K3l90K33L4K54m41K79M09l47l00K87j33K57k99M4P9J4k58j5K2q7j32J50
6220a87qN8J08J13j71m5L68k96J62O2j13P3pJ50j66j9J37l83J57k43o9N51k70
6243c8J72j48l89K99m9J40m7m9K40O8j73k07Q9K38o8K75k00k28J91k71K20j0O0
6266A15R1k72q4N3j52j29K03q6K31j34J61P3k81K19l5J22J5O5j25M5kK45k33j7
6290H8M2M5p7kk79J91R8Q3l45j9n9P2L0j65L67L6j12j59J59J23%J97l88L79k83
6315B2L51k25m9Q9j24j28j3K39j12l11J3K1k0O5J16J1n2O4j00k7J83M9j17J86
6339A31J89j79J06k32J64n1j47K61j26K1Pl1k55K03k04J41Q7k72J09o4L3K10j06
6362er2J55M8l1L5J44j54J45q6K3N3j09k15J31J3k63J56l79K29%N9j06K82j93
$$ plain form
6197 130 153 -237 -4 30 284 -157 122 531 184 -116 171 38 295 -4 40 119 133 -125 -140 -118 -205 -337 -187
6220 -187 -195 -137 -29 84 -87 -132 236 -60 102 164 51 124 117 267 101 82 219 -164 -7 -250 -319 232 -38
6243 -38 134 -14 -403 -104 -153 -13 -60 -109 131 199 26 -181 -92 146 78 353 153 -75 116 -155 65 55 115
6266 115 206 -66 -150 -97 -249 -378 -175 -261 -30 -164 -3 70 -211 8 -27 95 110 175 50 95 93 338 105 88
6290 88 130 175 98 96 -183 8 106 189 -156 -175 -234 -162 -132 -297 70 106 -6 -165 -6 117 117 314 -74 305 22
6315 22 373 148 99 188 64 -64 -77 162 50 -261 -248 -227 -247 -182 -66 -55 -107 -43 -143 -170 13 62 -55 131
6339 131 320 141 247 15 179 128 -19 242 116 137 144 113 -142 61 -143 -2 85 -187 -78 -142 -109 101 -5
6362 -5 -97 58 106 75 110 254 100 245 159 182 235 126 -89 42 55 -208 -52 -431 -202 -202 -143 -249 33 -160
6386a60n7M9J69j24JL84%j78r1M46k99j09O1j12K42k30O3K49k11N3k79j7N6J21
6410B7l24K10m5K24k1J42j52J02l00l8J85J82N1KJ92k86Q6k57Q6j27K58l09oK19
6434A01l63J52J90l50K31j26L70k18J84l77L45k75K15J94j21K0J2J14j01j68q9
6455f0L46k66k02O3oJ12r5q4J84n8n9n8k01L39J02n2M9m0K13r3j41J31M6j2l28
6480a70L76j82J39k89J59k24j0J03j41Q8K5Oj80P3J75j41Q5J12n1Q5M1J05J33
6503C17j69J63j19J24n8k88j25rK00j76l3k97K31M2J71K03k74o3K30j76m6L78
6525B26k5m53K82L49j25N1j52L83n30M01k12k9r5J91p3l34N3M19n82m4m7L95N5
6548A04r1k52K95j19oL22k71J27K14j84j0J03Jj78K42k7r7k09O2O4k10j80K77
$$ plain form
6386 -160 -217 -168 1 -123 -122 262 262 84 -7 439 140 31 92 -20 222 -8 55 304 93 146 -133 -150 -94 27
6410 27 -297 -87 -132 92 71 213 61 163 -137 -175 10 192 243 245 437 151 237 -20 66 -61 197 -112 -118 101
6434 101 -262 -110 80 -270 -39 -165 205 -13 171 -206 139 -136 79 273 152 172 184 298 197 29 -60
6455 -60 286 20 -182 -119 -125 -13 -108 -192 -8 -66 -125 -183 -384 -45 57 5 54 14 227 134 -7 124 170 158 -170
6480 -170 206 24 163 -126 33 -191 -201 -98 -239 -151 -126 -120 -300 -227 -52 -193 -108 4 -47 38 79 184 317
6503 317 148 311 192 316 258 -30 -155 -164 36 -140 -173 -470 -239 -197 -26 177 -97 -160 70 -106 -152 226
6525 226 201 -252 30 379 254 305 153 536 6 407 195 166 71 262 189 -145 -92 327 -255 -299 -346 49 104
6548 104 13 -239 56 -63 -69 253 -18 109 323 139 129 232 233 55 297 270 173 -36 26 90 -120 -300 -23
6571b3l42M70k30N4r7M05l16j20R9K60J37j52j07m6L06j96K56l69m9nN6J19l83
6594b73J11J9j00J8K06k77K32J08m1j66k5K43J36k23J89J01J0l81j4N19k02j59
6616C1M02j94J15k08q1rj2j98L4N8l72L55o1P9j2LR5k32M8J53o4L77k72j23K98
6641B10k1l13K97p2lo5L11m02J3j77P1J5M2j55k04K48J51j29J65M15m77J04J07
6664A31qK85l82K72M2j41o6p6o0k15L25L3r6k02n7r0K04j92J04J23J89k24M3O5
6688GJ73j0j02J00m5Q0k42L01k83n0M0J33j20j76K76j97q5J16j15j70M1J31O9
6711a28Q0j72J67K30l92M81j89J75J55j16o3j85K1K05L6l56J82j32j74M1J5l7
6733a56Q9k24J91P4j90Q3J61l21J31K12n5L45j77QPlj35J82j12P7j20K89j83k92
$$ plain form
6571 -23 -365 105 -125 -71 -168 237 -79 -199 -100 160 297 145 38 -8 298 102 358 -11 -60 -65 -9 110 -273
6594 -273 -162 -143 -243 -225 -19 -296 -64 44 3 -163 -188 55 191 -32 157 258 268 -113 -127 392 190 31
6616 31 433 239 354 146 65 56 44 -154 -120 -62 -434 -79 -140 -61 -73 -70 25 -207 -159 -6 -70 307 35 -88 210
6641 210 189 -124 173 101 98 33 344 -58 -45 -222 -151 -136 -94 -249 -453 -205 -54 -183 -18 397 -80 24 131
6664 131 123 408 26 298 340 199 133 57 -3 -218 107 140 44 -158 -215 -305 -101 -293 -189 -66 123 -101 -58 7
6688 7 180 170 68 168 123 203 -39 262 -21 -71 -31 102 -18 -194 82 -115 -200 -84 -199 -369 -328 -197 -128
6711 -128 -48 -220 -53 177 -215 266 77 252 407 291 228 43 64 269 305 -51 131 -1 -175 -134 -119 -156
6733 -156 -67 -291 -100 -26 -216 -133 28 -293 -162 50 -5 340 163 171 178 175 40 222 110 187 67 356 173 -119
6757a19Q3M6m2k8l29J97nl1M2K2j33K56J93m04K56N3K74j76K1L3J22l31P1O2k42
6782a09J7R9K71m58R9J31k72J83j25L78l13M1k6K02j73J96r2k72J17L07q4o2J06
6805A61O4j52p2R7l27K44J62lQ0k49j35P8k24K0J86K11k94P2J22K22j99j64j1
6828a11O04l65O9J24r3j89k97K85j14m0L2j23m0L32j8l25J86k26M75r1m62L47
6850d0L13k79j70J07L73n17L68J7N2jj3p9m0J4o9k25L23m96L36k15Q1j10P2L9
6874a59j66L67q3J0R1k3J40k2j63J08l9R7j01k91N39l71J85j63O9j72m2m1J6K11
6898cp1M1j94J63P9j47J72K1o5K20L7rO4k60N5o0R5p3K10r3j40N1J9k78l5J03
6924i8J99r7K39l45q2m0R9L1j18J27R3MK35j58N0K2%m1m3k15K54J1k80J9J31n5
$$ plain form
6757 -119 -36 10 -32 -60 -389 -192 -197 -228 -186 -164 -297 -41 152 -252 4 57 331 155 176 209 331 0 71 133 -109
6782 -109 -92 7 278 -180 -81 50 -222 -39 -164 214 -99 -58 -84 118 -55 141 49 -223 -106 201 117 55 161
6805 161 225 73 1 98 -229 15 177 174 254 5 -130 -52 -276 -256 -70 141 -153 -81 41 263 64 -100 -111
6828 -111 493 128 197 321 228 39 -258 27 -87 -127 -95 -218 -258 74 56 -269 -83 -309 166 75 -387 -40
6850 -40 273 -6 -176 -69 304 -213 155 172 224 223 210 131 91 105 36 -189 134 -362 -26 -241 -160 -270 -198 -159
6874 -159 -325 42 -41 -31 60 37 177 155 -8 100 61 158 57 -234 305 -66 119 -44 25 -147 -189 -230 -214 -3
6898 -3 -74 -33 -227 -64 15 -132 40 61 -4 216 253 244 308 48 103 43 138 65 275 182 42 93 112 -166 -201 -98
6924 -98 101 4 243 -102 -184 -224 -125 -94 -212 -85 8 12 247 89 139 161 161 120 77 -138 116 127 -153 -134 -3 -58
6950e8Jk66j7K40j04J02Q0q2L3J79j12K13j88P8L21j71j37l7j95L1K36k21J79
6973A05k43J91k20j07P3j26K3L88k32J53J37M3k57P4L4P5M6j2j20K90K1k95J9
6996F0j44PJ1Q0m31K70L09k67J03k01m2R7R1K10j92k13K15NQ7J68k62L27m05K71
7020A54P7J21n5l00K39j22n5n1j04j56L57l83M0j84K86l5J17m8j29J65J18Q7l61
7043b22K96K07k1N7j7j2m1j12J44m6k71J97k52J55k72k72M48k16K68m8r8O4k8
7066i2M6j70L35k93K15P2Qj17N2J9PJ05j0q2m2k25K26K2l52L29l51K5J31J90m31
7091c83M7M64k74J91J06l52K39J52Lm0j08Q9k43J60q5n4j41J74%P9j6k25J02q6
7115b01L7j37J86K29l96J00L09j12r5J66k23J36k3P5J64j9q8P7MN5k81oN2r7j9
$$ plain form
6950 -58 -57 -323 -340 -100 -204 -102 -22 -104 -71 108 -4 209 21 99 420 249 112 75 -120 -89 147 -74 105
6973 105 -138 53 -167 -274 -201 -327 -304 84 -148 5 142 185 -72 2 36 111 157 145 25 315 336 41 60
6996 60 -84 -77 -66 14 -417 -147 162 -105 -2 -203 -245 -148 -57 153 -39 -252 -37 -32 55 223 -39 288 -117 154
7020 154 231 352 297 -3 236 114 59 8 -96 -252 105 -278 -238 -422 -136 -171 -54 -102 -231 -66 52 139 -222
7043 -222 74 281 260 317 300 288 247 135 279 233 -38 159 -93 62 -210 -482 -34 -250 18 -30 -128 -64 -92
7066 -92 -46 -216 119 -174 41 113 121 4 56 75 82 187 177 95 53 -172 54 76 -276 53 -298 -273 -142 48 -383
7091 -383 -336 128 -146 45 151 -201 38 190 193 153 45 134 -109 51 -34 -88 -229 -55 -55 24 8 -217 -115 -201
7115 -201 -164 -301 -115 114 -282 -182 127 15 -80 86 -137 -1 -24 51 215 196 108 185 189 244 -37 -43 9 -88 -107
7140a07j58K53j68K63j94k3j0k55L35q2K85J01k85Q5j20K46P2k33P1J04j35J06
7162A51l7O0j69R3j26l2J2j0J19j55J38j89nM4J57l4J11j74J6J46j43J70Kj50
7186eN1P7o1qq3J83l46J17j2J60J48m56K3O4P7j50K82j38j39J79j01K65nN9J18
7211B99j92j02K46j69P7k16j03N9J98n2j36K3k10J69M14l97J96j97K77j59Q1K31
7233C37l27k39K51MJ41k44K9R7j11L86m68M2JPj12J74m09K45J70L4L7k99J40J85
7257G1j54r2K85k11J45J42r8Q3qj84R7J56l4n3m04K77j54M8p6k58K25n7N2j03
7281c05J0L61K3k66M30r8l10L29j09j60KK63p6J51j05m9j85J32j81K93j58RJ12
7304A13j54J61k84k6J66J13l02K83M4j94j9J94N1m2o0K8K45l69J48M4j30k5J93
$$ plain form
7140 -107 -265 -12 -180 83 -111 -134 -144 -399 -64 -146 139 240 -45 40 -80 166 238 5 76 180 45 151
7162 151 114 174 5 98 -28 -60 -48 -58 61 -94 44 -145 -150 -106 51 17 128 -46 -30 116 -27 143 145 -5
7186 -5 46 123 62 54 -29 154 -192 -75 -87 73 221 -235 -212 -148 -71 -221 61 -77 -216 -37 -138 127 122 181 299
7211 299 107 5 251 82 159 -57 -160 -101 97 45 -91 -68 -278 -109 305 -92 104 -93 184 25 106 337
7233 337 10 -229 22 26 167 -77 -48 49 -62 324 -144 -102 -101 -94 -206 -32 -441 -196 -26 8 45 -254 -114 71
7257 71 -83 -175 110 -101 44 186 88 171 163 -21 76 232 198 145 -259 18 -136 -88 -164 -422 -197 -254 -202 -305
7281 -305 -295 66 89 -177 253 155 -155 174 65 -95 -93 170 94 245 140 91 -94 38 -143 150 -8 1 113
7304 113 -41 120 -164 -190 -24 89 -213 70 114 -80 -99 95 146 104 44 72 317 -52 96 140 10 -15 178
7327A78j7Q4k42j00O5j03j56k5l8L39K34k09P2J59r5J86k39k2K61k31q1J47j62
7350EO9K75m08J87L8k86K13m6j15o5o9j4L00k55L95k51K2P1J8L1q6K74k07J24
7374B20l67L90q2M0k63O5J90J62k82j64P4o4L9p6l46L60k31M19k44j4K82m72L81
7397A7J43j68R5J00o0j68J07k03K1K19K6k87KkJ64m0M3J7k76K05l6L1JmL30l11
7423c4P4p2K07p7r3j45N30l14j7Rn4k37L31O9j97o4J7N0r3j06p1K19K39k95J3
7448a11J40k2J08n3P1m4R1j17K04o4n9n5k03j1O7K34j97o0j07K3J5l2j92K29K34
7473H9j79P4J38j98l3J31k5mJ47J40k53rL05j58j11O8p5PJ33j44j28PJ23j44O9
7498c0r2K65r4k26L62k53K3J5J72J90l72J33L0j84J20K4j93J67j77J99j05M9j42
$$ plain form
7327 178 161 245 3 -97 -32 -135 -291 -316 -354 -15 219 10 82 241 146 332 93 71 332 101 20 167 5
7350 5 74 349 -59 128 166 -120 93 47 -68 -133 -202 -216 84 -171 224 -27 -5 66 84 115 29 303 96 220
7374 220 -147 243 161 201 -62 3 193 355 73 -91 -17 -81 -42 -118 -464 -104 -335 84 -160 -174 108 -364 17
7397 17 160 -8 87 187 127 -41 66 -137 -116 103 129 -158 -156 -158 6 -34 9 26 -250 -45 -81 -50 -49 -53 277 -34
7423 -34 40 -32 175 98 5 -140 390 76 59 68 14 -223 108 177 -20 -84 -67 -17 -110 -216 -287 -68 171 -124 -111
7448 -111 29 7 115 62 133 89 180 63 267 203 144 89 -114 -125 -58 176 -21 -81 -188 -165 -150 -182 -374 -145 89
7473 89 -90 -16 122 -76 -109 22 -3 -7 140 280 27 18 323 165 54 122 47 54 187 43 -85 -78 45 -99 -30
7498 -30 -122 143 49 -177 185 -68 -45 -30 142 332 -40 93 123 -61 59 83 -110 57 -120 79 -26 23 -119
7521a19%l18M59j86q4j3Q5J02J15n7L85m46J09mN9q6L71j71j14J55k53J03k19
7544a27K82m28J29J58j56L8J08rj99k29L69Q9M7L3j9j91K21Q9m43O87l39j54J46
7567A02l5k59K20P9j28j86OK27j84N3j84K0Q5m3L27k63K0j78K22J14L4J2r2J97
7591A66o8rj21L1n7K48l71J14J11m22L52J18k15J29J71k64k69K25r0L56j64O9
7613D0P4J40p0J44n6q9No1j28p5K38l45L95l79r9L23k74J51l10K44Q9j41L9K39
7637I4m89L62J37l41K28J53r4N7l6L6oR0l8j17j65L0J06J52n2l20j86J88J0K14
7661A3j80m0K59O3j32k87L87m7j16J43M0M6m18L47J33j27j0k18L25m56J68m4l24
7684d75K50j90J91L06j47k96K63K38j79J52N0j31N0Q1j45L01n3m04J77j30K85
$$ plain form
7521 -119 -119 -437 22 -164 -248 -261 -176 -74 41 -16 369 -77 32 28 87 1 372 201 87 242 -11 92 -127
7544 -127 155 -273 -144 14 -142 -104 4 -5 -204 -433 -64 25 72 105 86 -105 116 205 -238 449 110 -44 102
7567 102 67 -192 28 107 -21 -207 -201 26 -158 -105 -289 -269 -184 -227 100 -163 -143 -321 -99 15 49 61 -31 166
7591 166 98 89 -32 -1 -58 190 -181 -67 44 -378 -26 92 -123 6 177 -87 -356 -131 -221 135 -29 40
7613 40 114 254 184 328 272 183 188 127 -1 -76 162 -183 212 -167 -266 57 -217 -66 -376 -132 -43 -184 -145 94
7637 94 -395 -33 104 -237 -9 144 50 107 71 107 101 191 153 36 -129 -99 7 159 107 -213 -399 -211 -201 13
7661 13 -167 -207 52 115 -17 -304 83 36 -80 63 103 149 -269 78 211 84 74 -144 181 -275 -107 -151 -475
7684 -475 -225 -415 -224 82 -65 -361 -98 140 -39 113 163 32 82 163 18 319 266 -138 39 -91 194
7705A94k28oJ9k17K74l66K60k0q3M3J27p2o1J76l96K18J11j52J48O9l6R1k0L20
7729C93j56J29k69o3k4J43q5q5k23L03q5M8p3l8R4L6j7J9l0m2J11P9k15m6Q3J86
7755A73o6J51p7J27j25m25J00m3r4L34k07j46Q5J07J15j08r2M4L42j68Q6l0j67
7778h4p8J52Ol1m3q0R3K02j17L9m0M6j30J47l72J07K52j83rJ23j72K5M5Q1N0K0
7804D9J42k67K32n9O5l50K00j61R0J72j82p4K5M5J33l41K66o9j42M38m06L11l87
7827b70L86k24L47j75J58k77K99K03j09j59j08O2o6J27k32K39l47J79j72J02N6
7848A9o8%q4n9K1L9P4J80k45k8L16j1k32K92Lk43K86k15n4m5j51N27n44L43k66
7873a45l47M04P3j53J32O5n1R8k72K98P8k43o3Q6J45K14k96J10L4K24l37J54j82
$$ plain form
7705 194 -34 -40 -21 -238 36 -330 -70 -90 -173 -130 -3 -75 -136 40 -356 -138 -27 -179 -31 38 2 93 73 393
7729 393 237 366 97 34 10 153 68 -17 -240 63 -22 26 -47 -85 9 45 28 47 17 -25 86 165 -50 -96 -13 173
7755 173 107 258 181 308 183 -242 -142 -185 -279 55 -152 -298 -213 -106 9 -99 -191 -147 195 27 113 83 -84
7778 -84 -162 -10 -4 -35 -78 -158 -65 137 20 59 19 65 -65 82 -290 -183 69 -114 -123 0 -172 -147 -102 -21 29 49
7804 49 191 -76 156 97 162 -188 12 -149 -59 113 -69 -143 -118 -73 60 -281 -15 -84 -226 212 -194 117 -270
7827 -270 116 -108 239 64 222 -55 244 447 338 179 71 133 67 194 -38 201 -146 33 -139 -37 19
7848 19 -49 -49 -133 -192 -171 -132 -58 122 -123 -151 165 154 -78 214 217 -26 260 45 -9 -54 -205 322 -222 121 -145
7873 -145 -492 -88 -15 -168 -36 29 -22 76 -196 102 180 -63 -126 -40 105 319 23 133 167 391 54 208 26
7896B6m5O6j74R2pk12M70l24J56L3k13p4L12j23p9J87N7Qj23N3J1J33k05J48j94
7921b1r5P7J67o7K25n84M71k40J05J70n77K77J1R9P8j75n9Q2P4j19K12K05k47
7944F9k2K84m44J88k1J90k21j72Q9P5j22K96M5j71L4k16mK32o2J01k08J00j06
7967f6R7j44L05o1l25K94M6o9j30R7r3M06n73K17l9Q3N2k03M9j5J5j61K19J58
7991A59j33Nj85J81J98j77J6j01J3j0k6mN2M6J00j13j34j8M13l52q0j1K12l88
8015c37J70R9n8J28J0k37J37K57j44L9K07J08k33O1j88Qj3M1j26M4J03j35j59
8038b18K12k43l4J98p1K1k42J81J14J58m2L0p0K41l11J27o4N8J20N4k73M5K8J28
8062A47j55r5J31j49R8l20M00k50n7J73j5J30J5j94J44o6P9PM4J37j6l28L76j53
$$ plain form
7896 26 -19 47 -127 -35 -42 -254 216 -108 48 81 -132 -206 106 -17 -96 91 148 156 33 86 97 230 25 173 -21
7921 -21 -116 -39 128 61 286 -298 173 -67 38 208 -369 -92 -81 18 96 -79 -138 -56 18 -101 111 316 69
7944 69 47 331 -113 75 54 244 23 -149 -60 15 -107 189 234 63 97 -119 -123 109 47 148 -60 40 -66
7967 -66 31 -113 192 131 -194 100 146 77 -53 44 -49 357 -216 1 -38 45 97 -106 -57 -72 -57 -218 1 159
7991 159 26 31 -154 27 225 48 64 -37 -24 -34 -60 -64 -12 34 134 21 -113 -131 282 -70 -150 -161 51 -337
8015 -337 -167 -68 -126 2 12 -225 -88 169 25 64 271 379 146 207 19 27 14 55 -71 -27 76 -59 -218
8038 -218 -6 -249 -283 -85 -156 -135 -377 -196 -82 76 34 64 -6 235 -76 51 -13 45 165 219 -54 -9 19 147
8062 147 -8 -103 28 -121 -23 -343 57 -193 -250 -77 -92 38 53 -141 3 -63 16 23 67 204 188 -140 236 83
8086H3o1q0J44k76J04k54L09P8k01N9J55j96J46q9jR0PR4JR3k26l0O6J35J62j92
8112A20k16j49k2J98j40J89k19J55j1R1k70K41j05j34O6m4M31k57J14P5M5J01
8134B59k79L8J70j28l1J80k24J34l24J94q3J3L13l34J32N5jk08K31k88J73j30
8156a38l3J75J84l06J21K50j10R6k73N5k4KL24k92R5j19O5k88J32R0j35J01J82
8179A54l09J72j2J69k87J98J5m1O0n2R6p4
$$ plain form
8086 83 22 -58 86 -190 -86 -340 -31 47 -154 -95 60 -136 10 -79 -80 10 17 111 112 205 -21 -51 15 150 312 120
8112 120 -96 -245 -267 -69 -209 -20 -239 -84 -95 -4 -274 -33 -138 -272 -206 -250 181 -76 38 113 158 259
8134 259 -20 18 188 60 29 209 -15 119 -205 -11 -94 -81 232 -102 30 85 84 -124 107 -181 -8 -138
8156 -138 -171 4 188 -118 3 253 143 239 -34 21 -3 -1 323 31 126 7 72 -216 -84 6 -129 -28 154
8179 154 -155 17 5 174 -113 85 100 59 119 67 163 89
8191H9
$$ Imaginary data points
##PAGE= N=2
##DATA TABLE= (X++(I..I)), XYDATA
0@%%%%%%%%%%%%%%Qj6J6j6J6k3L1l2L9m7N5o3P2q7R9j11J27j46J65j86K10k37
36a26K66k97L33l71M13m60N10n65O25o90P61q38R24j019J123j237J362j503J663
55H74j841K043k276K548k869L255l730M328n113O188p757J0272j4942K6467j07076
70h9629j62685K35556J76455l8041o1577L4865l4592o6306M9753Q5926o4869r0254
82b5398J1556K1746l1176M2312J04680l2439j75177m6437J09693M4206n1979j5223
94d3636O341l7820l210J09815P8003o2107o8172K1024L8706K2272J8859j3619
106F6456o2808l1593L5736O853l4100K0815L4851m6412o3761K8542P6720N95o7186
119c5292l4015L861K2163M7598K1066m6496l6796M7713N1619m1843l6828N8820
$$ plain form
0 0 0 0 0 0 0 0 0 0 0 0 0 0 0 0 8 -8 8 -8 8 -15 16 -16 23 -24 31 -32 40 -47 52 -59 68 -78 87 -99 111 -126
36 -126 140 -157 176 -195 218 -242 268 -297 328 -362 399 -439 485 -534 589 -648 714 -789 874
55 874 -967 1076 -1200 1348 -1521 1734 -1996 2332 -2781 3407 -4350 5922 -9020 17447 -89629
70 -89629 -252314 -16758 159697 121656 60079 94944 60352 -5954 43799 129725 64856 -25398
82 -25398 -13842 7904 -23272 19040 123720 91281 -83896 -130333 -20640 23566 -28413 -43636
94 -43636 -37295 -75115 -78325 31490 109493 47386 -20786 238 38944 61216 80075 66456
106 66456 3648 -27945 7791 14644 -19456 1359 36210 -10202 -73963 -45421 31299 31894 -35292
119 -35292 -69307 -65446 -43283 4315 25381 -21115 -57911 -10198 41421 -422 -37250 21570
131B1570L3087n7681k4005N6581K7152m5186j9390K5008k1473l5735L1643L2826
143B4397l3523k9513L1638K2954l3023r795L7582n046l6120J5328L6022j9300
155A601l5844L3887N3438l0270n1658K4615M6075l363k5234q283q255j7111O704
168a3698J1964k0558j0339K2529M231k3163N76M1679K1026l5625l0391J5216L0231
181A3678K1178L277j5162j5152L000K2295J0914j4183j1112j2189k1899j537K1967
194E075J0022k1497k4275K441N255j010K0637J5991k1450k8014N223L0730K2077
207B1205M296n490k1103r020L3887L2617j4698l8957j5059Q382o532j0986J5602
220e856R588k3052k3371O348K5466J3309l097j5082k7102n652L5842K8834q041
$$ plain form
131 21570 54657 -3024 -27029 29552 56704 11518 -7872 17136 -4337 -40072 -8429 24397
143 24397 -9126 -38639 -7001 15953 -17070 -26865 10717 5671 -30449 -15121 20901 1601
155 1601 -34243 -356 53082 22812 -28846 -4231 41844 38481 13247 4964 -3291 -20402 -13698
168 -13698 -1734 -22292 -32631 -10102 -5871 -29034 -28458 13221 34247 -1378 -31769 -16553 13678
181 13678 34856 38133 22971 7819 10819 33114 44028 29845 18733 6544 -15355 -16892 5075
194 5075 15097 -6400 -30675 -28234 -22979 -23989 -3352 12639 -8811 -36825 -31602 -872 21205
207 21205 25501 20011 -1092 -10112 23775 56392 41694 2737 -12322 -3940 -10472 -21458 -5856
220 -5856 3732 -19320 -42691 -36343 -10877 2432 -665 -15747 -42849 -48501 -12659 16175 8134
233H134j6158L070J4258P279J3235J8635r442k7145j1138N502Q988N49o727j1288
247b248j8270j682K0103J2933l095j3029j5999p836O491K2705J2301j8066j5150
260b0842J2361J7697J1511O454J310q962j5570j027J0443M229J177p648k0906
273i773j0746J1649J9945m35k3642j5190R45L023P770R246O30r121p624J0782
287a2541J8393Q642M225m622j4916m964J0720J5072K25j1743o199m182j634J3691
301A0167J0759r753k1393j3378M476R112L389J716n697q770M823J3233J4071N762
315A8517n038o945r518M1J7046J0705q416j4420n932P150Q323N717J566j4061
329D735j6923k548N189N827J562o545q552o054P667J7817P561m197p952p009K503
$$ plain form
233 8134 -8024 -4954 9304 16583 29818 48453 39011 11866 728 6230 15218 15767 9040 -2248
247 -2248 -20518 -22200 -2097 10836 7741 -5288 -21287 -29123 -22632 73 12374 -5692 -20842
260 -20842 -8481 9216 20727 27181 28491 19529 3959 2932 13375 17604 18781 11133 -9773
273 -9773 -20519 -8870 11075 10640 -13002 -28192 -27247 -24224 -16454 -7208 -6578 -15699 -23323 -12541
287 -12541 5852 14494 18719 14097 -819 -5783 4937 20009 20234 8491 2292 -1890 -3524 10167
301 10167 20926 11173 -10220 -23598 -19122 -10010 -6621 -4905 -10602 -19372 -14549 -1316 12755 18517
315 18517 13479 6534 -2984 -2943 14103 24808 16392 1972 -3960 3190 11513 17230 18796 4735
329 4735 -12188 -14736 -9547 -3720 -2158 -8703 -17255 -23309 -15642 2175 9736 5539 -2413 -9422 -6919
344f919Q094R710M368j1358j1705K197R643R772R25r323j2450q976L574J0656
358a792J831m800o673p331K572J1673J2701K115j1895q941J929Q182J1498M673
372A5742p008p673l546P681J2431L514n536j2065j0843l95P277O214k301j2163
386h671p140J159O567J1779M709p062r953m590P421J1507M802j906r205o153O540
401a96J0287P231q31r878p688k077L999Q770J376q237j1314o465N924R143K676
416B720l324j0536p400N143J0367Q942J576o176n149m9P307J1174R97p969q981
431a358n513N248R182N208j822j0325p493J607N233M547l913j3292j0831l700
445b7222P096J1878L536k830k771O31Q487J0937O277k296j2197q822K228O849
$$ plain form
344 -6919 1175 10885 15253 3895 -7810 -5613 4030 13802 14727 5404 -7046 -16022 -12448 -1792
358 -1792 39 -4761 -11434 -18765 -16193 -4520 8181 10296 -1599 -10540 -8611 -429 11069 15742
372 15742 8734 1061 -2485 5196 17627 21141 15605 3540 -7303 -7698 -421 5793 3492 -8671
386 -8671 -15811 -14652 -8085 3694 8403 1341 -8612 -13202 -5781 5726 10528 8622 -583 -6736 -196
401 -196 10091 17322 16491 6613 -1075 -3152 847 9617 10993 2756 -8558 -15023 -9099 44 2720
416 2720 -604 -11140 -18540 -13397 -3030 5912 7488 1312 -3837 -3886 3421 14595 15592 7623 -1358
431 -1358 -6871 -1623 7559 12767 10945 620 -6873 -5266 -33 4514 601 -12691 -23522 -27222
445 -27222 -20126 -8248 -4712 -7542 -10313 -9682 -1195 9742 16019 13723 1526 -7296 -5068 1781
459A781Q651N76q175o560J421J0009R144k252r990j1678p198K921O113M331j230
474b136p373j665R260J3030J1292J60r011q205j964N812O006l448p798q561k727
489g328Q100Q797K246n186j0537n183J327M286L436n023q405l901J236Q604J0524
504B993K878l825p669j285Q727P016o79o666p833j345K713N084M540k762o440
519d553l337p74L880N989J539m446r973k000R470O705N8m081m493L21K666N318
535B289P179l37m188k074J075M976L773P46k831q781n881L495M335R18l854o304
551e464l096j02N040O092k399o682m183J033O516L814J771J755j698k248L228
566C377Q189P221k901r268n154k54M143L391l007p652p272j139O047K812j466
$$ plain form
459 1781 10432 11008 2833 -3727 -2306 7703 16847 14595 4605 -7073 -14271 -11350 -5237 -906 -2136
474 -2136 -9509 -11174 -1914 11116 22408 22568 13557 5352 3388 9200 15206 11758 3960 -4601 -7328
489 -7328 772 9569 11815 6629 -3908 -9091 -7764 -3478 -42 -5065 -13470 -17371 -16135 -7531 2993
504 2993 5871 2046 -5623 -6908 1819 8835 8156 1490 -6343 -7688 -4975 109 4649 1887 -4553
519 -4553 -7890 -8664 -4784 1205 2744 -1702 -11675 -13675 -4205 2500 2558 -1523 -6016 -5695 -3029 2289
535 2289 9468 9131 4943 2869 3944 8920 12693 13439 10608 1827 -4054 -559 3776 4694 840 -5464
551 -5464 -8560 -8662 -3622 2470 71 -6611 -10794 -9761 -3245 569 2340 4095 2397 149 3377
566 3377 11566 18787 15886 6618 1464 1210 5353 8744 5737 -1915 -9187 -10326 -4279 -1467 -2933
581b933j938l886l401O03P953R413r27q151l36M527O817M583k27m544q314l437
597d198O548N667j494o548o972k002J629L946L608m441r624l312L306O707M662
612b518J667L92m935r11R959J0838Q00r098q648Q76M867K864K274l412o486l278
628d749J926P736K667m324n397o620l291N298P853K289p074n804M733Q511N904
643I658L914k272o254n169K073R202K581p618o246j646J360L156K907J017o619
658D4r867j807L726M437J723m447o760k359N976J1901M327n555m840Q00M682M432
674F413J350J756l100o751j193M496O168k56p681p367k292R89N928R39m917n619
690a1137k226N082O732K522k60j772l033J255N140O655J133m996k028J237J726
$$ plain form
581 -2933 -4871 -8757 -12158 -11555 -3602 5811 4884 -3267 -3603 924 7741 12324 12097 7553 -761 -4198
597 -4198 2350 8017 6523 -25 -6997 -8999 -7370 -3424 184 -4257 -13881 -17193 -13887 -7180 -2518
612 -2518 -851 -459 -5394 -6305 3654 14492 15292 6194 -2454 -1578 3289 6153 8427 5015 -1471 -4749
628 -4749 -2823 4913 7580 3256 -2141 -8761 -12052 -6754 1099 3388 -3686 -9490 -4757 3754 9658
643 9658 13572 11300 5046 -123 1950 11152 13733 6115 -131 -1777 -417 2739 5646 6663 44
658 44 -9823 -11630 -7904 -3467 -1744 -6191 -12951 -15310 -9334 2567 6894 1339 -3501 -2701 1981 6413
674 6413 7763 9519 6419 -332 -1525 2971 9139 8883 1202 -6165 -8457 -7468 -1540 -601 -5518 -11137
690 -11137 -13363 -8281 -1549 973 713 -1059 -4092 -2837 2303 8958 10091 5095 3067 4304 6030
705F030L514J739k191p598p046J870N373l86m162n056j857J643L223M771P33l850
721c250j107L78J659L773L418J504m125m451M151O758J739k809m805l243o21l8
737a069K373k97m231l821j972J940M052J716k54l072l221K368M606L553J202j961
753A912k266O81L180N711J257l545m836l382J393M070q19k929m069l231K28K219
769d426L846J553m333m427n1L503O166K295j964k744j121M488O196K132j939m017
785E157l601J75J595K730j061o602n180q60K556L634J32k815m272k567L519N775
801a685K764k01l527j972L917N270N108m41m588k723J65K925K873r49l789m914
817a767l729J401L407N73k979n914l428K580M598M066n99k927k87J661M455N209
$$ plain form
705 6030 9544 11283 9092 1494 -5552 -3682 1691 1305 -2857 -7913 -9770 -8127 -4904 -133 600 -3250
721 -3250 -4357 -3979 -2320 1453 4871 6375 2250 -2201 1950 8708 10447 7638 2833 -410 -1031 -1069
737 -1069 1304 1007 -3224 -7045 -9017 -7077 -3025 -1309 -1563 -4635 -7856 -5488 -882 2671 3873 1912
753 1912 -354 327 3507 9218 10475 6930 2094 -1288 105 4175 3356 427 -3642 -6873 -6645 -4426
769 -4426 -580 973 -3360 -7787 -7838 -4335 1831 4126 2162 -582 -1703 2785 8981 11113 9174 5157
785 5157 1556 1731 3326 6056 4995 -1607 -6787 -7647 -5091 -1457 -1325 -4140 -8412 -10979 -7460 -1685
801 -1685 1079 878 -2649 -4621 -704 4566 9674 9233 4645 1922 2087 5012 7885 6936 3147 -1767
817 -1767 -5496 -4095 -688 -115 -3094 -9008 -12436 -9856 -5258 -1192 -1791 -4718 -5005 -3344 1111 6320
833F320L16j869l252j522L284M166J289j803m684k751J315K198J384k737n752
848d098m047j142K432L825R7j842j998O18N162M753K608p37l260j362J810K998
864E817L023o75l895k236p3L324L167j648m164n176k825J329J406Pk173l922j117
881i831K454M623M275K83k744j296P39L709L511n52k158l405q97K842L192J025
897E770k357m789k592P76K081J351k886m169j909j95L368L551P31j283k425L23
913d654M346L717K086j186k997p03K076K874K412k285l248k442p22K219K076q15
929B754l019l809o56K455K150J073j737k988p68K057L788L029r98j336j483O91
945A203L816K703r21k719l445p57J572J098M34l048l858j460J297K562J707j726
$$ plain form
833 6320 6636 4767 1515 -7 3277 7443 8732 6929 2245 -506 809 3007 4391 1654 -4098
848 -4098 -8145 -9287 -6855 -3030 -2933 -4775 -6773 -6155 -993 3760 6368 5631 2371 1009 2819 5817
864 5817 8840 8165 4270 2034 1961 5285 8452 6804 2640 -2536 -5361 -4032 -2626 -2619 -4792 -8714 -9831
881 -9831 -7377 -2754 1521 1804 -940 -2236 -1497 2212 5723 5171 3013 -392 -1289 1553 4745 5770
897 5770 3413 -1376 -3968 -3192 -1111 240 -2646 -6815 -8724 -8919 -5551 -2000 -1269 -2552 -4977 -4654
913 -4654 -308 3409 5495 4309 1312 609 2685 5559 7971 5686 2438 -4 -726 1493 3569 2754
929 2754 -265 -4074 -4730 -2275 -125 948 -789 -3777 -4545 -2488 1300 4329 3331 1995 512 1203
945 1203 5019 7722 6801 4082 637 -120 1452 2550 2984 -64 -3922 -5382 -4085 -1523 184 -1542
961a542k573j966O05M088K762l43j364j541Q25K638L066J496k278l105j102Q76
977E42K110P38k396l714k745O2K716J379j077k299k669N59K627L151K005j417
993d28j775J022J914L291K320j255k133k118R31K784L80p88k409l585n83J659
1009g73J542P1l502k775p62P88L297K084j046r50o83K298L976K023M62j402k647
1026B001K16K239K032l48k961j926q70n8K323J71k482l204k255J95J552P63K29
1043b383k315k023J448L174K772J372j003j162l32J604L286J329k039k246j624
1058a42J009J705R98o55l482l190O69N42J218k12k510k116j089J846M031J199
1074a79j145r94n09K120K767K292N91k288j717J133J667J754k48k673k410j417
$$ plain form
961 -1542 -4115 -6081 -5476 -1388 1374 1031 -333 -1874 -1049 1589 4655 6151 3873 768 -334 542
977 542 2652 3390 994 -2720 -5465 -5403 -2687 -1308 -2385 -4684 -7353 -6794 -4167 -1016 989 -428
993 -428 -2203 -1181 733 4024 6344 5089 2956 838 1769 4553 4933 4145 1736 -1849 -2432 -773
1009 -773 769 840 -2662 -5437 -6199 -5411 -2114 -30 -1076 -2026 -2709 -411 3565 5588 6050 4648 2001
1026 2001 2217 4456 6488 6140 3179 1253 383 325 2648 2819 337 -2867 -5122 -4927 -3375 -2612 -2383
1043 -2383 -4698 -6721 -5273 -2099 673 2045 1042 -120 -452 1152 4438 5767 3728 1482 -142
1058 -142 867 2572 3570 2915 -567 -3757 -3088 -2546 -1328 -1540 -4050 -6166 -7255 -5409 -1378 -179
1074 -179 -1324 -2318 -2827 -707 2060 4352 4943 2655 938 2071 3738 5492 5244 2571 161 -1256
1090a256O48K056p15k047k021j842R57K277J803k44k473p96J451K259K727P67
1106C551j547j163L39J897K486n18r09k116k342K20J680O87j359l530j687N21
1122c790J079K308Mk336j463K04K323K125M17K43j114j249J628K728J508o98k306
1139A611j273o2O30J849o21k793k512m35J554J136m1o73j982j400K077J818J736
1156F19J44j926K28O04J865K945K05j451j994q81J721J893o40j723k647j148P41
1173a445R65P06q91k139j454K70J151K572M36j031j312j70K967K819O66r74j806
1190A330k0J145O91J053q48k838k277J22J382J028j085k040j938r24J633K146
1206a440N24j181j914O90J885J839K433l28j713n69R65K331J317r40j626j411
$$ plain form
1090 -1256 -608 1448 733 -1314 -3335 -5177 -4220 -1943 -140 -384 -2857 -3653 -2202 57 2784 3551
1106 3551 2004 841 1180 3077 5563 5045 4136 2020 -322 -102 1578 2265 906 -2624 -4311 -3790
1122 -3790 -2711 -403 -399 -2735 -4198 -3994 -1671 454 871 1114 0 -1249 379 3107 4615 3917 1611
1139 1611 338 276 906 2755 2134 -659 -3171 -3606 -2052 -916 -957 -1630 -3612 -5012 -2935 -1117 619
1156 619 763 -1163 -935 -331 1534 4479 4684 3233 1239 358 2079 3972 3332 1609 -1038 -2186 -1445
1173 -1445 -480 226 -665 -2804 -4258 -3988 -2837 -265 171 -860 -2172 -2342 625 3444 4110 3136 1330
1190 1330 1310 2455 3146 4199 3351 513 -1764 -1642 -260 768 -317 -2357 -4295 -5219 -3586 -1440
1206 -1440 -916 -2097 -4011 -3321 -1436 403 2836 2508 795 226 1191 3522 4839 3899 2273 862
1222H62j069J055J238l26k025k650j103Q85J238J105r39j848n77J036K773J896
1238A551l60p26m33J76K203J286P11m99k232l61J295Q22L12j794k212j370p21
1255b352J116Q68j004j981j725O19K025J424P08m65j480K80J729K185J096j047
1271A996k87m69k4J472J387p22j658k377o28J435K6o27j485k072o42J017J568
1288b090R88p27q90L9N55K172J937K18r92j036N43J977Q85L86j217k029m48P75
1306A046O61M11k072j709j049J50J466L78p45p28j039N24J701J667R35p56j089
1323b48L17J641J620O44j094j399o23o4J379J98j172j476j406m59R90R69J51j607
1341a639j373J20J014J728N20m10o65l04J063K064R69n55q31j164J01R69N17l34
$$ plain form
1222 862 -207 848 2086 1760 -265 -2915 -4018 -3133 -1895 -790 -1729 -3577 -4154 -3118 -345 1551
1238 1551 1191 465 32 208 2411 3697 4408 3909 1677 1316 2611 3433 3745 1951 -261 -1631 -2352
1255 -2352 -1236 -368 -1372 -3353 -5078 -4459 -2434 -1010 -302 -767 -2247 -1967 -238 1947 3043 1996
1271 1996 1709 1240 1216 2688 4075 3353 1695 -682 -1310 125 151 -476 -1961 -4033 -4675 -3658 -2090
1288 -2090 -1102 -1829 -2719 -2680 -2125 47 1984 2202 1210 174 717 2694 3579 3965 2748 719 271 1046
1306 1046 1707 2118 46 -1663 -2712 -2562 -1096 -718 -1463 -2191 -3230 -2706 -1005 662 1597 841 -248
1323 -248 69 1710 3330 3974 2880 1481 858 794 2173 2371 1199 -277 -1683 -2142 -1152 -183 -32 -1639
1341 -1639 -3012 -2892 -1878 -150 370 -40 -705 -1009 54 2118 3087 2532 1701 537 638 1607 2124 1790
1359A790j732j713n3J80P66K43j565j284q03R78J830N37j99p51n76J007J697J396
1377A748O36r58o96J85O90J301M35j320j786j043L55J040L9o47j901j202P83Q39
1395a502J259Oj254m69N57J051K243R00j058j48n46J223J157L53k93j495j163
1412H21J85M34N96o62k129j249l01K23J023m2j180o45n01R09J680Q76K04o98n07
1431i63J152J257J387j04j549l67m5N35J133n07j370j426j112O04O86k64n45j492
1449b990q89J086J022Q91N40j064L0M50J435J419N10o78o08n45J061J295p0n57
1467B338j740j099N17L00M85q23j398j078j82J123J026Q7q38p15l19J608J246
1484E38R04j10j005l23Q10J428R99n76j188q29l75Q20Q79o60j547j226m30P37
$$ plain form
1359 1790 58 -1655 -1708 -1528 -762 -519 -2084 -3368 -4171 -3193 -1363 -826 -1025 -1776 -2352 -1345 352 1748
1377 1748 2384 1426 730 915 1605 2906 3341 2021 235 -808 -453 587 626 -21 -1922 -3124 -2341 -1502
1395 -1502 -243 -237 -1491 -1960 -1403 -352 1891 2791 1733 1585 1039 2262 3419 3772 3479 1984 821
1412 821 1006 1440 2036 1374 -755 -2004 -2305 -2082 -1059 -1101 -2281 -2926 -3427 -2518 -838 38 242 -456 -963
1431 -963 189 1446 2833 2729 1180 813 768 1303 2436 1929 559 -867 -1979 -1375 -689 -953 -1498 -2990
1449 -2990 -3879 -2793 -1771 -880 -340 -1404 -1374 -924 511 1930 2440 1762 1154 609 1670 2965 2895 2338
1467 2338 598 -501 16 316 801 -22 -1420 -2498 -2680 -1557 -531 -444 -1282 -1997 -2316 -708 538
1484 538 1442 1332 327 4 814 2242 3241 2665 1477 648 273 1093 1972 1312 -235 -1461 -1891 -1154
1502a154M99L33l00j341l73P51J039J242j12j044q5K78J292J022J77p89j081m63
1520a09Q78O80j00p85j579p50J57R47L99n34j072p18j4J455P88J51j78q67K85
1539i66R79Q87J075k84j157n29Q48N87O24n66j229j043k01R54O31k03j110j131
1557a834m82J137R05O03p82q33K66P70J303R45mq15l79j62R70Q17k65n69j518
1576G3n23O03N92j18p87j706j86j25R70Q91o06o63k99J92J276R62K04k35o61J00
1596d6J097P74M64q03q04n79L69O11M50q89j265r50RO05L79k60n96j049P6J032
1616a375J139P54m48l98k1M89J450R43o35k84j069K85P96O24p21p18j089m49M37
1635b90K17R5p65j278m82L36J351K53k02k36o2K29J274O89K95m48n63M78K99O76
$$ plain form
1502 -1154 -655 -322 -622 -1963 -2336 -1585 -546 696 584 -460 -545 -267 1025 2047 2224 1435 354 -109
1520 -109 769 1449 1349 564 -1015 -1765 -1608 -661 -262 -796 -1868 -2586 -2600 -1145 -357 -206 -384 -1251 -966
1539 -966 13 900 1975 1691 534 5 853 1440 2064 1498 269 -774 -975 -21 610 407 -703 -1834
1557 -1834 -2316 -1179 -274 329 -453 -1286 -1020 -250 1053 1998 1994 1179 800 638 1608 2425 2160 1591 73
1576 73 -450 153 745 627 -160 -1866 -2052 -2177 -1207 -316 -922 -1585 -1884 -1692 -416 546 750 515 -146 -46
1596 -46 1051 1825 2289 1486 682 103 472 1083 1533 644 -621 -1571 -1562 -957 -578 -838 -1434 -2483 -2407 -1375
1616 -1375 -236 518 70 -328 -349 140 1590 2533 1898 1614 545 830 1626 2250 1529 811 -278 -727 -290
1635 -290 -73 22 -743 -2021 -2503 -2167 -816 -563 -765 -1001 -1063 -834 440 1129 1424 976 413 891 1190 1866
1655A866J33q36q45l77k1L79L07j014p13r62J60M17J050l65p57m71L74R55P24
1674DP75n49m66J71O68J204N20n66p15n41J72J89N23n45p48j022k0K59O33O8p49
1695g35j084l4P50Q76L04k35k36l73O43J148P41l42j32o28K7K13N64K61j152j037
1715d61k7L10K00k5j19j143o22N38N63M47r6o51k02M12O34J246L50n41n66j62
1735H5P15Q24N4k69j228l39KN62k5j52j126o32K18L17L90j52l36q6n59R81J058
1756C02K88K61o41m64P60P00M47q2j309j21k52O38K86m27q95l18o21K19M67M46
1776c16n70m72OO60L48J088J73m07k98L51Q21P28l6n89k32m96L14O98l5o62j081
1797go37j28L67L81l17j047o83K06P72Q26J36m15J73k35P51R09L47j01p69l16
$$ plain form
1655 1866 1999 1163 318 -59 -80 299 606 -408 -1121 -2083 -1923 -1506 -456 -821 -1578 -2049 -1675 -720 4
1674 4 779 230 -236 -65 603 1807 2327 1761 1046 505 677 866 1389 844 96 -926 -946 -687 -54 14 -735
1695 -735 -1819 -1853 -1103 -227 77 -158 -394 -767 -124 1024 1765 1423 1291 663 690 903 1467 1728 576 -461
1715 -461 -488 -178 22 -3 -122 -1265 -1887 -1349 -786 -339 -435 -1086 -1288 -876 -242 1004 1354 813 247 85
1735 85 800 1624 1678 1409 181 -158 -156 406 381 229 -897 -1529 -1311 -994 -604 -756 -1092 -1178 -1737 -756 302
1756 302 590 851 210 -254 506 1206 1653 1571 262 141 -111 527 813 386 -509 -827 -1448 -1229 -762 -316
1776 -316 -886 -1358 -1352 -692 -344 744 917 510 212 563 1384 2112 2076 1487 1255 759 1073 1771 1736 1074 -7
1797 -7 -644 -772 -405 -24 -341 -1388 -2071 -1865 -1093 -267 -131 -546 -373 -608 143 1052 1399 1298 529 213
1817B13L22Q09k08Kr90r63k34M35N63l84r62p33o7L74N80K23K81r46p8Q93Q84
1838A4R31j14j6l27J81N65P47M7o29p89j95L38K23j72n25q79n25Q7N45J81l93
1859g05m16k33M6M95J076j60J14l10L25P69N06K13Ln30o62M04K61J9o73o91m86
1880f35k32L30K56k49m84n71n3L79O92J43M9n52L66P67M27P49k78l92o2jN59M15
1902A623n68n33o19m71M30K6k33o01p07p0K86N69K48k26l85K7L91Q45M37K19k27
1923D61l44K64L75K23K61m00p41k95K29J76K90r61j82n77l48O04L72p4o1n68M85
1944h11N61N82P55m69l04N73J08M79L22j76n11n70q7J29M52n39o68p88j33K05
1964h90K77Q8n69l65J4K95R24M95m6j92q4J20Q05K21L10m02m46JM08rk55o73n66
$$ plain form
1817 213 535 1344 1136 1138 148 -815 -1049 -614 -51 -435 -1397 -2130 -2197 -1823 -1243 -1020 -739 -1685 -1763 -870 14
1838 14 945 831 815 488 669 1234 1981 2028 1399 610 415 753 976 804 279 -600 -1125 -1038 -493 -312 -705
1859 -705 -1121 -1354 -1308 -813 263 103 217 -93 232 1001 1507 1720 1723 1193 531 935 1196 1215 542 -149 -635
1880 -635 -867 -537 -281 -530 -1014 -1585 -1638 -1259 -567 -424 -375 -927 -561 206 633 1382 1104 712 650 649 1208 1623
1902 1623 1055 522 -97 -568 -138 -112 -345 -946 -1653 -1723 -1437 -868 -620 -846 -1231 -1204 -813 32 469 688 461
1923 461 117 381 756 979 1240 840 99 -196 33 209 499 -462 -644 -1221 -1569 -965 -593 -667 -728 -1296 -811
1944 -811 -250 332 1087 618 314 887 995 1474 1796 1620 1109 539 452 581 1033 494 -174 -962 -1095 -890
1964 -890 -613 -525 -1094 -1459 -1445 -1150 -226 269 223 31 -53 67 872 1093 1403 1001 555 556 964 955 700 27 -539
1987e39r3r6K63j45n49n67K5J86O77J50K32k46j42O99N89O49J67k29l78K18R2
2008I63M52L85p91n49m95j76L17J09l84q47l56j87L37o8P36j49l25K33L44R16
2028D65P5M8j09M8K88N82K10J15p18m68o6k3K5J29j023n65m15MN35J53m84l4l19
2051a547N19O11N52J92n26L59k7P59L52J66n68J2l71P3N95k02n73m05o30J64J24
2072c71j13K6o37n40J85P27J62N89m94J34k30O67R77j02n1j71l77M41K05k1k17
2093G89p68l78jK19K32j1p23l57K8l7P69r9j21k43j58N81M00K74K75l20k54N69
2115F66K43J45jn41j92o46L02L23l28J63r58j33k9K66K98J23p21Q4L36J99Q14
2136D13O4k18l2J62L92M57J10o16l61k43J08M10l76K76j131m39K99L05o9k94l08
$$ plain form
1987 -539 -632 -728 -465 -610 -1159 -1726 -1701 -1515 -838 -688 -456 -702 -844 -145 444 1093 1260 1031 653 871 963
2008 963 1415 1800 1009 460 -35 -211 106 215 -169 -1016 -1372 -1559 -1222 -1290 -554 -703 -1028 -795 -451 465
2028 465 540 588 479 527 815 1397 1607 1722 1004 536 470 447 472 601 -422 -987 -1402 -1398 -863 -710 -1194 -1228 -1547
2051 -1547 -1028 -417 135 327 -199 160 133 892 1244 1410 842 854 483 556 1151 949 376 -29 -659 -495 -371
2072 -371 -484 -458 -1095 -1635 -1450 -723 -561 28 -466 -332 -562 105 1082 980 929 758 381 822 1027 1006 789
2093 789 21 -357 -358 -139 93 82 -641 -998 -970 -1007 -238 -337 -458 -701 -859 -278 122 396 671 351 97 666
2115 666 909 1054 1053 512 320 -326 -24 299 -29 134 -824 -957 -986 -720 -422 -299 -1020 -936 -600 -401 413
2136 413 477 259 227 389 781 1238 1348 732 371 128 236 646 270 546 -585 -1024 -725 -420 -489 -783 -1091
2157a091k39L3P39M23J82k5m9l1O81L99K97P5o40j33N2J45J52l11l47n68j60n5
2179d71L74l97k87m71PM98O7O06j89j16J55M91L35O10l90l5M1k18J55J74j8l20
2201F01o20j10J68j55L37n14q15j55J73K6L50N7n4k52J77N06L70L85q9k39j01
2222D6N63M47j42j02n83R5j35J99K49j82m37o94q2L53K32j37k88l78K50J36K50
2243c40M31j78j53L21J50L63M80O5k42j38j76J70K41m22k01n15k35k4L25R5l55
2264c38m47k58n5N63K55k08p0r6k1P30K87J53L3l85K0K66L55N7l44m64l19m9K00
2287a35p0K9m28L5k85M54KL2K28l83R3L57K99K08j47j39L79j84J83K22j20j71
2309D59l70j15L62j1m98K0l66k4j56K61J55j70j68J09m6M70J83J96o4o7L0L54
$$ plain form
2157 -1091 -1330 -1297 -558 -135 47 22 -27 -58 623 1022 1319 1394 754 621 673 818 970 659 312 -256 -416 -471
2179 -471 -97 -494 -781 -1252 -1245 -747 -680 -74 -263 -379 -224 267 602 1212 822 787 828 610 765 939 921 601
2201 601 -19 -129 39 -116 221 -293 -1108 -1263 -1090 -1064 -714 -657 -711 -963 -786 -280 90 475 386 147 46
2222 46 609 1056 914 812 229 324 189 388 637 455 18 -676 -758 -405 -173 -310 -598 -976 -726 -590 -340
2243 -340 91 -87 -240 81 231 594 1074 1139 897 759 583 753 994 572 371 -144 -379 -403 -78 17 -338
2264 -338 -785 -1043 -1098 -535 -280 -488 -558 -654 -675 55 342 495 528 143 163 429 784 841 497 33 -286 -335 -135
2287 -135 -205 -176 -604 -569 -854 -400 -398 -366 -138 -521 -428 -71 228 436 289 150 529 345 528 750 630 459
2309 459 89 -26 336 325 -173 -153 -519 -543 -699 -438 -283 -453 -621 -512 -558 -88 95 291 227 160 190 544
2331E44M60j29k68k11R8k28L32j01m00n01k3J7K47J81m47j89k03J85L26M97lk30
2353d6L7J60K06K19n6p3j7mK4J72k23k56k00j7l10J71j12L7m30l52J05J24M94
2376c47j81M25l30N5N0O48M5J16J07l03K18n1L02J31n65k21R0O4j10P5m74l10
2398e66l72N39k4J1%r7l26N09K98K17R0Pl3p0M97J99K21o00l9k20K36J70l83j10
2422A54k04m79K7jL64k42m33n5K91j19O87m6j08J56l09L68L20L2K55k59L6o5Q4
2445D54M9p4j14n21R5r4J16P8n99p2j98N65p4K9J09l96J19L78M20j67L91k39J24
2468C79J86j39M39j12m2o21J4p2o6J6J18m80k20J26m1J74J9m17K03J5L27N04k10
2491A00N1J40J79OJ36j53Qj58l2J67k59rk35J40l42j28q9M4jr7o8M5K41K24L62
$$ plain form
2331 544 1004 875 607 396 494 266 598 497 97 -404 -427 -410 -163 18 -429 -618 -821 -636 -310 187 184 -46
2353 -46 -9 151 357 576 520 447 430 426 450 622 399 143 -57 -74 -384 -213 -325 -288 -718 -1070 -965 -841 -347
2376 -347 -528 -103 -433 -378 -328 320 365 481 588 285 503 452 754 885 320 99 189 253 143 218 -256 -566
2398 -566 -938 -399 -423 -412 -412 -509 -835 -326 -28 189 279 286 253 183 680 879 1100 500 461 241 477 647 264 154
2422 154 -50 -529 -502 -503 -139 -381 -814 -869 -578 -697 -10 -56 -164 -8 -317 51 371 403 658 399 435 370 454
2445 454 503 429 315 -206 -111 -205 -89 -11 -610 -682 -880 -315 -389 -360 -251 -647 -528 -150 270 103 494 255 379
2468 379 565 426 865 753 711 90 104 32 -34 -18 100 -380 -600 -474 -515 -341 -322 -739 -536 -521 -194 310 100
2491 100 151 291 470 476 612 459 467 309 277 444 185 176 -59 81 -261 -389 -478 -434 -435 -532 -600 -555 -314 -90 272
2516B72l28J68l86M18J76J73L12n51J71k98J57O2J87n04j90l33K14kn0o5J5l74
2538g56K48N6J36J46L3n5M0N24J03K5l39Q5K93j55K84K5l37m26n1o4L40k63k98
2561d06r1l58L52J0K93j06O2k58L48k3N02l1J57j79LJ72k4L84l89j95j74j55M25
2584C19m65PM1j90l02J34k36L42j34J49j92J68K04N36j63j14L10m32M76K40N2
2605G50l48j65o5L47q0M2n92o1m12N03k70K12k77l91L58J01k9R0J02J93k36N68
2627C40q7J54K28m9j28j63J30K1J72k59O7m77M6r7m0J24k09l70n2K15J54J90l99
2650d89j22K91L26K90j0j27J90p4K7J45J23K4m32l7J02j43j08J56l21j07m68K01
2672e63J12j69O4Lk12M95k2M16r9K48j00L2j44L26M54m13j45J74j31N4M1l47j86
$$ plain form
2516 272 -56 112 -274 144 320 493 805 254 425 127 284 346 533 29 -161 -494 -280 -282 -332 -397 -382 -756
2538 -756 -508 -452 -316 -170 -137 -192 -152 372 475 500 161 246 539 384 668 693 356 -70 -121 -185 155 -108 -406
2561 -406 -497 -855 -503 -493 -200 -306 -244 -502 -154 -177 325 294 451 272 275 447 423 807 418 223 49 -106 319
2584 319 -146 -139 -98 -288 -590 -456 -692 -350 -484 -335 -527 -359 -155 381 218 104 414 -18 458 698 750
2605 750 402 237 172 519 439 481 -111 -172 -584 -81 -351 -139 -416 -807 -449 -348 -377 -287 -185 8 -228 340
2627 340 253 407 635 586 458 295 425 446 618 359 426 -51 -5 -102 -142 -18 -227 -597 -649 -434 -280 -90 -489
2650 -489 -611 -320 6 296 286 159 349 275 302 447 570 594 162 125 227 84 -24 132 -189 -296 -764 -563
2672 -563 -451 -620 -556 -553 -765 -270 -292 124 25 273 173 205 61 387 841 428 283 457 326 380 421 74 -112
2695a12k13R2L0p2r3q8k8K4K14K36J55j16J62j35K24K73j92K76k75K1j37J72p5
2718C43j93k12q1L9j42L80j70k82o4N5J50K20k95J18k7J75O1j5J48K36k28J16
2740C32J05l25K91p6p6l51o1J00J56m60M9j52P0j77J53O9J12l31M79J21pK64k01
2763H4J95j60K8k60O57p9j82l96Q7J13o5J48l34j42m07L58p1q3L2j87K01r0K61
2786b92L81j04J97K59m82L59J10k9K08k91Ro4j5K60j96k64l55o3O5k3K1o7j39
2809e15m0n6M10N7J38k96K58n3L26J77J03J63m02J68J68j52r3k11M8l78L45m01
2831b36R8o0l20J64j23PL1l4K34J40l21N74k42N86k39K02j92j40K41Qj64k91K14
2854A37L7m71L52M3k37N3k15j02J54k34K70q8k60M88J74j16J46oj42L67R3K55
$$ plain form
2695 -112 -325 -233 -203 -275 -368 -456 -484 -460 -246 -10 145 29 191 56 280 553 361 637 362 383 246 418 343
2718 343 150 -62 -143 -104 -246 134 -36 -318 -382 -327 -177 43 -252 -134 -161 14 75 60 208 444 216 332
2740 332 437 112 403 327 251 -100 -161 -61 95 -365 -316 -468 -398 -575 -422 -353 -241 -572 -93 28 21 285 84
2763 84 279 119 147 -113 544 465 283 -113 -26 87 22 170 -164 -306 -713 -355 -426 -509 -477 -664 -463 -553 -292
2786 -292 89 -15 182 441 -41 318 428 399 607 316 325 261 246 506 310 46 -309 -372 -307 -330 -309 -376 -515
2809 -515 -555 -611 -201 -144 -6 -302 -44 -97 229 406 509 672 270 438 606 454 361 150 198 -180 165 -236
2831 -236 -138 -198 -518 -354 -477 -470 -439 -473 -239 -99 -420 154 -88 498 259 461 269 129 370 378 214 -77 137
2854 137 174 -297 55 98 -139 -86 -301 -403 -249 -483 -213 -301 -561 -73 101 -15 131 125 -17 350 443 698
2876F98j70l39k1KpO6j6l42J83n6k81N3P8M9m62MK99J33r6K34j04J26m0K28K4
2901B43J95j24k21J59Q3l00J80j82r4j9k27j24K50j08j12N7j61K27M0j0J92j26
2923a82K05oL15k12K19j42q2J34M2L6k5j1j62k02P7j06k6R1m39q4J91M1N3K56
2947a9k13P9J53J12J61j03N5p7P9q4L8K17K09k78k26l1j12Q5r6p8k28L3L33l01
2971b92Q3lj74k10K57J90K28n3qK02J60j34K2J88j27mJ04j41k5o5l28K03m4l38
2995c09Nn2L5k51J75J20J51J88J7k44K81kQ8J30rq8j60K34J60j9l44O0k51J60
3019G5j01j63L16l70o4Q0K5j56L36p2k57k3K19O0L94j30P5j76K47K7J13o3Nr2
3043C05l32J16L13n77J77p2o7l70J94L25j98j11n5K29n6K22j58l5M24l87L08l4
$$ plain form
2876 698 528 189 168 170 163 229 213 -129 54 -2 -283 -230 -152 -103 -565 -561 -262 -129 -225 9 -95 31 -9 219 243
2901 243 438 314 93 252 335 35 215 33 -61 -80 -307 -431 -181 -289 -401 -344 -505 -278 -238 -248 -56 -182
2923 -182 23 17 332 120 339 197 115 249 291 327 302 291 129 -73 4 -102 -128 -37 -476 -560 -369 -328 -275 -19
2947 -19 -232 -153 0 112 273 170 225 148 227 143 181 398 607 329 103 72 -40 45 -51 -129 -357 -324 9 -292
2971 -292 -209 -212 -386 -596 -339 -149 79 26 18 220 380 246 268 456 329 325 429 288 263 198 -130 73 29 -309
2995 -309 -304 -356 -321 -572 -397 -277 -126 62 79 -165 116 114 202 332 323 235 75 309 469 450 106 166 -85 75
3019 75 -26 -189 127 -243 -307 -227 -202 -358 -22 -94 -351 -374 -155 -95 299 169 244 68 315 342 455 392 397 305
3043 305 -27 89 402 -175 2 -70 -137 -507 -313 12 -186 -297 -352 -123 -179 43 -115 -150 274 -113 195 161
3065A61L55j13j42M5q7j74Q0M3j89M5j6j66p8q7K49Or2j43J13M04k08P5K3j5J02
3090A91K17j48%J1l8l9m3RJ72k16k98N8n8q2M54n77K5L04O0Q8pj22R8j07J65K35
3116C52m66L97q6J49l8k48J35o3J41k71l06k28L05j44J21m4l9o1K00J77k96J79
3138a34L5K7LP8L18j46j22K42Q7j06J29k92J08M1l36L40k17j20m1l21J10L9O4
3161b14j96K50R9p7K50o1J73k13L04k50J66K31k95J04j36K15j89J46K4l89p7J80
3183D5k80j8MR9j20Jk21K88j25L75j82J03J58O3K48k87K54j96j7j98L78j26l29
3206h3K02j31O5o0j9k48J48k92K56l77K89J69p3J84m45L27p3J80J75P5k38L54
3228C85j81K20r0j6k91j3M0j42K1j16j01Q5P0j86J21%J89m2K2p0J02J10l6K52
$$ plain form
3065 161 516 403 261 306 219 45 125 168 -21 24 8 -158 -236 -323 -74 -68 -160 -303 -190 214 6 81 104 89 191
3090 191 408 260 260 271 233 194 151 160 332 116 -182 -124 -182 -264 190 -387 -362 -58 2 90 83 -39 59 -48 117 352
3116 352 -114 283 197 346 308 60 195 132 273 2 -304 -532 -227 -371 -250 -294 -333 -394 -194 -17 -313 -134
3138 -134 -99 -72 -69 9 327 181 59 301 388 282 411 119 227 268 -68 272 55 -65 -106 -427 -317 -278 -214
3161 -214 -410 -160 -61 -138 112 51 224 11 315 65 231 462 167 271 135 350 161 307 331 -58 -135 45
3183 45 -235 -253 -249 -150 -270 -269 -490 -202 -327 48 -134 -31 127 190 438 151 405 209 192 -6 372 246 -83
3206 -83 119 -12 53 -7 -26 -274 -126 -418 -162 -539 -250 -81 -154 30 -415 -88 -161 19 194 269 31 385
3228 385 204 424 334 318 27 14 54 -88 -67 -183 -284 -199 -129 -315 -194 -194 -5 -47 -25 -95 7 117 81 333
3252C33k51q3J33K45r8pJ73k51l9N1l74K84j24j87j53j03K06j79L91j37j75J01
3274b44n3M50k72K40m19N58K6j50J84j91Q7k8p9K72k86j97m7K13k39l2j87k8k6
3297d48m1K82J11p4j74N13l08J66O0K45j89k38K36p2K52l9r4O7m55J43j41K28
3319C0r5l3J1k06J31o5L45N1k50O1J57j85M96m46L77l05M5R6O5m8q5n6J3j39j90
3344b25K84l7r7N6k86J34K6O3R1l67L70kj47K03p8J27K29l98L08J62N7p1j26k16
3368F0M3O1k16J01kj87J19j62j18o4L71o11L21L75j18J74k27m6L8K42J86q2K65
3391E23m87K28P5o77L52o2l7j77K80L8nm21M71m46L57k91j4J39J57k6J7J20J49
3414B63mr8j62K28K03k07j08L37n26m6M29o7k03j45l9j08J23j46J49k24K67l5
$$ plain form
3252 333 82 -1 132 377 279 272 445 194 155 206 -168 116 -8 -195 -348 -451 -245 -424 -33 -170 -345 -244
3274 -244 -297 153 -119 121 -298 260 286 136 320 129 216 188 109 381 95 -102 -149 64 -175 -207 -394 -422 -448
3297 -448 -489 -207 -96 -170 -344 169 -139 27 87 332 143 -95 141 69 321 282 188 255 -200 -57 -198 30
3319 30 -65 -98 -87 -293 -162 -227 118 169 -81 -20 137 -48 448 2 379 74 119 215 280 232 147 91 104 -35 -225
3344 -225 59 22 -75 -19 -305 -171 -145 -82 9 -358 12 10 -137 66 -12 115 344 -54 254 416 473 402 276 60
3368 60 103 164 -52 49 47 -140 -21 -183 -301 -365 6 -605 -284 91 -27 147 -80 -126 -88 154 340 258 523
3391 523 36 264 339 -338 14 -48 -85 -262 18 56 51 -370 101 -345 12 -279 -293 -154 3 -23 -6 114 263
3414 263 259 161 -1 227 430 223 115 452 -74 -120 309 242 39 -106 -145 -253 -130 -276 -127 -351 -84 -119
3436a19j17J42L37k28L15l30K11q7K57m41J05K04j42K20m14J26j21K2L8j60j00
3457b82o5M20k44P3o2p7L25k59K19j7K20j10n0K32j37P3j55K3j29P1l3p3K0j76
3481a93J17l34K61k14O3K43k87K19p6Q2J20M8M7k06J22J49L4J5j52J68o0j57J02
3504A11M6j60kk22L45k30k82K75j60K8J56J47l56j31K38Q6J13J97K3M0R9j82j
3527A78j05R0k59%K87k62J4l9Rk81O9J67J62O4j31j27j98K78J62J08m47N20J48
3550D07l16m2R4R9J16j0l08J32j18m4M6k69J79j35k27L59r5q3J21J63k27R4J52
3573H8n3K0R4j29o3R1J2K56J03m29M0K08l2j18o6k47o8M76j54k90J27k3N8k48
3597c47J57M4J39n3j07K91J73j08o7PM5J45r9l7r0Mj19j29M7k19J83o1J60j48
$$ plain form
3436 -119 -236 -94 243 15 330 0 211 124 381 -60 45 249 107 327 -87 39 -82 -60 -22 -182 -282
3457 -282 -347 73 -171 -98 -160 -237 88 -171 48 31 251 141 91 323 186 259 104 127 -2 69 36 -37 -17 -193
3481 -193 -76 -410 -149 -363 -300 -57 -344 -125 -201 -119 1 49 96 -110 12 161 195 210 58 226 166 9 111
3504 111 157 -3 -5 -227 118 -112 -394 -119 -279 -251 -95 52 -304 -435 -197 -111 2 199 222 262 361 179 178
3527 178 73 163 -96 -96 191 -71 -57 -96 -87 -368 -299 -132 30 94 -37 -164 -362 -84 78 186 -261 259 407
3550 407 91 49 143 242 358 348 40 172 54 10 56 -213 -34 -169 -396 -37 -132 -215 -94 69 -158 -64 88
3573 88 35 55 149 20 -43 48 60 316 419 -10 30 238 206 88 22 -225 -293 183 29 -261 -134 -157 -99 -347
3597 -347 -190 -146 -7 -60 -167 124 297 189 122 129 174 319 220 183 93 97 -22 -151 -104 -323 -140 -201 -41 -189
3621a89r5%oK20j09J33j4J99L0q7k02L56r1J66k31j3p9J15O3o2o6J98j96l5Q2
3646H7j02j62J18k11qJ69k25L59K03k17r8j06M44j33R8j24j45J05O3k65L25q6
3668H9k74L12l97P0j83K82Pj31r7K42n7L2j48J89J52LQ4m5j02K37k80K7R9j6P8
3693A73K5j37j04J00j05R0l84K80M4j14L5L0j85K52l4O8J09K52k86J57K1j82L49
3716D54n97L66l2Qr5k79J16K80o2p5j02j79Q2p1J5K45m31K97j1K07k53M04j94
3739I3Jj19Q1N4K08o5m44K87J51k19r9K43k84M4k37K75j23m0L9j0m23M02K47k09
3763a47J04L21k85J82P0k9rn8j28K38k53j52L13k79O5kJ2r3m0j66L30l03N1lJ22
3788a39J9K61l82L13q5P2J38k03J61K7n0J04j14k21J15Q7l05M14l45P2K3l10P6
$$ plain form
3621 -189 -284 -284 -290 -70 -179 -46 -60 139 169 82 -120 236 145 311 80 67 -12 103 166 104 38 236 40 5 87
3646 87 -15 -177 -59 -270 -278 -109 -334 25 228 11 -87 -193 251 118 216 92 -53 52 115 -150 175 89
3668 89 -185 127 -270 -200 -383 -101 -94 -225 -322 -80 -137 -105 -253 -64 88 91 175 130 28 265 -15 12 111 95 173
3693 173 198 61 -43 57 -48 42 -342 -62 -18 -132 -97 -67 -252 0 -34 34 143 395 109 266 287 105 454
3716 454 -143 223 191 199 104 -175 -59 221 159 84 -18 -197 -115 -186 -171 74 -357 -60 -71 136 -117 287 93
3739 93 94 -25 56 110 318 253 -191 96 247 28 -71 172 -112 -68 -305 -30 -153 -193 -154 -164 -587 -185 62 -147
3763 -147 -43 278 -7 175 245 216 207 149 21 259 6 -146 167 -112 -47 -49 -37 -130 -170 -336 -6 -309 -258 -261 -139
3788 -139 -120 141 -241 72 -13 59 197 -6 155 182 132 236 122 -99 16 103 -202 212 -133 -61 -38 -348 -272
3811b72K29k45K65J74j61j81L10J05R3l9r1j21O0K35k47J33j58O6j72J68j18j09
3833g6K9j40J73j05O4qk18J2K35j85K19j91L66l13M8K51nJ40k85J57Q9k64nl14
3857c26M91o6j56j79K5J04Q2Pn2k04Q7j39K22J42J00j97P4J56K11l41L54o7k34
3880I4Q7l40M55p6j11r1k9N5k19j48J96K88j73k75J96J72k72K05k47J08J55p4
3902d4n7K21l00N15p8j47m1K6j41k2L45n13J35R8j60n7J70q9K29k84J55Qq1K28
3926A16L15l74m7j05K04%K46j13k36K91m06K51K1l02n3K36j04%k0P8k46L47j74
3949g5o1%O5Q1o5M1q7M93k89O1J81l43O4Q8kJ54k39k28k0m1J06K7j97J88J4j58
3975b42j4J34j01J54J65K8j32J94J73j62j35k47K86J22j03J69j80m9R1j21q6J63
$$ plain form
3811 -272 -43 -288 -23 151 -10 -191 119 224 317 278 187 66 126 361 114 247 89 155 -17 151 33 -76
3833 -76 -47 -187 -14 -119 -55 -63 -281 -269 -34 -219 0 -191 175 -138 -90 161 156 296 11 168 257 -7 -12 -326
3857 -326 165 99 -57 -236 -211 -107 -25 -18 -70 -274 -187 -326 -104 38 138 -59 15 171 382 41 395 328 94
3880 94 181 -159 296 220 109 18 -11 44 -175 -323 -127 161 -12 -287 -91 81 -191 14 -233 -125 30 -44
3902 -44 -101 120 -180 335 257 110 69 95 -46 -68 277 -236 -101 -3 -163 -220 -50 -139 90 -194 -39 -31 -112 116
3926 116 431 57 10 -95 109 109 355 242 6 297 -109 142 163 -139 -192 44 -60 -60 -80 -2 -248 99 -75
3949 -75 -136 -136 -71 10 -55 -14 -101 392 103 164 345 2 66 154 152 306 67 -161 -181 -222 -116 -89 -286 -98 -84 -242
3975 -242 -256 -122 -223 -69 96 124 -8 186 359 197 62 -185 101 223 120 289 109 60 151 30 -56 107
3997A07n19K94j81K63q2J97m0o1rk59L4j6L80j73J23j34j26L17m9L6m6q6K0k15
4021b25K61j01%j11J33k86K32K12j80j02K72j79k8J38J31j93j97L47L8j91K37
4042B08j86o8J92m8q8mO3j49mJ17j96j40j34M50L3j11o5j01K48r6K17q9k84K08
4066b7M5O5l1k0K52j22j59M3k6K6j39j33J77k1j07q7pR1J02q6J87j5L6J39K1j06
4092I8O0j72L8K08m0N9m8k55J33j08Jj44M5k93K41R9r2l5R9P9o9J63J2j43MK42
4118A82l63N56l05J23Q9k5j68J63k96L78o71K4O05m42p5j88J46J44k4j73J08l21
4140e33N66o1k86M29L16j53K2l61J97K36j88j99K0n0K51J0k43O9k44r5J94q4J30
4163e7l72J82R1R2n9J2o4L28j84M6J93Q5k48J3R1L6P2k63Q5l5j60J31j07K85m15
$$ plain form
3997 107 -412 -118 -299 -36 -118 79 39 -22 -31 -290 -256 -272 108 -65 58 -76 -202 115 66 102 56 -30 -10 -225
4021 -225 36 -65 -65 -176 -43 -329 -97 115 -65 -167 105 -74 -102 36 167 -26 -223 124 162 -29 208
4042 208 22 -46 146 98 10 6 69 -80 -84 33 -163 -303 -437 13 46 -65 -130 -231 17 -79 138 49 -235 -27
4066 -27 18 83 52 32 284 162 3 46 20 46 -93 -226 -49 -70 -177 -264 -271 -180 -78 -164 23 8 44 183 204 98
4092 98 158 -14 24 232 192 251 203 -52 81 -27 -26 -170 -125 -418 -177 -78 -170 -205 -106 -27 -96 67 79 -64 -60 182
4118 182 -181 375 70 193 282 257 89 252 -44 334 -337 -313 292 -150 -225 -413 -267 -123 -147 -320 -212 -533
4140 -533 33 -28 -314 115 431 278 300 -61 136 372 184 -15 5 -45 206 216 -27 42 -202 -297 -103 -187 -57
4163 -57 -429 -247 -156 -64 -123 -111 -175 153 -31 15 208 293 45 58 149 185 257 -6 79 44 -116 15 -92 193 -222
4188b22J39j11J61k35Q5qk6J43k20K87j8J50l1K97N1k49j97J07K63k7l29J71n2
4211A29J23l43nj52l3N8K86j61R2j86k14L41j26J35mJ50m2rJ05j52J00K24rk35
4235G2J63Q6l79M4j05rk8q6J55j86J08j02L40k37R2k8KL16l84J17J45R4m3j88
4259d1K97j93K4O9j25R2K9j78j20oJ77J48m46J91r8j89M24l87L86k60L36R0R2
4282C12j22l11J68j3J73k58N0K7l88L21n7n2J36J7k23J76j6n4J14j28K44n7j26
4305f7J46j1J2J66j08K9R0j91L35l80j37J66L8j90L13K6l74Q2q2j23N4l12K92
4328b26L14J05j43L3J33r7l6l7M69m32K35l27K57j8m3j76J68j1q0n9P5J00l19
4351a15j41N6n4J81l13K60k68K68m1K55j87K5J55J7J89J20l34J38j72j38L68l13
$$ plain form
4188 -222 -83 -194 -33 -268 -183 -191 -217 -74 -294 -7 -25 125 94 391 442 193 -4 103 366 339 10 181 129
4211 129 252 -91 -96 -248 -281 -223 63 -98 -6 -192 -406 -65 -191 -56 -60 90 48 39 144 -8 92 316 307 72
4235 72 235 321 -58 -14 -119 -128 -156 -242 -87 -273 -165 -267 73 -164 -72 -100 -98 218 -166 -49 96 190 147 -41
4259 -41 256 63 87 156 31 123 152 -26 -146 -152 25 173 -273 -82 -180 -369 55 -332 54 -206 130 220 312
4282 312 190 -121 47 34 207 -51 -1 26 -362 -41 -98 -150 -14 3 -220 -44 -60 -114 0 -128 116 59 -67
4305 -67 79 68 80 246 138 167 257 66 401 21 -116 50 88 -102 211 237 -137 -55 -137 -260 -206 -518 -226
4328 -226 88 193 50 83 216 119 83 46 515 83 318 -9 248 230 187 11 179 168 88 29 104 204 -115
4351 -115 -256 -200 -254 -73 -386 -126 -394 -126 -167 88 -99 -74 81 98 287 407 73 211 39 -99 269 -44
4373d4K82m49K83j73J55j50J10j87M1j24R9K95l15J49k68P7L35K31j02j02m9O1
4395A55J62j45L4k91M07k29k59J66j37L3j66L15l70P9K9q1J93M9K5k80J32L38
4417A59Q6j88m6R4q0m6JQ0N0j08N6p2j66L32l92L24n8k84m8N45m22nK92J48J0
4442B62k41k50L68L17k27P1k05J19L5k58N3J92m57N5K42j48N1J58k24k04j93J67
4464c17J14J88l0N6n9o3R6M4N3p2J86L9j93L34l18j22K42j26j73L95m36J60o1
4487f3k24J09N6O5m8L6J71o1j56K74M0p6Qj32K44J7l15J97k05k34j23L09j41N09
4511B57j59l58j6j6J65J72j88m2J97j65J08J78k00K68k07K4R0K7r7J81k10K27
4533B36j28J5J01R0n47J0K16jj44m5J88k97L3K67q8P9j75J82j03J94K94j50O3
$$ plain form
4373 -44 238 -211 72 -101 54 -96 14 -173 -132 -256 -157 138 -177 -28 -296 -219 116 347 245 143 94 155
4395 155 317 172 206 -85 322 93 -166 0 -137 -104 -270 45 -325 -246 -217 -298 -105 -56 -31 -311 -179 159
4417 159 245 57 11 105 25 -21 -20 60 110 2 58 -14 -180 152 -240 84 26 -258 -306 239 -183 -188 104 252 262
4442 262 21 -229 139 456 229 300 95 214 249 -9 44 236 -221 -166 76 -72 -21 137 -87 -291 -484 -317
4464 -317 -203 -15 -45 11 -48 -111 -15 29 82 10 196 235 42 376 58 -64 178 52 -121 274 -162 -2 -63
4487 -63 -287 -178 -122 -57 -105 -69 102 41 -115 159 199 123 131 -1 243 260 -55 142 -63 -297 -420 -111 -252 257
4511 257 98 -260 -276 -292 -127 45 -143 -185 12 -153 -45 133 -67 201 -6 18 108 135 38 219 9 236
4533 236 108 123 224 314 -233 -223 -7 -8 -152 -197 -9 -306 -273 -6 -94 -15 -190 -8 -111 83 377 227 290
4556B90m1LR3k81J07j7J04m0m3j75j1j3l49O5J0K37k57J03P5K42j20O5K29j37
4580A39nj48J96j93J30J42j5Rk82K37j38r1L8j23P2j08M4j79l3j06L58l33L03
4603h6k1O3R4O3j53J4q7M18p5L35l71j3n7Q9j00k4j27rk22j1K04J47k49j87k0
4628c85J84L73l34J35J18J45k34J76j29J34M5k4J2j89K05j31M5j14j9J02k16k49
4650c50M06l07l6PJ60Qk14J88q4J55j62J52M31j63j04n3j9M08l77J9k23J35j70
4673a93K4R5l7j76M03k79k65K82q0k3R6M35j79l02K08k74N09l80L30K3j36J06
4695A87o2j69K28j42n1J92k04j36K45l33K43j76j41M0K38r3R8N1j21J87k8J69
4717B22J5J41K8l58J3k49L54k44J53R2k48L0k5N8k24N3MJ37q1N5j66J99r3K71
$$ plain form
4556 290 249 252 345 64 171 154 258 218 175 0 -11 -24 -373 -308 -298 -61 -318 -215 -140 102 -18 47 276 139
4580 139 134 -14 182 -11 119 261 246 255 -27 210 72 -19 19 -104 -32 -140 -96 -275 -308 -414 -56 -389 -86
4603 -86 -107 -44 50 113 -40 -26 -113 305 230 565 194 181 124 213 113 89 -38 -47 -269 -280 -76 71 -178 -365 -385
4628 -385 -201 172 -162 -27 91 236 2 178 49 183 228 204 216 27 232 101 146 32 13 115 -101 -350
4650 -350 56 -251 -287 -280 -120 -112 -326 -138 -222 -67 -229 -77 354 191 87 34 15 423 46 65 -158 -23 -193
4673 -193 -169 -74 -111 -287 116 -163 -428 -146 -226 -249 -153 282 103 -199 9 -265 244 -136 194 217 81 187
4695 187 125 -44 184 42 -9 183 -21 -157 88 -245 -2 -178 -319 -279 -41 -134 -36 15 -106 81 53 222
4717 222 237 378 406 48 61 -188 166 -78 75 167 -81 -51 -76 -18 -242 -189 -185 -48 -129 -74 -240 -41 -134 137
4741A37j61J63Q6J87k88k68L05k0R8l17K36N0p2j53j05j31k59O6K91K4kp1J65
4764c9O0j30L22O1j81m5N0p5K02J42m64M19l61J67P3K7M9k48j56j63O1J88j06
4787a47K4r4L28J8j63Q1p0J1J39k48K13P3J5K36k50M2j41J64r1k3p6K9l67O2J25
4812a10O5l09L13k09J37nQ5r9N8J14k8j16K13J6P4J57m66M67j65m6M0l1pk71J1
4837a12N9K16l17P1j20r6J62j1K83j76j25J36L7K5J24p9k1j9J75m3j31L5Q2j01
4861E4o0L09m34n6L4N1J82k24q5k8r8K94L5P2j7K29P3k94K09q2j36r9M33l84J75
4886A53j3j09j47J16n1j37k31J09K32j40K37J25k55K55k04j8Q3l33N19n9R0J18
4908C40p7p9k00L22r2L2k72Q1k45l7K38J05l92Q0k41L49L6k24M53m22J79N6L15
$$ plain form
4741 137 -24 139 225 412 124 -144 161 141 239 -78 158 208 136 -17 -122 -253 -512 -446 -155 -131 -133 -204 -39
4764 -39 21 -109 213 274 93 48 98 23 225 367 -97 322 -39 128 201 228 277 29 -127 -290 -229 -41 -147
4787 -147 -123 -217 111 129 -34 47 -23 -12 127 -121 92 165 180 416 166 208 67 231 140 117 41 70 -297 -235 -110
4812 -110 -45 -354 -41 -250 -113 -118 -33 -132 -74 40 12 -104 109 125 199 356 -110 357 192 146 186 155 148 -123 -112
4837 -112 -53 163 -154 -83 -203 -299 -137 -148 135 -41 -166 -30 7 32 156 77 56 37 212 169 38 73 155 54
4861 54 -6 303 -131 -187 -153 -102 80 -144 -229 -257 -355 -61 -26 46 29 258 331 37 246 164 28 -71 362 -22 153
4886 153 140 31 -116 0 -51 -188 -419 -310 -78 -218 19 144 -111 144 -60 -78 5 -328 191 132 222 340
4908 340 263 184 -16 306 214 246 -26 55 -190 -227 11 116 -276 -196 -437 -88 -52 -276 177 -245 -66 -10 305
4931C05k02P3J43N2j5o75M25J56p6J05k09K9k00J64o8m2R7l14n9J07N7k31L25
4954e3j31k16K45N9K94R3n8p9j65N2j2k1K36j87L27o7j05k58Q5j78J5j63Q8q2
4978b81M00l22j50K43k47Q8L33J37Mk90K67j85j7K45r0m1J0N5jj9l40L40j48r
5002a8p2k32J29O7k48L44Ll9J49o9N3J1J42L1k15J47J60j66O5J38m15jK29k8m3
5027A22J42l31kr4k0LP8N7o8j58J84o3J58L08l67K14M4q6RK92m06J54k09P0R1
5052A22L7r9m64L7K96k61K49m5Q3Lj16J01L76k57j15J42NML08j29j26L1m0nJ16
5077B53o1k3k08k66J42K04N6j79m2p3j05J99J87J4j04MK55l1j5j13l8K38J4l90
5101h2M09k62Q9m5P7q2k40K10l21P1m1q5Q2K78m78J53J32J9J21l7J50j8J16J23
$$ plain form
4931 305 103 176 319 371 356 -319 106 262 186 291 82 111 -89 75 7 -35 62 -252 -311 -204 -147 -378 -53
4954 -53 -184 -400 -155 -96 198 291 233 154 -11 41 29 8 244 57 384 317 212 -46 39 -139 -124 -287 -199 -281
4978 -281 119 -203 -353 -110 -357 -269 64 201 205 -85 182 -3 -20 225 135 94 104 159 158 139 -201 139 -9 -18
5002 -18 -90 -322 -193 -126 -374 -30 -27 -66 83 14 67 78 220 251 36 183 343 177 242 380 -35 -36 193 165 122
5027 122 264 -67 -69 -163 -183 -180 -102 -45 -113 -271 -87 -150 8 316 -51 163 207 121 130 422 16 170 -39 31 122
5052 122 159 60 -404 -367 -71 -332 -83 -128 -45 -42 -158 -57 319 62 -53 89 94 98 406 277 151 182 142 137 253
5077 253 192 169 -39 -305 -163 41 97 -82 -124 -197 -302 -103 84 98 -6 -2 253 222 207 94 56 294 308 -82
5101 -82 327 65 154 109 186 104 -136 74 -247 -176 -217 -302 -220 58 -420 -267 -135 -116 5 -32 118 100 216 339
5125C39k44J91k40J64pQ8q0k39J10j28j56N2M4lr0k10R2K85j3J52r0r1q6L12j46
5150Fm7K27l12L20n4JK2j40J39n8j49J56k70RJ40j08K55k45M3l10L19r5l8J57
5174c2K05k77m7M68l51M57k41q0K3K2j36P9K63l86K13j28j9k06P0j97J36j55K14
5197a05n5k37L85k07L18j02p1J4L66j02j41L40k39l3K03o6l63R2j18J09J4l57
5219c55M07m14J52Q7j08K11L9k1j69L70j62q3K23J75k06L0k86L07L6k41K84j53
5241A23J8j74K78n48K44n8k7L5J22k04m7K18N8o6J36p2KJ98o0p8L94m44L09m68
5265a11P9K85l36K98l08J99r2l44L86o8k37J05K1p7K05K41o37K42L47r4pK24k70
5288E1J22Q4P9q5j27j0o7l93M09m73M16k37l2K04k45P4k4LQ5j76J16L02M6j19
$$ plain form
5125 339 95 286 46 210 203 291 211 -28 82 -46 -202 -150 -106 -109 -199 -409 -317 -32 -45 107 17 -74 -160 152 6
5150 6 -41 186 -126 194 140 141 163 23 162 104 -45 111 -159 -150 -10 -118 137 -108 -65 -375 -56 -151 -189 -32
5174 -32 173 -104 -151 317 -34 423 182 102 125 147 11 90 353 -33 180 52 33 -173 -103 -300 -164 -319 -105
5197 -105 -160 -397 -12 -219 99 -3 -74 -60 306 204 63 403 164 131 334 268 -95 -3 -121 -12 2 -355
5219 -355 52 -362 -210 -123 -231 -20 19 -2 -171 199 37 -46 177 352 146 176 -110 197 233 -8 276 123
5241 123 141 -33 245 -303 -59 -117 -144 -109 13 -191 -238 -20 38 -28 108 36 38 236 176 98 492 48 357 -111
5265 -111 -32 253 -83 215 -93 106 14 -330 56 -12 -249 -144 -123 -200 5 246 -391 -149 198 104 97 321 51
5288 51 173 257 336 251 124 114 47 -346 63 -410 6 -231 -263 -59 -304 -230 -254 -251 -166 -342 -226 76 122 3
5312CJ1l8J84J5J74l20j22j2P7j6J5j9j06kN0Q2l39L0J57j15J69n0P6J72r1j50
5338a65J66L17j55j58Q8K10l75L20r9k06j82J31O5j63L3Nj98K05J77l67L93m39
5360c97J31J12j49K89l1J29l0j77J29M17j06k74K93n04J92K47k72j01K95k98J18
5381A3j89J17p8k79M81k04k12M52l08L95L1j81R5m1p5NK13J08m10L34M6j94j93
5404g4J33j85O7m9m4j4q2L7K15k19j61O00m86O8N69l41q2N0Q4J33j10J87J9RR7
5429D21m02Q8k23p5J35N6p0j25nl5K20r1j03M5p5J34J18jK39o9O0k23K17nj09
5454A22J2j6J08R7k17k47J58R7k54j23J89%l9n7j4j40M20J1L1K8l7r0J12R4j83
5479F2P7m3j68j46M13j15k4j89j18L08o0k92K25k57R7o1L18K7l5Q1j14q7N30m6
$$ plain form
5312 3 14 -24 160 175 349 29 -93 -105 -28 -44 -29 -48 -154 -156 -106 -24 -363 -333 -176 -291 -122 -172 -96 76 -15 -165
5338 -165 1 318 163 5 93 303 -72 248 149 -57 -239 -108 -43 -206 -173 -168 -366 -161 16 -351 42 -397
5360 -397 -266 -154 -303 -14 -45 84 54 -123 6 423 317 43 336 -168 24 271 -1 -102 193 -105 13
5381 13 -176 -59 -137 -416 65 -139 -351 101 -207 188 219 38 133 92 17 22 235 343 -67 267 313 119 -74
5404 -74 59 -126 -59 -108 -152 -166 -248 -211 4 -215 -376 224 -262 -194 375 34 -48 2 86 219 109 296 315 324 421
5429 421 19 107 -116 -191 -56 0 -70 -195 -200 -235 -15 -106 -209 -164 -239 -105 13 12 251 182 242 19 236 231 122
5454 122 134 118 226 323 106 -141 17 114 -140 -263 -74 -74 -113 -170 -184 -324 96 107 138 166 129 39 151 245 62
5479 62 139 96 -72 -218 195 80 56 -133 -251 57 -3 -295 -70 -327 -230 -291 27 54 19 100 -14 -101 429 383
5503C83l98K99j31J24r2j12j19K97O1k58j61km8j48K18j0K4k16J5K9Q8M3n8K13
5527D1j7L02j88M2o3J15Q8k61J46J16j48Ro6j14J14k59N8l48K90K65j60q3l5M8
5551a08P8J88m0j74O9M8J7J53P8r7O8n3o5m3j41K00m2R7l23K0k1l06J38L9k06
5576d26K04P2R4J72j78O1Rk04J17L63k68L77j73N1K00j83l1k91J43j48j34J65
5598hj43J7k81K24J23J13n18M24k56K76j45L43m1j47J59j04q3J34N6M5k02j72
5620a86L86j08j48J19Ol13K02NR2n2J10n15K15Q7J31P3n3R9j44K84M7P4q7l58
5644c4J18l3rO9o2j45J2k13J66J84m47K64N9r9lN9O6l9k8J24m7J13J43L8K7k45
5670C8R0QK9j25k01o2J60K1l2j46j30K11j92J38J3J91j81J28Q1l4P4K3J03j1M7
$$ plain form
5503 383 -15 284 153 277 185 73 -46 251 312 54 -107 -109 -157 -305 -87 -97 -73 -289 -274 -245 -157 -114 -172 41
5527 41 24 326 138 180 117 232 320 59 205 321 173 182 116 2 116 -143 -85 -433 -143 122 -38 -121 -156 -108
5551 -108 -30 158 118 -56 13 61 78 231 309 212 280 227 162 119 -22 178 136 233 -90 -70 -91 -397 -259 -220 -426
5576 -426 -222 -150 -56 116 -62 -1 8 -196 -79 284 16 393 220 271 471 288 257 -34 109 -39 -173 -8
5598 -8 -151 -134 -415 -191 -68 45 -473 -49 -305 -29 -174 169 128 -19 140 36 -47 87 143 188 -14 -186
5620 -186 200 92 -56 63 69 -244 -42 -37 55 3 113 -402 -187 -100 31 104 51 150 6 290 337 411 324 -34
5644 -34 84 51 42 111 49 -96 -84 -297 -131 53 -394 -130 -71 -170 -173 -114 -48 -87 -115 9 -38 75 218 256 283 38
5670 38 128 136 165 40 -161 -223 -63 -42 -74 -220 -350 -139 -331 -193 -180 11 -170 -42 39 5 79 102 205 194 241
$$ [...]
8191A9
##END NTUPLES=NMR FID
##END=
