##TITLE=1H_Ser 6-2-k-2
 CDCl3
 64 sc, 
 16.12.2022
##JCAMPDX= 6.0         $$ Bruker NMR JCAMP-DX V2.0
##DATA TYPE= NMR FID
##DATA CLASS= NTUPLES
##ORIGIN= UXNMR, Bruker Analytische Messtechnik GmbH
##OWNER= root
$$ XWIN-NMR		Version 3.5
$$ Fri Dec 16 14:16:44 2022 Russian Standard Time (UT+4h)  she@DPX200
##.OBSERVE FREQUENCY= 200.13135
##.OBSERVE NUCLEUS= ^1H
##.DELAY= (6, 6)
##.ACQUISITION MODE= SIMULTANEOUS
##.ACQUISITION SCHEME= undefined
##.AVERAGES= 64
##.DIGITISER RES= 18
##SPECTROMETER/DATA SYSTEM= spect
##.PULSE SEQUENCE= zg30
##.SOLVENT NAME= CDCl3
##.SHIFT REFERENCE= (INTERNAL, CDCl3, 0, 15.7039)
##AUDIT TRAIL= $$ (NUMBER, WHEN, WHO, WHERE, WHAT)
$$ ##TITLE= Audit trail, XWIN-NMR		Version 3.5
$$ ##JCAMPDX= 5.01
$$ ##ORIGIN= Bruker BioSpin GmbH
$$ ##OWNER= she
$$ F:/spectra/data/she/nmr/H-F/1/audita.txt
$$ ##AUDIT TRAIL=  $$ (NUMBER, WHEN, WHO, WHERE, WHAT)
(   1,<2022-12-16 14:15:37.09 +0400>,<she>,<DPX200>,
      <continue with go, POWCHK disabled, PULCHK disabled
       configuration hash MD5:
       00 E9 B6 7A A2 85 ED C7 34 08 36 98 17 FE 4E 26
       data hash MD5: 16K
       29 C2 12 2B E3 01 7C 57 EE 5B CD 0D 78 54 52 CB>)
$$ ##END=
$$ 
$$ hash MD5
$$ D2 38 32 60 AF B5 EE F2 09 8F 0F F6 C9 22 38 83
##$RELAX= 
##$RELAX= 
##$RELAX= 
##$RELAX= 
##$RELAX= 
##$RELAX= 
$$ Bruker specific parameters
$$ --------------------------
##$DU= <F:/spectra>
##$EXPNO= 1
##$NAME= <H-F>
##$PROCNO= 1
##$TYPE= <nmr>
##$USER= <she>
##$AMP= (0..31)
100 100 100 100 100 100 100 100 100 100 100 100 100 100 100 100 100 100 
100 100 100 100 100 100 100 100 100 100 100 100 100 100 
##$AQSEQ= 0
##$AQ_mod= 1
##$AUNM= <au_zg>
##$AUTOPOS= <>
##$BF1= 200.13
##$BF2= 200.13
##$BF3= 200.13
##$BF4= 200.13
##$BF5= 200.13
##$BF6= 200.13
##$BF7= 200.13
##$BF8= 200.13
##$BYTORDA= 1
##$CFDGTYP= 0
##$CFRGTYP= 5
##$CHEMSTR= <none>
##$CNST= (0..31)
1 1 145 1 1 1 1 1 1 1 1 1 1 1 1 1 1 1 1 1 1 1 1 1 1 1 1 1 1 1 1 1 
##$CPDPRG= <>
##$CPDPRG1= <>
##$CPDPRG2= <>
##$CPDPRG3= <>
##$CPDPRG4= <mlev>
##$CPDPRG5= <mlev>
##$CPDPRG6= <mlev>
##$CPDPRG7= <mlev>
##$CPDPRG8= <mlev>
##$CPDPRGB= <>
##$CPDPRGT= <>
##$D= (0..31)
0 1.2 0 0 0 0 0 0 0 0.06 0 0.03 0 0 0 0 0.0002 0 0 0 0 0 0 0 0 0 0 0 0 
0 0 0 
##$DATE= 1671185500
##$DBL= (0..7)
120 120 120 120 120 120 120 120 
##$DBP= (0..7)
150 150 150 150 150 150 150 150 
##$DBP07= 0
##$DBPNAM0= <>
##$DBPNAM1= <>
##$DBPNAM2= <>
##$DBPNAM3= <>
##$DBPNAM4= <>
##$DBPNAM5= <>
##$DBPNAM6= <>
##$DBPNAM7= <>
##$DBPOAL= (0..7)
0.5 0.5 0.5 0.5 0.5 0.5 0.5 0.5 
##$DBPOFFS= (0..7)
0 0 0 0 0 0 0 0 
##$DE= 6
##$DECBNUC= <off>
##$DECIM= 32
##$DECNUC= <off>
##$DECSTAT= 4
##$DIGMOD= 1
##$DIGTYP= 9
##$DL= (0..7)
0 120 120 120 120 120 120 120 
##$DP= (0..7)
150 150 150 150 150 150 150 150 
##$DP07= 0
##$DPNAME0= <>
##$DPNAME1= <>
##$DPNAME2= <>
##$DPNAME3= <>
##$DPNAME4= <>
##$DPNAME5= <>
##$DPNAME6= <>
##$DPNAME7= <>
##$DPOAL= (0..7)
0.5 0.5 0.5 0.5 0.5 0.5 0.5 0.5 
##$DPOFFS= (0..7)
0 0 0 0 0 0 0 0 
##$DQDMODE= 0
##$DR= 18
##$DS= 0
##$DSLIST= <SSSSSSSSSSSSSSS>
$$ [...]
##$SUBNAM2= <"">
##$SUBNAM3= <"">
##$SUBNAM4= <"">
##$SUBNAM5= <"">
##$SUBNAM6= <"">
##$SUBNAM7= <"">
##$SUBNAM8= <"">
##$SUBNAM9= <"">
##$SW= 18.05172834244
##$SWIBOX= (0..15)
0 0 2 0 0 0 0 0 0 0 0 0 0 0 0 0 
##$SW_h= 3612.71676300578
##$TD= 16384
##$TD0= 1
##$TE= 0
##$TE2= 300
##$TE3= 300
##$TEG= 300
##$TL= (0..7)
0 120 120 120 120 120 120 120 
##$TP= (0..7)
150 150 150 150 150 150 150 150 
##$TP07= 0
##$TPNAME0= <>
##$TPNAME1= <>
##$TPNAME2= <>
##$TPNAME3= <>
##$TPNAME4= <>
##$TPNAME5= <>
##$TPNAME6= <>
##$TPNAME7= <>
##$TPOAL= (0..7)
0.5 0.5 0.5 0.5 0.5 0.5 0.5 0.5 
##$TPOFFS= (0..7)
0 0 0 0 0 0 0 0 
##$TUNHIN= 0
##$TUNHOUT= 0
##$TUNXOUT= 0
##$USERA1= <user>
##$USERA2= <user>
##$USERA3= <user>
##$USERA4= <user>
##$USERA5= <user>
##$V9= 5
##$VALIST= <valist>
##$VCLIST= <CCCCCCCCCCCCCCC>
##$VD= 0
##$VDLIST= <DDDDDDDDDDDDDDD>
##$VPLIST= <PPPPPPPPPPPPPPP>
##$VTLIST= <TTTTTTTTTTTTTTT>
##$WBST= 1024
##$WBSW= 4
##$XGAIN= (0..3)
0 0 0 0 
##$XL= 0
##$YL= 0
##$YMAX_a= 335399
##$YMIN_a= -478763
##$ZGOPTNS= <>
##$ZL1= 120
##$ZL2= 120
##$ZL3= 120
##$ZL4= 120
##$ABSF1= 10
##$ABSF2= 0
##$ABSG= 5
##$ABSL= 3
##$ALPHA= 0
##$AQORDER= 0
##$ASSFAC= 0
##$ASSFACI= 0
##$ASSFACX= 0
##$ASSWID= 0
##$AUNMP= <proc_1d>
##$AZFE= 0.1
##$AZFW= 0.1
##$BCFW= 1
##$BC_mod= 2
##$BYTORDP= 1
##$COROFFS= 0
##$CY= 11.3945322036743
##$DATMOD= 1
##$DC= 2
##$DFILT= <>
##$DTYPP= 0
##$F1P= 2.36226072786647
##$F2P= -0.459571619588291
##$FCOR= 0.5
##$FTSIZE= 0
##$FT_mod= 4
##$GAMMA= 1
##$GB= 0.15
##$INTBC= 1
##$INTSCL= 1
##$ISEN= 128
##$LB= 0.24
##$LEV0= 0
##$LPBIN= 0
##$MAXI= 10000
##$MC2= 0
##$MEAN= 0
##$ME_mod= 0
##$MI= 1.114404
##$NCOEF= 0
##$NC_proc= 0
##$NLEV= 6
##$NOISF1= 3.799351
##$NOISF2= 2.8
##$NSP= 1
##$NTH_PI= 0
##$NZP= 0
##$OFFSET= 15.70392
##$PC= 1
##$PHC0= -19103.68
##$PHC1= 11.00072
##$PH_mod= 1
##$PKNL= yes
##$PPARMOD= 0
##$PSCAL= 0
##$PSIGN= 0
##$REVERSE= no
##$SF= 200.130013532006
##$SI= 16384
##$SIGF1= 3
##$SIGF2= 2
##$SINO= 400
##$SIOLD= 16384
##$SREGLST= <1H.CDCl3>
##$SSB= 0
##$STSI= 0
##$STSR= 0
##$SW_p= 3612.71676300578
##$SYMM= 0
##$S_DEV= 0
##$TDeff= 0
##$TDoff= 0
##$TI= <>
##$TILT= no
##$TM1= 0
##$TM2= 0
##$TOPLEV= 0
##$USERP1= <user>
##$USERP2= <user>
##$USERP3= <user>
##$USERP4= <user>
##$USERP5= <user>
##$WDW= 1
##$XDIM= 8192
##$YMAX_p= 0
##$YMIN_p= 0
$$ End of Bruker specific parameters
$$ ---------------------------------
##NTUPLES= NMR FID
##VAR_NAME=  TIME,          FID/REAL,        FID/IMAG
##SYMBOL=    X,             R,               I
##VAR_TYPE=  INDEPENDENT,   DEPENDENT,       DEPENDENT
##VAR_FORM=  AFFN,          ASDF,            ASDF
##VAR_DIM=   8192,          8192,            8192
##UNITS=     SECONDS,       ARBITRARY UNITS, ARBITRARY UNITS
##FACTOR=    0.0002768,     1,               1
##FIRST=     0,             0,               0
##LAST=      2.2672688,     0,               0
##MIN=       0,             -478763,         0
##MAX=       2.2672688,     335399,          0
$$ Real data points
##PAGE= N=1
##DATA TABLE= (X++(R..R)), XYDATA
$$ plain form
0 0 0 0 0 0 0 0 0 0 0 0 0 0 0 0 0 0 -64 64 -64 64 -64 65 -128 128 -128 192 -192 253 -257 320 -355 387 -450
33 -450 514 -578 653 -743 830 -926 1031 -1148 1279 -1420 1569 -1739 1916 -2120 2337 -2574
49 -2574 2838 -3124 3445 -3791 4181 -4621 5121 -5682 6330 -7084 7967 -9030 10333 -11974
63 -11974 14109 -17035 21270 -28032 40542 -71625 335399 273161 -249947 33027 162145
74 162145 154622 142079 99589 -130078 -101473 44654 81131 37944 55915 -15537 -56983 -29076
86 -29076 17939 62237 85564 -61227 -148393 8017 123238 2068 -24008 62758 6125
97 6125 -46581 114822 165976 -10740 -57500 68435 68572 -4314 -43 -12856 -55068 -3297
109 -3297 49213 -9546 -63621 -26759 27275 40592 -14755 -86305 -55139 10849 -42949 -87928
$$ packed form
0@%%%%%%%%%%%%%%%%o4J28j28J28j28J29j93K56k56L20l84M45n10N77o75P42q37
33d50R64j092J231j396J573j756J957k179K427k699K989l308L655m036M457m911
49b574N412n962O569p236P972q802R742j0803J2012j3414J5051j6997J9363k2307
63a1974K6083l1144L8305m9302O8574j12167M07024o2238n23108K82974J29118
74A62145p523j2543m2490k29667K8605J46127L6477m3187J7971p1452m1446K7907
86b9076M7015M4298K3327j46791q7166J56410J15221j21170k6076Q6766n6633
97F125n2706J61403N1154j76716m6760J25935J37p2886M271j2813m2212N1771
109c297N2510n8759n4075L6862N4034J3317n5347p1550L1166O5988n3798m4979
$$ plain form
121 -87928 -22130 -20470 -92351 -53772 29461 4326 -15329 30990 10067 -41537 15715 88843
133 88843 51187 -14154 -19423 4282 25443 36544 24345 -5581 -22847 -13527 6564 5405 -28090
146 -28090 -39019 -3796 -1736 -59511 -67405 -9760 4832 -25879 -22240 -7936 -17169 -2197 34568
159 34568 25134 6316 24429 20118 -2669 17191 44047 23111 -2339 -6563 431 23910 36069
172 36069 11518 -5937 5770 2254 -7686 18194 20570 -24039 -37306 -18371 -15966 -11562 -3768
185 -3768 -24120 -38950 -10598 6289 -10317 -6055 15490 7455 -2585 10691 11269 9725 23733
198 23733 19011 336 12175 25875 7962 1003 24270 23974 -763 -11586 -12171 -9155 3772
211 3772 -2262 -30398 -37144 -27979 -25932 -12752 1248 -14851 -33031 -20867 -7472 -6176 12429
$$ packed form
121h7928O5798J660p1881L8579Q3233k5135j9655M6319k0923n1604N7252P3128
133H8843l7656o5341n269K3705K1161J1101j2199k9926j7266R320K0091j159l3495
146b8090j0929L5223K060n7775p894N7645J4592l0711L639J4304r233J4972L6765
159C4568r434j8818J8113m311k2787J9860K6856k0936k5450m224O994K3479J2159
172C6069k4551j7455J1707l516r940K5880K376m4609j3267J8935K405M404P794
185c768k0352j4830K8352J6887j6606M262K1545q035j0040J3276N78j544J4008
198B3733m722j8675J1839J3700j7913o959K3267k96k4737j0823n85L016J2927
211C772o034k8136o746R165K047J3180J4000j6099j8180J2164J3395J296J8605
$$ plain form
224 12429 21232 -11571 -27220 2910 27664 23373 18015 10024 -5626 -311 25219 34873 15718
237 15718 -4497 -9246 -4772 801 1145 -1998 -10984 -24922 -30259 -16546 -1973 -5436 -16455 -18501
251 -18501 -19724 -18500 405 13747 -894 -10464 4825 12278 5960 14860 29798 22319 8331
264 8331 14515 20176 13809 14759 21934 15088 967 -6852 -2036 5439 4744 -3198 -11949 -19362 -23559
279 -23559 -13280 2018 -2877 -21991 -20298 -9416 -12247 -5251 16739 14053 -10770 -13042 6664
292 6664 20286 22776 21360 7626 -7129 224 21273 27444 16732 555 -11226 -8959 -107
305 -107 6769 6228 -8523 -30702 -33573 -14407 -3206 -10844 -17129 -24916 -34831 -22628 3808 7059
319 7059 -7409 -13104 -10560 -6418 7501 20351 12449 -3275 -4278 4658 12134 16903 10460 2532
$$ packed form
224A2429Q803l2803j5649L0130K4754m291n358p991j5650N315K5530R654j9155
237A5718k0215m749M474N573L44l143q986j3938n337J3713J4573l463j1019k046
251a8501j223J224J8905J3342j4641r570J5289P453o318Q900J4938p479j3988
264H331O184N661o367R50P175o846j4121p819M816P475o95p942q751p413m197
279b3559J0279J5298m895j9114J693J0882k831O996K1990k686k4823k272J9706
292F664J3622K490j416j3734j4755P353K1049O171j0712j6177j1781K267Q852
305a07O876n41j4751k2179k871J9166J1201p638o285p787r915J2203K6436L251
319G059j4468n695K544M142J3919J2850p902j5724j003Q936P476M769o443p928
$$ plain form
333 2532 1187 395 473 5066 3545 -8052 -15089 -12231 -15922 -19804 -13772 -10372 -18464 -18386 -9337 -8667
349 -8667 -8905 -812 4885 1912 -513 1610 2028 7187 16788 15520 9992 9561 11405 16771 26197 23459
365 23459 9664 3105 2630 2463 3781 6064 -3281 -16103 -14787 -8294 -6301 -1368 -671 -11229 -16066
380 -16066 -8312 -528 1532 3907 1406 -5880 -2336 10327 15883 16747 17778 11849 5940 11649 18339
395 18339 15431 13611 8293 -2725 -6612 3272 5787 -983 -2259 -9118 -18900 -11921 -557 -4091
409 -4091 -11625 -14469 -20067 -16269 -1714 3004 -6491 -8446 -5503 -6298 4819 16940 8592 -898 1766
424 1766 3990 6185 15832 15916 3151 -1727 5002 4046 4326 6932 -4051 -13857 -8104 -7085 -15150 -11527
440 -11527 -7380 -16726 -17502 -7979 -10187 -14527 -4039 -1344 -8786 -3391 1111 -5285 3041 15969 10885
$$ packed form
333B532j345p92P8M593j521j1597p037K858l691l882O032L400q092P8R049O70
349h667k38Q093N697k973k425K123M18N159R601j268n528m31J844N366R426k738
365B3459j3795o559m75j67J318K283r345j2822J316O493J993M933O97j0558m837
380a6066P754P784K060K375k501p286L544J2663N556Q64J031n929n909N709O690
395A8339k908j820n318j1018l887R884K515o770j276o859r782O979J1364l534
409d091p534k844n598L798J4555M718r495j955K943p95J1117J2121q348r490K664
424A766K224K195R647Q4j2765m878O729r56K80K606j0983r806N753J019q065L623
440a1527M147r346p76R523k208m340J0488K695p442N395M502o396Q326J2928n084
$$ plain form
455 10885 5913 11984 8752 2672 15412 20174 5795 1538 3299 -6920 -4154 12149 5737 -12387
469 -12387 -12438 -12292 -15954 -2521 5801 -13312 -22176 -12059 -12130 -10013 8666 5102 -17588 -12352 5780
484 5780 7020 13312 20600 741 -10214 11738 23274 14198 14951 8661 -13681 -5009 20142 9030
498 9030 -7373 -3533 -14883 -26190 -2608 6974 -17628 -21062 -10778 -19506 -17360 6648 -675
511 -675 -19361 -6008 1525 -9531 4225 16474 -1944 -2726 17575 9651 -3483 14249 18659
524 18659 635 6454 9690 -12526 -7514 13575 3011 -12055 -3607 -9569 -21021 -958 9535
537 9535 -11266 -15517 -5626 -15036 -11647 9612 1202 -17819 -7287 1926 140 12218 16818 -1478
551 -1478 -539 18200 19567 14202 17342 5822 -4510 10201 17673 2766 -15 4162 -4195 -4143 4247
$$ packed form
455A0885m972O071l232o080J2740M762j4379m257J761j0219K766J6303o412j8124
469a2387n1J46l662J3433Q322j9113q864J0117p1K117J8679l564k2690N236J8132
484E780J240O292P288j9859j0955K1952J1536r076P53o290k2342Q672K5151j1112
498I030j6403L840j1350j1307K3582R582k4602l434J0284q728K146K4008p323
511f75j8686J3353P533j1056J3756J2249j8418p82K0301p924j3134J7732M410
524A8659j8024N819L236k2216N012K1089j0564j5066Q448n962j1452K0063J0493
537I535k0801m251R891r410L389K1259q410j9021J0532R213j786J2078M600j8296
551a478R39J8739J367n365L140j1520j0332J4711P472j4907k781M177q357N2Q390
$$ plain form
566 4247 -3771 -9835 9 -285 -11131 -10603 -6648 -9810 -1474 6914 -988 -4015 2637 2264 8059 20454
582 20454 17724 3326 1304 7817 9595 16025 16390 -834 -7704 7567 11835 5815 4880 207 -8536
597 -8536 -1822 4763 -4961 -11047 -6139 -8478 -11411 -3680 -6850 -14400 -4246 5704 -3792 -4582 3317
612 3317 -1904 -3123 10467 10511 -323 3996 8649 3369 8902 18368 7477 -2658 5085 7840 2279
627 2279 5824 -2496 -17758 -9628 6753 -1570 -14893 -11623 -12663 -13366 2054 4138 -10318 -10261 -2479
642 -2479 -5281 -918 11479 9036 -868 4061 7638 3620 13552 19683 5813 504 9922 5850 678
657 678 8331 7677 -3402 -2221 -563 -9507 -6865 1975 -3770 -11975 -9471 -11213 -10401 -1431 404 -8419
673 -8419 -9709 -3831 74 3652 6947 2376 752 5168 8303 7628 9902 10196 5804 4406 6158 5164
$$ packed form
566D247q018o064R844k94j0846N28L955l162Q336Q388p902l027O652l73N795J2395
582B0454k730j4398k022O513J778O430L65j7224o870J5271M268o020r35m673q743
597h536O714O585r724o086M908k339k933P731l170p550J0154R950r496p90P899
612C317n221j219J3590M4j0834M319M653n280N533R466j0891j0135P743K755n561
627B279L545q320j5262Q130J6381q323j3323L270j040p03J5420K084j4456N7P782
642b479k802M363J2397k443r904M929L577m018R932O131j3870n309R418m072n172
657F78P653o54j1079J181J658q944K642Q840n745q205K504j742Q12Q970J835q823
673h419j290N878L905L578L295m571j624M416L135o75K274K94m392j398J752r94
$$ plain form
689 5164 4252 3018 -977 -3416 -3232 -3238 -5974 -7690 -8621 -6852 -6520 -8247 -10576 -6913 -3493 -3587 -3809 -4038
707 -4038 -4555 1173 7245 6776 1641 1443 4499 8459 12935 11783 4493 1695 3398 3705 7044 9790
723 9790 2957 -6688 -7896 -3366 465 2011 -4465 -15691 -15639 -6007 -1303 -3474 -4905 -9238 -10842
738 -10842 -1337 4416 4349 3200 1176 -894 2469 9943 12242 9187 6365 3459 4551 10339 11176 4679
754 4679 328 -47 -379 24 1109 -2792 -8278 -7465 -4704 -4082 -6955 -7028 -7347 -6706 -3585 -4371 -3602 -1333
772 -1333 513 1085 4068 5775 5862 5349 7357 7844 8776 10159 6549 2416 2546 6014 5482 3683 277
789 277 -4674 -2954 -942 -2825 -5388 -8774 -9397 -9739 -7096 -5149 -5766 -5744 -5190 -6063 -2577 1430 3050
806 3050 3331 2528 694 2063 6426 9131 6671 3885 3365 2925 3918 6381 6122 2848 -1463 -5331 -4471
$$ packed form
689E164r12j234l995k439J84ok736j716r31J769L32j727k329L663L420r4k22k29
707d038n17N728O072m69n135j98L056L960M476j152p290k798J703L07L339K746
723I790o833r645j208M530L831J546o476j1226N2R632M704k171j431m333j604
738a0842R505N753o7j149k024k070L363P474K299l055k822k906J092N788Q37o497
754D679m351l75l32M03J085l901n486Q13K761O22k873p3l19O41L121p86P69K269
772a333J846N72K983J707Q7n13K008M87R32J383l610m133J30L468n32j799l406
789B77m951J720K012j883k563l386o23l42K643J947o17K2N54q73L486M007J620
806C050K81q03j834J369M363K705k460k786n20m40R93K463k59l274m311l868Q60
$$ plain form
823 -4471 -1622 -673 -4002 -8921 -11113 -9364 -4041 485 -2853 -8177 -8147 -3953 -79 3203 3909 -698
839 -698 -1660 2313 8387 10427 10008 6791 3880 6510 10178 10267 7763 3415 72 -166 2521 2265 -1782
856 -1782 -4739 -5373 -4421 -3586 -3086 -5542 -6871 -4969 -2557 -3330 -3278 -3182 -1961 895 4073 4211 1760 3894
874 3894 6220 8537 10446 8370 3861 2746 5431 6900 7087 3759 -2885 -5699 -1668 2737 -326
889 -326 -4736 -6529 -9736 -7473 -1736 -1667 -7498 -10239 -8373 -5965 964 3410 -628 -3377 -752 2552
905 2552 6910 8272 5364 454 1692 5990 5847 5924 5931 1363 -517 2344 3240 -712 -2237 -3184 -5107
922 -5107 -6807 -3728 -6607 -7897 -5574 -5152 -7525 -4156 -2579 -4172 -2577 703 -391 -1276 2205 2986
938 2986 2938 6922 7117 2312 4126 8160 4900 3796 5383 1693 -3126 -999 451 -2609 -2661 -2116 -8027
$$ packed form
823d471K849R49l329m919k192J749N323M526l338n324L0M194L874L282P06m607
839f98r62L973O074K040m19l217k911K630L668Q9k504m348l343k38K687k56m047
856a782k957o34R52Q35N00k456j329J902K412p73N2R6J221K856L178J38k451K134
874C894K326K317J909k076m509j115K685J469J87l328o644k814M031M405l063
889c26m410j793l207K263N737O9n831k741J866K408O929K446m038k749K625L304
905B552M358J362k908m910J238M298j43P7Pm568j880K861Q96l952j525r47j923
922e107j700L079k879j290K323M22k373L369J577j593J595L280j094q85L481P81
938B986m8L984J95m805J814M034l260j104J587l690m819K127J450l060n2N45n911
$$ plain form
955 -8027 -8585 -3718 -3735 -4538 -3547 -6220 -9764 -4675 568 -2375 -1438 1029 -2045 -2811 6305 8802 2963
972 2963 4052 5527 1022 4484 9555 4817 -448 1725 1383 -519 2951 2313 -4902 -5398 -1501 -4927
988 -4927 -3191 -1081 -7254 -9123 -3275 -2319 -5063 -1595 826 -4579 -1951 3351 2072 2474 5983 3829
1004 3829 1373 6650 9032 6887 7062 5292 1013 2233 4992 2480 1284 1909 -3066 -7114 -1156
1019 -1156 -401 -4745 -3161 -3936 -8654 -5833 -536 -3653 -4767 -2206 -2142 -2127 3550 1695 -1717 1928
1035 1928 6518 5109 6546 7166 -1400 -1379 8636 8443 2051 1946 -524 -5504 -498 6041 -949 -6054
1051 -6054 -5717 -8293 -7031 -510 -2462 -10072 -9085 -4750 -3894 -715 1599 -5450 -6553 3227 5592 1992
1067 1992 3448 3734 -1691 2390 10712 5076 550 3845 2937 579 3391 3943 -2608 -4083 87 -2300
$$ packed form
955h027n58M867j7q03R91k673l544N089N243k943R37K467l074p66R116K497n839
972B963J089J475m505L462N071m738n265K173l42j902L470o38p215m96L897l426
988d927J736K110o173j869N848R56k744L468K421n405K628N302j279M02L509k154
1004C829k456N277K382k145J75j770m279J220K759k512j196O25m975m048N958
1019a156P55m344J584p75m718K821N297l117j114K561O4J5N677j855l412L645
1035A928M590j409J437O20q566K1J0015j93o392j05k470m980N006O539o990n105
1051f054L37k576J262O521j952p610R87M335Q56L179K314p049j103R780K365l600
1067A992J456K86n425M081Q322n636m526L295r08k358K812N52o551j475M170k387
$$ plain form
1083 -2300 -4334 -1875 -3740 -6874 -3901 -3133 -5844 -3850 -1180 -3518 -1787 1633 -1138 -3143 3485
1098 3485 8386 4478 3637 4445 2913 4316 9158 8514 3384 2153 2219 1906 3757 2864 238 -1161 -3356
1115 -3356 -3663 -2387 -2309 -5335 -5259 -4180 -3152 -4145 -2164 -2149 -2946 -76 597 -514 1518 3106 3737 3515
1133 3515 4741 2902 3715 7642 6377 5361 4000 366 -2032 2834 6150 -480 -5103 -3493 -4577
1148 -4577 -4357 1275 -1284 -9200 -8248 -3961 -4164 -853 -21 -5644 -6894 -714 2041 1475 4396 1980
1164 1980 -2510 2995 9154 3665 2479 6149 2327 153 5785 5961 -2157 -284 2129 -1666 -3176
1179 -3176 -492 -4600 -7064 -2099 -2146 -6890 -3820 -2098 -5336 -2712 1533 -1730 -2777 2854 2207 -815
1195 -815 3233 4855 1798 3356 7889 4701 1898 4308 2395 1664 5108 4649 -668 -1407 464 -2072
$$ packed form
1083b300k034K459j865l134K973P68k711J994K670k338J731L420k771k005O628
1098C485M901l908q41Q08j532J403M842o44n130j231O6l13J851q93k626j399k195
1115c356l07J276P8l026P6J079J028r93J981J5p97K870O73j111K032J588O31k22
1133C515J226j839Q13L927j265j016j361l634k398M866L316o630m623J610j084
1148d577K20N632k559p916R52M287k03L311Q32n623j250O180K755n66K921k416
1164A980m490N505O159n489j186L670l822k174N632J76q118J873K413l795j510
1179c176K684m108k464M965m7m744L070J722l238K624M245l263j047N631o47l022
1195h15M048J622l057J558M533l188k803K410j913p31L444m59n317p39J871k536
$$ plain form
1211 -2072 -1644 -172 -2904 -5950 -3434 -4076 -4951 -2352 -2403 -5431 -3862 -548 -1218 -1595 2667 2593 1488
1228 1488 2737 3252 2482 4291 5987 4667 2862 3972 2824 2367 2883 2022 -253 235 -690 -4141 -2126
1245 -2126 -1770 -4340 -5570 -3301 -3852 -4475 -2338 -2047 -3807 -2341 -818 -430 -215 939 1123 2104 3649
1262 3649 3405 2639 4811 3999 3320 2895 3352 1280 1154 2281 196 -1361 -758 -1765 -3010 -3189 -2613
1279 -2613 -3228 -3990 -3519 -4366 -3836 -2165 -1125 -2813 -2303 -2072 289 2239 3003 1650 1292 3186 4380
1296 4380 5250 6690 3925 1763 2550 3607 3283 2321 2063 -757 -2146 -1710 170 -928 -2838 -4894
1312 -4894 -5883 -3782 -1190 -1493 -3073 -4533 -4099 -2000 1237 1438 -719 -305 847 2193 4245 5934
1328 5934 4642 2480 2243 3066 4299 4973 1971 254 -389 630 852 14 -1427 -4095 -4040 -2776 -2856
$$ packed form
1211b072M28J472k732l046K516o42q75K599n1l028J569L314o70l77M262p4j105
1228A488J249N15p70J809J696j320j805J110j148m57N16q61k275M88r25l451K015
1245b126L56k570j230K269n51o23K137K91j760J466J523L88K15J154J84R81J545
1262C649k44p66K172q12o79m25M57k072j26J127k085j557O03j007j245j79N76
1279b613o15p62M71q47N30J671J040j688N10K31K361J950P64j353l58J894J194
1296D380Q70J440k765k162P87J057l24r62k58k820j389M36J880j098j910k056
1312d894r89K101K592l03j580j460M34K099L237K01k157M14J152J346K052J689
1328E934j292k162k37Q23J233O74l002j717o43J019K22q38j441k668N5J264q0
$$ plain form
1345 -2856 -2550 -4013 -4197 -4065 -2536 -1410 -2191 -1596 -770 371 329 972 2177 2518 3197 3239 2916 3504 3228
1364 3228 2019 2898 2287 2680 503 -17 -672 -968 -767 -1966 -3110 -4575 -3992 -3647 -3561 -2989 -3966 -3515
1382 -3515 -2074 -1775 -1397 -782 318 960 1417 2073 2774 3364 4245 4353 3511 3544 3709 3717 3665 3091 2267 73
1402 73 1034 -185 -996 -977 -988 -2803 -3864 -3048 -1890 -2844 -2611 -3206 -3384 -1940 396 981 -628 254 407
1421 407 1844 3823 4167 2458 2335 3044 2731 4208 4659 2726 755 349 1336 1504 1575 -660 -3307 -4052
1439 -4052 -2915 -2155 -2603 -3653 -4857 -4792 -2985 -2198 -2126 -1960 -1566 -2172 -721 1489 1124 955 1051 1953 1446
1458 1446 3030 4176 2308 2222 1638 2682 1114 1513 -821 -1880 -1441 -1916 -2364 -2515 -3241 -4656 -3814
1475 -3814 -1943 -2432 -3375 -2869 -3030 -3894 -101 1005 -33 -286 624 559 3014 4113 3679 1845 3298
$$ packed form
1345b856L06j463j84J32J529J126p81N95Q26J141m2O43J205L41O79M2l23N88k76
1364C228j209Q79o11L93k177n20o55k96K01j199j144j465N83L45Q6N72r77M51
1382c515J441K99L78O15J100O42M57O56P01N90Q81J08q42L3J65Qn2n74q24k194
1402G3R61j219q11J9j1j815j061Q16J158r54K33n95j78J444K336N85j609Q82J53
1421D07J437J979L44j709j23P09l13J477M51j933j971m06R87J68P1k235k647p45
1439d052J137P60m48j050j204O5J807P87P2J66L94o06J451K210l65j69R6R02n07
1458A446J584J146j868q6n84J044j568L99k334j059M39m75m48j51p26j415Q42
1475c814J871m89r43N06j61q64L793J106j038k53R10o5K455J099m34j834J453
$$ plain form
1492 3298 3735 3010 4044 3072 1481 1130 1903 623 -169 -416 -1951 -3681 -1956 -959 -3020 -3421 -2482
1509 -2482 -3459 -2107 -414 -35 -1856 -143 -332 338 1860 2856 2039 3314 3345 2845 2002 3817 4112 3309
1527 3309 3423 2560 -580 -114 1317 484 -178 -1067 -2945 -3969 -2284 -922 -1954 -2927 -3219 -3970 -1736
1544 -1736 -1254 -1828 -1591 -1057 -343 874 2702 1419 925 2633 4692 3046 3285 2640 889 1948 4195
1561 4195 1605 -654 109 -1404 -1365 -944 -1398 -3260 -3092 -1967 -3339 -4059 -1639 -3522 -4376 -237 -751
1578 -751 -3698 -549 448 -141 2127 5084 1551 -1731 2160 4336 3305 4923 4130 -1437 -178 3683
1594 3683 1673 373 1778 -1961 -3518 339 649 -4806 -3283 285 -3973 -3524 -249 -2932 -5583
1609 -5583 40 1320 -2433 30 2628 -1687 132 6418 3084 28 3382 2459 207 4259 6142
$$ packed form
1492C298M37p25J034r72j591l51P73j280p92k47j535j730J725R97k061m01R39
1509b482r77J352J693L79j821J713j89O70J522R96q17J275L1n00q43J815K95q03
1527C309J14q63l140M66J431q33o62q89j878j024J685J362j032r73k92p51K234
1544a736M82n74K37N34P14J217J828j283m94J708K059j646K39o45j751J059K247
1561D195k590k259P63j513L9M21m54j862J68J125j372p20K420j883q54M139n14
1578g51k947L149R97n89K268K957l533l282L891K176j031J618p93n567J259L861
1594C683k010j300J405l739j557L857L10n455J523L568m258M49L275k683k651
1609e583N623J280l753K463K598m315J819O286l334l056L354r23k252M052J883
$$ plain form
1624 6142 -513 -844 3613 51 -620 2447 -1466 -4732 -914 1048 -4486 -3950 -1355 -4330 -4409 650
1640 650 -1444 -4637 -701 1259 -1624 690 2752 -667 74 3528 3327 1291 4429 2987 27 2716
1656 2716 3683 851 467 2736 406 -1273 119 -869 -3945 -1165 -238 -3013 -4029 -2628 -3440 -2149
1672 -2149 -648 -2534 -3198 -448 -442 -573 1797 1272 -238 886 3696 2935 2636 3291 1181 429 3490
1689 3490 3276 2187 371 -1325 -1608 -170 1721 -1808 -4348 -3492 -2417 -2229 -1061 -2315 -5886 -3345
1705 -3345 -773 -1043 -199 305 -1517 -1411 1767 3329 1601 1903 2030 325 2087 5180 2136 880
1721 880 1516 1097 1283 2786 2135 -1769 -1721 -655 -1144 -748 -927 -2979 -4967 -1685 -1516 -2870 -1468 -281
1739 -281 -1685 -1318 529 1051 864 2440 1659 -31 2288 3225 2668 2710 3242 1035 1596 2244 2167 -109
$$ packed form
1624F142o655l31M457l562o71L067l913l266L818J962n534N36K595k975p9N059
1640F50k094l193L936J960k883K314K062l419P41L454k01k036L138j442k960K689
1656B716R67k832l84K269k330j679J392r88l076K780R27k775j016J401q12J291
1672b149J501j886o64K750Oj31K370n25j510J124K810p61k99O55k110p52L061
1689C490k14j089j816j696k83J438J891l529k540Q56J075J88J168j254l571K541
1705c345K572k70Q44N04j822J06L178J562j728L02J27j705J762L093l044j256
1721H80O36m19J86J503o51l904M8J066m89L96j79k052j988L282J69j354J402J187
1739b81j404L67J847N22j87J576p81j690K319R37n57M2N32k207N61O48p7k276
$$ plain form
1757 -109 332 -8 -2186 -1011 -392 -1827 -3423 -2336 -2773 -2505 -1334 -1292 -3002 -2315 -577 -596 -36 1100
1775 1100 -56 -148 1700 1908 2097 2044 1970 755 2202 2960 2088 2256 1472 94 -121 304 112 -524 -1975
1794 -1975 -1989 -1846 -2027 -1094 -1661 -1798 -2825 -2215 -1217 -565 -319 -301 -101 1170 1331 1225 2300 776 1388
1813 1388 2490 1818 2079 2184 2207 1639 1888 1325 1463 501 -134 -880 -1477 -1958 -1865 -1886 -2512 -2057 -2348 -2015
1833 -2015 -468 -2140 -1942 -573 175 -722 414 111 -56 1572 2657 1591 1189 2214 1404 2211 2543
1850 2543 2191 649 705 610 496 218 386 -1543 -2581 -2120 -1292 -1726 -900 -1973 -2873 -2764 -704 -1333 -678
1869 -678 -850 -758 -810 306 1175 1551 1763 2339 2165 1598 2444 2953 2243 982 1149 1208 1136 1194 9 65 -230
1890 -230 -693 -1671 -1101 -877 -1660 -1163 -2231 -2263 -1949 -1127 -907 -810 -929 2 321 987 1962 2270 1501 1578 1706
$$ packed form
1757a09M41l40k178J175O19j435j596J087m37K68J171M2j710O87J738j9N60J136
1775A100j156r2J848K08J89n3p4j215J447P58q72J68p84j378k15M25j92o36j451
1794a975j4J43j81R33n67j37j027O10R98O52K46J8K00J271J61j06J075j524O12
1813A388J102o72K61J05K3n68K49n63J38r62o35p46n97m81R3k1o26M55k91L33
1833b015J547j672J98J369P48q97J136l03j67J628J085j066m02J025q10Q07L32
1850B543l52j542N6r5j14k78J68j929j038M61Q28m34Q26j073r00J09K060o29O55
1869f78j72R2n2J116Q69L76K12N76j74n67Q46N09p10j261J67N9p2N8j185N6k95
1890b30m63r78N70K24p83M97j068l2L14Q22K20R7j19R31L19O66R75L08p69P7J28
$$ plain form
1911 1706 2459 2573 2536 1937 1589 881 342 539 158 367 -719 -1725 -1738 -1296 -1074 -1674 -3295 -2926 -1366
1930 -1366 -1477 -1678 -1001 -1122 -491 -332 427 1538 1796 1465 450 920 1841 2777 2108 2546 1265 1171 1992
1949 1992 1221 1052 82 -856 -972 -991 -1438 -1886 -1706 -1963 -2333 -1948 -1516 -1385 -2177 -792 -1147 -782 601
1968 601 9 -187 -84 634 1298 1510 1978 1529 964 2048 1916 1484 1507 840 -688 -2 863 -459 -1201
1987 -1201 -171 -1658 -2032 -1963 -1902 -2773 -1546 -1610 -2445 -907 -266 -480 -999 289 1138 78 1924 1575
2005 1575 786 931 2603 1453 1937 3152 1563 238 1733 1750 573 103 79 -1629 -1575 -869 -722 -2223
2023 -2223 -570 -1755 -3468 -1430 209 -1475 -2102 976 17 -624 1994 555 -86 1240 1688 629
2039 629 2642 3236 1657 672 3349 1973 579 1541 968 -1668 -155 1240 -1579 -1956 -1409 -1936 -2688
$$ packed form
1911A706P53J14l7n99l48p08n39J97l81K09j086j006j3M42K22o00j621L69J560
1930a366j11k01O77j21O31J59P59J111K58l31j015M70R21R36o69M38j281r4Q21
1949A992p71j69r70r38j16j9m47m48J80k57l70L85M32J31p92J385l55L65J383
1968F01n92j96J03P18O64K12M68m49n65J084j32m32K3o67j528O86Q65j322p42
1987a201J030j487l74O9O1q71J227o4q35J538O41k14n19J288Q49j060J846l49
2005A575p89J45J672j150M84J215j589j325J495J7j177m70k4j708N4P06J47j501
2023b223J653j185j713K038J639j684o27L078r59o41K618j439o41J326M48j059
2039F29K013N94j579r85K677j376j394R62n73k636J513J395k819l77N47n27p52
$$ plain form
2056 -2688 659 -682 -3198 -1601 -578 -1383 -115 136 -1056 -890 1764 1094 246 1865 2107 -270
2072 -270 2273 3640 1225 268 2089 1157 -779 1274 1200 -2252 -1270 316 -1885 -1458 -155 -2019 -2824
2089 -2824 -1034 -1214 -3070 -844 -969 -2025 -746 75 -605 -657 2109 1203 -320 1613 1285 1213 2127 3559
2107 3559 671 313 1017 963 871 1848 293 -2015 -479 -189 -1114 -971 -2428 -3483 -3333 -74 -770 -2354
2125 -2354 -1355 -2251 -2192 694 1495 -666 -316 997 220 1305 3780 1139 266 1236 1508 1033 2128 2549
2143 2549 -713 -589 876 -1259 -1033 -630 -626 -2014 -246 -372 -3111 -2470 -596 -734 -1293 -565 -1733 -2391
2161 -2391 48 1264 -132 353 1738 343 1848 2865 2025 1220 2409 1611 394 1623 2145 191
2177 191 -575 1338 -102 -1859 -478 -1545 -2770 -626 -821 -2179 -2046 -934 -1459 -942 14 -727 -1028
$$ packed form
2056b688L347j341k516J597J023q05J268K51j192J66K654o70q48J619K42k377
2072b70K543J367k415r57J821r32j936K053p4l452R82J586k201M27J303j864q05
2089b824J790j80j856K226j25j056J279Q21o80n2K766r06j523J933l28p2R14J432
2107C559k888l58P04n4r2R77j555k308J536K90r25J43j457j055J50L259o96j584
2125b354R99q96N9K886Q01k161L50J313p77J085K475k641q73R70K72m75J095M21
2143B549l262J24J465k135K26M03Mj388J768j26k739O41J874j38n59P28j168o58
2161b391K439J216j396M85J385j395J505J017q40q05J189p98j217J229N22j954
2177A91p66J913j440j757J381j067j225K144j95j358J33J112n25N17R56p41l01
$$ plain form
2194 -1028 710 1893 -340 1221 2347 828 1262 3352 1762 -72 834 1514 632 956 1738 -530
2210 -530 -677 -60 -130 -243 -360 -1826 -2607 -865 -689 -2025 -1336 -1311 -1860 -1401 68 -660 -454 921 1071
2229 1071 227 221 962 1172 1184 1152 1562 988 1493 809 530 1488 1287 -781 -883 20 -479 -1107 -1188 -1532 -1864
2250 -1864 -1801 -1399 -1012 -1122 -1222 -2150 -860 488 -168 -53 -142 804 553 1560 1640 988 1670 855 568 1120
2270 1120 1221 485 234 144 -648 -450 -34 601 -1226 -1138 -1250 -941 -1364 -994 -1067 -1415 -1112 -1634 -1782 -1189
2290 -1189 165 -454 -663 260 -181 601 2049 1494 1134 997 1142 923 1863 1070 617 748 -284 -51 -457
2309 -457 -153 -925 -1038 -1280 -1442 -1898 -1638 -1145 -1026 -1475 -1177 -566 -1313 105 -118 293 132 352 838 670
2329 670 1166 1133 598 1323 2030 1989 1443 651 692 306 -236 79 340 -440 -591 -1327 -1460 -560 -200 -509 -624
$$ packed form
2194a028J738J183k233J561J126j519M34K090j590j834R06O80q82L24P82k268
2210e30j47O17p0j13j17j466p81J742J76j336O89K5n49M59J469p28K06J375J50
2229A071q44oP41K10J2l2M10n74N05o84k79R58k01k068j02R03m99o28q1l44l32
2250a864O3M02L87j10j00r28J290J348o56J15q9R46k51J007Q0o52O82q15k87N52
2270A120J01p36k51r0p92J98M16O35j827Q8j12L09m23L70p3l48L03n22j48N93
2290a189J354o19k09R23m41P82J448n55l60j37J45k19R40p93m53J31j032K33m06
2309d57L04p72j13k42j62m56K60M93J19m49K98O11p47J418k23M11j61K20M86j68
2329F70M96l3n35P25P07m1n46p92M1l86n42L15K61p80j51p36j33R00L60l09j15
$$ plain form
2350 -624 -1705 -1284 -763 -319 -479 140 -5 -91 1078 1361 1098 1959 1513 1041 1362 1180 1633 1340 930 215
2370 215 -202 -53 -52 -993 197 -843 -1885 -1877 -783 -2158 -1173 -843 -811 -1557 -1114 -1118 -630 -264 -565 738
2390 738 155 148 706 363 874 1617 1226 1130 1013 1770 1220 485 -491 131 363 156 -244 -350 -902 -1154 -747
2411 -747 -536 -833 -667 -1381 -1386 -708 116 304 570 -83 -444 131 817 1285 891 1245 270 817 855 1948 1397
2432 1397 1170 286 -20 373 444 373 -29 -582 -485 -620 -588 -502 -427 -1756 -1711 -807 -631 -470 -833 -17 -163 565
2454 565 1196 891 1410 1415 693 603 1579 1992 1197 1262 946 495 -19 681 511 -287 97 -943 -892 -1287 -355
2475 -355 -1165 -1155 -1172 -1263 -1336 -1049 -819 -861 43 44 -207 -248 -237 199 536 1427 1507 406 1605 1930 1249 1652 952
2498 952 263 313 1098 658 -1130 -61 -1644 -2391 -747 -533 -1494 -2119 -1482 -1542 -918 -317 -163 -1420 -259
$$ packed form
2350f24j081M21N21M44j60O19j45q6J169K83k63Q61m46m72L21j82M53k93m10p15
2370B15m17J49Jr41J190j040j042QJ094j375R85L30L2p46M43mM88L66l01J303
2390G38n83pN58l43N11P43l91r6j17P57n50p35r76O22K32k07m00j06n52k52M07
2411g47K11k97J66p14nO78Q24J88K66o53l61N75O86M68l94L54r75N47L8J093n51
2432A397k27q84l06L93P1p1m02n53R7j35L2Q6P5j329M5R04J76J61l63Q16j46P28
2454E65O31l05N19Np22r0R76M13p95O5l16m51n14P00j70p98L84j040N1l95R32
2475c55q10J0j7r1p3K87K30m2R04Jk51m1J1M36L37Q91Q0j101J199L25o81M03p00
2498I52o89N0P85m40j788J069j583p47J644K14r61o25O37o0O24O01J54j257J161
$$ plain form
2517 -259 -434 -257 789 1985 590 268 849 422 651 2029 1212 868 811 477 406 993 184 -271 -665
2536 -665 -83 -954 -1116 -354 32 -1554 -1953 -1450 -1611 238 -529 -1114 -696 60 209 1006 254 597 -387
2555 -387 1218 855 1003 845 1627 1039 883 1326 681 109 544 528 141 -613 -28 -953 -1770 -771 -733 -1212
2575 -1212 -366 -1246 -1597 471 110 -845 -1066 418 268 1035 1307 91 -440 790 1497 1343 1263 520 -299
2594 -299 -87 663 1640 213 15 -314 -1532 -110 111 -530 -1102 -1505 -2042 -1240 -496 -336 -2291 -456
2612 -456 -353 -785 -234 646 647 63 937 23 397 837 999 942 1260 2031 -108 -261 850 570 -426 -572
2632 -572 -776 -1153 -11 -674 -1338 -503 -777 -1096 -1106 -354 -1182 -1058 -800 140 -36 557 819 -23 512 958
2652 958 720 1437 1302 825 223 526 738 216 645 159 -208 740 -85 -948 -490 220 667 -61 -1035 -1854
$$ packed form
2517b59j75J77J046J196j395l22N81m27K29J378q17l44n7l34p1N87q09m55l94
2536f65N82q71j62P62L86j586l99N03j61J849p67n85M18P56J49P97p52L43r84
2555c87J605l63J48j58P82n88j56M43o45n72M35j6l87p54N85r25q17R99L8m79
2575a212Q46q80l51K068l61r55k21J484j50P67K72j216n31J230P07j54q0p43q19
2594b99K12P50R77j427j98l29j218J422K21o41n72m03n37Q02P44J60j955J835
2612d56J03m32N51Q80Jn84Q74r14L74M40J62n7L18P71k139j53J111k80r96j46
2632e72k04l77J142o63o64Q35k74l19j0P52q28J24K58R40j76N93K62q42N35M46
2652I58k38P17j35m77o02L03K12n22M29m86l67R48q25q63M58P10M47p28r74q19
$$ plain form
2672 -1854 -1332 -589 245 -274 -1144 -815 -141 918 1622 1234 778 55 1278 1671 1241 1462 -300 -498 956
2691 956 860 243 678 235 -553 -97 -458 -421 -661 -567 -1224 -485 -980 -1096 -1529 -850 -921 -1302 -716 -375 401
2712 401 -167 757 -384 -40 611 763 456 1723 1011 538 1069 1311 1059 931 1138 -253 -523 -124 42
2731 42 -934 -296 -508 -1664 -1659 -93 -953 -1135 -10 -14 -1660 80 928 349 161 508 633 -231 702 1651
2751 1651 939 1701 703 47 625 1382 575 102 298 -812 -644 432 430 124 -1144 -1844 -1486 -547 -584 -324
2771 -324 -1145 -748 -163 -693 12 557 -268 -253 424 1212 1187 1151 1115 606 564 1733 810 1078 737 678 -224 185
2793 185 470 78 -41 -231 -912 -768 -1070 -1183 -1194 -414 -882 -664 -235 -552 -182 630 847 464 137 496
2813 496 664 780 1167 1260 1074 413 1170 770 615 318 700 -1023 -305 -521 440 -224 -1228 -1470 -447
$$ packed form
2672a854N22P43Q34n19q70L29O74J059P04l88m56p23J223L93m30K21j762j98J454
2691I56r6o17M35m43p88M56l61L7k40R4o57P39m95j16m33O79p1l81N86L41P76
2712D01n68R24j141L44O51J52l07J267p12m73N31K42k52j28K07j391k70L99J66
2731D2r76O38k12j156NJ566q60j82J125mj646J740Q48n79j88L47J25q64R33R49
2751A651p12P62r98o56N78P57q07m73J96j110J68J076kl06j268p00L58R39l7K60
2771c24q21L97N85n30P05N45q25J5O77P88k5l6l6n09m2J169r23K68l41n9r02M09
2793A85K85l92j19j90o81J44l02j13j1P80m68K18M29l17L70Q12K17l83l27L59
2813D96J68J16L87R3j86o61P57m00j55k97L82j723P18k16R61o64j004k42J023
$$ plain form
2832 -447 -634 -352 -642 -401 -859 -608 287 641 225 391 415 -663 -329 203 443 469 1039 1583 362 1021
2852 1021 1163 146 -126 114 -295 -462 406 -17 -788 -1497 -1186 -125 -840 -455 -368 -1404 -152 -418 -205
2871 -205 522 -297 146 -471 52 249 691 968 732 946 321 1330 453 1008 542 567 1 -282 -755 -291
2891 -291 511 -304 -1148 -864 -566 -1769 -1308 -760 -553 -1360 -677 -475 159 467 -631 -597 119 932 413 143
2911 143 951 875 550 996 244 688 535 521 239 -102 103 -336 332 50 -376 -245 -684 -163 -218 -525 -675
2932 -675 -288 -374 174 781 53 -241 -573 248 871 148 596 797 104 891 -292 504 822 710 391 571
2952 571 -18 -285 -240 -106 -223 79 -752 105 -429 -881 -157 -994 -1214 -710 211 -622 -674 -572 185 -244 656
2973 656 573 1233 1067 851 503 97 1185 1510 -110 743 511 768 -37 262 -356 -469 -1025 -604 -860 -293
$$ packed form
2832d47j87K82k90K41m58K51Q95L54m16J66K4j078L34N32K40K6N70N44j221O59
2852A021J42j017k72K40m09j67Q68m23p71p09L11J061p15L85Q7j036J252k66K13
2871b05P27q19M43o17N23J97M42K77k36K14o25J009q77N55m66K5n66k83m73M64
2891b91Q02q15q44K84K98j203M61N48K07q07O83K02O34L08j098L4P16Q13n19k70
2911A43Q08p6l25M46p52M44j53j4k82l41K05m39O68k82m26J31m39N21n5l07j50
2932f75L87q6N48O07p28k94l32Q21O23p23M48K01o93P87j183P96L18j12l19J80
2952E71n89k67M5J34j17L02q31Q57n34m52P24q37k20N04R21q33n2J02P57m29R00
2973F56q3O60j66k16l48m06J088L25j620Q53k32K57q05K99o18j13n56M21k56N67
$$ plain form
2993 -293 -205 -1303 -1309 -968 -1011 -1125 371 712 -458 125 255 -269 -133 674 185 669 -182 513 632 1682
3013 1682 905 474 200 -190 969 336 163 -298 -984 -719 -606 -1151 -571 -1407 -1569 -1186 -396 -877 213
3032 213 -686 -75 -416 286 408 -203 854 1246 942 295 1054 553 1059 843 526 214 203 638 118 393
3052 393 -251 -393 -935 -745 -249 -825 -622 -613 -769 -1046 -667 352 -564 -73 -652 834 -139 972 817 468
3072 468 97 413 1083 -75 430 575 955 -93 370 201 326 -29 430 -479 -463 -1151 49 -484 -116
3091 -116 467 -905 -822 -836 -360 -211 -156 -1209 -13 -235 534 283 565 540 268 672 1097 991 536 730
3111 730 -403 373 596 323 -227 316 16 317 -1236 50 -777 -1096 -494 -586 -1334 -526 -174 -853 -45
3130 -45 -61 -113 -713 716 739 575 873 1227 829 8 968 1281 488 -1 331 -498 655 551 -992 -883
$$ packed form
2993b93Q8j098oL41m3j14J496L41j170N83J30n24J36Q07m89M84q51O95J19J050
3013A682p77m31k74l90J159o33j73m61o86K65J13n45N80q36j62L83P90m81J090
3032B13q99O11l41P02J22o11J057L92l04o47P59n01N06k16l17l12j1M35n20K75
3052C93o44j42n42J90M96n76K03Rj56k77L79J019r16M91n79J486r73J111j55l49
3072D68l71L16O70j158N05J45L80j048M63j69J25l55M59r09J6o88J200n33L68
3091a16N83j372Q3j4M76J49N5j053J196k22P69k51K82k5k72M04M25j06m55J94
3111G30j133P76K23k73n50N43l00L01j553J286q27l19O02r2p48Q08L52o79Q08
3130d5j6n2o00J429K3j64K98L54l98q21R60L13p93m89L32q29J153j04j543J09
$$ plain form
3150 -883 -284 -787 -863 -64 -316 -1436 -182 -151 -1120 -169 -93 -550 -1128 -188 128 543 124 41 -92 619 1188
3171 1188 1281 657 946 70 -191 1698 480 281 22 712 -259 -147 74 -349 289 -123 -336 -1783 -1358
3190 -1358 -284 -997 -597 428 -367 -624 25 465 -12 249 404 51 558 1156 1092 1236 863 159 330
3209 330 769 1055 -720 -273 115 172 311 379 -770 -655 15 -581 -1029 -716 -270 -471 -426 121 -1053 602
3229 602 146 -47 402 691 -126 -59 773 1175 1204 539 1345 323 58 1331 635 -70 -116 -64 237 81 199
3250 199 -375 -334 -496 -1028 2 1049 140 -217 -179 -149 64 74 478 288 36 371 582 496 397 847 504
3271 504 470 355 337 311 -527 48 -192 -480 106 -462 -80 -588 -695 -844 -202 -1246 -433 -569 -1196 -158
3291 -158 -729 308 -475 -25 -423 -70 313 357 1047 208 530 1175 418 416 1018 592 -406 -88 174 -574 -302
$$ packed form
3150h83N99n03p6P99k52j120J254L1r69R51P6m57n78R40L16M15m19q3j33P11N69
3171A188R3o24K89q76k61J889j218j99k59O90r71J12K21m23O38m12k13j447M25
3190a358J074p13M00J025p95k57O49M40m77K61J55l53N07N98o4J44l73p04J71
3209C30M39K86j775M47L88N7J39O8j149J15O70n96m48L13M46k01M5N47j174J655
3229F02m56j93M49K89q17O7Q32M02K9o65Q06j022k65J273o96p05m6N2L01j56J18
3250A99n74M1j62n32J030J047r09l57L8L0K13J0M04j90k52L35K11q6r9M50l43
3271E04l4j15j8k6q38N75k40k88N86n68L82n08j07j49O42j044Q13j36o27J038
3291a58n71J037p83M50l98L53L83M4O90q39L22O45p57kO02m26r98L18K62p48K72
$$ plain form
3312 -302 -255 -29 255 -401 -365 -440 -674 10 -385 31 -103 -861 -472 487 -286 452 -249 -143 -155 1037 -50
3333 -50 566 78 229 1118 748 423 235 206 54 302 -237 132 -379 -131 -209 -620 -603 -171 -376 88 -1165
3354 -1165 -911 -931 -289 142 -197 -146 425 443 672 1089 237 613 570 8 375 527 496 738 466 206 -578
3375 -578 -82 -609 -374 -236 -309 -9 -490 209 -235 -9 -1278 -229 -365 -670 547 116 96 -255 479 933
3395 933 -32 510 -131 276 -97 779 810 495 661 906 431 -584 5 84 -331 -255 461 158 -754 -153 -424
3416 -424 44 -788 -507 -701 -1318 -160 269 40 247 58 400 586 1542 418 -10 -168 6 548 260
3435 260 -191 -88 355 701 631 -245 886 -447 -218 -511 -624 -169 -267 -1053 -22 -242 -745 -300 454 580
3455 580 -274 793 153 -60 206 582 239 -444 201 421 959 1196 980 123 5 -118 231 -478 -279 -496
$$ packed form
3312c02M7K26K84o56L6p5k34O84l95M16j34p58L89R59p73P38p01J06j2J192j087
3333e0O16m88J51Q89l70l25j88k9j52K48n39L69n11K48p8m11J7M32k05M64j253
3354a165K54k0O42M31l39N1N71J8K29M17q52L76m3n62L67J52l1K42k72k60p84
3375e78M96n27K35J38p3L00m81O99m44K26j269J049j36l05J217m31k0l51P34M54
3395I33r65N42o41M07l73Q76L1l15J66K45m75j015N89P9m15P6P16l03r12O01k71
3416d24M68q32K81j94o17J158M29k29K07j89L42J86R56j124m28j58J74N42k88
3435B60m51J03M43L46p0q76J131j333K29k93j13M55r8p86J031k20n03M45P54J26
3455E80q54J067o40k13K66L76l43o83O45K20N38K37k16q57j18j23L49p09J99k17
$$ plain form
3475 -496 -447 -922 -286 -579 -62 -577 -628 -807 -469 -1217 161 -393 -133 392 118 -26 297 307 266 -289 390
3496 390 447 1059 725 193 443 -151 -335 -247 480 -550 -170 -644 -712 146 238 38 -354 -649 -189 314 -201
3517 -201 140 -126 -132 557 96 652 413 259 -82 133 1013 709 623 577 737 513 -338 490 -797 176 7
3538 7 -389 -271 -375 -621 -180 -79 -823 115 -865 -41 -347 -639 282 -667 -254 -162 -28 273 -128 701 812
3559 812 133 660 733 795 730 94 690 -129 -233 964 -274 313 -516 -941 -511 314 -415 -120 440 -433
3579 -433 -989 -435 -20 -29 -539 537 -51 -241 -238 -268 274 604 586 261 116 54 -488 -563 -64 -62 71 86 611
3602 611 175 -216 -95 -668 563 -615 -618 -986 -26 -550 -216 -128 -92 -153 63 -49 -291 -477 680 16 183
3623 183 878 -13 136 87 253 200 -270 -349 97 324 370 -354 -268 -95 -153 -221 -168 411 -710 234 723 -621
$$ packed form
3475d96M9m75O36k93N17n15n1j79L38p48J378n54K60N25k74j44L23J0m1n55O79
3496C90N7O12l34n32K50n94j84Q8P27j030L80m74o8Q58R2k00l92k95M60N03n15
3517b01L41k66oO89m61N56k39j54l41K15Q80l04q6m6J60k24q51Q28j287R73j69
3538Gl96J18j04k46M41J01p44R38r80Q24l06k92R21r49M13R2J34L01m01Q29J11
3559H12o79N27P3O2o5o36N96q19j04J197j238N87q29m25M30Q25p29K95N60q73
3579d33n56N54M15rn10J076n88j90Ll0N42L30j8l25j45o2n42p5M99KJ33J5N25
3602F11m36l91J21n73J231j178ll68R60n24L34Q8L6o1K16j12k42j86J157o64J67
3623A83O95q91J49m9J66n3m70p9M46K27M6p24Q6J73n8o8N3N79j121R44M89j344
$$ plain form
3645 -621 -719 -299 -666 -905 -91 -127 49 210 240 232 347 751 -287 -158 690 -320 35 183 689 116 -148
3666 -148 -428 424 -353 47 -139 -930 -751 -270 -371 468 -239 -1136 -531 -358 -355 -756 1061 397 -26 371
3686 371 442 148 60 670 484 15 701 396 183 864 181 553 454 30 -390 161 242 -784 -1250 -287 -624
3707 -624 -937 -332 335 -1005 178 931 78 -702 319 313 13 -312 573 403 63 -61 134 251 1309
3726 1309 620 -160 -178 684 114 -130 1170 -519 -12 67 -425 -990 -354 -760 -1590 109 -100 52 -213
3745 -213 -176 -411 -344 433 -344 157 271 923 396 219 331 63 -162 270 943 767 -12 -670 -650 95 538
3766 538 335 -59 -417 107 -127 -452 496 -876 -718 103 105 -306 109 69 -17 339 332 455 456 569 797 632
3788 632 -48 -208 755 -384 -112 1256 -430 803 95 270 -551 -169 -590 -532 -324 -613 -256 -659 -507
$$ packed form
3645f21r8M20l67k39Q14l6J76J61L0qJ15M04j038J29Q48j010L55J48N06n73k64
3666a48k80Q52p77M00j86p91J79M81j01Q39p07q97O05J73Lm01J817o64m23L97
3686C71P1k94q8O10j86m69O86l05k13O81o83L72r9m24m20N51Q1j026m66R63l37
3707f24l13O05O67j340J183P53q53p80J021ol00l25Q85j70l40j24J95J17J058
3726A309o89p80j8Q62n70k44J300j689N07P9m92n65O36m06q30J699k09J52k65
3745b13L7k35O7P77p77N01J14O52n27j77J12k68k25M32O73j76p79o58K0P45M43
3766E38k03l94l58N24k34l25R48j372J58Q21Km11M15m0q6L56pJ23JJ13K28j65
3788F32o80j60R63j139K72J368j686J233p08J75q21L82m21N8K08k89L57m03J52
$$ plain form
3807 -507 -538 -65 -39 520 -45 -40 35 418 552 383 180 836 659 134 784 614 220 1230 660 636 -712
3828 -712 -584 -497 -545 -82 -416 -314 -21 354 -77 128 -671 -636 -853 -297 -164 -286 246 -192 -300 -179 -48
3849 -48 267 389 376 444 -66 506 561 249 683 -196 -455 218 -719 233 -793 235 -256 -212 224 369 5
3870 5 -150 -129 -332 -169 -518 186 -341 -68 270 -209 -428 756 -278 380 -217 -328 80 -266 299 -156
3890 -156 233 1026 568 167 817 -475 -881 71 -348 -656 510 -12 -134 112 -381 -324 1 330 -291 -453
3910 -453 946 -31 544 -102 175 -57 183 195 232 1184 150 128 633 119 596 137 40 58 762 347 -334
3931 -334 -544 151 -410 81 -583 -830 -52 -562 -49 -103 -402 -476 -118 -349 407 196 259 27 500 328 308
3952 308 64 -58 473 332 -124 -239 130 -219 69 77 -422 -426 144 35 313 -412 -185 385 -125 178 -314
$$ packed form
3807e07l1M73K6N59n65NP5L83J34j69k03O56j77n25O50j70l94J010n70k4j348
3828g12J28Q7m8M63l34J02K93L75m31K05p99L5k17N56J33j22N32m38j08J21J31
3849d8L15J22j3O8n10N72N5l12M34q79k59O73r37R52j026J028m91M4M36J45l64
3870Ej55K1k03J63l49P04n27K73L38m79k19J184j034O58n97j11M08l46N65m55
3890a56L89P93m58m01O50j292m06R52m19l08J166n22j22K46m93N7L25L29o21j62
3910d53J399r77N75o46K77k32K40J2L7R52j034k2N05n14M77m59r7J8P04m15o81
3931c34k10O95n61M91o64k47P78n10N13n4k99p4L58k31P56k11O3k32M73j72k0
3952C08k44j22N31j41m56j15L69l49K88Qm99mN70j09K78p25K27N70n10L03m92
$$ plain form
3973 -314 508 -41 403 -331 -128 -355 731 -108 153 462 -461 90 310 360 -218 -69 -22 60 377 177 296
3994 296 431 -438 -298 -94 -692 495 253 -32 10 -948 -181 202 123 538 292 503 26 -107 227 -56
4014 -56 693 972 407 56 605 257 754 280 863 979 133 688 -71 -38 -10 216 -171 -56 18 339 263 -211
4036 -211 -81 -824 -176 846 -217 118 70 370 -105 -200 587 451 323 205 -310 -538 -844 1246 49
4055 49 -461 -532 537 -362 -104 224 -755 -232 -595 84 -93 -196 213 -76 -540 -170 -169 383 -462 -177 170
4076 170 246 302 -25 249 1279 404 -189 623 392 -544 -353 -220 237 223 46 211 -450 35 -710 -547 129
4097 129 426 -201 203 -759 -42 -544 292 -289 -20 496 292 -321 406 899 -383 634 658 -1 751 181
4117 181 192 -277 338 -496 -360 -200 314 -492 135 136 -825 -534 1075 -559 -14 180 276 -492 -93 -122 -365
$$ packed form
3973c14Q22n49M44p34K03k27J086q39K61L09r23N51K20N0n78J49M7Q2L17k00J19
3994B96J35q69J40K04n98J187k42k85M2r58P67L83p9M15k46K11m77j33L34k83
4014e6P49K79n65l51N49l48M97m74N83J16q46N55p59L3K8K26l87J15P4L21p6m74
4036b11J30p43O48J022j063L35m8L00m75r5P87j36j28j18n15k28l06K090j197
4055D9n10p1J069q99K58L28r79N23l63O79j77j03M09k89m64L70JN52q45K85L47
4076A70P6N6l27K74J030q75n93Q12k31r36J91J33M57j4j77J65o61M85p45J63O76
4097A29K97o27M04r62P17n02Q36n81K69N16k04o13P27M93j282J017K4o59P52n70
4117A81J1m69O15q34J36J60N14q06O27Jr61K91J609j634N45J94R6p68L99k9k43
$$ plain form
4138 -365 324 334 -503 -372 -697 11 514 658 -7 -52 -9 406 441 -682 127 -472 83 -62 -58 419 -112 -227
4160 -227 -269 -438 -184 -776 -203 -691 -229 -245 252 573 797 126 175 44 944 495 163 -240 442 -196 227
4181 227 1208 -469 603 101 310 50 114 -324 -182 -144 -114 -197 81 -39 -445 -641 -787 -39 -290 -67 452
4202 452 77 487 619 272 456 -160 -75 -400 582 614 37 -540 998 263 -226 223 -280 160 677 41
4222 41 -1014 -511 -120 65 184 152 -475 -118 -661 -95 -817 -408 -98 -151 -67 76 361 497 -189 231 171
4243 171 -42 338 -169 -421 456 360 -321 115 263 -208 -165 400 68 22 -877 -849 -315 -740 -300 -331 487 -605
4265 -605 -1 491 -286 -316 -73 482 112 193 380 302 349 -132 923 56 155 -418 -201 -359 441 125 -621
4286 -621 -148 -262 314 -127 235 -1070 -809 -475 -477 -149 399 644 -433 -189 -134 -22 -310 29 -347 29
$$ packed form
4138c65O89J0q37J31l25P08N03J44o65m5M3M15L5j123Q09n99N55j45MM77n31j15
4160b27m2j69K54n92N73m88M62j6M97L21K24o71M9j31R00m49l32m03O82o38M23
4181B27R81j677J072n02K09k60O4m38J42L8L0q3K78j20m06j96j46P48k51K23N19
4202D52l75M10J32l47J84o16Q5l25R82L2n77n77J538p35m89M49n03M40N17o36
4222D1j055N03L91J85J19l2o27L57n43N66p22M09L10n3Q4J43K85J36o86M20o0
4243A71k13L80n07k52Q77r6o81M36J48m71M3N65l32m6q99K8N34m25M40l1Q18j092
4265f05O04M92p77l0K43N55l70Q1J87p8M7m81J055q67R9n73K17j58Q00l16p46
4286f21M73j14N76m41L62j305K61L34kL28N48K45j077K44N5J12k88L39l76L76
$$ plain form
4306 29 244 79 -223 293 296 266 369 455 -110 -739 -551 61 -436 -558 -232 597 -786 -241 -291 -807 -109 -466
4328 -466 -124 -124 -398 -127 562 -147 -430 363 322 32 -346 332 -224 48 604 229 243 507 665 35 94 -714
4350 -714 -303 737 -636 -199 -377 -585 71 -281 370 101 425 -176 171 -22 -29 184 410 30 916 -17
4370 -17 72 547 -9 -480 48 -51 445 -421 524 356 -669 -114 117 194 30 -102 -127 -486 -300 -282 -308 -128
4392 -128 103 541 167 -368 127 192 821 -306 -150 343 -360 10 664 -389 471 253 -388 697 309
4411 309 -514 -96 267 189 109 270 -165 -742 -951 -118 581 -269 670 -40 -600 -528 -597 24 219 36 -317
4432 -317 -242 219 -146 504 -93 33 271 240 251 316 -285 -564 -254 -23 -432 311 10 -924 18 431 362 115
4454 115 48 -346 158 -340 -369 -35 -430 -107 -212 922 -57 -8 -462 257 -66 712 680 130 104 -349 -62
$$ packed form
4306B9K15j65l02N16Ll0J03Q6n65o29J88O12m97j22L26Q29j383N45n0n16O98l57
4328d66L42%k74K71O89p09k83P93m1k90l78O78n56K72N56l75J4K64J58o30N9q08
4350g14M11J040j373M37j78k08O56l52O51k69L24o01L47j93pK13K26l80Q86r33
4370a7Q9M75n56m71N28r9M96q66R45j68j025N55K31P7j64j32k5l59J86J8k6J80
4392a28K31M38l74n35M95O5O29j127J56M93p03L70O54j053Q60k18o41J085l88
4411C09q23M18L63p8q0J61m35n77k09Q33O99q50R39p10n60P2o9O21J95j83l53
4432c17P5M61l65O50n97J26K38l1J1O5o01k79L10K31m09P43l01r34R42M13o9k47
4454A15o7l94N04m98k9L34l95L23j05J134r79M9m54P19l23P78l2n50k6m53K87
$$ plain form
4475 -62 -208 -34 -296 -152 -248 320 -754 -42 -664 -349 -450 -107 -360 -155 79 -220 -52 109 195 9 782
4496 782 77 -49 17 639 815 401 373 -101 720 286 292 292 236 768 -66 -636 -629 -908 368 -34 302 -381 -473
4519 -473 108 -660 -126 139 17 -367 42 -438 -92 348 109 263 206 661 -499 705 721 302 386 50
4539 50 -300 -241 25 -8 229 133 1029 117 234 -178 -34 -81 -207 -256 -87 -431 -196 294 -203 -4 438 116
4561 116 138 683 -357 -523 467 394 22 254 457 -136 327 575 -219 13 107 51 -261 -262 -699 -218 333 -799
4583 -799 843 -613 594 17 367 -388 -80 386 617 2 503 280 -713 392 -311 218 -109 786 -110
4602 -110 -208 675 -234 -61 -173 317 -406 -1 -1286 -333 -393 173 6 -408 -410 -270 109 118 -483 -462 266 -394
4624 -394 -256 -202 413 130 89 -93 585 193 425 152 157 139 538 74 -170 -457 -297 -487 -640 -140 -484 218
$$ packed form
4475f2j46J74k62J44r6N68j074P12o22L15j01L43k53K05K34k99J68J61Q6j86P73
4496G82p05j26O6O22J76m14k8m74Q21m34O%n6N32q34n70Pk79J276m02L36o83r2
4519d73N81p68N34K65j22l84M09m80L46M40k39J54n7M55j160J204J6m19Q4l36
4539E0l50N9K66l3K37r6Q96r12J17m12J44m7j26m9J69l44K35M90m97J99M42l22
4561A16K2N45j040j66R90p3l72K32K03n93M63K48p94K32R4n6l12jm37M81N51j132
4583g99J642j456J207n77L50p55L08M66K31o15N01k23r93J105p03N29l27Q95q96
4602a10r8Q83r09J73j12M90p23M05j285R53o0N66j67m14kJ40L79Ro01K1P28o60
4624c94J38N4O15k83m1j82O78l92K32k73Nj8L99m64k44k87J60j90j53N00l44P02
$$ plain form
4646 218 -677 578 -290 -474 245 -656 -170 -204 -148 -346 -537 190 328 -395 361 731 -366 -106 355 -621
4666 -621 580 352 255 694 -103 460 -169 126 6 -551 -633 -68 108 -130 40 -262 -755 -240 467 -252
4686 -252 739 636 47 477 -166 111 -17 -73 -14 -426 17 92 -5 154 -113 294 18 364 837 -372 -498
4707 -498 323 -705 813 35 -363 -345 -447 -769 -539 194 188 252 -508 -327 5 41 148 65 -150 -171 118 249
4729 249 548 134 -382 -60 313 203 207 -99 73 155 -153 680 -406 18 -704 -104 128 407 -322 -782 295
4750 295 216 547 -242 167 124 46 1011 -2 802 468 97 -188 471 -247 -414 663 374 131 410 92
4770 92 -158 -263 -434 196 -892 683 167 278 232 -583 130 -77 19 10 759 383 291 67 344 745 1162
4791 1162 -153 119 122 397 164 -297 455 993 -733 -299 487 424 -244 299 -621 -58 -494 -371 -110 -455
$$ packed form
4646B18q95J255q68j84P19r01M86l4N6j98j91P27J38p23P56L70j097K60M61r76
4666f21J201k28r7M39p97N63o29K95j20n57q2N65J76k38J70l02m93N15P07p19
4686b52R91j03n89M30o43K77j28n6N9m12M43P5r7J59k67M07k76L46M73j209j26
4707d98Q21j028J518p78l98J8j02l22K30P33oO4p60J81L32L6J07q3k15k1K89J31
4729B49K99m14n16L22L73j10Ml06J72Q2l08Q33j086M24p22O00K32K79p29m60J077
4750B95p9L31p89M09m3p8R65j013Q04l34l71k85O59p18j67J077k89k43K79l18
4770I2k50j05j71O30j088J575n16J11m6q15P13k07R6rP49l76r2k24K77M01M17
4791A162j315K72LK75k33m61P52N38j726M34P86o3o68N43r20N63m36J23K61l45
$$ plain form
4811 -455 -84 592 -626 -897 310 529 -344 87 -494 -9 260 -79 18 834 -48 2 466 353 861 155
4831 155 479 678 -569 303 110 208 -691 -789 -75 -835 -164 -106 -102 -16 -447 158 21 -250 -103 537 439 -138
4853 -138 690 538 -36 194 290 526 263 -206 395 47 336 147 -26 305 -537 -28 -1083 -148 315 -566
4873 -566 -165 -415 -338 -316 135 -335 -394 305 -427 -51 597 414 -93 -535 273 -59 32 147 -82 470 492 990
4895 990 339 -167 -9 110 -226 143 412 -176 -544 -233 286 -14 -625 121 -460 -455 769 -220 -98 52
4915 52 486 122 -329 109 338 361 568 -410 403 306 986 265 492 138 -823 -771 -534 -304 459 216 -188
4936 -188 -528 -107 742 -314 -34 -371 131 -236 715 415 14 -427 10 -298 26 37 720 -377 121 423
4956 423 38 -53 241 341 -264 564 -195 -43 -186 -305 -292 106 -541 -416 126 -66 164 -180 -66 -167 142
$$ packed form
4811d55L71O76j218k71J207K19q73M31n81M85K69l39R7Q16q82N0M64j13N08p06
4831A55L24J99j247Q72j93R8q99r8P14p60O71N8MQ6m31O05j37k71J47O40r8n77
4853a38Q28j52n74K30R6K36k63m69O01l48K89j89j73L31q42N09j055R35M63q81
4873e66M01k50P7K2M51m70n9O99p32L76O48j83n07m42Q08l32R1J15k29N52K2M98
4895I90o51n06J58J19l36L69K69n88l68L11N19l00o11P46n81NJ224r89J22J50
4915E2M34l64m51M38K29K3K07r78Q13r7O80p21K27l54r61N2K37K30P63k43m04
4936a88l40M21Q49j056K80l37N02l67R51l00m01m41M37l08L24J1O83j097M98L02
4956D23l85r1K94J00o05Q28p59J52j43j19J3L98o47J25N42j92K30l44J14j01L09
$$ plain form
4977 142 498 -267 122 342 -99 230 207 -100 240 154 528 452 -228 -129 -160 -132 -372 -229 -440 844 65 24
4999 24 390 132 -49 -1033 171 779 38 -348 -242 308 -127 296 181 -503 -11 -142 -724 689 -37 313
5019 313 421 -126 485 -293 -279 57 -257 213 -792 -242 -81 -496 -553 -241 -333 -545 -379 -300 198 422 401
5040 401 -23 66 -553 229 385 327 63 693 416 -110 -70 397 876 471 66 -262 -47 -2 -519 86 259
5061 259 -755 151 -900 -272 -419 -139 -556 -857 29 260 -291 -97 283 -228 426 44 81 -325 -186 -132
5081 -132 -406 -168 -21 387 504 -191 331 414 32 204 273 -106 -319 399 539 -972 18 53 -270 -1026 -255
5102 -255 -946 -631 441 -502 -119 -221 118 -240 506 66 219 -73 177 351 456 542 401 -203 659 741
5122 741 83 -453 65 17 224 -615 -382 -344 -76 -250 -17 -480 -212 -698 158 332 224 12 -370 -333 -72
$$ packed form
4977A42L56p65L89K20m41L29k3l07L40q6L74p6o80R9l1K8k40J43k11J284p79m1
4999B4L66k58j81r84J204O08p41l86J06N50m35M23j15o84M92j31n82J413p26L50
5019C13J08n47O11p78J4L36l14M70j005N50J61m15n7L12r2k12J66P9M98K24k1
5040D01m24Q9o19P82J56n8k64O30k77n26M0M67M79m05m05l28K15M5n17O05J73
5061B59j014R06j051O28j47K80m17l01Q86K31n51J94L80n11O54l82L7m06J39N4
5081a32k74K38J47M08J17o95N22Q3l82J72O9l79k13P18J40j511R90L5l23p56P71
5102b55o91L15J072r43L83j02L39l58P46m40J53k92K50J74J05Q6j41o04Q62Q2
5122G41o58n36N18m8K07q39K33L8K68j74K33m63K68m86Q56J74j08k12l82L7K61
$$ plain form
5143 -72 432 77 166 43 509 37 664 514 -16 -176 131 -502 200 451 -100 231 -240 120 109 -87 -92 -251
5165 -251 307 -82 450 -495 -205 -80 382 38 -42 -490 108 376 417 189 231 46 559 -133 288 -185 410
5186 410 438 126 9 76 470 486 127 -694 -134 -600 -90 -341 282 -797 -200 496 80 -213 -135 -152 47
5207 47 -43 1203 -111 293 -275 256 -26 -275 594 705 -199 -572 -382 -1043 -697 -269 -356 -1123 -273 78
5227 78 -324 -834 -155 247 -27 296 -1120 -444 197 -178 101 202 -1 129 25 -44 834 -255 554 17
5247 17 -811 373 -9 -160 408 -88 -149 291 -177 -70 298 -499 -589 34 -187 -219 293 -336 -495 304 -184
5268 -184 588 15 284 209 778 -601 46 151 -61 -10 354 169 70 492 279 163 203 432 -203 256 598
5289 598 -174 -738 318 203 -531 -403 -296 -296 125 -795 291 86 96 205 318 15 -538 201 -32 538
$$ packed form
5143g2N04l55Q9j23M66m72O27j50n30j60L07o33P02K51n51L31m71L60j1j96nj59
5165b51N58l89N32r45K90J25M62l44q0m48N98K68M1k28M2j85N13o92M21m73N95
5186D10K8l12j17O7L94J6l59q21N60m66N10k51O23j079N97O96m16k93P8j7J99
5207D7r0J246j314M04n68N31k82k49Q69J11r04l73J90o61L46M28q7p67Q50L51
5227G8m02n10O79M02k74L23j416O76O41l75K79J01k03J30j04o9Q78j089Q09n37
5247A7q28J184l82j51N68m96o1M40m68J07L68p97r0O23k21l2N12o29j59P99m88
5268a84P72n73K69p5N69j379O47J05k12N1L64j85r9M22k13j16M0K29o35M59L42
5289E98p72n64J056j15p34J28J07%M21r20J086k05J0J09J13l03n53P39k33N70
$$ plain form
5309 538 768 387 578 231 1170 693 -113 -484 -803 -131 96 -773 -27 -442 159 -526 -683 -185 -244 -435
5329 -435 -657 -108 -72 -528 -384 184 -41 -124 415 -192 649 -189 -256 -80 322 528 291 -238 248 64 122
5350 122 410 163 576 130 543 47 653 -539 701 -719 305 -53 -83 -877 71 253 -112 -390 -62
5369 -62 313 -212 455 371 55 301 9 131 981 709 -196 731 471 -190 349 -359 -509 -25 -73 -10 27 -196
5391 -196 9 402 -151 -443 -526 555 93 -259 335 40 636 419 -125 -130 504 194 425 804 -31 107 272
5412 272 -76 704 -89 -501 91 -20 -458 31 -330 -298 -1282 -390 -296 -963 -680 454 278 -328 -239 482 305
5433 305 210 306 -152 636 123 384 -483 348 -287 -507 -356 -488 183 -176 221 433 -222 117 -294 -271 804
5454 804 187 -210 135 -658 -217 59 -324 234 359 265 -10 -144 454 871 345 166 51 264 -36 881
$$ packed form
5309E38K30l81J91l47R39m77q06l71l19O72K27q69P46m15O01o85j57M98n9j91
5329d35k22N49L6m56J44N68k25q3N39o07Q41q38o7J76M02K06k37n29M86j84N8
5350A22K88k47M13m46M13m96O06j192J240j420J024l58l0p94R48J82l65k78L28
5369f2L75n25O67q4l16K46k92J22Q50k72r05R27k60o61N39p08j50M84m8O3L7k23
5391a96K05L93n53k92q3J081m62l52N94k95N96k17n44nO34l10K31L79q35J38J65
5412B72l48P80p93m12N92j11m38M89l61L2r84Q92R4o67K83J134j76o06Q9P21j77
5433C05r5R6m58P88n13K61q67Q31o35k20J51j32O71l59L97K12o55L39m11K3J075
5454H04o17l97L45p93M41K76l83N58J25r4k75j34N98M17n26j79j15K13l00R17
$$ plain form
5474 881 99 -373 -361 -681 -274 226 -722 -169 226 -682 -654 5 -467 -1142 159 -262 359 10 -275 -139
5494 -139 31 761 75 353 -59 496 -240 184 -492 234 418 52 254 -146 678 21 167 186 672 -318
5514 -318 232 -363 -14 -288 -605 -205 -38 -524 -669 -573 -772 62 -352 504 457 51 -105 214 766 384 309
5535 309 188 -509 219 348 43 280 244 -8 -663 367 -267 -5 191 96 -319 403 337 -99 -268 -136 -516
5556 -516 15 119 93 169 -284 177 -146 -34 -485 192 127 458 -307 303 359 198 558 546 -210 -390 -296 -174
5578 -174 -546 -264 -281 -63 35 -219 -135 -389 -531 -734 -348 -253 154 256 -556 -676 186 -207 773 990 -23
5599 -23 174 573 492 123 -7 -180 849 328 360 -196 318 -118 -478 -19 -668 -217 146 -180 -798 -177 677
5620 677 -219 -376 341 -901 270 -113 57 282 -154 571 229 -734 315 443 -292 155 661 -456 136
$$ packed form
5474H81p82m72J2l20M07N00r48N53L95r08K8O59m72o75J301m21O21l49k85J36
5494a39J70P30o86K78m12N55p36M24o76P26J84l66K02m00Q24o57J46J9M86r90
5514c18N50n95L49k74l17M00J67m86j45R6j99Q34m14Q56m7m06j56L19N52l82p5
5535C09j21o97P28J29l05K37l6k52o55J030o34K62J96r5m15P22o6m36j69J32l80
5556e16N31J04k6P6m53M61l23J12m51O77o5L31p65O10N6j61L60j2p56j80R4J22
5578a74l72K82j7K18R8k54Q4k54j42k03L86R5M07J02q12j20Q62l93R80K17j013
5599b3J97L99q1l69j30j73J029n21L2n56N14m36l60M59o49M51L63l26o18O21Q54
5620F77q96j57P17j242J171l83J70K25m36P25l42r63J049J28p35M47N06j117N92
$$ plain form
5639 136 713 393 -196 -615 -627 -966 100 -236 -499 -215 91 -419 -678 -375 -482 100 39 555 -243 446
5659 446 137 -18 -292 357 -299 -613 516 -129 292 -244 493 -188 -116 -652 -534 -480 752 -283 -460 308
5679 308 150 -21 -204 -552 28 -914 350 269 -469 -991 -353 -117 -382 -187 336 -128 311 -399 286 513
5699 513 -212 761 -14 695 298 -680 -485 -172 -614 -224 -180 301 -831 138 -672 -852 376 -344 453 81
5719 81 -369 -567 619 118 -240 -363 164 697 -507 855 -297 773 23 -266 -36 417 298 430 -264
5738 -264 -120 -90 -482 165 -153 81 -807 33 -392 -982 -253 -533 -674 203 -396 26 -573 663 -24 436
5758 436 400 -113 264 802 93 13 -12 71 -66 171 4 -205 -39 -218 81 303 790 -576 -95 -433 -479
5779 -479 -344 73 -324 -845 238 -83 -634 94 -69 547 644 -26 658 174 463 350 269 317 57 578 -179
$$ packed form
5639A36N77l20n89m19j2l39J066l36k63K84L06n10k59L03j07N82o1N16p98O89
5659D46l09j55k74O49o56l14J129o45M21n36P37o81P2n36J18N4J232j035j77P68
5679C08j58j71j83l48N80r42J264q1p38n22O38K36k65J95N23m64M39p10O85K27
5699E13p25R73p75P09l97r78J95L13m42L90M4M81j132R69q10j80J228p20P97l72
5719H1m50j98J186n01l58j23N27N33j204J362j152J070p50k89K30M53j19J32o94
5738b64J44L0l92O47l18K34q88Q40m25n90P29k80j41Q77n99M22n99J236o87M60
5758D36l6n13L77N38p09q0k5Q3j37K37j67k09J66j79K99K22M87j366M81l38m6
5779d79J35M17l97n21J083l21n51P28j63O16R7o70O84m84K89j13q1M8k60N21p57
$$ plain form
5800 -179 -158 496 293 -919 -215 -734 -540 423 -77 -812 -617 -753 -33 106 -398 -395 -135 -55 -764 -134 -334
5821 -334 -278 -160 -282 543 -315 337 298 -506 458 -293 -107 -200 -82 351 -433 91 149 -58 -463 -342 -418 484
5843 484 -205 -428 321 116 -126 312 136 -661 105 217 35 232 535 -420 575 574 374 -307 -109 152 -752
5864 -752 15 558 272 130 396 -156 -373 -441 171 42 -66 79 156 45 -118 120 372 -442 74 -147 -20
5885 -20 -40 219 363 -224 147 916 824 261 357 647 138 0 245 325 183 -635 157 81 -848 -50 -632 -84
5907 -84 -284 -43 -299 -501 -108 -636 -123 -42 -162 47 -460 493 662 388 -16 345 98 406 844 485 690
5928 690 -400 377 -283 896 21 200 -77 -715 -919 -716 -103 -17 -131 155 -294 -72 -334 9 -808 -377
5948 -377 7 229 -20 489 268 87 -216 410 42 494 164 -149 -151 412 236 -649 -225 407 -83 -216 179
$$ packed form
5800a79K1O54k03j212P04n19J94R63n00p35J95j36P20J39n04LK60Q0p09O30k00
5821c34N6J18j22Q25q58O52l9q04R64p51J86r3J18M33p84N24N8k07m05J21p6R02
5843D84o89k23P49k05k42M38j76p97P66J12j82J97L03r55R95jk00o81J98K61r04
5864g52P67N43k86j42K66n52k17o8O12j29j08J45P7j11j63K38K52q14N16k21J27
5885b0k0K59J44n87L71P69r2n63R6K90n09j38K45Q0j42q18P92p6r29P98n82N48
5907h4k00K41k56k02L93n28N13Q1j20K09n07R53J69k74m04L61k47L08M38l59K05
5928F90j090P77o60J179q75J79k77o38k04K03O13Q6j14K86m49K22k62L43q17M31
5948c77L84K22k49N09k21j81l03O26l68M52l30l13kN63j76q85M24O32m90j33L95
$$ plain form
5969 179 -118 -172 -187 -810 -266 -549 307 158 71 8 -1070 335 51 151 212 606 -250 694 521 696 654
5990 654 -52 94 -144 113 -417 -514 -352 -117 -373 461 69 68 7 -169 -503 -263 -526 -467 36 -358 -44 -235
6012 -235 -68 -343 -589 25 229 476 288 767 730 583 249 573 259 396 612 479 -572 19 104 285
6032 285 -54 116 95 -596 197 -551 297 732 494 -29 29 -284 -521 64 269 238 566 455 -506 190 -10
6053 -10 590 59 389 -203 90 459 1161 545 368 481 23 26 718 -313 -223 249 -184 -612 -307 -332 -430 -232
6075 -232 -54 -413 -470 -200 429 177 584 286 32 -572 477 -300 -544 372 74 751 6 437 -247 -455
6095 -455 128 -123 -519 468 -130 218 451 414 -211 -569 -395 85 -263 383 262 453 -259 534 413 -517
6115 -517 86 -81 854 -31 -720 467 -36 513 416 438 -369 -47 -73 -111 62 738 -331 463 -106 -601 -774
$$ packed form
5969A79k97n4j5o23N44k83Q56j49q7o3j078J405k84J00O1L94q56R44j73J75m2
5990F54p06J46k38K57n30r7J62K35k56Q34l92jo1j76l34K40k63N9N03l94L14j91
6012b35J67k75k46O14K04K47j88M79l7j47l34L24l14J37K16j33j051N91Q5J81
6032B85l39J70k1o91P93p48Q48M35k38n23N8l13k37N85K05l1L28j11r61O96k00
6053a0O00n31L30n92K93L69P02o16j77J13m58LO92j031R0M72m33m28L05k5r8J98
6075b32J78l59n7K70O29k52M07k98k54o04J049p77k44R16k98O77p45M31o84k08
6095d55N83k51l96R87n98L48K33l7o25l58J74M80l48O46j21J91p12P93j21r30
6115e17O03j67R35q85o89J187n03N49r7K2q07L22k6l8J73O76j069P94n69m95j73
$$ plain form
6136 -774 -534 190 -86 147 361 -79 81 78 211 -191 247 372 52 -251 -610 -141 470 205 -198 -84 -46
6157 -46 337 -678 -100 -631 -210 323 107 -621 -121 -183 -46 255 -399 408 -388 -34 -788 520 310 -371
6177 -371 -259 -637 -642 192 765 300 0 200 -24 -187 -3 509 -151 -124 472 -443 -153 -342 -259 -197 -707 -409
6199 -409 -236 -635 -391 267 -45 -707 273 299 329 504 543 -348 319 280 171 447 492 -8 10 327 -274 615
6221 615 616 -1 75 160 114 -312 17 -751 -525 -314 231 -198 -367 -489 -128 248 754 -162 -177 748 -126 -63
6243 -63 41 -236 706 778 328 130 478 335 537 499 3 616 147 -46 244 -582 -266 -472 -1130 -763 -530
6264 -530 -640 -254 -171 694 -99 -374 613 -521 -591 105 471 233 -533 167 261 -470 215 -66 534 293 198
6285 198 301 -268 14 -379 13 -777 9 -704 39 516 -193 -105 63 747 -571 -534 29 36 567 -368 -433
$$ packed form
6136g74K40P24k76K33K14m40J60lJ33m02M38J25l20l03l59M69O11k65m03J14L8
6157d6L83j015N78n31M21N33k16p28N00o2J37L01o54Q07p96L54p54J308k10o81
6177c71J12l78nQ34N73m65l00K00k24j63J84N12o60K7N96r15K90j89Q3O2n10K98
6199d09J73l99K44O58l12o62R80K6L0J75L9q91O67l9j09K76M5n00J8L17o01Q89
6221F15Jo17P6Q5m6m26L29p68K26K11N45m29j69j22L61L76N06r16j5R25q74O3
6243f3J04k77R42P2m50j98L48j43K02l8m96O13m69j93K90q26L16k06o58L67K33
6264e30j10L86Q3Q65p93k75R87j134p0O96L66k38p66P00R4p31O85k81O00k41r5
6285A98J03n69K82l93L92p90P86p13P43M77p09Q8J68O84j318L7N63PN31r35o5
$$ plain form
6306 -433 103 564 -558 174 909 -357 -100 -318 261 429 224 297 130 -383 -979 -558 -137 -318 -101 -747
6326 -747 -21 -396 136 -414 308 -570 -901 -170 -844 -144 -66 -23 184 -422 -648 63 394 29 -263 472 -205
6347 -205 709 14 970 -73 -101 358 -343 -854 -616 28 -340 -49 -1324 -975 -524 -437 -417 604 21 -331
6367 -331 -1129 764 124 -296 -106 341 81 -6 69 288 439 -211 90 -472 780 442 81 -158 -134 325
6387 325 351 -527 222 -227 -106 -505 -156 -65 -1031 573 175 -195 -761 -427 -133 287 -59 478 -269 -5
6407 -5 -17 -109 208 -202 118 -386 838 798 535 215 -220 174 -76 302 -772 -989 -110 -279 49 -466 297
6428 297 193 -399 -810 -469 440 273 -657 -279 321 -122 -310 194 502 742 712 -128 328 50 533 661
6448 661 404 -112 -248 -51 -421 74 -245 -36 698 -476 294 -570 291 -590 -518 -562 667 554 230 63
$$ packed form
6306d33N36M61j122P32P35j266K57k18N79J68k05P3j67n13n96M21M21j81K17o46
6326g47P26l75N32n50P22q78l31P31o74P00P8M3K07o06k26P11L31l65k92P35o77
6347b05R14o95R56j043k8M59p01n11K38O44l68K91j275L49M51Q7K0J021n83l52
6367c31p98J893o40m20J90M47k60q7P5K19J51o50L01n62J252l38l61k39K4M59
6387C25K6q78P49m49J21l99L49R1r66J604l98l70n66L34K94M20l46N37p47K64
6407ej2r2L17m10L20n04J224m0k63l20m35L94k50L78j074k17Q79j69L28n15P63
6428B97j04n92m11L41R09j67r30L78O00m43j88N04L08K40l0q40M56k78M83J28
6448F61k57n16j36J97l70M95l19K09P34j174P70q64Q61q81P2m4J229j13l24j67
$$ plain form
6468 63 289 -46 -50 111 681 -22 -237 278 24 -207 234 124 -222 379 -477 234 -535 -869 -179 -96 -102 26
6490 26 370 509 -358 -271 -220 -44 194 -534 820 359 -272 276 -655 205 -273 50 347 538 50 181 129
6511 129 62 -290 403 109 -538 -76 384 53 108 -674 -165 -11 -469 516 -115 -518 -246 -422 61 408 -141
6532 -141 -141 581 247 -149 260 581 386 -194 859 -684 172 520 0 269 -142 47 -23 208 -83 264
6552 264 -689 -624 -72 -542 -324 91 -123 24 -3 6 -422 234 558 258 251 -111 414 67 -36 395 472 -260
6574 -260 -365 305 9 73 293 168 -63 -58 44 -312 -500 132 -380 -222 -1 473 513 -462 44 -78 130
6595 130 -371 -275 -103 -450 -103 -192 713 342 75 252 -35 35 103 253 161 598 582 -388 124 -24 -662 -207
6617 -207 -595 304 -123 -128 -62 173 -5 -23 -31 -567 600 527 -169 14 154 -283 -774 -118 273 -116 327 598
$$ packed form
6468F3K26l35mJ61N70p03k15N15k54k31M41j10l46O01q56P11p69l34O90Q3oJ28
6490B6L44J39q67Q7N1J76K38p28J354m61o31N48r31Q60m78L23K97J91m88J31n2
6511A29o7l52O93k94o47M62M60l31N5p82N09J54m58R85o31m03K72j76M83L47n49
6532a41%P22l34l96M09L21j95n80J053j543Q56L48n20K69m11J89p0K31k91L47
6552B64r53O5N52m70K18M15k14J47k7Rm28O56L24l00pl62N25l47j03M31P7p32
6574b60j05O70k96O4K20j25k31NJ02l56j88O32n12J58K21M74M0r75N06j22K08
6595A30n01R6J72l47L47q9R05l71k67J77k87P0O8J50r2M37j6r70N12j48o38M55
6617b07l88Q99m27nO6K35j78j8qn36J167p3o96J83J40m37m91O56L91l89M43K71
$$ plain form
6639 598 -108 516 -166 116 -495 235 -334 -76 -514 151 -21 226 299 504 76 94 -646 -548 -288 256 -483
6660 -483 -299 -588 -397 87 67 907 -269 243 -231 -626 242 -109 -42 -541 289 196 -439 218 -504 -459 -560
6681 -560 228 -319 -638 -527 -623 -346 -220 454 -119 -556 -42 631 366 45 359 -165 2 175 -13 -201
6701 -201 132 299 7 615 -99 114 -133 219 221 -580 -45 -764 -61 -8 -224 46 -146 -75 800 138 -170
6722 -170 -252 179 -309 -808 520 110 262 116 635 25 642 1040 -827 695 -426 -135 -735 44 -178
6741 -178 191 -339 -696 -16 -427 68 -791 -50 -155 29 321 -696 -1 380 296 365 321 332 28 36 -137 16
6763 16 -139 623 231 145 132 457 -174 -179 -143 132 -461 -130 -50 118 66 -386 -156 -310 -369 -138 342 -308 -12
6786 -12 -387 -453 187 -857 568 -183 557 20 -322 -608 314 578 -321 -88 -508 42 438 314 -132 -169
$$ packed form
6639E98p06O24o82K82o11P30n69K58m38O65j72K47P3K05m28J8p40R8K60N44p39
6660d83J84k89J91M84k0Q40j176N12m74l95Q68l51O7m99Q30r3o35O57p22M5j01
6681e60P88n47l19J11r6K77J26O74n73m37N14O73k65l21L14n24J67J73j88j88
6701b01L33J67k92O08p14K13k47L52Kq01N35p19P03N3k16K70j92P1Q75o62l08
6722a70q2M31m88m99J328m10J52j46N19o10O17L98j867J522j121K91o00P79k22
6741a78L69n30l57O80m11M95q59P41j05J84K92j017O95L81q4O9m4J1l04Qj73J53
6763A6j55P62l92q6j3L25o31nL6K75n93L31Q0J68n2m52K30j54n9K31M80o50K96
6786a2l75o6O40j044J425p51P40n37l42k86R22K64q99K33m20N50L96j24m46l7
$$ plain form
6806 -169 -317 43 429 -226 -500 259 692 -4 -301 478 940 65 -53 689 316 89 -43 -469 285 115
6826 115 -403 536 -166 481 -215 641 258 168 297 -445 472 363 -191 -496 -545 -496 121 -256 -208 -426 114
6847 114 -527 -518 -928 -184 284 181 35 202 617 -58 774 592 -232 -432 18 47 447 -316 3 222 -269
6868 -269 86 -14 -422 -735 143 175 -501 -130 -461 53 -44 -91 567 61 -124 -601 -523 -301 -1 467 1
6889 1 -51 -622 -128 84 -276 -306 866 -320 62 499 -2 -97 -15 186 8 286 73 -28 2 143 -525 -126
6911 -126 -184 118 -107 -45 -113 -420 574 -163 -81 135 -352 -44 -116 776 -412 171 -15 37 -490 466 783 -412
6933 -412 144 -1054 -238 -1185 -543 126 -316 -556 82 294 -306 310 8 -509 485 -240 208 358 51 52
6953 52 -302 1097 316 530 453 -141 975 714 -20 900 304 -104 337 342 226 99 151 -61 -52 -420 146 -181
$$ packed form
6806a69j48L60L86o55k74P59M33o96k97P79M62q75j18P42l73k27j32m26P54j70
6826A15n18R39p02O47o96Q56l83r0J29p42R17j09n54l05m9M9O17l77M8k18N40
6847A14o41Rm10P44M68j03j46J67M15o75Q32j82q24k00M50K9M00p63L19K19m91
6868b69L55j00m08l13Q78L2o76L71l31N14r7m7O58n06j85m77P8K22L00M68m66
6889An2n71M94K12l60l0J172j186L82M37n01r5Q2K01j78K78k13j01L0J41o68L99
6911a26n8L02k25O2o8l07R94p37Q2K16m87L08p2Q92j188N83j86N2n27R56L17j195
6933d12N56j198Q16r47O42O69m42k40O38K12o00O16l02n17R94p25M48J50l07J
6953E2l54J399p81K14p7n94J116k61p34R20n96m08M41Nj16j27N2k12Rl68N66l27
$$ plain form
6975 -181 -707 -494 99 -55 58 627 -16 321 -96 131 -212 215 340 -61 191 -252 488 409 561 196
6995 196 656 407 186 449 170 -659 -385 6 96 -244 336 -297 -1025 599 -252 715 -437 -163 -450 -260
7015 -260 -288 -291 418 79 368 -751 578 97 448 10 -127 -615 -128 -58 -193 -402 -348 -100 222 -301 74
7036 74 206 -48 119 -112 -16 -209 -410 259 277 -988 -83 455 -249 228 -189 190 243 435 20 120 387
7057 387 -167 -104 -271 178 655 -170 -72 -545 -170 -119 -432 -485 -455 133 65 175 582 -220 132 -736 255 198
7079 198 239 -393 -637 -767 655 123 150 73 -115 657 241 352 132 125 -25 -542 -263 -512 -234 -175 -138 -433
7101 -433 -50 -99 -581 -676 307 -368 -336 -809 121 193 5 133 -218 533 615 349 149 382 -111 895 293
7122 293 -133 -70 71 -535 87 292 -297 277 -354 -646 220 162 -243 -376 -78 -262 -33 -417 -512 580 50
$$ packed form
6975a81n26K13N93j54J13N69o43L37m17K27l43M27J25m01K52m43P40p9J52l65
6995A96M60k49k21K63k79q29K74L91R0l40N80o33p28J624q51R67j152K74k87J90
7015b60k8lP09l39K89j119J329m81L51m38j37m88M87P0j35k09N4K48L22n23L75
7036G4J32k54J67k31R6j93k01O69J8j265R05N38p04M77m17L79N3J92m15J00K67
7057C87n54O3j67M49M77q25R8m73L75N1l13n3L0N88o8J10M07q02L52q68R91n7
7079A98M1o32k44j30J422n32K7p7j88P72m16J11k20pj50n17K79k49K78N9L7k95
7101d33L83m9m82r5R83o75L2m73R30P2j88J28l51P51Q2k66k00K33m93J006o02
7122B93m26O3J41o06O22K05n89N74o31k92Q66n8m05j33K98j84K29l84r5J092n30
$$ plain form
7143 50 -584 -135 119 -3 86 335 -399 -751 -30 680 268 524 39 -234 772 553 455 196 -183 -391 -12
7164 -12 -26 -366 -195 -670 23 -394 -818 -538 -471 395 47 -328 -641 156 -611 -286 51 -677 487 -196 -185
7185 -185 44 -61 -415 -431 164 -135 -204 -89 345 144 -34 442 -43 -778 148 83 189 -170 22 514 53
7206 53 -445 -107 -56 403 166 59 -576 203 404 -535 -351 350 467 274 -29 455 -431 216 -143 139 -140
7227 -140 -182 -135 -92 -967 34 -125 -94 -717 -13 -448 -369 8 -572 819 -279 -38 375 516 270 1025 257
7248 257 -423 152 857 435 543 576 687 -447 125 6 491 -287 316 -500 -153 -272 -125 -26 532 -296
7268 -296 234 94 95 -717 -368 -137 -88 -227 -39 324 -60 45 27 32 -176 -307 -253 -859 134 377 739 649 -78
7291 -78 415 -113 397 -18 -778 -148 -495 -414 -825 -298 291 -187 240 385 -60 -177 -46 -549 117 -532 500
$$ packed form
7143E0o34M49K54j22Q9K49p34l52P21P10m12K56m85k73J006k19r8k59l79k08L79
7164a2j4l40J71m75O93m17m24K80O7Q66l48l75l13P97p67L25L37p28J164o83J1
7185a85K29j05l54j6N95k99o9J15M34k01j78M76m85p35R26o5J06l59J92M92m61
7206E3m98L38N1M59k37j07o35P79K01r39J84P01J17j93l03M84q86O47l59K82k79
7227a40m2M7M3q75J001j59L1o23P04m35P9L77n80J391j098K41M13J41k46P55p68
7248B57o80N75P05m22J08L3J11j134N72j19M85p78O03q16L47j19J47R9N58q28
7268b96N30j40Jq12L49K31M9j39J88L63l84J05j8Nk08j31N4o06R93K43L62r0p27
7291g8M93n28N10m15p60O30l47Q1m11N27N89m78M27J45m45j17J31n03O66o49J032
$$ plain form
7312 500 250 -338 175 13 -560 345 -253 -520 99 262 -107 204 442 -178 -600 -169 -574 166 407 541
7332 541 436 -186 319 209 -137 -591 -188 793 -59 343 83 549 -158 332 -35 12 2 516 65 170 -144
7353 -144 264 -247 567 -541 -147 -433 413 164 203 638 278 -216 -344 171 -5 449 -213 -277 -262 -49 -458
7374 -458 625 109 409 -136 -347 -412 254 617 -529 -341 -712 -407 481 225 146 -337 78 214 -562 -59
7394 -59 -656 230 -240 69 -508 -561 -317 408 -246 320 122 -4 274 809 97 556 66 203 -78 254 -412
7415 -412 114 310 -204 -373 -39 305 -317 -519 -18 -161 -476 21 -482 329 -979 -185 22 744 386 -221
7435 -221 -431 322 -472 -411 555 84 -435 46 204 304 456 139 280 -420 542 184 353 -672 -210 -55
7455 -55 -122 -134 -610 82 -753 41 -158 353 -131 -204 -765 -362 -140 -73 258 -690 -89 846 502 11 236 40
$$ packed form
7312E00k50n88N13j62n73R05n98k67O19J63l69L11K38o20m22M31m05P40K41J34
7332E41j05o22N05j10l46m54M03R81q52M02k60M66p07M90l67M7j0N14m51J05l14
7353a44M08n11Q14j108L94k86Q46k49L9M35l60m94j28N15j76M54o62o4J5K13m09
7374d58J083n16L00n45k11o5O66L63j146J88l71L05Q88k56p9m83M15J36p76N03
7394e9n97Q86m70L09n77n3K44P25o54N66j98j26K78N35p12M59m90J37k81L32o66
7415d12N26J96n14j69L34L44o22k02N01j43l15M97n03Q11j308P94K07P22l58o07
7435b21k10P53p94O1R66m71n19M81J58J00J52l17J41p00R62l58J69j025M62J55
7455e5o7j2m76O92q35P94j99N11m84p3n61M03K22O7L31r48O01R35l44m91K25j96
$$ plain form
7477 40 -307 101 -40 513 -270 -398 -150 -73 -191 -469 -226 328 -399 -573 -49 -308 -725 -173 -562 918
7497 918 79 434 23 340 405 693 848 713 692 -325 545 -118 -39 -318 -288 -162 -224 -537 -125 442 222
7518 222 -261 -158 -558 -44 101 -269 -165 57 120 -722 243 -100 411 -439 305 268 364 -149 481 405 742
7539 742 -280 659 13 -211 460 313 171 -304 741 259 301 -180 -404 54 -18 63 -158 -744 -100 -142 -657
7560 -657 -568 342 -809 -363 -283 157 -232 483 23 554 628 207 213 -319 572 221 454 -587 612 458 882
7581 882 104 -607 321 -408 -17 458 -787 -822 555 54 150 -102 40 346 113 422 -197 -52 -284 -51
7601 -51 -355 138 -661 242 246 701 -86 219 -157 429 298 202 367 32 -162 158 271 80 -545 -216 100
7622 100 -282 42 517 -444 -14 -584 -28 -687 1036 -196 -1202 -429 168 -368 610 712 231 833 355
$$ packed form
7477D0l47M08j41N53p83j28K48P7j18k78K43N54p27j74N24k59m17N52l89J480
7497I18q39L55m11L17O5K88J55j35k1j017Q70o63P9k79L0J26o2l13M12N67k20
7518B22m83J03m00N14J45l70J04K22O3q42R65l43N11q50P44l7R6n13O30p6L37
7539G42j022R39o46k24O71j47j42m75J045m82M2m81k24M58p2Q1k21n86O44m2n15
7560f57Q9R10j151M46Q0M40l89P15m60N31P4m21On32Q91l51K33j041J199j54M24
7581H82p78p11R28p29L91M75j245l5J377n01R6k52J42L06k33L09o19J45k32K33
7601e1l04M93p99R03MM55p87L05l76N86j31r6J65l35j94L20J13j91o25L29L16
7622A00l82L24M75r61M30n70N56o59J723j232j006P73N97n36R78J02m81O02m78
$$ plain form
7641 355 306 582 -113 552 4 -283 439 327 -642 155 342 278 -146 -73 219 443 276 -288 233 -94 -275
7662 -275 676 474 271 85 116 745 -519 847 402 121 587 -82 -734 -84 -311 204 -126 376 -390 -470
7682 -470 250 -253 -68 302 87 -217 20 -7 309 108 287 540 35 -57 396 187 -44 983 83 6 139
7703 139 -425 517 272 18 -62 320 116 -218 137 -425 -461 10 54 229 -262 -360 362 -108 -1073 -519 -274
7724 -274 148 -790 159 314 408 56 82 134 63 -126 19 81 -466 420 -77 -339 -527 -208 934 149 38
7745 38 -532 -270 171 409 298 -172 11 -525 -657 -731 -93 231 -253 -219 -134 -63 -264 -148 366 -532 351 -294
7767 -294 -241 381 854 835 708 -16 -388 767 -253 368 -4 463 -113 -724 -104 -400 -190 711 247 -17
7787 -17 249 -394 -46 92 700 -355 -236 -22 -23 -134 -65 -263 -207 -196 -18 -62 461 396 432 888 -628 -459
$$ packed form
7641C55m9K76o95O65n48k87P22j12r69P97J87o4m24P3K92K24j67n64N21l27j81
7662b75R51k02k03j86L1O29j264J366m45k81M66o69o52O50k27N15l30N02p66q0
7682d70P20n03J85L70k15l04K37k7L16k01J79K53n05r2M53k09k31J027r00p7J33
7703A39n64R42k45k54q0L82k04l34L55n62l6M71M4J75m91r8P22m70r65N54K45
7724b74M22r38R49J55R4l52K6N2p1j89J45O2n47Q86m97k62j88L19J142p85j11
7745C8n70K62M41K38j11m70J83n36j32p4O38L24m84L4Q5P1k01J16N14q98Q83o45
7767b94N3O22M73j9j27p24l72J155j020O21l72M67n76o11O20k96K10R01m64k64
7787a7K66o43L48J38O08j055J19K14jj11O9j98N6J1J78m4N23o5L6M56j516J69
$$ plain form
7809 -459 -258 -24 5 138 -25 -66 324 -602 -409 281 824 259 217 351 50 7 588 705 108 -7 81 334
7831 334 420 1016 -382 -179 -200 359 -12 -359 742 -618 445 -542 -385 -137 -149 -161 284 -344 487 136
7851 136 108 219 353 263 -56 100 66 482 418 349 137 368 49 -122 -227 528 302 336 247 -295 -153 -258
7873 -258 -165 -85 -812 -115 -410 -444 1078 -516 -92 -484 -78 65 -123 247 -49 -486 -56 692 964 74
7893 74 381 409 354 -41 -243 189 -92 158 -52 -440 -241 -421 151 178 255 -601 -850 5 -339 -93 -36 -341
7915 -341 431 -205 -36 444 75 -975 136 357 74 -377 -50 313 57 30 -330 36 540 831 -209
7934 -209 542 -563 175 -52 177 -344 -50 -635 322 -781 -52 -119 -643 -292 449 690 34 -483 -78 -340
7954 -340 80 675 473 207 -255 395 738 -111 728 -177 282 139 -292 167 24 -272 -212 -423 -380 22 -479
$$ packed form
7809d59K01K34K9J33j63m1L90r26J93O90N43n65m2J34l01m3N81J17n97j15Q8K53
7831C34Q6N96j398K03k1N59l71l47J101j360J063r87J57K48j2j2M45o28Q31l51
7851A36k8J11J34r0l19J56l4M16o4o9k12K31l19j71j05P55k26L4q9n42J42j05
7873b58R3Q0p27O97k95l4J522j594M24l92M06J43j88L70k96m37M30P48K72q90
7893G4L07K8n5l95k02M32k81K50k10l88J99j80N72K7P7q56k49Q55l44K46N7l05
7915c41P72o36J69M80l69j050J111K21k83m51L27L63k56k7l60L66N04K91j040
7934b09P51j105P38k27K29n21K94n85R57j103P29o7n24L51P41K41o56n17M05k62
7954c40M20N95k02k66m62O50L43q49Q39r05M59j43m31M59j43k96O0k11M3M02n01
$$ plain form
7975 -479 -1009 -167 -72 13 -219 307 31 -246 -711 584 -330 554 241 -417 -183 84 -469 128 544 97
7995 97 -85 227 206 -358 305 114 258 -926 324 216 79 -69 -71 -63 157 -96 -808 -720 -648 -135 -209 56
8017 56 442 433 -175 320 -363 -448 114 135 163 -275 181 842 301 -224 735 -75 89 -185 -279 -295 420 174 271
8040 271 -655 -158 -164 -329 -363 -569 -359 476 420 -561 291 111 -134 -187 -271 189 -715 -33 194 248 122 144 208
8063 208 -213 645 432 -58 197 -58 -610 -569 -184 -174 -342 -862 -441 381 465 -395 -96 387 -268 -10 -192
8084 -192 519 252 362 194 316 392 -78 352 355 411 417 78 3 290 32 -1 47 -305 72 43 -817 509 -265
8107 -265 -683 -78 0 11 -350 -20 -353 531 208 -219 -517 -1 -472 323 -545 -7 314 499 -38 551 -284
8128 -284 -1072 -83 -282 -211 302 -315 -42 -383 -409 105 403 -10 332 891 -307 -231 54 -358 578 -108 22
$$ packed form
7975d79n30Q42R5Q5k32N26k76k77m65J295r14Q84l13o58K34K67n53N97M16m47
7995I7j82L12k1n64O63j91J44j184J250j08j37j48kQK20k53p12Q8P2N13p4K65
8017E6L86ro08M95o83q5N62K1K8m38M56O61n41n25R59q10J64k74r4j6P15k46R7
8040B71r26M97oj65l4k06K10Q35n6r81Q52j80k45n3q4M60r04O82K27N4j26K2O4
8063B08m21Q58k13m90K55k55n52M1L85J0j68n20M21Q22Q4q60K99M83o55K58j82
8084a92P11k67J10j68J22P6m70M30LN6Ol39p5K87k58l3M8l52L77k9q60J326p74
8107b65m18O05P8J1l61L30l33Q84l23m27k98N16m71P95q68N38L21J85n37N89q35
8128b84p88R89j99P1N13o17K73l41k6N14K98m13L42N59j198P6K85m12R36o86J30
$$ plain form
8149 22 -113 -384 -904 -140 137 80 167 719 729 -610 305 176 75 594 -199 -451 138 -131 717 432 -236
8170 -236 474 -126 -298 -205 -686 311 120 532 21 189 -691 271 825 -414 974 -311 335 263 -50 301
8190 301 -114
$$ packed form
8149B2j35k71n20P64K77n7Q7N52J0j339R15j29j01N19p93k52N89k69Q48k85o68
8170b36P10o00j72R3m81R97j91M12n11J68q80R62N54j239J388j285O46p2l13L51
8190C01m15
8191a14
$$ Imaginary data points
##PAGE= N=2
##DATA TABLE= (X++(I..I)), XYDATA
$$ plain form
0 0 0 0 0 0 0 0 0 0 0 0 0 0 0 0 0 0 0 0 0 0 0 0 0 -13 43 -64 64 -64 64 -64 66 -77 102 -125 129 -140 157 -183
38 -183 204 -220 249 -273 303 -336 370 -413 452 -497 546 -603 665 -733 809 -890 990 -1097
56 -1097 1222 -1364 1541 -1745 1999 -2321 2730 -3280 4083 -5305 7411 -11714 23899 -115199
70 -115199 -478763 -75976 260820 176908 106773 82628 -64329 -31963 149603 143268 23034
81 23034 -1863 -36768 -65098 2225 65140 73862 61128 -44462 -110089 37715 135421 -22342
93 -22342 -110951 -14463 -24623 -83624 45578 115498 -42669 -75528 96004 127842 30497 29859
105 29859 51323 17695 44810 85121 19237 -36550 18674 78075 71826 22136 -20006 23941
117 23941 94330 45409 -25055 18703 25586 -61000 -51224 20760 -16459 -72817 -34946 -29192 -69194
$$ packed form
0@%%%%%%%%%%%%%%%%%%%%%%%j3N6j07J28j28J28j28J30j43J79k27K54k69K97l40
38a83L87m24M69n22N76o39P06p83Q65r49J043j149J268j398J542j699J880k087
56a097K319k586K905l286L744m320N051o010P363r388J2716j9125L5613j39098
70a15199l63564M02787L36796q3912p0135k4145j46957L2366J81566o335j20234
81B3034k4897l4905k8330O7323O2915Q722j2734j05590o5627J47804R7706j57763
93b2342q8609R6488j0160n9001J29202O9920j58167l2859J71532L1838r7345o38
105B9859K1464l3628K7115M0311o5884n5787N5224N9401o249m9690m2142M3947
117B3941P0389m8921p0464M3758O883q6586R776P1984l7219n6358L7871N754m0002
$$ plain form
130 -69194 -15565 57096 11249 -56377 -35656 14437 34756 33090 15310 -7535 -7772 17300 38749
143 38749 35629 9832 994 30694 31343 -22543 -33623 17119 21338 -33020 -46605 -29302 -36908
156 -36908 -33379 -6676 -15552 -39552 -21139 -6584 -20505 -1146 27585 6272 -19344 -10650 7396
169 7396 23764 27990 2935 -13526 9422 20665 14518 32888 38711 1504 -7847 24100 28636
182 28636 16330 12952 -9178 -27914 -7294 6773 -18725 -27322 -7529 -13240 -24773 -9963 -1984
195 -1984 -7191 2394 1344 -15093 -4228 15757 3479 -2415 21867 30098 8194 6555 23722
208 23722 31047 36784 29007 1473 -5447 10090 11448 8117 8415 -11522 -32866 -19800 -2790 -7545
222 -7545 -5888 -5529 -32653 -45090 -9781 14780 -1186 -16052 -17735 -18561 -6715 20536 26947 6009
$$ packed form
130f9194N3629P2661m5847o7626K0721N0093K0319j666j7780k2845k37K5072K1449
143C8749l120k5797q838K9700O49n3886j1080N0742M219n4358j3585J7303p606
156c6908L529K6703q876k4000J8413J4555j3921J9359K8731k1313k5616Q694J8046
169G396J6368M226k5055j6461K2948J1243o147J8370N823l7207r351L1947M536
182B8636j2306l378k2130j8736K0620J4067k5498q597J9793n711j1533J4810P979
195a984n207R585j050j6437J0865J9985j2278n894K4282Q231k1904j639J7167
208B3722P325N737p777k7534o920J5537J358l331K98j9937k1344J3066J7010m755
222g545J657L59k7124j2437L5309K4561j5966j4866j683q26J1846K7251O411k0938
$$ plain form
236 6009 -7510 1306 17561 24796 23038 16186 7657 -663 -1840 10329 18439 4366 -13430 -17062
250 -17062 -15084 -14041 -5844 -1372 -20447 -34023 -19121 -9156 -18636 -14370 -1287 -6968 -19004 -7361
264 -7361 7050 5782 7802 16047 13757 4533 6951 19411 27779 23920 13898 6607 4783 6319
278 6319 13873 19944 7132 -15067 -15155 -1278 -3571 -7701 2792 -4473 -28619 -27535 -1952 9863
292 9863 2430 -4019 -10210 -15415 1746 24657 26252 12201 817 1967 14237 27407 29721 25146
306 25146 11220 -2150 4123 24334 29765 11455 -4161 -9887 -15720 -7187 9371 2067 -21863
319 -21863 -27948 -18168 -9965 -1436 4558 -7097 -20805 -16080 -241 6974 6250 1226 -3243 163
333 163 7599 12429 17886 17838 9435 6426 11279 11298 4984 4952 3631 -8993 -13452 -7626 -9911 -14707 -12662
$$ packed form
236F009j3519Q816J6255P235j758o852q529q320j177J2169Q110j4073j7796l632
250a7062J978J043Q197M472j9075j3576J4902R965r480M266J3083n681j2036J1643
264g361J4411j268K020Q245k290r224K418J2460Q368l859j0022p291j824J536
278F319P554O071j2812k2199q8J3877k293m130J0493p265k4146J084K5583J1815
292I863p433o449o191n205J7161K2911J595j4051j1384J150J2270J3170K314m575
306B5146j3926j3370O273K0211N431j8310j5616n726n833Q533J6558p304k3930
319b1863o085R780Q203Q529N994j1655j3708M725J5839P215p24n024m469L406
333A63P436M830N457m8q403l009M853J9o314l2j321j2624m459N826k285m796K045
$$ plain form
350 -12662 -10122 -15072 -19087 -16257 -14099 -10753 -4815 -9275 -16379 -13403 -6916 912 9922 9153 873
365 873 2440 12570 18913 19766 19786 12210 1723 5390 12218 11045 7195 4131 -7018 -11826 -2478
380 -2478 3140 -687 -6202 -10692 -17126 -14858 -2124 -274 -5724 -5889 -7346 -7259 4423 15617 13168
395 13168 10057 11164 8707 9139 22397 25327 15370 11253 8788 4076 11014 21636 13464 439
409 439 -2063 -2576 -1908 6715 6064 -9187 -15761 -10029 -9392 -3923 3612 -4733 -15435 -8085 -25 2184
425 2184 8167 8222 -2017 -2651 10757 14431 12685 15993 11132 4216 12826 17251 8044 8059 10624 -181
441 -181 -5623 1633 -2189 -11023 -6272 -4159 -14256 -13934 -8742 -15355 -12430 -1434 -7609 -16909 -7770
456 -7770 -4311 -6866 5651 13485 1810 -2490 8358 6988 9218 23743 17264 -2575 -1132 7387
$$ packed form
350a2662K540m950m015K830K158L346N938m460p104K976O487P828R010p69q280
365H73J567J0130O343Q53K0p576j0487L667O828j173l850l064j1149m808R348
380b478N618l827n515m490o434K268J2734J850n450j65j457Q7J1682J1194k449
395A3168l111J107k457M32J3258K930r957m117k465m712O938J0622q172j3025
409D39k502n13O68Q623o51j5251o574N732O37N469P535q345j0702P350Q060K209
425B184N983N5j0239o34J3408L674j746L308m861o916Q610M425r207J5K565j0805
441a81n442P256l822q834M751K113j0097L22N192o613K925J0996o175r300R139
456g770L459k555J2517P834j1675m300J0848j370K230J4525o479j9839J443Q519
$$ plain form
470 7387 4046 10271 14540 -4040 -15818 -3479 220 -5086 2567 -3734 -28192 -24409 -1890 -4183
484 -4183 -8939 -5875 -18813 -24872 1806 17049 2516 -1220 2521 -7868 2777 31005 21364
497 21364 -1397 5480 7899 98 16644 25991 -1518 -14592 561 -4385 -9339 5222 -3086
510 -3086 -26903 -16724 -3659 -15392 -12216 20 -16510 -22919 -890 -2676 -16962 133 11300
523 11300 -5880 -2099 11473 -1538 -276 22725 14687 -6408 1623 4799 -7406 6396 16295
536 16295 -7303 -16760 -1947 -4345 -8382 7010 -2514 -26701 -17868 -4513 -12108 -11751 -8816 -24058
550 -24058 -23745 -170 4371 -6036 -1999 -2466 -6978 9257 20415 4369 -552 8136 5145 2573
564 2573 10870 7503 -286 7542 9018 -4304 -4649 1050 -4015 -4888 -1500 -12048 -19437 -12265 -8421
$$ packed form
470G387l341O225M269j8580j1778J2339L699n306P653o301k4458L783K2519k293
484d183m756L064j2938o059K6678J5243j4533l736L741j0389J0645K8228r641
497B1364k2761O877K419p801J6546R347k7509j3074J5153m946m954J4561q308
510c086k3817J0179J3065j1733L176J2236j6530o409K2029j786j4286J7095J1167
523A1300j7180L781J3572j3011J262K3001q038k1095Q031L176j2205J3802R899
536A6295k3598r457J4813k398m037J5392r524k4187Q833J3355p595L57K935j5242
550b4058L13K3575M541j0407M037m67m512J6235J1158j6046m921Q688k991k572
564B573Q297l367p789P828J476j3322l45N699n065q73L388j0548p389P172L844
$$ plain form
579 -8421 -6399 1839 -808 -13762 -9597 4013 7177 8368 8015 -5058 -8192 10226 17273 6540
593 6540 4314 6651 3494 9552 18094 9228 1010 6591 5615 -320 2701 1263 -9780 -4160 4212
608 4212 -7681 -13019 -4164 -7337 -10892 -751 261 -12612 -9519 474 -4145 -1637 7803 832
622 832 -7079 6515 13877 8269 10851 9174 -1409 6166 22574 10586 -8007 -3511 -173 -2535
636 -2535 4004 4035 -13314 -16674 -5572 -6686 -8967 -134 -5528 -18147 -11609 -3803 -6672 -937 6357
651 6357 -4516 -7459 5285 7686 3621 10580 13185 3775 4953 9967 5620 6116 13833 7913 -2497
666 -2497 -791 1066 -528 4454 1873 -10313 -12760 -5395 -4012 -5112 -5552 -10207 -11678 -5835 -1170
681 -1170 -2803 -322 1941 -779 941 6716 7119 6938 7538 7204 7469 8861 9170 7086 5339 4657 4322
$$ packed form
579h421K022Q238k647j2954M165J3610L164J191l53j3073l134J8418P047j0733
593F540k226K337l157O058Q542q866q218N581r76n935L021j438j1043N620Q372
608D212j1893n338Q855l173l555J0141J012j2873L093R993m619K508R440o971
622H32p911J3594P362n608K582j677j0583P575J6408j1988j8593M496L338k362
636b535O539L1j7349l360J1102j114k281Q833n394j2619O538P806k869N735P294
651F357j0873k943J2744K401m065O959K605r410J178N014m347M96P717n920j0410
666b497J706J857j594M982k581j2186k447P365J383j100m40m655j471N843M665
681a170j633K481K263k720J720N775M03j81O00l34K65J392L09k084j747o82l35
$$ plain form
698 4322 4064 77 -3851 -1868 -867 -4803 -8874 -7775 -8506 -6404 -2051 -5945 -11531 -10233 -4465 -134
714 -134 1779 146 -4345 -3594 3864 7296 9421 11632 5656 -131 4122 10883 12723 10651 4066 -4979
730 -4979 -3691 6674 7962 -104 -6049 -10103 -10664 -4471 -787 -5686 -9988 -10805 -10945 -7078 -287 592
746 592 -2796 -4841 -3624 1789 7752 8318 3957 791 5833 8612 9679 11255 6034 2306 3836 7517
762 7517 5001 836 -696 -1903 -2544 -1830 -3878 -6579 -6563 -6254 -6564 -6412 -4896 -6125 -5775 -2989 -1890
779 -1890 522 1937 656 376 3710 10140 9429 7970 6307 4165 8669 11295 9393 4985 3033 2609
795 2609 2224 2955 1928 -2355 -4608 -5271 -7342 -6427 -5285 -5402 -7049 -7373 -7844 -5824 -1338 927 -1471
812 -1471 -3669 -1210 1068 3107 6704 6296 3766 3036 4244 6794 9304 9013 3868 -500 -1595 506
$$ packed form
698D322k58l987l928J983J001l936m071J099p31K102M353l894n586J298N768M331
714a34J913j633m491P51P458L432K125K211n976n787M253O761J840k072o585r045
730d979J288J0365J288q066n945m054n61O193L684m899m302q17j40L867O791Q79
746E92l388k045J217N413N963N66m361l166N042K779J067J576n221l728J530L681
762G517k516m165j532j207o41P14k048k701J6L09l10J52J516j229L50K786J099
779a890K412J415j281k80L334O430p11j459j663k142M504K626j902m408j952m24
795B609l85P31j027m283k253o63k071R15J142j17j647l24m71K020M486K265k398
812a471k198K459K278K039L597m08k530p30J208K550K510k91n145m368j095K101
$$ plain form
828 506 3641 2436 -3012 -10305 -8700 -3557 -2469 -3128 -6533 -10578 -11174 -6242 -2246 -2787 -4652 -7037
844 -7037 -6855 -717 4055 5986 3701 3107 3747 5748 10377 9245 5614 3018 3362 4878 4070 3587 1171
861 1171 -2050 75 949 -2774 -4737 -5527 -6395 -5446 -4532 -7056 -9230 -6192 -2655 -796 613 768 -1821
878 -1821 832 5801 7517 6700 5655 2445 2103 9450 12568 7736 2939 2859 2836 4548 7855 4453 -3215
895 -3215 -6398 -4658 -2646 -525 -1545 -7231 -10701 -7253 -3346 -958 -983 -3613 -6504 -4129 2277 3320
911 3320 1902 3974 1039 646 6013 9189 6025 5195 5935 5213 4603 6135 4089 148 929 1314 -2933
928 -2933 -2128 -1725 -4664 -5855 -3727 -5655 -8249 -5532 -4365 -5813 -4057 -1280 -4704 -2491 2845 3158
944 3158 1562 5389 4780 1712 5328 10161 6184 5388 5226 2753 -566 4713 5300 250 -1039 -2478
$$ packed form
828E06L135j205n448p293J605N143J088o59l405m045n96M932L996n41j865k385
844g037J82O138M772J931k285n94O40K001M629j132l631k596L44J516q08m83k416
861A171l221K125Q74l723j963p90q68R49R14k524k174L038L537J859J409J55k589
878a821K653M969J716q17j045l210l42P347L118m832m797q0k3J712L307l402p668
895c215l183J740K012K121j020n686l470L448L907K388k5k630k891K375O406J043
911C320j418K072k935l93N367L176l164q30P40p22o10J532k046l941P81L85m247
928b933Q05M03k939j191K128j928k594K717J167j448J756K777l424K213N336L13
944C158j596L827o09l068L616M833l977p96j62k473l319N279N87n050j289j439
$$ plain form
960 -2478 -5967 -3371 952 -3550 -7487 -5787 -7775 -9690 -2243 -15 -7099 -6424 -1794 -2716 -109 4943
976 4943 2851 -1468 1974 4848 4585 6049 6992 541 763 5833 4153 1576 3638 -801 -3686 623
992 623 1868 -4156 -4630 -2497 -7146 -8411 -2776 -4332 -7277 -3670 -4682 -5930 -2000 1949 -407 307
1008 307 894 19 2733 7040 5641 4212 6068 3893 1555 6784 7972 3116 2713 2770 -2455 -1563 2748
1025 2748 -152 -5337 -2520 -3537 -4941 -2652 -4001 -8078 -4862 618 -2523 -2097 -409 -4387 -3403
1040 -3403 7329 8231 671 1421 3958 1340 5702 13354 6942 -845 3163 3923 3006 7357 3655 -5407
1056 -5407 -5194 704 -260 -2344 -2290 -8605 -10774 -2953 520 -6035 -5575 -3596 -6779 -2496 4054 118
1072 118 -4658 -82 3396 1737 4122 6554 1109 702 6660 5944 2653 3749 2421 -1040 120 1403
$$ packed form
960b478l489K596M323m502l937J700j988j915P447K228p084O75M630r22K607N052
976D943k092m319L442K874k63J464R43o451K22N070j680k577K062m439k885M309
992F23J245o024m74K133m649j265N635j556k945L607j012j248L930L949k356P14
1008C07N87q75K714M307j399j429J856k175k338N229J188m856m03N7n225Q92M311
1025B748k900n185K817j017j404K289j349m077L216N480l141M26J688l978R84
1040c403J0732R02p560P50K537k618M362P652o412p787M008P60r17M351l702r062
1056e407K13N898r64k084N4o315k169P821L473o555M60J979l183M283O550l936
1072A18m776M576L478j659K385K432n445m07N958p16l291J096j328l461J160J283
$$ plain form
1088 1403 -1986 -3461 -841 -3892 -5967 -2736 -5973 -8717 -3598 -927 -5680 -6505 -3682 -4005 -2138
1103 -2138 3114 2761 -1384 -614 3161 5132 6371 7555 3515 3558 3951 4183 5308 4148 755 -822
1119 -822 1591 1612 -1473 -1788 -1553 -3950 -3915 -3158 -4206 -4851 -3504 -3570 -3482 -2685 -2585 -1015 2523 2019 352
1138 352 1024 1837 1835 6532 9671 4950 -87 3863 5518 5508 8080 3917 -3796 -3371 2224 1526 -1238
1155 -1238 -869 -6183 -8380 -2696 414 -4078 -4450 -5478 -8273 -4157 3407 -1126 -4296 511 857 -1403
1171 -1403 4302 7053 783 1541 7463 4960 2419 5295 2804 684 3976 3405 -1757 -1148 1002 -2693
1187 -2693 -4327 -755 -4188 -7624 -2918 -2369 -6293 -4545 -1645 -4593 -2934 1870 -1606 -3956 269
1202 269 2071 308 4178 5809 816 812 5845 4177 3796 6327 3586 514 1858 2004 -724 -610 -503
$$ packed form
1088A403l389j475K620l051k075L231l237k744N119K671m753q25K823l23J867
1103b138N252l53m145P70L775J971J239J184m040M3L93K32J125j160l393j577
1119h22K413K1l085l15K35k397L5P57j048o45J347o6Q8P97J00J570L538n04j667
1138C52O72Q13kM697L139m721n037L950J655j0K572m163p713M25N595o98k764
1155a238L69n314k197N684L110m492l72j028k795M116P564m533l170M807L46k260
1171a403N705K751o270P58N922k503k541K876k491k120L292n71n162O09K150l695
1187b693j634L572l433l436M706N49l924J748K900k948J659M804l476k350M225
1202B69J802j763L870J631m993mN033j668l81K531k741l072J344J46k728J14J07
$$ plain form
1219 -503 -3850 -4230 -1584 -2984 -5562 -2468 -2489 -5733 -4309 -2149 -3666 -2092 498 -614 -1138 1763
1235 1763 2050 3110 4106 4241 2943 3889 4609 3048 4170 5468 2349 461 1575 916 -470 -473 -1462
1252 -1462 -2879 -3756 -2662 -3683 -4583 -3822 -4111 -2908 -2387 -2756 -2714 -1047 715 -277 799 2091 1650
1269 1650 2226 4419 3674 2506 3861 3885 2944 3142 3737 1575 407 132 -577 -799 -930 -1593 -4325 -4387
1287 -4387 -3828 -3838 -2888 -3775 -5884 -5063 -3063 -2590 -1445 -323 -149 -1647 809 4112 4407 3345 3940
1304 3940 2955 1513 3351 6046 4946 2119 -260 -92 1523 2894 1160 -2027 -3642 -3490 -1836 -600
1320 -600 -2132 -5152 -5583 -4143 -2849 -833 -621 -2122 -2991 -985 1602 3026 3159 2784 1500 2330 4636
1337 4636 4863 5275 3424 2904 3003 3760 3121 1539 199 -1091 -1036 -297 -1656 -2830 -2294 -2796 -2850 -3067 -2541
$$ packed form
1219e03l347l80K646j400k578L094k1l244J424K160j517J574K590j112n24K901
1235A763K87J060R96J35j298R46P20j561J122J298l119j888J114o59j386lr89
1252a462j417q77J094j021r00P61k89J203N21l69M2J667J762r92J076J292m41
1269A650N76K193p45j168J355K4r41J98N95k162j168k75p09k22j31o63k732o2
1287d387N59j0R50q87k109Q21K000M73J145J122J74j498K456L303K95j062N95
1304C940r85j442J838K695j100k827k379J68J615J371j734l187j615J52J654J236
1320f00j532l020m31J440J294K016K12j501q69K006K587J424J33l75j284Q30K306
1337D636K27M12j851n20R9P57o39j582j340j290N5P39j359j174N36n02n4k17N26
$$ plain form
1356 -2541 -2977 -3448 -2692 -1751 -1205 -999 84 562 1779 2494 3181 2843 2634 3418 3793 4559 3609 1918 1500
1375 1500 2207 2187 756 -515 -720 -1523 -3042 -1895 -3884 -3927 -4281 -4238 -3784 -3635 -2514 -2625 -1222 -1018
1393 -1018 -340 -1218 84 1383 1744 2102 2558 2854 3326 4454 4653 3678 3903 1637 1198 2132 2174 655
1411 655 -934 -2337 -2787 -846 -432 -1941 -3621 -4656 -3780 -2400 -1154 -1424 -2290 -2006 -732 1685 1822
1428 1822 2882 1054 531 3090 4671 4962 5276 3594 2456 1729 4039 5070 2496 913 -157 -371
1444 -371 -64 286 -1070 -2332 -3289 -4016 -3177 -2306 -2799 -4021 -3008 -1039 -2247 -221 981 -509 -120
1461 -120 1520 2776 2511 3065 1763 1277 3800 4021 1771 1830 2674 -29 207 1727 505 -1751 -2401
1478 -2401 -2506 -3354 -2528 -2453 -4024 -4962 -4026 -3584 -3401 -1480 -2219 -3646 -1334 1009 -675 762 1368 768
$$ packed form
1356b541m36m71P56R41N46K06J083M78J217P15O87l38k09P84L75P66r50j691m18
1375A500P07k0j431j271k05q03j519J147j989m3l54M3M54J49J121j11J403K04
1393a018O78q78J302J299L61L58M56K96M72J128J99r75K25k266m39R34M2j519
1411F55j589j403m50J941M14j509j680j035Q76J380J246k70q66K84J274K417J37
1428A822J060j828n23K559J581K91L14j682j138p27K310J031k574j583j070k14
1444c71L07L50j356j262r57p27Q39Q71m93j222J013J969j208K026J202j490L89
1461a20J640J256k65N54j302m86K523K21k250N9Q44k703K36J520j222k256o50
1478b401j05q48Q26P5j571r38R36M42J83J921p39j427K312K343j684J437O06o00
$$ plain form
1496 768 1847 3485 2532 2035 2543 1965 1172 2759 3514 556 -202 -15 -661 -1145 -87 -2572 -4278 -3828
1514 -3828 -3233 -3808 -2690 -1612 -2234 -2449 -414 -1253 -1228 689 1592 1295 1725 1513 743 2028 4950 4164
1532 4164 2758 3417 2281 1415 3209 3016 1377 -202 -469 -1296 -599 -170 -2078 -3058 -2467 -1958 -2055 -2440
1550 -2440 -2913 -3707 -1273 -62 -960 -1049 331 -719 1088 3425 2128 983 2472 2976 2896 3346 3305 1510
1568 1510 1026 2371 1177 -242 466 -77 -2154 -633 -1009 -5401 -3960 -934 -2698 -3208 -1549 -2779
1584 -2779 -6106 -1439 1680 -438 326 1009 -1926 43 5768 4507 1072 3337 2361 341 4257 4693
1600 4693 -563 -417 3692 192 -2410 1413 -1096 -4470 -1029 1022 -3932 -4223 -1154 -5088 -3814
1615 -3814 1552 -319 -4579 -1552 719 -2421 1023 4006 -463 -479 4501 2766 678 3945 3154 -827
$$ packed form
1496G68J079J638r53m97N08n78p93J587P55k958p58J87o46m84J058k485j706M50
1514c828N95n75J118J078o22k15K035q39K5J917R03k97M30k12p70J285K922p86
1532D164j406O59j136q66J794j93j639j579k67q27O97M29j908r80N91N09r7l85
1550b440m73p94K434J211q98q9J380j050J807K337j297j145J489N04q0M50m1j795
1568A510m84J345j194j419P08n43k077J521l76m392J441L026j764n10J659j230
1584b779l327M667L119k118P64O83k935J969N725j261l435K265r76k020L916M36
1600D693n256J46M109l500k602L823k509l374L441K051m954k91L069l934J274
1615c814N366j871m260L027K271l140L444K983m469j6M980j735k088L267p91l981
$$ plain form
1631 -827 2592 5456 419 -779 2507 329 -1605 1988 -280 -5646 -2466 67 -3845 -3222 -1214
1646 -1214 -4053 -4162 -29 -797 -2339 -183 -635 -1416 -52 3386 804 373 4278 2621 1186 2435
1662 2435 3473 872 2209 4198 133 -808 125 24 -102 789 -2033 -4141 -2132 -1740 -2490 -1773 -2114
1679 -2114 -4540 -3485 40 -556 -1692 -1682 -1026 -683 3442 4360 515 647 1737 2366 4187 4534 2637
1696 2637 -1068 614 2613 1752 1899 -514 -3138 -2116 428 -1497 -2442 -2425 -4541 -4024 95 -495 -3123
1713 -3123 -2779 -1664 -2301 -434 2207 180 -612 494 2158 2088 3500 3135 923 757 3950 2158 1823
1730 1823 2227 489 -1026 1310 930 -1361 -833 -829 -2895 -3402 -1179 -1925 -2978 -1799 -1870 -2983 -788
1747 -788 -124 -865 -453 1221 927 690 3667 3009 1253 2567 3048 1677 2657 3501 1834 1353 1455 1191
$$ packed form
1631h27L419K864n037j198L286k178j934L593k268n366L180K533l912O23K008
1646a214k839j09M133p68j542K156m52p81J364L438k582m31L905j657j435J249
1662B435J038k601J337J989m065r41R33j01j26Q91k822k108K009L92p50P17l41
1679b114k426J055L525n96j136J0O56L43M125R18l845J32J090O29J821L47j897
1696B637l705J682J999q61J47k413k624J022K544j925r45J7k116N17M119n90k628
1713c123L44J115o37J867K641k027p92J106J664p0J412l65k212j66L193j792l35
1730A823M04j738j515K336l80k291N28Mk066n07K223p46j053J179p1j113K195
1747g88O64p41M12J674k94k37K977o58j756J314M81j371R80Q44j667m81J02k64
$$ plain form
1765 1191 -536 498 594 -2296 -1835 -991 -1534 -1978 -1475 -2913 -2820 -1855 -382 -915 -2159 -927 -1027 496
1783 496 1463 1156 1614 1823 1770 1797 2841 3155 1025 699 2351 946 915 1440 216 -520 -860 -696 -982
1802 -982 -1343 -2025 -2501 -2771 -2369 -2303 -1471 -1706 -1935 -1997 -255 -175 -363 221 1303 865 2184 2112 2208 2212 1691
1823 1691 1683 1240 1769 2491 1056 876 1081 565 349 -40 -1013 -1923 -1191 -2037 -1772 -2405 -2234 -2356 -1554 -901
1843 -901 -1505 -2358 -884 -516 189 1341 1073 787 1280 1693 3114 2838 1755 1538 724 1695 1607 1018 367
1862 367 155 -925 -820 -289 -378 -1972 -2214 -2517 -1741 -2917 -2163 -1756 -1649 -2536 -1075 -294 -115 446 524
1881 524 614 1303 1669 1914 1858 1013 2121 2094 1614 1918 1617 1021 1375 751 175 -641 -1475 -807 -922 -2391
1901 -2391 -1491 -2297 -1924 -1532 -1228 -1584 -1668 -1614 -851 534 673 502 524 323 1444 2362 2320 2972 2485 1583
$$ packed form
1765A191j727J034R6k890M61Q44n43m44N03j438R3R65J473n33j244J232j00J523
1783D96R67l07M58K09n3K7J044L14k130l26J652j405l1N25j224p36l40J64k86
1802i82l61o82m76k70M02O6Q32k35k29o2J742Q0j88N84J082m38J319p2R6Mn21
1823A691qm43N29P22j435j80K05n16k16l89r73r10P32q46K65o33J71j22Q02O53
1843i01o04q53J474L68P05J152k68k86M93M13J421k76j083k17q14R71q8n89o51
1862C67k12j080J05N31q9j594k42l03P76j176P54M07J07q87J461P81J79N61P8
1881E24R0O89L66K45n6q45J108k7m80L04l01n96L54o24n76q16q34O68j15j469
1901b391R00q06L73L92L04l56q4N4P63J385J39j71K2k01J121R18m2O52m87r02
$$ plain form
1921 1583 1771 1269 1456 1905 786 148 -379 312 -226 -852 -1141 -1779 -2041 -1747 -2071 -1919 -1737 -1881 -2110
1940 -2110 -578 -614 -573 518 453 324 350 1597 2208 1421 1929 1742 1597 2414 2002 1834 1318 704 830 310
1960 310 361 -583 -953 -1491 -1291 -2048 -1694 -1181 -2517 -1694 -1403 -1744 -689 -979 -484 -801 546 1229 611
1979 611 960 1787 1709 1977 2248 1934 1243 1396 1986 983 1323 491 -797 -375 -232 -1165 -1331 102 -1614
1998 -1614 -2202 -1358 -1322 -2352 -1252 -1943 -2105 -1506 169 -574 -19 1557 111 -702 1500 2660 1397
2015 1397 1489 1695 -83 46 2613 1823 835 536 285 -819 124 606 -1288 -2039 -965 -2182 -2109 -470
2033 -470 -1369 -2956 -2275 153 -1281 -1425 1036 -957 -1928 1639 1785 57 2236 1746 328 2779 3532
2050 3532 1568 -14 2416 713 332 1662 1401 -1696 -1394 528 -1657 -1142 -718 -2044 -3044 -427
$$ packed form
1921A583J88n02J87M49j119o38n27O91n38o26k89o38k62K94l24J52J82j44k29
1940b110J532l6M1J091o5j29K6J247O11p87N08j87j45Q17m12j68n16o14J26n20
1960C10N1r44l70n38K00p57L54N13j336Q23K91l41J055k90M95l17J347O83o18
1979F11L49Q27p8K68K71l14o91J53N90j003L40q32j288M22J43r33j66J433j716
1998a614n88Q44L6j030J100o91j62N99J675p43N55J576j446q13K202J160j263
2015A397R2K06j778J29K567p90r88k99k51j104R43M82j894p51J074j217P3J639
2033d70q99j587O81K428j434j44K461j993r71L567J46j728K179m90j418K451P53
2050C532j964j582K430j703l81J330k61l097L02J922k185N15M24j326j000K617
$$ plain form
2066 -427 -498 -2557 -1164 -641 -1476 -340 2880 -190 -1696 839 1830 1002 2159 2979 689 403 3477
2083 3477 1366 1732 3108 710 -962 1070 165 -1911 -1046 744 -1410 -2187 -353 -1891 -1992 -248
2099 -248 217 -2753 -1969 -938 -1132 -385 789 -986 -638 1214 1608 1847 3166 1127 413 1912 3574
2116 3574 2014 1761 554 -756 -369 2124 1109 -1194 -1322 -969 -1625 -345 -258 -2237 -3331 -1422 -850
2133 -850 -491 -66 -726 -2072 -391 626 309 420 2135 -191 166 2024 1301 513 1909 1766 538
2150 538 1060 1005 -980 -1266 1585 346 -1101 -155 -1892 -2658 -840 -284 -2375 -1882 -659 -2089 -1277
2167 -1277 868 -135 -2095 413 1676 291 778 2086 654 1155 3503 2207 969 1343 1185 480
2183 480 927 1798 -616 -996 779 -263 -1592 -196 -1228 -3127 -677 -446 -2586 -1084 -254 -925 -1076
$$ packed form
2066d27p1k059J393N23q35J136L220l070j506K535R91q28J157Q20k290k86L074
2083C477k111L66J376k398j672K032r05k076Q65J790k154p77J834j538j01J744
2099b48M65k970P84J031j94P47J174j775L48J852L94K39J319k039p14J499J662
2116C574j560k53j207j310L87K493j015k303j28L53o56J280Q7j979j094J909N72
2133h50L59M25o60j346J681J017l17J11J715k326L57J858p23p88J396j43j228
2150E38N22n5j985k86K851j239j447R46j737p66J818N56k091M93J223j430Q12
2167a277K145j003j960K508J263j385M87J308j432N01K348j296j238L74j58p05
2183D80M47Q71k414l80J775j042j329J396j032j899K450K31k140J502Q30o71j51
$$ plain form
2200 -1076 1101 123 -961 5 1951 579 687 1795 709 522 1907 2243 1616 1625 665 100 603 1335
$$ packed form
2200a076K177r78j084R66J946j372J08J108j086j87J385L36o27Rr60n65N03P32
$$ [...]
8191E63
##END NTUPLES=NMR FID
##END=
