##TITLE=1H_Ser 6-2-k-1-2
 CDCl3
 8 sc, 
 18.10.2022
##JCAMPDX= 6.0         $$ Bruker NMR JCAMP-DX V2.0
##DATA TYPE= NMR FID
##DATA CLASS= NTUPLES
##ORIGIN= UXNMR, Bruker Analytische Messtechnik GmbH
##OWNER= root
$$ XWIN-NMR		Version 3.5
$$ Tue Oct 18 12:57:42 2022 Russian Standard Time (UT+4h)  she@DPX200
##.OBSERVE FREQUENCY= 200.1313499994
##.OBSERVE NUCLEUS= ^1H
##.DELAY= (6, 6)
##.ACQUISITION MODE= SIMULTANEOUS
##.ACQUISITION SCHEME= undefined
##.AVERAGES= 8
##.DIGITISER RES= 18
##SPECTROMETER/DATA SYSTEM= spect
##.PULSE SEQUENCE= zg30
##.SOLVENT NAME= CDCl3
##.SHIFT REFERENCE= (INTERNAL, CDCl3, 0, 15.7039)
##AUDIT TRAIL= $$ (NUMBER, WHEN, WHO, WHERE, WHAT)
$$ ##TITLE= Audit trail, XWIN-NMR		Version 3.5
$$ ##JCAMPDX= 5.01
$$ ##ORIGIN= Bruker BioSpin GmbH
$$ ##OWNER= she
$$ F:/spectra/data/she/nmr/H-F/1/audita.txt
$$ ##AUDIT TRAIL=  $$ (NUMBER, WHEN, WHO, WHERE, WHAT)
(   1,<2022-10-18 12:56:24.50 +0400>,<she>,<DPX200>,
      <created by zg, POWCHK disabled, PULCHK disabled
       configuration hash MD5:
       00 E9 B6 7A A2 85 ED C7 34 08 36 98 17 FE 4E 26
       data hash MD5: 16K
       AF F5 56 6D 07 2E 9E 66 07 EC DF 03 DA 78 31 B8>)
$$ ##END=
$$ 
$$ hash MD5
$$ C3 F3 C4 1B 6B 4B 3A CE 76 28 ED 45 02 8B 47 7C
##$RELAX= 
##$RELAX= 
##$RELAX= 
##$RELAX= 
##$RELAX= 
##$RELAX= 
$$ Bruker specific parameters
$$ --------------------------
##$DU= <F:/spectra>
##$EXPNO= 1
##$NAME= <H-F>
##$PROCNO= 1
##$TYPE= <nmr>
##$USER= <she>
##$AMP= (0..31)
100 100 100 100 100 100 100 100 100 100 100 100 100 100 100 100 100 100 
100 100 100 100 100 100 100 100 100 100 100 100 100 100 
##$AQSEQ= 0
##$AQ_mod= 1
##$AUNM= <au_zg>
##$AUTOPOS= <>
##$BF1= 200.13
##$BF2= 200.13
##$BF3= 200.13
##$BF4= 200.13
##$BF5= 200.13
##$BF6= 200.13
##$BF7= 200.13
##$BF8= 200.13
##$BYTORDA= 1
##$CFDGTYP= 0
##$CFRGTYP= 5
##$CHEMSTR= <none>
##$CNST= (0..31)
1 1 145 1 1 1 1 1 1 1 1 1 1 1 1 1 1 1 1 1 1 1 1 1 1 1 1 1 1 1 1 1 
##$CPDPRG= <>
##$CPDPRG1= <>
##$CPDPRG2= <>
##$CPDPRG3= <>
##$CPDPRG4= <mlev>
##$CPDPRG5= <mlev>
##$CPDPRG6= <mlev>
##$CPDPRG7= <mlev>
##$CPDPRG8= <mlev>
##$CPDPRGB= <>
##$CPDPRGT= <>
##$D= (0..31)
0 1.2 0 0 0 0 0 0 0 0.06 0 0.03 0 0 0 0 0.0002 0 0 0 0 0 0 0 0 0 0 0 0 
0 0 0 
##$DATE= 1666083383
##$DBL= (0..7)
120 120 120 120 120 120 120 120 
##$DBP= (0..7)
150 150 150 150 150 150 150 150 
##$DBP07= 0
##$DBPNAM0= <>
##$DBPNAM1= <>
##$DBPNAM2= <>
##$DBPNAM3= <>
##$DBPNAM4= <>
##$DBPNAM5= <>
##$DBPNAM6= <>
##$DBPNAM7= <>
##$DBPOAL= (0..7)
0.5 0.5 0.5 0.5 0.5 0.5 0.5 0.5 
##$DBPOFFS= (0..7)
0 0 0 0 0 0 0 0 
##$DE= 6
##$DECBNUC= <off>
##$DECIM= 32
##$DECNUC= <off>
##$DECSTAT= 4
##$DIGMOD= 1
##$DIGTYP= 9
##$DL= (0..7)
0 120 120 120 120 120 120 120 
##$DP= (0..7)
150 150 150 150 150 150 150 150 
##$DP07= 0
##$DPNAME0= <>
##$DPNAME1= <>
##$DPNAME2= <>
##$DPNAME3= <>
##$DPNAME4= <>
##$DPNAME5= <>
##$DPNAME6= <>
##$DPNAME7= <>
##$DPOAL= (0..7)
0.5 0.5 0.5 0.5 0.5 0.5 0.5 0.5 
##$DPOFFS= (0..7)
0 0 0 0 0 0 0 0 
##$DQDMODE= 0
##$DR= 18
##$DS= 0
$$ [...]
##$SUBNAM2= <"">
##$SUBNAM3= <"">
##$SUBNAM4= <"">
##$SUBNAM5= <"">
##$SUBNAM6= <"">
##$SUBNAM7= <"">
##$SUBNAM8= <"">
##$SUBNAM9= <"">
##$SW= 18.0517283424941
##$SWIBOX= (0..15)
0 0 2 0 0 0 0 0 0 0 0 0 0 0 0 0 
##$SW_h= 3612.71676300578
##$TD= 16384
##$TD0= 1
##$TE= 0
##$TE2= 300
##$TE3= 300
##$TEG= 300
##$TL= (0..7)
0 120 120 120 120 120 120 120 
##$TP= (0..7)
150 150 150 150 150 150 150 150 
##$TP07= 0
##$TPNAME0= <>
##$TPNAME1= <>
##$TPNAME2= <>
##$TPNAME3= <>
##$TPNAME4= <>
##$TPNAME5= <>
##$TPNAME6= <>
##$TPNAME7= <>
##$TPOAL= (0..7)
0.5 0.5 0.5 0.5 0.5 0.5 0.5 0.5 
##$TPOFFS= (0..7)
0 0 0 0 0 0 0 0 
##$TUNHIN= 0
##$TUNHOUT= 0
##$TUNXOUT= 0
##$USERA1= <user>
##$USERA2= <user>
##$USERA3= <user>
##$USERA4= <user>
##$USERA5= <user>
##$V9= 5
##$VALIST= <valist>
##$VCLIST= <CCCCCCCCCCCCCCC>
##$VD= 0
##$VDLIST= <DDDDDDDDDDDDDDD>
##$VPLIST= <PPPPPPPPPPPPPPP>
##$VTLIST= <TTTTTTTTTTTTTTT>
##$WBST= 1024
##$WBSW= 4
##$XGAIN= (0..3)
0 0 0 0 
##$XL= 0
##$YL= 0
##$YMAX_a= 310152
##$YMIN_a= -388734
##$ZGOPTNS= <>
##$ZL1= 120
##$ZL2= 120
##$ZL3= 120
##$ZL4= 120
##$ABSF1= 10
##$ABSF2= 0
##$ABSG= 5
##$ABSL= 3
##$ALPHA= 0
##$AQORDER= 0
##$ASSFAC= 0
##$ASSFACI= 0
##$ASSFACX= 0
##$ASSWID= 0
##$AUNMP= <proc_1d>
##$AZFE= 0.1
##$AZFW= 0.1
##$BCFW= 1
##$BC_mod= 2
##$BYTORDP= 1
##$COROFFS= 0
##$CY= 11.3945322036743
##$DATMOD= 1
##$DC= 2
##$DFILT= <>
##$DTYPP= 0
##$F1P= 2.36226072786647
##$F2P= -0.459571619588291
##$FCOR= 0.5
##$FTSIZE= 0
##$FT_mod= 4
##$GAMMA= 1
##$GB= 0.15
##$INTBC= 1
##$INTSCL= 1
##$ISEN= 128
##$LB= 0.24
##$LEV0= 0
##$LPBIN= 0
##$MAXI= 10000
##$MC2= 0
##$MEAN= 0
##$ME_mod= 0
##$MI= 1.114404
##$NCOEF= 0
##$NC_proc= 0
##$NLEV= 6
##$NOISF1= 3.799351
##$NOISF2= 2.8
##$NSP= 1
##$NTH_PI= 0
##$NZP= 0
##$OFFSET= 15.70392
##$PC= 1
##$PHC0= -18038.86
##$PHC1= 17.2007
##$PH_mod= 1
##$PKNL= yes
##$PPARMOD= 0
##$PSCAL= 0
##$PSIGN= 0
##$REVERSE= no
##$SF= 200.130013532006
##$SI= 16384
##$SIGF1= 3
##$SIGF2= 2
##$SINO= 400
##$SIOLD= 16384
##$SREGLST= <1H.CDCl3>
##$SSB= 0
##$STSI= 0
##$STSR= 0
##$SW_p= 3612.71676300578
##$SYMM= 0
##$S_DEV= 0
##$TDeff= 0
##$TDoff= 0
##$TI= <>
##$TILT= no
##$TM1= 0
##$TM2= 0
##$TOPLEV= 0
##$USERP1= <user>
##$USERP2= <user>
##$USERP3= <user>
##$USERP4= <user>
##$USERP5= <user>
##$WDW= 1
##$XDIM= 8192
##$YMAX_p= 0
##$YMIN_p= 0
$$ End of Bruker specific parameters
$$ ---------------------------------
##NTUPLES= NMR FID
##VAR_NAME=  TIME,          FID/REAL,        FID/IMAG
##SYMBOL=    X,             R,               I
##VAR_TYPE=  INDEPENDENT,   DEPENDENT,       DEPENDENT
##VAR_FORM=  AFFN,          ASDF,            ASDF
##VAR_DIM=   8192,          8192,            8192
##UNITS=     SECONDS,       ARBITRARY UNITS, ARBITRARY UNITS
##FACTOR=    0.0002768,     1,               1
##FIRST=     0,             0,               0
##LAST=      2.2672688,     0,               0
##MIN=       0,             -388734,         0
##MAX=       2.2672688,     310152,          0
$$ Real data points
##PAGE= N=1
##DATA TABLE= (X++(R..R)), XYDATA
0@%%%%%%%%%%qJ6j6K4l2L2m0N6p2Q8j04J20j44J74k01K35k73L14l65M20m80N52
32B96o32P14q05R08j021J149j287J434j599J781j976K188k423K679k958L264l600
49a888L968m370M812n304N851o458P141p915Q797r812J1000j2413J4120j6233
63h704J8933k2517K7537l5119M8039p5857K43204k15641k01300N31577k04448
74A05704k88519L26096R1405m48096J39752L09038k54702r9776L21072j96447
84E527k88864L42565J71760l73996N1473K77016k45981j37361L53083n0267l30733
95b25778J82455J99598k51032J0497K45629j66892j39966K66500n051k31514J68482
106E2928J12759k94500M2235L20136j85927k48449K69430R2063k70212R4536K00190
$$ plain form
0 0 0 0 0 0 0 0 0 0 0 0 -8 8 -8 16 -16 16 -24 32 -40 48 -56 64 -80 94 -107 128 -145 169 -196 224 -256 296
32 296 -336 378 -427 481 -540 609 -678 756 -843 938 -1038 1150 -1273 1406 -1552 1712 -1888
49 -1888 2080 -2290 2522 -2782 3069 -3389 3752 -4163 4634 -5178 5822 -6591 7529 -8704
63 -8704 10229 -12288 15249 -19870 28169 -47688 195516 -20125 -221425 310152 105704
74 105704 -182815 143281 234686 -213410 -73658 235380 -19322 -119098 201974 5527
84 5527 -283337 59228 230988 -143008 -91535 185481 -60500 -197861 155222 104955 -225778
95 -225778 -43323 156275 -94757 -84260 161369 -5523 -145489 121011 115960 -115554 52928
106 52928 165687 -128813 -86578 233558 47631 -200818 68612 160675 -109537 -15001 185189
117A85189k55489j11761K78862l2994k10275J76452Q6633k66461M2147K66617
127A58920j34223j67483J74968M013j76152J50810J43061k25090o2136K05441
137G2129n9564j37117J71969O5785k04905J4421J69823o9469p0137J04696m0915
148A6716j14855J05899P0697j27692j249R5068q4705m8977J36908r56j29388O4446
160a8088R2729j00246k6740J15576l5956j06442P1842P1869p3652k2067M6082
171A4907k7505o176O3056k5837o1560N5605L6668p2668M377P8365m9535q8316
183g8619N9436P3582n0676l8596L6342n490l5438K9655L4366l1690k4019J9289
195a1858Q162M390K4110j0441l9674J3812L5985j9505p452M6576j4387o7713L3109
$$ plain form
117 185189 -70300 -182061 96801 63807 -146468 29984 116617 -149844 -107697 158920
127 158920 24697 -142786 32182 36195 -139957 10853 153914 -71176 -133312 72129
137 72129 12565 -124552 47417 113202 -91703 -77282 92541 23072 -47065 57631 16716
148 16716 -98139 7760 78457 -49235 -50484 44584 -40121 -89098 47810 46854 -82534 -18088
160 -18088 74641 -25605 -52345 63231 27275 -79167 -7325 64544 -9108 -31175 14907
171 14907 -12598 -18774 44282 18445 -43115 12490 49158 -23510 -19133 59232 9697 -78619
183 -78619 -19183 54399 3723 -34873 1469 -4021 -39459 -9804 24562 -7128 -31147 -11858
195 -11858 -3696 694 24804 14363 -25311 -11499 24486 4981 -2471 44105 29718 -37995 -4886
208d886P5038m7504o1315N6048K4786o4829J0328O0009l9572l9240M7907j10m2720
221b6060L8333J3836p3431J5353P1470n8673n0312Q8013O561r2425N2299P8877
233F3841r5281l6327J14949j4674r3889P2144N3990r9655O387R7526n8335n5742
245d5066Q9116j2432q9061Q3283O0922j24541j557J25938p2664r3031J25087K5555
257G1549j49005M0195J17890j01845n4800J27147k6951j14803R1013N9061j22979
268f3528K0406J10406r5392n5673J42613j9940j36152J03006Q9796j54566r458
279f8482J64182p1594j20312J35229M5652j50001M2869J17429j10812m4188J35159
290G5131m8500j12653J23042M4571j57743M3011J36537j28563p5220J71952j5134
$$ plain form
208 -4886 70152 22648 -38667 17381 42167 -22662 -12334 47675 8103 -31137 16770 16660 -26060
221 -26060 12273 26109 -47322 -31969 39501 -19172 -69484 18529 25090 -67335 -15036 63841
233 63841 -31440 -67767 47182 32508 -61381 10763 64753 -34902 -28515 69011 10676 -45066
245 -45066 44050 31618 -57443 25840 86762 -37779 -39336 86602 13938 -79093 45994 71549
257 71549 -77456 -37261 80629 -21216 -76016 51131 24180 -90623 390 59451 -63528
268 -63528 -43122 67284 -28108 -83781 58832 38892 -97260 5746 95542 -59024 -68482
279 -68482 95700 24106 -96206 39023 84675 -65326 -22457 94972 -15840 -60028 75131
290 75131 26631 -86022 37020 81591 -76152 -33141 103396 -25167 -100387 71565 56431
301E6431j66686R7697J08102j50904j9094J54443o9590j07952J28337K6603j36839
312g9452O5586R7674j30899j8336J55167o7308j22028J37904M9504j66253M0161
323c8280J45128j16074q2491J52136l106j37898Q1788P8443j28716J939J26572
334G9441p8978p7400J26436l189j31757Q5649R1832j42258k2027J52275n7153
345B2871j14358J21851M7889j44565K9406J21477q7955n8642J13194k1088r9615
356f9535Q7631M9868j18488J8033J04026q6113n7258J26153r799j28733O8825
367a5390Q8860j07296k3787J13216m1512q6841Q6504L8531r2995K2249O8417o8521
379a8565j8099R1274l2867p6448P4064L2691r2236K3912Q6600p0452n6515R3224
$$ plain form
301 56431 -110255 -12558 95544 -55360 -74454 79989 10399 -97553 30784 57387 -79452
312 -79452 -13866 83808 -47091 -65427 89740 22432 -99596 38308 87812 -78441 -38280
323 -38280 106848 -9226 -91717 60419 57313 -80585 1203 79646 -49070 -47131 79441
334 79441 463 -76937 49499 46310 -85447 202 92034 -50224 -72251 80024 22871
345 22871 -91487 30364 78253 -66312 -36906 84571 -3384 -62026 51168 30080 -69535
356 -69535 18096 67964 -50524 -32491 71535 -14578 -71836 54317 44518 -84215 -15390
367 -15390 73470 -33826 -57613 55603 14091 -72750 13754 52285 -40710 -18461 49956 -18565
379 -18565 -36664 54610 21743 -54705 19359 52050 -40186 -16274 70326 -126 -56641 36583
391C6583J3172q6061L0907N3038o5430j6966O7191k3729m9358M3572O953n2567
403d2695L3613M0969o1651j3884O8726j7369n2040N0711K8155o5615N46O4519
415C3985j9442m2010L2478J4688l1269J3766K6359k3510q167K3306j1515j1930
427c261K8651l501m0979J1025L4245k2707k4121K6401M201l4734N438L2647j1383
440A922k8852J0127J6187r536k315J2661n610j0639R623Q414l703N731K353j7196
454a0833M452K9505p529k9179J7006K0931k9306o681M1759p119m4834J8650L4316
467C1138k6523j5838K7311j1228k6959K5173J1799l2133O157K0484k9867j011
479b1497M6617j9352m4166M1086K7571n1357M803N5737l5738m5563N5430K2606
$$ plain form
391 36583 49755 -36306 -5399 47639 -17791 -34757 32434 8705 -40653 2919 9872 -42695
403 -42695 -9082 31887 -29764 -43648 25078 7709 -44331 6380 34535 -31080 -30534 33985
415 33985 14543 -27467 5011 19699 -11570 2196 28555 5045 -3122 20184 8669 -3261
427 -3261 25390 21889 -19090 -8065 26180 3473 -20648 5753 9954 -24780 -19342 13305 1922
440 1922 -26930 -16803 -616 -10152 -12467 194 -5416 -16055 -6432 1982 -1721 4010 6363 -10833
454 -10833 -6381 23124 15595 -13584 3422 24353 -4953 -11634 30125 23006 -21828 -3178 31138
467 31138 4615 -11223 16088 4860 -22099 3074 14873 -17260 -11103 9381 -20486 -21497
479 -21497 25120 5768 -38398 2688 30259 -21098 -16295 39442 3704 -41859 13571 36177
491C6177n5636Q195L9400l6453j1615N1600j6339m1404M0606J2011n4028K6283
503a203M9787o2333l1822P5738l995o9913M2497M4391p1798r097P8162k4937n5258
516c9781N1202J6306n8951K9493M7401o1306j4263O9630k9876n3213P1032J8010
528D5684r2786K2262Q4469o1097n0682Q1034m0q1134M4126N4639p0114j1903O7602
541C2060l6056m0860P1265p15p9790M4088N6934p6602j1529R0178l8223p5202
553f4452P9634M1342r0910R905P8572n3955m2084P8486l528p3163M3946L6179
565C9972p1831J2202P0409o1043m6686Q7388J630q7726M7211O1361q4832k0064
577e2009R3339k6353p2092N9905K8848p4637K1340O4211n7580k6875P2810j7408
$$ plain form
491 36177 -19459 -11264 28136 -8317 -19932 31668 15329 -26075 14531 26542 -27486 -1203
503 -1203 48584 -13749 -45571 30167 26172 -43741 -1244 43147 -28651 -37748 40414 15477 -39781
516 -39781 11421 27727 -31224 -1731 45670 -15636 -29899 39731 9855 -43358 27674 45684
528 45684 -47102 -24840 59629 -1468 -52150 28884 28844 -52290 -8164 46475 -23639 -35542 32060
541 32060 -3996 -44856 26409 25694 -54096 -10008 46926 -29676 -41205 48973 10750 -64452
553 -64452 15182 56524 -34386 -24481 54091 136 -41948 36538 33010 -40153 3793 39972
565 39972 -31859 -19657 50752 -10291 -56977 30411 32041 -55685 -8474 52887 -31945 -52009
577 -52009 41330 14977 -57115 2790 31638 -42999 -21659 42552 -15028 -41903 30907 13499
589A3499n7260O3123K6273q3779J7624P8547n5040m6308P9425J708q1187L9455
601c920N8263o4560k0775O4638k3158m5031N3279R854o3401K4715M5759n4516
613a8853j2679O5781k6873n7484N7105L0827o9406M925O2022l8057l7795N8238
625A7751Q281n4837K1979L5090l8626j730M2299k7672k7163M7690J854n0448K7704
638B172L6582n1757j4181N9075j1943n0562L1763K8020m2461k431L8727k0009
650B995k3742K8947J117k6713J9016J2710l3388M966L4123k2813k3225L6489O747
663A7229l9823J1330L5233k3630k1319K8134P557k4078O023J4561j2776k366J1268
676G343p871m860J5211n220j6357J4555J1363k0511n189K2571l211k0873R749
$$ plain form
589 13499 -43761 19362 45635 -38144 -20520 58027 2987 -43321 36104 37812 -43375 -3920
601 -3920 54343 -10217 -30992 33646 10488 -34543 18736 28590 -34811 -10096 35663 -18853
613 -18853 -31532 34249 7376 -50108 6997 37824 -31582 -26657 35365 -2692 -40487 17751
625 17751 26032 -28805 -6826 28264 -10362 -12092 30207 2535 -24628 23062 24916 -25532 2172
638 2172 38754 -13003 -27184 31891 19948 -30614 1149 29169 -13292 -15723 23004 2995
650 2995 -20747 8200 9317 -17396 1620 14330 -19058 -14092 20031 -2782 -26007 10482 17229
663 17229 -22594 -11264 23969 339 -20980 7154 14711 -9367 -3344 11217 -1559 -3925 7343
676 7343 -528 -5388 9823 4603 -11754 2801 14164 -6347 -11536 11035 7824 -13049 -3300
689c300J6070j3628j1129J4215O143j3288j646J0131o05o188J987K465j678K153
703A702j004m876N158P158j0313p180J5309L915k0388J954K1799r818k0193J7357
717E80J3049k2391l624K2132o085j6778J3997O645j5315O014J0627j5703Q38J9948
731A3934j3813j4330K6990L241l3901J3407L1685k7727j9865L6135K159l5597
743a7682J4680K5325k7031r000K7322j1815j8135K5620q89l1090J9762K1662l6627
756a7898l067M2759k0202l6565L9822K0141m8009M567M4117k5564k5804L9670
768A3967M242l7241J9953K1970l2899L923L4651k8341k1913M5421j285m8507K6733
781F74L5522m8881j3946N4195j3334m6563L3193K2776m4188L877L7791k8875j9788
$$ plain form
689 -3300 12770 -858 -11987 2228 8371 -4917 -6563 3568 2963 -3225 -1238 1227 -451 1702
703 1702 698 -4178 980 8138 -2175 -9355 5954 9869 -10519 -8565 13234 3416 -16777 580
717 580 13629 -8762 -12386 9746 3661 -13117 880 7525 -7790 -1776 8851 -6852 -6014 13934
731 13934 121 -14209 12781 16022 -17879 -4472 27213 -514 -20379 15756 17915 -17682
743 -17682 -3002 22323 -4708 -13708 13614 1799 -16336 9284 8395 -22695 -2933 18729 -17898
756 -17898 -20965 21794 1592 -34973 4849 24990 -23019 -18452 25665 101 -25703 13967
768 13967 18209 -19032 921 22891 -10008 -6085 28566 225 -21688 23733 22448 -26059 674
781 674 36196 -12685 -26631 27564 14230 -32333 860 23636 -20552 -16675 21116 -7759 -27547
794b7547M0000p027l4932L3129J6939m8591J0285M9926l4320l1149N2901N270
806B4884n4764K5131M3361m3309j8050M7430j0107l5739L3255J2125m3376J4282
818d877L3751l7083j1729M6915j8398m4109M1934K3728n4562K156M9952k9710
830b032l3138M6547Q156m7065J6772L2773l2691o341L8002j9273k6433L8692N606
843A9575m2307K1118L2688m2635j2355N2124j1444m5743L1348K5396m2183n94
855a5012L9389k1973k5733L2395L073l0653J9312J6545l4866L494L7122k3813
867g20k4224L7920L873m2039J9068L5325l3490j8603L8452j885l1090K0309J5902
880A8798k8387J058K4232j6805j0201K4747r359k4888K4549J4710l3410oL1994
$$ plain form
794 -27547 12453 5426 -29506 3623 20562 -28029 -17744 32182 -2138 -33287 19614 24884
806 24884 -29880 -4749 38612 -4697 -22747 24683 14576 -21163 12092 24217 -19159 -4877
818 -4877 28874 -8209 -19938 26977 8579 -35530 6404 30132 -24430 -22274 27678 -2032
830 -2032 -35170 11377 19533 -27532 -10760 22013 -10678 -17019 20983 1710 -24723 13969 19575
843 19575 -22732 -1614 31074 -11561 -23916 28208 16764 -28979 2369 27765 -14418 -15012
855 -15012 24377 2404 -23329 9066 12139 -18514 798 17343 -17523 -14029 23093 -720
867 -720 -24944 12976 16849 -25190 -6122 29203 -4287 -22890 15562 13677 -17413 2896 18798
880 18798 -9589 -8531 15701 -1104 -11305 13442 4083 -20805 3744 18454 -14956 -14962 17032
893A7032j7204k3129K9144J0460l1421L690K4158j2793j0786J7985k747j4249
905i860J3461O094j5449P007J2681j7977m295K4417n030k3327J3017J5390j9635
918c506n940K0151l858j8123P360J0188q623k907M929m486j081P230m038m905
932g609Q269M45j1314N728J2979q311j1169J1651Q032j0869j843J1377q19j0284
946c737L127R560k806p297K004L664j746p59M93j777N09R4m221P75P197m279j1527
963a0726P155J1067j1000q553J4358K259j5727M171J5922r141j0659J1272M231
976D629q877L963M900q258K154Q789q870k510J4716n997j6626J5659J3208k2216
990e336n055K3626o518k0585J6048J2150k0866k519J7768q085q670J3641l207
$$ plain form
893 17032 -172 -23301 5843 16303 -15118 -11428 12730 -63 -10849 7136 4389 -9860
905 -9860 3601 9695 -5754 1253 13934 -4043 -8338 16079 11049 -12278 739 16129 -3506
918 -3506 -9446 10705 6847 -11276 -3916 6272 -2351 -5258 -329 -4815 -5896 1334 -2704 -7609
932 -7609 660 1105 -10209 -4481 8498 187 -10982 669 8701 -2168 -4011 7366 6547 -3737
946 -3737 -610 8950 6144 -1153 851 4515 2769 2010 2503 726 1235 1329 -2892 -2117 5080 801 -10726
963 -10726 -3571 7496 -3504 -12057 2301 4560 -11167 -6996 8926 -215 -10874 398 4629
976 4629 -4248 -285 4615 -3643 -1489 7300 -1570 -4080 10636 4639 -11987 3672 16880 -5336
990 -5336 -10391 13235 6717 -13868 2180 14330 -6536 -9055 8713 628 -8042 5599 2392
1003B392j3917J3949O602k0419N683K0302j9303j3115K8580K090l0166J0768K3731
1016A7177k1164j0464K5965l413k2328J4989J0942j8857M166J5884j8348n366
1028a0817K5459r019k3135K2678J2425l2149M015L2294j9270k3718K8727Q153
1040A5643k9639Q688K1807k1262p837K4604q380j7767K1406K611k6641J4654K2445
1053B0332k8521r173L4397q492l1043K5113J8264l3382j871L1425j3798j9989
1065a6738K3475L342k4392J3276J5095k3391L29K5224j7657j7164L0611K173l3701
1078a9518J4185K7687k7872j3000L3353m185k8320J8135J6155k4231N20K1300
1090A4209j5295r920K2783n449k1754K0282J0877k9227L757K8998j8984k0833
$$ plain form
1003 2392 -11525 2424 9026 -11393 -5710 14592 -4711 -17826 10754 12844 -17322 -6554 17177
1016 17177 -3987 -14451 11514 8101 -14227 762 11704 -7153 -2987 12897 -5451 -10817
1028 -10817 14642 5623 -17512 5166 17591 -14558 -10543 21751 2481 -21237 7490 15643
1040 15643 -13996 -5308 16499 -4763 -12600 12004 3624 -14143 7263 9874 -16767 -2113 20332
1053 20332 -8189 -17362 17035 8543 -22500 2613 20877 -12505 -14376 17049 3251 -16738
1065 -16738 6737 10079 -14313 -1037 14058 -9333 -9004 16220 -1437 -18601 12010 14183 -19518
1078 -19518 -5333 22354 -5518 -18518 14835 10650 -17670 465 16620 -7611 -7091 14209
1090 14209 -1086 -11006 11777 6328 -15426 4856 15733 -13494 -9737 19261 277 -20556
1102b0556K8519O182l0615Q439K3389j8848j0896K1824l249j6791J4686N742j8963
1115a1137P932J5780j8540n051K4275p418k2200J9395J4583k4974k149K4995r240
1128F251j7954J6204P458j7394K954J1720j0843l319J2888p947r720J5072O51
1141F021j8522Q441J5386j6998q663K0895l62j9629Q371J4000j2639n444J3475
1154D332j885q327P071K419p266N767M730j0356J695J2386q006r923J3376M699
1168A0712j5890Q98J4163o362j0762Q399M974r328j014O012k325k520K131j915
1182b827o54M692j802n993N515N044q173j775R805Q6j0087L232R223l874o957
1197d545N162N346n440k814M637K185m192j506K117R46m98j943j921K493K619
$$ plain form
1102 -20556 7963 14145 -16470 -8031 15358 -3490 -14386 7438 4189 -12602 2084 7826 -11137
1115 -11137 -3205 12575 -5965 -11016 13259 5841 -16359 3036 17619 -7355 -9504 15491 6251
1128 6251 -11703 4501 11959 -5435 -2481 9239 -1604 -4923 7965 18 -9702 5370 6021
1141 6021 -12501 -4060 11326 -5672 -14335 6560 6198 -13431 -5060 8940 -3699 -9143 4332
1154 4332 2447 -5880 1191 3610 -3656 2111 6841 -3515 -1820 10566 2560 -7363 6013 10712
1168 10712 -5178 -4280 9883 3521 -7241 1158 6132 -3196 -4210 1802 -523 -3043 -912 -2827
1182 -2827 -3481 1211 -591 -6584 -1069 3975 -4198 -5973 3832 3918 -6169 -2937 6286 2412 -4545
1197 -4545 617 5963 523 -2291 2346 4531 339 -1167 950 1896 1398 -545 -2466 27 2646
1212B646m213l208O632J575q984Q31J0453l564r998O075Q249p903m420R483M74
1227D128p809K945M902m143m9K765m306N15P189o087o593J0460K299j4146L721
1242d209J4352j0506j1201J3999M930j4846K471J1357p928n337J0207j041p218
1255d970P581R39r966P586Q880j4192k882J7960n511j6207J4255J0309j9378k464
1269h060J9266o412j4107J1900M069j3777M947Q877j1780q35J2847r761q967J7672
1283E879M75k0447R276J7444j7499q423K2274j704k0027J1632J3536j5707k426
1296e717J5169p549q205J4208j577j3818J1120P787j8661K205J9972j4033j5439
1309a4538K0602N503k3650N614J8936j5265j0490J8599m81j5436R602O859j4417
$$ plain form
1212 2646 -1567 -4775 1857 3432 -5552 -4721 5732 2168 -7830 -1755 6494 -1409 -5829 3654 4128
1227 4128 -3681 -736 4166 23 -26 2739 -1567 -1052 6137 50 -6543 3917 6216 -7930 -4209
1242 -4209 10143 -363 -11564 2435 7365 -7481 -5010 6347 -1581 -6918 3289 2248 -4970
1255 -4970 2611 3550 -6416 1170 10050 -4142 -7024 10936 5425 -10782 3473 13782 -5596 -8060
1269 -8060 11206 4794 -9313 2587 6656 -7121 -2174 6703 -5077 -5912 6935 -2826 -11793 5879
1283 5879 6354 -14093 -4817 12627 -4872 -13295 8979 7275 -12752 -1120 12416 -3291 -5717
1296 -5717 9452 1903 -6302 7906 6329 -7489 3631 11418 -7243 -5038 14934 901 -14538
1309 -14538 6064 11567 -12083 -6469 12467 -2798 -13288 5311 4830 -10606 -1004 5855 -8562
1322h562M548J3286j3782n283J8983n238j7483J6313J1110k2163j001K2799q996
1335D531j6445J6433O365j7844L684J3854j1584m982J3420o261r595J3924J594
1348G094j7702P853J4614j6612p134K0894l042j9473J1338J3614j6050m156J5540
1361F778m616j0431J0917K216j1126O252O394j1734J409J3708j0236r910J5919
1374E540L140j7660N295J5053j2180q951J4967J635j3291M469P450p973m38P604
1388D660n374l662R045k586r236R629N659j3936J7J4314n826j1250R965N918j1862
1403d525m52J0014l392o055M607J392l941L249Q24n252L004M353o756j402R259
1418D927k419r448N635P699p433m639Q383J006p024J343N416k106l179J862N70
$$ plain form
1322 -8562 -4014 9272 -4510 -9793 9190 3952 -13531 2782 13892 -8271 -9272 13527 4531
1335 4531 -11914 4519 10884 -6960 -3276 10578 -1006 -5988 7432 1171 -8424 5500 7094
1348 7094 -10608 -2755 11859 -4753 -11887 9007 5965 -13508 -2170 11444 -4606 -8762 6778
1361 6778 2162 -8269 2648 4864 -6262 -10 6384 -5350 -3941 9767 -469 -10379 5540
1374 5540 8680 -8980 -3685 11368 -812 -9763 5204 6839 -6452 -1983 5467 -2506 -2944 4660
1388 4660 -714 -4376 4669 2083 -7153 2476 8135 -5801 -5784 8530 2704 -8546 1419 7337 -4525
1403 -4525 -4977 5037 1645 -4410 197 1589 -2352 897 1721 -3531 -527 3826 -2930 -4332 4927
1418 4927 2508 -6940 -1305 6394 -1039 -5678 2705 3711 -3313 -1970 3446 1340 -1839 23 593
1433E93M22N43k455o51M029j27n144J829N102l796m872M870M292n418l635N974
1449A556J865n602p17N001j50m854J058L264p94k253J09Q21R05J49k595Q04L835
1466B402j660m879L714N603n926m681Q084K544q475M72P215k553n437M161L012
1481C596l945q1K233j860O34J918m096p52O614k912p586O511N616j0094k384J1028
1497D440j782j0353N604O938p603k060P044j542m115M729l23m452N585J676q293
1512d507L307Q766p730o448J2087J714j3083L798J1044q140o881J0160O01r182
1526d494M174M675p187J008N506o359k171R450l721r779R586O102j3528j09J4678
1541G831o139j1286J1281N872j2556J160J0174o047m853Q665j764o543P576J625
$$ plain form
1433 593 1015 1558 -897 -1548 2481 2354 -2790 -961 4141 345 -4527 343 4635 -783 -4418 1556
1449 1556 3421 -2181 -2898 2103 1953 -2901 -1843 1421 627 -1626 -1517 -696 209 358 -2237 -1433 2402
1466 2402 742 -4137 -423 5180 -746 -5427 2657 5201 -3274 -2802 4413 1860 -3577 584 3596
1481 3596 -349 -430 1803 -57 577 2495 -1601 -2353 4261 1349 -6237 274 5890 -4204 -6588 4440
1497 4440 2658 -7695 -2091 4847 -2756 -4816 2228 686 -3429 1300 977 -3475 2110 3786 -4507
1512 -4507 -1200 7566 -164 -6612 5475 7189 -5894 -2096 8948 808 -6073 4087 4688 -4494
1526 -4494 -320 4355 -2832 -1824 3682 -2677 -4848 4602 881 -8898 688 6790 -6738 -6847 7831
1541 7831 1692 -9594 1687 7559 -4997 -3837 6337 290 -4563 4102 2338 -4205 3371 4996
1555D996j0753N423R614j1890m633J5030k186j5067R026R787j3297l594J3496
1568E952l597r723P853L660r442L942O253q844J47J0140o694p469J2792J857j4978
1583h151N161J3327j1095p784J4234K83j2575N250Q280r159j906Q714m992m343
1597d756Q799k555q579Q504M813j2304O78J3217p347r997J2062M988j3718K130
1611d065J1223o303o022Q343L94o598M791K158o839L081N648q055j754J0188l394
1626B796j0641Q098P200j1218k464J0937k749q781O103M390o612o05N196l173
1640a523n21M355l157l114O873K99p454M019O718p335l819R335Q26r090K060P175
1656E647m531l681M525L70l797J533L88j754K032J21m247J575M887m149m221N751
$$ plain form
1555 4996 -5757 -334 9280 -2610 -7243 7787 5601 -9466 -440 9347 -3950 -7544 5952
1568 5952 2355 -7368 485 4145 -5297 -1355 4898 -3946 -3799 6341 -353 -7822 4970 6827 -8151
1583 -8151 -2990 10337 -758 -8542 5692 5975 -6600 -1350 6930 -2229 -4135 4579 -413 -4756
1597 -4756 4043 1488 -7091 1413 6226 -6078 -5400 7817 470 -9527 2535 7523 -6195 -4065
1611 -4065 7158 855 -5167 3176 3570 -3028 1763 3921 -2918 163 5811 -2244 -3998 6190 2796
1626 2796 -7845 253 7453 -3765 -6229 4708 1959 -6822 -719 3671 -2941 -3546 1650 -1523
1640 -1523 -2044 2311 -846 -3960 2913 3212 -4242 -223 6495 -840 -4659 4676 5502 -3588 -1528 5647
1656 5647 1116 -2565 1960 2330 -1467 66 454 -1300 732 853 -3394 -1819 3068 -1081 -5302 449
1672D49K471o732k14P069j912n285K775M205k832j686K267P50n63k50n00J121
1688A133J060j601k055K880J999m051j422M281L24m772J82M709j440m356J624
1703a505L856k294k937J566K618j708j633J653J038n91r79l49J803Q43k059j276
1719a954L237J670m897R7N126r81n768K684M704l735l561M701J095l913L42K551
1735A398j442m40O50j536P90L170l167l052N569J430o955J472P081m184n872O450
1751A362L458p285k35N945k319l161L122R4k824K950j59m143L582L235o536j251
1767d165Q530k402q174N842N940q322k213R080j667o891M547L138m751J039L311
1782B842m097N0N218m155l914P676o5q612L737Q069p248n408R465O51r183L263
$$ plain form
1672 449 2920 -3812 -4026 3043 1131 -4154 -1379 2826 -6 -1692 575 1325 762 512 12 1133
1688 1133 2193 592 -1463 1417 3416 -635 -2057 2224 2548 -2224 -2042 2667 1227 -3129 -1505
1703 -1505 2351 57 -2880 -1314 1304 -404 -2037 -384 654 63 -916 -1265 538 1381 -678 -1954
1719 -1954 1283 2953 -1944 -1847 3279 2298 -3470 -786 3918 183 -3378 1323 2418 -1495 -1153 1398
1735 1398 -44 -484 166 -1370 -580 2590 -577 -3629 1940 3370 -3585 -2113 4968 784 -5088 1362
1751 1362 4820 -2465 -2700 3245 926 -2235 887 981 -1843 1107 948 -3195 387 3622 -2914 -4165
1767 -4165 4365 1963 -6211 -369 5571 -2751 -4964 4116 2449 -4442 105 3243 -1508 -469 2842
1782 2842 -1255 -1205 4013 -142 -4056 3620 3555 -5057 -1320 6749 -499 -5907 3558 4209 -4974 -1711
1798a711O491n779k724N767j713l401M887r58n287M947L454p973Q24R022n560
1813B86p210R369L422j0470Q87R214m505n824O689J511o078K721K977m678J192
1828d97M408n375k233Q512k448q118O144N804r383j812J0313k483q725N932M877
1843D916p480O6N377l194k267M633j983l421N174R41p710L526O879p246l761R014
1859C464K37r023L918P058o305l598O878j85m795L111J426l827K455J909m651
1874a928P33N642m149m813P174J708q534J243Q016m972m873N664K085n496L91
1889b109L739k360r19K444j878r60M009j709l682M259K919o459J00O929k269n891
1905c837L986M173n147j787M985n89k923J166Q55r10M25k05j887J937J856l927
$$ plain form
1798 -1711 4780 -999 -3723 2044 331 -3070 1817 859 -4428 519 3973 -4000 -3176 5846 286
1813 286 -6924 2445 5867 -4603 -3716 5498 993 -4831 1858 3369 -2709 12 2989 -1689 -497
1828 -497 3911 -1464 -3697 4815 2367 -5751 393 6197 -3186 -4998 5315 2832 -5893 39 4916
1843 4916 -2564 -2498 2879 -315 -2582 2051 68 -3353 1821 2762 -4948 -1422 5457 -1789 -5550 3464
1859 3464 3701 -5322 -1404 5654 -651 -4249 2629 2444 -2351 760 2186 -1641 814 2723 -1928
1874 -1928 -1195 4447 298 -4515 2659 4367 -4167 -2924 5092 120 -4753 911 2996 -2500 -2109
1889 -2109 1630 -730 -1649 795 -1083 -2043 1966 257 -3425 834 3753 -2706 -2606 4323 2054 -3837
1905 -3837 149 4322 -825 -2612 2373 1784 -1139 27 882 -28 397 192 -1695 242 2098 -1829
1921a829n84M591r89m688K020M189l101k992L614K126l451p88K739M34j632k57
1937e98O31J013l39j397J50K429o50k621Q74K593j877k430K003K608k732k239
1953b582K761J884k667j783L094Q29k672o47K515M40j757m46J285Q52n63j436
1969h93Q36K149r86k632J473L230k899k917L599J983m220j205M266m82l918J491
1985a125K229j336j214J092m79Q02K62j801jL542j425l758L196L588m400k278
2001c106N580O09n581J550M398k775k197K827J10j762J105k60j641K004M83l934
2017b590J450M140l702l877N884J511o484Q02N904k884m225M271J935l925O97
2032a093K591j779J4K026k342n48M530k162m411M628L158o742r75P359j985o552
$$ plain form
1921 -1829 -2413 2178 1189 -3499 -1479 2710 -391 -3383 231 2357 -1094 -1882 857 1291 -341 -598
1937 -598 33 1046 707 -690 -540 1889 1239 -1382 -508 2085 208 -2222 -219 2389 -343 -2582
1953 -2582 179 2063 -604 -2387 707 1536 -1136 -1783 732 1172 -585 -1031 254 1106 543 -893
1969 -893 -57 2092 1106 -1526 -53 3177 278 -2639 960 2943 -1277 -2482 1784 1302 -2616 -1125
1985 -1125 1104 -232 -1446 -354 -833 -31 231 -1570 -1571 1971 546 -3212 -16 3572 -828 -3106
2001 -3106 2474 3083 -2498 -948 3450 675 -1522 1305 1415 -347 758 498 -1143 861 1344 -2590
2017 -2590 -1140 3000 -702 -4579 1305 2816 -3668 -2866 3038 154 -4071 200 2135 -1790 -1093
2032 -1093 1498 -281 -267 1759 -583 -1131 3399 1237 -3174 1454 4612 -2130 -3105 4254 2269 -4283
2048d283M560L782n285j213M420j668k609K934n32k105K637M66m530K805M409
2063C788n283k753P200l13p035L491N292n090k701N786Q9m811K166K145k631N18
2079a42K184l355K41M272l358l670N895J128p195J758O568m279m681N823J947
2094C136n940J027M303k715j467K841j151j137K762r05l597M068K106n750J56
2109b263O303k803n597M907L519n980j026N565j629l809K874J070k416Q75R52
2124E42k144J460K154l542o15M874j233n055L431L947m737j926N080L0m377J374
2140g37K765j545j376J639q18r0J188j539j053L158o04l714K022L365l328k707
2156c374M272J420m357%L848r18k469J277J531j368j42K43J39Q31l23j864R32
$$ plain form
2048 -4283 277 4059 -1226 -2439 1981 313 -2296 638 106 -1999 638 1104 -3426 -621 3788
2063 3788 -1495 -4248 2952 2639 -4396 -905 4387 -703 -3404 2382 2471 -2340 -174 1971 -660 -142
2079 -142 2042 -1313 -1072 3200 -158 -3828 2067 3195 -4000 -2242 4326 47 -4634 1189 3136
2094 3136 -2804 -1777 2526 -189 -1656 1185 34 -1103 1659 754 -2843 1225 3331 -2419 -2263
2109 -2263 4040 1237 -4360 547 4066 -1914 -2940 2625 996 -2813 61 1131 -1285 -410 542
2124 542 -1602 -142 2012 -1530 -2145 2729 1496 -3559 -128 3819 -918 -2844 2236 2266 -2111 -737
2140 -737 2028 483 -893 746 -72 -162 1026 -513 -1566 1592 988 -2726 -704 2661 -667 -3374
2156 -3374 898 2318 -2039 -2039 1809 891 -1578 -301 1230 -138 -280 -37 102 933 610 -1254 -322
2173c22K689k139k429K884J902l266j256L731k78l358J003K367p55k125N50J567
2189G65o00n02m22Q53O87j310j029K079J166k477r71K844M72k650k91K831k32
2206A213k799M68K560q30k255J063J756p02j613M58J645m53j189q5J257M66j620
2223f60o94K396Q50k926j99K983k85l439J251K860j423k658J973J660k259o07
2239a177J487K08n94j30p67Q71Q32j413j099K854M60l414J84M189j854l118K858
2256C77K382l284j045K983l94j889J048M32n47J70M7j746K181J456l350q85M265
2273B201j024m239K819L396l964j987M048K92l442Q86J983j198m52J057p96j31
2289e51K193k267j288M046j29m525K064L988l786k852M747J143m852Q29L319j828
$$ plain form
2173 -322 2367 228 -2201 683 2585 -681 -1937 1794 1516 -1842 -839 1528 773 -1352 -802 765
2189 765 165 -337 -759 94 781 -529 -1558 521 1687 -790 -1761 1083 1555 -1095 -1386 1445 1213
2206 1213 -1586 -1118 1442 612 -1643 -580 1176 474 -1139 -681 964 511 -678 -763 494 960 -660
2223 -660 -1354 1042 1892 -1034 -1233 1750 1465 -1974 -723 2137 714 -1944 29 1689 -570 -1177
2239 -1177 310 518 -76 -206 -973 -102 730 -683 -1782 1072 1532 -1882 -1698 2491 637 -2481 377
2256 377 2759 -525 -1570 1413 1019 -870 178 610 63 233 280 -1466 715 2171 -1179 -2064 2201
2273 2201 1177 -3062 -243 3153 -811 -2798 1250 1542 -1900 -1014 969 -229 -681 376 -420 -551
2289 -551 1642 -625 -1913 2133 2004 -2521 -457 3531 -255 -3107 1640 2783 -2069 -1240 2079 251
2305B51j703J797l6j084J080l66j680K767M83l578O45M483k779l545M087K210
2321C032m894k54M656j226l188J985J372j891J34J130j529O45J444k306n34L383
2337A959j108l880L146K714m500j212M735l55m365K295K687k664p26J938l87r16
2353f39J221n23r02K267m84k865K121K702l170k072M344L13m717J266L862k638
2369H6k273K380Q50j721M54K56p30P38N4j926Q59K848k393j917L379J115l805
2386a746K96L856j450k818K038K091k141r52J774q7n56L8m35n6J510j460j457
2403a555K012J308l380Q9L190q71l208J550K491k219j231K024N87j156o42Q50
2419a61N26l5n97n67J622O35j975j06K455o21k479R66K384j462k142J601J263
$$ plain form
2305 251 -1452 345 309 -775 305 -61 -1741 1026 1509 -2069 -1424 3059 280 -3265 822 3032
2321 3032 -1862 -2116 2540 1314 -1874 111 1483 -408 -274 856 -673 -28 1416 -890 -1424 1959
2337 1959 851 -3029 117 2831 -1669 -2881 1854 1499 -2866 -571 2116 -548 -1274 664 277 -639
2353 -639 582 59 -843 1424 940 -1925 196 2898 -272 -2344 2000 2313 -2404 -1138 2724 86
2369 86 -2187 193 1043 -678 -224 32 -698 40 94 -1832 -973 1875 -518 -2435 944 2059 -1746
2386 -1746 -1450 2406 956 -1862 176 2267 126 -826 948 861 305 343 -92 -148 1362 -98 -1555
2403 -1555 457 1765 -1615 -1526 1664 793 -2415 -865 1626 -593 -1824 200 787 -369 -1011 -161
2419 -161 365 330 -267 -834 788 1423 -552 -658 1797 1176 -1303 -337 2047 585 -1557 44 1307
2436A307j386j333J641P12j054r46P19R91n64j234M85J622p75j577J028J569q07
2453C98j941J292J531j359j140J469J359j335j342J471R31j409o77J082L75r10
2469b05n97Q59N33n41j191P57J179o41j578J088J450j376j448K050J364k465m82
2486a244J970L57j732P2J538k54p40J75j07J042m88j222K06J751r20j918J493
2503b1J774k538j174K847N03l128N46K557r87j734J112O94p29J27j9r5J153m19
2521D69j687J363J811j958j992L012J164l499P4L193r82k171J319J405j692m92
2537f63O53p0J68J36j051j3J934j079k034K609J516l379o55L548m70l122J862
2554a10J773j875j107J908N0q98L61K20n91R75k42k075J771J729k782j011L453
$$ plain form
2436 1307 -79 -1412 229 941 -113 -1059 -340 651 87 -1147 -662 960 185 -1392 -364 1205 398
2453 398 -1543 -251 1280 -79 -1219 250 1609 274 -1068 403 1334 -75 -752 330 705 -205
2469 -205 -802 57 590 49 -1142 -385 794 153 -1425 -337 1113 -263 -1711 339 1703 -762 -1244
2486 -1244 726 1083 -649 -577 961 707 -33 142 35 1077 589 -633 -427 1324 404 -1514 -21
2503 -21 1753 -785 -1959 888 1391 -1737 -1191 1366 379 -1355 -243 451 -278 -151 -170 -265 888 469
2521 469 -1218 145 1956 -2 -1994 1018 2182 -1317 -1243 1950 968 -1203 116 1521 -171 -663
2537 -663 -10 -80 88 224 -827 -840 1094 15 -2019 590 2106 -1273 -1928 1620 1150 -1972 -110
2554 -110 1663 -212 -1319 589 639 -259 102 322 -269 706 464 -1611 160 1889 -893 -1904 1549
2571A549j77l554J524K772k320j569K447P84k265N99Q43r12M81M6q14K56J717
2588A407j787j181K817L75l733J124L179k045k370K371J188k233j62K052p29r01
2604f28N69n9k66J234r11j351K161N36k241L01K874j853k432K363J726k591p54
2621a322K198O6j589L27P22k21j29k38m77R08N62j764PK213r26k194J456K090
2639A689j942j477K363N52j969N3J712m67p88j4K73L82o4n97K94J281o61j906
2657a286J275J285j367j420J906P69j640o28J414K07j357J61J051j83p87J17O50
2674A67M66o46q72J123P50r26j187J602P14j695m62J552O32j934k35J868j88j497
2692g68J71J159l09o58j67N68M76p77n94J127N25j177n03J454M45j597k93J991
$$ plain form
2571 1549 1372 -2182 -658 2114 -206 -1775 672 1456 -809 -210 633 -279 202 248 -566 -310 1407
2588 1407 -380 -1561 1256 1631 -2102 -978 2201 156 -2214 157 1345 -888 -1050 1002 273 -628
2604 -628 -59 -118 -384 850 -61 -1412 749 1285 -956 -655 2219 366 -2066 297 2023 -568 -1322
2621 -1322 876 942 -647 -320 402 181 52 -186 -663 245 807 -957 -950 1263 337 -1857 -401 1689
2639 1689 -253 -1730 633 1185 -784 -731 981 514 -274 -288 -15 367 303 -294 0 1281 620 -1286
2657 -1286 -11 1274 -93 -1513 393 1162 -478 -1106 308 515 -842 -681 370 187 -600 -483 167
2674 167 633 -13 -885 238 988 62 -1125 477 1191 -504 -966 586 1218 -716 -951 917 729 -768
2692 -768 -597 562 253 -405 -572 -4 472 -305 -899 228 753 -424 -927 527 972 -625 -918 1073
2710A073j2j761n4J335K13j212K56J006k95j237L42Q87J73j090j94Q86J13j033
2728f04l39J160N88j634l10J870k93j443J56K163p50j858J119J021o29q34N71
2745d6P15j62o55Q4M38O40j307k16J373n3k004M74K079q58j559P11J501j565j093
2764a503J467N52j135o9M33J39J83l89m74J237N03j562j29K049n31k052R67K213
2782A899j504j459J718M18j400L6Q56J8o96M0%L20J55q27n34J674K5k018Q49J589
2802A159j194j699J975J178k291j58J802n42q61L08R43l18j45l02l98R62K41j696
2820a036M59K123j291k145K317R58k493j49K137j53j670K26J437q85l40M43m44
2837e06N64K96j163K96J798r03j803J531J504j879j025K246J60j995M79J307o54
$$ plain form
2710 1073 1061 -700 -754 581 794 -418 -162 844 549 -688 -346 541 714 -376 -570 316 429 -604
2728 -604 -943 217 805 -829 -1139 731 438 -1005 -849 1314 564 -1294 -175 846 217 -617 -46
2745 -46 669 507 -148 -64 374 1014 -293 -509 864 811 -1193 -719 1360 502 -1057 -346 1155 -410 -1503
2764 -1503 -36 516 -619 -688 -255 -116 67 -322 -796 441 944 -618 -747 1302 771 -1281 -314 1899
2782 1899 395 -1064 654 1072 -328 -292 564 582 -114 -74 -74 246 401 -426 -960 714 739 -1279 -430 1159
2802 1159 -35 -1734 241 1419 -872 -1030 772 230 -631 -323 620 302 157 -145 -543 419 660 -1036
2820 -1036 -577 1546 255 -1890 427 1385 -1108 -1257 880 727 -943 -717 720 -165 -505 -62 -506
2837 -506 58 354 -809 -513 1285 382 -1421 110 1614 -265 -1290 956 1116 -879 -400 907 253
2854B53r83O54K06JMn08j59J156m99j327J175J104j468r86J909N45k315M79K060
2873A301p20j323J018K91j35m19K49r6M80l97o13N96R42j224j095J835J61j775
2891i24lJ973n63j566P99Q26q09m77P09Q9Ml61j25N93M31p42r03J698K18j650
2911g83J41J596k91j795R64J046o03j042P81N79n06o20L03O83j88o34n3Q23P8
2930D79j079J71J111k51j362L90J410r08q68N58J072o55p79O36P21m96q11M11
2948b50J016l53j309P44O14j38j057M33R03m97j067R47O53l75j055N58J013q28
2966d8r83R05R43q42k80L05O75p50n30P69N00n49o97O58P78p98o50P67Q67j206
2986a66r26J049R81j413o78J285M96j291kJ193k03r33J95P00L28m29p59L26J177
$$ plain form
2854 253 -730 -76 130 131 135 -373 -532 624 125 -1202 -27 1077 -391 -1377 532 1077 -1238 -759 1301
2873 1301 581 -742 276 567 432 13 262 166 646 249 -364 232 1174 -50 -1145 690 851 -924
2891 -924 -927 1046 483 -1083 -284 542 -267 -744 -35 54 58 -303 -428 165 596 -146 -1049 649 867 -783
2911 -783 -642 954 663 -1132 -168 878 275 -767 14 593 87 -533 -230 453 265 -369 -422 401 479
2930 479 -600 -429 682 431 -931 -541 869 -39 -907 -349 723 68 -711 -75 646 150 -661 -250
2948 -250 766 413 -896 -152 462 324 -733 -300 603 106 -961 -14 639 264 -791 -233 780 -48
2966 -48 -1031 -126 817 -25 -305 0 675 -75 -605 164 664 115 -582 76 854 56 -594 173 1040 -166
2986 -166 -1092 -43 938 -475 -1153 132 628 -663 -665 528 325 -608 -413 287 615 186 -573 -247 930
3005I30r12p95R99Q87j409p64J780O5j370K8J024q8r59K9P38J24l53m18L57M61
3025C54l77r51R08J061j424o29J607K74j342o1J283j72j288O15J095o57o06N76
3043B66k6j54L3n38L42Q44p51p74R62P16j478m27J800k89j365K94J548q12q18
3062f27O45K54m10l5J53o2M46n14l71O42R71j539m27J926j63j821M87J497j274
3081b22o37Q30O08j270J61P01l8J4k45m92P09J82p69j09J469j48j775N00J792
3100A261j052j089J033M04o41l26Q73j87m56J16J21J97L21j090RQ75j5j254M49
3119d51J338j126q56J116O45j103k39J042N7q59K92N04j64O2j79r6P27kj197M58
3139c1J074q72j036R12O93j333j66J000M40j222j77P99M33r04j4L10N12j55q95
$$ plain form
3005 930 18 -777 222 1109 -300 -1064 716 781 -589 -561 463 375 -584 -555 183 307 -46 -464 -107 354
3025 354 -23 -974 -66 995 -429 -1058 549 823 -519 -580 703 531 -757 -142 953 296 -310 266
3043 266 240 86 119 -419 -77 767 16 -758 204 920 -558 -985 815 526 -839 -545 1003 191 -627
3062 -627 18 272 -138 -173 -20 -82 364 -150 -521 121 1092 -447 -874 1052 889 -932 -445 1052 -222
3081 -222 -859 -29 579 -691 -530 171 133 147 -98 -590 119 301 -468 -577 892 744 -1031 -531 1261
3100 1261 209 -880 153 557 -84 -410 463 276 -180 -64 57 254 575 -515 -506 369 354 -900 -451
3119 -451 887 -239 -1095 21 666 -437 -676 366 423 -436 -144 360 196 258 79 -17 710 708 -489 -31
3139 -31 1043 171 -865 47 740 -593 -759 241 681 -541 -718 81 514 -390 -404 -94 418 263 -632
3158f32O42M61m01o10P44O07p99o44Q49O64j418R6R11R2r04K4O08j8l54m53M20
3179a15M95n86j81L95L90p73l76Q99N90r80n67J031M14j086M2R64l83l66l51J073
3199E29j37p34j14O38K78n47k24M90M61j172j28R90J68j045qJ047k31r04J00R74
3219D31k10p14N8Q70j03p09p0M89K42p30Q2Q44j71n40j32J009k18p99NJ028l06
3240C56p75Q3R70n07q51P58L94m79n22N36M19q8o38qQ01j79p93l1R53J14r42J12
3262c17J170o37q82O22R59j040j85Q26M1m02l89K49N12l77l90j1O06J26j108L52
3282b75Q16j63j311P80P81q24n93J030L44j004l2N75M4j54l19J3M51J12n48Q6
3302a91Q28n33p15N18P83r26n35J102K49j003j00Q89J76o50m03N35L26l25k68
$$ plain form
3158 -632 10 471 70 -540 204 811 12 -632 217 881 -537 -441 470 562 -342 -318 290 272 -82 -535 -115
3179 -115 380 -206 -387 8 398 -375 -751 148 738 -242 -809 222 636 -450 -408 556 173 -193 -544 529
3199 529 392 -342 -456 182 460 -87 -311 179 640 -532 -660 330 498 -547 -555 492 261 -643 -543 431
3219 431 221 -493 -435 435 332 -377 -447 42 284 -446 -364 480 309 -231 -363 646 428 -371 -366 662 356
3240 356 -419 -336 634 127 -724 34 428 -51 -573 -37 382 294 -344 -352 449 270 -523 -554 399 513 -429 -317
3262 -317 853 216 -666 -44 915 -125 -310 516 557 155 -234 15 527 150 -240 -251 355 481 -627 -275
3282 -275 541 378 -933 -153 628 -196 -789 241 585 -419 -451 124 168 14 -305 -292 159 271 -277 -191
3302 -191 637 104 -611 -93 690 -236 -771 331 580 -423 -523 366 542 -108 -511 24 350 25 -243
3321b43J23P71m09p51L53P78m30r06J215L17j260L1R57O2j025L65M36k58k98m2
3341b14K01K10j40m29K01Q08j011m83Q75Q38j078n18J327R0j346L6J229m27n86
3360d17J69L83P6l57N5P6M34k71o99N71O82r08o34J201n6p96q8J101k57r22J80
3381d77N09J83m41j64M70M12o98j99P82J30p04p74J386Q5j193L08J026l79p92
3400e30M54L68q7q39N62N16l67m53oM73mm0n56P66q3q49J40P99n3r20N74N48m16
3423ck28O8M32j86k56N0L91k88j03k68O98j52o44J23O79k50o67M78L68l59n59
3444f76N79M81k39o73N85K29l10j07K38M66n33n86O38K03j95o15N14N37l27n03
3464b94L41O15m15q03P78L68q02l38M32M89m39n52N03P44p65l95M62N19n05n43
$$ plain form
3321 -243 -120 651 242 -509 -156 622 192 -714 501 818 -442 -411 546 608 -417 -52 384 126 -172 -214
3341 -214 -13 197 57 -372 -171 637 -374 -857 18 856 -222 -740 587 677 -669 -633 596 169 -417
3360 -417 -248 135 211 -146 -91 -15 419 148 -551 20 702 -206 -840 361 305 -491 -579 522 265 -657 -477
3381 -477 32 215 -226 -390 80 492 -206 -405 377 507 -197 -971 415 500 -693 -385 641 262 -530
3400 -530 -76 292 205 -634 -72 444 77 -376 -382 91 87 47 -509 257 174 -675 -535 264 211 -709 -135 413 -3
3423 -3 -231 -163 269 83 -173 -123 268 -20 -123 -391 307 155 -489 -366 313 63 -604 -126 242 -117 -676
3444 -676 -97 384 145 -528 57 286 -24 -131 107 573 40 -546 92 295 100 -515 -1 536 209 -294
3464 -294 47 662 247 -556 222 590 -212 -550 -118 371 -68 -620 -117 627 -138 -533 -71 448 -57 -600
3484f00N39M33j62m05J98N70n14m85M75N28p65k85N69K80n43j80N27R0l42r9k1
3505a92N78l22n25K45N78o17n07O05O68p19m99J092L01r30M1M33J51o56J24L94
3525B43l1l42L5J26M45m29m23O24L17q36k19Q03j12k71m60Q75j8p51P8O65k44
3546G5m23J63M59l16pj84O62j39l94l28Q44M3p28k09J056j98q75K94N56j94m67
3567c10J56L97m51j33J90j8O50p64k04O90J31o70k68J014j28p45N30P42p78m32
3587d01O48Q5l10q5J81O7n3Km04M79Q1q35L06N41J66j237N25N34j8p77M27L32
3609B54n19k26N07L9j61P5QL40p1l39K3M56q3o60K07N44k23p52O65O55j042J6
3631b87O72k60n50k8N03J51m8l76K09L14l10k80O2P31k65q16N92M12m19l84M98
$$ plain form
3484 -600 -61 372 210 -195 3 573 59 -426 49 577 -188 -473 96 376 -167 -347 180 270 -72 -171 -192
3505 -192 386 64 -461 -216 362 -255 -762 -157 511 -208 -707 385 686 -244 -203 230 381 -275 -151 243
3525 243 212 -130 -95 31 476 47 -376 248 565 -271 -490 313 201 -70 -530 345 327 -424 -346 319 75
3546 75 -348 -185 274 -42 -49 -233 429 290 -104 -432 412 455 -273 -482 574 376 -499 -205 351 157 -310
3567 -310 -154 243 -208 -341 -151 -169 481 -283 -487 203 334 -336 -604 410 282 -463 67 809 31 -401
3587 -401 247 332 22 -63 118 185 132 134 -270 209 290 -545 -239 302 468 -769 -244 290 272 -505 -78 254
3609 254 -265 -491 16 55 -106 -31 -23 317 246 -93 -70 386 303 -357 -150 394 171 -581 84 739 -303 -287
3631 -287 385 125 -425 -453 50 201 153 -223 -14 300 -10 -290 -228 503 238 -578 14 426 7 -377 121
3652A21J75l52j45K16M81l54m33J82N52l68m88N87K29l83k75K81L88m62m32O53
3672A73L09p84k46P71q0k43k32L26K18k69l92N12J68l26O2qL77m66j74O36J75
3693E07q02j78P89J40q13n9Q05k43l86K00N3J52n66KP01J00n55k86N48L30o37
3714a98k09O99J11o40P2M49J87n97r9N09Q1o59J68J02K35m74j50N86J06n29j52
3735d02O94k68k57j12Q05k87m78J13N44k12l10Q6M84o0p39M37M43k24o83L51M73
3756C98l63m19J66O47l63l48J9M44J52p65P9M83J23q42N37L44k06l11J20M80n61
3777a86K0J93K32o0l52J5K95jn25J95Q01k17r75N92O59j022N0K39L35q5q05Q00
3799A98J90o87N5J86L14j37k03j63N32m15k33K39O94n83l47O51L74j057J2P66
$$ plain form
3652 121 296 -56 -201 15 496 142 -291 -109 443 75 -413 174 403 20 -255 26 414 -48 -480 173
3672 173 482 -302 -548 223 143 -100 -332 -6 212 -57 -449 63 231 -95 -33 -41 336 -130 -304 332 507
3693 507 -295 -473 316 456 -357 -416 389 146 -240 -40 13 165 -401 -399 302 402 -153 -439 109 439 -198
3714 -198 -407 292 403 -237 -165 284 471 -126 -225 284 365 -294 -126 -24 211 -263 -413 173 279 -250 -402
3735 -402 292 24 -233 -345 460 173 -305 -192 352 140 -170 -84 400 340 -399 38 481 257 -426 -75 398
3756 398 35 -384 -218 429 66 -282 -263 181 333 -432 -353 130 253 -589 -52 292 86 -225 -105 375 -186
3777 -186 -166 27 259 199 -153 -138 157 156 -369 -174 627 410 -565 27 686 -336 -286 -47 288 203 -602 198
3799 198 388 -299 -244 -58 256 119 -84 -247 285 -130 -363 -124 570 -13 -360 291 665 -392 -380 386
3819C86k17k33J48K7K3l16k21M66P9k1l36M42j7l57l72P31J98p62r6R56l40m70
3841c02N6L86Q1j37j13J3L45l73m39O31L86p25J75L27J88m05l96O04k52k55L6
3862a69K83Q8m20K19J32k63K47n24O03P9n12j38N01L58o00J4O06j16p39L33L81
3883C63p3l55p9K74K5m09O1M51j34l96J86L23M46q82j43P54k35l01N2L52K1n96
3905b95L31M56m77k15L83J9oj86k15N00m38J3k31R23m94m69M00M46n20k08p8Q88
3927E27l11o81K16O54m48n14N15M15k45l97J15M56k1o69L87O14l85n64L08M97
3947D69j73m75L14L15l11m07K74L75m09k61Q0M87l95k39L29J88mm48L63K41l51
3968c8r4J07K85k57m06O70n9k20l51M85K58m17k44J70N72m83k83J70K16j22l3
$$ plain form
3819 386 169 -64 84 111 134 -182 -403 63 142 121 -215 227 210 -147 -519 212 410 -352 -448 508 168 -302
3841 -302 -246 140 221 84 -29 -16 329 -44 -483 148 534 -191 -16 311 499 94 -302 302 50 -205 -169
3862 -169 114 202 -218 1 133 -130 117 -407 196 275 -237 -375 126 484 -116 -102 504 388 -351 -18 363
3883 363 290 -65 -144 130 155 -254 -193 258 124 -272 -86 237 683 -199 -342 412 177 -124 -72 280 301 -295
3905 -295 36 492 15 -200 183 202 196 10 -205 295 -143 -130 -361 562 68 -401 -1 445 -75 -283 -361 527
3927 527 216 -465 -249 405 -43 -557 -42 373 128 -269 -154 302 281 -388 -1 613 228 -336 -28 469
3947 469 296 -179 135 450 139 -268 6 381 -28 -289 -209 278 -117 -356 -27 161 157 -291 72 313 -38
3968 -38 -132 -25 260 3 -403 267 208 -12 -363 122 380 -37 -281 -111 461 -22 -305 -135 81 -41 -74
3989g4J3L19l65k96K14J51l01J07K13N7k51k8N26q7l66k28M22M26o02k5K52J52
4011B29k03j58R6J61l07q8N68Q6m59l26K17K07j0K0K20k46k32P9K47j39J06l42
4033b74L79J80p31K11N21l01k0k84P74r7n37J26P51n30m23J74J28J16k56K5L75
4054C07n4l45J70P4J00l42j54M60l9l93jO57m6p21J46M39k09k62K84L6k06j61
4076b60J00J85j0L2k18L94J81p25J78L08q0l91K3N76m16k35J68O1J21l30K84M74
4098D20l14o0P0J48j09k89J54K31k67m17M17O58m47n95M66J62l25l49K91M12l02
4119d5K66j49Q9P5p73J21P68l59k29L09L64n32l28N73pj50l64M87J24k63l08N62
4141B31j9j52l01J81K45k78l8P3M36l25l80J82M15m49n1M60j29l14J13Q4K60k65
$$ plain form
3989 -74 -61 258 -107 -403 -189 -38 -339 -232 -19 38 -213 -241 285 198 -168 -396 26 452 -150 -175 77 229
4011 229 26 -132 -36 125 -182 -270 298 384 -75 -401 -184 23 13 33 253 7 -225 -146 101 -38 68 -274
4033 -274 105 285 -446 -235 286 -15 -35 -319 455 358 -179 -53 698 168 -255 -81 47 163 -93 -68 307
4054 307 253 -92 78 152 252 -90 -244 216 177 -216 -217 440 394 -327 -181 258 49 -213 71 107 -99 -260
4076 -260 -160 25 15 47 -171 223 404 -321 -143 165 85 -306 -283 293 -123 -358 -190 -129 -8 -338 -54 420
4098 420 106 46 116 264 155 -134 20 251 -16 -433 -16 642 195 -400 66 228 -97 -446 -155 257 -45
4119 -45 221 72 161 236 -537 -416 352 -7 -236 73 437 -95 -423 150 143 -7 -371 116 240 -23 -331 231
4141 231 212 60 -241 -60 185 -93 -131 -58 378 53 -327 -145 270 -179 -230 230 101 -213 -100 -16 244 -21
4163b1j58K83K39m26k19M27Lk06j63J76L81k04l96M53P1m77K17K14k43j41o5K97
4185D2O3l15Q5L19j53j91mL63j31k4r5M5M35o22J59O0m8P4j77L99k70l00M10J56
4209B80j38m2k21K95j64j48LK43k34j05K6J04L82l50j74K70r0k12j1M36j05k00
4231a55J34K1K30o38K46N91l42j65n8K87J64l66K72J40k41k05NK77l0l73Q6M74
4253C54l49j78J43j34J51J13L1J89k57o5l4L20k65k89K67M16k31m27K50J8K06
4274B29o44N06P8k67N7l0K70l60l99N79L54m76j6j08M82n3o47K52N61m49j06J80
4296gJ24Q2j76J16R8k24r3J48J85n40J07K77k4j60J6J67Q6r4m22K53M87m66l10
4319c70K54L90n16O8K71J21j72j33M3K01p7j66p5N56m01n0J64J02j05l61M47j2
$$ plain form
4163 -21 -179 104 343 -83 -302 125 128 -78 -241 -65 316 112 -284 169 240 -237 -20 194 -49 -190 -255 42
4185 42 105 -210 -125 194 41 -150 -154 209 78 54 -41 4 439 -183 -24 36 -12 62 -115 284 14 -286 124 280
4209 280 142 100 -121 174 10 -138 -135 108 -126 -231 -205 -101 281 -69 -243 27 -63 -275 -286 150 45 -155
4231 -155 -21 0 230 -408 -162 429 87 -78 -136 151 315 -51 221 361 120 -85 -80 197 167 -206 -120 354
4253 354 5 -173 -30 -164 -13 100 131 320 63 -2 -36 284 19 -270 -3 413 182 -245 5 23 229
4274 229 -415 91 169 -98 -41 -71 199 -161 -560 19 373 -103 -119 -227 255 202 -445 -193 368 -81 -187 -7
4296 -7 117 199 23 139 237 13 -80 68 253 -287 -180 97 73 -87 -71 96 182 88 -334 -81 406 -60 -370
4319 -370 -116 274 -242 -174 97 218 46 -87 -44 157 80 -86 -161 395 -6 -56 108 210 105 -256 191 179
4341A79m50K39O6n9j38k79O52k08k50n6L22K94m28o1M01mm24J17K77%j72j93M48
4364B73ql79M2K28O7n95M22M35n14k91M05N9J50l71k04K85L4j48q7O74l78k24
4386a25M8L16j25q9PQK11l89Q6J95J7l37J42K23k9r3k06O09l93l89L26O2J92n34
4410b67k7N19k87j42P1L15j77OM6J18o1k70j70P01l46l74K29M41k72k80J88J52
4432A13pl84O33r6j87j35J90l5mj28j11L37l06j65R7L50k22j61K19J75k23j14
4454a64J43J43j52M2j0Q0k40j26Q3N50m09r5J73L04k96k40N92j87j25k25J34J88
4476A63k21q0K61R0k53j57L09J56k45n59P75l9l55l3L91N6j12q4J2J20k78r9K81
4499I9K14n47M4K26K83j48k44R1p3k99L02j7K53L8k98M1J99l05N2J36j42r8m4
$$ plain form
4341 179 -271 -32 34 -25 -163 -442 210 2 -248 -304 18 312 -116 -177 224 220 -204 -87 190 190 18 -175 273
4364 273 265 -114 -72 156 223 -372 50 485 -29 -320 85 144 294 -77 -281 4 38 -110 -197 477 99 -125
4386 -125 -77 239 114 25 32 40 251 -138 -52 143 160 -177 -35 188 159 66 -140 469 76 -313 13 75 267 -267
4410 -267 -294 225 -62 -204 -133 182 5 11 57 175 114 -156 -326 375 29 -345 -116 325 53 -227 -39 113
4432 113 106 -278 355 259 72 -63 127 92 88 -40 -151 186 -120 -285 -188 162 -60 -221 -2 173 -50 -164
4454 -164 -21 122 -30 12 2 82 -158 -284 -201 349 -60 -155 18 322 26 -214 378 191 66 -159 -25 163
4476 163 -58 -138 123 213 -40 -197 112 268 23 -536 239 200 -155 -188 203 259 147 63 75 195 -83 -182 99
4499 99 313 -234 -190 36 319 171 -73 18 -55 -354 -52 -69 184 222 -76 -35 164 -141 -89 47 -95 -193 -237
4522b37J47N53o36n4N16j12n66K14M02N3k49j69L52k73r9qK94N7l09j62O09k41
4544H2j21j58M33k76j42k2M20k26j35K6O34n21o1r9L49j12P8k33L87k17l77L31
4566D0K27q9j99q2K00K67n92K68o4J55m48K19L08j30j43j08J36J66n26L10Q4K5
4588B4j80R2J98m4j69j68L04J26j57j5J59k22O1J58j63K25l44L6O6l08K75R4M3
4611I1k26m12P30J69m96j3K90n4k77M6J90p6k4r0J28L94m40r9R1L94k82n35M04
4634i7J69j18k16L69J80k49q9K96m5k20l04P89n29j46K09J06J33j66j03J54P7
4655B00l4l93M48K04n84O1K25j2R5r9j75K50k53j60O08j95k54k4j06M27l70q8
4677b29M40k44j61l0L72o3l63J40K06J33l90p2P61l89j15l29K58L59l67J95L6
$$ plain form
4522 -237 -90 463 -173 -227 289 177 -389 -175 227 280 31 -138 214 -59 -158 -166 128 185 -124 -286 323 82
4544 82 -39 -197 236 -40 -182 -204 216 -10 -145 -119 515 -6 -67 -166 183 71 149 -84 303 86 -291 40
4566 40 267 178 -21 -103 97 364 -228 40 -24 131 -317 -98 210 80 -63 -171 -35 131 -395 -85 -1 24
4588 24 -156 -64 134 90 -79 -247 57 183 26 11 170 -52 9 167 4 229 -115 -79 -13 -321 -46 48 91
4611 91 -135 -547 183 352 -144 -157 133 79 -198 -152 38 -38 -62 -152 -24 370 -70 -169 -78 316 34 -501 -97
4634 -97 72 -46 -262 107 287 38 -51 245 200 -20 -324 465 -64 -210 -1 105 238 72 -31 123 200
4655 200 166 -227 221 425 -159 -98 127 115 210 111 -64 186 -67 -227 381 186 -68 -92 -198 229 -141 -229
4677 -229 211 -33 -194 -224 148 85 -278 -138 68 201 -189 -261 500 111 -4 -333 -75 284 -83 112 148
4698A48K09o02l2L87j65J04j33J7m7po0L26J9k88j82N51q8m42M85l5l72P0o2N45
4722C46k52l77L50K12k16Lp6L72j28m55L00j92O9K14k67K67k85q2K59L6K7m26
4744c01L86j44J01m02J44K46j9k49J74L79om92M41j64j45k93N46m4j43k09j0K36
4766C2o6j84J13K91j96k54K55K94l77J4p2N56k46j13j03J91p6l65L50J59k7j41
4788C5j1L18k53k48K15J08j54P8J27o9k16j56N3L11j32j82K00J32j32l04M05J75
4810C00o04M8K94L50k85k60K09Qk20n9M34p5j92k59K88J35j31p3M7K61m84j11
4832c79N76Rl5n06M14p0k70P1K19O3q9k61M56Q5k88k01L50M0k87J26O7K0l23J52
4856f1L76m60J51p2K24l5l63J43M75k31j32j59L26J07n89K87P6O4l53J35J15r0
$$ plain form
4698 148 357 -245 -277 110 -55 49 -84 -67 -114 -121 -181 145 164 -124 -306 245 157 -285 200 165 -207 -137 -199 346
4722 346 94 -283 67 279 63 66 -10 362 234 -221 79 -113 -44 170 -97 170 -115 -197 62 98 125 -301
4744 -301 85 -59 42 -360 -216 30 11 -238 -64 315 309 -183 258 94 -51 -344 202 158 15 -194 -204 32
4766 32 -34 -218 -105 186 -10 -264 -9 285 -92 -78 -150 406 160 47 -56 135 59 -306 44 203 176 35
4788 35 24 342 89 -159 56 164 10 88 215 146 -70 -226 -173 138 6 -176 24 156 24 -280 125 300
4810 300 -304 -256 38 388 103 -157 52 60 -160 -219 215 140 -52 -311 -23 112 -19 -92 -45 216 -268 -379
4832 -379 197 206 171 -335 79 9 -261 -190 29 92 3 -258 198 283 -5 -206 144 184 -103 23 90 110 -213 -61
4856 -61 315 -145 6 -66 158 123 -240 -97 378 147 15 -144 182 289 -300 -13 63 127 -226 -91 24 -66
4878f6j74Q6J20J32j04l1K40r9l25Q6L63j15l88J72L08j90k15J42n4N2j44O3L15
4901A74j35l14J56L46l75lJ02K13l29l88L25L14N3l45M34l8m90Q2R8J80j56r0
4923a86mM64l79k05K86L19j00m00J64J71K0m43L45K82o19J34J00L32l88k47M27
4944G3J12k16l28K18L56k99r6M26j80k76J2J10L28k04j17J00J66k08k2M15l91
4965b1j51K6K95N9k71j27L88k7j81j99K02K33m31Q9K82j31j44p8N27m4l45P2j66
4988a43P11o45K99j33J0j24k89L90l6n0l34N58l43m0M2M04k23j40J1K99j38l42
5010b56J95J07q0j31K13K02K9m62K14L92l39j08N3o3K45m94J67J60J26k70n7K8
5032a29K87k35L9J82k3k81lJ83J21l44K13M58m99J78p8K45%o49J97K89j73m47
$$ plain form
4878 -66 -240 -154 -34 98 -6 -37 203 104 -221 -135 228 113 -275 -103 205 15 -200 -58 -112 -60 -204 -141 174
4901 174 39 -275 -119 227 -148 -151 -49 164 -165 -553 -228 86 139 -206 228 190 -300 -218 -120 60 -96 -186
4923 -186 -190 274 -105 -310 -24 295 195 -205 -41 130 150 -293 52 334 -285 -151 -51 281 -107 -354 73
4944 73 185 -31 -359 -141 215 -84 -180 246 66 -210 -198 -88 240 36 -81 19 185 -23 -45 370 -21
4965 -21 -172 -146 149 208 -63 -190 198 171 -10 -209 -7 226 -205 -116 166 35 -109 -187 340 296 -49 23 -143
4988 -143 568 -77 222 89 99 -25 -314 76 40 -10 -344 214 -129 -169 -127 277 54 -86 -75 224 86 -256
5010 -256 -61 46 -34 -165 48 250 279 -183 31 423 84 -24 29 -34 211 -283 -116 44 170 -100 -157 -129
5032 -129 158 -77 -38 144 121 -160 -163 20 141 -203 10 468 -31 147 69 314 314 -335 -138 151 -22 -469
5054d69N56L5j76l78M16K03m09K5M93j72k57j48L17J13l05n4N3M31j43M5j94L07
5076B89k19L1j08L54l35k65J18K77J22o00L76K47l62l57N42l56L72l68J97k25
5096b70K48j99M62k27k23j66M89J93m22N0J19N3j52PJ14J70l3j43o5K02n90L11
5118g2ML16l42j03L52J11n00J63K48m8j27k25J43L64m82K6L73n6l68O4K47J64
5140B52k42M1K0Q4j77l22N08j67j60j75L53K93o17K42K63O3P2m36K55k08R1j73
5162a40J42k0r1N6J58K9l26O4K96o7j88J05K49j78P4j61M18j27n86K18K19J52
5184B96l84j5M08k23m0m3J28k61j58K77K13k38k77K04N20l05m51J76N65k26l45
5205a79K54K12j79l17l5L48j59l9n0M84l21k12k0L59j55j99n5N07l59k7L46j64
$$ plain form
5054 -469 87 122 -54 -432 -16 187 -222 -197 296 124 -133 -281 36 149 -156 -210 -157 274 131 176 -18 289
5076 289 70 101 -7 347 12 -253 -135 142 264 -336 40 287 -75 -432 110 -246 126 -242 -45 -270
5096 -270 -22 -221 241 14 -209 -375 114 307 -115 -65 54 107 -45 -38 76 246 213 70 5 207 -383 -72
5118 -72 -68 248 -94 -197 155 266 -234 -71 177 129 2 -223 -80 284 -198 -172 201 145 -223 -159 88 252
5140 252 10 51 71 155 -22 -344 164 -3 -163 -338 15 308 -309 -67 196 259 331 -105 150 -58 33 -140
5162 -140 2 -18 -109 -53 105 134 -192 -128 168 101 -87 18 267 89 163 2 420 293 -293 -75 144 296
5184 296 -88 -103 305 82 42 -1 127 -134 -292 -15 198 -40 -317 -113 407 102 -349 -173 392 166 -179
5205 -179 75 287 108 -209 -244 104 -55 -94 -144 340 19 -193 -213 146 -9 -208 -263 244 -115 -142 204 40
5227D0k07k43O95rj03j81n2J08K5k66J70K68k47j02j02L12k01JM14k57j2k51J7
5250a83N30j66n43N70P7m74j24K54K06l01k25K54J47J0k39J12J48j08J8J71m1
5271I3k30rJ41J54L7j8l74J84m5r0K06J93n94J99J24K94k20m32N77j52l92K93
5293f1L65l19J2l51N22K5l5j97K29O6l07k4M4K64m26Q5K80Nk81J54M6J04j22k06
5317a28Q8J75m33K27J47Kk94K87M2N8k49J23J59l16j20J51K93l28J68k66L91k05
5339b8j8J28Mn9j05P2M3J75k44k3K37j00k94L34n4J06k81M1J17k30O2j38L30K45
5363C20m75k5K47O7k06M6K66o8j91J9J36k2j45J62K59l88k89L55M1l8r9J87j75
5386a6Q3k11K61J06j28j22O3K2M9k35K04l8m2L7J77P0n64K48J34K00k57r9o1J62
$$ plain form
5227 40 -167 -410 285 276 173 -8 -60 48 73 -193 -23 245 -2 -104 -206 106 -95 -94 320 63 51 -200 -183
5250 -183 347 181 -362 208 285 -189 -313 -59 147 -154 -379 -125 22 32 -207 -95 53 -55 -37 134 93
5271 93 -137 -146 -5 149 186 168 -206 -22 -67 -157 49 242 -352 -153 -29 265 45 -387 190 38 -354 -61
5293 -61 304 -15 -3 -354 168 193 158 -39 190 256 -51 -75 -31 233 -193 -108 172 177 -104 50 96 200 78 -128
5317 -128 -40 135 -298 -71 76 78 -216 71 113 171 -78 45 204 -112 -232 -81 212 -116 52 -214 177 -28
5339 -28 -46 82 86 27 -78 -6 37 212 -32 -55 182 82 -212 122 68 174 -107 -66 51 -179 -117 -255 75 320
5363 320 -155 -180 67 134 -72 -26 240 172 -19 0 136 114 -31 131 390 2 -287 68 109 71 -28 159 -16
5386 -16 67 -144 117 223 95 -27 36 58 107 -128 76 38 -4 33 210 280 -284 -36 98 298 41 -58 -119 43
5410D3r8%j82M47o6j43n1O1r2j40M04q7j60j97L12j98K83m57K73K48j98j00J20
5433B2K58m43K25Q7M3l34J51N5P9q9j77J40r4m3j8K67J9r7l37L65k45r5j62M22
5457ak1J11l17L09o6j13j46L41j08n7q4K68P8l64M4N26j28l31k8o1J44J9k22K80
5481G3J7k73k7L62j08l16O2J60R0k12k15M37J27j67k12J84M03n99K56L0j20J85
5503A37k60J6k9L2L1K48J0k32R3k73M16l17L7M6J19k57Q3M14k85k81K67J85k81
5526h1j04N7M71m49O6r7L39p9j28j02K75j11n7p9K66q4l55K81J88n42J02J08K95
5549A80j93l60J31M42j47j45k6J32L1l35J23K76p9l02K93j31K2l2K77O6l36J31
5571A8M33l07k39Nn4L16k20j87K93K29l62P5k4j47L88k11o1L28l02k24k3K90J29
$$ plain form
5410 43 -55 -55 -237 210 144 1 -50 11 -81 -221 183 96 -64 -261 51 -147 136 -321 -48 200 2 -98 22
5433 22 280 -163 62 149 192 -142 9 64 143 54 -123 17 -77 -120 -138 129 148 51 -286 79 -166 -261 -423 -1
5457 -1 -22 89 -228 81 15 -98 -244 97 -11 -68 -152 116 194 -170 -126 400 272 -59 -87 -148 -4 15 -207 73
5481 73 90 -183 -210 152 44 -272 -210 -50 40 -172 -387 50 177 10 -202 -18 385 -214 42 72 -48 137
5503 137 -123 -107 -136 -104 -73 175 185 -47 46 -227 189 -128 -91 -45 74 -183 -100 314 29 -252 15 200 -81
5526 -81 -185 -128 343 -106 -40 -137 202 123 -5 -107 168 57 0 -79 187 103 -252 29 217 -325 -223 -115 180
5549 180 -13 -373 -242 200 53 -92 -118 14 45 -290 -167 109 30 -272 21 -110 -88 -120 157 223 -113 18
5571 18 451 144 -95 -90 -144 172 -48 -235 58 287 -75 0 -24 -171 217 6 -55 273 -29 -253 -276 14 143
5594A43k97Q5L48l34m32O11j67n0J01J14K04l01m04L62L86m24j37K73mk74J47
5615e0M1K6j13k36o8M95k64j33K94L81k38m05M59j43m6Q9J06J04l60k0r9K76l28
5638b32L30k31J41k87k7L49l2k05j74K47R5k51J92j5J66j38j51M32K0j55l36K99
5660C7l1n2K11k4n3q1r6K92m67J5L74J14l19j07J03J03J9l02J63K33pk56J00m1
5684g2K54q3j50N1J35m32J95R3K04m35J36J47M0j13K27J14j30l99J28L60p0j24
5706G6n7J38q2l84K52J27n7j84K60J04j76K4k77N93l48k77M63O1k72j94K02J21
5728A13K8j48RJ76j42j77J25M16n17j35N14k60m1k25K29K28j44j2N9J02l92m4
5750b38J35O45m76k15J72L04j34n28K68P4J21q7p8L44l46O0j07R2P0k08J41K6
$$ plain form
5594 143 -154 -69 279 -55 -487 124 -43 -93 8 122 326 25 -379 -17 369 -55 -192 81 77 -197 -50
5615 -50 -9 17 -96 -332 -400 95 -169 -302 -8 373 135 -270 189 46 0 89 195 299 -61 -81 -180 96 -232
5638 -232 98 -133 8 -279 -306 43 11 -194 -368 -121 -26 -277 -85 -100 66 -72 -223 209 229 74 -262 37
5660 37 6 -46 165 141 88 7 -89 203 -264 -249 125 239 -80 -187 -84 19 38 -264 -101 132 125 -131 -31 -72
5684 -72 182 99 -51 0 135 -297 -102 -9 195 -240 -104 43 83 -30 197 311 181 -218 -90 270 200 76
5706 76 19 157 75 -309 -57 70 13 -171 89 193 17 41 -236 357 9 -268 195 256 -16 -210 -8 113
5728 113 141 -7 2 178 36 -141 -16 400 -117 -252 262 2 -39 -264 -35 193 49 37 96 198 -194 -238
5750 -238 -103 542 66 -149 23 327 193 -335 -67 7 128 41 -37 307 -39 21 -86 6 76 -132 9 35
5772C5k39O3K70n3l19r2K47R8M8k29Q0L27j92k23L85j20n9j14K42l4j16j05O3
5795c7K82k64k11N11l03o8P2RJ18m66L19M63j80l87r3K94Ll18K06J49jk82K38
5818E4J27j88j74J50J11k8l27L47L24l63r5r9K39N6k80L29j34j0j5r3K04pn92
5841d64K53M09k01N7l25M34j30m05K96O2L88o04J34J67R8k58J54J96Qk49j72L40
5863A88j03j66n4K14n4l07L60j8m2j91j39M39j16r5j30M16j60k79Q5M13l39J03
5885B5J05J40m26J47J24o2ql30K61L65J5m95K50R8j4o11K85K98k30l02J82L09
5907A26k48jL0J01n8k08M06J49m69R6l1K49j12k4J34j26j28n2K35%j11M3J29j55
5931b5K7k93L46j74n5n5J35L86k56k7j06K67m16k04O07L3k56k75L97k78J79M8
$$ plain form
5772 35 -204 -141 129 76 -243 -335 -88 10 58 -171 -91 236 44 -179 206 86 27 -87 155 121 5 -100 -37
5795 -37 245 -19 -230 281 -22 -90 -18 -9 109 -357 -38 425 245 -142 -235 59 62 -256 -50 99 98 -184 54
5818 54 181 -7 -181 -31 80 52 -275 72 396 33 -62 -161 78 134 -146 183 49 39 24 -69 135 128 -464
5841 -464 -211 198 -3 54 -271 163 33 -372 -76 -14 374 -230 -96 71 169 -89 65 261 269 20 -152 188
5863 188 85 -81 -135 79 25 -282 78 60 18 -173 -312 127 11 -84 -214 202 42 -237 -152 261 -78 25
5885 25 130 270 -156 -9 115 53 45 -285 -24 341 356 -139 111 209 195 -416 -131 167 -63 -365 -183 126
5907 126 -122 -123 -93 8 -50 -258 148 297 -172 -76 -107 142 30 6 140 14 -114 -166 69 69 -42 1 130 -25
5931 -25 2 -291 55 -119 -174 -229 -94 292 36 9 -97 170 -246 -450 157 190 -66 -341 56 -222 -43 5
5953Ej9qJ22l55L65l3k46mJ74L7k18M3J4M76m75N0K34o8k57J52L06k81k34j0M58
5978B28j13o4j22K57j9j83P1q6NN6j13j35K83k70m8L44K59p01O85j09n6k67n2
6001a50J86N1l58J55P5K39j66r5N1J45k9r9OJ1O8k47M19r8l4j85j02K29j49J2
6025f5J02J0k20o3N65n25J46k47L79m8l05K02QJ23k69J88j11J25o2J64j84J90
6047A03m59M27j03R5k36K27J50L6l56LM18l89J2N3J70k76k29L55k7N1Jk7J11R7
6071B07m86J99j0j85J37K58p8j23k8K04j11o7M1L13l22K05l67K58J93l56j42L22
6093F2K10n88J41J93K45k11q6n2Q7K00o33M82Q7L4k88K25m9j44K08P0J76n30J62
6116AJ08O3k63m6L64k41J9j53Q2K46j52k13M18j24j76j91L22J55l59K30k14M26
$$ plain form
5953 5 -14 -22 100 -255 110 77 -169 -173 1 38 -180 -137 -123 353 -122 -72 162 94 -163 -11 295 14 -220 -230 228
5978 228 115 51 -71 186 167 -16 55 -31 -26 30 -83 -218 65 -205 -253 91 350 -351 334 225 169 -98 -150
6001 -150 36 87 -271 -116 -41 198 32 -63 -12 133 104 5 11 22 90 -157 262 164 130 -55 -157 72 -77 -65
6025 -65 37 47 -173 -236 329 -196 -50 -297 82 34 -271 -69 -61 62 -207 -19 -130 -5 -67 97 -87 103
6047 103 -356 71 -32 63 -173 54 204 240 -116 -113 305 -84 -72 -19 151 -125 -354 1 -26 25 26 -1 110 207
6071 207 -279 -80 -90 -275 -138 120 42 -81 -109 95 -16 -83 -42 271 -51 154 -213 45 238 -118 -260 62
6093 62 272 -316 -175 18 263 52 -34 -86 1 201 -432 50 137 171 -117 108 59 -85 123 193 369 -161 1
6116 1 109 172 -91 -137 227 -14 5 -148 -66 180 28 -185 233 109 -67 -258 64 219 -140 90 -124 302
6138C02k24n0M9K6k26k4L03n4O5m26K62N0J3k40K5K95Q2j54J04p0m56K46N4P6
6162B8l95M44j2Ql18L93J91k23m21P9L87r0j15J16P5L3k95LJ82n1k33J43L42N8
6186C29m85L59j66K10l72J24R2k7j37N9J05j06j3j25N48l11l84K29N56n69J04
6207B0nR7j41j71P9M04j04l24J60J02J17n25K71j28K66j40p2J90l09P3l2K60m7
6230D1k52J87K76m39J78J11q5K31l36J38J02j2j07NK91j41o44O02R0l35j69K07
6252f1J59j61p9J94M7k21l3m4J3K23j18p2N9n3L8L40k48o2k28L79J74l19j82K79
6276B4J25j73l34K58M13l02j90K20J55k17m2n3K17m6j36n5J24j94o7L08or9r4
6299a64J99p0j22K29K67k24j95LJ71o6k8j70K33Qj01l99M21L58l89q5L69k95l70
$$ plain form
6138 302 78 28 77 103 -123 -147 156 102 167 -259 3 53 66 -174 -149 146 228 74 178 108 -348 -102 -48 28
6162 28 -367 77 65 73 -245 148 339 116 -305 -226 161 71 -44 72 147 180 -115 -112 70 19 -214 -71 271 329
6186 329 -156 203 37 247 -125 -1 91 64 -73 -14 91 -15 -28 -153 395 84 -300 -71 485 -84 20
6207 20 15 112 -29 -200 -121 283 179 -145 15 117 234 -291 -20 -148 118 -22 -94 96 -213 -140 -172 88 41
6230 41 -211 -24 252 -187 -9 102 17 248 -88 50 152 140 33 38 329 188 -456 146 236 -99 -268 -61
6252 -61 98 -63 -142 52 99 -122 -155 -199 -186 37 -81 -153 -94 -147 -109 231 -17 -79 -307 72 246 -73 -255 24
6276 24 149 -24 -358 -100 313 11 -179 41 196 -21 -63 -116 101 55 -81 -136 -12 -206 -273 35 29 -70 -164
6299 -164 35 -35 -157 72 339 115 -80 -77 94 28 0 -170 63 71 -30 -429 -8 350 -39 -124 245 -50 -420
6322d20N33j78L62j34j03j71J75k96Q0J2M73l35j56J73K6r5L2K60j68j56J73m
6344H3K56l01l94K27J04k53M00r8J47k61l0L69r7k15j51M29k79j52J85l4k5m2
6366a32K9L53n54K50o9K92k23j90L27J91l37k43K84J31o3k16J71J94Ol69J02J52
6388H6k7j92m9J55p9lK53J89k7l11j32L53l40k6O7L19l7m30M82j23k64pL05j97
6412c5j27m5L50Nr7J09M6qj78l7l8K13K3k53M18m56Lj10L09L36n63K6K02J14l15
6437a08J15%j09O6k19L00M1J8k04L30r8J37n31K24K84m01J88R8j48K3J03k00R2
6460Aj87J53J18J0k90m2K93K79o08K75o5J70k23l8L62j39j3q5N3J1m2k38M61k14
6484Bl6j66J64j0K92l42Q3J05O7j63L10q1m75J25Q9J41j39O5K91m61j27L13N7
$$ plain form
6322 -420 113 -65 297 163 60 -111 64 -232 -152 -140 333 -2 -158 15 41 -54 -22 238 70 -86 87 83
6344 83 339 38 -356 -129 -25 -278 122 24 171 -90 -120 249 152 -63 -214 215 -64 -216 -31 -65 -90 -132
6366 -132 -103 250 -304 -54 -123 169 -54 -244 83 274 -63 -306 -22 109 46 -170 1 195 201 -168 -66 86
6388 86 59 -133 -182 -27 -106 -109 144 333 306 -5 -137 216 -124 -150 -83 236 199 -231 251 128 -136 -143 162 -35
6412 -35 -162 -207 143 148 51 160 206 198 20 -17 -55 158 181 -72 346 -110 -107 -217 92 428 -135 -109 93 207 -108
6437 -108 7 7 -102 -36 -255 45 86 104 -100 230 132 269 -262 -38 246 -155 33 131 -17 6 109 -91 1
6460 1 -186 -33 85 95 -195 -237 56 335 -273 2 -63 107 -116 -154 208 69 56 -29 24 35 -7 -245 216 2
6484 2 -34 -200 -36 -46 246 -96 -13 92 159 -4 306 225 -250 -125 -36 105 -34 31 322 -139 -266 47 104
6507A04j1l84j83O12m8j1l4Q9q7j33j91L19n7k3o4j7J79Ok33K88l9ql65N49K3
6532B81j13Q4l55J78k56k7M60k88j53L22J49l78k35L65O6j17j18Q9L45k90O9k59
6554a81L67M5n04J21L08j90j46K95k00L3l06M14J28l37J21K07N2k61l14K63Q5
6575@j14P4m0K04M8k26l03N71r1k15J60n4K1j64J79j00j00OK14M2J9k40m5J91
6599C7m9J84j34K15k47l54L70K9l4m9P2R1l67j92M12R7M3j09L7m2M6m8K62k25
6623D5n0o8K36P2k09L8o8K03k71r0K85Rk65N8J08j06J85j77j33M36j74k73M04
6646A95k57J68k60l0K15k51J65J86k29k62L42J52J52l28k77K69J93Jo3M9O8l48
6668a50Q3L48l53K14p1j54J93J6k17K1M1l27Q9L82j78j58l1L40l5k44J11J47R8
$$ plain form
6507 104 93 -291 -474 138 90 79 45 134 47 -86 -277 42 -15 -38 -102 -119 60 66 -167 121 82 74 -291 258 281
6532 281 168 252 -103 75 -181 -208 252 -36 -189 133 282 -96 -331 34 100 -17 -135 -46 299 9 78 -181
6554 -181 186 231 -273 -152 156 -34 -180 115 -85 -52 -358 56 184 -153 -32 175 227 -34 -348 -85 0
6575 0 -114 -40 -80 124 172 -54 -357 214 123 -92 68 14 35 -129 50 -50 -150 -144 70 112 131 -109 -154 37
6599 37 -12 172 38 253 6 -348 22 51 17 -32 40 131 -236 -428 -16 81 124 15 52 10 56 8 270 45
6623 45 -5 -73 163 235 26 64 -4 199 -72 -162 123 132 -133 -75 33 -73 112 -65 -198 238 64 -209 195
6646 195 -62 106 -154 -184 31 -220 -55 131 -98 -360 -18 134 286 -42 -319 -50 143 144 81 130 198 -150
6668 -150 -67 281 -72 142 71 -83 110 126 -91 -70 -29 -356 -267 115 -63 -221 -252 88 53 -191 -80 67 165
6691A65n19N03nj22n8j20M58K9j33j23J0j04j48K92L1R6l22O3K4j59j70K77j8
6714e3N0J28k86K27o3j90K38J70k39k87R1L94m08P7K17J63r8n68L83M46k83l30
6736b21L20o1J4k02n0K83j15J44k19L69l51j26Q1J91J74n34M94k33p3K9MK62J54
6759C34m61K65Jj58j26K22J98j67l90L88J22j66l6m5L34l28j78K95mk92j27K49
6781g0K13l50r1N81Ok91j07J27K2m7M5j91K3M97m07J25Q7j08j21j45M11m51P7
6804a65L75j54p3k83M52J23m41j30M40Jn01K05L44P3k38Rj7J47q2j88M7K89l08
6827g5n1L75k30j51o9K01l6j53M2Q4M35m82R0M7K82l13k62K88J04p05M69K05L7
6850A32l09K4L51k03o6m7L30j53M4p4j15J63k20J57J22j53r9MK53j09k82K24J21
$$ plain form
6691 165 -354 149 144 22 -36 -156 302 331 198 75 85 -19 -167 125 156 252 -70 -7 17 -142 -312 -35 -53
6714 -53 -3 125 -161 66 3 -187 51 221 -18 -305 -214 180 -228 -151 66 229 131 -437 -54 392 109 -221
6736 -221 99 38 52 -150 -200 83 -32 112 -107 262 -89 -215 -134 57 231 -303 191 -42 -115 -86 -82 180 334
6759 334 -127 138 139 -19 -145 77 275 108 -282 106 228 62 26 -19 315 -13 -191 104 100 -192 -319 -70
6781 -70 143 -207 -298 283 289 -2 -109 18 40 -7 38 -153 -130 367 -40 85 172 64 -57 -202 209 -242 -165
6804 -165 210 56 -17 -300 152 275 -166 -296 144 145 -356 -151 193 266 28 37 20 167 85 -103 -56 233 -75
6827 -75 -126 249 19 -132 -201 0 -36 -189 -147 -63 372 -110 -20 27 309 -4 -266 22 126 -579 -110 95 132
6850 132 -177 -153 198 -5 -71 -118 212 59 103 29 -86 77 -143 14 136 -17 -116 -112 141 32 -250 -26 95
6873I5J56l19J82j34J73k77j89K95M4j63J07J67j66k2J39m3J18l33K33J86m25
6894a76q3J9J42J06k26K17O0j95r8J16K27k6k27n8L18j99Q4j08J32q4j56J12N28
6917D25m05j96K13K56j80n01K84K71k31o6N18l23j84J0K25o6p7l98N76J11k02
6938F0l76L83l8j37J31j41J64n3k17J51Q9j96J42K13j86N6j8P1N1k57k8L31Kk3
6962A74m5m2K27l94j11K36J80j76j52K9j6j26k0L18k3k65J71J07j06j06J93J86
6984B39k34k08%M66k06K3o6J17N9r0l41M33k25k82J60K17J33l33M2K86J03k29
7006F4j68Q1n0n0j36J71J39j8j35L17n4j19j67K68l7l42K16L8j12Q7R9J45m9m57
7030b69J80L69j25k49O5K91k30k43J50L10m68kL13q5J78j47j21L56j5n24K55J01
$$ plain form
6873 95 251 -68 114 -20 153 -124 -313 -18 26 -137 -30 137 -29 -51 88 45 163 -170 63 249 -176
6894 -176 -259 -240 -98 8 -218 -1 59 -136 -234 -118 109 83 -144 -202 116 -83 1 -107 25 -59 -215 -103 425
6917 425 20 -176 37 293 113 -388 -104 167 -64 -130 388 65 -119 -109 116 50 -27 -425 151 262 60
6938 60 -316 67 29 -108 23 -118 46 -7 -224 -73 16 -180 -38 175 -11 45 27 98 149 -108 -136 195 197 174
6962 174 129 87 314 -80 -191 45 225 49 -103 -74 -90 -216 -236 82 59 -206 -35 72 -34 -140 53 239
6984 239 5 -203 -203 263 57 80 14 131 190 100 -241 192 -33 -315 -155 62 195 -138 -96 190 293 64
7006 64 -104 -23 -73 -123 -259 -88 51 33 -102 215 161 42 -125 143 106 -236 -20 18 -94 -7 92 237 188 -269
7030 -269 -89 280 155 -94 -29 262 32 -211 -61 249 -219 -221 92 7 185 38 -83 273 258 -266 -11 90
7052I0L4l6j97K79k10j30K58J16k64j44L07j63J52k19K64j40mk2j85M43k21j42
7074a34l08O05k08k08J76J58r8j70K94J65k32k95J58K93j67j75K03N0o2k68M8
7095a75J07o2j45L13R3j7k9J01j35j63j35J62L72k71k17L51K2m9q3J59m6m71J96
7118a22L53P0m14k1L08J96l36l18N77n9k84l38L27J10J15j80O7K45n43K3J91L09
7140B76k03r6K16rJk39K91j53m24M42R0j47r2j3J67M8j82j63K00K98m68j98N08
7163A50J9l70j36L10K04j30r4LJ75j54J18j00l1n3K48k32L14j95k39M84j82k09
7185a00m1J00L29n93M58k37L97j99l9J45j07m88K38L65m48M7N9J31m3n7k7K48
7207A38L3k28k5M78k50j37J57k2m7j35q0k3P4k52K73lJ51l68J28L5j06J40m0m2
$$ plain form
7052 90 124 88 -109 170 -40 -170 88 204 -60 -204 103 -60 92 -127 137 -3 -7 -29 -214 229 8 -134
7074 -134 -442 163 -45 -253 -77 81 -17 -187 107 272 40 -255 -97 196 29 -146 57 107 45 -223 -175
7095 -175 -68 -130 -275 38 131 114 85 186 51 -112 -247 -85 287 16 -201 150 172 123 40 199 153 -318 -122
7118 -122 231 301 -113 -134 174 370 34 -284 293 234 -50 -388 -61 49 164 -16 51 296 -247 -224 -33 276
7140 276 73 -23 193 184 185 -54 237 84 -340 102 192 45 -47 -60 107 155 -27 -190 10 308 -160 -358 150
7163 150 169 -201 -337 -27 177 47 -47 -44 131 -23 95 -5 -36 -89 159 -73 241 46 -193 291 109 -100
7185 -100 -141 -41 288 -305 153 -84 313 114 75 220 113 -375 -137 228 -220 -173 -114 17 -26 -83 -110 138
7207 138 171 -57 -82 396 146 9 166 144 97 -38 -118 -141 -67 -319 -46 -49 102 -266 -138 -103 -209 -69 -109 -151
7231a51j01K58J95o2k56K3J7K2K50k91K17k39P5K96m71L85k41q2P3L5Q1j23p3
7254a63J33r8n9R5K65j28k95P4N46l41q1J9J32q6L6J7J96Q2n47J74q9J49j51r
7278a29K54j73j66J79J72j75k97K93N7m3k04M05k19j69K62J10m4p6j95J8J88l48
7300c00K09J72j38o4r3K04L7M6k82L07J44j18n37N80j2j93k2N2n3k19J97J4L93
7323C24l36l69M50J96n83L24L04n01r4n7P47L9l88k22N24m87N1k4L07K2k79j24
7345a76K23l7k22j4M04ql08M7M04l4l61J9K08l56P4j42M03q7k08K21r4J16l46
7368b74J28K01P6j17l61M91r3q7k7O5J41j55j30K20O2k16j43J86J20j32J74l0
7390I9k68o1K71J49j22k69K88L4p3k41J18R4M5k54K85L01n69o8L40J17j97j18
$$ plain form
7231 -151 -252 6 201 139 -117 -94 -77 -55 195 -96 121 -118 -43 253 -218 167 -74 -156 -83 -48 33 -90 -163
7254 -163 -30 -128 -187 -92 173 45 -250 -176 370 29 -52 -33 99 13 49 66 262 344 -203 -29 -118 31 -120 -129
7278 -129 125 -48 -214 -35 137 -38 -335 -42 15 -28 -232 173 -46 -215 47 157 113 37 -158 -140 48 -300
7300 -300 -91 81 -57 -121 -214 -10 27 73 -209 98 242 124 -413 167 155 -38 -60 -8 -61 -280 -83 -69 324
7323 324 -12 -381 69 265 -318 6 310 -191 -285 -342 405 444 56 -166 358 -129 -78 -102 205 227 -52 -176
7345 -176 47 10 -212 -226 178 170 -138 -91 313 279 -82 -63 145 -211 -137 -279 124 37 -171 50 -44 72 -274
7368 -274 -146 55 131 14 -347 144 51 -36 -63 2 143 -12 -142 78 140 -76 -219 -33 87 -45 129 99
7390 99 -169 -230 41 190 68 -201 87 121 48 -193 -75 19 64 -190 95 396 -173 -241 99 216 19 -99
7412i9j75L24m1j47p0L83k72J1J09j53K35k45O4K04N6m75L16J40k40r2L49j63
7434A9j32m7M46J4k52j83q5N79j86n80L17J32j02J24QL1J9j56j16K73m4k52J71
7457bj23j9J00l0R0j81J22L3Q1p7M6J05m6%k59L77k20N6k13K26J72k62%L39k31
7482H4r7K95l53L04l62N4j09L74m45K46mJ89n01Q8N47o7j92j30J26J96j94l6N2
7505F5M9k51m0L00l41J09J10J58k62J02k6J90j55n27M26K56Nk62l4N6K09l90N0
7528b03J83m7J07j37J61L34l25K7J52k63N0o6K29k50lq1L4J34k79K20N3J31k13
7551e2%K52r2j26L2Mm5N5L1K14k15O5j71QM9l1q8K87j71q9J6M68m81l78N42K16
7577C00k31j14j24J92j23m1m0K60k09j19J86K24n0m89O50r1k05o9J55Pj5k71J84
$$ plain form
7412 -99 -274 50 9 -138 -208 175 -97 -86 23 -130 105 -140 -76 128 184 -291 25 165 -75 -167 182 19
7434 19 -113 -160 286 300 48 -135 -220 359 173 -407 -90 42 -60 64 72 103 122 -34 -150 123 79 -173 -2
7457 -2 -125 -144 -44 -74 16 -165 -43 -10 71 -6 40 145 99 99 -160 217 -3 53 -160 66 238 -24 -24 315 84
7482 84 -13 282 -71 233 -129 -75 -184 190 -255 -9 -13 176 -325 -237 310 243 51 -79 47 243 49 13 65
7505 65 114 -137 -177 123 -218 -109 1 159 -103 -1 -27 163 8 -519 -93 163 168 -94 -128 -72 137 -253 -203
7528 -203 -20 -67 40 -97 64 398 73 100 252 -11 39 -27 202 -48 -51 -132 -98 36 -243 -23 30 161 -52
7551 -52 -52 200 108 -18 14 18 -27 28 59 273 58 123 -48 -40 9 -22 -110 177 6 -83 -67 401 -80 -458 84 300
7577 300 69 -45 -169 23 -100 -141 -181 79 -130 -249 -63 161 111 -378 272 181 -24 -93 62 69 54 -217 -33
7600c3J87k4j5j23L45j99k97K34J04l95j24L86K55n04K53j7RJ00j59J03k9j59
7622a02L0J09K65k37o2P9J70J19l01K0P7l39k51O21j49k60J83O4M8l22K86m4k2
7645a8k3m39O25o9j31j58L97J21k88j08M57k81k09K70j55K64k16k60K83lj70p
7667a18J53K08r3k03K45N6k32r5J92K77m45k11L41l31N3L57j19j0j42j60L58m0
7689D1l20K47L6k22J10M4O9p9J05j81J3J99N6j6j17k6R2k33K39l4j82Q7M18k65
7713H1j82j5K69n0m72K9M78l8o2k32J85K00k58j61K51j11L68j68L20l21k15K11
7735A07L6M2k39j9L67l68J54j31J47k39JP3J15Oj09Q7p5J72k58M5J92p7j56K5
7759a02J06p9J10O8nk6j11KK71j13j2r5J21k92J68R3j29L4j62L72k58rj40L8N8
$$ plain form
7600 -33 154 130 115 -8 337 138 -159 75 179 -216 -340 46 301 -203 50 33 42 142 -17 86 57 -102
7622 -102 -72 37 302 65 3 82 252 371 70 90 167 -172 -423 198 49 -211 -28 36 84 -238 48 4 -18
7645 -18 -41 -480 145 76 -55 -213 184 305 17 -91 366 85 -124 146 -9 255 39 -221 62 59 -111 -118
7667 -118 35 243 150 -53 192 248 16 -79 113 390 -55 -266 75 -256 -203 154 35 25 -117 -277 81 41
7689 41 -279 -32 4 -218 -108 -64 5 -74 31 -150 -137 62 118 102 -15 -41 51 -182 57 23 -159 -72 346 81
7713 81 -101 -116 153 103 -369 -340 138 100 38 -194 -9 191 -67 -228 23 -88 280 112 432 111 -104 107
7735 107 143 185 -54 -73 294 -74 80 -51 96 -143 -142 -69 46 52 -57 30 -45 127 -131 -86 106 29 -127 -102
7759 -102 4 -75 35 103 98 72 -39 -37 234 121 109 14 135 -157 11 104 -25 9 -153 219 -39 -48 -188 -150 -92
7784i2J61l15M8K52k06M1K77lj97j67K40P5j75j05P9j72J84j96J75L32m29K05
7806A2J34j57j22J3K41q1Q1R6j03J11k8l51L16j55j47J06J32j35K26l75M43J44
7828D01n16K26LK6j86j62J45J37j6l4j17L6l3N4J33n0l58K93K3O6%k61K83J06
7852A99j53m5J77j08r7K83j47j07j3J44j72K1J3k14K84O6j84j68M51k12j31j21
7874b34L31o6q7r1J16R9k91n2J94J85k59J7j5L88m79M97l24K37m57L54J0j32j49
7897b08M4L86j32p6m7M7n3K9r2J79K9k24l7M5K38q0J77j04j47o2k9K77j48o5J19
7922F6p0o9O7l46J11L08j95K8J06J05k28J12J75r9l41M20j02R3l09N7J21q2j07
7945a79j9L80j52l4L9K63k31n2P7R6k75J23k5K45l76j2J88R9l09j31J37N57l77
$$ plain form
7784 -92 69 -246 -198 54 -152 -111 166 163 -34 -201 39 114 -61 -166 -87 -259 -75 -271 -96 236 -193 12
7806 12 146 -11 -133 -120 121 40 121 217 114 225 197 -154 162 7 -140 -34 98 -37 189 -186 257 401
7828 401 -115 111 114 140 -46 -208 -63 74 58 24 -93 -57 -90 -36 97 47 -311 -18 5 71 71 -190 93 199
7852 199 46 1 178 70 -27 256 109 2 -11 133 -39 -18 -5 -219 65 131 -53 -221 230 18 -113 -234
7874 -234 97 31 -56 -147 -31 68 -223 -275 -81 104 -155 -138 -153 235 -244 253 -71 166 -291 63 73 -59 -208
7897 -208 -164 222 90 14 -33 14 -39 -10 -102 77 106 -118 -155 -110 128 48 225 121 -26 -88 -117 160 12 -53 66
7922 66 -4 -73 -6 -352 -241 67 -128 -100 6 111 -117 -5 170 71 -270 150 48 141 -168 -111 10 -72 -179
7945 -179 -198 182 30 -4 35 298 67 15 92 188 -87 36 11 256 -120 -132 56 155 -154 -285 -148 409 32
7968C2j28LJ78p9m36M82j13j9o8J11K85k84J16j50K28k37j81K91K85l39j48J28
7990d3k8J06j79n1L95k65L7Q3J01j26j18K89j36j52PJ79J03j08l37K85q8P6k80
8013b50N06k45l5j32L24M6k66k37K76Q2l35L1M81j7k62m55O86j1k02O6J6j20q2
8036a35O5r7J03k05J00K16K88m36P2J77M3j88J26o6J18j87l4M0N4k53K26LJ20
8059A50k01N6J33Rj76R2pll6j07J92k32J0J09l6L3l56M97j6j1m12J01M61k93J4
8084b9J12J27nj59mN2m99L14K01J9j35j99M5L74m5j28N8K1j48j01J60J56k81N2
8108d2N8K52j39k05K20j28j5j26J88m4O8k42K19J58m18K80r0K01l79k50K58K77
8130A01J22n37K02K04j00k65N18j98pj00K60n8l41K98Q8J07n40O5K74k00M7k09
$$ plain form
7968 32 -96 -93 85 6 -430 52 -61 -80 -148 -37 248 -36 80 -70 158 -79 -260 31 316 -23 -171 -43
7990 -43 -71 35 -144 -195 200 -65 -28 55 156 30 -88 201 65 -87 -80 99 202 94 -243 42 -46 30 -250
8013 -250 256 11 -24 -156 168 214 -52 -289 -13 69 -266 -235 246 229 -33 -488 198 187 -15 51 67 -53 -135
8036 -135 -70 -167 -64 -269 -169 47 335 -101 -29 148 191 3 129 63 181 -6 -40 0 54 -199 27 30 150
8059 150 -51 5 138 147 -29 63 56 53 17 -90 102 -130 -120 -11 -47 -14 -370 127 111 100 -312 -211 250 -43 -29
8084 -29 83 210 205 46 42 94 -405 -91 110 129 -6 -205 -160 214 169 41 99 120 -28 -129 31 187 -94 -42
8108 -42 16 268 129 -76 144 16 1 -125 63 19 87 -155 64 222 -196 84 -6 195 -184 -434 -176 101
8130 101 223 -314 -112 92 -8 -273 245 47 40 -60 200 142 -199 99 187 294 -246 -181 93 -107 -60 -269
8152b69J93J44j93OO2L45k71J8J18q0M4M9j2Q2k09k35J87M6j5k80K72J60k13k62
8176c13L13M9k9m5J19l2j29j75M22k09o6K86k3j59n3
$$ plain form
8152 -269 -76 68 -125 -119 -57 288 17 35 153 73 117 166 154 236 27 -208 -21 25 10 -270 2 162 -51 -313
8176 -313 0 49 20 -25 94 62 -67 -242 180 -29 -95 191 168 9 -44
8191d4
$$ Imaginary data points
##PAGE= N=2
##DATA TABLE= (X++(I..I)), XYDATA
0@%%%%%%%%%%%qJ6j6J6j6K4l2L2m0M8n6P2q4R5j12J33j52J72j96K24k58K94l30
34a74L71m18M69n27N87o52P25q05Q94r91J094j206J332j468J616j780J961k161
52a133K383k630K907l222L582l995M477n050N743o598P684r119J1100j4016J8727
67A0840k7526M9176j93002k28222N91470j4404l83948K65105K00571m22202L6530
78a15612L92294k00130k23187K96431o7438l23414K76154K45285l72680n2772
88a45069L44396j48546k16236L05304K4739l73097J09598K73874k25630q9804
98a40471K64337r3924k05123K25958O7167k62637R3920J91557k28834k6431L25424
109B10943j19058l00644K34114J78136k75683Q312K49809j79812j59686K78074
$$ plain form
0 0 0 0 0 0 0 0 0 0 0 0 0 -8 8 -8 8 -8 16 -16 16 -24 24 -32 40 -44 51 -61 72 -80 92 -104 120 -138 156 -174
34 -174 197 -221 248 -279 308 -344 381 -424 470 -521 573 -633 699 -769 847 -933 1028 -1133
52 -1133 1250 -1380 1527 -1695 1887 -2108 2369 -2681 3062 -3536 4148 -4971 6129 -7887 10840
67 10840 -16686 32490 -160512 -388734 202736 188332 -195616 69489 270060 -152142 -115612
78 -115612 276682 76552 -146635 149796 82358 -241056 35098 280383 -92297 -145069
88 -145069 199327 50781 -165455 139849 164588 -208509 -98911 174963 -50667 -140471
98 -140471 123866 29942 -175181 50777 117944 -144693 -50773 140784 -88050 -114481 210943
109 210943 91885 -208759 25355 203491 -72192 -63880 185929 6117 -153569 124505
119A24505L4953k63894J00572J48147k30928j7645K80208r5169k32267J55029
129C511Q5948j80689Q2775J70292j96031j07803K21206l847j83888J13197R6915
140A01586j97988j8333K05042l6356j19205R3084J2181j15238Q0468J00199j20651
151a5211l7981J13469m8864q1953J08155J6860j42968L4720J20013p8762n5996
162f8518J14835o876j16605N5427R0012p6458m6172O4211k670k7862M5844j3528
174A1640o7735M3257N6405n9184j0836P9960k7551q5867N5318Q0299n9741n9134
186d3169M2941J5886l5175J8280L1465l7397l3730K4685J7608n529Q608q849l5934
199d0310R955L8870j5166k1682L5960J131n3763K8526P6098m1107p1859N1460
$$ plain form
119 124505 159458 -104436 -3864 144283 -86645 -104290 175918 80749 -151518 3511
129 3511 89459 -91230 -8455 161837 -34194 -141997 79209 75362 -108526 4671 101586
140 101586 -96402 -114735 90307 53951 -65254 27830 40011 -75227 5241 105440 -15211
151 -15211 -53192 60277 11413 -70540 37615 54475 -88493 -53773 66240 -12522 -68518
162 -68518 46317 39441 -77164 -21737 68275 -8183 -54355 9856 7186 -20676 25168 11640
174 11640 -56095 -12838 43567 -15617 -26453 53507 25956 -59911 -4593 75706 15965 -43169
186 -43169 -228 15658 -19517 -1237 30228 -7169 -40899 -16214 1394 -4135 4473 -4376 -40310
199 -40310 -30355 8515 -6651 -28333 7627 8758 -45005 -16479 59619 18512 -53347 -1887
211a887M4865n9146l951O7739k4650n1238M5532K0277m7933J9871L1122n6959
223a6358j3P5267l9725o8485P0132K5335r7185K0037Q7052p6870o0191J09003
235B7999J1344j08687M4880P8187q8151k2377J05261l3070q0803P6764K3812r2885
247e7726N1796Q2164j05104l1180J33267l3932j12795J02589O2061j42040Q229
258d2671J40170p3824r0529J17358J0969j29954N9603Q9187j13640k1406J21204
269F6467o1227q8824J22130J7567j46851O1951J17355j32907n1037J66603l1371
280C9856j47890J08215Q7515j48255Q76J41842p9091q3258J30389r65j29052R0672
292A0854Q4150j46260o66J54186q8951j11234J55646L0541j77613N8211J42244
$$ plain form
211 -1887 42978 -16168 -20119 47620 22970 -28268 17264 37541 -10392 9479 40601 -16358
223 -16358 -16371 58896 19171 -49314 20818 46153 -51032 -30995 56057 -20813 -81004 27999
235 27999 39343 -69344 -24464 53723 -34428 -56805 48456 15386 -65417 11347 35159 -57726
247 -57726 -5930 76234 -28870 -60050 73217 39285 -73510 29079 91140 -50900 -42671
258 -42671 97499 23675 -66854 50504 61473 -68481 -8878 80309 -33331 -54737 66467
269 66467 5240 -83584 38546 56113 -90738 -28787 88568 -44339 -95376 71227 39856
280 39856 -108034 181 87696 -60559 -59683 82159 3068 -80190 50199 49234 -79818 10854
292 10854 95004 -51256 -51922 102264 13313 -97921 57725 88266 -89347 -31136 111108
303A11108j30370o6667J58158k9032j38278J02676O8929j40116J9864J22844j02762
314b3646o1350J49776k5164j44520J07416R0686j56985l530J63048q1084j17503
325a02856J40459M0847j51585M4803J12631j10277l9273J34727m2867j07204J07934
336B7339L8749j34858M5662J16490j19658o0069J52916j9018j39477R2913Q3894
347H4883j38901q058J39405o1058r3106J06038J9751j10634N8459P8779j07938
358c2380j6871J16760n3625q4285J10203K4233j33182M0986J12238r2320n9436
369f7679J13507j2097j05499O7233O4216r5115p901Q4791m7384m4733Q4539p351
381B6527q7532N6203N7743q5714m058R4092m9226p3010Q6637L7390r1357J1393
$$ plain form
303 111108 -19262 -85929 72229 43197 -95081 7595 76524 -63592 -43728 79116 -23646
314 -23646 -84996 64780 39616 -104904 2512 93198 -63787 -67317 95731 14647 -102856
325 -102856 37603 78450 -73135 -28332 84299 -25978 -65251 69476 26609 -80595 27339
336 27339 66088 -68770 -23108 93382 -26276 -86345 66571 47553 -91924 989 84883
347 84883 -54018 -62076 77329 16271 -76835 29203 48954 -61680 -3221 75558 -32380
358 -32380 -49251 67509 13884 -70401 39802 64035 -69147 -28161 84077 -8243 -67679
369 -67679 45828 33731 -71768 -4535 59681 -35434 -43335 41456 -5928 -50661 33878 26527
381 26527 -61005 -4802 52941 -32773 -36831 57261 8035 -64975 21662 59052 -32305 -20912
393b0912P3926m9009l4419P0439m419o2234L4525K7508n2499J1621M5834n2355
405a1994l1164O6138k285o3252L4977M0344o0165j3560O7594j1195n6342K6882
417a4022K8601l3209J243L1806j9752j6349K6897Q35j6031K3180O721l4320R265
430e135M0447j6796k9927K4213J2998l1677K79L3184j0780l3159R717K1107j1525
443B946j0982R149m157j3363O965R310p410k389L142j1396K679K4807m511k9084
457b4294J2474K6916k2288j3775L6997O39m3441J4674M3009k1626k4467K8645
469A3463K775k7423J9518J9986l1663m718K5631k0150j3970L7566j0860m9391
481c9236L0644L8223m7023j1172N6049k0629n1613M7675L5575n7762p731M9562
$$ plain form
393 -20912 53014 4005 -30414 40025 35606 -26628 7897 35405 -17094 -5473 40361 -11994
405 -11994 -43158 22980 20695 -42557 -7580 32764 -27401 -40961 26633 15438 -40904 -14022
417 -14022 14579 -18630 -17387 14419 -5333 -21682 5215 6050 -9981 13199 19920 -14400 -5135
430 -5135 35312 18516 -11411 12802 25800 -5877 -5598 27586 16806 -16353 -6636 14471 2946
443 2946 -8036 1113 -3044 -16407 -9442 -132 -7542 -9931 -6789 -18185 -15506 9301 4790 -24294
457 -24294 -11820 15096 -7192 -20967 16030 16669 -26772 -12098 30911 9285 -15182 13463
469 13463 16238 -11185 8333 28319 -3344 -8062 17569 -2581 -16551 21015 10155 -39236
481 -39236 -8592 29631 -17392 -28564 27485 6856 -44757 2918 38493 -19269 -27000 22562
493B2562k4071k6063M6713k240m8971L0609L0204m7721Q729N4996m5426m3092
505d3771P1274J4641p6701K2847N8167o0492k8341P7840r096p0825L9553L7736
517C2832n7022P989N6658m7615l2531O9200p106o3609N2334L8264q4049L032R2825
530F1202m2693p0096P2864K5590q4077K3245P0367o0855l5485P1723j3393n7570
542c9178N5824K1117q0197K2567P1767o2962l7946Q5676j4813q7042O1077O0337
554E6227q8343j5244Q9138l2304o0631P1114K0845p8024K6533N8705n9930j2349
566b4263P3534l8367o2449P6641K5278r1545K3651P6780o8934m2118R2360m238
578C6330q7383M4195N1303p1582m227P1115m3326m9084O7255M912o8193M2485
$$ plain form
493 22562 -1509 -27572 19141 16901 -32070 -1461 28743 -18978 -10249 44747 -679 -43771
505 -43771 27503 42144 -34557 -11710 46457 -14035 -42376 35464 26368 -44457 -4904 32832
517 32832 -24190 -16201 40457 -7158 -39689 29511 22405 -41204 11130 49394 -34655 -31623 61202
530 61202 18509 -51587 21277 46867 -37210 -13965 56402 -4453 -39938 31785 18392 -39178
542 -39178 16646 37763 -42434 -19867 51900 -11062 -49008 36668 21855 -65187 -4110 56227
554 56227 -32116 -47360 41778 9474 -51157 19957 40802 -37222 -10689 48016 -11914 -24263
566 -24263 49271 10904 -51545 25096 50374 -41171 -17520 59260 -9674 -51792 40568 36330
578 36330 -51053 -6858 44445 -27137 -31364 39751 -3575 -52659 14596 19508 -48685 -6200
590f200M4727p5941l819Q5700l6326o4302P0530K5522q1858K1563P2797n3686
602a293m0204O7367r29n7027M0924K8847o1176P617N6961m1775l1001O1655q216
615B1750o5134M3539M5625o6331j3797O7257k3748n2224M9873K2842n9807P521
627b2634M7176l1772j9202M2854j3130l6073M0797J6378m9625J4355M5566m0808
639f118k5760N7381J428n6933K3256M0428l8010j5255M2289r621l2808K5995J2948
652A9220k9386R352K0682k8012n197L4604j5323l0576L0056J4860l9136K643L8232
665B2019j8465k9084K6943J4827k6685M47J9958r919q489J3043l213q286J2144
678E240J8j5786J0823J4418j8446q371K2391M97k2125O759J8718j2024j3722J4625
$$ plain form
590 -6200 38527 -37414 -41233 44467 8141 -56161 14369 39891 -41967 -20404 52393 -1293
602 -1293 -41497 25870 24941 -32086 8838 37685 -23491 -15874 41087 -688 -31689 29966 21750
615 21750 -43384 155 45780 -20551 -34348 32909 9161 -43063 6810 29652 -30155 -22634
627 -22634 24542 -7230 -26432 16422 3292 -32781 8016 24394 -25231 -10876 34690 -6118
639 -6118 -31878 25503 26931 -30002 -6746 33682 -4328 -19583 22706 13085 -19723 6272 19220
652 19220 -10166 -814 19868 -8144 -13341 21263 5940 -24636 5420 20280 -18856 -16213 22019
665 22019 3554 -25530 1413 16240 -10445 -9998 9960 41 -8448 4595 1382 -6904 5240
678 5240 5258 -10528 295 14713 -3733 -12104 10287 10784 -11341 -4582 14136 2112 -11610 3015
692C015Q152j4618m184J1600M58p870J424L868j719q7L99l783L132O281p048p446
708h426J3204O383j8341j327K1522n966k1483J3802J6950k0453q865K2562j902
721G660k0499J0462J1741j5398m05J3530j1656n551J8289p157j8120K1142R641
734A3679l0731N345L4542k0326k6853L3076J2139l6527P262L2278k1834j7388
746a5338K9082j527k4117J9670R260l0147J0116K7573k9936j4157L9971r275m2115
759c0940L0512K8846m6200q494M7160j6275l6275L4011J5203l9734Q692L1450
771A7956k7138q896L6132j5506k9429L9250J2175m7771J4846M4583l8357k5118
783b7273N3569K92n2614K4559L5589m0698r718M2276j8847l1217L5811O070m0699
$$ plain form
692 3015 11167 -3451 -7635 3965 4423 -3447 -2023 1845 126 39 438 -3345 -213 6068 -980 -8426
708 -8426 4778 11161 -7180 -8507 13015 7049 -14434 -632 16318 -4135 -13000 9562 7660
721 7660 -12839 -2377 9364 -6034 -6439 7091 -4565 -10116 8173 1016 -17104 4038 13679
734 13679 -17052 -11707 22835 2509 -24344 8732 20871 -15656 -8394 23884 2050 -15338
746 -15338 13744 12217 -11900 7770 17030 -13117 -3001 24572 -5364 -19521 20450 11175 -30940
759 -30940 -428 28418 -17782 -26276 20884 4609 -31666 2345 17548 -22186 -13494 17956
771 17956 -9182 -18078 18054 2548 -26881 12369 24544 -23227 -8381 36202 -2155 -27273
783 -27273 26296 26588 -26026 -1467 34122 -6576 -16294 25982 7135 -24082 11729 17799 -22900
796b2900K0259K6493m3240m758N0518k3076m3009M5088J9159n5244J0732N1447
808C1469l4973l1173M8311M849m2798K4069K5503l9659J644M1228k6400k3887
820b1817M4241l284m7235L1285L5178n0388j2001N3849j7167m3848L8805K0268
832B7886m9546M076M1186k6274k0758L6793p201l3681L0675J7092m1429P883L9572
845B6274l2771k2509M9420O02n0396K2766L7465l8088j3231M2852j1398l4226
857b3240K8958J4595l3624Q588K4426k9234o874L7120j4333l2524L2144J4250
869B0252m1790P994M0290k7564k7719L7495R049l5770J2015K4266k5110o768K8102
882A4742r009j8056K2180P84k6031J7758K0292l0413q252L3583r926k8277K3274
$$ plain form
796 -22900 -2641 23852 -19388 -24146 26372 3296 -39713 5375 24534 -30710 -19978 31469
808 31469 -3504 -34677 13634 18483 -24315 -246 25257 -14402 -12758 28470 2070 -21817
820 -21817 22424 19140 -28095 3190 38368 -12020 -24021 29828 12661 -31187 7618 27886
832 27886 -21660 -17584 23602 -2672 -23430 13363 6162 -27519 3156 20248 -21181 -13298 26274
845 26274 -6497 -29006 20414 21016 -29380 -6614 30851 -7237 -20468 22384 10986 -23240
857 -23240 5718 20313 -13311 -4723 19703 -9531 -16405 20715 6382 -26142 6002 20252
869 20252 -21538 -13544 26746 -818 -28537 8958 18007 -17763 -5748 18518 -6592 -13360 14742
882 14742 5733 -12323 9857 10641 -15390 2368 22660 -7753 -16005 17578 7652 -20625 2649
895B649J6402l1606l638K8857r194j8025J5876L654j7053Q923J0825j5014J59
908g185J5303j2421p971K2691J24k4057R854K0795j6561j0262K0592R74j9820
921g944O096J4716q859p033P085j964l760O181k129p399N585K385j0494K390J2022
936F878p863j2702J0043R702j1135m926J1279J203j0571K515J1109k665q112K878
950b367O068j175j403R59o0L2J726k427J44N894k686r900N599J1214r695j0756
966h833J2288N015j5521M71J5504o959j4132J0155P781j0985R2P396o663j494
980e885R593n475o132J2162j009j5699J0966J6088j8800r528K3738l26k2327J1964
994f70J6834j9137p519K0240l229j4059J1149K918j4819Q751J1179j8014j661
$$ plain form
895 2649 19051 -12555 -16193 12664 3470 -14555 1321 4975 -12078 -3155 7670 -7344 -7185
908 -7185 8118 -4303 -12274 10417 10541 -13516 -3662 17133 572 -9690 10902 11876 -7944
921 -7944 -1848 12868 4009 -3024 4061 2097 -1663 4518 2389 -5010 575 2960 -7534 -5144 6878
936 6878 -985 -13687 -3644 6058 -5077 -10003 1276 2479 -8092 -5577 5532 2867 -5245 -2367
950 -2367 3701 2526 1123 2082 2022 2054 3780 1353 1497 7391 4705 -5195 404 11618 1923 -8833
966 -8833 3455 8470 -7051 -6580 8924 1965 -12167 -2012 5769 -5216 -5124 2272 -4391 -5885
980 -5885 3708 -1767 -7899 4263 3254 -12445 -1479 14609 -4191 -13719 10019 9693 -12634 -670
994 -670 16164 -2973 -10492 9748 6519 -7540 3609 6527 -8292 459 11638 -6376 -8037
1007h037K1121j2427j7801K4362Q045l0452M325K7694j6476j7794K4260L999k5583
1020a4764R994J7676j7959l384J8595j1647j1482K3088j428k5760J6603J8823
1032A8355k8143m432L3092j1751k9355K4849J7101l0391M29K6445j5476j5594
1044a4871K4308n30k2314J5574J0669k5130N930K6024k2482j6878L2875O83l4085
1057b0227J7151K5553l0025j0528L3442o068k7169J9754J2186k5103N345K0717
1069A5028j9683p791K5464q996k2479K4719J0306l3525O314L1559k1687k0929
1081b1700L1919M129l2150J2306K3089k2276q012K4445q199j6475K0226K535k3045
1094a3208J3341J7310k5800l701L0260j1196k6016K4369J3777l0375R97K7300
$$ plain form
1007 -8037 13084 657 -17144 7218 15263 -15189 -10864 16830 354 -17440 6820 10819 -14764
1020 -14764 -4770 12906 -5053 -8437 10158 -1489 -12971 10117 8689 -17071 -468 18355
1032 18355 -9788 -14220 18872 7121 -22234 2615 19716 -10675 -10246 16199 723 -14871
1044 -14871 9437 8907 -13407 2167 12836 -12294 -6364 19660 -2822 -19700 13175 13858 -20227
1057 -20227 -3076 22477 -7548 -18076 15366 9298 -17871 1883 14069 -11034 -5689 15028
1069 15028 -4655 -12446 13018 4022 -18457 6262 16568 -16957 -10643 20916 -771 -21700
1081 -21700 10219 14348 -17802 -5496 17593 -4683 -12695 11750 3551 -12924 7302 9837 -13208
1094 -13208 133 17443 -8357 -12058 18202 7006 -19010 5359 19136 -11239 -10242 17058
1106A7058j4602j7626K1213L239k0501R367J1603j7860Q20J7932j4015j0991K2536
1119H173j214k4112J3777J9113k2880q053K6058l221k1851J3866J3455j7880j485
1132f254J6173p643p569J2763k611j1684J1885N546j7472L528J7328j3606j2683
1145a2299J9191L720k0982M072J7010j1641j0251J3534J442j1559M790N553p599
1158e019J740O175p801j397J2324m690j1339J1887Q089j4685j499J5683l463j2700
1172f695Q064Q143r459k675P560j061m741K246k08j840L155q25o012L101N704
1187D457p440l617R115M38r962J659R957l828q044M906O032m895l425N316K667
1202C336m009j296L246J192o98j438q78K036K494l867k623M930J975p813m36R224
$$ plain form
1106 17058 2456 -15170 6043 9282 -11219 -1852 9751 -8109 -7289 10643 -3372 -14363 8173
1119 8173 6959 -17153 -3376 15737 -7143 -15196 10862 7641 -14210 -344 13111 -4769 -6254
1132 -6254 9919 2276 -5293 7470 4859 -6825 5060 10606 -6866 -3338 13990 384 -12299
1145 -12299 6892 10612 -10370 -6298 10712 -929 -11180 2354 3796 -7763 -2973 2580 -5019
1158 -5019 -3279 2896 -4905 -6302 6022 1332 -10007 1880 9969 -4716 -6215 9468 6005 -6695
1172 -6695 1369 9512 53 -2622 4938 3877 -864 1382 1174 -666 2489 1664 -4348 -1247 4457
1187 4457 -2983 -6600 2515 2953 -7009 -5350 4607 779 -7265 -2359 3673 -1222 -4647 669 3336
1202 3336 -673 -1969 1277 2469 1771 333 -545 1491 3985 118 -2505 2425 4400 -3413 -3849 5375
1218E375k047j0619M473R482p595o281Q812K388r025K034O583l612k538L601j864
1233h33r23O075k914p248Q743M703j2657J012J4017p178j3314J2682Q150j5043
1247d728j582J3182n518r364R541J805r348M857M297r644L472J0408j1161o064
1261i847J6833r46j7711J0766J4025j7274o311K0577k282j7009J0393Q958j3427
1274c255M57J1924q853n614J2768m635j1942J3892M816k0267M028J9471j4484
1287a694j3265K0528K767k1812O918J7624j4251q076J6462k962j1981J2276L967
1300F501j4830P274J1816j5507k586K0461q265j8274J8064J1107k2778j7K1130
1313A4096j0768j5230J7448M540j8222N397J0934j2690j121J3958r812j0247J7211
$$ plain form
1218 5375 3328 -7291 -2818 6664 -931 -7212 1600 3988 -5037 -3003 3580 -32 -2570 1031 -833
1233 -833 -1756 4319 1405 -5843 2900 7603 -5054 -4042 9975 2797 -10517 2165 10315 -4728
1247 -4728 -6310 6872 1354 -8010 1531 3336 -6012 -1155 3142 -6502 -3030 7378 -3783 -9847
1261 -9847 6986 6040 -11671 -905 13120 -4154 -10465 10112 7830 -9179 1214 10172 -3255
1274 -3255 -2798 9126 273 -5341 7427 2792 -9150 4742 9558 -10709 -6681 12790 -1694
1287 -1694 -14959 5569 8336 -13476 -6558 11066 -3185 -11261 5201 2239 -9742 2534 6501
1300 6501 -8329 -1055 10761 -4746 -7332 13129 4864 -13410 4654 15761 -7017 -7034 14096
1313 14096 3328 -11902 5546 10086 -8136 -2739 8195 -4495 -5616 8342 -1470 -11717 5494
1326E494K80j9112J1091J4865k0179o189K4126m073k0171J3258J2114j7734q12
1339g042J6800p816r620J2830m68j1588J0499N570j6310L036J6864j2857j1212
1352a1314J9050J522k0749P683J6818j4683r183J6777q77j3470Q448O256j1644
1365e366K134R326r295k690J3228n794j1966J3099P024j7369J025J7166r025j2250
1379a0753J4134N662j4882J456J0788o784m242Q403k904n936P581O16r539O921
1393E21P127j2032k548J4414k991j3040Q223Q589j1050k913J1044j780q583M612
1407d07L583m601J190K586m863J233N365n319l144Q133j76r882M005Q678o865
1422d84o289Q062K805p372j30O380j589m271J909J861m38j65r65j132L740k2m197
$$ plain form
1326 5494 5774 -13338 -2247 12618 -7561 -13750 10376 6303 -13868 -610 11504 -6230 -7042
1339 -7042 9758 1942 -7678 5152 4684 -6904 3595 9165 -7145 -4109 12755 -102 -11314
1352 -11314 7736 9258 -11491 -3808 13010 -1673 -10856 5921 5044 -8426 22 6278 -5366
1365 -5366 -3232 6094 -3201 -5891 7337 1543 -10423 2676 9700 -7669 -6644 10522 1497 -10753
1379 -10753 3381 9043 -5839 -4383 6405 -379 -4621 3782 878 -5058 2523 3139 -6400 521
1393 521 7648 -4384 -6932 7482 4491 -8549 -326 8263 -2787 -5700 5344 3564 -5019 -407
1407 -407 3176 -1425 -235 2351 -2512 -1279 4086 -1233 -4377 3756 3580 -6302 -2297 6381 -484
1422 -484 -6773 1289 4094 -3278 -3408 2972 1383 -2888 -979 882 444 279 -686 -1818 1922 1900 -2297
1439b297Q83N208k630n188M317M707n035m611O320K602n398j390N195J71m792
1454a938K39M268j121k492n2J657J94n09j772J2L063j061m379K583N226m452n262
1471e796O999L883q307j261Q173j446o693L555M791m557j437L643j171m90K390
1486B276k535j719O053q66p378M681O705q371m435J0706K68j1392L647Q566p018
1501h12m679P602m2n990L322J964m979K834L416p009P25R067n604p712R980M773
1517F856j2950J098J3035o179r158R690M434j0077J506P710n982k014O960l891
1531A038m762Q358p31j0352O716P815j1846l818J4652l307j3707R002Q771j2305
1545d476k306J1886m233p230P761J609q044N052M554r413K139J0582q414p373
$$ plain form
1439 -2297 -1414 3794 1164 -4024 293 5000 -35 -4646 1674 4276 -1122 -2512 2683 2854 -1938
1454 -1938 -1699 2569 1448 -1044 -1096 561 755 246 -1526 -1514 1549 488 -3891 -1308 3918 -534 -5796
1471 -5796 1203 5086 -3221 -4482 3691 2245 -4448 -893 3898 -659 -2096 1547 376 -114 2276
1486 2276 -259 -1978 4075 3209 -4169 512 7217 -1154 -5589 5117 5385 -6007 -2360 6206 -812
1501 -812 -5491 2111 2069 -3921 -599 1365 -3614 -780 2636 -4373 -3648 5419 -185 -7897 2083 6856
1517 6856 -6094 -4996 8039 1860 -7298 2392 6826 -3251 -1745 5965 -17 -2031 4929 1038
1531 1038 -3724 4634 3903 -6449 267 8082 -3764 -7582 7070 3763 -9944 -942 7829 -4476
1545 -4476 -6782 5104 871 -6359 1402 3011 -5033 19 4573 -4840 -2701 7881 -533 -7906
1559g906J3909J410j5290N887J2755j1676o824J3849Rj2685O191O465r141J77
1573b870P938o882l361J0049l534r580J0046N274j4433J843J4712q482j0690J3045
1587C075M622j3883K901J0707p538n152R281j292p125P054J090r106N314P248
1601G196j0969k487J3334m386j2245R840P287j2912j254J2412m242q613P548L041
1615C550p398K691M752n998M67P232o147l636R466m43j0837O209Q975j0065m867
1630f049J1241l61r985L990O276o573k462N761j501l168L977j436m248N326J611
1645B399p551K137P711n819n429Q701K662r214J047Q097l049n202N033K439m358
1660c96P08K152j957M90J609l701M64M684k723n471M925L330o388j520O544r73
$$ plain form
1559 -7906 6003 7413 -7877 -1990 10765 -911 -7735 6114 6123 -6562 -371 6094 -3047 -2870
1573 -2870 5068 -1814 -5175 4874 1340 -8240 1806 7080 -7353 -5510 9202 720 -9970 3075
1587 3075 7697 -6186 -3285 7422 -116 -5268 4013 2721 -4404 2650 3740 -5366 -52 7196
1601 7196 -3773 -6260 7074 2688 -9557 283 7570 -5342 -6596 5816 1574 -7039 509 3550
1615 3550 -3848 -1157 3595 -2403 -1936 5296 -851 -4487 4979 4536 -6301 -92 8883 -1182 -6049
1630 -6049 5192 4831 -5154 -1164 5112 -1461 -3923 1838 337 -2831 1146 -290 -4538 788 2399
1645 2399 -5152 -3015 4696 -1123 -6552 2149 4811 -4403 -3356 4741 1692 -3510 1523 3962 -396
1660 -396 312 2464 507 997 2606 -1095 -631 4053 1330 -4141 784 4114 -2274 -3794 2750 1777
1676A777o626K525M660k782l119K615J057r96m60N40N11J014j002j620K588K242
1692B924l381j750M388J285m624n50N280j247m546J524M069j938l743J956K560
1707B207k076k058J804Q21r51j057m3J293Q43j856j378K842J809l898j059N508
1723B751p46n394K005N502l448m220M472K347m303o43L652j041j805J560r18j11
1739c40K440k096l141M136K386o647P4P288k705o770N607M809o903j740O510p59
1755B149m598K850J648l295J530J589l737J625M152n701k135P877n25q936M108
1770a399P216p111m390Q844N7q016L265N035m666j536M555k439j853M901k206
1785B57m399N912K064q248K209Q870o195o932R187K980r768J538Q251n032m871
$$ plain form
1676 1777 -4849 -2324 2336 -446 -3565 -950 107 -889 -1349 -809 -298 716 -286 -1906 682 2924
1692 2924 -457 -2207 2181 3466 -1158 -1708 3572 2325 -2221 -697 3372 1434 -2309 -353 2207
1707 2207 131 -1927 -123 698 -253 -1310 -1353 -60 783 -1073 -2451 391 2200 -1698 -2757 2751
1723 2751 2005 -3389 -1384 4118 670 -3550 922 3269 -1034 -1677 1975 934 -871 689 -229 -340
1739 -340 2100 4 -3137 999 3385 -3262 -3188 4100 1395 -5375 232 5041 -1862 -3602 2908 2149
1755 2149 -2449 401 2049 -1246 284 1873 -1864 -239 3913 -1788 -3923 3954 3429 -5507 -1399
1770 -1399 5817 -1294 -5684 3160 3217 -4799 -1534 3501 -1165 -2701 1854 -585 -2438 2463 257
1785 257 -4142 1770 3834 -4414 -2205 6665 470 -6462 2725 5705 -4063 -2525 5726 694 -4177
1800d177O337L25n132L176J752n504L008M606o963j232Q281k915q321P488N572
1815F301r910j604R849k671p741O256L719o816O18M899l877j247N284l265l616
1830c821O959Q1q264M181P324q035l997J0437q51r525M349P034o848k514O802
1845C312j995l986M173J80m433L510K676o901J352P130n363n830Q703K051r712
1860e133J959Q196n154n444O974J543n873K027L210l769N33L424l473j093N212
1875C139k030n385O013L572q198q9Q071k984o582N270L666o027p29M546j399k579
$$ plain form
1800 -4177 2160 2485 -2647 529 2281 -3223 -215 4391 -2572 -3804 4477 1562 -6759 729 6301
1815 6301 -3609 -5213 4636 1965 -5776 480 4199 -2617 -1999 2900 -977 -2224 3060 -205 -3821
1830 -3821 3138 3219 -5045 -864 6460 -1575 -5572 4865 4014 -5511 -1162 5872 -976 -3490 3312
1845 3312 1317 -2669 1504 1684 -2749 761 3437 -3464 -2112 5018 -345 -6175 2528 4579 -5133
1860 -5133 -3174 5022 -132 -5576 1398 2941 -2932 -905 2305 -1464 -931 2493 -980 -2073 3139
1875 3139 1109 -4276 1737 5309 -2889 -2978 5093 2109 -4473 797 4463 -1564 -2293 2253 854 -1725
$$ [...]
8191b75
##END NTUPLES=NMR FID
##END=
