##TITLE=1H_Ser 6-2-i-H
 CDCl3
 8 sc, 
 16.11.2021
##JCAMPDX= 6.0         $$ Bruker NMR JCAMP-DX V2.0
##DATA TYPE= NMR FID
##DATA CLASS= NTUPLES
##ORIGIN= UXNMR, Bruker Analytische Messtechnik GmbH
##OWNER= root
$$ XWIN-NMR		Version 3.5
$$ Tue Nov 16 11:31:10 2021 Russian Standard Time (UT+4h)  she@DPX200
##.OBSERVE FREQUENCY= 200.131346
##.OBSERVE NUCLEUS= ^1H
##.DELAY= (6, 6)
##.ACQUISITION MODE= SIMULTANEOUS
##.ACQUISITION SCHEME= undefined
##.AVERAGES= 8
##.DIGITISER RES= 18
##SPECTROMETER/DATA SYSTEM= spect
##.PULSE SEQUENCE= zg30
##.SOLVENT NAME= CDCl3
##.SHIFT REFERENCE= (INTERNAL, CDCl3, 0, 15.7039)
##AUDIT TRAIL= $$ (NUMBER, WHEN, WHO, WHERE, WHAT)
$$ ##TITLE= Audit trail, XWIN-NMR		Version 3.5
$$ ##JCAMPDX= 5.01
$$ ##ORIGIN= Bruker BioSpin GmbH
$$ ##OWNER= she
$$ F:/spectra/data/she/nmr/H-F/1/audita.txt
$$ ##AUDIT TRAIL=  $$ (NUMBER, WHEN, WHO, WHERE, WHAT)
(   1,<2021-11-16 11:29:41.65 +0400>,<she>,<DPX200>,
      <created by zg, POWCHK disabled, PULCHK disabled
       configuration hash MD5:
       00 E9 B6 7A A2 85 ED C7 34 08 36 98 17 FE 4E 26
       data hash MD5: 16K
       A1 69 CE 1A F9 48 DB 72 F5 46 99 CB F8 11 B3 8B>)
$$ ##END=
$$ 
$$ hash MD5
$$ 72 A7 54 29 3F 9F 32 3E 43 A7 D3 28 30 1B E5 31
##$RELAX= 
##$RELAX= 
##$RELAX= 
##$RELAX= 
##$RELAX= 
##$RELAX= 
$$ Bruker specific parameters
$$ --------------------------
##$DU= <F:/spectra>
##$EXPNO= 1
##$NAME= <H-F>
##$PROCNO= 1
##$TYPE= <nmr>
##$USER= <she>
##$AMP= (0..31)
100 100 100 100 100 100 100 100 100 100 100 100 100 100 100 100 100 100 
100 100 100 100 100 100 100 100 100 100 100 100 100 100 
##$AQSEQ= 0
##$AQ_mod= 1
##$AUNM= <au_zg>
##$AUTOPOS= <>
##$BF1= 200.13
##$BF2= 200.13
##$BF3= 200.13
##$BF4= 200.13
##$BF5= 200.13
##$BF6= 200.13
##$BF7= 200.13
##$BF8= 200.13
##$BYTORDA= 1
##$CFDGTYP= 0
##$CFRGTYP= 5
##$CHEMSTR= <none>
##$CNST= (0..31)
1 1 145 1 1 1 1 1 1 1 1 1 1 1 1 1 1 1 1 1 1 1 1 1 1 1 1 1 1 1 1 1 
##$CPDPRG= <>
##$CPDPRG1= <>
##$CPDPRG2= <>
##$CPDPRG3= <>
##$CPDPRG4= <mlev>
##$CPDPRG5= <mlev>
##$CPDPRG6= <mlev>
##$CPDPRG7= <mlev>
##$CPDPRG8= <mlev>
##$CPDPRGB= <>
##$CPDPRGT= <>
##$D= (0..31)
0 1.2 0 0 0 0 0 0 0 0.06 0 0.03 0 0 0 0 0.0002 0 0 0 0 0 0 0 0 0 0 0 0 
0 0 0 
##$DATE= 1637047781
##$DBL= (0..7)
120 120 120 120 120 120 120 120 
##$DBP= (0..7)
150 150 150 150 150 150 150 150 
##$DBP07= 0
##$DBPNAM0= <>
##$DBPNAM1= <>
##$DBPNAM2= <>
##$DBPNAM3= <>
##$DBPNAM4= <>
##$DBPNAM5= <>
##$DBPNAM6= <>
##$DBPNAM7= <>
##$DBPOAL= (0..7)
0.5 0.5 0.5 0.5 0.5 0.5 0.5 0.5 
##$DBPOFFS= (0..7)
0 0 0 0 0 0 0 0 
##$DE= 6
##$DECBNUC= <off>
##$DECIM= 32
##$DECNUC= <off>
##$DECSTAT= 4
##$DIGMOD= 1
##$DIGTYP= 9
##$DL= (0..7)
0 120 120 120 120 120 120 120 
##$DP= (0..7)
150 150 150 150 150 150 150 150 
##$DP07= 0
##$DPNAME0= <>
##$DPNAME1= <>
##$DPNAME2= <>
##$DPNAME3= <>
##$DPNAME4= <>
##$DPNAME5= <>
##$DPNAME6= <>
##$DPNAME7= <>
##$DPOAL= (0..7)
0.5 0.5 0.5 0.5 0.5 0.5 0.5 0.5 
##$DPOFFS= (0..7)
0 0 0 0 0 0 0 0 
##$DQDMODE= 0
##$DR= 18
##$DS= 0
##$DSLIST= <SSSSSSSSSSSSSSS>
$$ [...]
##$SUBNAM2= <"">
##$SUBNAM3= <"">
##$SUBNAM4= <"">
##$SUBNAM5= <"">
##$SUBNAM6= <"">
##$SUBNAM7= <"">
##$SUBNAM8= <"">
##$SUBNAM9= <"">
##$SW= 18.0517287032376
##$SWIBOX= (0..15)
0 0 2 0 0 0 0 0 0 0 0 0 0 0 0 0 
##$SW_h= 3612.71676300578
##$TD= 16384
##$TD0= 1
##$TE= 0
##$TE2= 300
##$TE3= 300
##$TEG= 300
##$TL= (0..7)
0 120 120 120 120 120 120 120 
##$TP= (0..7)
150 150 150 150 150 150 150 150 
##$TP07= 0
##$TPNAME0= <>
##$TPNAME1= <>
##$TPNAME2= <>
##$TPNAME3= <>
##$TPNAME4= <>
##$TPNAME5= <>
##$TPNAME6= <>
##$TPNAME7= <>
##$TPOAL= (0..7)
0.5 0.5 0.5 0.5 0.5 0.5 0.5 0.5 
##$TPOFFS= (0..7)
0 0 0 0 0 0 0 0 
##$TUNHIN= 0
##$TUNHOUT= 0
##$TUNXOUT= 0
##$USERA1= <user>
##$USERA2= <user>
##$USERA3= <user>
##$USERA4= <user>
##$USERA5= <user>
##$V9= 5
##$VALIST= <valist>
##$VCLIST= <CCCCCCCCCCCCCCC>
##$VD= 0
##$VDLIST= <DDDDDDDDDDDDDDD>
##$VPLIST= <PPPPPPPPPPPPPPP>
##$VTLIST= <TTTTTTTTTTTTTTT>
##$WBST= 1024
##$WBSW= 4
##$XGAIN= (0..3)
0 0 0 0 
##$XL= 0
##$YL= 0
##$YMAX_a= 150293
##$YMIN_a= -268283
##$ZGOPTNS= <>
##$ZL1= 120
##$ZL2= 120
##$ZL3= 120
##$ZL4= 120
##$ABSF1= 10
##$ABSF2= 0
##$ABSG= 5
##$ABSL= 3
##$ALPHA= 0
##$AQORDER= 0
##$ASSFAC= 0
##$ASSFACI= 0
##$ASSFACX= 0
##$ASSWID= 0
##$AUNMP= <proc_1d>
##$AZFE= 0.1
##$AZFW= 0.1
##$BCFW= 1
##$BC_mod= 2
##$BYTORDP= 1
##$COROFFS= 0
##$CY= 11.3945322036743
##$DATMOD= 1
##$DC= 2
##$DFILT= <>
##$DTYPP= 0
##$F1P= 2.36226072786647
##$F2P= -0.459571619588291
##$FCOR= 0.5
##$FTSIZE= 0
##$FT_mod= 4
##$GAMMA= 1
##$GB= 0.15
##$INTBC= 1
##$INTSCL= 1
##$ISEN= 128
##$LB= 0.24
##$LEV0= 0
##$LPBIN= 0
##$MAXI= 10000
##$MC2= 0
##$MEAN= 0
##$ME_mod= 0
##$MI= 1.114404
##$NCOEF= 0
##$NC_proc= 0
##$NLEV= 6
##$NOISF1= 3.799351
##$NOISF2= 2.8
##$NSP= 1
##$NTH_PI= 0
##$NZP= 0
##$OFFSET= 15.70392
##$PC= 1
##$PHC0= -15516.28
##$PHC1= 15.00081
##$PH_mod= 1
##$PKNL= yes
##$PPARMOD= 0
##$PSCAL= 0
##$PSIGN= 0
##$REVERSE= no
##$SF= 200.130013532006
##$SI= 16384
##$SIGF1= 3
##$SIGF2= 2
##$SINO= 400
##$SIOLD= 16384
##$SREGLST= <1H.CDCl3>
##$SSB= 0
##$STSI= 0
##$STSR= 0
##$SW_p= 3612.71676300578
##$SYMM= 0
##$S_DEV= 0
##$TDeff= 0
##$TDoff= 0
##$TI= <>
##$TILT= no
##$TM1= 0
##$TM2= 0
##$TOPLEV= 0
##$USERP1= <user>
##$USERP2= <user>
##$USERP3= <user>
##$USERP4= <user>
##$USERP5= <user>
##$WDW= 1
##$XDIM= 8192
##$YMAX_p= 0
##$YMIN_p= 0
$$ End of Bruker specific parameters
$$ ---------------------------------
##NTUPLES= NMR FID
##VAR_NAME=  TIME,          FID/REAL,        FID/IMAG
##SYMBOL=    X,             R,               I
##VAR_TYPE=  INDEPENDENT,   DEPENDENT,       DEPENDENT
##VAR_FORM=  AFFN,          ASDF,            ASDF
##VAR_DIM=   8192,          8192,            8192
##UNITS=     SECONDS,       ARBITRARY UNITS, ARBITRARY UNITS
##FACTOR=    0.0002768,     1,               1
##FIRST=     0,             0,               0
##LAST=      2.2672688,     0,               0
##MIN=       0,             -268283,         0
##MAX=       2.2672688,     150293,          0
$$ Real data points
##PAGE= N=1
##DATA TABLE= (X++(R..R)), XYDATA
$$ [...]
2013B024k000j502L062pl110J662J682k571q80L027p60k411J466J845k567m47
$$ 2024 24 -1478 1584 1577 -1533 129 1811 -760 -1640 1387 627 -1784 -318 1527 -1040 -1487
2029a487K841j414k263K672J026l027O23K841j784j718K487Q16l008P75L083k304
$$ -1487 1354 -60 -2323 349 1375 -1652 -1029 1812 28 -1690 797 1613 -1395 -620 2463 159
2045A59j587K791o2k567J264K290k632j205K839k69k656J728J406k903r4K938
$$ 159 -1428 1363 1301 -1266 -2 2288 -344 -1549 1290 1021 -1635 93 1499 -1404 -1498 1440
2061A440j223k080K189J038k944K76L015j736j937K427R61k658Q24K007j559j280
$$ 1440 217 -1863 326 1364 -1580 -1304 1711 -25 -1962 465 1426 -1232 -408 1599 40 -1240
2077a240K248L95k691J118J779j909j024K457j77k417J347J716k064j031K627
$$ -1240 1008 1403 -1288 -170 1609 -300 -1324 1133 956 -1461 -114 1602 -462 -1493 1134
2092A134l93k525J632J464k104n14K467p65j884J378J354k017m5K397j259j874
$$ 1134 741 -1784 -152 1312 -792 -1306 1161 396 -1488 -110 1244 -773 -818 1579 320 -1554
2108a554K325O30k354N01J956j497j961K633O52k910Q09K543k335j189K688j27
$$ -1554 771 1401 -953 -452 1504 7 -1954 679 1331 -1579 -770 1773 -562 -1751 937 810
2124H10k403J185J875k080p22K760r85k025J946J289k312k34K116r61j739K282
$$ 810 -1593 -408 1467 -613 -1335 1425 440 -1585 361 1650 -662 -896 1220 259 -1480 802
2140H02Q72k979N98K126j827j300K393K42k147Q84J449j484r56K091j42k116J332
$$ 802 1674 -1305 -707 1419 -408 -1708 685 927 -1220 -336 1113 -371 -1327 764 622 -1494 -162
2157a62J717k217n09K200m21j887J074J712k006n51K523p70j895J673J059k004
$$ -162 1555 -662 -1171 1029 608 -1279 -205 1507 -499 -1050 1473 703 -1192 481 1540 -464
2173d64k30J839q12j579J718R06k596O32J709j336j411K262N6j973L83K072j511
$$ -464 -694 1145 333 -1246 472 1378 -1218 -586 1123 -213 -1624 638 694 -1279 -896 1176 -335
2190c35j459K423K08k428J590J804k083p89K342l86k184J643J374k555J61J989
$$ -335 -1794 629 837 -1591 -1 1803 -280 -1069 1273 887 -1297 346 1720 -835 -674 1315
2206A315r64j639J787O10k029K50J926j239j468K069K09k189O91J870j453j169
$$ 1315 351 -1288 499 1109 -920 -670 1256 17 -1451 618 827 -1362 -671 1199 -254 -1423
2222a423J825m7j543N54J661j488o28K195k38j927J259J379j844l43J943o98j912
$$ -1423 402 355 -1188 -634 1027 -461 -1089 1106 868 -1059 200 1579 -265 -608 1335 637 -1275
2239a275J723R64j943k73K020j083j366J358P65j660l74J994j099j284J787K00
$$ -1275 448 1412 -531 -804 1216 133 -1233 125 890 -770 -1144 850 -249 -1533 254 454
2255D54j807R90J487j590l79J448N4j723Q52J517j775l89J918m22j685J323R87
$$ 454 -1353 -363 1124 -466 -845 603 657 -1066 -214 1303 -472 -861 1057 635 -1050 273 1260
2272A260j661o22J968m56j617J171O61j348K8J742j404q84J404L32j644M43J558
$$ 1260 -401 -1023 945 489 -1128 43 704 -644 -616 1126 -278 -1162 242 574 -1070 -627 931
2289I31q39j390J974L19j835O12J480j410r16J708K84j888O34J548j361o58J609
$$ 931 92 -1298 676 995 -840 -228 1252 -158 -1074 634 918 -970 -336 1212 -149 -807 802
2306H02n73j051Q13P91j346m95J996p10j631J313J205k158O14J769j306q34J445
$$ 802 229 -822 -9 782 -564 -1059 937 227 -1404 -91 1114 -1044 -430 1339 33 -801 644
2323F44N22j723L81J469r66j361J857p1j595N92J268j492n75J608p7j421Q06R11
$$ 644 1166 -557 -176 1293 327 -1034 823 752 -843 -251 1017 -475 -1050 558 481 -940 -134 777
2341G77j564k80J838m79j358J103R47j624J18J463m36j680J665O29j864O79J352
$$ 777 -787 -1067 771 292 -1066 37 984 -640 -522 941 505 -1175 490 1119 -745 -66 1286
2358A286j212q84J472J21j524M29J339r80j291J835N0j860Q18J223j355q20J788
$$ 1286 74 -810 662 783 -741 -312 1027 47 -1244 591 641 -1219 -401 822 -533 -1353 435
2375D35K10j622M90J561j501k63J283k91j522J437R63j830J48J684q42j413J713
$$ 435 645 -977 -487 1074 -427 -690 593 302 -1220 217 1180 -650 -502 1182 340 -1073 640
2392F40M69j756M00J395j103j095J601M84k013M02J644j395p40J311q9j238P02
$$ 640 1109 -647 -247 1148 45 -1050 551 1035 -978 -576 1068 -327 -1067 244 155 -1083 -381
2409c81J241j341p22K018l19j847J281J070j526J07J323m73j097R32P82j498l9
$$ -381 860 -481 -1203 815 496 -1351 -70 1000 -526 -419 904 431 -666 266 1048 -450 -489
2426d89J514r33q92J477l6j379O38R55r46j019J599k22j269M63J516j467m47J557
$$ -489 1025 92 -800 677 641 -738 -100 855 -91 -1110 489 267 -1002 -539 977 -490 -937 620
2444F20k91j402R94J086j281m02J362k52j252J168Q27j609j1J366q80q48J417
$$ 620 329 -1073 -79 1007 -274 -676 686 434 -818 350 1177 -432 -443 923 43 -805 612
2461F12L17j639Q9J574r33j072J436K96j464M11J404p96j152J242K93j456O23
$$ 612 929 -710 -621 953 20 -1052 384 680 -784 -373 1031 235 -917 325 618 -838 -215
2478b15J411j520m58J309J8j347Q11R02j238n70J853q20j203J389M92j646J03
$$ -215 1196 -324 -782 527 545 -802 9 911 -327 -897 956 136 -1067 322 814 -832 -729
2495g29J517p01j021J278M32j838L15J709j066q79J446L4j213N55J045j196j32
$$ -729 788 87 -934 344 776 -1062 -747 962 -104 -983 463 497 -716 -161 884 -312 -444
2512d44J143j99j399R50P00j075j61J242o47r29O97O51j070p3J336k98j550J264
$$ -444 699 500 -899 51 751 -324 -485 757 110 -819 -122 529 -541 -614 722 424 -1126 138
2530A38L58j129K66Q87n69p55J161L79j039J95J179j072n73J081L22j289L66J065
$$ 138 496 -633 -367 520 -49 -804 357 736 -303 -108 1071 -1 -574 507 829 -460 -94 971
2548I71q30o81J037M09j497N80Q76j260j19J124l18j314O62R99j104l93J608p05
$$ 971 141 -540 497 906 -591 -11 865 -395 -514 610 292 -1022 -360 639 -465 -858 750 45
2566D5j193J295K94j228L72J407r70p67J182L16j090J07J175j101m43J406l19
$$ 45 -1148 147 441 -787 -415 992 22 -745 437 753 -337 -230 945 -156 -599 807 488
2583D88j279R06O89j090m87J383l64j238R18L43q79L5R90m38j009R14Q16j263
$$ 488 -791 115 804 -286 -773 610 246 -992 -74 269 -610 -575 415 -23 -1032 -118 698 -565
2601e65P9Q45j88q90J030K0j014N22Q96m88p97J100Q6j104N79Q31j121k22R11
$$ -565 -486 359 171 -719 311 331 -683 -161 735 247 -550 550 636 -468 111 942 -179 -401 510
2620E10p2j503R86Q54r99m23J153q1j300O97Q73j238P6R99l32q36P05O54r83K7
$$ 510 438 -1065 -79 775 -224 -647 506 425 -875 -178 695 -543 -467 532 200 -636 69 723 -260 -233
2640b33J078j116l81J303n4j087l4J181o81p48J128o4r55N75O56p40m40J121l12
$$ -233 845 -271 -652 651 597 -490 -524 657 -24 -772 356 292 -663 -88 568 -172 -612 509 197
2659A97q30P76L25r28K78J050o18p92R56K46j083R7R81k73j075Q00O36j328J02
$$ 197 -633 143 468 -460 -182 868 250 -542 414 660 -423 -326 655 382 -693 107 743 -585 -483
2678d83J016m20r41J351k13p57J21J116r32m90R83K11j333N19R52q91l69J144
$$ -483 533 113 -828 523 310 -447 -326 790 -142 -632 351 562 -771 -252 700 -191 -560 584
2696E84j62j170R42O83p90p12J362n00p83R40L78j257J30R65m60n23N66Oj360
$$ 584 422 -748 194 877 87 -625 737 237 -546 394 772 -485 -355 610 150 -373 193 199 -1161
2715a161R96N71q64l27R26K19j061O69O07r38n4J076j58p97L33N28q22k24Q36
$$ -1161 -165 406 -458 -785 141 360 -701 -32 575 -363 -417 659 501 -296 37 565 -257 -481 355
2734C55N7o30L83L16q09n0P48m65o59J067J12j041L31Q23n37m03O70R0r00J63
$$ 355 412 -218 165 481 -328 -378 370 -95 -754 313 425 -616 -285 538 1 -402 268 358 -542 -379
2754c79Q95o80o49J107K82j011M57O32r07n7Q74l09o68N15O86j075j84J176m21
$$ -379 516 -164 -813 294 576 -435 22 654 -253 -310 564 255 -413 102 788 -287 -471 705 284
2773B84p52N67L00o30j67J030m58p75P45M12q68J07P22r77k32J022l39m48P06
$$ 284 -468 99 399 -231 -398 632 174 -601 144 556 -312 -205 517 -460 -692 330 -9 -457 249
2792B49J85o31l53R41J88j042M33M90n26l90Q08J2o89O43r3k86k01Q17n46n81
$$ 249 434 -197 -550 391 579 -463 -30 460 -66 -456 352 364 -325 318 225 -61 -262 555 9 -572
2812e72M95L92p30K28Q57o05q02P84J28m94J20Q38o81m01O79L13j118M18R12p25
$$ -572 -77 315 -415 -187 670 65 -737 47 175 -319 -199 639 -42 -443 236 549 -569 -151 761 36
2832C6k88O83M9p77M47K65o71k19J061l49o49N09N48j027j08P63k60q11P75O96
$$ 36 -252 431 480 -297 150 415 -256 -475 586 237 -412 97 645 -382 -490 273 13 -798 -23 673
2852F73j067L6J080o57l24M05L70j047L61O81o21k64P56l36o48M33P46r59j04
$$ 673 -394 -358 722 65 -259 146 516 -531 -170 511 -110 -374 382 46 -602 -169 577 -382 -486
2871d86Q01N6r52L18O96o97l84J009k47o16Q37J38o65j58O03j15k68N85Q7p84
$$ -486 315 371 -581 -263 433 -264 -648 361 114 -502 335 473 -192 -350 253 138 -130 455 542 -242
2891b42J09O96n21l24O16J97r55K21P21n58o53R33J09j012O06N57o25m79Q86j81
$$ -242 -133 563 42 -282 334 531 -424 -203 518 -40 -693 240 349 -663 -57 500 -125 -604 282 101
2911A01o89M24O69o47q4N88k47n37M58P12q04j15P36k77r00Q27M13r97K89N04
$$ 101 -588 -164 505 -142 -226 362 115 -422 36 748 -56 -171 565 288 -612 215 628 -369 -80 424
2931D24m92n91P19M30r56P8O06j10o68N77J8o09M79J86k19m54J128k21j032R53
$$ 424 -68 -659 60 490 -466 -388 218 108 -560 17 35 -574 -95 91 -128 -582 546 325 -707 246
2951B46J51n00l3N88l67l67N99K76p14pP26p92n04R95L5o37K5M05k98q6L74Lp66
$$ 246 397 -103 -136 452 85 -282 317 593 -121 -128 598 -194 -698 297 332 -305 -280 125 -173 -259 115 118 -648
2974f48M30N06n31k61Q00J78q30J49P16n42l17Q49j37p84N78K78p98K93M32l26
$$ -648 -218 288 -243 -504 296 474 -356 -207 509 -33 -350 499 362 -422 156 434 -364 -71 361 35
2994C5l37L37J95l91l00Q51n23m35R30r3p46J01N03j15m00N46J71p09N23M14o85
$$ 35 -302 35 230 -161 -461 390 -133 -568 362 269 -477 -376 127 12 -388 158 329 -380 143 557 -128
3015a28l68J087n12l14K04N39p90k49R48k32o59P19m2n47j23P48q8q67O32L88
$$ -128 -496 591 79 -235 -31 508 -282 -531 417 185 -474 245 203 -344 -467 281 193 -674 -42 346
3035C46q44K61M58k63l08O37Qn86J07N72j67n06P49k36o83M61N07n65l57Q91m07
$$ 346 -498 -237 221 -42 -350 287 295 -291 -184 388 221 -285 464 228 -455 6 513 -52 -409 482 75
3056G5m91L94K57l12l30Q55k79l70L11j23k74k4O04k59l22L89L92o47K38L63l52
$$ 75 -416 -22 235 -77 -407 448 169 -201 110 -13 -287 -311 293 34 -288 101 493 -154 84 447 95
3077I5m06N08K63p22q4P40k41m68O44j06m41j04O03l96p1L48L0n78K20M23n98
$$ 95 -311 197 460 -262 -346 394 153 -315 329 223 -218 -322 281 -115 -186 162 192 -386 -166 257 -341
3098c41p1P40j35p76N66L31n62j40O68k04l63N81K02o22o0M19l80j34O59j51k93
$$ -341 -412 328 193 -583 -17 314 -248 -388 280 76 -287 294 496 -126 -186 233 -147 -281 378 227 -66
3119f6j84M74k32k55N36p7n24K22N88p17l53N10L94m01l8N28o68Q3P02m36m29
$$ -66 -250 224 -8 -263 273 196 -328 -106 482 -235 -588 -78 316 -85 -123 405 -263 -180 522 86 -343
3140c43M63M7j1m93O08j23m99N07J47q79M27O83m70m17M63J14l94j17M41l7n47
$$ -343 120 167 156 -337 271 148 -351 156 303 -576 -149 534 64 -353 110 224 -170 -287 154 117 -430
3161d30P18k37k35K62L69n46k89N04J27n74N94L21p14r4N39l80l85L10K70j58
$$ -430 288 51 -184 78 447 -99 -388 116 243 -331 263 584 -130 -224 315 -65 -450 -140 130 -28
3181b8l14N61j50m10M30J34n45J57M70m22k37N96p0n42M44M11p90J33P59k92q63
$$ -28 -342 219 69 -341 89 223 -322 -165 305 -117 -354 242 172 -370 74 485 -305 -172 587 295 -568
3202e68M04L97n3o48O23L3m05J55L03m64J98L10m61k78N46r8k81M3N25m86j44
$$ -568 -164 233 180 -468 155 188 -217 -62 241 -223 -25 285 -176 -454 92 -6 -287 -244 281 -205 -349
3223c49M14K34m34J51J47k38j34N06j1p35M32K38k61M4P5j2j54J65J89l79Q3M24
$$ -349 65 299 -135 16 163 -75 -209 297 286 -449 -17 221 -40 4 79 67 -87 78 267 -112 -29 395
3245C95k86n66N45K38m63rK05j12k59M64nl44J52M03k93l31K49O1l86L29K04k15
$$ 395 109 -457 88 326 -137 -146 59 -53 -312 152 147 -197 -45 358 65 -266 -17 44 -342 -13 191 -24
3267b4o7M48j19k95M1K45k82j81P17m53m27K21L84k98o1K78r9n62N46K93l59J3
$$ -24 -91 357 238 -57 -16 229 -53 -234 483 30 -397 -176 208 -90 -151 127 28 -534 12 305 -54 -41
3289d1L34l36j44L46J75n29J09L27r1n35N55P5n36K44J53k37q5N50k43j98n4L66
$$ -41 293 -43 -187 159 334 -195 -86 241 150 -385 170 245 -291 -47 106 -131 -216 334 91 -107 -161 205
3311B05n36J45L21l25p1K72K01l35oM01k47k37L26J32j34j59L38j62m57O09K06
$$ 205 -331 -186 135 -190 -261 11 212 -123 -129 272 25 -212 114 246 112 -47 291 129 -328 281 487
3332D87o07J09L82m68j78O77m26l67J09N53m29k9M29r2k30J16K93o66J80M11q7
$$ 487 -120 -11 371 -97 -275 402 -24 -391 -282 271 -158 -187 242 150 -80 36 329 -337 -157 254 167
3353A67o22O23L65o44L1J52q9k32P51j37m97J55J94n23O7K39Q1m56M02L05m40
$$ 167 -455 168 533 -111 -80 72 -17 -249 502 365 -132 23 217 -306 -239 0 81 -375 27 332 -108
3374a08q7M77j23m33M70N3l35o9M82k95j54K76J79m73l0L26J48m40l1M68m72O9
$$ -108 -195 282 159 -274 196 249 -86 -155 327 32 -122 154 333 -140 -170 156 304 -136 -167 301 -171 -102
3396a02L34l34k30M23J04n34J80L34j00k12J72k9j53O6L23p01P9P89k51l75L95
$$ -102 232 -102 -332 91 195 -339 -159 175 75 -137 35 6 -147 -81 242 -459 -380 409 158 -217 178
3417A78K02m21j18N66r0n71L49P1m2j13L62r6m42M38j70l91L09P6k40j46K28K06
$$ 178 380 -41 -159 407 317 -254 95 166 124 11 373 277 -165 273 103 -288 21 97 -143 -289 -61 145
3439A45k31J17o3L4l12M97k32r8J50P8Q4l33L16L8m67J52N59m64j73L59J3m04
$$ 145 -86 31 -32 2 -310 187 -45 -143 7 85 169 -164 152 190 -277 -125 434 -30 -203 156 169 -235
3461b35L63p1k56J17K45%m47J53J53k57J83L39n13K15K2L21m37Q1K43r7j11P3
$$ -235 128 57 -199 -82 163 163 -284 -131 22 -235 -52 287 -226 -11 11 332 -105 -24 219 122 11 84
3483H4N4l72Q6M00j64k83K61l1k64L03j03Jk71N28j50j33j10J31j64J9M21l91
$$ 84 138 -234 -148 252 88 -195 66 35 -229 74 -29 -28 -299 229 79 -54 -164 -33 -197 -178 243 -148
3505a48J05J78n5k33P7K28l84J19J90R2l66K04K48l97k04O05k87l74L04K04k14
$$ -148 -43 135 80 -153 -76 152 -232 -113 77 169 -197 7 255 -142 -346 259 -28 -402 -98 106 -108
3526a08l81L90L43p6k62M65l94l32P19q1l69L64O6o64J08K94J18k86J8L13l82
$$ -108 -489 -99 244 168 -94 371 -23 -355 364 283 -86 278 344 -320 -212 82 200 -86 -68 245 -137
3547a37J25J1j67N1J97K6l32J03M27k11j14J38o1k34N1L32r8j63J06O9k38K58
$$ -137 -12 -1 -168 -117 80 106 -226 -123 304 93 -21 117 56 -178 -127 205 107 -56 50 119 -119 139
3569A39M2o0k0J48Ml65P3J78k80r0P11k41n79M12O2k82j1L20q9k95L99j47k07
$$ 139 181 121 101 249 253 -112 -39 139 -141 -231 480 239 -340 72 134 -148 -159 161 72 -223 176 29 -178
3592a78j80M41l2j86L42k90nJ50Q1j80k42L22P1j40qM30k64j83L00k79N1J45J10
$$ -178 -358 83 51 -135 207 -83 -88 62 143 -37 -279 43 114 -26 -34 396 132 -51 249 -30 21 166 276
3615B76m59K54p6J19k86P6J81k37L05r2j95N3K68j35l31P6N26l32j94K96J9p2
$$ 276 -183 71 -5 114 -172 -96 85 -152 153 61 -134 -81 187 52 -279 -203 323 -9 -203 93 112 40
3637D0j13K26j86R7J04l18q6J75L02k43k56M51R3n65K80L35m14j34N01m55N9K21
$$ 40 -73 153 -33 64 168 -150 -236 -61 241 -2 -258 193 286 -279 1 336 -78 -212 289 -166 -107 114
3659A14L4j83ML41l44j02J00J32k35L13m5l44M4L77n4l58J98K21k77j4J82Kj57
$$ 114 148 -35 -31 310 -34 -136 -36 96 -139 174 129 -215 -171 206 152 -206 -8 213 -64 -78 104 106 -51
3682e1J1K78j24l1J36k76j04M8J77k29j08J98J09k41J44K07q6l2J27j34j77K79
$$ -51 -40 238 114 83 219 -57 -161 -113 64 -165 -273 -75 34 -207 -63 144 58 26 153 19 -158 121
3704A21j94J25k1K72m40k0K09N9l45K65O7k50k6M90k06k26L04J62l79k16L61j95
$$ 121 -73 52 31 303 -137 -157 52 111 -234 31 98 -152 -178 312 106 -120 184 346 -33 -249 112 -83
3726h3l55L46P8l6j64K31L0k01M05o9j01j7K6k89j03K60l4j1j12K61K5k56M92
$$ -83 -438 -92 -14 -50 -214 17 47 -154 251 182 81 64 90 -199 -302 -42 -76 -87 -199 62 87 -169 323
3749C23k48n9j95K13k76J92K26n8j78o1K75k34K21j35L4k56K40J07k11k64M80
$$ 323 75 16 -179 34 -242 -50 176 118 -60 -121 154 -80 141 6 40 -216 24 131 -80 -344 136
3770A36k20R6K21j24K52n94N85m35j51M58j04k93L67j60j45j02R0K17k53o3N48
$$ 136 -84 12 233 109 361 -233 352 -83 -234 224 120 -173 194 34 -111 -213 -123 94 -159 -222 326
3791C26o27N19j24j3j26M06m53L5r1M39n05J29J70J30l62K77Q4k65Jk7J11m0l2
$$ 326 -301 218 94 81 -45 361 -92 -57 -148 291 -214 -85 85 215 -147 130 214 -51 -50 -77 34 -6 -38
3814c8L02j15l22K90j42r0J17J8o8j16L12k5k09K8N20l39q6K37m84K28J29j04
$$ -38 264 149 -173 117 -25 -115 2 20 -48 -164 148 123 -86 -58 462 123 37 274 -210 18 147 43
3836D3q9j99L28k71O9L54o4l72J4K31j23j50K02P3j14q0J40J35k51j06M36k55
$$ 43 -46 -245 83 -188 -119 235 171 -201 -187 44 -79 -229 -27 46 -68 -148 -8 127 -124 -230 206 -49
3858d9P4PL5m6j63L92l89j4K37P8Q3j38j58k46L43k54P8O9L23j70k92K70j5k82
$$ -49 25 32 67 21 -142 250 -139 -153 84 162 245 107 -51 -297 46 -208 -130 -61 262 92 -200 70 55 -227
3882b27L01m8k94K02J18O7j86N7l2p5J52J23o6k34K22J70m52J25K3J87q0N8L9
$$ -227 74 26 -268 -66 52 119 -67 -10 -42 -117 35 158 92 -142 80 250 -202 -77 -54 133 53 111 150
3905A50k21k55M94k67k9K35K5Qk31K33k42J2J07O7l89K55L68k31L9L05j77l66
$$ 150 -71 -326 168 -99 -128 107 132 140 -91 142 -100 -88 19 86 -303 -48 320 89 128 433 256 -110
3927a10O2J90r0k3L93l40j94l5K00j25l1j97L61m2j37J88j60P7Q5j60L0J45P2
$$ -110 -48 142 52 29 422 82 -112 -147 53 -72 -103 -300 61 19 -118 70 -90 -13 72 -88 -58 87 159
3950A59j2j03K55k31r1j68M45k84PK5m8R1J5j5j99K20m5j9j59J47l9L4J82k06
$$ 159 147 44 299 68 -23 -191 254 -30 -23 2 -46 45 60 45 -154 66 21 2 -157 -10 -49 -15 167 -39
3974c9k18L48m9n3J1j04K70l03R3M4l3j71J67K12k25q6o0j6L31J05j07m08L72
$$ -39 -257 91 42 -11 0 -104 166 -137 -44 0 -33 -204 -37 175 -50 -136 -196 -212 119 224 117 -291 81
3997H1O1j8j79L67j66j54r3J68k3n3J21J7j54M2L18n42Q4L59l65K26j35J4J19
$$ 81 142 124 -55 312 146 -8 -101 67 44 -9 112 129 -25 17 335 -207 -123 236 -129 97 -38 -24 95
4020I5q6J81j21n2n6r4K41j01O9R3k35O8m0j19J83J39J1m07K67K35k58k32N28
$$ 95 9 190 69 17 -39 -133 108 7 76 169 -66 2 -38 -157 26 165 176 -231 36 271 13 -219 309
4043C09l35j20L04L5k00J85j93M9p2N4p6q7K34j83O8j98K95l42L38J9Q2l96M00
$$ 309 -26 -146 158 193 -7 178 -15 34 -38 16 -60 -147 87 -96 -28 -226 69 -273 65 84 166 -230 170
4066A70R9k42j24J37j09j2J37j85K20k18K60o1l32M98j40k85l1K45Mj41P2J43
$$ 170 269 27 -97 40 -69 -81 56 -129 91 -127 133 72 -260 238 98 -187 -218 27 31 -110 -38 105
4088A05j34p7L47k61j07J68M6J06j51j38n9Q9J39n1n0J09J20j15j80K33o5k14
$$ 105 -29 -106 241 -20 -127 41 87 193 42 -96 -155 -66 73 22 -28 81 201 86 -94 139 74 -140
4110a40J87K69k00l93M68l44J98k93K15J54k43K30L3k16J28J53j92M6k9j31J68
$$ -140 47 316 116 -277 191 -153 45 -248 -33 121 -122 108 141 -75 53 206 14 60 31 -100 68
4131F8q4Rj93m9M82m24J20P0K17l90J77K32j96j84J07K8L7L2q9k14K16K66M4j15
$$ 68 -16 -7 -200 -249 233 -191 -71 -1 216 -174 3 235 39 -145 -38 -10 27 59 -30 -244 -28 238 282 167
4155A67j10k78M1j8K02l6j26Q5J64o6k92L41J22m17L29N7j98R9K57k43n1J41K54
$$ 167 57 -221 -180 -198 4 -32 -158 -73 91 25 -267 74 196 -221 108 165 -33 66 323 80 29 170 424
4178D24l04j83K03o7m21N63j24k57J60J4o8m1K87k1k35J02KL6k03J58J7k48J97
$$ 424 120 -63 140 73 -348 215 91 -166 -6 8 -60 -101 186 165 -70 32 34 70 -133 25 42 -206 -9
4201iJ64l81K1L56k00j28K97j19M2J97k28k01k6J39J45l19J22R3k9k54K30J41
$$ -9 155 -226 -205 151 -49 -177 120 1 43 240 12 -189 -215 -76 69 -250 -128 -35 -64 -318 -88 53
4223E3j38J35n0j21j42L51J84m59K63j39j98K58K4J6j4OJ47l17R2K50k93l3J30
$$ 53 -85 50 0 -121 -263 88 272 -187 76 -63 -261 -3 21 37 23 29 176 -141 -49 201 -92 -125 5
4246EJ19J4k69K45j81j90K79k8j57K28R8m4k63K50n4k36N9K37k40j69K35J14m5
$$ 5 124 138 -131 114 -67 -257 22 -6 -163 65 163 119 -144 106 52 -184 -125 112 -128 -297 -62 52 7
4269GJ01K92m82K07j20J69m66L33l7J37j57J13j25k2O4J21j08m5J20j80rM02p7
$$ 7 108 400 -82 125 5 174 -292 41 4 141 -16 97 -28 -50 14 135 27 -18 102 -78 -87 315 238
4292B38m60L48j63R0j95M0K80l61J52J16k91L31j59K53m16L15J00p8O3l18K81
$$ 238 -222 126 -37 53 -142 -102 178 -183 -31 85 -206 125 -34 219 -197 118 218 140 203 -115 166
4313A66m08J69J24j97o1L57K8j55r5J00J6J37O9j3l24J2P3Pk00K50J8k68M60k35
$$ 166 -242 -73 51 -146 -207 150 178 23 -72 28 44 181 250 237 -87 -75 -2 5 -195 55 73 -195 265 30
4337C0J23j74K25j5l78J14L7q8K41K0r3l39L28p1j0K79k35k51M58j93J8l9j57
$$ 30 153 -21 204 189 -189 -75 -38 -126 115 135 42 -297 31 -40 -50 229 -6 -257 201 8 26 -13 -170
4360a70L30j21j08R3j79j89J11O38m17m4K33l62R9R5k9n3L4J69k38Q3jm8J20K40
$$ -170 160 39 -69 24 -155 -344 -233 405 -12 -56 177 -185 -86 9 -20 -73 -39 130 -108 -25 -26 -74 46 286
4384B86Q0m16j5J20n7j2L99j26k59%J12l07J66R6J67m29K70O3p6j32M1k08K80
$$ 286 366 -50 -65 55 -2 -14 385 259 0 0 112 -195 -29 67 234 -195 75 138 62 -70 -29 -237 43
4407D3j76K68o9k36M51l23r7J33K46k17r0J71M8k75R5Kp4J27j05K48j66j55K93
$$ 43 -133 135 66 -170 281 -42 -139 -6 240 23 -67 104 152 -123 -28 -26 -100 27 -78 170 4 -151 142
4430A42j39N4J79j48l80M32k3j90k5L39m50R2J03m9j44K63k71R7n1N7K23k10R8
$$ 142 3 57 236 88 -292 140 117 -73 -98 241 -209 -117 -14 -63 -207 56 -215 -118 -169 -112 111 -99 -1
4453aQ3k54L50k41J50k66L47j38m85K37K79j40j46N55k47j53K4K33K8l22K16p3
$$ -1 82 -172 178 -63 87 -179 168 30 -455 -218 61 -79 -225 330 83 -70 -46 187 215 -107 109 36
4475C6k32K98j20Kj4K43k67j10J11K13k46q2N69l69j34J74K55o19K58J50l01J20
$$ 36 -196 102 -18 -16 -30 213 -54 -164 -53 160 -86 -168 401 32 -102 72 327 -292 -34 116 -185 -65
4497f5J04L6j2j45L9k63J27O6L5l2o7J35L55l57Q2K40k85J63j2k84N6J39j27r2
$$ -65 39 75 63 -82 -43 -306 -179 -113 -78 -110 -177 -42 313 -44 38 278 -7 156 144 -140 -84 55 -72 -164
4521a64J18Q0K7k52L65l62J63J28r2no8P3J24l16N6K08r5J79J57k44j46j1P1J63
$$ -164 -46 34 61 -191 174 -188 -25 103 11 6 -62 11 135 -181 -125 83 -12 167 324 80 -66 -77 -6 157
4545A57j54J19J23l65L17j61j68L69k07j9m6J17n7k62L4J04mk44L37O2m29K51
$$ 157 3 122 245 -120 197 36 -132 237 30 11 -35 82 25 -237 -203 -99 -103 -347 -10 52 -377 -126
4567a26Oj31K54K7N6r0Q4p9l4J6J09N0l41L82l94J67J57J20l04M1K33l79O1j9
$$ -126 -120 -251 3 30 86 -4 80 1 -33 -17 92 142 -199 183 -211 -44 113 233 -71 -30 203 -176 -115 -134
4591a34K81j50Q1o1Nj50K64p5k92J62L5k35J82J43q8p9J03K74j64k47L5J95k25
$$ -134 147 -3 78 17 22 -128 136 61 -231 -69 -34 -269 -87 56 -32 -111 -8 266 102 -145 -110 85 -140
4614a40o5K04J20k86J22N3p4p8P5O7l03K76M0Mm2j4J03k03K62j37p9J33K35l50
$$ -140 -205 -1 119 -167 -45 8 -66 -144 -69 -2 -305 -29 11 15 -27 -41 62 -141 121 -16 -95 38 273 -77
4638g7j9M14n33j2K8N93l17k1L63k82k17q7J28R8j90J79k65q1N6L48l12n9K82
$$ -77 -96 318 -215 -227 -199 394 77 56 419 137 -80 -167 -39 59 -131 48 -217 -298 -242 106 -206 -265 17
4661A7j29J23o4k4n7K20p0r2J61J51n3k27J67K76n59K55kk5K53m54K72l30Q7Q
$$ 17 -112 11 -53 -77 -134 86 16 -76 85 236 183 -44 123 399 -160 95 93 68 321 -133 139 -191 -104 -96
4685i6R2O5k26L55l29Q0K16j84j26J79J76n90K32K32K5j59J90O1l33J89K27j82
$$ -96 -4 61 -165 190 -139 -59 157 -27 -153 26 202 -388 -156 76 101 -58 132 193 -140 49 276 94
4707I4k21K96j68P3j39J30l5J3j3j14pM3L0k13J26q8L16l72K17J82k65L61k09
$$ 94 -127 169 1 74 -65 65 30 43 30 -84 -91 -48 -18 -231 -105 -193 123 -249 -32 150 -115 246 37
4730C7k32J60K71k22j7J13K72m64J95j21n1m0k4L46p1l09K48Q0j20P6k73J95j33
$$ 37 -195 -35 236 14 -3 110 382 -82 113 -8 -59 -99 -123 223 152 -157 91 171 51 127 -146 49 -84
4753h4K55k93k33O27k35j57N8L03k40j13L26N8l17K5q9Q9k17K48K77m61L24k39
$$ -84 171 -122 -355 272 37 -120 -62 241 1 -112 214 272 -45 -20 -109 -20 -237 11 288 -173 151 -88
4775h8l7L2m4PJ23j86j5M12k16L14k10k40N4J33K4J58p8j94J84J85k64p1O0nN6
$$ -88 -125 -93 -137 -130 -7 -193 -208 204 -12 302 92 -148 -94 39 63 221 143 -51 133 318 54 -17 43 38 94
4800I4j89L0M8R6j06M2j0k53K65m3j1R1K1m31L47L4k76L4L08K20k36r6K07l06
$$ 94 -95 -65 -17 79 -27 15 5 -248 17 -26 -37 54 75 -356 -9 25 -251 -217 91 311 75 -21 186 -120
4824a20J48J13j87M5j9J46j1j00j04J40n0J10l1k44N1J58M1l20K10J98n32J21
$$ -120 28 141 -46 -1 -20 126 115 15 -89 51 1 111 80 -164 -113 45 86 -234 -24 174 -358 -237
4846b37L51k53J4j0L17n10N48Jr7j37P4k18J76Q8kO4k75M6n9M6j70J54N3j39J0
$$ -237 114 -139 -125 -135 182 -328 220 221 124 -13 61 -157 19 107 105 169 -106 -60 -119 -73 -243 -89 -36 -175 -165
4871a65J37j9j3p2J63o7o6O3K28j55l6M3q7K53j99p1J8L9O2k2O9J51k96l7J03
$$ -165 -28 -47 -60 -132 31 -36 -102 -39 189 34 -2 41 -46 207 8 -63 -45 -6 56 34 103 254 -42 -79 24
4896B4j23J11J03m3l51J97K35j37j98L23n1m19M56j73k52J87J95j44K17q0J38
$$ 24 -99 12 115 72 -279 -82 153 16 -182 141 90 -329 127 -46 -298 -111 84 -60 157 77 215
4917B15l36K35q9N2k64K13k44K1L32R7j76r0J95k13LM1K3l17N37k66j63nL35k23
$$ 215 -121 114 25 77 -187 26 -218 -197 135 232 56 -34 161 -52 -49 -8 15 -302 235 -31 -194 -199 136 -87
4941h7j42L77l00K92j79K86j48j35O0k0r4O8J06M1j15j11J51k03K14J02j7j86
$$ -87 -229 148 -152 140 -39 247 99 -36 24 4 -90 -22 84 125 10 -101 50 -153 61 163 146 -40
4963d0J4L03l13k08L85k79q8M75l53J6O0J05l9q7L24l67M0r6L34l73K05m6J24
$$ -40 -26 277 -36 -244 141 -138 -226 249 -104 -88 -28 77 38 -49 275 -92 -52 -148 186 -187 18 -28 96
4986I6l88M97j95J08j16J5J08j17j5L0j79L9P8o4k19K67J80j90K6k54L26k17L15
$$ 96 -292 205 10 118 2 17 125 8 -7 23 -156 -117 -39 -103 -322 -55 125 -65 -39 -293 33 -184 131
5009A31j41j18K9K81l63K3J16K80n25M47Kk45K7K03j56J04j47Q3J8k42K90m2j76
$$ 131 -10 -128 -99 182 -181 -158 -42 238 -287 160 162 -83 -56 147 -9 95 -52 31 49 -193 97 55 -121
5032a21P2J79j65j14J62k29R0J47Rj32j41M48k12K20q3M2l28q2K18J25k58L13
$$ -121 -49 130 -35 -149 13 -216 -126 21 30 -102 -243 205 -7 213 130 172 -156 -238 -20 105 -153 160
5054A60n1k35O9K93r5m62N14j35j91K39J34l96O4M7K37k74P7L61m83J92J21p7
$$ 160 109 -126 -57 236 141 -321 193 58 -133 106 240 -156 -92 -45 192 -82 -5 356 -127 65 186 109
5076A09j82J70j12o8J22n1jL6l9Rk31K68pj4km5J5mQ3K5j47j82N11l13N5K08Q3
$$ 109 -73 97 -15 -83 39 -12 -13 23 -16 -7 -238 30 23 9 7 -38 -23 -27 56 81 -66 -248 263 -50 5 213 296
5103B96k73j70K23j5l82N56j30j74L8J96q6k54K94j25Rk12L45k68j5M93j82m28
$$ 296 23 -147 76 61 -321 235 105 -69 -31 165 79 -175 119 -6 3 -209 136 -132 -147 346 164 -264
5125b64M34Q3r0j34J7j00N4Q2pk51J39K35j58R1r9r0J12j14K63l2l05L19J0l96
$$ -264 170 253 163 29 46 -54 0 82 75 -176 -37 198 40 131 32 -58 54 -60 203 171 -134 185 195 -201
5149b01J85q5R3q1j0J89j25L0J7R7k48L25j27k36K07j56J02M1l2J06j77O7L6j7
$$ -201 -16 -101 -8 -89 -99 90 -35 -5 12 109 -139 186 59 -177 30 -126 -24 17 -15 91 -86 -19 17 0
5173@m7N1j0o0M5J06J25k89J11Lj99K28j61j9n7L98k44r7jK27k43N2M85m06m6
$$ 0 -47 4 -6 -66 -21 85 210 -79 32 35 -164 64 -97 -116 -173 225 -19 -116 -117 110 -133 -81 404 -2 -48
5198d8j47J69P1l9J84k95K23j1mk77P1K34j13k32K20lr2O2J50l52N9K85l10p0
$$ -48 -195 -26 45 6 190 -105 118 107 103 -174 -103 131 18 -214 6 3 -89 -27 123 -229 -170 115 -195 -265
5222b65L87K02l59k2P0j56J07R5qk16M45q3k15n3M5j7J95j00M4k38J83q8J21l07
$$ -265 122 324 -35 -57 13 -143 -36 59 51 -165 280 197 -18 -71 -26 -43 152 52 96 -142 41 -47 74 -233
5246b33K83j53J7n2k0J38o2r5J98J98m58N35m05P7K82k66o3K00j5k63J29J13j54
$$ -233 50 -103 -86 -138 -158 -20 -82 -177 21 219 -239 296 -109 -32 250 -16 -79 121 106 -157 -28 85 -69
5269f9N5k9J32k78N6K43j83j7O2K04jk97L80l7j75j14N3k50P4K59L6j96J82p6
$$ -69 -14 -43 89 -189 -133 110 -73 -90 -28 176 175 -122 258 221 46 -68 -15 -265 -191 68 104 -92 90 14
5293A4n5j02M16k86JL10k16k24M7J33l05K47Q2J25j70q5J87m95N61l26j8J61j94
$$ 14 -41 -143 273 -13 -12 298 82 -142 -95 38 -267 -20 62 187 17 -68 119 -376 185 -141 -159 2 -192
5316a92K1J14m8K38o0n31N67j51j9j60J12Q9k4k3J67j07L5Q6J9l56M6K72j96O1
$$ -192 -171 -57 -105 133 73 -458 109 -42 -61 -221 -109 -20 -44 -67 100 -7 28 114 133 -223 -177 95 -101 -40
5340d0j13R7n9o5K08%L4P1q6m19J93K46k17J76l7P2l82K00J27k17M00j56j67K04
$$ -40 -153 -56 -115 -180 28 28 62 133 47 -372 -179 67 -150 26 -11 61 -321 -121 6 -211 189 33 -134 70
5364G0j16J28k90q0O3K76j00j61L00j70K08j55j36J75L4r2L7j84L71k22m2p5J45
$$ 70 -46 82 -208 -288 -225 51 -49 -210 90 -80 128 -27 -163 12 46 -46 -9 -193 178 -44 -86 -161 -16
5387a6J56J54K7k06K60k66J01j23r1J7j60M59k09l04L28q5J04k21q6R8O5j26J16
$$ -16 140 294 321 115 375 109 210 87 -4 13 -147 312 103 -201 127 42 146 -75 -161 -63 2 -124 -8
5410hl8j12K22K18l01J90l7j92p4k2K08j75LK88q8l42K44J4k14L49j19k33J07
$$ -8 -46 -158 64 282 -19 171 134 -58 -132 -154 54 -121 -118 170 82 -260 -16 -2 -216 133 14 -219 -112
5433a12J07L5j42JJ91M8J5r1K3l05J65k9K9j40L10n5k09K83K6q6q6l4K81k61J07
$$ -112 -5 30 -112 -111 80 128 143 52 75 -230 -65 -94 -65 -205 105 50 -159 124 150 64 -22 -56 225 -36 71
5458G1j37N0K07k44q2jJ80k4k84p4L92k45J17J97j33k49K69J08j05k04M27k03
$$ 71 -66 -16 191 -53 -135 -136 44 20 -264 -338 54 -191 -74 123 -10 -259 10 118 13 -191 236 33
5480C3j52K93o3j66l1K14j01m9J58Q1k69R2l7j19o8J29o0m8L1K05j4j20J29J53
$$ 33 -119 174 111 -55 -86 128 27 -22 136 217 -52 40 3 -116 -184 -55 -115 -163 -132 73 59 -61 68 221
5504B21l34q6K00p3j0Q0N6j64K50n2r0k2J27j13J8M7j90J83nJ22k11O1O7j04k43
$$ 221 -113 -199 1 -72 -82 -2 54 -110 140 88 -2 -24 103 -10 8 55 -135 48 43 165 -46 15 82 -22 -265
5529b65K79J75m84P3K62r4j81J75J31k33K17L8kj13j3P5K11l77K20j57J50l63
$$ -265 14 189 -295 -222 40 -54 -235 -60 71 -162 55 93 91 -22 -35 40 251 -126 94 -63 87 -276
5551b76N55m02O1J89j29p3J77pk68O2N7O6j38J76oj40K75k18J67k00P2p6K10j72
$$ -276 279 -123 -62 127 -2 -75 102 95 -173 -111 -54 12 -126 50 44 -96 179 -39 128 -72 0 -76 134 -38
5575c8M20l19MJ25l51M6Q5l0No3M42m44K39j64q1N5J73O9q3m39M11N1k22K87j69
$$ -38 382 63 67 192 -159 -113 -28 -58 -53 -116 326 -118 121 -43 -124 -69 104 173 90 -349 62 113 -109 178 9
5600IM4k03Q8J54j13j85K52l06J56M8J42k44P1J58k10J79j3j24J61R0l3k19J14
$$ 9 53 -150 -62 92 -21 -206 46 -260 -104 -56 86 -158 -87 71 -139 40 27 -97 64 154 121 -98 16
5623A6M9j50k32L58K8j61J5J31k64K36M6k8j64K41nk80k9M48l24J65j62j3M3N0
$$ 16 65 -85 -317 41 69 -92 -77 54 -210 26 72 44 -120 121 116 -164 -193 255 -69 96 -66 -79 -36 14
5647A4K21o6ql65J61l65K31K01j11o2J25K50m04J37M55m63L4K8o9K0J41j0l56
$$ 14 235 169 161 -204 -43 -408 -177 24 -87 -149 -24 226 -178 -41 414 -49 -15 13 -56 -36 105 95 -261
5670b61J38K39k68K25kj6q1j53K37r6Q4j76K46Lj01j39J00j29L2Q1j44OK15p0
$$ -261 -123 116 -152 73 71 55 -26 -179 58 -38 46 -130 116 119 18 -121 -21 -150 -118 -37 -181 -175 40 -30
5694c0j93K03m5K5%o4K83l12K27j09j51L23J66l93o9K03j55K29%j46n7j85K45
$$ -30 -223 -20 -65 -40 -40 -104 179 -133 94 -15 -166 157 323 -70 -139 64 -91 138 138 -8 -65 -250 -5
5717ek26J37J71j19R5o9J43k02J25j17J62p8L2K55n01j6K42q1M1J20k07q5K10
$$ -5 -231 -94 77 -42 53 -16 127 -75 50 -67 95 17 49 304 -197 -213 29 -52 -11 109 -98 -183 27
5740B7J56k8l65O8K04j86J17p1k43L13j36M4j02K28j16m02M67p0Q2K6j04J69j8
$$ 27 183 155 -210 -142 62 -124 -7 -78 -321 -8 -144 -100 -202 26 -90 -492 -25 -95 -13 13 -91 78 60
5763F0r8L53k36j15m7J34k28K26k8Mj68J54K2p4j3L16p2k56k36R4J45m1L34l47
$$ 60 -38 315 79 -36 -83 51 -177 49 21 25 -143 11 33 -41 -54 262 190 -66 -302 -208 -63 -104 230 -117
5787a17mL21k94jQ5L07m00r4L13P4j83J97n1m68K65P6j27J11P5k24j11J06K81
$$ -117 -121 200 -94 -95 -10 297 -103 -197 116 190 7 204 153 -315 -50 26 -101 10 85 -139 -250 -144 137
5810A37j9j27M3NL6j14J08P1k13m0L44m31K55N1n5j4j47J93L1p4j39q4J54N6J3
$$ 137 118 -9 34 39 75 -39 69 140 -73 -113 231 -200 55 106 51 37 -110 83 114 40 -99 -183 -29 27 40
5835D0j33r7K74l43M35Q7j60l17K28Q1l47L02oJ60k94l7J71j78j32M61p8k78K43
$$ 40 -93 -190 84 -259 176 263 103 -214 14 95 -252 50 44 204 -90 -127 44 -134 -266 195 117 -161 82
5858H2j8l8l30N05k01q2m8j23K94O6m4m3k82L04M3J3k91M90m27K4K35k26K13k40
$$ 82 64 26 -304 201 0 -82 -130 -253 41 107 63 20 -262 42 85 98 -193 297 -130 -106 129 -97 116 -124
5882a24J77J3J84m59L14k30J96K21l12Q1j16K10q3j87l7K06j74K9m1K3J76J11
$$ -124 53 66 250 -209 105 -125 71 292 -20 61 -55 155 72 -115 -152 54 -120 -91 -132 -109 67 178
5904A78j88K21L9l84j14L69j86J99j82Q4n4J68k41K83n58K29L22k54K32p2k00
$$ 178 -10 211 250 -134 -248 121 -65 134 -48 36 -18 150 -91 192 -366 -137 185 -69 163 91 -109
5925a09M8p8K07m5j55K31m2j05K62k55j01J95q9L6l1j17PK6M7R1j2l7o0J97l34
$$ -109 -61 -139 68 23 -132 99 57 -48 214 -41 -142 53 -36 0 -31 -148 -141 -115 -68 23 11 -26 -86 111 -223
5950b23J60J4j00j14L25K85m48K3N5Nj4J44K0%k29M4r0Q9j9J19l11O6J27R4l6
$$ -223 -63 -49 -149 -263 62 347 -101 -78 -23 -18 -32 112 132 132 -97 -53 -143 -54 -73 46 -265 -199 -72 22 -14
5975a4O9k50M3L71m2j80j43J67q5K43j82J61q0j19j88P9K83o5l5k34R9K33k38
$$ -14 55 -195 -152 219 177 -3 -146 21 -64 179 -3 158 78 -41 -229 -150 133 68 33 -201 -102 131 -107
5998a07J76q7q9j19L82p5l4o7N8J28j80J00P3J0k18J77n3m3Km8n4J03J44o0m5
$$ -107 69 -18 -107 -226 156 81 47 -20 38 166 -14 86 159 169 -49 128 75 32 34 -14 -68 35 179 119 74
6023G4j57q1r8K39K40l21J89j26J74j82L8J53k50j03J70M4P2j76J5M0N4J34l23
$$ 74 -83 -164 -262 -23 217 -104 85 -41 133 -49 -11 142 -108 -211 -41 3 75 -101 -86 -46 8 142 -181
6046a81J51J73j79k3k0J40j54P9P9j2j62%j9K45k62J33L1j81J44J75j20l13K21
$$ -181 -30 143 -36 -59 -79 61 -93 -14 65 53 -109 -109 -128 117 -145 -12 19 -162 -18 157 37 -276 -55
6069e5K0j24K53Q9q6Rq2K0j02J12j56P2j68L01j30k3R1p0L4j84L63j80l1J35l05
$$ -55 -35 -159 94 183 97 106 24 44 -58 54 -102 -30 -198 103 -27 -50 41 -29 5 -179 184 4 -27 108 -197
6094a97p4J11J52L9j77J42r3q1K14j03K6l0J32k8j39K77K51l64l7o3L72m23k5
$$ -197 -271 -160 -8 31 -146 -4 -97 -178 36 -67 -41 -71 61 33 -106 171 422 58 21 -42 330 -93 -118
6117a18K52k32k09L71l42J24J00OO0j01K2K9k04L50j59j61J47J22O0j99J15q5
$$ -118 134 -98 -307 64 -278 -154 -54 -48 12 -89 -67 -38 -242 108 -51 -212 -65 57 117 -82 33 -52
6139e2R6L4o6J2j04M34j12k47K03k66j05p7KJ05J67K64l13o5o9J10j14L2o5M6
$$ -52 44 78 12 24 -80 354 242 -5 198 -68 -173 -250 -248 -143 24 288 -25 -90 -159 -49 -163 -131 -196 -150
6163a50J69q3K07j8p9j18J70j15K31j49j54J42J83k84k20M30j76r9J52j32J31
$$ -150 19 -64 143 125 46 -72 98 -17 214 65 -89 53 236 -48 -268 162 -14 -113 39 -93 38
6184C8k36R9J19k96J30RJ25k62L07j00L5l0Mj44O6K95j67l0OO3J2j59K21j7j54
$$ 38 -198 -99 20 -276 -146 -137 -12 -274 33 -67 -32 -62 -58 -202 -136 159 -8 -38 -32 31 43 -116 105 88 -66
6209f6J02k9j72J71l8K9k83L30Qk16P7K38m67R9K49o1p2K18j53JL9K79k33j40
$$ -66 36 7 -165 6 -32 -3 -286 44 52 -164 -87 151 -316 -217 32 -29 -101 117 -36 -35 4 283 50 -90
6233i0M06j67j30l23M90l71R8J76J32l74j14K05k6j0j82K50oo2o9N1j47L62k22
$$ -90 316 149 19 -304 186 -185 -87 89 221 -153 -267 -62 -88 -98 -280 -30 -36 -98 -167 -116 -263 99 -123
6256a23K76j46r4q8J72P5P0m3k51K31k28J16J10J00l44rL74j12M2K10j87l66L46
$$ -123 153 7 -87 -175 -3 72 142 99 -152 79 -149 -33 77 177 -167 -176 198 86 128 338 151 -215 131
6279A31L6O3m90M62k65J0k01K17o8M5q2N2m6rL13j54m7J43k93L96l28L82m30J19
$$ 131 167 230 -260 202 -63 -53 -254 -37 -105 -60 -142 -90 -136 -145 168 14 -33 110 -183 213 -115 267 -163 -44
6303d4K77j75l34K16O1k03K98j45m1J85k80o6j6K59R8j03r8K17k3r2N9k53J2J2
$$ -44 233 58 -276 -60 1 -202 96 -49 -90 95 -185 -251 -267 -8 90 -13 -111 106 83 -9 50 -203 -191 -179
6327a79K77q4j48J33J22j74n6K55k30n6j51L8L19N6K4k52j67K62j07L48l99K94
$$ -179 98 14 -134 -1 121 -53 -109 146 -84 -140 -291 -253 66 122 146 -106 -273 -11 -118 230 -169 125
6349A25j60J75j99K25k07K46q8k30k6L64k89K7K67J62p19K79rL9J6k43M39k85
$$ 125 -35 140 -59 166 -41 205 117 -113 -139 225 -64 -37 230 392 -327 -48 -57 -18 -2 -245 194 -91
6371i1m7J22J23k01M0J74l61J99K79k57J68k47L13n6j58L00m02KJ77L9P3j7j37
$$ -91 -138 -16 107 -94 -54 120 -241 -42 237 -20 148 -99 214 158 0 300 -102 -100 77 116 189 172 35
6394C5J67j68m7L3j31ML06l78J02k3R8k07j9K01M2j2Pj59n4K05o4jK80j82j53
$$ 35 202 34 -13 20 -111 -107 199 -179 -77 -100 -2 -209 -228 -27 15 3 10 -149 -203 2 -62 -63 217 35 -118
6419a18L11p0k4k0o0jQ8pj47k1j32J50Q9k94J41J4L06l25K20j9k67J5P2O4M0q1
$$ -118 193 123 99 79 19 18 106 99 -48 -69 -201 -51 38 -256 -115 -101 205 -120 100 81 -186 -171 -99 -35 5 -76
6445g6J70j02qN2j8qj21R4J92j72J35k60K8P7M7j0j12K51k72k7L54l77L47m04
$$ -76 94 -8 -16 36 18 10 -111 -17 175 3 138 -122 -94 -17 30 20 -92 159 -113 -140 214 -163 184 -220
6469b20l9K55l0J22k14RJ91r1ql52M32k70L86k38J80n3j00K41j99q9L10J91m79
$$ -220 -259 -4 -34 88 -126 -117 74 -17 -25 -377 55 -215 171 -67 113 60 -40 201 2 -87 223 414 -65
6492f5M46n83L69k14K24l32J78o2j67J34k58L96q7j43J63m0L0RJ84j13r3L1J33
$$ -65 381 -202 167 -47 177 -155 23 -39 -206 -72 -330 66 -21 -164 -1 -41 -11 -2 182 69 -24 7 140
6515A40n5j45K4L5J01j21j80R7L13r4k17O6K16k05K5m6J81k55N9J4J77l07K30
$$ 140 85 -60 -36 -1 100 -21 -201 -104 209 115 -102 -36 180 -25 0 -46 135 -120 -61 -47 130 -177 53
6538E3j2n2K35j88K32k67P3L31m19J33m6J3j21J53r3j29K10j13N8r0o0n1R0j55
$$ 53 41 -11 224 36 268 1 74 405 -14 119 73 86 -35 118 25 -104 106 -7 51 -39 -99 -150 -60 -215
6562b15J20j3N1K4O4l53L7K05j21J81J44k3j66L6j06J1L04m10J66j07P6K01k65
$$ -215 -95 -108 -57 -33 31 -322 -285 -80 -201 -20 124 101 -65 -29 -135 -124 180 -230 -64 -171 -95 106 -159
6585a59L24j21j43l9K01q0K07j79q5m5l9K29p5l0J10j05Q5K07k47j2K17m00M10
$$ -159 165 44 -99 -138 63 -17 190 11 -74 -119 -158 71 -4 -34 76 -29 56 263 16 4 221 -179 231
6608B31l26q5K50j13j05M31j14l26j53K28N5K55l09K82j38j16q9L70j39jl41r
$$ 231 -95 -180 70 -43 -148 283 169 -157 -310 -82 -27 228 -81 201 63 -53 -142 228 89 88 -253 -262
6630b62M14r4j04j62L98k54J31q3J1J62N3n20J61J03j84L15K9l37J86L5l50M80
$$ -262 152 58 -46 -208 190 -64 67 -16 -5 157 210 -310 -149 -46 -230 85 114 -223 -37 -2 -352 128
6652A28k39j21M14l28K61r1k17K09l61R3M50j81J59j18n1r1o1P1NJ52lj54L06
$$ 128 -111 -232 182 -146 115 24 -193 16 -345 -252 198 17 176 58 7 -84 -145 -74 -69 83 80 -74 232
6675B32m84K21j73K02M7k08K1K29M2k53J11J17l37J54j06K90k56L7K38j00j4j2
$$ 232 -252 -31 -204 -2 45 -163 -142 87 129 -124 -13 104 -233 -79 -185 105 -151 -114 124 24 10 -2
6697bJ5m8K89k11k0n7J19pj66O6N8j98J82Q7J1j30j01j2q3J34j5R1j49M2K02j64
$$ -2 13 -35 254 43 23 -34 85 78 -88 -22 36 -162 20 107 118 -12 -113 -125 -208 -74 -89 2 -147 -105 97 -67
6723f7n0o4J21J10pj83O2K75m9k60n0M88k17j64J17mj96j3J42L19j90k32K36k88
$$ -67 -117 -181 -60 50 43 -140 -78 197 148 -112 -162 326 109 -55 62 58 -138 -151 -9 310 120 -112 124 -164
6747a64J68J6O0k53K16J88K9j06j19Jj92L4P4m4K21J5j79R5j05p2J42k0O2j39
$$ -164 4 20 80 -173 43 231 260 154 35 36 -156 -122 -48 -92 129 144 -35 60 -45 -117 25 5 67 -72
6771g2k9K18k16M3J78j79L2mJ05j16j54P4J77rk89L60j48o4R2k0J80k70J21r1
$$ -72 -101 117 -99 -56 122 -57 -25 -29 76 -40 -194 -120 57 48 -241 119 -29 -93 -1 -21 159 -111 10 -81
6795h1K5l5J28j77K65r6k4j22K1J32J72l75K78r4l5J27j99nJ08J40l19%m4J71
$$ -81 -56 -91 37 -140 125 29 5 -117 -96 36 208 -167 111 17 -18 109 -90 -95 13 153 -166 -166 -210 -39
6819c9L05j44pk04R1p0J47Q0j91K27l11n1L04P1k35K79l39J65J1k07K17l15J30
$$ -39 266 122 115 -89 2 -68 79 159 -32 195 -116 -167 137 208 -27 252 -87 78 89 -118 99 -216 -86
6842h6L39m52L07qj29j12J63k78K92j30J04L6j72L5%J62j55K84q3q0L7j3o5N0
$$ -86 253 -199 108 100 -29 -141 22 -256 36 -94 10 46 -126 -91 -91 71 -84 200 117 37 74 61 -4 46
6866D6J42P2l23J22j6j71J08K0j16M2O3O8O4k37L72m42K90O9l46R1J52l4m4M2
$$ 46 188 260 -63 59 43 -128 -20 0 -116 -74 -11 57 121 -116 256 -186 104 173 -173 -82 70 36 -8 34
6890C4M31o78J50OK45j83M8P2q3l17L66J76n09J39K81j98j2m1K19j66n1L34m02
$$ 34 465 -213 -63 -57 188 5 53 125 42 -275 91 267 -242 -103 178 -20 -32 -73 146 -20 -71 263 -139
6913a39J42J15k59l7M16mo6r3o4J01J60j43K0k19K13l05J54k01J25R2j73L83M1
$$ -139 3 118 -141 -178 238 234 168 75 11 112 272 129 149 -70 143 -162 -8 -209 -84 8 -165 218 259
6936B59m33J02M0M1O1j56j03P2j40K35j5p7K70k09Ok7L59l09m1K98l33K43j9l63
$$ 259 -174 -72 -32 9 70 -86 -189 -117 -257 -22 -37 -114 156 -53 -47 -74 285 -24 -65 233 -100 143 124 -239
6960b39o4L06k5R7N6j57k0J85j56j62o1K39l2R2j84J90j56J31J2j31R9j08J81
$$ -239 -303 3 -22 75 131 -26 -46 139 -17 -179 -240 -1 -33 59 -125 65 -91 40 52 -79 20 -88 93
6983I3l09M47k14k9k4J68K1j40J73J4l85J95k51L75m5j70J37j78J42r7J01n5M8
$$ 93 -216 231 17 -12 -36 132 153 13 186 200 -185 10 -241 134 89 -81 56 -122 20 -77 24 -31 17
7006A7J6J19r5j07J76j25K9qJ60l63K24N0J3j51k31M41L9l70J69L6O9o7k6J82
$$ 17 33 152 57 -50 126 1 30 22 182 -181 43 93 106 -45 -276 165 204 -166 3 39 108 41 15 197
7030A97j27j63J02q6K01k16o0J30m6R5k90K31J39k14J33Q3L8q5R4jj31j88J83
$$ 197 70 -93 9 -77 124 -92 -152 -22 -68 27 -263 -32 107 -107 26 109 147 62 156 155 24 -164 19
7053A9j82k1N11k37j15J68j54j59J83O5o8j35L4P5Q2k63J51q3J96R3k89P0K4J21
$$ 19 -163 -184 327 90 -25 143 -11 -170 13 78 10 -125 -91 -16 66 -197 -46 -129 67 160 -129 -59 -35 86
7077H6j76K18j45m9J75k6q8q5R8J54k45Q8j77K45p6l14L88Kj22n3P2J56p4J44
$$ 86 -90 128 -17 -66 109 83 -5 -90 8 162 -83 5 -172 73 -3 -317 71 73 -49 -102 -30 126 52 196
7101A96p4q3j06j00M57l41J54k4k36J8L00k58K89j20p5j35K83k80J27L1Q2k1j18
$$ 196 122 39 -67 -167 290 -51 103 79 -157 -139 161 -97 192 72 -3 -138 145 -135 -8 23 105 84 -34
7124c4R9O1j17J12p3k69J17k7J80p2k6J46j75M0L6l7M9J22r1j55J49o1J96m7M
$$ -34 65 126 9 121 48 -221 -104 -131 49 -23 -49 97 -78 -38 -2 -39 10 132 41 -114 35 -26 170 123 127
7149A27o4k78j64N23m22K29O6K2lK1l4p2m5K2m4J93j04L21l57K7n8J62k61J01
$$ 127 63 -215 -379 144 -278 -49 17 39 36 57 23 -49 -94 -72 -116 77 -27 294 -63 -36 -94 68 -193 -92
7173i2J86k11J42J21j24j40L49m5M1m71N02l97K14K5J49m31J26j9q2N6R2o9J12
$$ -92 94 -117 25 146 22 -118 231 186 227 -244 258 -139 75 100 249 -182 -56 -75 -157 -101 -9 -78 34
7196C4j5M7J60m64M14l52J78Q0L2k28L21j07j1jJ75k40j63P8j04J29p0P1J50j20
$$ 34 19 66 226 -238 176 -176 2 82 114 -114 207 100 89 88 263 23 -140 -62 -166 -37 -107 -36 114 -6
7220fj09K13j38O6j44M72m68Ok56M39n33K75k3K36O5j38j94M95R1l34R0k5j39
$$ -6 -115 98 -40 26 -118 354 -114 -108 -364 75 -458 -183 -206 30 95 -43 -237 258 349 15 105 80 -59
7243e9L6N8P9J30j40j70L95l74k41K84L5p0j58L68k63K67M3j94q1K51l4k81J30
$$ -59 -23 35 114 244 104 -66 329 -45 -286 -2 33 -37 -195 173 -90 177 220 26 -55 196 162 -119 11
7266A1m3q2K26J56l15J35o2K23j07Nlj39o3J67j80o7J81M6%j93K55k88L2K30l75
$$ 11 -32 -114 112 268 -47 88 26 249 142 147 144 5 -58 109 -71 -138 43 89 89 -104 151 -137 -105 125 -250
7291b50K14n4J17R2q5L4r6r3J83q4P4L0j45o3K06p4q9J22k3N4o5o2j51J2J18O0
$$ -250 -36 -90 27 119 34 68 -28 -121 62 -22 52 82 -63 -126 80 6 -83 39 16 70 5 -57 -208 -196 -78 -18
7317a8M8Oj17m2r0K52O9J37k60O8M6r4J32k45k1L33l30P7M7p8J03O3oj72K63j32
$$ -18 30 36 -81 -123 -213 39 108 245 -15 53 99 5 137 -108 -129 204 -126 -49 -2 -80 23 86 80 -92 171 39
7343C9k12p1K04k62K18J39j42P4n0lN3O8j24L00l76K16q8J72k66J37J10l28K78
$$ 39 -173 -244 -40 -302 -84 55 -87 -13 -63 -66 -13 55 -69 231 -145 71 -17 155 -111 26 136 -192 86
7366H6q5m2k5N1P0j3j29k3K07k42J4K05k24Q5J29j41L5Q4p1O3r0K0j80J46J83
$$ 86 1 -41 -66 -15 55 42 -87 -110 97 -145 -131 74 -150 -65 64 -77 -42 42 -29 34 -56 -36 -216 -70 113
7391A13k47R4K08j91p6N0o7K27k54K02j02mL7P5j04L9j8rK32k09O6j4j36p4L06
$$ 113 -134 -40 168 -23 -99 -49 -116 111 -143 59 -43 -47 -10 65 -39 0 -18 -27 205 -4 62 48 -88 -162 144
7416A44k55J5K49m83J39K86m6k7k00J06j61J00K39k37K37Q2l81J22K51Q9l66J21
$$ 144 -111 -96 153 -330 -191 95 49 22 -178 -72 -233 -133 106 -131 106 188 -193 -71 180 269 -97 24
7438B4l27M57j93j7l4j14P3K70k83J24J30k04K05L6j50J10p1j19O7J13j8j40k12
$$ 24 -303 154 -39 -56 -90 -204 -131 139 -144 -20 110 -94 111 147 -3 107 36 -83 -16 97 79 -61 -273
7461b73K30O2m6J21p2n2k35L99K0j22Mj72R0q9J65L6rl47K43j73J0J25L34m4j57
$$ -273 -43 19 -27 94 22 -30 -265 134 154 32 36 -136 -46 -135 30 66 57 -290 -47 -220 -210 -85 249 205 48
7486D8k26M5K38j59K65k16qr2L06j68r7n1o7J76j40O4j83O1K20R1j2j09mJ48k07
$$ 48 -178 -133 105 -54 211 -5 -13 -105 201 33 -64 -115 -182 -6 -146 -82 -265 -204 16 107 95 -14 -18 130 -77
7511g7l7j9L4J80j74P4J77j8k04J44j5r6m8M5M1k3N9j09J87k29p7K24J57M8k88
$$ -77 -114 -133 -99 81 -93 -19 158 140 -64 80 65 -31 -79 -34 7 -16 43 -66 121 -108 -185 39 196 244 -44
7536d4j21j1K52N7k63J78m8n6n2R7q2M8K24k78Q7j05M86l41k0o7j2J31K6o7J7
$$ -44 -165 -176 76 133 -130 48 0 -56 -108 -11 -93 -45 179 -99 -12 -117 369 28 8 -59 -71 60 86 19 36
7561C6k51K64J50j19R8o6j83q4J46m3l5J29R0k0N3k49k1K1J47J4o8j56N1Q3j52
$$ 36 -215 49 199 80 178 112 -71 -155 -9 -52 -87 42 132 112 165 -84 -105 -84 63 77 9 -147 -96 -13 -165
7586a65mJ60P5j47Q3nrJ77k47J27k88K53J34k11r9K83j22j4l4j3Q2J4J38k43j89
$$ -165 -169 -9 66 -81 2 -3 -12 165 -82 45 -243 10 144 -67 -166 117 -5 -19 -53 -66 16 30 168 -75 -264
7611b64K62J20n9J05O5j27J20j10j64o4J6J26J28k4k14K7P9J13k52L01n26M09
$$ -264 -2 118 59 164 229 102 222 112 -52 -116 -100 26 154 130 -84 -57 22 135 -117 184 -342 67
7633F7k6m8K34j45k39J94j01R1J9l3j94J67J70k42M7p0K12P7k12K6J08j55O7j05
$$ 67 41 -7 227 82 -157 37 -64 27 46 13 -181 -14 156 -86 -39 -109 103 180 -32 -6 102 -53 14 -91
7657i1J18j82P9K55l24R5K5r3J49J95o5j40n3jo4J95j32N4%j07k0J88j14P7j79
$$ -91 27 -155 -76 179 -145 -50 -25 -118 31 226 161 21 -32 -33 -97 98 -34 20 20 -87 -107 81 -33 44 -135
7682a35m1R3l6Q7K21j60k27P9l0J9n6J28l7M8Q2J29k62K6M6n1r7J04p3K13p2J8
$$ -135 -176 -83 -119 -32 189 29 -198 -119 -149 -130 -186 -58 -95 -47 35 164 -98 -72 -26 -77 -174 -70 -143 70 -2 16
7708A6J7J58R7j44k46J78M5r4j53P1Pj97J63J69r3o3J45k5m6l6o1r9K38m0M9J92
$$ 16 33 191 288 144 -102 76 121 27 -126 -55 -48 -245 -82 87 -6 -69 76 51 5 -31 -92 -191 47 7 56 248
7734B48k12Rj2J16k45L35m10K31J8J96k75l8k36J75j52L3L74j78J62l04J76J28
$$ 248 36 45 33 149 -96 239 -171 60 78 274 -1 -39 -275 -100 -252 -219 155 -23 139 -165 11 139
7756A39j74r2q7L06j48j30K54P2j10J1k02L1N8L16l8N1R2l53K38j46n6j23K6l8
$$ 139 -35 -127 -214 92 -56 -186 68 140 30 41 -161 -130 -72 244 206 257 349 -4 234 88 32 -91 -65 -103
7780a03P2j8Nn4M6K75o2j1k5k39J18N2k64K33j04j06K58k38K02K80n44J33J76
$$ -103 -31 -49 -44 -98 -52 223 161 150 125 -114 4 56 -208 25 -79 -185 73 -165 37 317 -227 -94 82
7803H2J96l55j64K75j74lK67n5nq4k05L01j82J71J8k02K18j22j4m6n3J5K27j15
$$ 82 278 -77 -241 34 -140 -143 124 69 64 -20 -225 76 -106 65 83 -119 99 -23 -37 -83 -136 -121 106 -9
7827iJ11p6r0J04o5Q9j08lQ5J74k29k7J30J3o2l6P7m9J5K10J0j33P9k44Jj95K62
$$ -9 102 26 -64 40 -25 64 -44 -47 38 212 -17 -44 86 99 37 1 78 29 44 254 264 131 210 -34 -33 -228 34
7854C4K8k30K74Rk06q9K73r9K4M0k54O3J48r5q3L15j33J75k61pK32k56p2K79m09
$$ 34 62 -168 106 115 -91 -180 93 -6 18 58 -196 -133 15 -80 -163 152 19 194 -67 -74 158 -98 -170 109 -300
7879c00K82qJ46r9j32J13J65m9j57j0K1j46q7J67Q4K19n0j76k5M8j12L47j55k8
$$ -300 -18 -26 120 21 -111 2 167 118 -39 -49 -28 -174 -261 -94 -10 209 159 -17 -42 6 -106 241 86 58
7903E8N1k42RJ53k01K1O0J89k2j89nM9o5J26MrJ56j66J21j49J95J8j59j13K10
$$ 58 109 -133 -124 29 -172 -151 -91 98 76 -113 -118 -69 -134 -8 -4 -13 143 -23 98 -51 144 162 3 -110 100
7928A00j21j65K04K61j04j45j39R1J48k47l0J92j24j5k0J19j9j7j1j2k9P8m0P1
$$ 100 -21 -186 18 279 175 30 -109 -18 130 -117 -147 45 -79 -94 -114 5 -14 -31 -42 -54 -83 -5 -45 26
7952B6j96m8K51R2k1P9j04M9j09l4j83l4O8K12j91K54o3k53m7K44k54J65jM0p
$$ 26 -170 -218 33 125 104 183 79 128 19 -15 -198 -232 -164 48 -143 111 48 -205 -252 -8 -262 -97 -98 -58 -65
7977f5n0K4M2J27j05P4nj18J02j53%P3K52l63J55ok6P5r6K27k94K78j70P5J27
$$ -65 -115 -91 -49 78 -27 47 42 -76 26 -127 -127 -54 198 -165 -10 -16 -42 33 -63 164 -130 148 -22 53 180
8002A80m1q1O2j7r2j28n1L25l1j96N1k34K27n0J53nm7L2J38l33J32j9L2o1K07
$$ 180 139 58 120 103 11 -117 -168 157 126 -70 -19 -253 -26 -76 77 72 25 57 195 -138 -6 -25 7 -54 153
8027A53q2j22L1Q7j71%M5K66pj48k32J13j09K28O7j93J0J73PJ23l37P3P9P7j97
$$ 153 71 -51 -20 67 -104 -104 -59 207 200 52 -180 -67 -176 52 119 -74 -64 109 116 239 -98 -25 54 131 -66
8052f6q1K65k17J45k75K5L24o1k81K32Pq2K5j76J79Q9k7lj01NJ05nJ33j32M6J5
$$ -66 -147 118 -99 46 -229 -204 120 59 -222 10 17 -65 -40 -216 -37 52 25 22 -79 -74 31 26 159 27 73 88
8078H8P5k41J43J2J13k59K39k92K29k34MK01r2J94j26Q9j20J73m75M36l18K64
$$ 88 163 -78 65 77 190 -69 170 -122 107 -127 -123 78 -14 180 54 143 23 196 -279 157 -161 103
8100A03j46l0p6J54r5p0L76k93j04j69L83P6j48j7J25q2K80j50k2Ll9J43m50L14
$$ 103 -43 -73 -149 5 -90 -160 216 -77 -181 -350 33 109 -39 -56 69 -13 267 117 95 98 59 202 -248 66
8124F6j47O5J45k13O9j39o8J41N1j5j38K54j48J80N1N4k88J82j36O2k19L50L7
$$ 66 -81 -16 129 -84 -15 -154 -222 -81 -30 -45 -183 71 -77 103 154 208 -80 102 -34 28 -191 159 196
8147A96p1J38l37j62J93J1L8k0o2k11K86k14J75O7J33Jl33N3J20j49K01l89J34
$$ 196 125 263 -74 -236 -43 -32 6 -14 -76 -287 -1 -215 -40 27 160 161 -172 -119 1 -148 53 -336 -202
8170b02J87J23o5k73R4J77k21K5J47J35k96M0K29r9l5J28r9J1K65k86p4
$$ -202 -15 108 43 -230 -136 41 -180 -155 -8 127 -169 -129 100 1 -34 94 -5 6 271 -15 -89
8191h9
$$ Imaginary data points
##PAGE= N=2
##DATA TABLE= (X++(I..I)), XYDATA
0@%%%%%%%%%%%%%lJ1j6J6j6J7k5L2l8M6n2O0p2Q4r3J06j22J41j63J84k07K34k64
$$ 0 0 0 0 0 0 0 0 0 0 0 0 0 0 -3 8 -8 8 -8 9 -16 16 -22 24 -28 32 -40 44 -49 57 -65 76 -87 97 -110 124 -140
36a40K97l32L71m15M62n11N64o24O91p65Q43r27J023j126J240j368J507j664J840
$$ -140 157 -175 196 -219 243 -268 296 -328 363 -402 441 -486 537 -589 651 -717 790 -874 966
55I66k037K264k526K830l191L628m167M851n753O998q832J1793j7332L1024j22966
$$ 966 -1071 1193 -1333 1497 -1694 1934 -2233 2618 -3135 3863 -4969 6824 -10508 20516 -102450
70a02450j65833L57740O0836k18036O8287J38178j59756k6111J89911o0100j93725
$$ -102450 -268283 89457 150293 -67743 544 138722 -21034 -47145 142766 82666 -111059
81a11059J04187R8132j43219k2602J46905k1280q4197M6259P411o7311O4510N3575
$$ -111059 -6872 91260 -51959 -74561 72344 51064 -33133 13126 20537 -46774 17736 71311
93G1311j37008m7588J41786j933r8048P5031N4685j12505J0132J40014n6494j30069
$$ 71311 -65697 -113285 28501 26568 -71480 3551 58236 -54269 -44137 95877 39383 -90686
105i0686R2492P1026j30258q396J36522m7758j05858J00004P6634j16407k7374
$$ -90686 1806 72832 -57426 -65822 70700 22942 -82916 17088 93722 -22685 -50059
116e0059J23021k3291j06778O0175N5292q8236k007Q7158m6097p1033P2365L4239
$$ -50059 72962 49671 -57107 3068 58360 -29876 -31883 55275 9178 -61855 10510 44749
128D4749q4591R854O8649n5254k6150Q2760k4733p3900Q0283N2816j12704k0176
$$ 44749 -39842 -29988 38661 -16593 -42743 40017 15284 -58616 21667 74483 -38221 -58397
140e8397J16900k7341r9768P2467M9462j12785Q369J27642n3796j07014Q6889
$$ -58397 58503 31162 -68606 3861 53323 -59462 -51093 76549 22753 -84261 2628
151B628O5762j05353j0049J09195m4571q7952Q1269M5232q3162J5109P1399n9251
$$ 2628 68390 -36963 -47012 62183 17612 -70340 10929 56161 -27001 -11892 59507 256
163B56m3879Q1944P256q2522L0517N0460p1867j4178Q1486k7893o5231N5097K3518
$$ 256 -43623 38321 45577 -36945 -6428 44032 -27835 -42013 39473 11580 -53651 1446 24964
176B4964p5827K3278R2229n7612q0932Q2026M7464q2727M587O6838n6159m8390
$$ 24964 -50863 -27585 64644 7032 -73900 8126 55590 -27137 -22550 44288 -11871 -60261
188f0261Q3926K1500r0710J8518Q7106n1356o0813P6854L2342p0237r88M0486
$$ -60261 23665 45165 -45545 -27027 60079 8723 -52090 24764 57106 -13131 -14119 26367
200B6367l5247j5463O1445r105p2475K7961N8076l8604j8878M1793k4066m1239
$$ 26367 -8880 -24343 37102 27997 -44478 -16517 41559 2955 -15923 25870 1804 -39435
212c9435M6249K2001o4690J088O6757l4946n4883O5794L4193p0229L816O3075
$$ -39435 6814 28815 -35875 -34787 31970 -2976 -57859 7935 42128 -28101 -24285 38790
224C8790l8622m3726O7470K2242q0601M897P2773l4104m1526N8949Q034o4985
$$ 38790 168 -43558 23912 46154 -34447 -29550 43223 9119 -32407 26542 34576 -30409
236c0409K3167N5144m6190l3637N8943L64o3124K8621M3701n2314j3830N6439
$$ -30409 -7242 47902 1712 -31925 27018 27382 -35742 -7121 36580 -15734 -29564 26875
248B6875k1543n2559M3737L5482n6043q148N4638k6693l7339N7223J3713o4426
$$ 26875 5332 -47227 -3490 31992 -24051 -32199 22439 -4254 -41593 15630 29343 -35083
260c5083J5016N7339l6997l5147N7316J1300o2652J8499N4175m2742k6534N7991
$$ -35083 -20067 37272 275 -34872 22444 33744 -28908 -10409 43766 1024 -25510 32481
272C2481l359o1168K3490M8388l7892k8173M2150m634m2245L2357K7868m7296
$$ 32481 29122 -32046 -8556 39832 1940 -26233 15917 11283 -30962 1395 29263 -18033
284a8033q180M3840j6239l2766L6446J8254m9090Q84M8792k1996l0571M3260Q290
$$ -18033 -26213 17627 1388 -31378 5068 23322 -25768 -24884 23908 1912 -28659 14601 22891
297B2891n2092J3080M9931k6566l4885M0335J2923m8270J4444M6061l2561k9846
$$ 22891 -29201 -16121 33810 7244 -27641 12694 25617 -22653 -8209 37852 5291 -24555
309b4555L8580L403l9198J9600L3785l8763k3948M6792L095m1515K2632K6994
$$ -24555 14025 17428 -21770 -2170 31615 -7148 -31096 15696 18791 -22724 -92 26902
321B6902m1097r553M4353q835l7839K5824K0373m2595l00M9063j8109l5790L3482
$$ 26902 -14195 -23748 20605 11770 -26069 -245 20128 -22467 -22767 26296 8187 -27603 5879
334E879J2152l9308J2742M0062l1104l1737M1522R524m3891J8255L8013l8995
$$ 5879 18031 -21277 -8535 31527 423 -31314 10208 19732 -24159 -5904 32109 -6886
346f886k1734M7285L637m0847J8733K9880l7910j6043M5920m785l9874K2534J9826
$$ -6886 -28620 18665 22302 -18545 188 30068 -7842 -23885 22035 17250 -22624 -90 19736
359A9736l6359n33M0082j3514l3012K5297J6149l5432N180L6056k5722k8340L2456
$$ 19736 -16623 -17156 22926 9412 -23600 1697 17846 -17586 -12406 23650 -2072 -30412 2044
372B044J0308l1920R547K9483k3635k0941L4569Q847l3051J1846K4620k7479j2423
$$ 2044 12352 -19568 -10021 19462 -4173 -25114 9455 18302 -14749 -2903 21717 -5762 -18185
385a8185L4347J289l1182J2914K2487k6607p593L6818p613l5638J8979K0713k8324
$$ -18185 16162 17451 -13731 -817 21670 -4937 -12530 24288 16675 -18963 16 20729 -7595
398g595o510L0583j0592l2517K1175K0817l0530k574L1271j6479k4378K9439J5436
$$ -7595 -14105 16478 5886 -26631 -5456 15361 -15169 -17743 13528 -2951 -27329 2110 17546
411A7546l0356K039K9323j8919k0379L4460P323l8122R530L0227k3714j4782L4966
$$ 17546 -12810 -10771 18552 -367 -20746 13714 21037 -17085 -7555 22672 -1042 -15824 19142
424A9142K228l6772J2116K9905k5545j4706L0837q097l2483J9724K0285k7199
$$ 19142 21370 -15402 -3286 26619 1074 -13632 17205 9108 -23375 -3651 16634 -10565
436a0565n082K9136j2184k5543K8062J6653l4777j239K9038j7576j9305K9603
$$ -10565 -15647 13489 1305 -24238 3824 20477 -14300 -15539 13499 -4077 -23382 6221
448F221P971l3129N488L2293j5189j6741K9564K974l1649J0449K3871k0073j3114
$$ 6221 14192 -18937 -13449 18844 3655 -13086 16478 19452 -12197 -1748 22123 2050 -11064
461a1064K2360l837k6999J5726K3390k4436j0791K7662n776k4011J9154J7916
$$ -11064 11296 7459 -19540 -3814 19576 -4860 -15651 12011 6235 -17776 1378 19294
473A9294k7404j0736K8013l105k5111J8479J7334k6838m297K8008p077k0238J9095
$$ 19294 -8110 -18846 9167 6062 -19049 -570 16764 -10074 -14371 13637 6560 -13678 5417
486E417J0066k8371m54K8900j2909k0743K4085N833k9608J0621K9546j8984j9176
$$ 5417 15483 -12888 -13342 15558 2649 -18094 5991 11824 -17784 -7163 22383 3399 -15777
499a5777K6622M409l0843J3540K6927k8140j6990L0566j581k7149J7719J9424
$$ -15777 10845 15254 -15589 -2049 24878 -3262 -20252 10314 8733 -18416 -697 18727
511A8727k9175q453L3044n722k5760K2790J1880l3594K590L3461j4424k4599K2091
$$ 18727 -10448 -18901 14143 8421 -17339 5451 17331 -16263 -13673 19788 5364 -19235 2856
524B856Q874k8524P197K9337k0722j9500K8479M820k7051J1572K3099k2024j4430
$$ 2856 11730 -16794 -9597 19740 -982 -20482 7997 12817 -14234 -2662 20437 -1587 -16017
537a6017K6622J572k5439J4762J7686k6245n812L0393n501k5296J5000J5194k5476
$$ -16017 10605 12177 -13262 1500 19186 -7059 -12871 17522 12021 -13275 1725 16919 -8557
550h557o327K7334q670k4744J8392J2681k4502J984K7163j1582j9893K0065J0950
$$ -8557 -14884 12450 3780 -20964 -2572 10109 -14393 -12409 14754 3172 -16721 3344 14294
563A4294k4769L238K4321j8816j8108K6599N022k5993J0526K3086k2327j4042
$$ 14294 -10475 -7237 17084 -1732 -19840 6759 11781 -14212 -3686 19400 -2927 -16969
575a6969L1854L606l1671J1284K0626k5388o837L0819p267k8745J7564J9003k5390
$$ -16969 14885 18491 -13180 -1896 18730 -6658 -13495 17324 10057 -18688 -1124 17879 -7511
588g511m230K8897j3043k5725K3005J1924k8233L157K5420j8289j9475K8418J0934
$$ -7511 -11741 17156 4113 -21612 1393 13317 -14916 -11759 13661 -4628 -24103 4315 15249
601A5249k8981N592K4303j8811j0383K8040j599k7231J2186J9636k1488p598K6483
$$ 15249 -13732 -8140 16163 -2648 -13031 15009 13410 -13821 -1635 18001 -3487 -11085 15398
614A5398n788k4914J7771J4859k5441p52K6334j2278k3743J9306J5201k5251k373
$$ 15398 9610 -15304 2467 17326 -8115 -8867 17467 5189 -18554 752 15953 -9298 -11671
627a1671K4584j3514j9912K3656R916k5709J989K2160j3610j4651K3801N271k5722
$$ -11671 12913 -601 -20513 3143 13059 -12650 -10661 11499 -2111 -16762 7039 12310 -13412
640a3412Q586K0691j9753q418K7376k433k6771J1809J9664j9307o737K4491r111
$$ -13412 -4826 15865 -3888 -12306 15070 12637 -14134 -2325 17339 -1968 -8705 15786 6675
653F675k4994K0002J6415k4711n409K2596q762j8512J8788J0879k4249J669K2775
$$ 6675 -18319 1683 18098 -6613 -12022 10574 1812 -16700 2088 12967 -11282 -9613 13162
666A3162j4963j4482K4890M981k6792M691K1642j3552j2333K2042o9k5088J2082
$$ 13162 -1801 -16283 8607 13588 -13204 -8513 13129 -423 -12756 9286 9217 -15871 -3789
679c789K0818j9620r700K2448k138k1485J2165J6298j9758o208K2928q428j9676
$$ -3789 17029 -2591 -12291 10157 8019 -13466 -1301 14997 -4761 -10969 11959 3531 -16145
692a6145K0368J2002k5282j684K4064r621j7637K0170P769k6418L911K3906j4940
$$ -16145 4223 16225 -9057 -10741 13323 3702 -13935 6235 14004 -12414 -8503 15403 463
705D63j4877K1851K646k3699P231K0293j5385j1445K0629k281k0816J5034J5576
$$ 463 -14414 7437 10083 -13616 -6385 13908 -1477 -12922 7707 5426 -15390 -356 15220
718A5220k1833o065K2509m675j8041J5310J2067k2040j979K3397r250j6296J8416
$$ 15220 -6613 -12678 9831 5156 -12885 2425 14492 -7548 -9527 13870 4620 -11676 6740
731F740O616k2525K083K0626r805j4915J6495L904k1265P639J8744j6083j1873
$$ 6740 13356 -9169 -7086 13540 3735 -11180 5315 9219 -12046 -4407 14337 -1746 -13619
744a3619J9026J080j9100Q528J6079j6714r735K1079r97j9693J2880J3989j8489
$$ -13619 5407 6487 -12613 -4085 11994 -4720 -14455 6624 5627 -14066 -1186 12803 -5686
757e686n638K0222k388j6034J2491R696j9868K07K1773q724j6275J5522O176j9258
$$ -5686 -11324 8898 6510 -9524 2967 12663 -7205 -6998 14775 6051 -10224 5298 11474 -7784
771g784L094J8250j1943j4283J7978L626k1651P034J9167j5811j2395J7828K524
$$ -7784 -4690 13560 1617 -12666 5312 8938 -12713 -5679 13488 -2323 -14718 3110 5634
784E634j7293Q550J3660j8259n951K2646k921j8549J3444J1235j8645j650K0345
$$ 5634 -11659 -3109 10551 -7708 -13659 8987 6066 -12483 961 12196 -6449 -8099 12246
797A2246o677j6012J5132P385k0591K682K1614j1875j5097J6045M777j6819M641
$$ 12246 5569 -10443 4689 12074 -8517 -5835 15779 3904 -11193 4852 9629 -7190 -2549
810b549J4755j4541j0652J8413Q10j8503Q570J2756j5801m970J8251j718j5726
$$ -2549 12206 -2335 -12987 5426 6236 -12267 -3697 9059 -6742 -11712 6539 4821 -10905
823a0905J0613J0874j6756k922J9449n205j5924J1469Q560j4149L92J5451p243
$$ -10905 -292 10582 -6174 -9096 10353 5148 -10776 693 9253 -4896 -4504 10947 3704
836C704j2787J3637O345j7059K644J4352j1339j0460J5369K583j5602M903J3858
$$ 3704 -9083 4554 10899 -6160 -3516 10836 -503 -10963 4406 6989 -8613 -3710 10148
849A0148j2687q405J8043P73j7676P228J2179j3673n479J6517k155j5627R161
$$ 10148 -2539 -10944 7099 7872 -9804 -2576 9603 -4070 -9549 6968 4813 -10814 -1653
862a653J1311j4457k191J6798o930j3662J2609P554j5479L12J5156q797j1937
$$ -1653 9658 -4799 -6990 9808 2878 -10784 1825 9379 -6100 -5788 9368 571 -11366
875a1366J5345N570j7075L769J4124j1289p671J5256J355j5958N308J2365j2151
$$ -11366 3979 9549 -7526 -3757 10367 -922 -8593 6663 8018 -7940 -2632 9733 -2418
888b418n343J6160l353j4909R593R075j3444j508J4384o214j3438J1890Q394j5123
$$ -2418 -7761 8399 5046 -9863 -270 8805 -4639 -6147 8237 2023 -11415 475 8869 -6254
902f254l22J3662p438j0013J2613M987j3275P60J2576p735p662J3485K246j4153
$$ -6254 -6576 7086 -352 -10365 2248 7235 -6040 -5280 7296 -439 -8101 5384 7630 -6523
916f523M470J0608r056m511J1958j479j2720O321J0125j0624m123J3104l524j2498
$$ -6523 -2053 8555 -501 -5012 6946 5467 -7253 -932 9193 -1431 -5554 7550 4026 -8472
930h472Q512Q105j1202l514J0870l527j0804R404P010j2613j27J2040n814p716
$$ -8472 40 8145 -3057 -6571 4299 772 -10032 -628 6382 -6231 -6358 5682 -132 -7848
944g848J1057M086j2865R72J2045o711q077J2433J779j3387N012J1137q440n764
$$ -7848 3209 7295 -5570 -4598 7447 736 -7341 5092 6871 -6516 -1504 9633 1193 -4571
958d571J1031l64j2272O312Q634j1283l837J1679l728j0261Q756O432j1524j589
$$ -4571 6460 6096 -6176 136 8770 -2513 -6350 5329 1601 -8660 96 6528 -4996 -6585
972f585J1510m386r310J0034M455j3685J661J2609n926p721R448M044j0527K507
$$ -6585 4925 539 -8771 1263 5718 -7967 -6306 6303 377 -7344 2104 6148 -4379 -1872
986a872J0431p120o106J0198j06j0778N303Q096q701m991R499j53r707O168O439
$$ -1872 8559 1439 -4667 5531 5425 -5353 -50 8046 -655 -5646 3853 3700 -6007 161 6600
1001F600j0762k497J1201k750q926O640N685r906j392J0984l163q362Q287L534
$$ 6600 -4162 -6659 4542 1792 -7134 -494 5191 -4715 -6107 4877 1714 -6648 1639 5173
1015E173j0790K440J0369n661p532Q482K723j0092L050J0464q478p561J1075J456
$$ 5173 -5617 -3177 7192 1531 -6001 2481 5204 -4888 -1838 8626 148 -7413 3662 5118
1029E118j0002L852P656q253n088J0721M30r818M970O107j0024j178J0749k662
$$ 5118 -4884 -1032 6624 -1629 -6717 4004 4434 -5384 -414 5693 -4331 -5509 5240 2578
1043B578q495N770M806q564M68J0376n558q887R523L688j0051J393Q960o109o945
$$ 2578 -5917 -147 4659 -3905 -3437 6939 1381 -7506 2017 5705 -4346 -2953 6007 -102 -7047
1058g047Q678L176j0121K780R147p674n565J0285R43r139L484O932p470l884J1129
$$ -7047 1631 4807 -5314 -2534 6613 -1061 -6626 3659 4602 -4537 -1053 5879 -1591 -5475 5654
1073E654r54j0364N815O699r662j140J0440l146r311O091N193r243RR929n917
$$ 5654 4700 -5664 151 6850 -2812 -3952 6488 3342 -5969 122 5315 -3928 -3919 6010 93
1088I3q274R284L444r729K171Q152p006n255R954J590j0476L773Q252q334l093
$$ 93 -8181 1103 4547 -5182 -3011 5141 -1865 -7120 2834 4424 -6052 -2279 5973 -2361 -5454
1103e454J0724o90r580M179P214o808k802R310k558q999O718N122q094j243P749
$$ -5454 5270 4580 -5000 -821 6393 -415 -3217 6093 3535 -5464 1254 6376 -1718 -2961 4788
1118D788m170o026O530L444q986L94Q386n838n675R123J866r348J554Q243n063
$$ 4788 618 -5408 1122 4566 -4420 -4026 4360 -1478 -7153 1970 3836 -5512 -3958 4285 -778
1133g78n482Q870J779r858L359Q651p011l795R353l24r194M332P455p955l252
$$ -778 -6260 2610 4389 -5469 -2110 6541 -470 -4265 5088 4764 -4430 -98 7357 -598 -3850
1148c850R566k644r089P071N619r439j413Q452l590p147P660L613j0093N22R061
$$ -3850 5716 3072 -6017 1054 6673 -2766 -4179 4273 683 -6464 1196 4809 -5284 -4762 4299
1163D299n157n210Q844L52r217L868P880o744l780R480r56r874O497P019q879
$$ 4299 -858 -6068 2776 3128 -6089 -2221 5659 -1085 -4865 4615 3659 -6215 282 7301 -1578
1178a578k194Q927k471p755O252N343q609k415R130l046o907O776K894q076M56
$$ -1578 -3772 5155 2684 -5071 1181 6524 -2085 -4500 4630 1584 -5323 1453 4347 -3729 -3273
1193c273P260l855n310O851K043q632J932P738n231m027P313P7p779L652O834
$$ -3273 3987 132 -5178 1673 3716 -4916 -2984 4754 -477 -4504 2809 2886 -4893 -1241 5593
1208E593n894m522Q066K1q249M342O532p109k999P467r74p205N139N975r242j745
$$ 5593 -301 -4823 3243 3264 -4985 -643 5889 -1220 -4219 3248 2274 -4931 208 6183 -3059 -4804
1224d804R652l106p180O657L840q955J18R145l843o719P476K107q977K549Q093
$$ -4804 4848 1742 -5438 1219 5059 -3896 -3778 5367 1524 -5195 2281 4388 -4589 -2040 6053
1239F053o642m461P702M12q278M022O490p560l082R182j579q376O551M863q747
$$ 6053 -589 -5050 2652 3064 -5214 -1192 5298 -2262 -5344 3838 2259 -6117 434 5297 -3450
1254c450j018Q908k116p238N817M268q335K82Q706m291o274P078K221p630J498
$$ -3450 -4468 4440 2324 -4914 903 5171 -3164 -2882 5824 1533 -4741 2337 4558 -3072 -1574
1269a574O890m870n021O837J099p602L073N768o650k859P249np426L834N253o686
$$ -1574 5316 446 -4575 2262 3361 -4241 -1168 4600 -2050 -4909 2340 2335 -5091 -1257 3996 -2690
1285b690k663Q796j481p357N284M347o742n62P671k188o796N546M517p923N51
$$ -2690 -5353 3443 1962 -5395 -111 4236 -2506 -3068 4603 2415 -4381 1165 5682 -2241 -1690
1300a690P687m679o214P473K440q173Q62P286n033n698P838J563q327K598O115
$$ -1690 5997 1318 -4896 2577 5017 -3156 -2294 4992 -41 -5739 2099 3662 -4665 -2067 4048
1315D048o300k978P810j74q058M212N490o712j372Q872l167p106O603L929p687
$$ 4048 -2252 -5230 2580 2406 -5652 -1440 4050 -2662 -4034 4838 1671 -5435 1168 5097 -2590
1330b590J54Q341l968p069P351L490q723J193P156n370m605P155J355q037K224
$$ -2590 -2436 5905 1937 -5132 2219 5709 -3014 -1821 5335 -35 -4640 2515 3870 -4167 -1943
1345a943O207n996l506P978n02p655M087N074o413j398P618j736o849M556N203
$$ -1943 4264 -1732 -5238 2740 2238 -5417 -1330 3744 -2669 -4067 3551 1815 -5034 -478 4725
1360D725o968o42P493l331n532N756L049o654K02O328l943m927O980J777p737
$$ 4725 -2243 -2885 4608 1277 -4255 1501 4550 -2104 -1902 4426 483 -4444 2536 4313 -3424
1375c424J874O248n126l839O873O99p419K245O067n401l150P717j168p211M346
$$ -3424 -1550 4698 -428 -4267 2606 3305 -4114 -1869 4198 -1203 -4353 3364 2196 -5015 -669
1390f69M801o153j335O595j360o370N142L996p201j17O849l793n226O571K181
$$ -669 4132 -2021 -3356 3239 1879 -4491 651 4647 -2554 -2671 4178 385 -4841 1730 3911
1405C911p328P42P378m282n170P222J041p823K913O289n375l183O667l00o733
$$ 3911 -3417 -2675 4703 421 -4749 2473 3514 -4309 -1396 4893 -482 -3665 3002 2702 -4031
1420d031L693N322o754j687P346k152n917N134L206o549j023O806k555n614N584
$$ -4031 -338 4984 -1770 -3457 3889 1737 -4180 954 4160 -2389 -3412 3394 839 -4775 809
1435H09K660p349J044O407l943l745N434J290o368J876N893m218l118O233k63
$$ 809 3469 -3880 -2836 3571 -372 -4117 1317 2607 -3761 -1885 4008 -210 -3328 2905 2642
1450B642o269L635M814n193k544O056p09n819L789M236n871j530N791k113m603
$$ 2642 -3627 8 4822 -371 -2915 3141 2432 -3387 402 4638 -1233 -2763 3028 915 -3688
1465c688M244K570n624r12N997k341m306M833J878o530J334O007l445l653N208
$$ -3688 556 3126 -2498 -3410 2587 246 -4060 773 2651 -3879 -2545 3462 17 -3636 1572
1480A572J122n820J879O060m615l295N837K21n725L418M007n052k471N742q99
$$ 1572 2694 -3126 -1247 4813 198 -3097 2740 2961 -2764 654 4661 -391 -2862 2880 1981
1495A981n378L748L441o148p10O082k318m791M300K394n823J2N900k742m405N446
$$ 1981 -3397 351 3792 -2356 -3066 3016 698 -4093 207 2601 -3222 -3210 2690 -52 -4457 989
1511I89J703o109J742N259l596l149M983R66n373K068M941m806k126N607r85m946
$$ 989 2692 -3417 -1675 3584 -12 -3161 1822 2788 -2585 -517 4424 -382 -2508 3099 2114 -2832
1527b832L219L434n029j844N874j285n237L714K813n523K20N688k776m320M060
$$ -2832 387 3821 -1208 -3052 2822 1537 -3700 14 2827 -2696 -2476 3212 436 -3884 176
1542A76K174n012O88N142l137l669M884J199m997J803M050l925k308N153L97n311
$$ 176 2350 -2662 -1974 3168 31 -3638 1246 2445 -2552 -749 3301 -624 -2932 2221 2618 -2693
1558b693K479L562m229j748N326r10m868K686L475m162j537M931j306m238L411
$$ -2693 -214 3348 -881 -2629 2697 1787 -3081 -395 3080 -1082 -2619 2312 1006 -3232 179
1573A79K718m769k0M838k555l739L928K814n410K12M742k743l310M743J210n448
$$ 179 2897 -1872 -1892 2946 391 -3348 580 3394 -2016 -1804 2938 195 -3115 1628 2838 -2610
1589b610J240M514l340l549N249R79n411K136L766m507r65N629j645m809L201
$$ -2610 -1370 3144 -196 -3745 1504 2483 -2928 -792 2974 -1533 -2498 3131 1486 -3323 -122
1604a22L543m670q70N729k508m835M978K261n446P30M176k838l687N055J355n133
$$ -122 3421 -1249 -2119 3610 1102 -3733 1245 3506 -1940 -1210 2966 128 -3559 1496 2851 -2282
1620b282R67L982l561j969M823l13n338K614L493l619j623M791j063m467L302
$$ -2282 -1315 2667 -894 -2863 1960 1647 -3691 -1077 2416 -1203 -2826 1965 902 -3565 -263
1635b63L247m388o51M385j121l618K836K744l567j114M398j670l247L265J591
$$ -263 2984 -1404 -2055 2330 1209 -2409 427 3171 -396 -1510 2888 1218 -2029 1236 2827
1650B827m468N37L554k130l312L577J616m750Q09M117l161k676M595O67n065J369
$$ 2827 -1641 -1104 2450 320 -2992 585 2201 -2549 -1740 2377 -784 -3460 1135 1802 -3263 -1894
1666a894M790l556k087M628J14m955L155L399m191q26M554j756l817L562K236
$$ -1894 2896 -660 -2747 1881 1995 -2960 195 3594 -597 -1423 3131 1375 -2442 1120 3356
1681C356m939j80N110k704l508M259J304n437Q85M631k926l113M233K88m368K062
$$ 3356 -1583 -1763 3347 643 -2865 1394 2698 -2739 -1854 2777 -149 -3262 971 1259 -3109 -1047
1697a047L696l719j891M767m83l912K630K782l913q49M513j149l697L207J901
$$ -1047 2649 -1070 -2961 1806 1323 -2589 41 2823 -1090 -1939 2574 1425 -2272 935 2836
1712B836m094j08L708j109l095K509J323l548K84L491k376k681L413Q92l489N58
$$ 2836 -1258 -1366 2342 1233 -1862 647 1970 -1578 -1294 2197 -179 -2860 553 1445 -2044 -1486
1728a486L575k070k357L378O56m140J831L489l218j889L718K10l757J895K908
$$ -1486 2089 19 -2338 1040 1696 -2444 -613 2876 -342 -2231 1487 1697 -2060 -165 2743
1743B743l368j681L827ll824K338K131l686m50M064j248l360L006J876m330N84
$$ 2743 -625 -2306 1521 1518 -2306 32 2163 -1523 -1973 2091 843 -2517 489 2365 -1965 -1381
1759a381M322k480l400L838J170m244J405L625l096k471M378J72m138J999K831
$$ -1381 2941 461 -2939 899 2069 -2175 -770 2855 -241 -2712 1666 1838 -2300 -301 2530
1774B530l543j250L811l12l508K283K174l817p48M258j373l449L121J813l715
$$ 2530 -1013 -2263 1548 1236 -2272 11 2185 -1632 -2380 1878 505 -2944 177 1990 -1725
1789a725K69L615j471l039L172J477l676O23L354k267k353L378M21l304J240K827
$$ -1725 -1456 2159 688 -2351 821 2298 -1378 -755 2599 332 -2021 1357 1778 -1526 -286 2541
1805B541l004j761M030j43l970J766K513l031j105L319j50l526K066K465l337
$$ 2541 -463 -2224 1806 1663 -2307 -541 1972 -1059 -2164 1155 1005 -2521 -455 2010 -1327
1820a327o56L745j057k780K297J766l076n8L108j421k886L261J481l883Q69L175
$$ -1327 -1983 1762 705 -2075 222 1988 -1088 -1146 1962 541 -2345 916 2397 -1486 -617 2558
1836B558k050k008K937Q40m047Q04L104k766j795L614k37l506J859K582k956j300
$$ 2558 508 -1500 1437 2277 -1770 -966 2138 -628 -2423 1191 954 -2552 -693 1889 -1067 -2367
1852b367L512l84l553K433K431l527k03L807j544k614K859J879l670l29M144k115
$$ -2367 1145 761 -2792 -359 2072 -1455 -1658 2149 605 -2009 850 2729 -941 -1270 2874 759
1868G59k781L209J039l914R96K943k343j917L292J51l848J895K665k991j243L396
$$ 759 -2022 1187 2226 -1688 -692 2251 -92 -2009 1283 1434 -2414 -519 2146 -845 -2088 1308
1884A308n64l343K458K149l131n88L512q01k998K479J832l252n32L303j446k058
$$ 1308 744 -2599 -141 2008 -1123 -1711 1801 1000 -1998 481 2313 -939 -1471 1832 386 -1672
1900a672K480J195l357K44L055j754k037K726N36l600J279K947k659j261L032
$$ -1672 808 2003 -1354 -1110 1945 191 -1846 880 1416 -2184 -905 2042 -617 -1878 1154
1915A154j9l292J472L026k887j460L556q23k459K001J937l016q01L368r89k758
$$ 1154 1135 -2157 -685 2341 -546 -2006 1550 727 -1732 269 2206 -810 -1611 1757 768 -1990
1931a990K532J547l636K01L399j781k437K766J022l196K88L264j947k151L192
$$ -1990 542 2089 -1547 -1346 2053 272 -2165 601 1623 -1573 -1285 1979 32 -2119 1073
1946A073K15l041J162K502k377j225L003N2l159J662K508l236n65L449j450k466
$$ 1073 1288 -1753 -591 1911 -466 -1691 1312 1364 -1795 -133 2375 -861 -1426 2023 573 -1893
1962a893K081J733l050m09L164j437k548K835J108l298M25K974j690k318K729
$$ -1893 188 1921 -1129 -1538 1626 189 -2359 476 1584 -1714 -1289 1685 -5 -2323 406
1977D06J164l189R19K644k286j404L385k25k979J832J786k449q16K946n28k678
$$ 406 1570 -1619 -700 1944 -342 -1746 1639 1414 -1565 267 2053 -396 -1212 1734 1206 -1472
1993a472J766J539k651m08L109j306k508K158R45k362l85K881j457j778K379P43
$$ -1472 294 1833 -818 -1226 1883 577 -1931 227 1172 -1190 -1575 1306 -151 -1929 450 1193
2009A193k515O00K320j679j700K457Q96k820O58K877k178j516K784J01k514R99
$$ 1193 -1322 -722 1598 -81 -1781 676 1572 -1248 -590 2287 109 -1407 1377 1478 -1036 -37
2025c7J989k074j134K622m34k604J619J507k894k74L344j371k444J880J904l172
$$ -37 1952 -122 -1256 1366 932 -1672 -53 1454 -1440 -1714 1630 259 -2185 -305 1599 -1573
2041a573J56L042j492k550L010J032k869P19K471j718j769K690M76k696R54K207
$$ -1573 -1417 1625 133 -2417 593 1625 -1244 -525 1946 228 -1541 1149 1625 -1071 -117 2090
2057B090k656p18K868p87k295J577J278k138o20K744r23k532J994J595k666K27
$$ 2090 -566 -1284 1584 797 -1498 79 1357 -781 -1401 1343 420 -2112 -118 1477 -1189 -962
2073i62K208j138j647J866P96k063K49K376j613j350K407J10k505Q56J922j625
$$ -962 1246 108 -1539 327 1123 -940 -691 1685 72 -1278 1129 1239 -1266 -410 1512 -113
2089a13j478K393L43k637J152K205k097j250K465p9k044O21K001k204o58K459
$$ -113 -1591 802 1145 -1492 -340 1865 -232 -1482 983 904 -1140 -519 1482 -722 -1380 1079
2105A079n40k221J737J552k637n5K465n98k555K367J189l029M03K791k040j512
$$ 1079 539 -1682 55 1607 -1030 -1085 1380 782 -1773 594 1783 -1246 -843 1948 -92 -1604
2121a604K552K73k660O58K157j631j346K387o2k714J601J996k114q05K316m35
$$ -1604 948 1221 -1439 -781 1376 -255 -1601 786 724 -1990 -389 1607 -507 -1312 1004 569
2137E69j662J501J455k751j55K656j205j708K023M32k105q6K219j127j306J394
$$ 569 -1093 408 1863 -888 -1043 1613 408 -1300 723 1155 -950 -1036 1183 56 -1250 144
2153A44M88j834L61K308j684j357K296j00k004R28J606j708r78K334j7k252J236
$$ 144 632 -1202 -841 1467 -217 -1574 722 622 -1382 -454 1152 -556 -1534 800 783 -1469 -233
2170b33J743j940n76J953k00j626J252Q82j735l73K327p99j930J851P32k397N3
$$ -233 1510 -430 -1006 947 747 -879 373 1255 -480 -853 1474 675 -1255 596 1328 -1069 -1016
2187a016K152j135j659K134L73k551R22J978j402j516K187J58j625Q56J746j888
$$ -1016 1136 1 -1658 476 849 -1702 -780 1198 -204 -1720 467 625 -1000 -144 1602 -286
2203b86p46K349o42k089J587J232j991r4K065o88k096J742J109k211N2K336j559
$$ -286 -1032 1317 675 -1414 173 1405 -586 -680 1385 697 -1399 343 1452 -759 -707 1629 70
2220G0j166J622N92k134M25J378j045j385K164K2k034Q67J710j416j006K035j40
$$ 70 -1096 526 1118 -1016 -591 787 -258 -1643 521 543 -1491 -624 1086 -330 -1336 699 559
2237E59j655J147J397j860l74K278q36j841J800J028j746p14K090o95j808J369
$$ 559 -1096 51 1448 -412 -786 1492 656 -1185 615 1643 -103 -817 1273 578 -1230 139
2253A39P07j903L07J594r15r69J249N83j786N58J987k071p67K327k32j933J029
$$ 139 846 -1057 -750 844 -71 -1040 209 792 -994 -436 1551 -520 -1287 1040 808 -1125 -96
2270i6J184j548n00J735J72k116J006J508j776n48J846m96j392J220Q87j650k20
$$ -96 1088 -460 -960 775 947 -1169 -163 1345 -431 -979 867 371 -1021 199 1086 -564 -784
2287g84J607m24j771J412J097k099L14J474p23j286J723M86j835L07J573j053
$$ -784 823 399 -1372 40 1137 -962 -648 826 103 -1183 540 1026 -809 -502 1071 18
2303A8r06J575k5j707J079J241j501n74J743n27j740J074J206j908k52J794n69
$$ 18 -888 687 662 -1045 34 1275 -226 -800 943 416 -1324 -250 956 -952 -1204 590 21
2320B1j565J557J064j748m8J691l83j693J603P74j840l2J816j053r02J447J67
$$ 21 -1544 13 1077 -671 -719 972 589 -1104 499 1273 -567 -599 1217 164 -738 709 876
2337H76j485N81J023j476n52J761l05j630Q59J129j370m91J685j61j592R61J132
$$ 876 -609 -28 995 -481 -1033 728 423 -1207 -348 781 -589 -1080 605 444 -1148 -187 945
2354I45j409j85J422l77j327J302N84j158l28J711q14j347J773J79j738P75J008
$$ 945 -464 -649 773 396 -931 371 955 -203 -531 1180 366 -981 792 971 -767 8 1016
2371A016q58j022J305K84j694N31J317j170q41J565m6j693R90J121j281l23J332
$$ 1016 158 -864 441 725 -969 -438 879 -291 -1132 433 387 -1306 -316 805 -476 -799 533
2388E33n8j659J262R82j608k06J963p90j226J210R98j967N0J714q06j608J709
$$ 533 475 -1184 78 1060 -548 -754 1209 419 -807 403 1401 -566 -516 1198 392 -1216 493
2405D93L08j752P16J154j350o49J476K46k010J155J139j423o93J663l72j155R36
$$ 493 801 -951 -235 919 -431 -1080 396 642 -1368 -213 926 -497 -1190 473 101 -1054 -118
2422a18J068j366j38J462m12j480J153Q60j677L4J791r15r46J095L63j405L74
$$ -118 950 -416 -554 908 496 -984 169 1029 -648 -614 1177 262 -684 411 774 -631 -257
2439b57J198j005j008J604l9j612N54J186o71p35J286r2j324M97J534j406o19
$$ -257 941 -64 -1072 532 493 -1119 -565 621 -50 -785 501 409 -915 -418 1116 -290 -909
2456i09J508k85q03N06J219j722n3J359n91j200J098Q05j399J63R30p27r95J224
$$ -909 599 314 -489 17 1236 -486 -539 820 229 -971 127 932 -467 -304 626 -101 -1096 128
2474A28N09j550L0K063j235q11J257K39j466O91J045j113m74J460q4j688J225
$$ 128 637 -913 -883 1180 -55 -866 391 630 -836 -145 900 -213 -687 773 689 -999 226
2491B26P63j574K2J414m28j405R05J204j835OJ659q38j311J439K30j540P74Q91
$$ 226 989 -585 -563 851 423 -982 -77 1127 -708 -702 957 119 -1192 247 477 -1063 -289 602
2509F02p93o98J414M9j301O58P81q36p83J714k15j114P28N69q88p29J642j99j357
$$ 602 -191 -889 525 574 -727 -69 712 -124 -907 807 592 -522 206 775 -113 -842 800 601 -756
2528g56R20M00r55n7R84l86r41O89O59j297J93J149m90j116J243M93j340M40J129
$$ -756 164 564 -391 -448 536 150 -791 -102 557 -740 -547 602 112 -1004 239 732 -608 -168 961
2547I61p49j345J461O72j740M01J147r28n50J134kj130P93R29j064o09J382q39
$$ 961 212 -1133 328 1000 -740 -339 808 -120 -670 464 462 -668 125 1054 -10 -619 763 -76
2565g6j098J265Q61j555Q4J053m99j102J119O65j395k36J853j070o56J426Q1j309
$$ -76 -1174 91 952 -603 -519 534 35 -1067 52 717 -678 -914 939 -131 -787 639 720 -589
2583e89M78J065j110l47J316l09j258P82R03j253l54J200j54j130M88Q81j290
$$ -589 -111 954 -156 -503 813 504 -754 28 931 -322 -676 524 370 -760 -272 609 -681
2600f81J99J154n76j128R18N63j162K49R15m68o03R63J25j101M18J101q41m73
$$ -681 -482 672 96 -1032 -114 449 -713 -464 451 -17 -620 343 468 -633 -215 886 45 -428
2618d28J092j91r89L20Q19m73p87J189J66j611P31P44r57k80J121l84j199R52
$$ -428 664 473 -516 -196 623 150 -637 552 718 -893 -162 582 -375 -655 466 82 -1117 -165
2636a65Q56j029m54J318m00j053J208N63j417L74J290q26r99J116K07j026L05
$$ -165 691 -338 -792 526 126 -927 281 844 -573 -199 1091 265 -734 382 589 -437 -132
2653a32R10q40l42N23Q2r15O09N83o86n23J003k11p17P86N28q16m35J191j18j099
$$ -132 778 -62 -404 119 201 -714 -105 478 -208 -731 272 61 -656 130 658 -158 -593 598 480 -619
2673f19O71P79r35m18J222o04n89Q27J23q05J55N71m71o91R09K93j242N81R34
$$ -619 52 831 -104 -522 700 96 -493 334 457 -348 -193 378 -93 -784 125 418 -824 -243 691
2692F91q79n58R20r3q79M63J179j032l16J042k75r74J061L69r53j86J184m92o46
$$ 691 -188 -746 174 81 -798 -335 844 -188 -504 538 263 -711 350 719 -234 -420 764 272 -374
2711c74N64N99j205K14J072q09o97Q81K02p83J06O10o33o30J130J50r43L51N49
$$ -374 190 789 -416 -202 870 61 -636 245 447 -336 -230 380 -253 -883 247 397 -546 -195 354
2730C54n65n46J144M4j114O63P45r67j3Q01l59p42P32M58p98qO71m92o66O26O47
$$ 354 -211 -757 387 431 -683 -20 725 -242 -255 546 187 -555 177 635 -163 -171 500 8 -658 -32 615
2751F15j116J74P87l10o37O31J77q28Q3Q81p25m91Q85K8n87K32P28r00j64J128
$$ 615 -501 -327 460 150 -487 144 321 -507 -424 457 -268 -759 126 154 -433 -201 527 -373 -537 591
2771E91k46p14N44K26p40o2J135m67o86M99N22r85L92L46l07p41P98L37r63P8
$$ 591 345 -369 175 401 -339 -401 734 267 -419 80 602 -383 9 355 48 -693 105 442 -521 -443
2791d43Q17o05k63P07n5m64K59L60n37l21Q81J13p10K83N23p46l25Q56k87l97
$$ -443 374 -231 -494 213 158 -306 -47 313 -224 -545 336 449 -261 22 545 -201 -526 330 43 -354
2811c54L30M87o05l26P13j38o07J84P60q38J0O02L3p23M96K91o31o5R10l52o52
$$ -354 -24 463 -142 -468 245 107 -500 -316 444 -394 -384 218 251 -472 24 315 -316 -381 529 177 -475
2832d75P83Q5o70r0R81m96m50O57r2o15K86P65r85j93O87k6r25O89M51n87l12
$$ -475 308 393 -277 -367 614 118 -332 325 233 -382 -96 669 -316 -509 178 152 -773 -84 367 -220 -532
2853e32P52J2q08M50L69n51j43R72n69l45P82m2n31L13N83o18m68L94L57r24L38
$$ -532 220 232 -576 -126 243 -308 -451 521 -48 -393 389 347 -184 129 712 94 -374 20 377 -547 -209
2874b09P15p04j45M86J83r56M10N60o74l82P04M01j034P35M17p93L25N5L5m93
$$ -209 506 -198 -343 143 326 -630 -220 340 -334 -716 -12 389 -645 90 507 -286 39 94 129 -364
2894c64M34L36o18j6J045o20l69J56N76r16j69J149p82k17M75K64q25K79O61o40
$$ -364 70 406 -212 -228 817 197 -172 -16 560 -356 -525 624 -158 -375 100 364 -461 -182 479 -161
2914a61k46P46j59o74K77N62k90m15Q92l24o43N31M48p96l05R81np49N22M49o22
$$ -161 -407 339 180 -494 -217 345 55 -360 532 208 -435 96 544 -252 -557 424 419 -330 192 641 19
2935A9m14Q05k85o46P41K34q88J32P23r29Q3P11R3r23M54M94o48l86P75L2n93
$$ 19 -395 410 125 -521 220 454 -434 -302 421 -508 -425 286 379 -544 -90 404 -244 -630 145 177 -416
2956d16L60L21m59k2N61j14o33Q06k39o02L19O18m52k73L03L47o39j30R58o35
$$ -416 -56 265 -194 -216 345 231 -402 404 165 -437 -118 500 48 -225 78 425 -214 -344 614 -21
2976b1n05M26M29q21K06L88j43k22K24N00q26J33O80l43k24N37j95n47L54N84
$$ -21 -526 -100 329 -492 -286 102 -41 -263 -39 461 -365 -232 448 105 -119 418 223 -324 30 614
2996F14p37m4M15L0o74J19N27o61J28O68k30o70O56L50o62J52M05n01p7J82L09
$$ 614 -123 -167 248 278 -396 -277 250 -411 -283 385 155 -515 141 491 -171 -19 386 -115 -192 -10 299
3017B99p01M32L85l73n69Q20M6p77N08J70j18m14P30j87p71M65K73l30l39N42
$$ 299 -402 30 415 42 -527 293 339 -438 70 240 122 -292 438 251 -520 -55 218 -112 -451 91
3037I1j96k95N19L4m92K59M31l92k39M17O1m91L1Q74n85k63M53L06q10J76O42
$$ 91 -105 -400 119 153 -339 -80 351 -41 -280 137 198 -293 -262 612 27 -236 217 523 -287 -111 531
3058E31m13n80P57k15m73N11M25n88l53O57j16n98K36M02m79m6P56n83k44M85
$$ 531 118 -462 295 80 -393 118 543 -45 -398 259 143 -455 -219 183 -296 -342 414 -169 -413 72
3078G2O6j55k65P50k91k72L44J06o59N35K62l88k68M18j90l75L48L78m48m58Q28
$$ 72 138 -17 -282 468 177 -95 249 355 -304 231 493 105 -163 255 65 -310 38 416 -32 -490 338
3099C38j30n39NN12l68k32P57j61m93L84J32m92R8O07k97m80N79K14o22J65N69
$$ 338 208 -331 -326 186 -182 -414 343 182 -311 73 205 -287 -189 418 121 -359 220 434 -188 -23 546
3120E46k78q30P25J76n72J23M02k87m20L48M09p32m9P22k33p32Q86j28n74O23
$$ 546 268 -562 163 339 -233 -110 292 5 -415 -67 342 -390 -439 283 50 -682 204 76 -498 125
3140A25Q7n92J00N77k38l51M67J08o86K14M23j46m34M94L7k80j46P04l85n43P26
$$ 125 212 -380 -280 297 59 -292 175 283 -403 -189 234 88 -346 148 185 -95 -241 463 78 -465 261
3161B61j22n34M68J91m28l04M47J19k87J44L44l24o19R17J30o12M65J3m36j24
$$ 261 139 -395 73 264 -164 -468 -21 98 -189 -45 299 -25 -644 273 403 -209 256 269 -167 -291
3181b91N92j75n39N38J43l06L9L96l95k01L58K03l95k56M89j92l49M69J08n83
$$ -291 301 126 -413 125 268 -38 1 397 2 -199 159 362 -33 -289 200 8 -341 128 236 -347
3201c47K55N27k90l17K43L48m00k72N71n42nN41J34p34M73R8l31p1K26O5m40K89
$$ -347 -92 435 145 -172 71 419 19 -253 318 -224 -229 312 446 -288 185 283 -48 -119 107 172 -268 21
3223B1L24r65L70M89l44k43P22N2n81M6M95o58O0O09k59k79K98j5o0j86K22n0
$$ 21 345 -620 -250 239 -105 -348 374 426 -155 -109 386 -272 -212 397 138 -141 157 142 82 -104 118 68
3245F8r3J43K27m43m1L09l52j99L75P7m22L93J03n6o55M01L65j34r7L39l86r8
$$ 68 -25 118 345 -98 -139 170 -182 -381 -6 71 -351 42 145 89 -566 -165 200 66 -31 308 -78 -176
3267a76L21L7l19K43L79n06k48L72J4k75K44J63l12k26N76k62k43R3N90n84j92
$$ -176 145 182 -137 106 485 -21 -269 103 117 -158 86 249 -63 -289 287 25 -218 -125 465 -119 -311
3288c11N04l34j10K53K29m22N9N60n17k71M44K54m14J16L48k96k24j20N62m77
$$ -311 193 -141 -251 2 231 -191 -132 428 -89 -360 84 338 -76 40 388 92 -132 -252 310 -167
3308a67J7O36r68J01O27j55l37J16K64l51j26N31r3j75K41r1l42N79l56L61j93
$$ -167 -150 486 -482 -381 246 91 -246 -130 134 -217 -343 188 95 -80 161 70 -272 307 -49 312 119
3329A19O6Qk02p5K30m5l77N79j95j34k96P97n54p8L86k3m53K50M27n89N1L35j75
$$ 119 185 193 -9 -84 146 101 -276 303 108 -26 -322 475 -79 -157 229 206 -247 3 430 -159 -108 227 52
3352E2k70K87Nj24k03M59l2j19j35M79m69j66O58n5m35N4L22j62j48L62l78k5
$$ 52 -218 69 74 -50 -253 206 174 55 -80 399 -70 -236 422 367 -68 -14 308 146 -2 360 -18 -43
3374d3L18j41l12J60n5J85l53M32n9m29J64N73l39m87M61J06k75kL00l55J27L24
$$ -43 275 134 -178 -18 -73 112 -241 191 132 -297 -133 440 101 -386 75 181 -94 -96 204 -151 -24 300
3396C00r7l74K43Lm0j05K88j79m49M26M7k85J47M60l17p0J29j39m79K84M35M3
$$ 300 203 -171 72 75 35 -70 218 39 -410 16 63 -222 -75 385 68 -2 127 -12 -491 -207 228 271
3418B71m54J16l7L8PK71k22j82K90j6L4k38M59l56J6N19m25n20O99j29o3l5J71
$$ 271 -183 -67 -104 -66 -59 212 -10 -192 98 82 116 -122 337 -19 -3 516 91 -429 270 141 78 43 214
3441B14l89j23M66J38m76M8L81k35k02L48K03l71k33M46k43l44N42k11j74K94
$$ 214 -175 -298 168 306 -170 -122 259 24 -178 170 373 2 -231 215 -28 -372 170 -41 -215 79
3461G9K60j0n27O30l99j75K35k3k96Q0M51l48k80L87J67n30L29L43j83n19L73
$$ 79 339 329 -198 432 33 -142 93 70 -226 -146 305 -43 -323 64 231 -299 30 373 190 -329 44
3482D4M09m50l4J74j1k72K98J84p16M74J03j60j94K89l6l94O29q2m10p2M22k81
$$ 44 453 3 -31 143 132 -140 158 342 -374 100 203 43 -151 138 102 -292 337 255 -155 -227 195 -86
3504h6L7K66o4l24p3L59l93J59L40l11P3J2M0N4k96M43J96o16K98K4j02j29R1
$$ -86 -49 217 153 -171 -244 115 -278 -119 221 -90 -17 -5 35 89 -207 236 432 -184 114 138 36 -93 -2
3527bO5k8Q5J20j82j76J09kk54J97J61k7j00n0M5q3lO2j96o9M31k1q4M5K19l40
$$ -2 63 35 120 240 58 -118 -9 -11 -265 -68 93 66 -34 -84 -39 -122 -125 -63 -259 -328 103 82 -2 43 262 -78
3553g8J8L12k66n2J11K20m19J25L03l59j65L10o2n02K66M03j84l00O45m93k4L80
$$ -78 -60 252 -14 -66 45 265 -154 -29 274 -85 -250 60 -2 -504 -238 165 -19 -319 326 -167 -191 189
3575A89J75m14p9K07K69p06M24K15j42j26k2J84j82J62k19K5j33K03O5p5J77j17
$$ 189 364 -50 -129 78 347 -359 65 280 138 12 -10 174 -8 154 -65 -40 -173 30 95 20 197 80
3597H0k09m6L94k04k87J81k6J5J36J63l0m17J87K0N9j4qj61n4N32l17k66L31k0
$$ 80 -129 -175 219 15 -272 -91 -117 -102 34 197 167 -250 -63 -43 16 2 -6 -167 -221 311 -6 -272 59 39
3621C9k04J25K89l04k47L92N3j48r2R1P6n06M79O1l15J06L91k94o5M0K36k67j18
$$ 39 -165 -40 249 -55 -302 90 143 -5 -97 -6 70 -436 43 104 -211 -105 286 -8 -73 -33 203 -64 -182
3644a82J79j08N7J28MJ21j42J86l06k4L55l82j47K74J37m20L81K01m17jJ50K89
$$ -182 -3 -111 -54 74 78 199 57 243 -63 -87 268 -114 -261 13 150 -270 111 312 -105 -106 44 333
3666C33m84L9K95n0k91J00J60j31O5M6j03k4Q1k4j27j5M62k92n3J57j38q3J00
$$ 333 -151 -112 183 133 -158 -58 102 -29 36 82 -21 -45 36 12 -115 -130 332 40 -13 144 6 -77 23
3689B3K67l14o4K69k32j61K85L78o25L17Qk19m8L11q3j04k48M74k06m3L13p7k98
$$ 23 290 -24 -88 181 -51 -212 73 451 -174 143 151 -68 -116 195 112 8 -240 234 28 -15 298 221 -77
3712g7p9M60j92l00L51k21k40J60K86l22J53P0P4k85K00k8q1Q6J70P6m40L60Q8
$$ -77 -156 304 112 -188 163 -58 -298 -138 148 -174 -21 49 123 -162 38 10 -71 15 185 261 -179 181 269
3735B69m45K60K48k46j34J8M24o23L86nj43q0J69j24l02K48K59j92j53M42l57
$$ 269 -176 84 332 86 -48 -30 394 -229 157 152 9 -71 98 -26 -328 -80 179 -13 -166 276 -81
3756h1Kp3O23o92L5J46r1R1K02Rj75R5l7n8k47J20L74l19o2M89m40Q6K50M9m07
$$ -81 -79 -152 471 -221 -186 -40 -131 -40 162 171 -4 91 54 -4 -251 -131 243 -76 -138 351 -89 -3 247 296 -111
3781a11k23L62J64j99J83j57j47K30J35m98J87M5K50m43L34K10l94K24k0j73r5
$$ -111 -334 28 192 -7 176 19 -128 102 237 -261 -74 -29 221 -222 112 322 -72 152 132 -41 -136
3802a36J87J56k41m0L48j30k38oQ2j72J09P8o6j80J75K74k31j8pn6j51J27R6l8
$$ -136 51 207 -34 -74 274 144 -94 -100 -18 -190 -81 -3 -69 -249 -74 200 -31 -49 -56 -112 -263 -136 -40 -78
3826g8K79ol01l39N71J4j54L3j25J87l95K28J91o8R5j8j67J51J43m28RJ88m6r1
$$ -78 201 195 -106 -445 126 140 -14 19 -106 81 -314 -86 105 37 132 114 -53 98 241 -187 -178 10 -36 -127
3850a27j48L34k21%K16J1l50L52J9j62J34O3K08j38j16l4ml80N37j46l52L86l6
$$ -127 -275 59 -162 -162 54 65 -285 67 86 -76 58 121 329 191 75 41 37 -343 194 48 -304 82 46
3873D6l16K37J39k02j54L06K84p53L81J1O5K7oJ9j34J81p5M7j39L75k96k63j6
$$ 46 -270 -33 106 -96 -250 56 340 -413 -32 -21 44 71 65 84 -50 131 56 103 -36 339 43 -220 -236
3896b36M82o5k7p2J95m70J55P6j66L17k40J61m41K17J20pj13K73k85N6r9O3N2
$$ -236 246 181 154 82 277 -193 -38 38 -128 189 -51 110 -331 -114 6 -1 -114 159 -126 -70 -169 -106 -54
3919e4k15M15on3j39K20l55K08K26j75l06M82l02jL64j20m48K96N5j45j71J24
$$ -54 -269 146 140 87 -52 168 -187 21 247 72 -234 248 -54 -55 309 189 -259 37 92 -53 -224 -100
3941a00K25k56k6J11K25n60L31L7jq5J49j4j51K25k19N24m86m0K65l47M01k23
$$ -100 125 -131 -157 -46 179 -381 -50 -13 -14 -99 50 36 -115 110 -109 415 -71 -111 154 -193 208 -15
3963a5o5LJ37k99P7L11l23K45j95L30l01j48K00j6J92k47K28j76j18L59k11o0
$$ -15 -80 -77 60 -239 -162 149 -174 71 -124 206 -95 -243 -43 -59 133 -114 114 -62 -180 179 -32 -92
3985i2N2L32l68KM7J01p3K03j30j63j0l3Q2j2J68J0m0j98L40j28j05N4j70m4L1
$$ -92 -40 292 -76 -74 -27 74 1 204 74 -89 -99 -132 -50 -62 106 116 76 -122 218 90 -15 39 -131 -175 -144
4010a44K95j00r1om4N6J69r0j05J25J14j34o7k4J07J26m42L90j27q8k3K77j25
$$ -144 151 51 -40 -46 -90 -34 135 45 -60 65 179 45 -22 -46 61 187 -255 135 8 -80 -103 174 49
4033D9J28N4k55k83L31P9k72J10K02j49r2K00k89Q7K25N3k23J44m7J32l19Q7N4
$$ 49 177 231 -24 -307 24 103 -169 -59 143 -6 -98 102 -187 -100 125 178 -45 99 52 184 -135 -48 6
4056FM8l4M1O5m98N67m2k89k0L80j12j50K70j0o30N59j05l97N20j35j68J24q2
$$ 6 54 20 61 126 -372 195 153 -136 -156 224 112 -38 232 222 -408 151 46 -351 169 34 -134 -10 -92
4079i2J55L7j07K80q7l69K29J09l5k10O8J93m26K28p8j84P6R2K78k09J07o0j95
$$ -92 63 100 -7 273 186 -183 46 155 120 -90 -22 171 -255 -27 -105 -289 -213 -121 157 -52 55 -5 -200
4102b00J95r2K07k97O7L32k35K1J25k28j37N09k70j73K72k0j90K51rj5J16m00
$$ -200 -5 -97 110 -187 -120 212 -23 -2 123 -105 -242 267 -3 -176 96 76 -114 137 128 113 229 -171
4124a71J53lJ4L91n34j22N28k31k0o0l8q5N7J85j86M1J07p6K14l36J97QR0j72
$$ -171 -18 -21 -7 384 -150 -272 256 25 5 -55 -93 -178 -121 64 -122 -81 26 -50 164 -172 25 33 123 -49
4148d9K69m16K07Q0KM1q1ln1j00K26M3p4L9J69l09j65J71J04j49o1r1J38L07l39
$$ -49 220 -196 11 91 93 134 53 50 -1 -101 125 168 94 133 302 -7 -172 -1 103 -46 -107 -198 -60 247 -92
4173i2J69j68J75k5j9oJ18l03J6J58J57l88J53K49j97k27K40M3n1K17k1m32K25
$$ -92 77 -91 84 59 40 34 152 -151 -135 23 180 -208 -55 194 -3 -230 10 53 2 219 198 -234 -9
4196ij33K54l74P3M88m20L31k30k2K6n6j2J04J10J20M6n71M39K03k23j22Q0j09
$$ -9 -142 112 -262 -189 299 -121 210 -20 -42 -16 -72 -84 20 130 250 296 -275 164 367 144 22 102 -7
4219gm26L23L13k69O5N1m33L74K51r4m86M00M0k07m1K60n9j13j12K80m1k8R8L4
$$ -7 -433 -110 203 -66 -1 50 -383 -9 242 148 -338 62 102 -105 -146 114 55 -58 -170 110 69 41 139 173
4243A73l32L52Q1k04j30K91q9j52L89k56p1k07L82k98Ll0J29M6m6K59l17KJ45
$$ 173 -159 193 274 70 -60 231 142 -10 379 123 52 -155 227 -71 -68 -98 31 77 31 290 -27 -25 120
4266A20jl36M28O9l75L14k03p6J80r6l7k60M06j00J65j19l7M1j06%J61k23l1k15
$$ 120 119 -217 211 280 -95 219 16 -60 120 24 -13 -273 133 33 198 79 42 83 -23 -23 138 -85 -116 -331
4290c31O43m41L52j1m4l33J09L23l75J59n7J69l15K50j40J40K30j78j42N5J04
$$ -331 312 -129 223 212 168 -165 -56 267 -108 51 -6 163 -152 98 -42 98 328 150 8 63 167
4311A67j78k82M61o9j72j65M40j88j16n9K78k95j37O59k78Q5J27l69N2j29K62
$$ 167 -11 -293 168 99 -73 -238 202 14 -102 -161 117 -178 -315 344 66 151 278 -91 -39 -168 94
4332I4n8L7L7k91K10j77Q9l0n8%K19j68R4J47k66q6J75j7p4J00q8n2j04M76K5
$$ 94 36 73 110 -181 29 -148 -59 -89 -147 -147 72 -96 -2 145 -121 -207 -32 -49 -123 -23 -111 -163 -267 209 234
4357B34m61P7L20j34O1K13j78j55L74n07L52k20K53k11r2K90l44j43K22L1j53
$$ 234 -227 -150 170 36 97 310 132 -23 351 -156 196 -24 229 18 -74 216 -128 -271 -49 -18 -171
4378a71O5J81j70j19L59j52j61r3M89j35k17J99J17j23j2L1l7j18k1K08l8l65
$$ -171 -106 75 -95 -214 145 -7 -168 -261 228 93 -124 75 192 69 57 88 51 -67 -88 120 82 -283
4400b83M33q7M2jk16L0K5L80n49R9K73k34n4L02j92Q2j83L90l66k90M58Q5l58
$$ -283 150 63 105 104 -112 -82 -57 323 -226 -127 146 -88 -142 160 -32 50 -133 257 -109 -399 59 144 -214
4423b14J72L3M0j19o2J90M6P0j64p9K32M9O8n31K78l0Pl3j03K67k01J00k46pJ8
$$ -214 -42 -9 31 -88 -150 40 86 156 -8 -87 145 194 262 -269 9 -21 -14 -47 -150 117 -84 16 -230 -237 -219
4448b19K57r4r4Q2M03m30J75O5j31j51J58K71l36Q8N3j60j33L83k34K9j29P0M1
$$ -219 38 -56 -150 -68 335 -95 80 145 14 -137 21 292 -44 44 97 -63 -196 187 -47 -18 -147 -77 -36
4471c6l25L57P2j15J65J25m78N6K50J17k86J42n4p6j08L14J72l95jJ95j65k23
$$ -36 -361 -4 68 -47 118 243 -235 -179 71 188 -98 44 -10 -86 -194 120 292 -103 -104 91 -74 -297
4493b97O55k51k79K41J45J10m06L10k79j86J41L16k54J14O6m8k49J78M8j80NK47
$$ -297 358 107 -172 69 214 324 -82 228 -51 -237 -96 220 -34 80 146 98 -151 27 75 -105 -100 147
4515A47l3l55J43K45j83l3P7j80j4J70P2l82K80J88k6j53K97r6j80k40L15j45
$$ 147 114 -241 -98 147 -36 -69 8 -172 -186 -16 56 -326 -46 142 116 -37 260 164 -16 -256 59 -86
4537h6J57j10N4M7j98J34j9L38j20k79OK07p1Mk64P14m03o5J73r3j26jK54l50
$$ -86 71 -39 15 62 -136 -2 -21 317 197 -82 -76 131 60 64 -200 514 111 46 219 126 0 -1 253 -97
4561i7j0M32j01l51J42o1j5o5J91l07N7K01L0KK9j81J62l3M1K9k46J32J54k2l2
$$ -97 -107 325 224 -127 15 -46 -61 -126 65 -242 -185 16 46 48 77 -104 58 25 66 95 -151 -19 135 113 81
4586H1N1j78l3NK74l83J93o0j2j2p8L55k54j98M77j70k72J90Q6j27P5JP2j00j21
$$ 81 132 -46 -79 -74 200 -183 10 -50 -62 -74 -152 203 -51 -249 228 58 -214 -24 62 -65 10 11 83 -17 -138
4611a38K58j42r3R6M8l72N36k32l4K6J56j40n9J91j10j33J5OJ38m6O2j65j67J04
$$ -138 120 -22 -115 -19 29 -343 193 -39 -73 -47 109 -31 -90 101 -9 -142 -127 -121 17 -29 33 -132 -299 -195
4635a95M5q6K5L41j72k00J79J25j48O7M77l43m22M77R1l76n3K63P0k28l3L24m87
$$ -195 -150 -236 -211 130 -42 -242 -63 62 -86 -19 458 115 -307 170 261 -115 -168 95 165 -63 -96 228 -259
4658b59L91pj34k89M93k76J8P1K2R3l02K38J91m01j19M30P4j60J13k11k19Q3M54
$$ -259 132 125 -9 -298 195 -81 -63 8 30 123 -179 59 250 -151 -270 160 234 74 187 -24 -243 -160 294
4681B94j0k92J3J24n4Q0j56l00K28K06k60q5J3K43l63M87k81m6Q1N6O5k34M41
$$ 294 284 -8 5 129 75 155 -1 -301 -73 133 -127 -212 -199 44 -319 168 -113 -159 -78 -22 43 -191 250
4704B50P7k94K3N4O6P6k39J43l20J39L35l46k7O8L10l47j43O5L93l30O6R4j11
$$ 250 327 33 56 110 176 252 13 156 -164 -25 310 -36 -63 5 315 -32 -175 -110 283 -47 19 113 2
4727BK74l11j41J06M0P1j29NJ20k63J23L19j13k50%K98L8l70K63o4j57J41K05
$$ 2 276 -35 -176 -70 -30 41 -88 -83 37 -226 -103 216 103 -147 -147 151 189 -181 82 18 -139 2 207
4750B07j21k45K21m0j51K31Qk95K10J83Q4k97j12K83l02j20M09j02k78L25J58
$$ 207 86 -159 62 22 -129 102 110 -185 25 208 292 -5 -117 166 -136 -256 153 51 -227 98 256
4771B56m90Q5L74n4k41N9J15j45P2J21j50r0J72or3J5j02r4L8K96j31q9J4Q3o2
$$ 256 -234 -149 225 171 -70 -11 104 -41 31 152 2 -88 84 78 -15 0 -102 -196 -158 138 7 -82 -68 15 -47
4796d7l4K65j28j38K47k73k03L25J72k6k12J22O6n94L81K03l36K33J1n2j30J66
$$ -47 -81 184 56 -82 165 -108 -311 14 186 160 -52 70 136 -458 -77 126 -210 23 34 -18 -148 18
4818A8j0j80j0K41J87n50K88M5j55Q9K16j9j81J70Q0l66L1J83n8l9P3j04O6L0
$$ 18 8 -172 -182 59 246 -304 -16 29 -126 -37 179 160 -21 149 229 -137 -106 77 19 -20 53 -51 15 45
4842D5M2j80J15r1L74k95%J95k71j63M15j29l15J79K53j76K20l9r4m7N8L40m41
$$ 45 87 -93 22 -69 305 10 10 205 -66 -229 186 57 -258 -79 174 -2 218 179 85 38 96 436 -5
4865eR0n7L4P3p9j88K75j84P3m3nJ41j92J46m07L16k23K73J2o4k58M18J13n17
$$ -5 85 28 62 135 56 -132 143 -41 32 -11 -16 125 -67 79 -328 -12 -235 38 50 -14 -272 146 259 -258
4889b58M06k53K77k04R8k0l1j75K86J16j13n9j60L60l02J15lk4j06J58j01K3k20
$$ -258 148 -105 172 -32 66 46 15 -160 126 242 129 70 -90 270 -32 83 80 56 -50 108 7 30 -190
4912a90J96k66J85K65k27J00J86pm20L9L00k24J65N3M9k47J95j08k47K45O6k51
$$ -190 6 -260 -75 190 -37 63 249 242 -178 -139 161 -63 102 155 204 -43 152 44 -203 42 108 -143
4934a43k13N70j50l31K44P6j76J05J50k61Q6J77j55k92R6L18m6l21K88J38j61
$$ -143 -356 214 64 -267 -23 53 -123 -18 132 -129 -43 134 -21 -313 -217 101 55 -266 22 160 -1
4955aJ06J20l52L48k09P8lL2k7K3j53J88n6j50J88j7o2k29K51k24QK6L19r8j77
$$ -1 105 225 -127 221 12 90 87 119 92 115 -38 150 94 -56 132 115 53 -176 75 -149 -141 -115 204 106 -71
4980g1j1J05j05J42J02k03J59L6k87N1M01l27Q8k1p3k8k29M12m7l79K19J06j4
$$ -71 -82 23 -82 60 162 -41 118 154 -133 -82 319 -8 80 59 -14 -42 -271 141 94 -285 -66 40 26
5003B6j46Q3MJ89l53K71j04K6Q3j73j80L71J48n08J7L58r6J28k23L87l14j29J24
$$ 26 -120 -37 -33 156 -197 74 -30 -4 79 -94 -274 97 245 -263 -246 112 16 144 -79 308 -6 -135 -11
5026a1j62K69R1k28j58J66j24J30J7J02j14k18l0K43q7L7J55j29j18K34r9OMM71
$$ -11 -173 96 187 -41 -199 -33 -157 -27 -10 92 -22 -240 -270 -27 -114 -77 78 -51 -169 65 -34 -28 -24 447
5050D47l32l8j61J30n6j03L29j97j90Q2J23j68K11m6j17r6J98Lr9p8M69m22j76
$$ 447 115 77 -84 46 -10 -113 216 19 -171 -89 34 -134 77 31 -86 -182 16 19 -80 -158 311 -111 -287
5073b87L86j07J09j06M2M4r1L25l85k87M10j65J26J45j52mn2K2K43m44R5J93j16
$$ -287 99 -8 101 -5 37 81 -10 315 -70 -357 53 -112 14 159 7 3 -49 -27 216 -228 -133 60 -56
5096e6J14j30j8j05M8L64k98J7k2J57m2l8j4K29j61p4j5M2j2J27j41j65K41j75
$$ -56 58 -72 -90 -195 -147 217 -81 -64 -86 71 29 -9 -23 206 45 -29 -44 -2 -14 113 -28 -193 48 -127
5120a27K75k56J66M4j80M1J22j82J38Kl66L48J57j51k46K62O7l75M08n9j61K20
$$ -127 148 -108 58 102 -78 -37 85 -97 41 43 -323 25 182 31 -215 47 114 -261 147 88 -73 147
5142A47L3k32m2L80j32q7n1k5J04n8m6L4j55N7L00l69J50p3L91m25rN4k40L8K50
$$ 147 180 -52 -94 286 154 67 16 -9 95 37 -9 25 -130 -73 227 -142 8 -65 326 -99 -108 -54 -294 -256 -6
$$ [...]
8191a4
##END NTUPLES=NMR FID
##END=
