##TITLE=1H_Ser 6-2-V-H
 CDCl3
 8 sc, 
 10.11.2021
##JCAMPDX= 6.0         $$ Bruker NMR JCAMP-DX V2.0
##DATA TYPE= NMR FID
##DATA CLASS= NTUPLES
##ORIGIN= UXNMR, Bruker Analytische Messtechnik GmbH
##OWNER= root
$$ XWIN-NMR		Version 3.5
$$ Wed Nov 10 10:40:08 2021 Russian Standard Time (UT+4h)  she@DPX200
##.OBSERVE FREQUENCY= 200.1313468511
##.OBSERVE NUCLEUS= ^1H
##.DELAY= (6, 6)
##.ACQUISITION MODE= SIMULTANEOUS
##.ACQUISITION SCHEME= undefined
##.AVERAGES= 8
##.DIGITISER RES= 18
##SPECTROMETER/DATA SYSTEM= spect
##.PULSE SEQUENCE= zg30
##.SOLVENT NAME= CDCl3
##.SHIFT REFERENCE= (INTERNAL, CDCl3, 0, 15.7039)
##AUDIT TRAIL= $$ (NUMBER, WHEN, WHO, WHERE, WHAT)
$$ ##TITLE= Audit trail, XWIN-NMR		Version 3.5
$$ ##JCAMPDX= 5.01
$$ ##ORIGIN= Bruker BioSpin GmbH
$$ ##OWNER= she
$$ F:/spectra/data/she/nmr/H-F/1/audita.txt
$$ ##AUDIT TRAIL=  $$ (NUMBER, WHEN, WHO, WHERE, WHAT)
(   1,<2021-11-10 10:38:23.42 +0400>,<she>,<DPX200>,
      <created by zg, POWCHK disabled, PULCHK disabled
       configuration hash MD5:
       00 E9 B6 7A A2 85 ED C7 34 08 36 98 17 FE 4E 26
       data hash MD5: 16K
       49 93 92 11 B4 8A D7 8E AC 90 2D C9 AF DC BE 4C>)
$$ ##END=
$$ 
$$ hash MD5
$$ EC F1 6A 60 CD EC BC 4D 76 30 08 EC A7 72 3B 2A
##$RELAX= 
##$RELAX= 
##$RELAX= 
##$RELAX= 
##$RELAX= 
##$RELAX= 
$$ Bruker specific parameters
$$ --------------------------
##$DU= <F:/spectra>
##$EXPNO= 1
##$NAME= <H-F>
##$PROCNO= 1
##$TYPE= <nmr>
##$USER= <she>
##$AMP= (0..31)
100 100 100 100 100 100 100 100 100 100 100 100 100 100 100 100 100 100 
100 100 100 100 100 100 100 100 100 100 100 100 100 100 
##$AQSEQ= 0
##$AQ_mod= 1
##$AUNM= <au_zg>
##$AUTOPOS= <>
##$BF1= 200.13
##$BF2= 200.13
##$BF3= 200.13
##$BF4= 200.13
##$BF5= 200.13
##$BF6= 200.13
##$BF7= 200.13
##$BF8= 200.13
##$BYTORDA= 1
##$CFDGTYP= 0
##$CFRGTYP= 5
##$CHEMSTR= <none>
##$CNST= (0..31)
1 1 145 1 1 1 1 1 1 1 1 1 1 1 1 1 1 1 1 1 1 1 1 1 1 1 1 1 1 1 1 1 
##$CPDPRG= <>
##$CPDPRG1= <>
##$CPDPRG2= <>
##$CPDPRG3= <>
##$CPDPRG4= <mlev>
##$CPDPRG5= <mlev>
##$CPDPRG6= <mlev>
##$CPDPRG7= <mlev>
##$CPDPRG8= <mlev>
##$CPDPRGB= <>
##$CPDPRGT= <>
##$D= (0..31)
0 1.2 0 0 0 0 0 0 0 0.06 0 0.03 0 0 0 0 0.0002 0 0 0 0 0 0 0 0 0 0 0 0 
0 0 0 
##$DATE= 1636526302
##$DBL= (0..7)
120 120 120 120 120 120 120 120 
##$DBP= (0..7)
150 150 150 150 150 150 150 150 
##$DBP07= 0
##$DBPNAM0= <>
##$DBPNAM1= <>
##$DBPNAM2= <>
##$DBPNAM3= <>
##$DBPNAM4= <>
##$DBPNAM5= <>
##$DBPNAM6= <>
##$DBPNAM7= <>
##$DBPOAL= (0..7)
0.5 0.5 0.5 0.5 0.5 0.5 0.5 0.5 
##$DBPOFFS= (0..7)
0 0 0 0 0 0 0 0 
##$DE= 6
##$DECBNUC= <off>
##$DECIM= 32
##$DECNUC= <off>
##$DECSTAT= 4
##$DIGMOD= 1
##$DIGTYP= 9
##$DL= (0..7)
0 120 120 120 120 120 120 120 
##$DP= (0..7)
150 150 150 150 150 150 150 150 
##$DP07= 0
##$DPNAME0= <>
##$DPNAME1= <>
##$DPNAME2= <>
##$DPNAME3= <>
##$DPNAME4= <>
##$DPNAME5= <>
##$DPNAME6= <>
##$DPNAME7= <>
##$DPOAL= (0..7)
0.5 0.5 0.5 0.5 0.5 0.5 0.5 0.5 
##$DPOFFS= (0..7)
0 0 0 0 0 0 0 0 
##$DQDMODE= 0
##$DR= 18
##$DS= 0
##$DSLIST= <SSSSSSSSSSSSSSS>
$$ [...]
##$SUBNAM2= <"">
##$SUBNAM3= <"">
##$SUBNAM4= <"">
##$SUBNAM5= <"">
##$SUBNAM6= <"">
##$SUBNAM7= <"">
##$SUBNAM8= <"">
##$SUBNAM9= <"">
##$SW= 18.0517286264689
##$SWIBOX= (0..15)
0 0 2 0 0 0 0 0 0 0 0 0 0 0 0 0 
##$SW_h= 3612.71676300578
##$TD= 16384
##$TD0= 1
##$TE= 0
##$TE2= 300
##$TE3= 300
##$TEG= 300
##$TL= (0..7)
0 120 120 120 120 120 120 120 
##$TP= (0..7)
150 150 150 150 150 150 150 150 
##$TP07= 0
##$TPNAME0= <>
##$TPNAME1= <>
##$TPNAME2= <>
##$TPNAME3= <>
##$TPNAME4= <>
##$TPNAME5= <>
##$TPNAME6= <>
##$TPNAME7= <>
##$TPOAL= (0..7)
0.5 0.5 0.5 0.5 0.5 0.5 0.5 0.5 
##$TPOFFS= (0..7)
0 0 0 0 0 0 0 0 
##$TUNHIN= 0
##$TUNHOUT= 0
##$TUNXOUT= 0
##$USERA1= <user>
##$USERA2= <user>
##$USERA3= <user>
##$USERA4= <user>
##$USERA5= <user>
##$V9= 5
##$VALIST= <valist>
##$VCLIST= <CCCCCCCCCCCCCCC>
##$VD= 0
##$VDLIST= <DDDDDDDDDDDDDDD>
##$VPLIST= <PPPPPPPPPPPPPPP>
##$VTLIST= <TTTTTTTTTTTTTTT>
##$WBST= 1024
##$WBSW= 4
##$XGAIN= (0..3)
0 0 0 0 
##$XL= 0
##$YL= 0
##$YMAX_a= 134908
##$YMIN_a= -252509
##$ZGOPTNS= <>
##$ZL1= 120
##$ZL2= 120
##$ZL3= 120
##$ZL4= 120
##$ABSF1= 10
##$ABSF2= 0
##$ABSG= 5
##$ABSL= 3
##$ALPHA= 0
##$AQORDER= 0
##$ASSFAC= 0
##$ASSFACI= 0
##$ASSFACX= 0
##$ASSWID= 0
##$AUNMP= <proc_1d>
##$AZFE= 0.1
##$AZFW= 0.1
##$BCFW= 1
##$BC_mod= 2
##$BYTORDP= 1
##$COROFFS= 0
##$CY= 11.3945322036743
##$DATMOD= 1
##$DC= 2
##$DFILT= <>
##$DTYPP= 0
##$F1P= 2.36226072786647
##$F2P= -0.459571619588291
##$FCOR= 0.5
##$FTSIZE= 0
##$FT_mod= 4
##$GAMMA= 1
##$GB= 0.15
##$INTBC= 1
##$INTSCL= 1
##$ISEN= 128
##$LB= 0.24
##$LEV0= 0
##$LPBIN= 0
##$MAXI= 10000
##$MC2= 0
##$MEAN= 0
##$ME_mod= 0
##$MI= 1.114404
##$NCOEF= 0
##$NC_proc= 0
##$NLEV= 6
##$NOISF1= 3.799351
##$NOISF2= 2.8
##$NSP= 1
##$NTH_PI= 0
##$NZP= 0
##$OFFSET= 15.70392
##$PC= 1
##$PHC0= -15519.43
##$PHC1= 29.00082
##$PH_mod= 1
##$PKNL= yes
##$PPARMOD= 0
##$PSCAL= 0
##$PSIGN= 0
##$REVERSE= no
##$SF= 200.130013532006
##$SI= 16384
##$SIGF1= 3
##$SIGF2= 2
##$SINO= 400
##$SIOLD= 16384
##$SREGLST= <1H.CDCl3>
##$SSB= 0
##$STSI= 0
##$STSR= 0
##$SW_p= 3612.71676300578
##$SYMM= 0
##$S_DEV= 0
##$TDeff= 0
##$TDoff= 0
##$TI= <>
##$TILT= no
##$TM1= 0
##$TM2= 0
##$TOPLEV= 0
##$USERP1= <user>
##$USERP2= <user>
##$USERP3= <user>
##$USERP4= <user>
##$USERP5= <user>
##$WDW= 1
##$XDIM= 8192
##$YMAX_p= 0
##$YMIN_p= 0
$$ End of Bruker specific parameters
$$ ---------------------------------
##NTUPLES= NMR FID
##VAR_NAME=  TIME,          FID/REAL,        FID/IMAG
##SYMBOL=    X,             R,               I
##VAR_TYPE=  INDEPENDENT,   DEPENDENT,       DEPENDENT
##VAR_FORM=  AFFN,          ASDF,            ASDF
##VAR_DIM=   8192,          8192,            8192
##UNITS=     SECONDS,       ARBITRARY UNITS, ARBITRARY UNITS
##FACTOR=    0.0002768,     1,               1
##FIRST=     0,             0,               0
##LAST=      2.2672688,     0,               0
##MIN=       0,             -252509,         0
##MAX=       2.2672688,     134908,          0
$$ Real data points
##PAGE= N=1
##DATA TABLE= (X++(R..R)), XYDATA
$$ [...]
$$ plain form
1868 -244 246 1132 1367 1018 -99 -333 -8 810 1126 709 105 -317 -210 512 1094 1099 514 -86 -371 -55
1888 -55 450 862 635 -377 -430 -252 643 1235 773 137 -324 -285 652 1199 876 390 -325 -535 137 529 1037
1909 1037 578 -693 -925 -505 274 730 184 -738 -903 -881 158 349 166 -391 -1044 -1022 -568 250 404 206
1929 206 -554 -681 -569 48 726 104 -342 -852 -776 19 434 442 -269 -730 -780 -281 244 156 -205 -930 -934 -877 217
1952 217 605 150 -369 -969 -744 114 646 311 -220 -650 -32 225 422 1226 563 -237 -357 -133 498 799
1972 799 499 -51 -205 -65 185 169 636 339 -269 -202 -72 -40 437 455 -22 -244 -113 280 795 586 763
1993 763 -380 -6 438 353 780 530 -129 -54 -20 137 702 264 376 -455 -394 -12 363 31 -125 -325 -651
2014 -651 -436 -58 54 72 -430 -489 -720 -3 474 174 294 -203 -837 32 422 536 111 -339 -918 -526 287
$$ packed form
1868b44M90Q86K35l49j117k34L25Q18L16m17o04m22J07P22N82Nn85o00k85L16
1888e5N05M12k27j012n3J78Q95N92m62o36m61L9R37N47l23m86p15k10O72L92N08
1909A037m59j271k32M20P79M56n46r22j65K2J039J91j83n57o53K2M54Q18J54j98
1929B06p60j27J12O17O78o22m46n10P6P95M15Qp11m61n0M99N25q8l61p25mN7J094
1952B17L88m55n19o00K25Q58N32l35n31m30O18K57J97Q04o63q00j20K24O31L01
1972G99l00n50j54J40K50j6M67k97o08O7J30L2M77J8m77k22J31L93N15k09J77
1993G63j143L74M44q5M27k50o59P5L4J57N65m38J12q31O1L82L75l32j56k00l26
2014f51K15L78J12J8n02n9k31P17M77l00J20m97o34Q69L90J14m25m50n79L92Q13
$$ plain form
2035 287 472 108 -320 -335 -1053 -596 421 -165 -283 -966 -1103 -688 129 320 -49 -743 -474 -576 -43 637
2055 637 256 -373 -529 -486 -265 437 450 166 -561 -740 -143 312 870 372 -618 -374 -244 -174 456 157 -285
2076 -285 -530 -479 216 551 696 454 -505 -628 76 535 868 495 -784 -484 44 174 771 559 185 -142
2096 -142 -160 715 638 635 516 -493 -339 209 727 348 271 -173 -370 -468 320 236 77 -153 -355 -692 147 245
2118 245 427 395 -97 -428 -43 848 875 377 182 -78 -300 617 878 340 -218 -366 -996 -376 306 92 -55
2139 -55 -360 -717 -431 64 531 -40 -425 -209 -328 -257 212 134 -528 -387 -567 -608 -118 573 53 -418 -188
2160 -188 210 -16 372 -10 -405 -402 -496 -89 208 14 -494 -772 -802 -314 -181 -11 133 -613 -657 -687 -55 261
2182 261 209 47 -257 -64 165 464 441 843 16 -328 201 86 465 364 -247 -689 -456 -78 116 -73 34
$$ packed form
2035B87J85l64m28j5p18M57J017n86j18o83j37M15Q17J91l69o94K69j02N33O80
2055F37l81o29j56M3K21P02J3k84p27j79N97M55N58m98r90K44J30P0O30k99m42
2076b85k45N1O95L35J45k42r59j23P04M59L33l73j279L00N28J30N97k12l74l27
2096a42j8Q75p7lj19j009J54N48N18l79p7m44j97r8P88q4j59k30k02l37Q39R8
2118B45J82l2m92l31L85Q91K7m98j95k60k22R17K61n38n58j48o30O20O82k14j47
2139e5l05l57K86M95M67n71l85K16j19P1M69p8o62J41j80m1M90O91n20m71K30
2160a88L98k26L88l82l95Lr4M07K97j94n08k78l0M88J33J70J44p46m4l0O32L16
2182B61n2j62l04J93K29K99k3M02q27l44N29j15L79j01o11m42K33L78J94j89J07
$$ plain form
2203 34 -486 -594 94 466 83 105 -120 -510 -183 539 907 644 496 70 -56 219 757 630 558 -215 -499
2224 -499 55 439 494 217 -250 -55 -81 227 894 187 51 -375 -598 -102 163 181 86 -602 1 -46 514 854
2246 854 338 -40 144 175 144 609 428 203 -363 -215 -141 407 524 329 -500 -951 -356 -146 86 -71 -680
2267 -680 -849 -377 -220 441 88 -106 -372 -394 8 363 397 242 -301 -625 -230 173 292 188 -176 -386 -405
2288 -405 70 321 12 -75 -519 -699 -289 227 106 -93 -417 -621 -142 15 423 90 -54 -318 -157 39
2308 39 441 126 175 115 -120 94 546 611 469 -33 -166 82 271 635 225 172 -384 -267 21 192 259 242
2330 242 -164 -241 10 250 533 400 118 -327 -12 220 609 463 188 142 -239 253 585 468 390 -171 -208
2351 -208 -214 59 426 243 -45 -261 -352 -185 278 204 5 -226 -579 -411 111 141 203 -687 -364 -474 -33 452
$$ packed form
2203C4n20j08O88L72l83K2k25l90L27P22L68k63j48m26j26K75N38j27p2p73k84
2224d99N54L84N5k77m67J95k6L08O67p07j36m26k23M96K65J8r5o88O03m7N60L40
2246H54n16l78J84L1l1M65j81k25n66J48P4N48J17j95q29m51N95K10K32j57o09
2267f80j69M72J57O61l53j94k66k2M02L55L4j55n43l24L95M03J19j04l64k10j9
2288d05M75K51l09q7m44j80M10N16j21j99l24k04M79J57M08l33j44k64J61J96
2308C9M02l15M9o0k35K14M52O5j42n02j33K48J89L64m10n3n56J17K88J71O7j7
2330B42m06p7K51K40K83j33k82m45L15K32L89j46k75m6l81M92L32j17p8n61l7
2351b08oK73L67j83k88k16r1J67M63p4j99k31l53J68N22L0O2q90L23j10M41M85
$$ plain form
2373 452 79 -366 -321 -408 -149 260 328 -78 -246 -319 -216 216 -37 18 -301 -701 -255 -117 -20 229 -606 -724
2395 -724 -601 -176 226 -78 55 -245 -210 -58 242 420 213 -158 -347 -176 -36 641 203 -43 -12 -82 228
2416 228 216 276 -46 -291 -536 -178 153 438 305 -102 -325 -57 147 450 248 115 -115 -397 25 471 672
2437 672 310 -110 8 211 544 731 287 -146 16 110 253 585 30 19 -150 -443 71 73 394 171 -100
2458 -100 -462 -250 27 296 281 -142 -302 -210 -5 403 422 34 -193 -360 302 100 242 352 -10 -341 -82
2479 -82 23 399 -166 -286 -359 -440 -8 203 211 -212 -586 -738 -39 75 -132 -34 -213 -383 -436 -110 460 158
2501 158 -367 -387 -310 -165 531 107 141 -391 -397 -42 -208 222 203 -319 94 -429 -193 181 7 -205 -431 -763
2523 -763 -275 364 254 68 -460 -145 -142 280 278 285 -15 -79 -209 128 316 485 77 -173 -226 -130 254 285 466
$$ packed form
2373D52l73m45M5q7K59M09O8m06j68p3J03M32k53N5l19m00M46J38R7K49q35j18
2395g24J23M25M02l04J33l00L5J52L00J78k07l71j89J71J40O77m38k46L1p0L10
2416B28j2O0l22k45k45L58L31K85j33m07k23K68K04L03k02j33k30k82M22M46K01
2437F72l62m20J18K03L33J87m44m33J62R4J43L32n55j1j69k93N14KL21k23k71
2458a00l62K12K77K69j5m23j60R2K05M08J9l88k27j67O62k02J42J10l62l31K59
2479h2J05L76n65j20p3q1M32K11Qm23l74j52O99J14k07R8j79j70n3L26N70l02
2501A58n25k0P7J45O96m24L4n32oL55j66M30j9n22M13n23K36L74j74k12k26l32
2523g63M88O39j10j86n28L15LM22kPl00o4j30L37J88J69m08k50n3R6L84L1J81
$$ plain form
2546 466 -141 -177 -33 -43 220 -22 -121 -462 -239 -58 280 196 307 114 -243 182 165 322 207 -38 -137 179
2568 179 101 253 307 81 -275 -317 334 403 436 405 -234 -691 -99 185 -6 -45 -223 -293 -468 34 181 109 -354
2591 -354 55 -427 13 662 428 149 135 -92 -21 343 594 3 -70 -12 -406 32 0 74 -113 -284 -532 -307
2613 -307 14 2 -191 -371 -234 66 -88 441 447 116 42 -254 -139 239 428 287 -166 -287 117 -44 346
2634 346 189 -513 -324 -43 51 261 80 -320 -554 -271 105 -45 123 -32 -497 -615 357 69 90 78 -92
2655 -92 -222 174 -94 287 265 362 77 -58 315 180 236 435 -109 -104 40 211 -41 79 -383 -381 -482 85 327
2678 327 160 -27 180 -100 -163 618 149 218 148 -18 175 406 590 303 -73 36 91 112 253 73 -67 -112
2700 -112 -455 -185 -92 -27 50 -65 -110 -57 -37 45 -50 154 -378 -369 -200 -29 69 -353 -403 -248 -388 134 397 250
$$ packed form
2546D66o07l6J44j0K63k42r9l41K23J81L38q4J11j93l57M25j7J57j15k45r9L16
2568A79p8J52N4k26l56m2O51O9L3l1o39m57N92K84j91l9j78p0j75N02J47p2m63
2591c54M09m82M40O49k34k79j4k27P1L64K51n91p3N8l94M38l2P4j87j71k48K25
2613c07L21j2j93j80J37L00j54N29Ol31p4k96J15L78J89j41m53j21M04j61L90
2634C46j57p02J89K81R4K10j81m00k34K83L76j50J68j55m65j18R72k88K1j2j70
2655i2j30L96k68L81k2R7k85j35L73j35N6J99n44NJ44J71k52J20m62Kj01N67K42
2678C27j67j87K07k80o3P81m69O9p0j66J93K31J84k87l76J09N5K1J41j80j40m5
2700a12l43K70R3O5P7j15m5N3K0Q2r5K04n32RJ69J71R8m22n0J55j40N22K63j47
$$ plain form
2724 250 -169 44 19 -41 366 147 -339 -496 -500 -397 -22 95 136 -451 -383 -53 -162 -157 125 -450 -411 49 150
2747 150 142 136 197 -283 29 162 367 176 245 -81 -217 -158 327 127 223 27 -174 -338 -152 447 150 41 80
2770 80 -310 -31 232 93 215 201 -310 -187 -44 319 255 -14 -56 -122 306 436 220 303 186 -53 422 508
2792 508 277 129 -63 -174 25 147 -52 260 19 -133 -138 -202 -100 50 109 -273 -51 -228 -174 147 359 -28
2814 -28 -338 -85 -4 217 310 24 -69 -157 65 245 297 154 -42 -281 102 155 -18 9 -466 -356 -152 -268 -83
2837 -83 120 -284 -286 -383 -260 -63 -15 -118 -114 -70 -190 30 193 215 89 -286 -60 -15 32 -104 -38 25 -385 -255
2861 -255 242 144 19 -194 -246 -182 -299 -263 17 -84 -382 -182 66 303 386 1 66 -243 141 594 235 184
2883 184 -25 -80 177 -18 209 519 36 -27 -54 -156 274 307 15 33 -270 -45 76 -88 128 145 -163 -265
$$ packed form
2724B50m19K13k5o0M07k19m86j57mJ03L75J17M1n87O8L30j09NK82n75L9M60J01
2747A50qoO1m80L12J33K05j91O9l26j36N9M85k00R6j96k01j64J86N99k97j09L9
2770H0l90K79K63j39J22j4n11J23J43L63o4k69m2o6M28J30k16Q3j17k39M75Q6
2792E08k31j48j92j11J99J22j99L12k41j52no4J02J50N9l82K22j77N4L21K12l87
2814b8l10K53Q1K21R3k86r3q8K22J80N2j43j96k39L83N3j73K7m75J10K04j16J85
2837h3K03m04kr7J23J97M8j03MM4j20K20J63K2j26l75K26M5M7j36O6O3m10J30
2861b55M97r8j25k13n2O4j17L6K80j01k98K00K48K37Q3l85O5l09L84M53l59n1
2883A84k09n5K57j95K27L10m83o3k7j02M30L3k92J8l03K25J21j64K16J7l08j02
$$ plain form
2905 -265 -63 651 173 141 -64 -215 -228 145 372 168 -37 -81 74 177 154 76 -10 -155 -303 -60 -26 166
2927 166 13 -187 -381 27 -174 -90 38 -84 -121 -10 -139 438 352 -356 11 73 84 296 242 67 -143 -88
2949 -88 -127 306 183 355 -25 -327 -199 14 331 53 -188 -140 -349 -216 77 217 55 -12 -216 -154 62 -84
2971 -84 204 -124 -290 -3 -18 211 -42 75 22 -92 123 267 75 -37 123 -3 -203 74 106 41 -205 -140
2993 -140 -329 -156 352 340 -22 88 -173 -309 66 363 -139 -115 -61 106 288 208 492 -184 186 172 105 76
3015 76 276 -177 -68 -169 -219 22 162 351 -30 -55 -187 21 53 218 -202 -283 -316 -59 209 35 93 -17
3037 -17 -106 49 259 214 361 -81 -417 18 21 204 200 102 68 -239 -333 29 349 271 -99 -176 -430 -222 67 85
3061 85 -53 15 -118 -22 314 287 153 132 -98 -101 102 91 220 178 -208 -311 181 105 264 134 -271 -129 -132 36
$$ packed form
2905b65K02P14m78l2k05j51j3L73K27k04k05m4J55J03k3p8q6j45j48K43L4J92
2927A66j53k00j94M08k01Q4J28j22l7J11j29N77q6p08L67O2J1K12n4j75k10N5
2949h8l9M33j23J72l80l02J28K13L17k78k41M8k09J33K93J40j62o7k04O2K16j46
2971h4K88l28j66K87j5K29k53J17n3j14K15J44j92j12J60j26k00K77L2o5k46O5
2993a40j89J73N08j2l62J10k61j36L75K97n02K4N4J67J82q0K84o76L70j4o7k9
3015G6K00m53J09j01n0K41J40J89l81k5j32K08L2J65m20q1l3K57K68j74N8j10
3037a7q9J55K10m5J47m42l36M35LJ83mr8l4l07r4L62L20p8l70p7k54K08K89J8
3061H5j38O8j33R6L36k7j34k1k30lK03j1J29m2l86j03M92p6J59j30m05J42lJ68
$$ plain form
3085 36 211 -184 -110 131 -264 -30 92 224 -80 55 -88 -15 207 338 46 -77 -124 -171 -86 55 267 41
3107 41 -139 -31 457 100 254 184 -334 308 104 -100 20 108 -88 2 -27 -5 4 -55 -25 -201 -180 155 -103 183
3131 183 -43 -150 67 30 175 101 246 -136 -195 -25 427 27 131 -12 -331 61 125 -114 132 -243 -356
3152 -356 -227 -14 31 72 -87 317 -310 -13 186 -225 46 227 -13 -45 174 193 73 -164 -2 -254 135
3173 135 -48 98 -67 -18 -219 -505 -129 -81 -22 -284 -563 -159 -154 53 134 -145 -267 -22 -388 178 202 -20
3195 -20 -255 -278 63 -276 195 407 67 -186 -35 283 -50 59 32 -288 90 -110 -107 1 112 -113 -5 259
3217 259 -1 82 -49 235 -109 -135 -180 83 148 50 -59 -127 138 154 244 249 106 -83 101 242 153 377 10 0
3241 0 -65 -41 278 155 65 -46 -182 170 141 209 184 342 199 -2 77 170 361 97 -63 2 121 211 191 355
$$ packed form
3085C6J75l95P4K41l95K34J22J32l04J35j43P3K22J31k92j23m7m7Q5J41K12k26
3107D1j80J08M88l57J54p0n18O42k04k04J20Q8j96R0k9K2Rn9L0j76K1L35k58K86
3131A83k26j07K17l7J45p4J45l82n9J70M52m00J04j43l19L92O4k39K46l75j13
3152c56J29K13M5M1j59M04o27K97J99m11K71J81k40l2K19J9j20k37J62k52L89
3173A35j83J46j65M9k01k86L76M8N9k62k79M04NK07Q1k79j22K45l66N66K4k22
3195b0k35k3L41l39M71K12l40k53J51L18l33J09k7l20L78k00LJ08J11k25J08K64
3217B59k60Q3j31K84l44k6m5K63O5r8j09o8K65J6R0Nj43j89J84J41q9K24l67j0
3241@o5K4L19j23r0j11j36L52k9O8k5J58j43k01P9R3J91k64j60O5J19R0k0J64
$$ plain form
3265 355 74 178 -153 -119 -118 205 -26 -105 -260 -242 93 204 -33 -225 -141 -588 -163 -147 -28 39 -222 -93 -81
3288 -81 97 464 -15 -382 -133 122 -41 205 -98 -289 -50 147 8 235 -127 -59 -152 -81 18 213 -28 -25
3310 -25 -306 -383 -430 67 194 62 -113 -37 -111 47 98 -93 254 -184 -157 62 470 307 -24 -57 88 195 176
3333 176 18 182 -48 -345 -26 -99 -154 123 86 103 -78 -108 282 -42 -54 -273 -25 -113 164 252 -32 52 -63
3356 -63 39 -22 67 223 356 114 -172 -360 409 8 -144 -184 -55 -94 72 -58 -87 -44 -346 -179 -129 40 -75
3379 -75 64 -85 -26 -22 168 191 -128 -251 17 90 61 177 -222 5 -49 20 65 152 109 -82 -194 -98 -428 -162
3403 -162 133 -246 -145 -174 -74 -145 -126 88 -10 -114 -132 -235 -222 346 -32 -220 75 -35 101 123 148 -252 -3
3426 -3 -218 65 247 213 174 -250 -172 -51 -150 -62 -204 -137 -235 -36 164 119 56 -29 -181 -335 133 175 240 270 19
$$ packed form
3265C55k81J04l31L4JL23k31p9j55J8L35J11k37j92Q4m47M25J6J19O7k61J29J2
3288h1J78L67m79l67K49K55j63K46l03j91K39J97j39K27l62O8r3P1R9J95k41L
3310b5k81p7m7M97J27j32j75P6p4J58N1j91L47m38K7K19M08j63l31l3J45J07j9
3333A76j58J64k30k97L19p3n5K77l7J7j81l0L90l24j2k19K48q8K77Q8k84Q4j15
3356f3J02o1Q9J56J33k42k86j88P69m01j52m0J29l9J66j30k9M3l02J67N0J69j15
3379g5J39j49N9MJ90K3l19j23K68P3k9J16l99K27n4O9M5Q7m3j91j12R6l30K66
3403a62K95l79J01k9J00p1J9K14r8j04j8j03J3N68l78j88K95j10J36K2K5m00K49
3426ck15K83J82l4l9m24P8J21r9Q8j42O7r8J99K00m5o3q5j52j54M68M2O5L0k51
$$ plain form
3451 19 -34 -80 209 434 241 -38 65 109 99 302 284 -139 -294 -131 -98 36 184 -116 -122 133 -3 63 126 16
3475 16 280 -31 233 -159 116 64 115 -84 -281 157 247 188 193 53 195 -122 9 -50 -35 -263 -173 -13 -53 100
3499 100 309 -135 -86 -211 -77 -6 88 140 -229 -55 202 89 147 310 4 -157 -23 -37 24 140 -79 -290
3521 -290 19 -59 159 113 259 -148 -332 -285 -263 109 50 -233 29 -349 -16 -71 -42 181 -252 -263 99 -33 38
3544 38 69 -15 95 -124 101 173 -207 -61 -31 12 47 -25 -42 -118 -95 -160 -65 256 167 -156 -213 -175 -77 -132 429 237
3570 237 147 -143 -74 316 159 264 265 -85 -17 -220 44 85 314 -158 -21 -7 -19 -32 224 116 -196 -91 91
3593 91 -161 128 98 -37 -52 -47 134 105 128 -120 31 134 77 -55 318 181 -1 -273 177 93 131 261 42
3616 42 -161 106 -58 -240 -150 -144 -163 -132 76 -290 -95 147 -247 -165 -152 -376 165 107 195 73 -124 -52 50 328
$$ packed form
3451A9n3m6K89K25j93k79J03M4j0K03j8m23j55J63L3J34J48l00oK55j36O6O3j10
3475A6K64l11K64l92K75n2N1j99j97M38R0n9Nj40J42l17J31n9J5k28R0J60m0J53
3499A00K09m44M9j25J34P1R4N2l69J74K57j13N8J63l06j61J34j4O1J16k19k11
3521b90L09p8K18m6J46m07j84M7K2L72n9k83K62l78L33n5K9K23m33j1L62j32P1
3544C8L1q4J10k19K25P2l80J46L0M3L5p2j7p6K3o5R5L21q9l23n7L8R8n5N61j92
3570B37r0k90O9L90j57J05Jl50O8k03K64M1K29m72J37J4j2j3K56j08l12J05J82
3593I1k52K89l0j35j5NJ81k9K3k48J51J03n7j32L73j37j82k72M50q4L8J30k19
3616D2k03K67j64j82R0Oj9L1K08l66J95K42l94Q2J3k24N41n8Q8j22j97P2J02K78
$$ plain form
3640 328 258 55 1 -80 7 283 30 20 -214 -78 -205 291 -73 -239 -186 -210 97 243 172 -41 -28 -1 13 -192
3664 -192 177 179 -145 47 1 109 219 166 117 185 -80 -69 0 340 53 132 121 -186 -20 369 35 -182 -183 -120
3688 -120 136 135 76 96 -412 -204 33 119 243 48 231 -235 41 -203 46 86 -135 -38 -29 -315 214 160 -308
3711 -308 -323 -79 89 88 -10 107 6 104 -86 37 46 12 -60 -198 36 -189 -10 216 158 -14 -89 -130 -168 -165 103
3736 103 82 -159 -178 117 -26 32 -161 8 -97 64 -67 67 50 -287 -121 57 -29 104 -120 -146 -17 -14 -119
3759 -119 -79 120 -160 -105 70 204 94 259 212 62 228 -6 58 56 46 41 -259 -39 -123 123 304 31 200
3782 200 -216 26 245 214 105 -202 -196 -34 149 93 416 270 -166 -108 -91 -123 213 13 224 -89 201 150 96
3805 96 -145 -111 105 -36 32 0 205 349 -205 -91 121 52 60 -161 156 -285 13 -133 26 87 -47 -25 -99
$$ packed form
3640C28p0k03n4q1Q7K76k53j0k34J36j27M96l64j66N3k4L07J46p1k13J3K7J4k05
3664a92L69Kl24J92m6J08J10n3m9O8k65J1O9L40k87P9j1l07J66L89l34k17jO3
3688a20K56jn9K0n08K08K37Q6J24j95J83m66K76k44K49M0k21R7Rk86N29n4m68
3711c08j5K44J68jr8J17j01R8j90J23Rl4p2j38K34k25J79K26n8j72p5m1l8LK68
3736A03k1k41j9K95j43N8j93J69j05J61j31J34j7l37J66J78q6J33k24k6J29Lj05
3759a19M0J99k80N5J75J34j10J65m7j50J66k34O4kj0nl00K20q4K46J81k73J69
3782B00m16K42K19l1j09l07OJ62J83n6L23j46m36N8J7l2L36k00K11l13K90n1n4
3805I6k41L4K16j41O8l2K05J44n54J14K12o9Qk21L17m41K98j46J59O1j34K2p4
$$ plain form
3828 -99 73 252 90 164 110 -241 -160 151 382 271 -89 -286 -203 -2 144 -317 -408 -15 -329 -344 193 -74
3850 -74 -112 31 -261 222 42 -96 -219 38 1 65 -279 39 67 135 -58 29 -59 -7 77 -32 -32 -18 -124 -59 115
3875 115 -27 -74 71 64 -133 -8 246 71 156 -142 128 17 -64 -152 -32 -10 337 109 195 78 7 48 19 274
3899 274 146 46 -75 -159 -279 -178 143 218 186 -224 -127 13 148 54 22 69 -154 -101 115 75 122 -136 -18
3922 -18 12 -48 138 117 -32 -65 -102 -19 -118 66 -26 -238 -264 -167 -139 -10 -6 -103 257 -361 -58 1 94 314 -291 -169
3948 -169 133 -106 79 139 -43 -68 160 -85 -3 -38 144 19 -24 -3 -71 100 333 -83 -57 -322 -40 28 -18
3971 -18 -144 70 -169 -51 -209 -42 61 -39 33 -235 -62 107 -56 -152 81 -40 10 383 143 -106 -59 -233
3993 -233 41 230 118 -125 38 -223 -263 -73 133 -99 150 -424 26 -113 -181 -15 -22 16 -50 -180 -64 228
$$ packed form
3828i9J72J79j62P4n4l51Q1L11K31j11l60j97Q3K01J46m61r1L93l14j5N37k67
3850g4l8J43k92M83j80j38j23K57l7O4l44L18K8O8j93Q7q8N2Q4j09%J4j06O5J74
3875A15j42m7J45pj97J25K54j75Q5k98K70j11q1q8J20K2L47k28Q6j17p1M1k9K55
3899B74j28j00j21q4j20J01L21P5l2m10R7J40J35r4l2M7k23N3K16m0M7k58J18
3922a8L0o0J86k1j49l3l7Q3r9J84r2k12k6R7K8J29Mr7L60o18L03N9R3K20o05J22
3948a69L02k39J85O0j82k5K28k45Q2l5J82j25m3K1o8J71K33m16K6k65K82O8m6
3971a8j26K14k39J18j58J67J03j00P2k68J73J69j63r6K33j21N0L73k40k49M7j74
3993b33K74J89j12k43J63k61m0J90K06k32K49n74M50j39o8J66pL8o6j30J16K92
$$ plain form
4015 228 185 248 15 85 -87 34 130 -32 109 118 -283 -164 -19 -222 29 -176 -97 117 -265 -67 -178 -81 -44
4038 -44 -64 185 47 -38 -115 38 -261 64 176 -146 20 -66 -104 -43 170 149 -71 -18 -107 -138 98 125 43 184
4062 184 -289 -114 -144 -167 -34 175 -162 0 -323 -54 382 -126 38 98 71 73 23 43 71 58 -14 -24 -15 144 252
4087 252 -109 -139 -81 83 -184 -120 -279 -29 -276 192 -1 -37 -72 -282 -366 -47 11 -13 158 -194 36 62 -70
4110 -70 71 -29 164 71 -122 379 -5 106 92 -45 -15 100 172 103 -35 -52 61 163 -60 94 -141 -252
4132 -252 37 -139 11 203 167 112 79 142 48 54 68 -226 -177 -187 -98 135 142 -155 -74 290 -24 -190 -22 -299 -263
4157 -263 31 -69 -148 -18 205 -177 -300 -78 -191 -45 104 57 27 44 56 -49 -126 6 188 -95 -127 70
4179 70 -23 34 142 165 -199 -147 -167 -24 -2 -16 -145 128 -18 -103 -151 121 -41 -150 50 153 -21 -136 128
$$ packed form
4015B28m3O3k33P0j72J21R6j62J41Rm01J19J45k03K51k05P9K14l82J98j11R7L7
4038d4k0K49j38q5p7J53k99L25J12l22J66q6l8O1K13k1k20N3q9l1K36K7q2J41
4062A84m73J75l0k3J33K09l37J62l23K69M36n08J64O0k7Kn0K0K8j3p2j0RJ59J08
4087B52l61l0N8J64k67O4j59K50k47M68j93l6l5k10q4L19N8k4J71l52K30K6j32
4110g0J41j00J93r3j93N01l84J11j4j37L0J15P2o9j38j7J13J02k23J54k35j11
4132b52K89j76J50J92l6n5l3O3r4OJ4k94M9j0Q9K33Pk97Q1L64l14j66J68k77L6
4157b63K94j00p9J30K23l82j23K22j13J46J49m7l0J7J2j05p7J32J82k83l2J97
4179G0r3N7J08K3l64N2k0J43K2j4j29K73j46q5m8K72j62j09K00J03j74j15K64
$$ plain form
4202 128 180 -106 24 164 181 186 -77 -173 -280 136 90 145 34 -175 -90 65 139 155 146 234 -153 14 127 297
4226 297 127 -49 -249 -207 191 121 -28 84 161 -124 -10 -42 224 -98 230 -20 -224 102 223 18 154
4247 154 -466 -98 148 146 -218 -263 109 -136 5 -153 168 -7 112 -13 -72 32 6 -44 8 -110 107 291
4269 291 159 -9 71 29 -134 -40 -25 58 194 -115 32 -111 -134 330 99 29 -11 -397 96 -177 17 -45 -183
4292 -183 64 195 316 80 0 -79 22 62 -130 154 -66 -63 127 -1 10 146 203 217 -180 -47 31 199 114
4315 114 -170 31 -205 -74 59 327 110 -203 -220 61 -3 221 -69 87 -294 119 5 39 202 239 -178
4336 -178 -110 26 90 5 48 -231 -167 32 -130 -36 -85 128 236 137 -39 -15 237 -10 284 -215 -253 -137 -78 103
4360 103 -7 -144 -166 62 21 192 -84 -82 -34 21 207 45 81 -139 -35 -51 12 104 109 25 -106 -138 77 330 23
$$ packed form
4202A28N2k86J30J40J7Nk63r6j07M16m6N5j11k09Q5J55P4J6rQ8l87J67J13J70
4226B97j70j76k00M2L98p0j49J12P7k85J14l2K66l22L28k50k04L26J21k05J36
4247A54o20L68K46kl64m5L72k45J41j58L21j75J19j25n9J04k6n0N2j18K17J84
4269B91j32j68Q0m2j63R4J5Q3J36l09J47j43k3M64k31p0m0l86M93k73J94o2j38
4292a83K47J31J21k36q0p9J01M0j92K84k20LJ90j28J1J36N7J4l97J33P8J68q5
4315A14k84K01k36J31J33K68k17l13j7K81o4K24k90J56l81M13j14L4J63L7m17
4336a78O8J36O4q5M3k79O4J99j62R4m9K13J08r9j76K4K52k47K94m99l8J16N9J81
4360A03j10j37k2K28m1J71k76KM8N5J86j62L6k20J04j6O3R2Nq4j31l2K15K53l07
$$ plain form
4385 23 -113 -32 11 -42 77 -29 59 -169 -48 100 259 208 44 48 -136 63 51 320 225 -3 10 -234 -178 -103
4409 -103 0 224 -247 193 -312 56 -29 208 -206 228 -61 -28 -89 120 280 -363 -119 -90 123 -52 279
4430 279 -176 -5 79 -131 -76 28 48 -127 93 -140 54 194 -45 92 -96 -252 286 -62 233 87 6
4451 6 276 116 -359 376 -92 4 -6 -241 -23 37 214 -135 -63 -121 66 112 323 38 23 59 33 5 -131 -22
4475 -22 -451 -193 -262 -25 127 -116 -192 -20 -2 146 -237 276 92 -57 104 117 201 157 446 -134 -35 -52 129
4498 129 181 163 32 -298 -21 -127 33 197 -89 229 -184 19 -88 218 50 -200 -86 -252 -217 238 16
4519 16 -59 41 89 6 -69 -17 103 278 117 38 130 83 -142 108 96 135 -8 91 -94 -124 17 -73 -117 227 56
4544 56 158 -196 -186 -211 146 123 36 -87 -287 -190 97 3 -68 200 -17 -119 -13 -17 253 -115 19 47 -10 -63
$$ packed form
4385B3j36Q1M3n3J19j06Q8k28J21J48J59n1j64Mj84J99j2K69r5k28J3k44N6P5
4409a03J03K24m71M40n05L68q5K37m14M34k89L3o1K09J60o43K44K9K13j75L31
4430B79m55J71Q4k10N5J04K0j75K20k33J94J40k39J37j88j56N38l48K95j46q1
4451FK70j60m75P35m68R6j0k35K18O0J77l49P2n8J87M6K11k85j5L6k6k8j36J09
4475b2m29K58o9K37J52k43p6J72J8J48l83N13j84j49J61J3Q4m4K89n80R9j7J81
4498A29N2j8j31l30K77j06J60J64k86L18m13K03j07L06j68k50J14j66L5M55k22
4519A6p5J00M8q3p5N2J20J75j61p9R2m7k25K50j2L9j43R9j85l0J41r0m4L44j71
4544E6J02l54J0k5L57k3q7j23k00R7K87r4p1K68k17j02J06mK70l68J34K8n7n3
$$ plain form
4568 -63 35 345 -211 144 12 54 185 -93 179 -32 150 -346 -7 115 31 91 -208 16 -101 207 103 -57
4590 -57 -157 -149 135 -9 114 -12 79 -127 -301 22 182 240 -354 6 -65 -112 80 -89 83 -155 31 80 72
4613 72 -144 8 53 -31 20 1 -53 -115 0 25 51 -97 -124 -81 -94 -152 -96 -366 -92 249 10 40 -111 50 -187
4638 -187 31 188 -204 -89 -100 -99 256 69 65 41 -232 62 141 134 64 -75 -181 175 -33 -29 205 -115 -160 134
4662 134 -99 -190 -23 -97 -89 25 -22 -216 -241 130 -7 -83 46 -246 125 19 83 -99 108 37 204 51 136
4685 136 150 -48 -287 43 84 -122 204 17 -337 -125 -84 -10 4 194 35 -93 130 30 159 -217 -223 -30
4707 -30 -13 167 38 -372 -29 72 104 -41 128 -147 -51 225 64 66 -42 100 73 -211 -153 -134 126 -6 -170
4730 -170 -117 123 -62 -209 361 -78 76 -63 77 97 -22 80 -116 -64 317 65 81 -82 20 -102 -228
$$ packed form
4568f3R8L10n56L55j32M2J31k78K72k11J82m96L39J22q4O0k99K24j17L08j04j60
4590e7j00QK84j44J23j26R1k06j74L23J60N8n94L60p1m7J92j69J72k38J86M9q
4613G2k16J52M5q4N1j9n4o2J15K5K6j48k7M3j3n8N6k70K74L41k39L0j51J61k37
4638a87K18J57l92J15j1JL55j87mk4k73K94P9pp0j39j06L56k08MK34l20m5K94
4662A34k33r1J67p4QJ14m7j94k5L71j37p6J29k92L71j06O4j82K07p1J67j53Q5
4685A36J4j98k39L30M1k06L26j87l54K12M1P4J4J90j59j28K23j00J29l76oJ93
4707c0J7J80j29m10L43J01L2j45J69k75R6K76j61Kj08J42k7k84N8J9K60j32j64
4730a70N3K40j85j47N70m39J54j39J40K0j19J02j96N2L81k52J6j63J02j22j26
$$ plain form
4751 -228 39 116 -152 101 -77 -199 143 249 -243 -116 -211 -59 -68 121 -117 -71 -323 -2 -68 88 21 -26 -188
4774 -188 -152 -260 -209 141 -149 148 -12 -57 -191 102 -49 65 22 -188 -195 -29 106 3 -229 -47 110 -145
4796 -145 -143 196 -70 310 249 16 32 129 165 -56 -208 -62 -11 44 5 149 -48 -74 -114 -67 55 61 -139 -43 -147
4821 -147 -43 -214 -92 102 -123 -190 -279 9 -108 238 162 263 -84 90 -75 198 164 1 -34 27 171 108
4843 108 253 -6 -29 -89 -316 26 66 -1 -1 -322 -37 24 98 102 -22 -41 -40 20 -34 24 -56 -154 108 113 -34 -275 188
4870 188 -8 -258 -33 -161 -3 -7 119 -57 -63 -227 -85 -200 9 -83 -134 76 -355 71 44 -196 -139 -36 73
4893 73 -80 91 -92 1 -88 -116 -9 9 -44 34 17 108 129 106 -53 5 -175 -98 56 79 -139 60 6 13 87 -229
4919 -229 -199 132 106 -76 -237 96 54 47 -176 -399 62 28 154 306 68 150 121 180 -40 -34 12 146 60 314
$$ packed form
4751b28K67P7k68K53j78j22L42J06m92J27r5J52rJ89k38M6k52L21o6J56o7m7j62
4774a88L6j08N1L50k90K97j60m5j34K93j51J14m3k10pJ66J35j03k32J82J57k55
4796a45KL39k66L80o1k33J6R7L6k21j52J46N1N5l9J44j97k6m0M7J22Ok00R6j04
4821a47J04j71J22J94k25o7q9K88j17L46p6J01l47J74j65K73l4j63l5O1J44o3
4843A08J45k59k3o0k27L42M0o7%l21K85O1P4Mj24j9JO0n4N8q0r8K62Nj47k41M63
4870A88j96k50K25j28J58mJ26j76oj64J42j15K09r2n1K10m31M26k7k40N7J03J09
4893G3j53J71j83R3q9k8J07J8n3P8j7R1K1k3j59N8j80P7J54K3k18J99n4PP4l16
4919b29L0L31k6j82j61L33m2pk23k23M61l4J26J52k38Q2k9N9k20OM6J34q6K54
$$ plain form
4943 314 56 -245 -32 86 -75 79 -64 -135 -102 -233 -111 -228 -152 -76 -81 94 -64 -5 26 102 138 84 115 -314
4967 -314 -19 -92 -102 -109 216 -43 51 -69 79 241 14 117 142 -95 25 35 -51 95 -22 148 -89 -276 -52
4990 -52 14 -43 41 -87 74 209 87 -62 -148 -115 318 -104 -139 -85 -163 9 -32 -125 -192 -62 -175 -275 -97 97
5014 97 87 -160 -118 -69 61 -35 123 27 -14 -126 86 97 263 27 132 117 19 -1 -411 101 -76 5 -214 -83
5038 -83 -18 76 -164 38 -163 -24 163 57 265 -53 -211 -332 73 -116 196 144 72 129 -89 193 -108 77
5060 77 -80 -117 130 -135 120 34 186 -193 -9 -2 89 54 229 89 138 60 87 159 88 -155 11 -82 73 -293
5084 -293 88 2 8 27 167 -67 -37 36 -47 362 -41 194 250 230 -102 286 81 -199 39 95 41 176 32 -168
5108 -168 -1 -110 -43 124 41 75 -195 -172 145 -44 -179 58 85 -25 281 -55 116 206 67 18 -125 20
$$ packed form
4943C14k58l01K13J18j61J54j43p1L3j31J22j17P6P6nJ75j58N9L1P6L6n4L1m29
4967c14K95p3j0pL25k59R4j20J48J62k27J03K5k37J20J0q6J46j17J70k37j87K24
4990e2O6n7Q4j28J61J35j22j49q6L3M33m22l5N4p8J72m1r3o7J30j13j00J78J94
5014I7j0k47M2M9J30r6J58r6m1j12K12J1J66k36J05j5r8k0m10N12j77Q1k19J31
5038h3O5R4k40K02k01J39J87j06K08l18j58j21M05j89L12n2p2N7k18K82l01J85
5060G7j57l7K47k65K55q6J52l79J84PR1l5J75j40M9p8K7P2p1k43J66r3J55l66
5084b93L81q6OJ9J40k34L0P3q3M09m03K35N6k0l32L88k05k80K38N6n4J35j44k00
5108a68J67j09O7J67q3L4k70K3L17j89j35K37K7j10L06l36J71R0j39m9j43J45
$$ plain form
5130 20 -116 -97 -2 -147 106 139 -1 -145 -147 120 -6 -197 -25 59 94 -258 26 288 -75 -108 -6 -258 23
5153 23 111 72 -254 -16 -147 -1 80 -56 -65 -94 -117 -60 88 -283 168 -84 -174 -176 -154 -80 -151 -49 -59 -178 -122 182
5179 182 -35 11 -220 30 -239 -218 168 151 -119 -56 -42 -108 -1 -75 -134 -12 -137 -7 187 -123 308 -104 -264
5202 -264 -204 126 129 219 -130 -71 118 -183 26 -93 -121 -14 18 147 36 50 52 163 -143 84 208 -55 45
5225 45 0 -68 -156 102 125 -100 31 -193 -142 -64 -6 128 284 57 29 -182 -107 251 -126 -161 -211 188 -48 132
5249 132 138 -23 132 -2 -384 6 178 -44 -120 -55 -18 50 9 -135 -62 74 42 -293 -227 -35 -46 33 49 7 -45
5274 -45 159 125 148 157 -162 -37 -172 155 407 122 129 18 -49 127 -63 -82 -77 156 -39 -223 108 25 -59 166
5298 166 -33 -97 102 -41 86 -364 79 -205 -23 63 -130 76 -2 -53 73 17 354 275 59 93 132 122 147
$$ packed form
5130B0j36J9R5j45K53L3j40j44kK67j26j91J72Q4L5l52K84K62l63l3J02k52K81
5153B3Q8l9l26K38j31J46Q1j36rk9k3N7J48l71M51k52r0kK2P4p1J02j0j19N6L04
5179A82k17M6k31K50k69K1L86j7k70O3J4o6J07p4n9J22j25J30J94l10M31m12j60
5202b64O0L30LR0l49N9J89l01K09j19k8J07L2J29j11J4KJ11l06K27J24k63J00
5225D5m5o8q8K58K3k25J31k24N1P8N8J34J56k27k8k11P5L58l77l5n0L99k36J80
5249A32Oj61J55j34l82L90J72k22p6O5L7O8m1j44P3J36l2l35O6J92j1P9J6m2n2
5274d5K04l4K3Rl19J25j35L27K52k85Pj11o7J76j90j9NK33j95j84L31q3q4K25
5298A66j99o4J99j43J27m50M43k84J82Q6j93K06p8n1J26n6L37p9k16L4L9j0K5
$$ plain form
5321 147 93 -228 -306 138 -157 -62 9 -139 -14 -79 140 5 72 185 48 -17 152 228 -103 94 -101 35 -250
5344 -250 -42 -89 7 -134 -198 -187 -128 143 -11 93 33 -40 -131 31 83 305 180 95 -25 -288 -184 -201 67 116
5368 116 -56 -121 134 56 -34 -12 -128 222 12 -54 148 14 -117 100 -131 -44 51 -129 -192 -13 -198 114 127
5391 127 -42 -126 83 -188 236 144 -1 -142 -17 -2 224 -65 -17 315 -81 66 41 138 -41 153 -133 -125 -243
5414 -243 -32 198 -241 -140 52 -77 -203 208 48 133 123 -187 -337 -101 78 -51 -349 -146 84 -97 61
5435 61 84 -81 131 8 -179 -254 -69 242 34 -24 -114 237 -250 -135 96 85 59 -133 14 -101 -178 -88 47
5458 47 66 61 267 -29 -103 -93 -138 -88 33 131 -74 14 58 62 24 -136 22 -95 -174 22 -70 -23 23 28 -183 94 101
5485 101 27 111 8 87 -265 -214 -82 -204 267 -78 -38 86 -5 27 -121 -164 -98 -42 -94 -19 -281 -47 -279 25
$$ packed form
5321A47n4l21p8M44k95R5P1j48J25o5K19j35O7J13j37o5J69P6l31J97j95J36k85
5344b50K08m7R6j41o4J1N9K71j54J04o0p3r1J62N2K22j25q5j20k63J04j7K68M9
5368A16j72o5K55p8r0K2j16L50k10o6K02j34j31K17k31Q7R5j80o3J79j85L12J3
5391A27j69q4K09k71M24r2j45j41J25J5K26k89M8L32l96J47k5R7j79J94k86Qj18
5414b43K11K30m39J01J92j29j26M11j60Q5j0l10j50K36J79j29k98K03K30j81J58
5435F1K3j65K12j23j87p5J85L11k08n8r0L51m87J15K31j1k6j92J47j15p7R0J35
5458D7J9nK06k96p4J0m5N0J21R8k05Q8M4Ml8j60J58j17p9J96r2M7M6Nk11K77P
5485A01p4Q4j03P9l52N1J32j22M71l45M0J24r1L2j48m3O6N6n2P5k62K34k32L04
$$ plain form
5509 25 -93 43 10 -144 -33 -224 75 -4 32 55 -195 65 107 81 142 -54 -40 -35 -121 12 -94 -321 -25 177
5533 177 176 40 123 9 -108 -95 -7 -216 -81 -331 -46 219 -10 -102 -89 110 -1 130 -21 -17 -68 -118 -90 -285
5557 -285 23 -107 174 -228 37 10 137 62 -19 -22 -107 132 -207 19 -13 32 -86 73 34 -252 174 191 -158
5580 -158 227 175 35 -170 -202 -62 75 247 85 63 -253 -49 -156 188 115 49 31 -4 -13 -155 10 4 196 -136
5604 -136 237 23 54 -29 185 -135 -55 -56 26 6 -22 -103 -188 17 136 -60 -86 -64 -49 275 -118 -97 52 -28 98
5629 98 -219 62 78 -36 -121 100 -175 209 -113 51 113 -54 -279 53 24 22 -131 -168 101 131 -30 -122 -29 87
5653 87 7 139 -131 -153 96 85 -104 -105 -182 -160 -31 -242 -227 2 17 103 -128 109 62 188 146 -23 100 -59
5677 -59 81 -31 -208 -104 107 86 -50 -15 -150 -59 146 157 140 -84 194 -11 -69 60 -123 -89 -80 81 163 -43
$$ packed form
5509B5j18J36l3j54J11j91K99p9L6K3k50K60M2k6O1j96J4Nq6J33j06k27K96K02
5533A77jj36Q3j14j17J3Q8k09J35k50K85K65k29r2J3J99j11J31j51Mn1n0K8j95
5557b85L08j30K81m02K65k7J27p5q1lq5K39l39K26l2M5j18J59l9k86M26J7l49
5580a58L85n2j40k05l2J40J37J72j62k2l16K04j07L44p3o6j8l5rj42J65oJ92l32
5604a36L73k14L1q3K14l20Q0jQ2k0k8q1q5K05J19j96k6K2J5L24l93K1J49q0J26
5629I8l17K81J6j14q5K21k75L84l22J64O2j67k25L32k9kj53l7K69L0j61r2R3J16
5653H7q0J32k70k2K49j1j89jp7K2J29k11J5K29J5Q6k31K37m7J26m2j69J23j59
5677e9J40j12j77J04K11k1j36L5j35R1K05J1j7k24K78k05n8J29j83L4RJ61Q2k06
$$ plain form
5701 -43 -31 206 17 17 117 123 178 70 -8 79 30 128 -92 -23 -104 -63 82 -163 88 -38 -87 42 -95 12 -74
5726 -74 -75 43 116 45 -204 19 -11 -73 66 15 20 -128 -359 218 41 -59 -203 -138 81 83 1 -17 -186 -171 21
5751 21 -24 91 -191 -311 -69 23 89 80 -111 -91 -200 -189 -55 275 -12 -140 -37 97 -234 -44 50 70 -118
5774 -118 -146 78 -123 305 -101 128 29 22 208 21 61 46 -99 -84 -196 -84 52 -301 35 84 -18 39 -19
5797 -19 29 -96 -154 -301 82 171 104 -129 84 22 -33 149 143 -31 22 127 -100 -85 179 -376 188 -157 150 194
5821 194 -3 -94 -111 27 13 -96 46 -58 90 270 161 13 78 -349 16 12 -42 54 -56 389 107 -170 -123
5844 -123 115 -82 111 309 14 47 96 12 48 59 -293 23 224 -55 -90 -161 21 -105 115 -182 -64 -162 -180
5867 -180 -112 -44 -242 -58 78 -18 134 8 -87 166 61 63 253 194 -111 89 -94 1 187 -10 -85 -117 84
$$ packed form
5701d3J2K37j89%J00ON5j08p8Q7m9R8k20O9q1M1J45k45K51j26m9J29j37J07q6
5726g4jJ18P3p1k49K23l0o2J39n1Nj48k31N77j77j00j44O5K19Kq2j8j69J5J92
5751B1m5J15k82j20K42R2O6rj91K0j09J1J34L30k87j28J03J34l31J90R4K0j88
5774a18k8K24k01M28m06K29r9pJ86j87M0j5j45J5j12J12J36l53L36M9j02N7n8
5797a9M8j25n8j47L83Q9o7k33K13o2n5J82oj74N3J05k27J5K64n55N64l45L07M4
5821A94j97r1j7J38j4j09J42j04J48J80j09j48O5m27L65mn4R6j10M45k82k77M7
5844a23K38j97J93J98k95L3M9q4L6J1l52L16K01k79l5p1J82j26K20k97J18r8j8
5867a80O8O8j98J84J36r6J52j26r5K53j05KJ90n9l05K00j83R5J86j97p5l2K01
$$ plain form
5890 84 -202 226 -145 80 -166 -6 31 109 33 -233 -146 -71 135 -11 -292 101 -9 92 45 -126 -213 206 137
5913 137 43 208 2 60 -14 -52 -250 -62 -115 -11 119 -33 186 -5 -226 -98 4 115 -109 -85 -161 -22
5935 -22 -43 90 196 -120 53 39 -61 105 234 147 -106 103 4 -78 102 224 -105 23 64 118 87 132 -51
5958 -51 -10 -51 -33 114 -112 -213 -107 -24 115 -8 84 17 -197 1 -26 307 -153 69 -131 63 -215 -9 148
5981 148 -26 21 -116 2 -52 -137 89 -91 -320 -13 -155 -175 -298 -190 -116 -90 -37 -7 55 118 162 44 64 -184
6005 -184 -174 -39 491 100 -136 -80 -58 -118 43 112 -56 -279 -148 44 -56 22 -243 -149 -288 42 94 -74 158
6028 158 -134 -8 -135 36 -32 123 91 -139 -130 59 -35 163 -30 97 99 -219 -43 -286 -239 -109 -120 -64 149
6051 149 -80 -26 -202 140 -136 -99 89 83 -198 72 -10 -167 -20 121 -205 45 9 -96 127 -101 246 240 -185
$$ packed form
5890H4k86M28l71K25k46J60L7P8p6k66Q7P5K06j46k81L93j10J01m7j71q7M19o9
5913A37r4J65k06N8p4l8j98J88n3J04J30j52K19j91k21J28J02J11k24K4p6J39
5935b2k1J33J06l16J73j4j00J66J29q7k53K09r9q2J80J22l29J28M1N4l1M5j83
5958e1M1m1J8J47k26j01J06Q3J39j23R2o7k14J98k7L33m60K22k00J94k78K06J57
5981A48j74M7j37J18n4q5K26j80k29L07j42k0j23J08P4K6N3L0O2O3M4j18K0k48
6005a84J0J35N30l91k36N6K2o0J61O9j68k23J31J92j00P8k65R4j39L30N2j68K32
6028A58k92J26j27J71o8J55l2k30RJ89r4J98j93J27Kl18J76k43M7J30j1N6K13
6051A49k29N4j76L42k76L7J88ok81K70q2j57J47J41l26K50l6j05K23k28L47om25
$$ plain form
6074 -185 -151 241 -19 124 -176 -178 42 -140 153 -90 28 -21 -48 -137 35 -13 5 -89 280 26 51 105 -29 -107
6098 -107 -73 -304 -122 -90 72 223 22 80 -143 134 -187 -109 -114 56 -259 -218 -110 76 -257 -119 -34 -59 40
6121 40 66 49 135 -213 172 -245 -95 58 44 -43 61 -80 48 191 -50 -62 48 -38 23 35 77 32 -79 19
6145 19 -24 -79 46 40 -160 -292 -145 1 205 298 170 35 121 275 9 80 29 27 -93 119 -38 -95 -37 -27 -163
6170 -163 33 -12 -220 -26 -198 -145 -287 105 118 176 -126 25 -54 153 30 221 -59 -34 65 -64 25 -210 -135
6193 -135 155 107 -2 155 -160 130 179 127 -240 139 -44 138 -15 -20 22 -188 -11 169 -378 45 6 17 -140
6216 -140 -162 -51 -125 -58 -136 -157 12 -19 -76 138 37 41 42 39 -23 -9 78 181 -45 154 179 -100 125 -6 -70 151
6242 151 -36 -53 21 -126 104 12 83 -104 -10 -156 50 -42 -247 149 189 -148 87 -141 -19 -119 -174 -26 -47
$$ packed form
6074a85L4L92k60J43l00kK20j82K93k43J18m9k7q9J72m8J8r4L69k54K5N4j34p8
6098a07L4k31J82L2J62J51k01N8k23K77l21P8nJ70l15M1J08J86l33J38Q5k5R9
6121D0K6j7Q6l48L85m17J50J53j4q7J04j41J28J43k41j2J10q6O1J2M2m5j11R8
6145A9m3n5J25ok00j32J47J46K04R3j28j35Q6J54k66P1n1kj20K12j57n7N8J0j36
6170a63J96m5k08J94j72N3j42L92J3N8l02J51p9K07j23J91k80K5R9j29Q9k35P5
6193a35K90m8j09J57l15K90M9n2l67L79j83J82j53nM2k10J77J80n47M23l9J1j57
6216a40k2J11p4O7p8k1J69l1n7K14j01MJlo2J4Q7J03k26J99K5k79K25j31o4K21
6242A51j87j7P4j47K30r2P1j87R4j46K06r2k05L96M0l37K35k28J22j00n5J48k1
$$ plain form
6265 -47 -182 7 171 119 -85 73 -86 40 19 13 -125 -73 33 -365 -125 -56 -100 -22 -159 43 -69 40 38 68
6289 68 32 -250 63 66 93 -23 9 101 -18 -205 -67 152 -8 153 -291 41 -121 -93 5 -19 -144 -103 135 -64
6313 -64 45 -193 -159 42 -291 50 -54 144 67 80 -78 42 -89 -200 79 -44 -30 14 -17 20 -262 -3 -75
6336 -75 -15 0 -129 204 -64 51 -139 106 -64 -280 165 77 116 240 103 -18 -189 -238 177 -153 -212 -290 174
6359 174 61 91 112 73 51 54 -132 122 227 64 -17 -65 14 -4 52 -193 -91 272 35 41 -51 286 219 -61 223
6384 223 1 -35 37 -24 46 -115 53 111 92 -45 -272 100 -143 -189 30 -298 61 90 -114 -44 377 101 -317
6407 -317 -394 -19 -66 -120 -59 47 -4 17 -77 109 98 107 60 -69 85 174 80 -6 70 -121 -21 -96 -202 46 285
6432 285 332 94 -57 29 284 -114 -21 20 -260 -81 -186 -48 164 64 192 128 -225 -102 140 70 168 239 128
$$ packed form
6265d7j35J89J64n2k04J58j59J26k1oj38N2J06l98K40O9m4P8j37K02j12J09kL0
6289F8l6k82L13LK7j16L2R2j19j87J38K19j60J61m44L32j62K8R8k4j25M1K38j99
6313f4J09k38L4K01l33L41j04J98p7J3j58J20j31j11K79j23J4M4l1L7k82K59p2
6336g5O0J5j29L33k68J15j90K45j70k16M45q8L9J24j37j21j71m9M15l30n9p8M64
6359A74j13L0K1l9k2Lj86K54J05j63q1m8P9j8N6k45J02L63k37Or2L37o7k80K84
6384B23k22l6P2o1P0j61J68N8j9j37k27L72k43m6K19l28L59K9k04P0M21k76m18
6407c17p7L75m7n4O1J06n1K1r4J86j1Rm7j29J54Q9r4q6P6j91J00p5j06K48K39
6432B85M7k38j51Q6K55l98R3M1k80J79j05J38K12j00J28o4l53J23K42p0R8P1j11
$$ plain form
6455 128 -43 -18 202 -49 21 274 -87 135 -98 -175 -106 -116 35 -271 -9 60 -78 129 -108 118 188 6
6477 6 -139 19 -30 61 -163 120 -200 -81 216 -177 -42 -250 -8 -6 168 98 -19 -82 -152 2 36 145 -4
6500 -4 -219 -102 -102 82 122 11 393 -100 -157 304 34 110 -85 -203 94 266 95 295 -203 -1 -28 65 -158
6523 -158 -87 315 -175 -222 145 201 -12 -31 91 -5 73 -64 -235 -102 -172 50 122 -162 279 -45 68 113 115 22
6547 22 -178 149 183 -84 8 -115 -106 184 -44 -5 47 26 44 -60 112 148 100 -127 -170 -16 34 -65 -57 112 172 55
6573 55 -141 50 -83 -84 76 96 -16 -14 292 -126 -159 178 259 -133 108 -202 42 -158 -114 21 -197 54 -167
6596 -167 114 241 -141 128 27 173 -337 -108 161 21 2 -40 29 -21 -121 76 -137 -155 -30 215 64 -193
6618 -193 13 88 -222 118 -2 -59 189 87 40 110 -40 -91 186 107 13 -14 90 85 -95 33 -41 -155 83 -27
$$ packed form
6455A28j71K5K20k51P0K53l61K22k33p7O9j0J51l06K62O9j38K07k37K26P0j82
6477Fj45J58m9R1k24K83l20J19K97l93J35k08K42KJ74p0j17o3p0J54L4J09j49
6500dk15J17%J84M0j11L82m93n7M61k70P6j95j18K97J72j71K00m98K02k7R3k23
6523a58P1M02m90m7L67N6k13j9J22r6P8j37j71J33p0K22P2k84M41l24J13M5Kr3
6547B2k00L27L4k67R2j23RK90k28L9N2k1J8j04J72L6m8k27m3J54N0r9QJ69O0j17
6573E5j96J91j33jJ60K0j12KL06m18l3L37Q1l92K41l10K44k00M4J35k18K51k21
6596a67K81J27l82K69j01J46n10K29K69j40j9m2O9n0j00J97k13j8J25K45j51k57
6618a93K06P5l10L40j20n7K48j02m7P0j50n1K77p9r4k7J04nj80J28p4j14K38j10
$$ plain form
6642 -27 58 -155 101 -26 -150 -103 -50 -12 179 -74 -154 108 -37 -43 -85 180 -27 -74 63 285 8 -120 181
6665 181 -139 195 103 -134 -188 -125 -139 -180 113 -31 -41 -257 -21 22 -208 -51 16 -70 -137 -123 -78 274 -51 -61
6689 -61 -297 -122 -151 305 -24 -141 61 -188 20 8 -131 118 -87 -12 -34 -104 203 -104 -167 -16 -183 1
6711 1 226 30 25 -56 313 -31 -143 -33 181 -95 -141 8 243 -20 52 35 45 127 186 257 12 88 -147 25
6735 25 -40 -205 -63 -11 45 -65 -96 194 145 -46 51 32 324 -6 -240 -54 -102 52 287 -325 -138 356 -10
6758 -10 -77 107 46 129 400 331 132 -54 5 48 -110 184 -5 -9 123 -13 -268 5 136 101 100 -108 94 57
6782 57 1 -71 193 -60 143 -215 -30 -34 32 61 29 -47 283 -11 -44 100 88 133 5 -146 104 -145 -89 -18 106
6807 106 -6 61 -12 7 -70 -56 -124 -144 -69 39 -14 194 55 143 227 94 -134 41 -69 -88 -151 -219 231 -53 -12
$$ packed form
6642b7Q5k13K56j27j24M7N3L8J91k53q0K62j45om2K65k07m7J37K22k77j28L01
6665A81l20L34r2k37n4O3j4m1K93j44j0k16K36M3k30J57O7q6o7J4M5L52l25j0
6689f1k36J75k9M56l29j17K02k49K08j2j39K49k05P5k2p0L07l07o3J51j67J84
6711AK25j96nq1L69l44j12J10K14k76m6J49K35k63P2j7J0Q2N9P1k45P6k35J72
6735B5o5j65J42N2N6j10l1K90m9j91R7j9K92l30k34J86m8J54K35o12J87M94l66
6758a0o7J84o1Q3K71o9j99j86N9M3j58K94j89mJ32j36k55K73J31l5jk08K02l7
6782E7n6p2K64k53K03l58J85mO6K9l2p6L30k94l3J44j2M5j28j51K50k49N6P1J24
6807A06j12O7p3J9p7J4o8k0P5J08n3K08j39Q8Q4j33k28J75j10j9o3o8M50k84M1
$$ plain form
6832 -12 -229 -123 72 154 186 69 3 -132 -98 -147 164 -36 -35 28 -83 -70 -129 -38 129 136 -135 -97 -33 119 134 -289
6858 -289 182 353 -72 -26 -72 9 182 151 190 169 -102 -82 63 165 360 57 -27 53 -53 -180 168 196 -113
6881 -113 77 -98 -98 67 66 64 -78 -11 55 -35 241 -70 92 142 143 41 295 53 -29 -236 24 -199 -6 -5 -117
6906 -117 -77 -198 -268 21 13 40 -132 -188 126 -138 5 111 -43 -103 28 -61 62 -27 -335 -191 -39 -77 -134 -150
6930 -150 -126 -273 43 -122 -168 -136 76 44 -218 -90 4 77 42 21 -155 40 50 -37 -7 -57 40 -109 -80 110 67
6955 67 74 -3 42 -149 -86 294 -7 -107 -38 169 -179 213 -7 100 126 -50 54 195 -150 14 -230 -250 17
6978 17 -87 46 139 114 247 2 91 -148 111 43 107 40 43 -1 -267 103 231 129 -168 181 -59 451 151
7001 151 -99 -63 -153 -218 24 -123 -37 359 -68 -27 -53 30 -37 -135 230 -54 -42 94 -131 -296 -91 124 -139
$$ packed form
6832a2k17J06J95Q2L2j17o6j35L4m9L11k00JO3j11J3n9R1J67Pk71L8O4J52J5m23
6858b89M71J71m25M6m6Q1J73l1L9k1k71K0J45J02J95l03q4Q0j06j27L48K8l09
6881a13J90j75%J65jkj42O7O6r0K76l11J62N0Jj02K54k42q2k07K60k23J93Jj12
6906a17M0j21p0K89qK7j72n6L14k64J43J06j54o0J31q9J23q9l08J44J52l8n7j6
6930a50K4j47L16j65m6L2K12l2k62J28R4P3l5k1j76J95J0q7L0n0R7j49K9J90m3
6955F7Pp7M5j91O3L80l01j00O9K07l48L92k20J07K6j76J04J41l45J64k44k0K67
6978A7j04J33R3k5J33k45Q9k39K59o8O4o7Lm4k66L70J28j02k97L49k40N10l00
7001A51k50L6r0o5K42j47Q6L96m27M1k6Q3o7r8L65k84J2J36k25j65K05K15k63
$$ plain form
7024 -139 73 165 15 44 -59 94 196 17 151 -85 -152 -115 -248 -30 -129 -93 -252 -65 203 -259 100 -118
7046 -118 188 81 -40 95 110 161 121 83 -104 153 -22 81 -137 -82 6 3 82 -27 -268 -84 -39 -105 55 -87
7070 -87 28 156 57 -159 176 138 70 114 178 -43 -118 52 -123 247 -195 29 102 189 140 -70 40 -30 -106 -189
7094 -189 -60 -64 -361 50 6 -133 -160 278 37 71 -41 -2 -200 -206 55 95 108 -141 16 -162 177 22 -66 55
7118 55 -181 -25 34 -41 -144 -49 18 -190 52 285 126 -147 69 96 -49 -45 -111 -115 163 -133 16 -133 -6 96
7142 96 61 70 80 339 -109 -17 -42 -311 -30 -62 221 70 244 -166 -104 -21 -165 0 -110 1 -203 -108 4 -91
7166 -91 124 -111 9 -222 -320 -296 -95 -48 60 -139 45 185 49 163 116 137 -3 -153 -134 85 -159 -28
7188 -28 57 -44 -149 -13 -214 185 49 -11 195 -139 -137 -161 251 -3 87 -166 152 -166 -189 -156 84 -145 -4
$$ packed form
7024a39K12R2j50K9j03J53J02j79J34k36o7L7j33K18r9L6j59J87K68m62L59k18
7046a18L06j07j21J35J5N1m0l8j87K57j75J03k18N5Q8lP9j09k41J84M5o6J60j42
7070h7J15J28r9k16L35l8o8M4O4k21p5J70j75L70m42K24P3Q7m9k10J10p0p6q3
7094a89J29mk97M11m4j39k7M38k41L4j12L9j98oK61M0J3k49J57j78L39j55q8J21
7118E5k36J56N9p5j03R5O7k08K42K33j59k73K16K7j45Mo6mK78k96J49j49J27J02
7142I6l5RJ0K59m48R2k5k69K81l2K83j51J74m10O2Q3j44J65j10J11k04R5J12r5
7166i1K15k35J20k31r8K4K01M7J08j99J84J40j36J14m7K1j40j50J9K19k44J31
7188b8Q5j01j05J36k01L99j36o0K06l34Kk4M12k54R0k53L18l18k3L3K40k29J41
$$ plain form
7211 -4 -1 -258 -84 -113 49 91 1 94 -157 66 -32 17 13 100 -41 -135 -10 -181 -162 -116 38 -80 -12 -64 49 15
7237 15 280 -118 3 -15 -33 30 76 -118 -56 -141 -23 222 -173 -139 -270 -194 281 -36 68 148 -115 -377 116
7260 116 -120 293 -101 -95 124 -27 354 172 204 366 251 -92 187 -78 -178 -107 163 -38 -129 28 367 -251
7282 -251 -306 11 75 212 119 117 114 -31 -1 -100 39 71 -407 49 -50 -138 307 110 154 -72 23 -42 16 62 178 -197
7308 -197 -92 18 83 -134 19 106 -119 91 122 252 31 294 38 -97 -11 206 51 207 -133 191 -155
7329 -155 -278 -105 -253 279 -113 -156 71 80 329 -163 -240 202 131 71 7 -88 -163 -83 76 -135 62 -383 -94
7352 -94 -176 -88 145 -60 -135 110 79 220 319 161 145 29 116 61 -216 -62 127 182 -31 81 -39 -166 -171 150
7376 150 -114 -217 -256 -131 165 16 30 -61 40 -30 20 6 -61 84 2 47 -19 68 -65 -218 63 102 260 -29
$$ packed form
7211dLk57J74k9J62M2r0R3k51K23r8M9mQ7j41r4J25j71J9M6J54j18O8n2J13l4
7237A5K65l98J21j8j8O3M6j94O2q5J18K45l95L4j31P6M75l17J04Q0k63k62M93
7260A16k36M13l94OK19j51L81j82L2J62j15l43K79k65j00P1K70k01r1J57L39o18
7282b51n5L17O4J37r3klj45L0r9J39L2m78M56r9q8M45j97M4k26R5o5N8M6J16l75
7308a97J05J10O5k17J53Q7k25K10L1J30k21K63k56j35Q6K17j55J56l40L24l46
7329a55j23J73j48N32l92m3K27RK49m92p7M42p1o0o4r5p5Q0J59k11J97m45K89
7352i4q2Q8K33k05p5K45l1J41R9j58j6j16Q7n5k77J54J89N5k13J12j20j27nL21
7376A50k64j03l9J25K96j49J4r1J01p0N0j4o7J45q2M5o6Q7j33j53K81L9J58k89
$$ plain form
7400 -29 -229 -48 -84 -81 -341 -21 87 50 20 198 -291 170 -33 151 11 5 60 28 141 106 -43 144 227 -5
7424 -5 -23 55 -3 196 140 -268 46 158 58 -120 193 -192 -86 -30 -44 126 182 -1 -15 -178 -35 142 -92
7447 -92 -426 40 -13 -233 157 368 232 239 -16 128 91 -127 282 136 -77 102 -117 -94 -70 102 20 61 -67
7470 -67 5 -88 -75 -199 -278 -144 -1 93 -175 20 -253 6 -83 -170 147 277 -76 -41 -87 23 -104 39 107 -56
7494 -56 43 -153 -87 -67 -2 29 -87 24 -149 118 -75 3 42 162 -199 94 78 -233 -74 -43 -139 116 -50 134
7518 134 -55 -58 -355 -86 175 -145 -202 41 -184 -119 77 39 113 -86 -285 202 83 44 -106 -16 -110 129 53
7541 53 305 -31 -23 24 -186 294 13 -207 209 338 -45 -300 -2 -6 41 -165 -91 194 145 33 -23 52 32 -25
7565 -25 -49 -151 -183 -111 -117 -208 206 70 -94 278 -69 -112 162 120 27 41 26 97 196 205 97 162 120 -19 -47 112
$$ packed form
7400b9k00J81l6Lk60L20J08l7l0J78m89M61k03J84j40oN5l2J13l5j49J87Q3k32
7424ej8P8n8J99n6m08L14J12j00j78L13l85J06N6j4J70N6j83j4j63J43J77k34
7447i2l34M66n3k20L90K11j36Pk55J44l7k18M09j46k13J79k19K3K4J72q2M1j28
7470f7P2r3J3j24p9J34J43R4k68J95k73K59q9q7L17J30l53L5m6J10j27J43O8j63
7494e6R9j96O6K0O5L1j16J11j73K67j93P8L9J20l61K93j6l11J59L1r6K55j66J84
7518A34j89lk97K69K61l20n7K43k25O5J96l8P4j99j99M87j19l9j50R0r4K39p6
7541E3K52l36QM7k10M80k81k20M16J29l83k55K98mM7k06P4K85m9j12n6P5k0n7
7565b5k4j02l2P2or1M14j36j64L72l47m3K74m2r3J4j5P1R9Rj08O5m2j39k8J59
$$ plain form
7591 112 67 389 -87 21 -186 240 -98 -41 -66 -46 52 -50 61 -21 87 -243 -101 262 12 72 48 -267 -197
7614 -197 90 176 106 -52 73 19 55 -123 194 -47 -196 -101 -103 -12 -34 61 -101 -81 -81 -130 104 34 -5 45 -14 78
7640 78 52 -119 -24 35 36 -119 -122 -162 134 -110 -303 45 -157 -84 -1 -169 66 260 -17 -119 -82 96 -129 -244
7664 -244 -37 -54 118 208 327 -112 -169 69 -160 67 60 69 -130 0 -44 118 184 70 -73 -91 49 246 -259
7687 -259 380 94 -18 15 215 -148 145 133 14 -200 -19 -37 16 96 28 137 -143 -152 -39 297 -59 434 -64
7710 -64 19 168 162 49 246 129 -13 161 370 236 82 66 -183 117 97 114 -76 -166 -53 -44 -166 208 48
7733 48 144 -227 -243 73 -377 -194 -95 -54 -133 63 272 205 216 152 105 161 12 -132 39 -16 -4 -193 -49 192
7757 192 128 77 -202 -396 -41 177 -246 -118 -30 103 -117 -69 -8 -59 50 110 -2 140 -108 -113 -164 68 104 -20
$$ packed form
7591A12m5L22m76J08k07M26l38N7k5K0R8j02J11q2J08l30J42L63k50O0k4l15P0
7614a97K87Q6p0j58J25n4L6j78L17k41j49R5kR1k2R5j62K0%m9K34p0l9N0n9R2
7640G8k6j71R5N9Jj55lm0K96k44j93L48k02P3Q3j68K35J94k77j02L7J78k25j15
7664b44K07j7J72R0J19m39n7K38k29K27pRj99J30m4J62O6j14j43j8J40J97n05
7687b59O39k86j12L3K00l63K93j2j19k14J81j8N3Q0o8J09k80rJ13L36l56M93m98
7710f4Q3J49oj13J97j17j42J74K09j34j54j6k49L00k0J7j90r0J13Rj22L74j60
7733D8R6l71j6L16m50J83R9M1p9J96K09o7J1o4m7N6j49j44J71n5J2j89J44K41
7757A92o4n1k79j94L55K18m23J28Q8J33k20M8O1n1J09O0j12J42k48nn1K32L6j24
$$ plain form
7781 -20 152 -148 -115 321 64 -8 -98 42 -12 -111 -59 -349 82 -39 -97 -224 97 63 -30 59 -37 -8 231 55
7805 55 -224 243 -50 -32 63 -85 111 20 19 75 -99 -156 -223 111 -118 -98 -117 -91 -94 99 -82 62 -58 -73 108
7830 108 -92 42 111 -127 106 71 68 -13 192 5 205 -185 -208 166 -214 290 212 63 -130 180 -152 32
7852 32 -50 233 0 -58 166 172 178 -42 -148 -83 76 -28 277 246 -184 -162 -38 -17 38 -101 196 -52 -30 351
7876 351 207 -234 124 117 -115 -55 121 -18 -144 -164 -122 0 291 -126 110 100 -60 -218 -160 -145 -167 77 -170
7899 -170 -50 181 -5 0 18 40 68 -147 -53 -228 -283 -52 179 -226 -164 -164 0 -80 47 -155 -168 -76 -146 -11 -69
7924 -69 257 316 164 -127 -204 -133 217 41 -39 3 13 -7 -142 -55 292 -116 84 -34 -29 -170 53 -172 -119 222
7948 222 49 355 -83 -156 -90 48 -25 -23 -71 -78 -52 147 -19 191 139 51 133 -43 -55 -216 133 45 160 17 42
$$ packed form
7781b0J72l00L3M36k57p2r0J40n4r9N2k90M31j21n8j27L21l4r3Q9r6K9K39j76
7805E5k79M67k93J8R5j48J96r1jN6j74n7o7L34k29K0j9K6lJ93j81J44j20j5J81
7830A08k00J34O9k38K33l5lq1K05j87K00l90k3L74l80N04p8j49j93L10l32J84
7852C2q2K83k33n8K24OOk20j06O5J59j04L05l1m30K2J24K1N5j39K97k48K2L81
7876C51j44m41L58pk32O0J76j39j26k0M2J22K91m17K36j0j60j58N8J5k2K44k47
7899a70J20K31j86NJ8K2K8k15R4j75n5K31K31m05O2%J64q0J27k02j3R2p0J35n8
7924f9L26N9j52k91p7P1L50j76q0M2J0k0j35Q7L47m08K00j18Nj41K23k25N3L41
7948B22j73L06m38p3O6J38p3Km8pK6J99j66K10n2q8Q2j76j2j61L49q8J15j43K5
$$ plain form
7973 42 6 96 123 -48 -218 -148 15 63 34 -81 -233 164 -106 33 26 -211 194 -69 191 -18 97 -67 -42
7996 -42 10 328 57 48 -84 -84 72 -90 -110 -213 104 57 -146 -16 -95 -26 -158 214 -227 -57 -89 142 -33 -117
8020 -117 -24 -82 28 -46 298 44 124 62 60 0 41 24 85 208 136 -130 -11 65 146 2 -201 -62 -205 163 101
8045 101 74 117 56 -190 -137 -7 145 -45 -40 -76 58 11 171 -102 139 126 -100 126 191 190 -128 -212 233 -94
8069 -94 -143 -180 50 -127 0 181 270 -7 -81 6 122 -36 -13 -321 -54 156 -50 154 -123 55 -79 92
8091 92 -285 -75 86 -164 61 70 175 124 -36 -109 -83 -135 -256 -235 40 29 54 -41 128 -155 -29 -146 -46 125
8115 125 -152 -60 -10 155 62 288 246 189 39 -1 -43 -21 -12 64 376 -150 -71 253 -9 -3 -10 -39 36 -25 -6 -63 -83
8142 -83 -40 -7 -424 -177 40 -12 -60 38 -44 344 -53 -224 69 -165 210 177 -11 121 -28 47 80 24 -100 -271
$$ packed form
7973D2l6R0K7j71j70P0J63M8k9j15j52L97k70J39pk37M05k63K60k09J15j64K5
7996d2N2L18k71rj32%J56j62k0j03L17m7k03J30p9O9j32L72m41J70l2K31j75q4
8020a17R3n8J10p4L44k54Q0o2ko0M1j7O1J23p2k66J19P6Q1j44k03J39j43L68o2
8045A01k7M3o1k46N3J30J52j90Nl6J34m7J60k73K41j3k26K26O5jl18q4M45l27
8069i4m9l7K30j77J27J81Q9k77p4Q7J16j58K3l08K67K10k06K04k77J78j34J71
8091I2l77K10J61k50K25RJ05n1j60p3K6n2j21K1K75j1K5r5J69k83J26j17J00J71
8115A25k77R2N0J65r3K26m2n7j50m0m2K2RP6L12n26P9L24k62Opk9P5o1J9n7k0
8142h3M3L3m17K47K17n2m8R8q2L88l97j71K93k34L75l3j88J32j49P5L3n6j24j71
$$ plain form
8166 -271 -141 1 33 -106 -245 121 94 143 10 297 -57 -121 39 2 253 55 -65 42 43 -118 93 -59
8188 -59 -52 101 -94
$$ packed form
8166b71J30J42L2j39j39L66k7M9j33K87l54o4J60l7K51j98j20J07Jj61K11j52
8188e9PJ53j95
8191i4
$$ Imaginary data points
##PAGE= N=2
##DATA TABLE= (X++(I..I)), XYDATA
$$ plain form
0 0 0 0 0 0 0 0 0 0 0 0 0 0 0 0 2 -8 8 -8 8 -8 16 -16 16 -24 24 -32 32 -40 47 -54 59 -68 78 -87 98 -110
36 -110 123 -138 153 -172 192 -212 234 -261 287 -318 350 -385 425 -468 517 -568 626 -692 765
55 765 -849 943 -1054 1182 -1336 1524 -1757 2055 -2452 3012 -3858 5275 -8091 15820 -82811
70 -82811 -252509 -49431 125239 112078 37651 17338 -10276 -11766 39444 68247 12936 -20542
82 -20542 -11314 -22253 -45052 3607 98115 91656 -42295 -84148 23802 81575 17916 -27089
94 -27089 -11559 -19467 -31904 33914 80303 27294 793 47759 53449 14680 23290 62566 38555
107 38555 -16515 -6524 25280 10270 3331 40686 60228 11004 -30912 23524 81329 42736
119 42736 -3009 7183 2268 -24773 -4394 36294 7133 -39123 -11660 15023 -8480 2412
$$ packed form
0@%%%%%%%%%%%%%%Kj0J6j6J6j6K4l2L2m0M8n6O4p2Q7j01J13j27J46j65J85k08
36a10K33k61K91l25L64m04M46m95N48o05O68p35Q10q93R85j085J194j318J457
55G65j614J792j997K236k518K860l281L812m507N464o870R133j3366K3911r8631
70h2811j69698K03078J74670j3161p4427k0313k7614j490N1210K8803n5311l3478
82b0542R228j0939k2799M8659R4508o459j33951m1853J07950N7773o3659m5005
94b7089J5530p908j2437O5818M6389n3009k6501M6966N690l8769Q610L9276k4011
107C8555n5070R991L1804j5010o939L7355J9542m9224m1916N4436N7805l8593
119D2736m5745J0192m915k7041K0379M0688k9161m6256K7463K6683k3503J0892
$$ plain form
131 2412 46546 34743 -26459 -37368 18212 41081 6116 -7956 3706 -4389 -13589 15059 46858
144 46858 14727 -35020 -19573 8365 -7227 -17840 -9012 -23683 -46634 -22661 14163 -12809
156 -12809 -44495 -4667 28980 -5045 -36448 -10672 25039 13593 -15205 -12365 -2238 -2931 -926
169 -926 -1947 -11998 -12657 6510 9218 -34585 -45663 17924 48996 -6671 -54325 -26635 22141
182 22141 26169 8173 -4136 -22230 -20038 9772 21814 5765 -5532 630 -1437 -20110 -5661
195 -5661 39627 38204 -12712 -38777 -9384 27661 28022 16041 4229 -20302 -19786 20995 44117
208 44117 23161 -5284 -8600 -3769 -3977 13680 30084 6499 -24437 -21846 2116 15414 14058
221 14058 16493 10543 -15921 -20933 10601 32318 18301 -8537 -18313 -14597 -7973 14303 27607
$$ packed form
131B412M4134j1803o1202j0909N5580K2869l4965j4072J1662q095r200K8648L1799
144D6858l2131m9747J5447K7938j5592j0613Q828j4671k2951K3973L6824k6972
156a2809l1686L9828L3647l4025l1403K5776L5711j1446k8798K840J0127o93K005
169i26j021j0051o59J9167K708m3803j1078O3587L1072n5667m7654K7690M8776
182B2141M028j7996j2309j8094K192K9810J2042j6049j1297O162k067j8673J4449
195e661M5288j423n0916k6065K9393L7045L61j1981j1812k4531N16M0781K3122
208D4117k0956k8445l316M831k08J7657J6404k3585l0936K591K3962J3298j356
221A4058K435n950k6464n012L1534K1717j4017k6838r776L716O624K2276J3304
$$ plain form
234 27607 4428 -19743 -15971 -264 8743 12582 15837 -375 -30748 -27324 4801 20497 8993
247 8993 -10717 -20223 -21385 -12686 13452 23566 -1861 -28087 -30331 -12950 6353 13162 5155
260 5155 -20541 -38307 -16527 15868 18289 253 -12919 -12907 -11895 -6787 12666 17948 -4171 -22397
274 -22397 -21738 -6424 10106 13909 2233 -21240 -28340 -2991 17081 9256 -6631 -11890 -6569
287 -6569 -5080 -3881 6979 9800 -2101 -9366 -7407 653 9133 13356 10961 -2284 -8091 6746
301 6746 15746 10170 4952 2479 988 -2274 151 9961 9498 2598 1620 527 1448 5103 8646 11579
317 11579 4104 -3718 -463 3029 5165 8629 8144 4078 -1437 2494 13532 12712 8851 9714 5460
332 5460 -477 -363 5796 10999 6154 -1417 -3788 -5005 1154 10581 10500 3212 -6882 -8428 -518 3447
$$ packed form
234B7607k3179k4171L772J5707R007L839L255j6212l0373L424L2125J5696j1504
247H993j9710r506j162Q699K6138J0114k5427k6226k244J7381J9303O809q007
260E155k5696j7766K1780L2395K421j8036j3172J2J012N108J9453N282k2119j8226
274b2397O59J5314J6530L803j1676k3473p100K5349K0072p825j5887n259N321
287f569J489J199J0860K821j1901p265J959Q060Q480M223k395j3245n807J4837
301F746R000n576n218k473j491l262K425R810m63o900r78j093R21L655L543K933
317A1579p475p822L255L492K136L464m85m066n515L931J1038q20l861Q63m254
332E460n937J14O159N203m845p571k371j217O159R427q1p288j0094j546P910L965
$$ plain form
348 3447 4065 2557 -7152 -14656 -11605 924 11302 6008 -3762 -8954 -10819 -2532 9304 9013 -1835
363 -1835 -15405 -17909 -7788 2279 8245 2645 -12975 -19078 -12089 2433 11041 2159 -12153 -20466
377 -20466 -19053 -6833 4615 3705 -8281 -22349 -22184 -8122 3864 8811 89 -17056 -21609 -10540
391 -10540 4910 12023 3835 -8806 -16711 -13026 3852 14150 9982 -2919 -15928 -14647 -277
404 -277 10596 11395 -677 -15004 -17708 -7600 7736 12573 2081 -9553 -15461 -10451 7696 19112
418 19112 13042 322 -7997 -2272 11371 21002 20157 5972 -5843 -4585 2927 14240 17875 7754
432 7754 -2946 -5534 1205 14036 20262 13679 -205 -8165 -1356 7851 11695 10629 720 -6371
446 -6371 -1207 7398 14645 16061 10435 2461 -1690 3573 10890 10407 7069 358 -5362 130 8877
$$ packed form
348C447O18j508r709p504L051J2529J0378n294r770n192j865Q287J1836k91j0848
363a835j3570k504J0121J0067N966n600j5620o103O989J4522Q608q882j4312q313
377b0466J413J2220J1448r10j1986j4068J65J4062J1986M947q722j7145m553J1069
391a0540J5450P113q188j2641p905L685J6878J0298m168j2901j3009J281J4370
404b77J0873P99j2072j4327k704J0108J5336M837j0492j1634n908N010J8147J1416
418A9112o070j2720q319N725J3643R631q45j4185j1815J258P512J1313L635j0121
432G754j0700k588O739J2831O226o583j3884p960O809R207L844j066r909p091
446f371N164Q605P247J416n626p974m151N263P317m83l338o711n720N492Q747
$$ plain form
461 8877 12139 12968 7806 1376 -572 2947 6297 2187 -3890 -8845 -14614 -12028 -3488 -1585 -1000 -98
477 -98 -2675 -3052 1418 6083 6325 783 -3451 -7308 -6221 590 1403 -1165 -98 -1302 -2656 547
493 547 422 -1430 -3085 -5710 -12739 -17913 -11746 -4898 -5512 -5701 -6658 -8358 -1348 6465 7494 5465
509 5465 111 -5545 -8131 -3881 2645 1901 -3052 -7858 -11090 -1971 11561 11951 4451 -2678 -6916
524 -6916 -3497 4891 8588 1667 -8341 -9619 -5833 1240 12047 10834 132 -4674 -4213 2078 9456
539 9456 9058 701 -8242 -8357 -1602 6318 14017 10508 -303 -1767 3413 8162 13997 12743 1036
554 1036 -9993 -9828 -1615 4357 5386 978 -10059 -12588 -2935 6596 11360 6877 -5570 -10949 -5542
569 -5542 3583 9680 8026 -1157 -12846 -12065 3321 11895 7980 -465 -12389 -15214 -3253 6863
$$ packed form
461H877L262Q29n162o430j948L519L350m110o077m955n769K586Q540J903N85R02
477i8k577l77M470M665K42n542m234l857J087O811Q13k568J067j204j354L203
493E47j25j852j655k625p029n174O167O848o14j89r57j700P010P813J029k029
509E465n354n656k586M250O526p44m953m806l232R119J3532L90p500p129m238
524f916L419Q388L697o921j0008j278L786P073J0807j213j0702m806M61O291P378
539I456l98q357q943j15O755P920P699l509j0811j464N180M749N835j254j1707
554A036j1029J65Q213N972J029m408j1037k529R653R531M764m483j2447n379N407
569e542R125O097j654r183j1689P81J5386Q574l915q445j1924k825J1961J0116
$$ plain form
583 6863 4182 -5724 -13022 -12630 -7618 1399 6429 2044 -4397 -10343 -10197 1490 10259 4737 -6136
598 -6136 -13868 -11781 -1564 5334 2367 -8068 -10553 -5404 -3774 -969 3748 1844 -3450 -7100 -6569
613 -6569 254 7255 7321 -1612 -9276 -5076 2655 6879 5337 -1879 -5628 -1157 374 752 4212 4572
629 4572 393 -3667 -2137 2294 4886 7399 3857 -3926 -2329 3958 6511 6608 3897 984 1094 1800
645 1800 3363 5271 6417 4312 -694 -686 3478 4985 7919 8103 1402 -1562 2277 5939 6114 3857
661 3857 1455 -1997 -3518 835 3311 2966 2881 -800 -3384 -372 3521 5567 4731 -44 -2795 -1652
677 -1652 2316 3602 1573 2503 629 -3592 -2168 1161 3485 4295 -9 -6865 -8185 -2640 3980 2338
693 2338 -3514 -7300 -7742 -3512 1121 2049 1877 -1786 -8421 -7925 -828 6170 6212 -2418 -10053 -9980 -30
$$ packed form
583F863k681r906p298L92N012R017N030m385o441n946J46J1687Q769n522j0873
598f136p732K087J0217O898k967j0435k485N149J630K805M717j904n294l650N31
613f569O823P001O6q933p664M200P731M224j542p216l749M471J531L78L460L60
629D572m179m060J530M431K592K513l542p783J597O287K553R7k711k913J10P06
645A800J563J908J146k105n006QM164J507K934J84o701k964L839L662J75k257
661C857k402l452j521M353K476l45q5l681k584L012L893K046q36m775k751J143
677a652L968J286k029R30j874m221J424L329K324Q10m304o856j320N545O620j642
693B338n852l786m42M230M633R28j72l663o635M96P097O998M2q630p635P3R950
$$ plain form
710 -30 10309 6245 -4911 -8936 -6777 -324 4503 3660 -337 -5726 -8844 -5868 369 6018 3579
725 3579 -6140 -11318 -8082 1121 8657 4562 -4911 -7749 -3922 2672 6353 4694 1149 -3810 -5017
740 -5017 -1130 2398 6139 4857 -2373 -6610 -3486 3323 8560 5389 -1524 -5736 -4979 1245 5171
755 5171 4761 1098 -4568 -5544 -136 4536 7320 5399 -955 -5073 -3361 3528 8453 4877 -1309 -5135
771 -5135 -3683 3120 7613 7146 2735 -2567 -2389 1801 5262 6447 3042 -3015 -5087 -3446 2757 6421
787 6421 2608 -2278 -4121 -2122 3188 5092 2605 -279 -3013 -2015 270 1733 3771 2323 -970
802 -970 -2067 -1146 2767 5370 2427 -943 -2638 -1873 975 1147 236 -556 -1791 -1734 -2368 -2085 1183 2239
820 2239 -654 -3563 -4497 -1550 1211 861 -577 -2921 -3655 -1607 -989 533 1257 -229 -2044 -3299
$$ packed form
710c0J0339m064j1156m025K159O453M827q43l997n389l118K976O237N649k439
725C579r719n178L236R203P536m095r473k838L827O594L681j659l545m959j207
740e017L887L528L741j282p230m237L124O809N237l171o913m212P57O224L926
755E171m10l663n666r76N408M672K784j921o354m118J712O889M925l576o186l826
771e135J452O803M493m67m411n302J78M190L461J185l405o057k072J641O203L664
787F421l813m886j843J999N310J904k487k884k734R98K285J463K038j448l293
802i70j097R21L913K603k943l370j695P65K848J72r11p92j235N7o34K83L268J056
820B239k893k909r34K947K761l50j438k344p34K048O18J522P24j486j815j255
$$ plain form
836 -3299 -2368 1935 3551 1441 -2323 -4647 -2021 918 1939 1257 -2400 -5112 -3858 -1577 1146 1750
852 1750 -605 -2937 -4543 -3005 1264 2923 1191 -2535 -5085 -2716 1161 3733 4319 326 -2910
867 -2910 -1747 1793 5156 5229 1521 -2162 -4326 -1967 3271 4069 1845 -1841 -4694 -2514 1853 5320
883 5320 4897 -428 -4123 -3362 469 4455 4442 765 -2581 -4190 -214 5723 6817 3815 -291 -2741
899 -2741 -534 3211 5728 4218 -2092 -5096 -3514 256 4125 4358 75 -3076 -4549 -466 4418
914 4418 4463 812 -3918 -5653 -2919 745 3488 2344 -2603 -4348 -2065 1662 4695 3890 240 -4124
930 -4124 -5283 -973 2620 1781 -482 -4332 -5443 -1701 1677 3918 1974 -2691 -4551 -3524 -481
945 -481 1098 69 -2718 -5644 -5726 -396 2549 1260 170 -1502 -2020 -464 1639 2944 760 -2126
$$ packed form
836c299R31M303J616k110l764k324K626K939J021o82l657k712J254K281K723O04
852A750k355k332j606J538M269J659j732l726k550K369L877K572N86l993l236
867b910J163L540L363P3l708l683k164K359N238P98k224l686k853K180M367L467
883E320m23n325l695P61L831L986j3l677l346j609L976N937J094l002m106k450
899b741K207L745K517j510o310l004J582L770L869K33m283l151j473M083M884
914D418M5l651m730j735K734L664K743j144m947j745K283L727L033q05l650m364
930d124j159M310L593q39k263l850j111L742L378K241j944m665j860J027L043
945d81J579j029k787k926q2N330K945j289j090j672n18J556K103J305k184k886
$$ plain form
961 -2126 -2548 -2253 -238 2606 2080 1 -1800 -1950 1373 2561 1206 -93 -865 -1801 -2031 -632 2397
978 2397 1916 -122 139 -494 520 3815 4199 1500 -879 -1217 421 1174 1474 1693 861 433 18 927
996 927 3828 3546 2253 1134 -533 -302 1924 3548 2416 -896 -1442 334 -244 1464 3080 779
1012 779 -1316 -1632 -1224 1107 1676 1672 -557 -2757 -2056 800 3179 3008 -610 -2186 -897 -288 1819
1029 1819 3347 1058 -2691 -3368 -1374 346 730 1517 -1562 -5305 -3802 -63 1569 1131 -1727 -3976
1045 -3976 -2859 -1376 870 1808 24 -2876 -4390 -2045 887 1508 1899 -639 -4866 -3430 1529 3342
1061 3342 1805 -896 -2926 -3670 -1377 2616 2774 -296 -2870 -4248 -2412 1675 3071 1493 -2107
1076 -2107 -5557 -3011 2092 4275 1377 -2425 -2394 -1408 692 4391 3726 -122 -1250 -700 469 2613
$$ packed form
961b126m22K95K015K844n26k079j801j50L323J188j355j299p72r36k30J399L029
978B397m81k038K61o33J014L295L84k699k379l38J638P53L00K19q32m28m15R09
996I27K901k82j293j119j667K31K226J624j132l312n46J776n78J708J616k301
1012G79k095l16M08K331N69mk229k200P01K856K379j71l618j576J289O09K107
1029A819J528k289l749o77J994J720L84P87l079l743J503L739J632m38k858k249
1045c976J117J483K246R38j784k900j514K345K932O21L91k538m227J436M959J813
1061C342j537k701k030p44K293L993J58l070k574j378J836M087J396j578l600
1076b107l450K546N103K183k898l802L1R86K100L699o65l848j128N50J169K144
$$ plain form
1092 2613 4070 2629 -1304 -2753 -384 2142 3548 1426 -1746 -1737 -773 25 2419 2451 -343 -1486 -840
1109 -840 349 1180 3005 2990 -1006 -2535 152 2412 3238 2905 521 -1520 -1286 1374 3275 2828 469
1126 469 -1291 -1627 482 1297 1485 1639 -1495 -3238 -677 944 1150 250 -249 -2110 -2481 523 2342
1143 2342 157 -588 -347 -1014 -45 729 895 1062 -138 -1134 -829 -13 873 203 292 -497 -2471 -1354 855
1162 855 294 -376 -59 -1801 -2368 -1235 1270 1043 -1233 -1874 -1942 -1861 763 1483 -195 -1229 -2063 -652
1180 -652 585 1178 1035 178 -1078 -1807 -637 2116 2225 -447 -1303 -1334 -1428 455 1660 609 -1499 -2342
1198 -2342 -1561 -443 302 1733 -273 -2484 -2760 -1298 1530 2574 376 -1294 -1408 -933 1763 3612
1214 3612 2385 -730 -2399 -422 1114 1934 2816 638 -2384 -1899 435 2436 2566 807 -1047 -2355
$$ packed form
1092B613J457j441l933j449K369K526J406k122l172RR64P98K394L2k794j143O46
1109h40J189Q31J825j5l996j529K687K260Q26l33k384k041K34K660J901m47k359
1126D69j760l36K109Q15J88J54l134j743K561J621K06r00m99j861l71L004J819
1143B342k185p45K41o67R69P74J66J67j200r96L05Q16Q86o70Q9p89j974J117K209
1162H55n61o70L17j742n67J133K505k27k276o41o8Q1K624P20j678j034q34J411
1180f52J237N93j43q57j256p29J170K753J09k672q56l1r4J883J205j051k108q43
1198b342P81J118P45J431k006k211k76J462K828J044k198j670j14M75K696J849
1214C612j227l115j669J977J536Q20Q82k178l022M85K334K001J30j759j854j308
$$ plain form
1230 -2355 -1426 1369 2495 1274 -1181 -2956 -974 1317 2475 2490 210 -1813 -1460 1309 2969 2181
1246 2181 1055 -229 -1938 -681 2514 3456 1815 -775 -2088 -875 1412 2486 1438 -1024 -2601
1261 -2601 -2133 32 1909 1027 -492 -1193 -2164 -1269 1505 2530 785 -1431 -1767 -471 602 2140
1277 2140 1782 -602 -2037 -899 337 1589 1173 -349 -1615 -2355 -1072 794 1036 -263 -2248 -2441
1293 -2441 -1634 -890 420 182 -1571 -2180 -1688 -269 1061 571 -119 -1192 -1582 -415 1126 1200 528 -600
1311 -600 -1025 -614 378 1188 1159 -312 -913 -1083 -412 167 372 46 -576 -1637 -930 345 613 740 -146
1330 -146 -899 -744 -100 1298 1585 203 101 -128 231 844 1621 2212 1015 -333 -79 736 1572 2062 653
1349 653 -294 -1154 -558 1404 1842 759 -95 -1021 -677 322 1156 1728 470 -1136 -1317 -183 1605 2346
$$ packed form
1230b355R29K795J126j221k455j775J982K291J158J5k280k023L53K769J660p88
1246B181j126j284j709J257L195R42j641k590j313J213K287J074j048k462j577
1261b601M68K165J877q82j519p01r71Q95K774J025j745k216l36J296J073J538
1277B140l58k384j435J138J236J252m16j522j266p40J283J866K42j299j985j93
1293b441Q07P44J310k38j753o09M92J419J330m90o90j073l90J167J541P4o72j128
1311f00m25M11R92Q10k9j471o01j70O71N79K05l26o22j061P07J275K68J27q86
1330a46p53J55O44J398K87j382j02k29L59O13P77N91j197j348K54Q15Q36M90j409
1349F53r47q60N96J962M38j083q54r26L44R99Q34N72j258j606j81J134J788P41
$$ plain form
1367 2346 835 -866 -1582 -330 1775 1799 822 -257 -1464 -1199 274 1462 1511 -36 -1823 -1909 -1068
1384 -1068 797 1276 -133 -1901 -3048 -1742 415 883 326 -1273 -2410 -1898 -433 1201 1198 -384 -2121
1401 -2121 -1616 -554 764 1668 334 -1269 -2089 -834 1094 949 529 -1409 -2440 -1392 -230 1067
1417 1067 818 -871 -2290 -1777 -785 1245 1491 -50 -1366 -2105 -637 1635 1793 1043 -458 -1272 -378
1434 -378 1132 2062 2129 402 -763 -793 638 2210 2163 656 -375 -959 429 1785 1897 1216 -351 -1064
1452 -1064 -3 1014 1360 1288 0 -490 -300 412 1865 1758 536 -44 -284 774 1466 1686 1308 276
1470 276 -185 417 527 1628 1277 104 -770 -726 -407 441 691 336 -976 -1508 -682 -33 487 746 -632
1489 -632 -1363 -799 -397 328 710 399 -544 -1127 -358 302 306 375 -298 -1320 -1088 -281 -125 564 -171 -1458
$$ packed form
1367B346j511j701p16J252K105K4r77j079j207K65J473J188M9j547j787q6Q41
1384a068J865M79j409j768j147J306K157M68n57j599j137N12J465J634lj582j737
1401b121N05J062J318R04j334j603q20J255J928j45m20j938j031J048J162J297
1417A067k49j689j419N13R92K030K46j541j316p39J468K272J58p50j501q14Q94
1434c78J510R30O7j727j165l0J431J572m7j507j031n84J388J356J12o81j567p13
1452a064J061J017L46p2j288m90J90P12J453j07j222n80k40J058O92K20l78j032
1470B76m61O02J10J101l51j173q74M4L19Q48K50l55j312n32Q26O49N20K59j378
1489f32p31N64M02P25L82l11r43n83P69O60MO9o73j022K32Q07J56O89p35j287
$$ plain form
1509 -1458 -1758 -1034 -378 331 -124 -822 -2146 -1482 -519 -228 8 -317 -1510 -1640 -491 431 845 255 -844
1528 -844 -1796 -916 546 1026 693 -32 -1698 -1038 617 1073 930 57 -1142 -1277 -812 748 1064 71
1546 71 -561 -1424 -1307 851 1362 867 -39 -1174 -814 330 1713 1386 33 -349 -527 -311 1398 2034
1564 2034 960 30 -572 -489 1060 2218 1460 -283 -1449 -789 196 1402 1786 -273 -1583 -1187 -255
1581 -255 875 1907 421 -1156 -1230 -437 1319 1919 1468 -467 -1357 -122 811 1282 1329 46 -963 -708
1599 -708 464 1093 792 336 -808 -1587 -484 654 722 156 -550 -1661 -1030 358 272 63 -265 -854 -1176
1618 -1176 -963 637 1210 116 -338 -1536 -934 1094 1158 489 -500 -1127 -1081 -62 898 490 -438 -539 -913
1637 -913 -1156 780 1017 -452 -807 -1163 -1234 36 629 209 -1067 -729 -17 -78 831 876 -263 -71 -52 -243
$$ packed form
1509a458l00P24O56P09m55o98j324O64R63K91K36l25j193j30J149R22M14n90j099
1528h44r52Q80J462M80l33p25j666O60J655M56j43q73j199j35M65J560L16r93
1546G1o32q63J17K158N11m95r06j135L60J144J383l27j353l82j78K16J709O36
1564B034j074r30o02Q3J549J158p58j743j166O60R85J206L84k059j310L96R32
1581b55J130J032j486j577p4P93J756O00m51j935q90J235R33M71M7j283j009K55
1599g08J172O29l01m56j144p79J103J138O8n66p06j111O31J388q6k09l28n89l22
1618a176K13J600N73j094m54j198O02K028O4o69r89o27M6J019R60m08r28j01l74
1637i13k43J936K37j469l55l56p1J270N93m20j276L38P12o1R09M5j139J92J9j91
$$ plain form
1657 -243 366 946 584 -224 -376 -449 9 546 1364 18 -717 -241 -351 176 850 428 -659 -575 -164 215
1677 215 1013 1277 193 -856 -480 165 561 1340 87 -632 -280 258 623 1035 1257 399 -678 -29 596
1696 596 783 1194 617 -640 -1004 31 540 843 590 -594 -864 -679 453 425 568 188 -1072 -839 183
1715 183 1066 1343 447 -638 -842 -117 1314 1328 414 -497 -1111 -798 791 1135 -16 -625 -1251 -1371 -638
1734 -638 607 587 -573 -1464 -1385 -692 636 755 -422 -1047 -1123 -1085 -103 673 484 -552 -1152 -1114 -273 826
1754 826 1128 -58 -1050 -787 -209 815 1040 -16 -824 -1218 -676 125 518 424 -654 -1517 -775 34 596
1773 596 830 -164 -976 -568 92 936 1244 545 -35 -306 167 1315 1251 1262 401 -265 321 540 930 1124
1793 1124 263 -355 -378 -101 752 714 507 -58 -526 -76 623 632 721 446 -265 -169 25 657 1068 563 211 107
$$ packed form
1657b43O09N80l62q08j52p3M58N37Q18j346p35M76j10N27O74m22j087Q4M11L79
1677B15P98K64j084j049L76O45L96P79j253p19L52N38L65M12K22q58j077O49O25
1696E96J87M11n77j257l64J035N09L03k53j184k70J85J132k8J43l80j260K33J022
1715A83Q83K77q96j085k04P25J431J4r14r11o14L13J589L44j151o09o26j20P33
1734f38J245k0j160q91P9O93J328J19j177o25p6L8R82P76j89j036o00L8Q41J099
1754H26L02j186r92K63N78J024K25j056q08l94N42Q01L93r4j078q63P42Q09N62
1773E96K34r94q12M08O60Q44L08o99n80k71M73J148o4J1q61o66N86K19L90J94
1793A124q61o18k3K77Q53l8k07n65m68M50O99RQ9k75p11R6J94O32M11n05l52j04
$$ plain form
1815 107 386 1107 1066 623 271 -342 -358 144 175 728 41 -294 -541 -625 150 547 167 -613 -820 -695 -411
1836 -411 -340 -237 -582 -913 -754 -316 81 580 162 -369 -587 -758 266 709 112 -563 -1000 -937 -348 29
1856 29 302 -360 -1113 -1487 -993 -299 244 -330 -994 -1231 -1140 -305 88 497 -330 -898 -544 42 729 710 177
1877 177 -726 -635 -494 429 1100 534 -381 -469 -422 119 783 728 91 -883 -947 63 577 594 64 -873 -361 -82
1899 -82 576 1123 548 -32 -390 -307 648 992 1307 401 -277 -124 660 1052 1348 542 -434 30 167 1099 1095
1920 1095 684 -331 -637 -172 634 514 636 -139 -792 -822 70 959 772 103 -594 -555 -150 743 670 284
1940 284 -270 -694 -370 306 474 730 125 -811 -502 -42 285 523 -432 -957 -863 -698 341 312 -282 -658
1960 -658 -943 -710 21 99 -16 -364 -797 -796 -186 189 341 93 -171 -499 -186 643 298 283 -29 -281 -235 172
$$ packed form
1815A07K79P21m1m43l52o13j6N02L1N53o87l35k47q4P75L97l80p80k07J25K84
1836d11P1J03l45l31J59M38L97M99m18n31k18j71J024M43n97o75m37O3N89L77
1856B9K73o62p53l74M94O94N43n74o64k37R1Q35L93M09q27n68L54N86O87j9n33
1877A77r03R1J41R23O71n66r15q8M7N41O64n5o37r74o4J010N14J7n30r37N12K79
1899h2O58N47n75n80l58Q3R55L44L15r06o78J53P84L92K96q06r76M64J37R32m
1920A095m11j015l06M65Q06j20J22p75o53l0Q92Q89j87o69o97L9M05Q93p3l86
1940B84n54m24L24O76J68K56o05r36L09M60L27K38r55n25R4J65J039k9n94l76
1960f58k85K33P31P8j15l48m33JO10L75J52k48k64l28L13Q29l45j5l12k52M6M07
$$ plain form
1982 172 204 651 122 -481 -936 -556 378 555 112 -495 -641 -182 357 400 193 185 -252 -172 175 591 589 527 166
2005 166 7 -184 816 1123 626 267 -260 -217 508 661 617 358 -331 -182 -351 239 478 93 -187 -293
2025 -293 -559 132 1023 554 113 -335 -450 -89 754 742 229 -401 -62 -205 581 1085 558 -322 -381 -357 231
2046 231 1048 340 -310 -928 -796 -299 -185 360 -9 -1029 -522 -355 -300 552 329 -555 -896 -481 97 393
2066 393 457 153 -906 -404 37 99 330 216 -745 -727 -436 395 335 49 -352 -1166 -797 164 527 200 -145
2087 -145 -880 -536 132 393 188 -200 -829 -835 -375 397 427 -81 288 -123 -352 688 762 325 19 -456 -163
2108 -163 294 382 648 48 -133 -233 -244 6 665 -16 7 -409 -749 -216 672 606 -85 -427 69 54 800 1230
2130 1230 280 -261 -118 248 398 802 357 -171 -204 78 386 495 551 -61 -673 -70 -74 349 654 178 -372
$$ packed form
1982A72L2M47n29o03m55L80R34J77m43o07j46M59N39M3k07qm37Q0L47M16ko2l61
2005A66j59j91J000L07m97l59n27M3P25J53m4k59o89J49j69N90K39l85k80j06
2025b93k66O91Q91m69m41m48j15L61Q43j2n13o30L39j43P86N04n27q80n9K4N88
2046B31Q17p08o50o18J32M97J14N45l69j020N07J67N5Q52k23q84l41M15N78K96
2066C93O4l04j059N02M41O2K31j14r61J8K91Q31o0k86m01q14L69R61L63l27l45
2087a45p35L44O68K61k05l88o29oM60P72L0n08L69m11k29J040P4m37l06m75K93
2108a63M57Q8K66o00j81j00j1K50O59o81K3m16l40N33Q88o6o91l42M96j5P46M30
2130A230r50n41J43L66J50M04m45n28l3K82L08J09N6o12o12O03mM23L05m76n50
$$ plain form
2151 -372 -465 -153 115 24 3 -73 -478 -225 284 -99 567 539 -225 -144 -285 280 532 516 207 -234 -339 -27
2173 -27 311 358 11 -802 -898 -353 -113 15 -239 -805 -985 -647 -196 241 -470 -249 -576 -627 222 500 314
2194 314 286 -382 -387 -407 426 487 -81 -319 -399 -664 -102 138 -60 -290 -526 -866 -517 -310 45 -99 -521 -691
2216 -691 -451 180 570 476 -218 -328 -441 421 668 557 351 -312 -255 35 515 724 171 -308 -70 24 380
2237 380 721 440 -59 -380 -277 153 166 106 -67 -637 -194 358 365 901 124 103 197 284 499 570 710 378 -53
2260 -53 136 438 913 487 373 -130 -435 -18 377 584 -47 -267 -412 -406 162 421 243 -66 -335 -268 214
2281 214 446 290 147 -392 -478 -85 478 436 220 -522 -307 -178 147 372 110 -270 -557 -461 69 -136 196
2302 196 -131 -559 -535 -365 109 244 -334 -150 -368 -773 -140 171 252 -361 -355 -289 176 194 543 79 -325 -252
$$ packed form
2151c72r3L12K68r1k1p6m05K53N09l83O66k8p64Q1j41N65K52j6l09m41j05L12
2173b7L38M7l47q13r6N45K40J28k54n66j80L38M51M37p11K21l27n1Q49K78j86
2194C14k8o68nk0Q33O1n68k38q0k65N62K40j98k30k36l40L49K07L55j44m22j70
2216f91K40O31L90r4o94j10j13Q62K47j11k06o63N7K90M80K09n53m79K38R4L56
2237C80L41k81m99l21J03M30J3o0j73n70M43N52PN36p77k1R4Q7K15P1J40l32m31
2260e3J89L02M75m26j14n03l05M17L95K07o31k20j45ON68K59j78l09k69O7M82
2281B14K32j56j43n39q6L93N63m2k16p42K15J29L25K25k62l80k87R6N30k05L32
2302A96l27m28K4J70M74J35n78J84k18m05O33L11Q1o13OO6M65J8L49m64m04P3
$$ plain form
2324 -252 -17 139 402 -8 -254 -174 -189 49 272 263 121 -250 -391 -185 278 303 -56 -241 -258 -69 217 515
2346 515 307 470 21 -43 523 461 530 357 -46 -32 136 518 754 592 -122 -105 -36 246 226 422 400 -369 -257
2369 -257 84 252 462 373 -110 -584 -86 208 527 92 19 -266 -179 167 387 481 242 -54 -258 -38 320
2390 320 471 189 -323 -336 -255 -5 182 28 -298 -648 -693 -423 120 -103 -313 -671 -479 7 -15 87 41 -579
2412 -579 -288 -222 252 654 199 -200 -364 -323 62 220 190 -60 -438 -433 -50 138 309 -141 -576 -529 -364 -146
2434 -146 81 -47 -260 -272 -239 -53 445 349 261 -443 -147 17 607 689 307 13 12 143 480 686 146 -200
2456 -200 -253 -244 292 191 479 82 -261 -82 -144 309 187 -3 -316 -104 65 248 325 380 45 -6 -23 138 575
2479 575 601 372 85 -116 -48 251 467 159 -65 -500 -127 12 300 126 -282 -485 -328 -337 -143 136 -246
$$ packed form
2324b52K35J56K63m10k46Q0j5K38K23rj42l71j41K06M63K5l59j85j7J89K86K98
2346E15k08J63m49o4N66o2O9j73m03J4J68L82K36j62p14J7O9K82k0J96k2p69J12
2369b57L41J68K10q9m83m74M98K94L19m35p3k85Q7L46K20R4k39k96k04K20L58
2390C20J51k82n12j3Q1K50J87j54l26l50m5K70N43k23k10l58J92M86k2J02m6o20
2412e79K91O6M74M02m55l99j64M1L85J58l0k50l78NL83J88J71m50m35M7J65K18
2434a46K27j28k13j2L3J86M98r6q8p04K96J64N90Q2l82k94jJ31L37K06n40l46
2456b00n3RN36j01K88l97l43J79o2M53j22j90l13K12J69J83P7N5l35n1j7J61M37
2479E75K6k29k87k01O8K99K16l08k24m35L73J39K88j74m08k03J57rJ94K79l82
$$ plain form
2500 -246 -315 -351 -328 164 60 220 -338 -172 -36 13 57 241 1 -118 -366 -137 -28 377 347 -15 -91 -196
2522 -196 208 117 -210 -317 -319 -401 -292 -258 258 -76 -478 -386 120 142 454 107 -293 -207 -121 77 440 584 55
2545 55 -33 -16 152 424 340 391 10 -419 -267 196 334 150 -18 -307 -508 13 -83 -85 -240 -258 -268 296 237 311
2569 311 -321 -251 -129 -134 91 608 390 197 110 -198 220 775 359 361 -138 -428 -349 121 221 181 -157 -229 -478
2592 -478 100 457 276 -534 -163 -153 -1 525 185 233 -105 154 201 368 693 217 -184 67 -104 38 482
2613 482 248 -114 -398 -500 -98 -73 93 178 -602 -452 -178 115 99 602 -115 -220 32 151 148 338 95 -219
2635 -219 -201 172 469 199 394 -19 -419 -77 119 426 103 -435 -330 -236 356 195 -42 -133 -358 -543 -172
2656 -172 -128 -308 -69 -285 -512 -376 111 155 101 239 17 -57 426 493 131 319 -18 -434 -61 -19 176 13
$$ packed form
2500b46o9l6K3M92j04J60n58J66J36M9M4J84k40j19k48K29J09M05l0l62p6j05
2522a96M04r1l27j07kq2J09L4N16l34m02R2N06K2L12l47m00Q6Q6J98L63J44n29
2545E5q8J7J68K72q4N1l81m29J52M63J38j84j68k89k01N21r6kj55j8j0N64n9P4
2569C11o32P0J22nK25N17k18j93q7l08M18N55m16Km99k90P9M70J00m0l38p2k49
2592d78N78L57j81q10L71J0J52N26l40M8l38K59M7J67L25m76m01K51j71J42M44
2613D82k34l62k84j02M02K5J66Q5p80J50K74K93j6N03p17j05K52J19lJ90k43l14
2635b19J8L73K97k70J95m13m00L42J96L07l23n38J05R4N92j61k37r1k25j85L71
2656a72M4j80K39k16k27J36M87M4n4J38k22p4M83O7l62J88l37m16L73M2J95j63
$$ plain form
2678 13 -52 -375 -320 59 397 -47 -43 -194 -443 126 124 314 -18 -269 -111 118 92 505 260 -205 260 58 56
2701 56 369 362 -224 -256 -111 2 121 334 -54 -65 -77 -292 67 344 273 -243 -198 -559 -43 143 246 130 -184
2724 -184 -307 -66 57 198 345 -393 -276 -44 352 195 211 22 -151 -274 -133 154 166 -128 -276 -572 -27
2745 -27 -22 -48 -56 -302 -263 -176 -85 140 -151 86 -81 -369 -26 -9 198 -70 -206 -301 -185 -92 332 138 -232 -223 -110
2770 -110 -15 300 274 -1 -28 -453 33 136 265 -180 -269 -301 -126 261 132 40 -241 -183 -128 160 250 266 63
2793 63 -40 118 200 380 407 327 66 -57 -1 255 629 343 -316 -97 67 -12 127 182 32 -91 -91 158 39
2816 39 285 -15 61 -52 -213 85 239 79 149 -23 76 59 485 324 179 -259 84 -67 282 137 144 -158
2838 -158 -298 -15 -40 168 -24 35 -376 -513 -258 104 187 190 44 -265 -136 177 523 307 -158 78 -43 17
$$ packed form
2678A3o5l23N5L79L38m44Mj51k49N69kJ90l32k51J58K29k6M13k45m65M65k02k
2701E6L13pn86l2J45J13J19K13l88j1j2k15L59K77p1n16M5l61N16J86J03j16l14
2724a84j23K41J23J41J47p38J17K32L96j57J6j89j73j23J41K87J2k94j48k96N45
2745b7Nk6qk46L9Q7R1K25k91K37j67k88L43J7K07k68j36r5J16R3M24j94l70RJ13
2770a10R5L15k6k75k7m25M86J03J29m45q9l2J75L87j29r2k81N8N5K88R0J6k03
2793F3j03J58Q2J80K7q0k61j23N6K56L74k86o59K19J64p9J39N5j50j23%K49j19
2816C9K46l00P6j13j61K98J54j60P0j72R9j7M26j61j45m38L43j51L49j45Pl02
2838a58j40K83k5K08j92N9m11j37K55L62Q3Lj46l09J29L13L46k16m65K36j21O0
$$ plain form
2860 17 310 -91 -170 0 -361 -118 27 5 -134 -253 -394 128 -240 -156 26 -194 -146 -239 -223 0 116 -89
2882 -89 -86 -380 32 -6 229 496 -77 38 -164 110 191 451 -15 129 -24 -74 353 172 90 -125 -499 -197
2904 -197 24 68 -80 -373 -310 -105 -56 270 170 -90 -44 -75 140 448 242 208 -42 -275 -21 171 214 450
2926 450 193 52 -48 -86 208 30 -12 -119 -640 -127 68 120 79 13 -131 -264 -89 176 38 -201 -104 -249
2948 -249 67 272 106 86 -151 -124 67 85 315 139 -109 132 54 121 68 195 -38 10 -255 -172 266 181 225
2971 225 -197 -181 -154 -70 199 -159 -320 -115 -25 157 389 -3 -139 -26 -164 -75 298 198 72 42 -22 25 -168
2994 -168 115 -125 -98 -354 11 -85 40 268 -247 -87 -289 -26 180 324 43 -178 -256 -57 266 391 343
3015 343 -66 -149 410 73 440 -55 100 -25 69 58 48 227 13 244 -102 -192 34 52 -94 -187 -221 -182 -234
$$ packed form
2860A7K93m01p9J70l61K43J45k2j39j19j41N22l68Q4J82k20M8r3J6K23J16k05
2882h9Lk94M12l8K35K67n73J15k02K74Q1K60m66J44j53n0M27j81q2k15l74L02
2904a97K21M4j48k93O3K05M9L26j00k60M6l1K15L08k06l4k50k33K54J92M3K36
2926D50k57j41j00l8K94j78m2j07n21N13J95N2m1o6j44j33J75K65j38k39R7j45
2948b49L16K05j66k0k37K7J91J8K30j76k48K41p8O7n3J27k33M8k65Q3M38q5M4
2971B25m22J6K7Q4K69l58j61K05R0J82K32l92j36J13j38Q9L73j00j26l0o4M7j93
2994a68K83k40K7k56L65r6J25K28n15J60k02K63K06J44k81k21p8J99L23J25m8
3015C43m09q3N59l37L67m95J55j25R4j1j0J79k14K31l46r0K26J8j46r3l4L9n2
$$ plain form
3038 -234 129 -10 292 -201 -200 -27 107 181 185 -239 73 -174 98 282 -53 -133 -3 -383 -170 302 64 -198
3060 -198 -93 -110 -240 20 124 -211 -418 54 -201 -221 169 172 -48 -12 -42 -69 353 219 65 45 4 -39 -9 186
3084 186 96 -175 -173 -30 -54 170 221 -142 -143 -153 -29 32 216 168 -1 -268 -270 18 120 248 -25 -302 -88 318
3108 318 294 262 235 -138 -239 151 -30 74 404 152 -251 182 47 229 164 -275 -184 -326 -284 -21 42 -57 -169
3131 -169 -285 -194 32 60 65 -87 -166 -281 174 571 286 113 -27 110 -7 386 156 71 -111 -51 240 252 -29
3154 -29 -28 112 -174 -130 -24 237 -42 -64 -71 44 -7 132 91 115 -307 189 -10 -88 280 245 317 -170 -260 -118 206
3179 206 332 205 158 -18 -43 198 90 176 -157 -212 -195 -144 175 290 -274 -244 -391 -112 61 223 411 -386
3201 -386 -215 -106 427 -67 -112 24 -81 -11 171 -182 327 87 -222 -289 -198 -32 -61 -35 57 -233 -282 48 -263
$$ packed form
3038b34L63j39L02m93JJ73J34P4Mm24L12k47K72J84l35q0J30l80K13M72k38k62
3060a98J05j7j30K60J04l35k07M72k55k0L90Lk20L6l0k7M22j34j54k0m1m3L0J95
3084A86r0k71KJ43k4K24N1l63jj0J24O1J84m8j69k67kK88J02J28k73k77K14M06
3108C18k4l2k7l73j01L90j81J04L30k52m03M33j35J82o5m39R1j42M2K63O3r9j12
3131a69j16R1K26K8Nj52p9j15M55L97k85j73j40J37j17L93k30q5j82O0K91J2k81
3154b9JJ40k86M4J06K61k79k2pJ15n1J39m1K4m22M96j99p8L68l5P2m87r0J42L24
3179B06J26j27m7j76k5K41j08Q6l33n5J7N1L19J15n64L0j47K79J73J62J88p97
3201c86J71J09N33m94m5J36j05P0J82l53N09k40l09o7R1J66k9K6R2k90m9L30l11
$$ plain form
3224 -263 149 317 -207 -285 -31 -132 -37 -55 -73 -186 101 87 296 241 -54 -56 109 2 237 27 6 77 10 -119
3248 -119 107 -19 116 81 -140 -100 9 54 -60 -69 -230 -129 -42 -15 155 204 -43 -245 -69 96 265 340 -181
3271 -181 -143 -200 318 297 14 -90 -133 -38 -79 232 330 133 -11 37 -191 -279 143 -10 -72 -312 -65 186 104 221
3295 221 -365 -198 177 -225 129 434 164 -97 81 -70 108 47 255 128 -323 -234 169 152 -18 78 -46
3316 -46 11 -132 81 163 -25 -95 62 -249 3 246 143 -141 -312 132 -56 173 17 -242 -147 -36 21 224
3338 224 104 127 97 -106 -132 334 -99 -99 88 -269 128 -98 116 290 -161 108 -60 -136 127 314 -59 130
3360 130 -285 -219 -59 310 229 -139 312 143 168 39 75 13 91 -59 276 3 137 -110 -223 -226 -18 26 115
3383 115 89 -56 -207 -44 -221 35 71 172 121 -90 55 261 -65 42 -100 -153 -22 184 318 350 180 -283
$$ packed form
3224b63M12J68n24p8K54j01R5j8j8j13K87j4K09n5k95kJ65j07K35k10k1P1o7j29
3248a19K26j26J35l5k21M0J09M5j14rj61J01Q7K7J70M9k47k02J76J65J69P5n21
3271a81L8n7N18k1k83j04m3R5m1L11R8j97j44M8k28q8M22j53o2k40K47K51q2J17
3295B21n86J67L75m02L54L05k70k61J78j51J78o1K08j27m51Q9M03j7j70R6j24
3316d6N7j43K13Q2j88p0J57l11K52K43j03k84j71M44j88K29j56k59R5J11N7K03
3338B24j20K3l0k03k6M66m33%J87l57L97k26K14J74m51K69j68p6K63J87l73J89
3360A30m15O6J60L69q1l68M51j69K5j29L6o2P8j50L35k73J34k47j13lK08M4Q9
3383A15k6j45j51J63j77K56L6J01n1k11J45K06l26J07j42n3J31K06J34L2j70m63
$$ plain form
3405 -283 66 -116 50 114 -46 -158 -234 -277 262 54 190 97 -92 -149 72 270 135 -79 -178 115 97 209
3427 209 105 186 101 -226 94 241 -32 1 245 -118 -53 37 47 8 -116 64 -273 -250 -75 145 -200 -237 -392
3450 -392 -32 -163 108 131 -92 -198 -77 -25 232 240 189 -17 -164 119 -3 4 100 -27 132 211 -3 -214 97
3473 97 -78 -68 -59 -136 32 -6 -73 97 28 -212 140 98 179 211 -162 38 68 192 52 -4 63 7 -79 128 176 102
3499 102 -229 -165 -59 -27 287 9 141 -192 -23 27 152 151 13 -186 -165 -155 143 205 360 -48 -143 -50 417
3522 417 143 170 226 -171 -23 -66 -66 36 71 91 -98 -45 -170 127 -119 -61 -211 -182 71 -42 143 -120 -194 -307
3546 -307 9 119 -59 -25 7 31 22 67 141 89 -43 -1 -5 -202 15 101 110 127 56 0 -19 46 -95 6 15 -262 65
3573 65 -178 41 90 -435 3 -59 -100 2 149 -127 289 108 169 338 241 9 162 -322 215 35 29 17 -303
$$ packed form
3405b83L49j82J66O4j60j12p6m3N39k08J36r3j89n7K21J98j35k14r9K93j8J12
3427B09j04Q1q5l27L20J47k73L3K44l63O5R0J0l9j24J80l37K3J75K20l45l7j55
3450c92L60j31K71K3k23j06J21N2K57Qn1k06j47K83j22PR6j27J59P9k14k11L11
3473I7j75J0Rp7J68l8o7J70o9k40L52m2Q1L2l73K00L0J24j40n6O7n6q6K07M8p4
3499A02l31O4J06L2L14k78J32l33J69N0J25jj38j99K1J0K98O2J55m08r5R3M67
3522D17k74K7N6l97J48m3%J02L5K0j89N3j25K97k46N8j50K9K53j13J85k63p4j13
3546c07L16J10j78L4L2K4rM5P4n2j32M2mj97K17Q6RJ7p1n6j9O5j41J01Rk77L27
3573F5k43K19M9n25M38o2m1J02J47k76M16j81O1J69r7k32J53m84N37j80oj2l20
$$ plain form
3596 -303 -103 -241 332 89 22 -161 -46 56 232 237 -1 157 -195 53 196 70 18 -91 -91 -5 270 118
3618 118 251 -157 74 36 -48 136 57 137 233 22 21 -14 46 192 2 -64 -105 -67 -156 131 -97 -82 -249 -141 -23
3643 -23 358 212 -267 -99 -39 55 194 209 53 1 -5 -119 183 -67 83 57 -70 19 -52 -195 86 -206 -31
3666 -31 -185 -225 21 12 280 48 73 60 82 -58 116 97 168 -23 261 -70 231 -132 -100 -107 125 49 287 104
3690 104 -191 -19 -236 50 -203 5 -105 -204 9 57 187 296 -70 -125 172 -25 47 19 1 -28 116 -81
3712 -81 104 340 35 203 38 72 255 29 133 -12 -251 -234 -133 -59 86 -57 -179 1 -174 -170 328 -48
3734 -48 -24 -57 -224 146 152 348 272 -10 -223 -71 -211 65 287 -220 -100 92 -257 -255 -168 -58 -140 -152 14 63
3758 63 -83 -27 -115 -307 -145 -75 30 -206 -79 110 5 -123 105 -50 131 -75 -102 -204 -225 209 182 -263
$$ packed form
3596c03K00j38N73k43o7j83J15J02J76Nk38J58l52K48J43j26n2j09%Q6K75j52
3618A18J33m08K31l8q4J84p9Q0R6k11jl5O0J46j90o6m1L8q9K87k28J5j67J08J18
3643b3L81j46m79J68O0R4J39J5j56n2oj14L02k50J50k6j27Q9p1j43K81k92J75
3666c1j54m0K46rK68k32K5j3K2j40J74j9P1j91K84l31L01l63L2pK32p6K38j83
3690A04k95J72k17K86k53K08j10r9K13M8J30J09l66n5K97j97P2k8j8k9J44j97
3712h1J85K36l05J68j65L4J83k26J04j45k39J7J01P4J45j43j22J80j75MM98l76
3734d8K4l3j67L70OJ96p6k82k13J52j40K76K22n07J20J92l49KQ7J10q2j2J66M9
3758F3j46N6q8j92J62P0J05k36J27J89j05j28K28j55J81k06k7j02k1M34k7m45
$$ plain form
3780 -263 -27 198 57 231 56 73 93 39 31 29 -60 12 -132 95 -289 55 386 167 3 -14 -106 -76 319 51
3804 51 241 -46 -68 -10 -116 174 98 -122 158 253 298 366 -171 -220 -32 -179 80 -47 -9 48 -72 -202 139
3827 139 -45 180 -143 5 -27 131 -168 172 -90 89 -70 -122 -253 -286 247 214 201 81 -205 -15 -88 15
3849 15 -86 -200 -87 -109 37 178 54 -47 -64 -74 55 -8 8 149 -67 -195 42 127 246 77 38 28 188
3872 188 136 -14 237 -17 -145 3 -121 -133 0 162 47 -99 101 -26 47 81 -102 -118 -13 249 114 -15
3894 -15 -25 -244 -121 -73 244 -54 85 62 -79 -202 82 -113 95 130 -131 285 89 145 -81 59 55 -74 -78
3917 -78 10 36 -112 139 -121 123 -102 283 271 126 -150 65 126 105 197 79 -38 -116 -46 75 63 296 -37
3940 -37 200 -132 221 232 -251 -71 -108 -51 -208 85 48 -211 -433 81 -180 133 248 -40 131 -235 146 -219
$$ packed form
3780b63K36K25j41J74j75J7K0n4qkq9P2j44K27l84L44L31k19j64j7r2L0L95k68
3804E1J90k87k2N8j06K90p6k20K80R5M5O8n37m9J88j47K59j27L8N7j20j30L41
3827A39j84K25l23J48l2J58k99L40k62J79j59n2j31l3N33l3j3j20k86J90p3J03
3849A5j01j14J13k2J46J41j24j01j7j0J29o3J6J41k16j28K37Q5J19j69l9j0J60
3872A88n2j50K51k54j28J48j24j2J33J62j15j46K00j27P3L4j83j6J05K62j35j29
3894a5j0k19J23M8L17k98J39k3j41j23K84j95K08L5k61M16j96N6k26J40mj29m
3917g8Q8K6j48K51k60K44k25L85j2j45k76K15O1k1R2j18j17p8P0J21j2K33l33
3940c7K37l32L53J1m83J80l7N7j57K93l7k59k22N14k61L13J15k88J71l66L81l65
$$ plain form
3962 -219 148 89 274 93 -77 -98 160 -203 -258 -87 96 146 54 -146 21 -171 -71 -176 34 -2 -160 -54
3984 -54 -50 161 -64 56 211 -36 -139 98 120 162 342 41 78 -175 248 53 250 400 -47 -240 -168 -181 -10
4007 -10 22 52 -57 -260 3 -59 58 -3 -67 -133 -229 -76 19 80 100 48 41 -90 384 253 216 -29 -233 -9 -33
4032 -33 16 158 198 120 -135 24 152 156 -8 102 -63 106 -89 -200 -18 -214 -226 385 -9 353 46 -120
4054 -120 -121 -56 -46 218 -71 -160 -105 50 20 -44 -35 -259 13 -211 -3 -115 -159 -58 -37 -370 -266 111 24 -74 2
4079 2 19 -292 -200 86 -27 201 232 -173 122 57 -57 -10 186 6 -70 15 -88 243 192 -90 -119 135 166 -21
4103 -21 -20 -77 -271 -346 -87 -176 74 -26 -228 -132 -90 141 -66 70 -19 -152 -232 19 176 196 196 -60 -180 313
4127 313 165 228 -96 -152 -58 -303 115 -69 -77 -9 -423 178 -15 172 345 119 -135 308 -7 -20 -87 -318 45
$$ packed form
3962b19L67n9J85j81j70k1K58l63n5J71J83N0r2k00J67j92J00j05K10l6j58J06
3984e4MK11k25J20J55k47j03K37K2M2J80l01L7k53M23j95J97J50m47j93P2j3J71
4007a0L2L0j09k03K63o2J17o1o4o6r6J53R5O1K0n2pj31M74j31l7k45k04K24k4
4032c3M9J42M0p8k55J59J28Mj64J10j65J69j95j11J82j96j2O11l94L62l07j66
4054a20jO5J0K64k89q9N5J55l0o4Rk24K72k24K08j12m4J01K1l33J04L77q7r8P6
4079BJ7l11R2K86j13K28L1m05K95o5j14M7J96j80p6Q5j03L31n1k82k9K54L1j87
4103b1Jn7j94p5K59q9K50j00k02R6M2K31k07J36q9j33q0K51J57K0%k56j20M93
4127C13j48O3l24n6R4k45M18j84qO8m14O01j93J87J73k26k54M43l15j3o7k31L63
$$ plain form
4150 45 -56 188 143 258 -155 244 -61 170 49 -222 -193 -79 124 21 4 303 66 15 -142 -190 -83 232
4172 232 11 22 -258 55 -94 -21 159 -79 513 203 47 -34 268 -38 -59 185 -78 46 -38 -141 -98 32
4194 32 -125 -16 -33 -47 -79 -130 24 66 -380 -161 -43 -86 -332 -152 180 126 62 28 119 -40 -140 -66 112 270
4218 270 -153 -207 -248 53 213 74 22 144 257 123 227 56 328 -32 -24 179 -300 -109 -6 25 22 207 -31
4241 -31 50 -46 -14 -101 -12 88 -153 319 -214 230 -53 -33 17 206 14 277 -40 -155 78 -108 -14 -135 136
4264 136 -32 81 -148 142 29 -35 -5 -265 -95 -116 161 -120 -97 238 -56 174 99 146 -120 -162 209 182 101
4287 101 -29 -158 -144 160 -49 179 102 -139 -310 -182 28 121 145 -106 -152 40 92 282 -5 195 -67 106
4309 106 51 -110 -42 243 -60 4 63 -93 -22 -80 90 -60 -163 15 209 84 12 48 -107 -50 74 155 133 294
$$ packed form
4150D5j01K44m5J15m13L99l05K31j21k71K9J14K03j03j7K99k37n1j57m8J07L15
4172B32k21J1k80L13j49P3J80k38N92l10j56q1L02l06k1K44k63J24q4j03M3J30
4194C2j57J09j7j4l2n1J54M2m46K19J18m3k46J80L32n4o4l4R1j59j00P4J78J58
4218B70m23n4m1L01J60j39n2J22J13j34J04j71K72l60QK03m79J91J03L1lJ85k38
4241c1Q1r6L2q7Q9J00k41M72n33M44k83K0N0J89j92K63l17j15K33j86R4j21K71
4264A36j68J13k29K90j13o4L0k60J70k1K77k81K3L35k94K30p5M7k66m2L71k7q1
4287A01j30j29J4L04k09K28p7k41j71J28K10R3K4k51m6J92N2J90k87K00k62J73
4309A06n5j61O8K85l03O4N9j56P1n8J70j50j03J78J94j25p2L6j55N7J24Q1k2J61
$$ plain form
4333 294 -94 -20 -18 -46 60 56 -34 -65 -37 -94 166 108 -174 69 77 172 103 -64 -15 175 -254 -177 -140 16 143 -157
4359 -157 104 -45 -85 147 329 -128 -31 -154 -153 -107 153 -11 352 6 -46 113 217 -40 -103 39 20 97 18
4382 18 -175 46 131 136 -188 42 131 115 405 50 -28 0 2 107 -204 -323 26 156 -62 -164 210 -23 -182
4405 -182 -170 186 21 120 84 108 106 19 37 195 -132 231 -114 -22 -274 -125 227 -67 32 -57 124 -64 112 20
4429 20 -183 -86 106 123 68 -267 36 -46 -134 179 -49 -59 -164 -185 145 -121 -107 0 -78 33 5 95 -18 329
4453 329 34 -15 58 -192 212 13 2 -167 54 -63 -60 -61 -95 -189 27 -151 169 -119 41 -109 -1 142 29
4476 29 -24 143 79 41 -32 -13 -157 157 -79 -6 -24 118 -207 -81 -106 19 166 -58 138 89 119 18 40 179
4500 179 195 -30 133 -43 -162 -111 -30 -143 -199 227 68 27 138 142 -83 -89 -7 -253 141 103 -210 80 164 214
$$ packed form
4333B94l88P4Kk8J06mr0l1K8n7K60n8k82K43QR5o9j67M9J90m29P7L7J56J27l00
4359a57K61j49m0K32J82m57R7j23JM6K60j64L63l46n2J59J04k57o3J42j9P7p9
4382A8j93K21Q5Nl24K30Q9j6K90l55p8K8KJ05l11j19L49J30k18j02L74k33j59
4405a82J2L56j65R9l6K4kq7J8J58l27L63l45R2k52J49L52k94R9q9J81j88J76r2
4429B0k03R7J92J7n5l35L03q2q8L13k28j0j05k1L30k66J4J07p8J11k8R0j13L47
4453C29k95m9P3k50M04j99j1j69K21j17Ljl4r4K16j78L20k88J60j50J08J43j13
4476B9n3J67o4l8p3J9j44L14k36P3j8J42l25J26k5J25J47k24J96m9L0j01K2J39
4500A79J6k25J63j76j19N1Q1j13n6M26j59m1J11Mk25oQ2k46L94l8l13K90Q4N0
$$ plain form
4524 214 -50 36 -110 109 167 -124 -1 -134 210 -49 -31 284 110 -74 280 127 -233 81 320 -130 -336
4545 -336 -25 236 -13 165 -50 -254 -101 147 113 161 76 33 28 9 414 58 30 247 -159 48 128 -181 214
4568 214 181 -25 -111 20 -187 116 -8 -166 67 109 82 -203 120 5 72 -331 -50 200 154 -273 -45 33
4590 33 -145 -179 -90 324 122 -227 -18 33 -4 -74 -26 -85 -139 -193 4 244 13 96 -82 28 115 -102 -11 78 57
4615 57 -95 -88 355 35 75 -20 -120 71 95 -127 -7 154 -105 125 277 -327 58 172 -51 -29 210 33
4637 33 30 80 28 -135 -18 75 107 6 -109 197 81 -31 110 0 -42 161 -256 219 -256 271 95 31 -200
4660 -200 -10 -51 -5 13 10 52 -52 33 110 -88 -1 -80 71 -299 -107 81 123 192 35 -393 -100 45 13 -172
4684 -172 38 -22 80 42 82 42 -99 33 -36 -56 -150 -103 65 -23 9 295 -203 201 18 -56 -63 -1 -107 24 101
$$ packed form
4524B14k64Q6j46K19N8k91J23j33L44k59J8L15j74j84L54j53l60L14K39m50k06
4545c36L11K61k49J78k15k04J53K48l4M8q5m3nj9M05l56k8K17m06K07Q0l09L95
4568B14l3k06q6J31k07L03j24j58K33M2k7k85L23j15O7m03K81K50m6m27K28P8
4590C3j78l4Q9M14k02l49K09N1l7p0M8n9n4n4J97K40k31Q3j78J10Q7k17R1Q9k1
4615E7j52PM43l20M0r5j00J91K4k22J20J61k59K30J52o04L85J14k23K2K39j77
4637C3lN0n2j63J17R3L2j01j15L06j16j12J41j10m2K03m17M75m75N27j76o4k31
4660b00J90m1M6J8lM2j04Q5P7j98Q7p9J51l70J92J88M2O9j57m28K93J45l2j85
4684a72K10o0J02l8M0m0j41J32o9k0r4M7J68q8L2K86m98M04j83p4pO2j06J31P7
$$ plain form
4709 101 100 -47 161 70 87 -40 89 -105 100 -28 1 139 128 -118 -42 -230 -75 70 2 -19 133 -155 52
4732 52 373 87 -132 45 -88 -30 -112 158 126 -61 -395 47 9 -58 14 17 55 -31 -140 70 183 105 -15 -44
4756 -44 -147 59 63 -15 71 -184 -156 -35 -54 -177 -12 -17 -214 -29 -65 20 -93 40 -84 -69 77 65 -55 -15 -11
4781 -11 -6 -121 157 220 13 347 146 -99 198 186 -231 -49 76 -98 -115 70 294 77 -341 -43 -41 315 275
4804 275 -51 -214 -89 89 33 176 46 -134 -11 13 224 -35 -16 107 -94 160 201 24 -89 -156 -86 -101
4826 -101 -3 205 121 143 -138 -133 103 180 147 155 114 -372 30 -237 172 -31 -90 125 -142 -106 11 189 28 56
4850 56 -138 -18 -49 115 196 -239 -15 -95 -49 105 26 -47 -114 169 -72 165 156 -105 154 64 -3 123 -63 208
4874 208 -137 284 -92 -97 160 58 148 126 -21 -140 -86 85 235 0 -242 96 -64 77 -209 -88 115 -202
$$ packed form
4709A01jj47K08r1J7j27J29j94K05j28K9J38j1k46P6j88J55J45o8k1J52k88K07
4732E2L21k86k19J77j33N8q2K70l2j87l34M42l8o7P2LL8q6j09K10J13p8j20k9
4756d4j03K06Mp8Q6k55K8J21j9j23J65nj97J85l6Q5j13J33j24J5J46j2j20M0M
4781a1Nj15K78O3k07L34k01k45K97j2m17J82J25j74j7J85K24k17m18K98KL56m0
4804B75l26j63J25J78n6J43j30j80J23K4K11k59J9J23k01K54M1j77j13o7P0j5
4826a01R8K08q4K2k81NK36P7l3Qm1m86M02k67M09k03n9K15k67L6J17J78j61K8
4850E6j94J20l1J64Q1m35K24q0M6J54p9p3o7K83k41K37rk61K59r0o7J26j86K71
4874B08l45M21l76nK57j02R0k2j47j19N4J71J50k35k42L38j60J41k86J21K03l17
$$ plain form
4896 -202 67 -79 -124 -80 137 -201 -53 12 298 95 -96 -153 -117 91 -186 3 86 45 17 -13 -144 -63 206
4919 206 118 -325 16 114 -241 105 -150 170 -189 100 27 334 93 -111 193 -173 258 144 -170 -5 46
4940 46 80 -139 159 270 -164 -132 -122 -18 106 -201 146 52 -435 158 45 -49 52 13 -120 94 130 323 -180
4963 -180 88 -236 -161 186 38 204 59 -25 297 187 257 24 70 -2 -33 -156 228 101 46 -96 -264 98
4985 98 -98 3 14 -329 180 -161 15 19 85 17 28 -173 39 -35 159 -38 97 68 -209 -70 -89 251 75
5008 75 -151 22 28 -64 277 -59 261 -84 -272 110 67 13 45 -72 -11 50 148 -57 67 238 302 113 5 201
5032 201 162 -118 129 138 -135 280 90 79 -75 -374 -141 206 -122 -51 -124 81 -156 80 -103 -51 -27 -85 9
5055 9 -152 61 -37 -128 -159 17 -342 22 115 19 -26 109 26 51 -223 -208 152 -31 -87 -12 29 93 58 -99 -180 52
$$ packed form
4896b02K69j46m5M4K17l38J48O5K86k03j91n7L6K08k77J89Q3m1k8l0j31Q1K69
4919B06q8m43L41R8l55L46k55L20l59K89p3L07k41k04L04l66M31j14l14J65N1
4940D6L4k19K98J11m34L2J0J04J24l07L47r4m87N93j13r4J01l9j33K14L6J93n03
4963a80K68l24P5L47j48J66j45q4L22j10P0k33M6p2l1j23L84j27n5j42j68L62
4985I8j96J01J1l43N09l41J76MO6o8J1k01K12p4J94j97J35k9k77J39j9L40j76
5008G5k26J73Or2L41l36L20l45j88L82m3n4L2j17O1O1R8k05J24J71O4j89j08J96
5032B01l9k80K47Rk73M15j90j1j54k99K33L47l28P1p3K05k37K36j83N2K4n8R4
5055Ij61K13r8r1l1J76l59L64R3r6m5J35q3K5k74J5L60j83n6P5M1O4l5j57q1K32
$$ plain form
5081 52 159 155 299 -245 -259 3 -91 -145 125 59 -70 26 124 -35 44 269 76 -118 -126 -59 -60 189 -280 -184 -239 -28
5107 -28 211 -116 56 -187 111 -182 219 -3 103 -135 -32 -74 -59 -49 108 -42 -171 115 -92 277 -159
5128 -159 143 -58 -166 -132 26 84 306 -8 -132 -17 -20 45 -8 146 -282 113 -47 -138 90 33 5 5 57 227
5152 227 45 -142 179 -153 -64 -120 76 84 -113 98 -29 -175 -110 -106 -283 193 -40 -78 -254 -19 108 -162 77
5175 77 106 34 39 -4 264 118 -46 106 -55 285 7 195 219 81 37 184 230 -220 168 24 -213 -26 39
5198 39 271 -168 -130 36 184 153 98 -312 -243 -138 -18 28 279 -42 -57 -41 68 -52 170 84 -61 -15 143
5221 143 65 57 -30 4 178 -141 -17 -82 17 -69 -32 -115 -220 255 264 102 -106 -193 -164 -38 -123 -7 131 164 -5
5246 -5 -125 261 107 169 117 251 40 0 127 56 120 146 -100 -99 49 -2 -280 178 -112 -186 -45 178 48 -133
$$ packed form
5081E2J07mJ44n44j4K62r4n4K70o6j29R6R8j59P9K25j93j94qO7jK49m69R6n5K11
5107b8K39l27J72k43K98k93M01k22J06k38J03m2J5J0J57j50j29K86k07L69m36
5128a59L02k01j08L4J58N8K22l14j24J15lO5n3J54m28L95j60r1K28n7k8%N2J70
5152B27j82j87L21l32Q9n6J96Qj97K11j27j46O5Mj77M76k33l8j76K35J27k70K39
5175G7K9p2Nm3K68j46j64J52j61L40k78J88K4j38m4J47M6m50L88j44k37J87O5
5198C9K32m39L8J66J48l1n5m10O9J05J20M6K51l21j5J6J09j20K22q6j45M6J58
5221A43p8qq7L4J74l19J24o5R9q6L7q3j05M75Rj62k08q7K9J26q5J16J38L3j69
5246ej20L86j54O2n2J34k11m0J27p1O4K6k46JJ48n1k78M58k90p4J41K23j30j81
$$ plain form
5270 -133 -53 -92 -63 60 80 79 -57 -242 47 87 45 -47 146 -7 208 171 385 233 132 144 -167 -227 77 80 145
5295 145 -332 60 44 138 267 225 104 -187 -63 -187 -141 25 -116 121 77 69 -124 -404 -52 -269 10 -119
5317 -119 -119 -144 189 -119 -73 -101 -24 80 29 -65 26 21 -15 108 -83 19 117 22 -125 -63 130 -87 -142 272 17
5342 17 273 133 29 -137 -222 -54 -73 341 174 -290 101 -10 0 -107 188 -185 206 -18 100 -259 110
5363 110 151 164 -15 84 -1 -277 -27 157 73 -30 6 -120 93 -70 40 -207 -62 284 96 136 146 -51 31
5386 31 -247 -118 85 204 -381 241 -18 226 -9 -170 -260 47 -86 67 -264 15 45 -245 61 110 -69
5407 -69 230 -134 78 -139 28 51 124 -137 -306 -87 -10 -115 23 -129 -51 22 -135 146 6 82 -30 31 -20
5430 -20 -43 -212 31 33 145 -25 -96 50 13 76 61 52 -164 164 -154 297 75 289 -97 59 361 -52 66
$$ packed form
5270a33Q0l9K9J23K0jj36j85K89M0m2r2J93j53K15l7K14j52j01J2l11o0L04LO5
5295A45m77L92j6R4J29m2j21k91J24j24M6J66j41K37m4qj93k80L52k17K79j29
5317a19%k5L33l08M6k8P7J04n1r4R1nl6J23j91J02R8r5j47O2J93k17n5M14k55
5342A7K56j40j04j66q5J68j9M14j67m64L91j11J0j07K95l73L91k24J18l59L69
5363A10M1J3j79R9q5k76K50J84q4j03L6j26K13j63J10k47J45L46j88M0J0j97Q2
5386C1k78J29K03J19n85O22k59K44k35j61r0L07j33J53l31K79L0k90L06M9j79
5407f9K99l64K12k17J67K3P3k61j69K19P7j05J38j52P8P3j57K81j40P6j12O1n1
5430b0k3j69K43KJ12j70p1J46l7O3j5rk16L28l18M51k22K14l86J56L02m13J18
$$ plain form
5453 66 213 60 -56 258 -70 269 206 179 -26 50 113 183 -2 23 -164 -143 -7 -142 182 -13 -229 15 -42
5476 -42 26 86 -92 39 -185 -113 -16 3 287 -46 -47 -66 121 23 334 -14 100 -2 114 -154 -13 70 -322 54
5500 54 84 -216 207 -184 147 69 -108 28 5 57 -78 133 -435 -123 -171 182 -12 -11 -280 -12 -10 143 -63
5523 -63 164 -233 -28 -104 51 -208 38 -114 -10 148 17 -131 -217 -139 64 197 56 6 79 -37 -194 -73
5545 -73 150 -19 -143 100 -127 -17 176 85 -354 110 14 -118 21 230 -50 -32 -29 -154 162 -144 -29 200
5567 200 -30 24 150 -150 129 194 117 -64 -17 117 -165 58 204 -170 -241 267 75 -230 164 168 25 -124
5589 -124 90 -59 -77 69 80 140 176 90 -159 71 -171 151 42 -127 26 139 190 125 -21 -11 -20 206 -36
5612 -36 -55 -357 -86 71 -18 -41 -118 90 -288 139 95 89 -25 248 81 -115 227 205 80 7 187 42 18 49
$$ packed form
5453F6J47j53j16L14l28L39o3k7k05P6O3P0j85K5j87K1J36j35L24j95k16K44n7
5476d2O8O0j78J31k24P2R7J9K84l33jj9J87r8L11l48J14j02J16k68J41Q3l92L76
5500E4L0l00M23l91L31p8j77J36k3N2j35K11n68L12m8L53j94Jk69K68KJ53k06
5523f3K27l97K05p6J55k59K46j52J04J58j31j48q6P8K03J33j41n0P3j16j57J21
5545g3K23j69j24K43k27J10J93r1m39M64r6j32J39K09k80J8Lj25L16l06J15K29
5567B00k30N4J26l00K79O5p7j81M7J34k82K23J46l74p1N08j92l05L94Mj43j49
5589a24K14j49j8J46J1O0L6q6k49K30k42L22j09j69J53J13N1o5j46J0rK26k42
5612c6j9l02K71J57q9k3p7K08l78M27m4oj14K73j67j96L42k2j25p3J80j45k4L1
$$ plain form
5636 49 200 204 32 244 -24 -75 -43 162 176 4 -151 -289 -243 -114 8 21 -76 -105 -57 52 161 -58 10 -86
5660 -86 -14 -234 -1 -133 -3 13 -182 57 50 14 -178 182 261 105 125 93 68 -93 -97 -92 -445 -39 -164 -282 195
5685 195 -34 -14 70 283 -158 43 106 -178 -45 -108 244 6 163 126 31 -23 90 -163 302 121 -102 -91 49
5708 49 218 -10 -234 75 11 41 47 -90 -85 74 -65 -30 64 -95 -183 -14 82 26 60 -50 -42 170 322 96 -37
5733 -37 95 120 152 72 46 72 -27 147 -186 -79 158 53 -14 165 212 -183 256 37 -19 32 -119 -73 29 158
5757 158 -114 10 -110 99 -53 31 -6 123 93 42 191 -19 -39 -101 41 -10 91 -164 -24 -23 -222 -109 11
$$ packed form
5636D9J51Mj72K12k68n1L2K05J4j72j55j38M6J29J22J3r7k9M8J09J09k19O8r6
5660h6P2k20K33j32J30J6j95K39pl6j92L60P9j56K0l2k5j61mNl53M06j25j18M77
5685A95k29K0Q4K13m41K01O3k84J33o3L52k38J57l7r5n4J13k53M65j81k23J1J40
5708D9J69k28k24L09o4L0Oj37NJ59j39L5R4j59q8J69R6n6L4j10QK12J52k26j33
5733c7J32K5L2q0k6K6r9J74l33J07K37j05o7J79M7l95M39k19n6N1j51M6J02J29
5757A58k72J24j20K09j52Q4l7J29l0n1J49k10k0o2J42n1J01k55J40Jj99J13J20
$$ [...]
8191B52
##END NTUPLES=NMR FID
##END=
