##TITLE=1H_Ser 5311-N
 200.13MHz, CDCl3,
 8 sc
 
 5.8.2025
##JCAMPDX= 6.0         $$ Bruker NMR JCAMP-DX V2.0
##DATA TYPE= NMR FID
##DATA CLASS= NTUPLES
##ORIGIN= UXNMR, Bruker Analytische Messtechnik GmbH
##OWNER= pz
$$ XWIN-NMR		Version 3.5
$$ Tue Aug  5 16:14:35 2025 Russian Standard Time (UT+4h)  she@DPX200
##.OBSERVE FREQUENCY= 200.1313
##.OBSERVE NUCLEUS= ^1H
##.DELAY= (6, 6)
##.ACQUISITION MODE= SIMULTANEOUS
##.ACQUISITION SCHEME= undefined
##.AVERAGES= 8
##.DIGITISER RES= 18
##SPECTROMETER/DATA SYSTEM= spect
##.PULSE SEQUENCE= zg30
##.SOLVENT NAME= CDCl3
##.SHIFT REFERENCE= (INTERNAL, CDCl3, 0, 14.3821)
##AUDIT TRAIL= $$ (NUMBER, WHEN, WHO, WHERE, WHAT)
$$ ##TITLE= Audit trail, XWIN-NMR		Version 3.5
$$ ##JCAMPDX= 5.01
$$ ##ORIGIN= Bruker BioSpin GmbH
$$ ##OWNER= she
$$ F:/spectra/data/she/nmr/H-C/1/audita.txt
$$ ##AUDIT TRAIL=  $$ (NUMBER, WHEN, WHO, WHERE, WHAT)
(   1,<2025-08-05 16:12:27.15 +0400>,<she>,<DPX200>,
      <created by zg, POWCHK disabled, PULCHK disabled
       configuration hash MD5:
       00 E9 B6 7A A2 85 ED C7 34 08 36 98 17 FE 4E 26
       data hash MD5: 16K
       3E C3 48 F0 D7 E3 B3 C1 80 53 0D C7 3C 40 FF 7E>)
$$ ##END=
$$ 
$$ hash MD5
$$ 77 3C 65 B3 BD AF 92 49 7F 79 B9 07 A9 FE 2B 23
##$RELAX= 
##$RELAX= 
##$RELAX= 
##$RELAX= 
##$RELAX= 
##$RELAX= 
$$ Bruker specific parameters
$$ --------------------------
##$DU= <F:/spectra>
##$EXPNO= 1
##$NAME= <H-C>
##$PROCNO= 1
##$TYPE= <nmr>
##$USER= <she>
##$AMP= (0..31)
100 100 100 100 100 100 100 100 100 100 100 100 100 100 100 100 100 100 
100 100 100 100 100 100 100 100 100 100 100 100 100 100 
##$AQSEQ= 0
##$AQ_mod= 1
##$AUNM= <au_zg>
##$AUTOPOS= <>
##$BF1= 200.13
##$BF2= 200.13
##$BF3= 200.13
##$BF4= 200.13
##$BF5= 200.13
##$BF6= 200.13
##$BF7= 200.13
##$BF8= 200.13
##$BYTORDA= 1
##$CFDGTYP= 0
##$CFRGTYP= 5
##$CHEMSTR= <none>
##$CNST= (0..31)
1 1 145 1 1 1 1 1 1 1 1 1 1 1 1 1 1 1 1 1 1 1 1 1 1 1 1 1 1 1 1 1 
##$CPDPRG= <>
##$CPDPRG1= <>
##$CPDPRG2= <>
##$CPDPRG3= <>
##$CPDPRG4= <mlev>
##$CPDPRG5= <mlev>
##$CPDPRG6= <mlev>
##$CPDPRG7= <mlev>
##$CPDPRG8= <mlev>
##$CPDPRGB= <>
##$CPDPRGT= <>
##$D= (0..31)
0 0.7 0 0 0 0 0 0 0 0 0 0.03 0 0 0 0 0 0 0 0 0 0 0 0 0 0 0 0 0 0 0 0 
##$DATE= 1754395946
##$DBL= (0..7)
120 120 120 120 120 120 120 120 
##$DBP= (0..7)
150 150 150 150 150 150 150 150 
##$DBP07= 0
##$DBPNAM0= <>
##$DBPNAM1= <>
##$DBPNAM2= <>
##$DBPNAM3= <>
##$DBPNAM4= <>
##$DBPNAM5= <>
##$DBPNAM6= <>
##$DBPNAM7= <>
##$DBPOAL= (0..7)
0.5 0.5 0.5 0.5 0.5 0.5 0.5 0.5 
##$DBPOFFS= (0..7)
0 0 0 0 0 0 0 0 
##$DE= 6
##$DECBNUC= <off>
##$DECIM= 32
##$DECNUC= <off>
##$DECSTAT= 4
##$DIGMOD= 1
##$DIGTYP= 9
##$DL= (0..7)
0 120 120 120 120 120 120 120 
##$DP= (0..7)
150 150 150 150 150 150 150 150 
##$DP07= 0
##$DPNAME0= <>
##$DPNAME1= <>
##$DPNAME2= <>
##$DPNAME3= <>
##$DPNAME4= <>
##$DPNAME5= <>
##$DPNAME6= <>
##$DPNAME7= <>
##$DPOAL= (0..7)
0.5 0.5 0.5 0.5 0.5 0.5 0.5 0.5 
##$DPOFFS= (0..7)
0 0 0 0 0 0 0 0 
##$DQDMODE= 0
##$DR= 18
##$DS= 0
##$DSLIST= <SSSSSSSSSSSSSSS>
$$ [...]
##$SUBNAM0= <"">
##$SUBNAM1= <"">
##$SUBNAM2= <"">
##$SUBNAM3= <"">
##$SUBNAM4= <"">
##$SUBNAM5= <"">
##$SUBNAM6= <"">
##$SUBNAM7= <"">
##$SUBNAM8= <"">
##$SUBNAM9= <"">
##$SW= 18.0517328524113
##$SWIBOX= (0..15)
0 0 2 0 0 0 0 0 0 0 0 0 0 0 0 0 
##$SW_h= 3612.71676300578
##$TD= 16384
##$TD0= 1
##$TE= 0
##$TE2= 300
##$TE3= 300
##$TEG= 300
##$TL= (0..7)
0 120 120 120 120 120 120 120 
##$TP= (0..7)
150 150 150 150 150 150 150 150 
##$TP07= 0
##$TPNAME0= <>
##$TPNAME1= <>
##$TPNAME2= <>
##$TPNAME3= <>
##$TPNAME4= <>
##$TPNAME5= <>
##$TPNAME6= <>
##$TPNAME7= <>
##$TPOAL= (0..7)
0.5 0.5 0.5 0.5 0.5 0.5 0.5 0.5 
##$TPOFFS= (0..7)
0 0 0 0 0 0 0 0 
##$TUNHIN= 0
##$TUNHOUT= 0
##$TUNXOUT= 0
##$USERA1= <user>
##$USERA2= <user>
##$USERA3= <user>
##$USERA4= <user>
##$USERA5= <user>
##$V9= 5
##$VALIST= <valist>
##$VCLIST= <CCCCCCCCCCCCCCC>
##$VD= 0
##$VDLIST= <DDDDDDDDDDDDDDD>
##$VPLIST= <PPPPPPPPPPPPPPP>
##$VTLIST= <TTTTTTTTTTTTTTT>
##$WBST= 1024
##$WBSW= 4
##$XGAIN= (0..3)
0 0 0 0 
##$XL= 0
##$YL= 0
##$YMAX_a= 245519
##$YMIN_a= -363002
##$ZGOPTNS= <>
##$ZL1= 120
##$ZL2= 120
##$ZL3= 120
##$ZL4= 120
##$ABSF1= 10
##$ABSF2= 0
##$ABSG= 5
##$ABSL= 3
##$ALPHA= 0
##$AQORDER= 0
##$ASSFAC= 0
##$ASSFACI= 0
##$ASSFACX= 0
##$ASSWID= 0
##$AUNMP= <proc_1d>
##$AZFE= 0.1
##$AZFW= 0.1
##$BCFW= 1
##$BC_mod= 2
##$BYTORDP= 1
##$COROFFS= 0
##$CY= -3
##$DATMOD= 1
##$DC= 2
##$DFILT= <>
##$DTYPP= 0
##$F1P= 0
##$F2P= 0
##$FCOR= 0.5
##$FTSIZE= 0
##$FT_mod= 4
##$GAMMA= 1
##$GB= 0.15
##$INTBC= 1
##$INTSCL= 1
##$ISEN= 128
##$LB= 0.25
##$LEV0= 0
##$LPBIN= 0
##$MAXI= 10000
##$MC2= 0
##$MEAN= 0
##$ME_mod= 0
##$MI= 1.114404
##$NCOEF= 0
##$NC_proc= 0
##$NLEV= 6
##$NOISF1= 3.799351
##$NOISF2= 2.8
##$NSP= 1
##$NTH_PI= 0
##$NZP= 0
##$OFFSET= 14.38212
##$PC= 1
##$PHC0= -1201.031
##$PHC1= 12.5923
##$PH_mod= 1
##$PKNL= yes
##$PPARMOD= 0
##$PSCAL= 0
##$PSIGN= 0
##$REVERSE= no
##$SF= 200.129724274929
##$SI= 16384
##$SIGF1= 3
##$SIGF2= 2
##$SINO= 400
##$SIOLD= 16384
##$SREGLST= <1H.CDCl3>
##$SSB= 0
##$STSI= 0
##$STSR= 0
##$SW_p= 3205.1282051282
##$SYMM= 0
##$S_DEV= 0
##$TDeff= 0
##$TDoff= 0
##$TI= <>
##$TILT= no
##$TM1= 0
##$TM2= 0
##$TOPLEV= 0
##$USERP1= <user>
##$USERP2= <user>
##$USERP3= <user>
##$USERP4= <user>
##$USERP5= <user>
##$WDW= 1
##$XDIM= 8192
##$YMAX_p= 0
##$YMIN_p= 0
$$ End of Bruker specific parameters
$$ ---------------------------------
##NTUPLES= NMR FID
##VAR_NAME=  TIME,          FID/REAL,        FID/IMAG
##SYMBOL=    X,             R,               I
##VAR_TYPE=  INDEPENDENT,   DEPENDENT,       DEPENDENT
##VAR_FORM=  AFFN,          ASDF,            ASDF
##VAR_DIM=   8192,          8192,            8192
##UNITS=     SECONDS,       ARBITRARY UNITS, ARBITRARY UNITS
##FACTOR=    0.0002768,     1,               1
##FIRST=     0,             0,               0
##LAST=      2.2672688,     0,               0
##MIN=       0,             -363002,         0
##MAX=       2.2672688,     245519,          0
$$ Real data points
##PAGE= N=1
##DATA TABLE= (X++(R..R)), XYDATA
0@%%%%%%%%%%%%%kJ0j6J6j6J6k4L2l2M0m8N4o2P2q5R6j09J25j43J60j78K02k27
$$ 0 0 0 0 0 0 0 0 0 0 0 0 0 0 -2 8 -8 8 -8 8 -16 16 -16 24 -24 30 -32 40 -45 51 -58 67 -76 84 -94 108 -119
36a19K52k80L13l51L88m27M71n22N77o34O98p70Q49r34J027j130J247j380J527
$$ -119 133 -147 166 -185 203 -224 247 -275 302 -332 366 -404 445 -489 538 -592 655 -725 802
55H02j694J888k113K377k694L082l569M202n052O250q064J1083j6934L2048j42217
$$ 802 -892 996 -1117 1260 -1434 1648 -1921 2281 -2771 3479 -4585 6498 -10436 21612 -120605
70a20605k42397M13623J65589k41429Q368J70896q4310j09804J28079j0399j92238
$$ -120605 -363002 50621 216210 -25219 -16851 154045 69735 -40069 88010 77611 -114627
81a14627M0975J48526j24659n0765J55761l2127j29194R9041Q6921j31541m7895
$$ -114627 -73652 74874 -49785 -100550 55211 23084 -106110 -7069 79852 -51689 -99584
92i9584J43397Q363j22844J02817J09382j63179o1504J76237k3999j42960O7842
$$ -99584 43813 52176 -70668 32149 141531 -21648 -83152 93085 69086 -73874 -6032
103f032P8310j30391l8821J71157q055j98048P3149J84761j27840j17497J56235
$$ -6032 72278 -58113 -96934 74223 66168 -131880 -58731 126030 -1810 -119307 36928
114C6928N7118j45577r828J17609j7593r1567N1784M6046p0637K0764P2370q2519
$$ 36928 94046 -51531 -61359 56250 38657 -52910 -1126 44920 -25717 -4953 67417 -15102
126a5102l3466R6795j6963r5857N2223P8749q3675p5784J13719M0980j27413K0941
$$ -15102 -48568 48227 31264 -64593 -12370 66379 -17296 -93080 20639 61619 -65794 -44853
138d4853J24084p4507p7223J05347L7818j03330n318Q5240l2661o6741P9974L0475
$$ -44853 79231 4724 -72499 32848 70666 -32664 -37982 47258 14597 -52144 27830 58305
150E8305j17731K1783J21255o1712r5734O5491M9893n8895j6046N4841k0080n0731
$$ 58305 -59426 -37643 83612 21900 -73834 -8343 41550 -17345 -33391 21450 1370 -49361
162d9361N5992L3474o7748J4183N8344m9783j8965P1825q789p9373J6332P2808
$$ -49361 6631 40105 -27643 -13460 44884 -4899 -23864 47961 39172 -40201 -23869 48939
174D8939l6224o7561N8381L3752p9449O930P4240l7945n4778M2084L9657k7867
$$ 48939 12715 -54846 3535 37287 -42162 -35232 39008 1063 -53715 -11631 28026 159
186A59j5096L6978Q18l0153L2500J0642o0180N080M9669k5105l4876K2681K2592
$$ 159 -14937 22041 22859 -7294 25206 35848 -24332 -19252 30417 5312 -29564 -6883 15709
199A5709k5792k3021K8027Q035l0290K3057K9328k7896L636L3083j4845k4444
$$ 15709 -10083 -33104 -5077 2958 -27332 -4275 25053 -2843 793 33876 19031 -5413
211e413J2868J2725k9379j9449M2476N620n1129K1313M2012m2434k5505L8171
$$ -5413 7455 20180 -9199 -28648 13828 19448 -31681 -10368 31644 -10790 -36295 1876
223A876J0056k9820J120L6108o571l1260K6240J3647l6901J5683K5906l5399o055
$$ 1876 11932 -17888 -16768 19340 12769 -18491 7749 21396 -15505 178 26084 -9315 -15370
236a5370L8586m417l4397O524L1338k1740l3985L4747J1923m1752J8691L2925
$$ -15370 23216 18799 -15598 -9074 22264 524 -33461 1286 13209 -28543 -9852 23073
248B3073l1094r185K9675j574k2372R516K4881k0851k0097L9423J749m8099J9886
$$ 23073 -8021 -17206 12469 10895 -11477 -1961 22920 2069 -18028 21395 23144 -24955 -5069
261e069L2652l3897j6820K6052O879k0349n187K0654o219j7521K4783N398k4725
$$ -5069 27583 -6314 -23134 2918 9797 -10552 -15739 4915 -1304 -18825 5958 11356 -13369
274a3369K0074J5083k7828j3K1454n632k0469L800K3080j4162k4387K8488J0080
$$ -13369 6705 21788 -6040 -6053 15401 9769 -10700 -6900 16180 2018 -22369 6119 16199
287A6199l1929Q209J7815j6877n217J3857K640j1463K33K0196r318j8824K7101
$$ 16199 -15730 -7521 10294 -6583 -11800 2057 4697 -6766 -6533 13663 4345 -14479 12622
300A2622N546l1795J1466K1921j8907j3545J2407J0720j3926j1355J7213k591
$$ 12622 18168 -13627 -2161 19760 853 -12692 -285 10435 -3491 -14846 2367 -224
312b24j5668J9711J207k2531J7707J5846j9119k233J7668R99j9270Q98K2372j5458
$$ -224 -15892 3819 5026 -17505 202 16048 -3071 -5304 12364 13363 -5907 -5009 17363 1905
326A905k1389K7847O327k7492O881J2416j2135k750P303r43p415O963J4755j5628
$$ 1905 -19484 8363 14690 -12802 -5921 6495 -5640 -8390 -1087 -2030 -9445 -2482 12273 -3355
340c355q902K6150n467k2148J7855J0559j6084j88J0531j557j0416J44P132j1559
$$ -3355 -12257 13893 8426 -13722 4133 14692 -1392 -1580 8951 7394 -3022 -2878 4254 -7305
354g305k200J6629j3491j1717K3612M41j7523P855J2088m836o708Q470Q835j4596
$$ -7305 -9505 7124 -6367 -18084 5528 5969 -11554 -3699 8389 3553 -3155 5315 14150 -446
368d46l135J6510r122j1208J0350m493n624J0646l374j1064K666J0619J56j5417
$$ -446 -3581 12929 3807 -7401 2949 -1544 -7168 3478 104 -10960 -8294 2325 2481 -12936
382a2936N448J9061j0783o094J6028k437q584N140m65l390j946J041P63q331M021
$$ -12936 -7488 11573 790 -5304 10724 8287 -297 4843 4378 988 -958 83 846 -7485 -3464
397c464Q403j2652k91J6560p150q634Q581L543o499o154O774P320r578J281J2413
$$ -3464 4939 -7713 -8004 8556 1406 -7228 1353 4896 -1603 -7757 -983 6337 -3241 -1960 10453
412A0453o830l087Q969p316n246N915k072p081j882Q905Q68j7456O319J9927j1021
$$ 10453 3623 536 9505 2189 -3057 2858 786 -6295 -8177 728 1596 -15860 -9541 10386 -635
427f35q301J2451K146l732J728J734k274n235O383M100j2419K639R037j3252j709
$$ -635 -8936 3515 5661 1929 3657 5391 3117 -2118 4265 8365 -4054 -1415 7622 -5630 -7339
442g339J3098p024j0630N360R058k506r732R204J0313j2625O69J2883o028l581
$$ -7339 5759 -1265 -11895 -6535 2523 17 -9715 -511 9802 -2823 -2154 10729 4701 1120
456A120M830l807k548K039J05m510o783R858P232j5116N48J4127o559p988M506
$$ 1120 5950 2143 -405 1634 1739 -2771 -9554 304 7536 -7580 -7032 7095 536 -7452 -2946
471b946L172j758n060M663Q401o122K034Q235q093q42Q356n891o812J648K132
$$ -2946 226 -1532 -6592 -1929 6472 350 2384 10619 2526 1684 10040 4149 -2663 -1015 1117
486A117k996p313O941N490j6434J106J9524n948j0853Q848P159l684l684O652
$$ 1117 -1879 -9192 -2251 3239 -13195 -12089 7435 1487 -9366 -518 6641 2957 -727 5925
500E925K409j1649M528R745j4030o2J5135j1540j2179J2617O281j5002o519J5567
$$ 5925 8334 -3315 1213 10958 -3072 -3134 12001 461 -11718 899 7180 -7822 -14341 1226
514A226L341j7875Q917J6447j6629l990K0453n093j3796R450Q272j0861m581J3866
$$ 1226 4567 -13308 -4391 12056 -4573 -8563 11890 6797 -6999 2451 10723 -138 -4719 9147
528I147k313j9565J3136J5511k3237n891K3896o564k0034Q894J3825j0208j0361
$$ 9147 6834 -12731 405 15916 -7321 -13212 10684 4120 -15914 -7020 6805 -3403 -13764
541a3764J6236N190j5716J1153J4446k1242l943K2431n457j8445Q561J2025j4506
$$ -13764 2472 7662 -8054 3099 17545 -3697 -7640 14791 9334 -9111 -550 11475 -3031
554c031j0589J9094J831k6008Q432K2184j5576p719J9238O8j4942O715J2675j2192
$$ -3031 -13620 5474 7305 -18703 -10271 11913 -3663 -11382 7856 7924 -7018 -303 12372 180
568A80j0749J8757L791k3450R078J8195k0446r059K2421k40k1603L916J9824r113
$$ 180 -10569 8188 11979 -11471 -2393 15802 -4644 -13703 8718 8478 -13125 -9209 10615 1502
582A502j6265J7554P302k1557P549J8886j7500q843K1011P53k0647N080J9679
$$ 1502 -14763 2791 10093 -11464 -3915 14971 -2529 -11372 9639 10392 -10255 -5175 14504
595A4504j2315j6266J9969O349k5578P264K1274j7178j2514J8710L843j7634K333
$$ 14504 2189 -14077 5892 12241 -13337 -6073 15201 -1977 -14491 4219 8062 -9572 -7239
608g239J7092r546j2333J9724M371k3662Q524J9255j6342j1232J8414L379j8864
$$ -7239 9853 307 -12026 7698 12069 -11593 -3069 16186 -156 -11388 7026 10405 -8459
621h459P31J7536q820j5816J6331O568j8859O258J6254j2550q094J4766K323j6124
$$ -8459 -7728 9808 988 -14828 1503 8071 -10788 -4530 11724 -826 -8920 5846 8169 -7955
635g955J969J7080p249j3648J5720N446j9615L233J5325j0533j0648J1123O209
$$ -7955 -5986 11094 3845 -9803 5917 11363 -8252 -5019 10306 -227 -10875 248 6457
648F457j1939k662J3448l944j2117J3195N832j4870M193J4218p877j0898Q181
$$ 6457 -5482 -8144 5304 1360 -10757 2438 8270 -6600 -2407 11811 3934 -6964 1217
661A217P909j1274n461J4338j720j4578Q838P406j3504j95J1643m084q421O833
$$ 1217 9126 -2148 -7609 6729 5009 -9569 -731 6675 -6829 -7024 4619 535 -7886 -1053
675a053Q871r514m934J4679j846j4738J0034R637j3335k433J2139k768j2114K802
$$ -1053 7818 -1696 -6630 8049 6203 -8535 1499 11136 -2199 -4632 7507 4739 -7375 -4573
689d573J0353q260p874J3281J588j2802Q048P765j1611r63J1342j923j0731M358
$$ -4573 5780 -2480 -10354 2927 4515 -8287 -239 7526 -4085 -5048 6294 4371 -6360 -2002
703b002J1837q037q759J2715M56j3983N762P746r139l084Q844J215q761R93R634
$$ -2002 9835 1798 -6961 5754 6210 -7773 -2011 5735 -3404 -6488 2356 3571 -5190 -4197 5437
718E437o015p049J1852J214j1834N903R214p618n374O686L353q710k128J0139
$$ 5437 -578 -7627 4225 5439 -6395 -492 8722 1104 -4270 2416 5769 -2941 -5069 5070
732E070l033r362Q519L295j0557J864P589m275m116N999M661q479k194J2416l148
$$ 5070 2037 -7325 1194 4489 -6068 -4204 3385 -890 -5006 993 5654 -2825 -5019 7397 4249
747D249j0989Q628N465j0122j5Q297l365p147M107O179q242m945J1598j584r655
$$ 4249 -6740 1888 7353 -2769 -2784 5513 2148 -4999 -892 5287 -2955 -7900 3698 2114 -7541
762g541Q069M417r799J643R232k937p831M601Q358q382n008J0592j231j0067O378
$$ -7541 528 4945 -4854 -3211 6021 3084 -4747 -146 8212 -170 -5178 5414 4183 -5884 494
777D94M312r193L00P167k081o348L337O535p255l090J1169k316r425P629N063
$$ 494 4806 -4387 -4087 3080 999 -5349 -2012 4523 -2732 -5822 5347 3031 -6394 1235 6298
792F298p480n56N820r12n501J862N024o242l626Q020k005o382N666K320n806J280
$$ 6298 -1182 -1738 4082 3170 -2331 -469 4555 -1687 -5313 2707 702 -5680 -14 2306 -3500 -2220
808b220N160j229n028K175O473n160m234P460k69n125L430J472l704l68K600m00
$$ -2220 2940 1711 -3317 -1142 5331 171 -4063 3397 3128 -1997 1433 2905 -799 -1167 1433 1033
824A033m092J51M511k959k715N331o21m385L555K621k257q47K824K022l087k008
$$ 1033 -3059 -2908 1603 -1356 -4071 1260 639 -3746 -191 2430 173 -674 2150 4172 1085 -923
840i23L770k487k902L898p97k970K211O09j890r75J579J516l252N5N072j439k554
$$ -923 2847 360 -2542 1356 559 -2411 -200 409 -1481 -2456 -877 639 -2613 -2558 2514 1075 -1479
857a479M001M01j946K68l25j55L4p21L13k204l91K438j869q94K679j038n30K438
$$ -1479 2522 2923 977 1245 920 765 799 78 391 -1813 -2204 234 -1635 -2529 150 -888 -1418 1020
875A020q96J59K08l56J626r08j510J123J27P08m1k655J668J035l051O41J374k184
$$ 1020 124 283 491 135 1761 853 -657 466 593 1301 1260 -1395 273 1308 -1743 -1102 272 -1912
893a912N88J301p33J90M99O72p58j203L474k85l542L066J866m216Q90J645j705
$$ -1912 -1324 -23 -756 -566 -67 605 -153 -1356 2118 1833 -1709 1357 3223 -993 -103 1542 -163
910a63j220J109J332k104j634L696j034l722L779J253m018K833K368k812o45K683
$$ -163 -1383 -274 1058 -1046 -2680 1016 -18 -3740 39 1292 -2726 107 2475 -337 -982 1701
926A701J611l500j274M497j400l946L497j26l689K041J618k635r43K233J376k916
$$ 1701 3312 -188 -1462 3035 1635 -2311 1186 1060 -2629 -588 1030 -1605 -2548 -315 1061 -1855
942a855n67M140j844k471M449P23l870J689K505j757j178P02J205k235j060L113
$$ -1855 -2422 1718 -126 -2597 1852 2575 -1295 394 2899 1142 -36 666 1871 -364 -1424 1689
958A689j586l346L264j6l161J480J882j229o41J738L047k433k032M748n69l934
$$ 1689 103 -3243 21 5 -3156 -1676 206 -1023 -1664 74 3121 688 -1344 3404 2835 -1099
974a099K525O98k645L47Q75j379j587N96K733k860j775M676o87l099L769Q15l095
$$ -1099 1426 2124 -521 -174 701 -678 -2265 -1669 1064 -1796 -3571 1105 418 -2681 1088 1903 -1192
991a192J064K386k89k262K37K834k678k006L661j639l003L128L86l007M78K453
$$ -1192 -128 2258 1969 -293 -56 2778 100 -1906 1755 116 -2887 241 627 -2380 -1902 551
1007E51k0j845O27K557k093j505L969j180k718K664K71j667J034K85m47j091M52
$$ 551 531 -1314 -687 1870 -223 -1728 2241 1061 -1657 1007 1278 -389 645 930 483 -608 -156
1024a56J219j871j123K324j096j461K315n01o85J352J79O7k55l65J545o22q38
$$ -156 1063 -808 -1931 393 -703 -2164 151 -350 -1035 317 496 563 308 -57 1488 866 28
1041B8Q43j078O9Q92j803J78Q92q67R13J39j615J373L22r25M16j38Q10K56j011
$$ 28 871 -207 -138 754 -1049 -871 21 -846 67 206 -1409 -36 286 -639 -223 -361 449 705 -306
1060c06J375J63k058J762N81k022L19M31p29l04r0Q24m23r53K101j67j854J683
$$ -306 1069 1232 -826 936 1517 -505 -186 245 -484 -788 -878 -54 -477 -1430 671 504 -1350 333
1078C33O20j865Q76J089o46l70J33J400r76j506J793l11j948J512L22k325R69
$$ 333 953 -912 -36 1053 407 37 170 1570 594 -912 881 570 -1378 134 456 -1869 -900
1095i00N94l5p54J8J928m94j291K065J18j900J743P30j618k55M67L11p84j250
$$ -900 -306 -341 -1095 -1077 851 357 -934 1131 1249 -651 1092 1822 204 -51 416 727 -57 -1307
1113a307J812n13j769K055K42k255Q90J593q64q59R81J591j465o89K672q88k699
$$ -1307 505 -8 -1777 278 520 -1735 -845 748 -116 -975 6 1597 132 -557 2115 1227 -1472
1130a472K251Q75k293J0J352r63p61N20J201j535j215K922l20k536K547Q77k421
$$ -1472 779 1654 -639 -629 723 -240 -1001 -481 720 -815 -2030 892 572 -1964 583 1460 -961
1147i61J052J620q73j285R52J404j739j922K647n82k366K242L63k282J233P89
$$ -961 91 1711 838 -447 505 1909 170 -1752 895 313 -2053 189 552 -1730 -497 292
1163B92m21q47M84J835j317j030K330m38j619J630O54j840J61O56N3r76p78J488
$$ 292 -129 -976 -492 1343 26 -1004 1326 888 -731 899 1553 -287 -126 530 583 -393 -1171 317
1181C17m43j618J984O0j666J234P06r99J78M25R11r43p57K288o50k312J657J307
$$ 317 -126 -1744 240 300 -1366 -132 574 -425 -247 178 1089 146 -611 1677 1027 -1285 372 1679
1199A679k344K48R49m85j005k2J591j317j661L107r9k304J690J463j678J79J435
$$ 1679 -665 -417 532 47 -958 -980 611 -706 -2367 740 641 -1663 27 1490 -188 -9 1426
1216A426l76j471mK883k124k104K770L15l044J118J674j955n97J952J27k308P79
$$ 1426 1050 -421 -425 2458 334 -1770 1000 1315 -1729 -611 1063 -892 -1489 463 590 -1718 -939
1233i39K452j435k088L386M03l098J470K100j957j287J873O67k816q0K697j484
$$ -939 1513 78 -2010 1376 1779 -1319 151 2251 294 -993 880 1547 -1269 -1349 1348 -136
1249a36k384L249M37l146J519J581j361j162K089P47k161m11L556j724k362K897
$$ -136 -2520 729 1166 -1980 -461 1120 -241 -1403 686 1433 -728 -1139 2417 693 -1669 1228
1265A228P87l207M08K102j034j886J236J379k163p96L508j144k697L121J161k731
$$ 1228 2015 -1192 -784 1318 284 -1602 -366 1013 -1150 -1946 1562 418 -2279 842 2003 -728
1281g28J11K435q22k068J251J988k959j346L615o33l212K385J400k769J71K353
$$ -728 -617 1818 996 -1072 179 2167 -792 -2138 1477 844 -2368 17 1417 -1352 -1181 1172
1297A172o33k360J262K773l123j165M212p96l288K645J663l054q27K974p4l065
$$ 1172 539 -1821 -559 2214 -909 -2074 2138 1342 -1946 699 2362 -692 -1519 1455 1381 -1684
1313a684J115K319k704r70L494q88l571L014J490k861k1K778k37k674J453K416
$$ -1684 -569 1750 -954 -1924 1570 682 -2889 125 1615 -1246 -1267 1511 1274 -1400 53 2469
1329B469k916j353L592n17l061K053R54k021m76J689j63k073R36K712k847q36
$$ 2469 -447 -1800 1792 1275 -1786 267 1221 -800 -1276 413 250 -1823 -887 1825 -1022 -1858
1345a858L313j13k480J446J340j457o97J453M16k324K50J766j707q96K091k25
$$ -1858 1455 1342 -1138 308 1648 191 -506 947 1363 -961 -711 1055 -652 -1548 543 318
1361C18j666J152J223j347n97J078J005k053N2K295r99j707K124J52j305J22Q25
$$ 318 -1348 -196 1027 -320 -917 161 1166 -887 -835 1460 461 -1246 878 1030 -275 -153 672
1378F72N1j508M80P54j255j70J887j236j486K243J11j369M66Q40L08j379M46J473
$$ 672 723 -785 -305 449 -806 -976 911 -325 -1811 432 543 -826 -360 480 788 -591 -145 1328
1396A328j150o91J632m47j132Q31J33o76k3L78n00o69L02J457j369l02J757m87
$$ 1328 178 -513 1119 672 -460 371 504 -172 -195 183 -317 -986 -684 773 -596 -898 859 372
1414C72r74Q42L54P8p17J54N79q96l10Q69l12p03J031m79m59K65L99l6o54J77
$$ 372 -602 240 594 672 -45 109 688 -208 -518 351 39 -664 367 -112 -571 -306 93 57 -597 -420
1434d20J044n76j018J465K51j149Q26N98o38m55L37K63p03o18J088n93r53J377
$$ -420 624 48 -970 495 746 -403 423 1021 383 -72 265 528 -175 -793 295 -298 -1251 126
1452A26j49j153P84Q39m58p05Q31O55r37k82J350m88j120J370l7j498M89P80l29
$$ 126 -23 -1176 -392 447 -11 -716 115 770 -167 -449 901 413 -707 663 626 -872 -383 397 68
1471F8p88N35M52j153K37J529j137p39J508K86j039K71O76j94j033M06R96j178
$$ 68 -720 -185 267 -886 -649 880 -257 -996 512 798 -241 30 706 512 -521 -115 881 -297
1489b97m32J360m09q95J049j13r64M26O45k68r39N89J267j211l32J370l00p03
$$ -297 -729 631 222 -673 376 263 -701 -275 370 102 -837 -248 1019 -192 -524 846 546 -157
1507a57N45N77j059r3P58l7r50R9J037j198j45Q15l64q64J218K66p50k29P04M65
$$ -157 388 965 -94 -187 571 534 -416 -317 720 -478 -623 192 -172 -1036 182 448 -302 -531 173 638
1527F38j068K41J303q68n06Q07l6j017L91K77m66l48R70k79j248P35J628j599
$$ 638 -430 -189 1114 246 -260 547 511 -506 -115 162 -304 -652 318 39 -1209 -474 1154 -445
1545d45m58J447m17j16J14L52m6n12L61M50j165K79O92p72l91Q48l35o35N70N75
$$ -445 -903 544 127 11 125 477 431 -81 280 730 -435 -156 536 -236 -627 221 -114 -749 -179 396
1565C96p06l61O05O28r96J4P14j26l89O21l88K9K53%r6K2n91L31m87PP54p17p8
$$ 396 -310 -671 -66 562 -434 -420 294 168 -221 400 12 41 294 294 198 220 -371 -40 -527 -520 234 -483 -561
1588e61Q11l73R1k06j40Q97k76k35N91m32k03L03k36j8k17P9K99l13k17N98p12
$$ -561 250 -123 -32 -238 -378 519 243 8 599 167 -36 267 31 13 -204 -125 174 -139 -356 242 -470
1609d70j24R48n19n05O27K97J20m63K31N53o37l86R57m36l50L62k95p4j8K23n38
$$ -470 -594 354 -165 -670 -43 254 374 -89 142 695 58 -328 629 193 -157 205 -90 -164 -182 41 -497
1630d97KM35K50p94J82Q78o01j52O76K24k03Ql10L6j33k13O01p16P6J053q29o02
$$ -497 -495 -60 190 -604 -422 456 -145 -297 379 603 400 408 98 134 1 -212 389 -327 -251 802 -27 -629
1652f29P71k1o44J78L45L64p35K06R07o76j29K50k81J00K54k63o8J89l89M71l32
$$ -629 142 121 -523 -345 0 364 -371 -165 742 66 -63 187 -94 6 260 -3 -71 118 -271 200 -132
1673a32l11P30o21k51Q66k59m73O76l9J89o27J43M90q4l12M25l68j80L14j76k51
$$ -132 -443 287 -334 -585 281 22 -451 225 186 375 -252 -109 381 297 -15 410 42 -138 176 0 -251
1694b51J86K10m44l05Q00ro70k50J129j00m56K34p4K64j06q0P5N0l11J76j55J72
$$ -251 -65 145 -299 -604 196 187 -483 -733 396 296 -160 74 0 264 158 78 153 203 -108 68 -87 85
1716H5J98k62k61L33k6k96o1M0P64p17m33J028N9k26j33K29P7m22j55N83n25j23
$$ 85 283 21 -240 93 67 -229 -290 -250 514 -203 -636 392 451 225 92 321 398 -24 -179 404 -121 -244
1738b44M95l10r7L59k86n16K89O36l16o54M39O97p14k11J016j23p73O26J06n48
$$ -244 251 -59 -156 203 -83 -599 -310 326 10 -644 -205 492 -222 -433 583 460 -313 313 419 -129
1758a29Q9J54j90o30K21P01q13j42J362j95j222R92O60r66m94J052n0p23K53O84
$$ -129 -40 114 -76 -706 -485 216 -597 -739 623 428 -794 198 858 -108 -602 450 400 -323 -70 614
1778F14p98j44Q75m13q47P82M19j014K48N55j21q58N74Q16r79j32R28j10p95O69
$$ 614 -184 -328 547 134 -713 69 488 -526 -278 277 156 -702 -128 688 -291 -423 505 395 -400 269
1798B69M38n95n58Q25r3p97M33P82j071n70J657m28q33M99O47p09o44Q67M45r81
$$ 269 707 112 -446 379 286 -511 -78 704 -367 -937 720 292 -541 -42 605 -104 -748 119 564 -417
1818d17K10Q33n37n93J054P2r08K89K75n01n13J077q3r62L86R76j107l39J185
$$ -417 -207 626 89 -504 550 622 -286 3 278 -223 -736 341 258 -704 -318 658 -449 -788 397
1837C97J9r46M87M33l05m09O35L82j288M23R27j202j2Q15l72p22L29Q83n13r05
$$ 397 416 -530 -43 390 85 -324 311 693 -595 -172 755 -447 -459 356 -16 -738 -409 474 -39 -944
1857i44J265K11q97J72Q78o40l18P79q1o00K48L87k53p87P03O27j225J78Q98q20
$$ -944 321 532 -365 -193 685 45 -273 506 425 -175 73 460 207 -580 123 750 -475 -297 601 -219
1877b19o95J106J09p68J25Q39m44l75L04N97r90L65P58p52j56O22o7q42K95N53
$$ -219 -914 192 301 -467 -342 497 53 -322 -18 579 -411 -46 712 -40 -196 426 359 -483 -188 365
1897C65j29r38Q18Rl45j98Q01m13m3J76j29j59K98K65l39m55O65M45j060J92N03
$$ 365 236 -702 116 125 -220 -418 383 -30 -73 103 -26 -185 113 378 39 -416 249 694 -366 -174 329
1918C29m48k06K46J62m02k36Q98k68j69j85O65m93r2N30m62j99M49L57o30K33
$$ 329 -119 -325 -79 83 -319 -555 343 75 -94 -279 386 -107 -199 331 -131 -330 119 476 -154 79
1938G9K34k3r77M31O05m70J02Q9J03m19K45N26n91j79K51K11m16M24J05l05k29
$$ 79 313 290 -687 -256 349 -121 -19 70 173 -246 -1 525 -66 -245 6 217 -199 225 330 25 -204
1959b04N79l03n50L05J75J33n96K78N69o93P6L09o2j62j26M69%k64L23k4q02P15
$$ -204 375 72 -478 -173 2 135 -461 -183 386 -307 -231 78 16 -146 -272 197 197 -67 256 232 -570 145
1981A45J16m58q1N01k44k48J80N8R3l94K07K24k98J77N66l67m33M57j85r7L63
$$ 145 261 -197 -278 223 -21 -269 -89 -31 62 -332 -125 99 -199 -22 544 177 -256 201 16 -81 282
2002B82J55m91j48K22K52n97L17J44k36j04K02j02j91OP01m56rL65p4l14J78L97
$$ 282 437 -54 -202 20 272 -325 -8 136 -100 -204 -2 -104 -295 -289 412 -44 -53 312 238 -76 102 499
2024D99o46j69M86j16j90m4L49J18o16M98o7k13L8J18j22K22k59L52j56j06K80
$$ 499 -147 -316 170 54 -136 -180 169 287 -329 169 102 -111 -73 45 -77 145 -114 238 82 -24 256
2045B56l22q7K10J42l02P7K51k62L5m7j64L63j41q5P1K91l17M7L4l17N69m04j58
$$ 256 -66 -153 57 199 -103 -26 225 -37 -2 -49 -213 150 9 -76 -5 286 -31 16 50 -267 302 -102 -260
2068b60K89J92k40K15j96R5n19M43j1P0k17K11r8j31L63N2j53l32K55j20k01L76
$$ -260 29 221 -19 196 0 95 -424 19 8 78 -139 72 -26 -157 206 258 105 -227 28 -92 -293 83
2090H3P9m2J34l32J82k14m0K21k31J84j6J99j91N0j18j83k3J61K77p0J07l64J94
$$ 83 162 120 254 -78 104 -110 -150 71 -160 24 8 207 16 66 -52 -235 -258 -97 180 110 217 -147 47
2113D7j90J71K65l82j58L45l30O27m05l71N85n2j09q5N7p6K6l9M0K27k07l3j21
$$ 47 -143 28 293 -89 -247 98 -232 395 -10 -381 204 152 43 -42 15 -61 -35 -74 -34 193 -14 -47 -168
2136a68L66p1l74M33N1m99M68l47O6R6k15J72J48k56N6j04K38%j58p4J87J44k15
$$ -168 198 127 -247 186 237 -262 206 -141 -75 21 -194 -22 126 -130 -74 -178 60 60 -98 -172 15 159 -56
2159e6q4L1J57M4J97m63N25m01o3j13K83j59M8J51k21K8K72k85J67k78L34l26
$$ -56 -140 -109 48 92 289 -174 351 -50 -113 -226 57 -102 -54 97 -124 -96 176 -109 58 -220 114 -212
2181b12J38M0J70l76m2L46k49Q1K75J33l31l0q9M3K72l96J34j36K99j86l2J58
$$ -212 -74 -34 136 -240 -282 64 -185 -104 171 304 -27 -57 -146 -103 169 -227 -93 -229 70 -116 -148 10
2203A0L4j60J2L4j83J59L36k00l43M52n4l4m5j43K84K78k73k8j40J72q1%NM4j5
$$ 10 44 -116 -104 -70 -253 -94 242 42 -301 151 97 63 18 -125 159 437 164 136 -4 168 87 87 92 136 121
2228A21j71l2J77j41L90l09P0O4l49K53k11J70k28J51j82K60Kj3j71R7m7K09k9
$$ 121 -50 -82 95 -46 344 35 105 169 -180 73 -138 32 -196 -45 -227 33 35 22 -149 -52 -99 110 81
2251H1J20j96m4o6K18k27q1L02q8l93K87K91j11p5m98O32j70r6m8N4k7J33L5l00
$$ 81 201 5 -39 -105 113 -114 -195 107 19 -374 -87 204 93 18 -480 152 -18 -114 -162 -108 -135 -2 33 -267
2275b67J51J36j1k13K34m5l3j00M17m34L61k59J72L4j68Q8k03J83o0j21k00K34
$$ -267 -116 20 9 -204 30 -15 -48 -148 269 -165 196 -63 109 143 -25 63 -140 43 -17 -138 -338 -104
2297a04J54j4J41j82q6M64o30O79m76j98L77j64j53J36j32L05j83K72j82j08m04
$$ -104 50 36 177 -5 -91 373 -257 422 -54 -252 125 -39 -192 -56 -188 117 -66 206 24 -84 -488
2318d88O82j88k88J79J11O6j22K64k28P7J02j01J7o3K12k05Lp7J5k55K18r5R5
$$ -488 194 6 -282 -103 8 74 -48 216 -12 65 167 66 83 20 232 27 30 -47 -32 -287 -69 -164 -69
2341f9K9j48M23k79J73k57J46q3P2l0l2m2K54j75j79K14j10m3J69J3J54l26K69
$$ -69 -40 -188 235 -44 129 -128 18 -65 7 -23 -55 -97 157 -18 -197 17 -93 -136 33 46 200 -126 143
2364A43K46m31q0M83l97k63M01Q0k94N8M63j36m95o8M77m9l22L65q5l69J68L84
$$ 143 389 -42 -122 361 -36 -299 102 182 -112 -54 409 273 -222 -290 187 138 -184 181 96 -273 -105 279
2386B79j66o82L75N84o59L06L21l02K40k33k09K98k59M09l46j25L85k25j16pJ62
$$ 279 113 -569 -194 390 -269 37 358 56 296 63 -146 152 -107 302 -44 -169 216 -9 -125 -132 30
2407C0k30r8K32M81l25k43K50m7pJ03ok49J50q6m2n7J83K26k46PK19k18k02K71
$$ 30 -200 -298 -66 415 90 -153 97 50 43 146 140 -109 41 -45 -87 -144 39 265 19 26 245 27 -175 96
2431I6J67j38jP0pl33J81rk41L00o4o0j2K5M98p93J83L77k29j28j01N33m55q3
$$ 96 263 125 124 194 187 -146 35 26 -215 85 21 -39 -51 -26 472 -321 -138 239 10 -118 -219 314 -141 -224
2455b24L89j40j10M07j84k69K99R1r1m90L40RN4j67L63o2q37O17N01n16j47M03
$$ -224 165 25 -85 322 138 -131 168 259 168 -322 18 27 81 -86 277 215 -622 -5 496 -20 -167 236
2477B36j5j45p2q1j30J39J73K34l65n4L19l16j57J91j03p8J37j4m1J2K40J95l67
$$ 236 221 76 4 -77 -207 -68 105 339 -26 -80 239 -77 -234 -43 -146 -224 -87 -101 -142 -130 110 305 -62
2500f2q7M19l96K8K77r0l3K0J93l21k06K58N11r81K34L74j37k58J62K19k66K44
$$ -62 -149 270 -126 -98 179 89 56 76 269 -52 -258 0 511 -470 -236 138 1 -257 -95 124 -142 102
2522A02J6l0l54N08K12m42o6M00l86j41K3L28k20j24L3K60l69K68K62l60n9L39
$$ 102 118 88 -266 242 454 12 -54 346 -40 -181 -158 170 -50 -174 -141 119 -250 18 280 -80 -139 200
2544B00r8l13K32J54j37r6L47j38n84M10J41k70j90O91k30n73M82J44l9l04J32
$$ 200 102 -211 21 175 38 -58 289 151 -433 -23 118 -152 -342 349 119 -454 28 172 133 -171 -39
2565c9J86l26R3L68m40J42J47k8k86M3N25l72j76J58Q0k98J17k0L6qJ89nr2J35
$$ -39 147 -179 -86 282 -158 -16 131 103 -183 -140 385 13 -163 -5 75 -223 -106 -126 -90 -98 91 86 -6 129
2589A29J07l47k87N74R6m17L13J68n33K90L8q6l19J08L67m9l57Q0L54k74J48J7
$$ 129 236 -111 -398 176 272 -145 168 336 -197 93 131 45 -274 -166 201 152 -205 -125 229 -45 103 120
2611A20j98j5J03L74o44L31J36k50k5K80k50j28k4L72m3j73P0p6k03J46L76m10
$$ 120 -78 -93 10 384 -260 71 207 -43 -68 212 -38 -166 -190 182 139 -34 36 -40 -243 -97 279 -131
2633a31j07N76m27j81L06N85o00l1J46k2J18k02J39p4j85O0K05j17l81M55o9l44
$$ -131 -238 338 -89 -270 36 621 21 -10 136 114 232 30 169 95 -90 -30 175 58 -323 132 63 -281
2655b81K52J47o4l17M16P5j81j47J01q5J25M6k71J91j61J43Q4k63l4J07o2n0L21
$$ -281 -29 118 54 -263 153 228 47 -100 1 -84 41 87 -184 7 -154 -11 73 -190 -224 -117 -179 -229 92
2678I2K0Q5J6n5j48J80J10j34l34L89K8j91r0k9M7P6m86K31L0j52L36r8N0O9k61
$$ 92 112 197 213 158 10 190 300 166 -168 221 249 58 -32 -61 -14 62 -424 -193 -163 -315 21 -77 -27 42 -219
2703b19R2K95J2p3k04M1L27n9l77J43j12O2J51o2K3j28J57j30k84K94N9j17l55
$$ -219 -127 168 180 107 -97 -56 271 212 -165 -22 -134 -72 79 17 40 -88 69 -61 -345 -51 8 -109 -464
2726d64M60K90m08p0M56r1l11K24K97l67k31L49j06k77K02K2k02P0J99j07j73
$$ -464 -4 286 -122 -192 264 173 -138 86 383 16 -215 134 28 -249 -47 -25 -227 -157 42 -65 -238
2747b38K29j9j14q0J99K39n60O22m2m44K67k05L5l4M2K38k90K08K62m48j89K69
$$ -238 -9 -28 -142 -222 -23 216 -344 278 236 -208 59 -146 -111 -145 -103 135 -155 53 315 -133 -322 -53
2769e3N4j38J4K63j11M9k41M06j15Q9j36J15q6l58O0Q8J12j33O0J00j21J1n5j24
$$ -53 1 -137 -123 140 29 78 -163 243 128 217 81 196 110 -248 -188 -100 12 -121 -61 39 -82 -71 -126 -250
2793b50J55J52j00R5O9K9j13j06J00J49k10L65l33P9J46j93j20k31L05j21J82
$$ -250 -95 57 -43 52 121 150 37 -69 31 180 -30 335 2 81 227 34 -86 -317 -12 -133 49
2814D9OK11k61j57L59j08k33K63j70j26K13k62K39k7m23J46J13j1J81j87Q4K78
$$ 49 55 266 5 -152 207 99 -134 129 -41 -167 46 -216 23 -4 -427 -281 -168 -179 2 -185 -101 177
2836A77l61K15Mj68J22j01M5N1o0M7k7L92o5j63m38L76l73J19L71j01j47J97l74
$$ 177 -184 31 35 -133 -11 -112 -67 -16 -76 -29 -56 336 271 108 -330 46 -327 -208 163 62 -85 112 -262
2859b62Q6M04l13K34j19O9k3k4q1K2J63m39M45k60J88O0k54K08L4n25M30k69j02
$$ -262 -176 228 -85 149 30 99 76 52 -29 -7 156 -283 162 -98 90 150 -104 104 138 -387 43 -226 -328
2882c28L04K11k23K93j87q4p5K92J53k53k94K80j66k52K50J47l33J28K70l77J74
$$ -328 -24 187 -36 257 70 -14 -89 203 356 103 -191 89 -77 -329 -79 68 -265 -137 133 -244 -70
2903g0J65K42l04L6L24l10m02L02K53k22J05O0k18j57J30K5k44J02P7j07M4L88
$$ -70 95 337 33 69 393 83 -319 -17 236 14 119 179 -39 -196 -66 -41 -285 -183 -106 -213 -169 219
2925B19j0l90K01K31n76M98L1N4l10k10L79K5p3j27r8Q7l9o4J81k38L03n9k14
$$ 219 209 -181 20 251 -325 173 204 258 -52 -262 117 142 69 -58 -156 -69 -108 -172 9 -229 74 15 -199
2948a99j41M63Q3j65K24m65J84j6L02m0r7q1M32l61j72Q2N9k57K54m2l38L62q
$$ -199 -340 123 206 41 265 -200 -16 -32 270 230 133 52 484 123 -49 33 92 -165 89 47 -291 71 63
2971F3k04j11L97J58l30j42L47j50J72l30K26r6k66R8L71j89L2k5j40M2mK76j82
$$ 63 -141 -252 145 303 -27 -169 178 28 200 -130 96 0 -266 -168 203 14 46 21 -119 -77 -81 195 13
2994A3J69j79J87m63K12L62n35K13L71l98k61O52k26n3k09L63l40k72L44M30r50
$$ 13 182 3 190 -273 -61 301 -234 -21 350 -48 -309 343 117 64 -145 218 -122 -394 -50 380 -570
3015e70M90K27l78o3M96K9m93K42J68j39l5M9L01l04j88L75k1l73J12K73l16o1
$$ -570 -80 147 -231 -294 202 231 -262 -20 148 9 -26 23 324 20 -168 207 186 -187 -75 198 -118 -179
3037a79J75J96n28K51L82q49L72N03j56m23J03J41Q4l48M43J68o47K71J94k90
$$ -179 -4 192 -336 -85 297 -552 -180 323 167 -256 -153 -12 72 -276 167 335 -312 -41 153 -137
3057a37j63K88J52k69K77K01l38k58N87r6n42N35K17l90m38M23K11m37J8L82k03
$$ -137 -300 -12 140 -129 148 349 11 -247 340 244 -298 237 454 64 -374 49 260 -177 -159 223 20
3078B0k04L15J15n62J44L56m11j09Q04l02m29O3M34O3o86L62L52j73l18L74k78
$$ 20 -184 131 246 -316 -172 184 -227 -336 468 166 -263 -200 234 297 -389 -27 325 152 -166 208 -70
3099g0j12M16o5m27K44L05m26m02O36K32n00L7Q19m89l18M03j80qj82O52m19n38
$$ -70 -182 234 169 -258 -14 291 -135 -537 99 331 -169 -132 687 198 -120 283 103 95 -87 565 146 -392
3121c92L51N13o95J78L05k89k06N82j53k59k60J47L38j50r0L63m66M4N36k70j96
$$ -392 -41 472 -223 -45 260 -29 -235 347 194 -65 -325 -178 160 10 -80 283 -183 -139 397 127 -69
3142f9j8L41m87L05J70k8p37O26j82j82NN90j18m23L15O9p1J9J60n4k92J74J11
$$ -69 -87 254 -233 72 242 214 -523 103 -79 -261 -256 334 216 -207 108 177 106 125 285 231 -61 113 224
3165B24p03J63M11k54J08m5M22m78j60L38q2j68M20K26n10O8L04k61J72j96J82
$$ 224 -479 -316 95 -159 -51 -96 326 -152 -312 26 -56 -224 196 422 -88 -20 284 23 195 -1 181
3186A81m19NL20M3o11P17K2m06j33L30J40l33L6K90j66j65N76qo28J3M21k52r5
$$ 181 -238 -233 87 130 -481 236 258 -148 -281 49 189 -144 -108 182 16 -149 427 419 -209 -196 225 -27 -122
3209a22R6L08m65J27M22l81j86M48j63m98J0N96j37j02j31M16j18k15j43K89k87
$$ -122 -26 282 -183 -56 366 -15 -201 247 84 -414 -404 192 55 -47 -178 238 120 -95 -238 51 -236
3230b36K74q6O1o9J71jl29K25L48n85J7J35L03n18L53J41k5k35R3L25l15p6K13
$$ -236 38 -48 13 -56 115 114 -215 10 358 -227 -210 -75 228 -290 63 204 179 -56 37 362 47 -29 184
3253A84j28j20L0J27p4k74O25o80l0N89j17l68K43K25l41K87j61O2j13R1P4q7
$$ 184 56 -64 -34 93 19 -255 370 -310 -340 249 132 -236 7 232 -109 178 17 79 -34 57 131 44
3275D4j98K66J6l00J70K27k91m34P15j76l11L14j27L51l26Q6K61l21j7L66p9m21
$$ 44 -154 112 128 -172 -2 225 -66 -500 215 39 -272 42 -85 266 -60 26 287 -34 -51 315 236 -185
3297a85L36mk98J96J8j22rk8J06J21j66L63k23l62K59l1K1P0mj2K28j63J64l48
$$ -185 151 147 -151 45 63 -59 -68 -96 10 131 -35 328 105 -257 2 -29 -8 62 58 46 274 111 275 -73
3321g3p8J69K17o17L55K0j32k12L62Lk64O9K72j22k66K99j46j50L83O6Pm2K99
$$ -73 -151 18 235 -382 -27 -7 -139 -351 11 14 -250 -181 91 -31 -297 2 -144 -294 89 155 162 120 419
3344D19o7p06R4K17Q7m72M88l5j78L88j70k82N66l22j55K17j9J42j84l06P89n18
$$ 419 352 -354 -260 -43 44 -428 60 25 -153 235 65 -217 349 27 -128 89 70 212 28 -278 511 -7
3366gQ0J87k39r6k03J07N9J12pN0j73P6L08k62L7n1RK14j23m0o6k30N4K89jl8
$$ -7 73 260 21 -75 -278 -171 -112 0 -7 43 -130 -54 254 -8 29 -22 -13 201 78 38 -28 -258 -204 85 84 46
3392D6k26rr9K70J3n2K93k58K50k3j51K13j38j88L51n83K80Mj91N10l02k51L79
$$ 46 -180 -189 -288 -18 -5 -57 236 -22 228 205 54 267 129 -59 292 -291 -11 -7 -198 312 10 -241 138
3415A38k64j06l7J26n3K36K41l08K61n69N66k23K42k48O2j37J58m5J40k32mK4
$$ 138 -126 -232 -269 -143 -196 40 281 -27 234 -335 231 8 250 2 64 -73 85 40 180 -52 -56 -32
3437c2j49K01k4Q3m11N93m09N1K18k17P6O1j6J97k72P2L0l0m2nj43L30l57J71
$$ -32 -181 20 -4 79 -332 261 -148 -97 121 -96 -20 41 25 222 -50 22 52 22 -20 -25 -168 162 -195 -24
3461b4P9l05J46N5J1N5m3Q4k41L40m9j14J53j39o6J78R0l36K46k39J23K51k69
$$ -24 55 -250 -104 -49 -38 17 -26 58 -183 157 108 -6 147 8 -58 120 210 -126 120 -119 4 255 -14
3484a4J19o3j09j09M8O4Q2M6O1k70K35j9k6m1O7k70J53r5J16rn6J12J17k45j04
$$ -14 105 42 -67 -176 -128 -64 18 64 125 -145 90 71 45 4 71 -199 -46 -141 -25 -34 -90 22 139 -106 -210
3509b10J04L0j21j13K45J33J68k48J22o3k3J88l61K07Jj7l65J85O0J25l14K11
$$ -210 -106 -76 -197 -310 -65 68 236 -12 110 47 24 212 -149 58 59 42 -323 -138 -78 47 -267 -56
3531e6M29k88k23M15o8Q3j78L4k9k31m7p5J78L1L44l60J14j5j66O0ok7Q0q2j88
$$ -56 373 85 -138 277 209 292 114 148 119 -112 -159 -234 -56 -25 319 -41 73 58 -108 -48 -54 -81 -1 -83 -271
3556b71K95L2k46M29r4p2L1r8J31j65J33p3n3n6J87l39m9K19j02M9K76j06k34
$$ -271 24 56 -190 239 145 73 104 6 137 -28 105 32 -21 -77 110 -229 -278 -59 -161 -112 164 58 -176
3579a76J72m3K06l41L14J82j31q3J5j53p3J82K01k85k32N84l0n59oL56k46l8K20
$$ -176 -4 -47 159 -182 132 314 183 100 115 -38 -111 71 272 -13 -245 339 309 -250 -256 100 -146 -184 36
3602C6J25p5j57L00p1l67J76J28j32j2k8K59m19J91J39Q4k56q2O6l80K54M78j80
$$ 36 161 86 -71 229 158 -209 -33 95 -37 -49 -77 182 -237 -46 93 177 -79 -161 -95 -475 -221 257 77
3625G7k89M46k59K07J02k70L6J1K16j27j83o0J73k33L2K25J1r5k25K90k74K78
$$ 77 -212 234 -25 182 284 14 50 61 277 150 -33 -93 80 -153 -121 104 115 20 -205 85 -189 89
3647H9J54k11j54J53O8k46n2L06k30k00L22q2Q6RJ20k23N6k02L10l28N3K32j76
$$ 89 243 32 -122 31 99 -147 -199 107 -123 -323 -1 -83 3 12 132 -91 -35 -237 73 -255 -202 30 -146
3670a46L82j73J80k55j36J57Q9k19K00K85l46J10O2k74RQK9N7m2N3K06J2l03L63
$$ -146 236 63 243 -12 -148 9 98 -121 79 364 18 128 190 -84 -75 -67 -38 19 -23 30 236 248 -55 308
3694C08m01m7K21k38M1J85L8j14j92R4J57l87K43N4n6J5K21j9n15J91M90J32m36
$$ 308 -93 -140 81 -157 -116 69 107 -7 -199 -105 52 -335 -92 -38 -94 -79 142 123 -392 -201 289 421 -15
3717a5ON13o12R8j62K82j2j37J65k72J29M5m5r8N3J01j17J24r4J7j43J61K41m9
$$ -15 -9 504 -108 -10 -172 110 98 -39 126 -146 -17 28 -17 -115 -62 39 -78 46 -48 -31 -174 -13 228 179
3741A79j20J24j90j87L30M2k5j59QM6l8o2K09k12j1Q3j5p8n3K03j32rK27m0l00
$$ 179 59 183 -7 -194 136 178 153 -6 2 48 10 -52 157 -55 -66 17 2 -76 -129 74 -58 -67 160 120 -180
3766a80J66J71m18J97K34M9j87l5KP0j27j06J10j1j20L07n7l60J23M38m69j11
$$ -180 -14 157 -261 -64 170 219 32 -3 -1 69 -58 -164 -54 -65 -185 122 65 -295 -172 266 -203 -314
3788c14K15j33L31J04o0j67n8L37k41qN2l6Lp6P4J42k40L39j63l76L69n3n4k55
$$ -314 -99 -232 99 203 143 -24 -82 255 14 6 58 22 25 -51 23 165 -75 264 101 -275 94 41 -13 -268
3812b68K72m7K10j42j13J95j20J38k53l6K47p7j20RP9K34k06k7L39j53l30J24
$$ -268 4 -43 167 25 -88 107 -13 125 -128 -164 83 6 -114 -105 -26 208 2 -25 314 161 -169 -45
3834d5o8L33r8Oj2o5j56n8J69j08OP7K59m13J91l4j92M11l27K16N2N5k60O6N6
$$ -45 -113 220 122 128 116 51 -105 -163 6 -102 -96 -19 240 -173 18 -16 -208 203 -124 92 144 199 -61 5 61
3859F1Q2j84l48L91r3j81J44j05P1J74M9L7n4J7j36J5j60L73l55R5N5K95n9k45
$$ 61 143 -41 -389 2 -91 -272 -128 -233 -162 12 61 98 44 61 -75 -60 -220 153 -202 -107 -52 243 184 -61
3883f1L6m9K23k86J69j71m1J21PO5J04j96q0qM31O0l28k98K86l0q0J27K0r2O9
$$ -61 -25 -74 149 -137 32 -139 -180 -59 -52 13 117 -79 -159 -167 264 324 -4 -302 -16 -46 -126 1 21 -71 -2
3908bK93p1j68J0q7K87k90Q4j1l3J72k01j52J65l5N3k51p2O34n23k8J85n9j1o0
$$ -2 291 220 52 62 -25 262 -28 56 45 12 184 -17 -169 -4 -39 14 -237 -309 325 -198 -226 -41 -100 -111 -171
3933a71K99j11M9k51K01J38m54L65q1Q3j63p0J75jP0j4j13O2l6M9O4l69R4K42
$$ -171 128 17 66 -185 16 154 -300 65 -16 67 -96 -166 9 8 78 64 -49 13 -23 26 90 -279 -185 57
3957E7n7j54%J52R0j15j06K07j22k20K04J79j32n6N6J34K8j62L5KJ39k41Q0P9
$$ 57 0 -154 -154 -2 88 -27 -133 74 -48 -268 -64 115 -17 -73 -17 117 145 -17 18 20 159 -82 -2 77
3981G7pJ02j21j06k12L25j51k2K83j15M5j55J83m35M51l12K22K99n75J64p7p6
$$ 77 70 172 51 -55 -267 58 -93 -115 168 53 98 -57 126 -309 142 -170 52 351 -224 -60 -137 -213
4003b13OL11o3J16l08N05m50K89j31k13K5J2O4J64l48K02l1l8K43k17q1L47j67
$$ -213 -207 104 41 157 -151 354 -96 193 62 -151 -126 -114 -50 114 -234 -32 -63 -101 142 -75 -156 191 24
4026B4n6L5J99j9j8j93J5rR8R3O1n8j17l6r2k97L65O0k5p4k0k69K40K33j99K72
$$ 24 -32 3 202 183 165 -28 -13 -22 76 169 230 172 55 19 -73 -370 -5 55 30 -44 -64 -333 -93 140 -59 213
4052B13L3Ql14Q5j1L7R3J1L8k7q9l5j09%KJ0j63J3l0L36%r8P6M2j60K40k44J83
$$ 213 246 254 -60 25 14 51 144 155 193 166 77 42 -67 -67 -65 -55 -218 -205 -235 101 101 3 79 121 -39 201 -43 140
4080A40j61k2j7R0Jj26J49k55P3n6J26K8oK98l24j37J27k24N00m47jK22j12J4
$$ 140 -21 -43 -60 30 31 -95 54 -201 -128 -184 -58 -30 -36 262 -62 -199 -72 -296 204 -243 -244 -22 -134 -120
4104a20K36j67q9K26J07k43K44k71n8M4J49j66Q4J70p7p1L7k26J76j37P1j7K5
$$ -120 116 -51 -140 86 193 -50 194 -77 -135 -91 58 -108 -24 146 69 -2 35 -191 -15 -152 -81 -98 -73
4127g3L26l59J77L4j12J77j89q6K10k63J53o4o8K19l21J52J80j79K61J46k30r0
$$ -73 253 -106 71 105 -7 170 -19 -105 105 -158 -5 -69 -137 82 -239 -87 93 -86 175 321 91 1
4149ArKL04j58k91J84mJ14j67J65l16K35k36K54j35K44l01j1Q8m1j36J88L10l21
$$ 1 -8 -6 298 140 -151 33 29 143 -24 141 -175 60 -176 78 -57 187 -114 -125 -37 -78 -214 -26 284 -37
4173c7K61j90m5J17j63J29L6M9k51K5O0j5l5K20Q4k87L5Q9k99p5J78r9M10l06
$$ -37 224 34 -11 106 -57 72 108 157 -94 -69 -9 -24 -59 161 245 -42 -7 82 -217 -292 -114 -213 197 -109
4197a09J42L03l43P8J31p9j24j64M89l81J55pK41k01Q6l77M44l23K3j00L66P3
$$ -109 33 336 -7 71 202 123 -1 -165 324 -57 98 91 332 131 217 -160 284 -39 -16 -116 250 323
4219C23l36r0M6J13o0M2j16K69k23j35K33J46k85j46K27j22J2K0N4M3rJ03o0L7
$$ 323 -13 -103 -57 56 -4 38 -78 191 -32 -167 66 212 -73 -219 8 -114 -102 -82 -28 15 6 109 49 86
4243H6J80l68K55k26J05m8J97l82N70l87K24l08Q2M9J65j40j10L53l34J40j89
$$ 86 266 -102 153 -73 32 -16 181 -201 369 -18 206 -102 -20 29 194 54 -56 297 -37 103 -86
4264h6J85j42m9J49Q9q1l0q1k2J81k74J13K79k63j4Q4L20n58R7J92P6j54j52L86
$$ -86 99 -43 -92 57 146 65 35 -46 -68 113 -161 -48 231 -32 -46 38 358 -200 -103 89 165 11 -141 245
4288B45k89nK0R1J06k37J26j10k4Q7j15L87k63L2L29n70M14m19R7L5J75j06J05
$$ 245 -44 -49 -29 62 168 -69 57 -53 -77 10 -105 282 19 51 380 -190 224 -195 -98 -63 112 6 111
4311A11l42L35k24L24m15M82n81L07j12p2m7K04J08m4o8R2q0o9K09j81RL5K41
$$ 111 -231 104 -120 204 -211 271 -310 -3 -115 -187 -234 -30 78 34 -34 58 -22 -91 118 -63 -54 -19 222
4334B22l09J65J8N5p1j49J38K5q7n1J22l97L12j91K07n5M8J07j35J56q1j54L94
$$ 222 -87 78 96 151 80 -69 69 94 7 -44 78 -319 -7 -198 9 -46 2 109 -26 130 49 -105 289
4357B89l60j14J07K93J04k86o1l7K94j61r2J10KR9k70m4K58k50k49M29n3m6K01
$$ 289 -71 -185 -78 215 319 33 -28 -65 229 68 -24 86 88 187 -83 -127 131 -119 -368 61 8 -38 163
4380A63k76J49j78L3K68k11j4L38l67J21N2p3k13K94l3j63M2P8j09M6J13n2lj
$$ 163 -113 36 -142 -109 159 -52 -66 272 -95 26 78 5 -208 86 53 -110 -68 10 -99 -53 60 8 5 4
4404DR4k79Q9o4J44k10N13k25L7r1j09M15k5l65J47k63J59J37j01j15J8l0J42
$$ 4 98 -181 -92 -156 -12 -222 291 66 103 12 -97 318 293 -72 75 -188 -29 108 7 -108 -90 -120 22
4427B2j4J81j71o0J35k96L37k3Qj83M2j59J28n8L18l70J81k30J76KK42k95J38
$$ 22 8 189 18 -42 93 -203 134 111 119 -64 -22 -181 -53 -111 207 -163 18 -212 -36 -34 208 -87 51
4450E1l64N20J01l57J63j88j6J58r8K4K85l04n4O1R2J5j09L1j5o5J20k89M51j27
$$ 51 -313 207 308 -49 114 -74 -90 68 -30 -6 279 -25 -79 -18 74 89 -20 11 -4 -69 51 -238 213 86
4474H6J7O1l61J47J09QQJ26m71J79Q3K86j21j70M6j69J96j36n8K1K07l45K53M7
$$ 86 103 164 -197 -50 59 67 75 201 -270 -91 -8 278 157 -13 33 -136 60 -76 -134 -113 94 -251 2 49
4498D9k50Q5j02M15k77J38j34k05K40R4K6p3rn2R9k54k2J11J61n2O9k54J8R9j
$$ 49 -201 -116 -218 197 -80 58 -76 -281 -41 53 79 6 -3 -55 44 -210 -232 -121 40 -12 57 -197 -179 -80 -81
4523h1Q6J95P7k51p7N0j97J31L08l12k4K46r1J25k91o1K58l06J25K9J6Q0K0Mq3
$$ -81 5 200 277 26 -51 -1 -198 -67 241 -71 -95 151 60 185 -106 -167 91 -215 -90 -61 -45 35 55 59 -24
4548b4j45K66k28j0j24L35k20K6R2K90m10J74m3K06k2K4l08J84l48L88l5R9qR9
$$ -24 -169 97 -131 -141 -265 70 -150 -124 -32 258 -152 22 -21 185 163 187 -121 63 -285 103 68 167 159 258
4572B58k46RJ54r1P0M4l05O0j68M10k47J93j14J52k61K47l14K3Q5m9O8J04J94
$$ 258 12 21 175 84 154 198 -107 -47 -215 195 -52 141 27 179 -82 165 -149 -126 -41 -90 -22 82 276
4595B76m58K37o4J59Kk36K23L5L5j82K51l14j0K18k96J30j44K78n7l76J13J72
$$ 276 -182 55 -9 150 152 -84 139 174 209 27 278 -36 -46 172 -124 6 -138 140 83 -293 -180 -8
4617hn7J09O6r9N0j30J26k19j20M30j88J46r6j1k1L4m1K21j89o6p1J44Q7J00K31
$$ -8 -65 44 110 11 61 -69 57 -162 -282 148 -40 106 10 -1 -22 12 -29 192 3 -63 -134 10 97 197 428
4642D28m96r9J31J86k24R2p0j7J55m3J59l50N58n05j17J40L18k95K22k17J59j07
$$ 428 -68 -167 -36 150 -74 18 -52 -69 86 43 202 -148 410 -95 -212 -72 246 -49 173 -44 115 8
4664HK5j19K7NjL6j97j33O1L68J7%r9J81k46J38nN9k04K18j42j28J27J76j98j82
$$ 8 33 -86 -59 -54 -55 -19 -216 -349 -288 80 97 97 -2 179 -67 71 66 125 -79 139 -3 -131 -4 172 -26 -208
4690b08L53N9j98n7K28j10m2n0o0K09l15O7J05O4j82L99k09j59P8L0N1Q9k23J31
$$ -208 145 204 6 -51 177 67 25 -25 -85 124 -191 -124 -19 45 -137 262 53 -106 -28 2 53 142 -81 50
4714E0j18L14Lk95kk9k1K94k1l42J96j4j22m3J99n9J05J92j32k34O5M6j1kJ75
$$ 50 -68 246 249 -46 -48 -77 -98 196 175 -167 29 15 -107 -150 49 -10 95 287 155 -79 -14 32 21 19 194
4739A94q5l74M65m35M4K72p7qj7K05O5k42k3J66k05J8J36l6n4k2j20K26k82r7
$$ 194 109 -265 200 -235 -191 81 4 -4 -21 184 249 7 -16 150 -55 -37 99 63 9 -13 -133 93 -189 -286
4763b86J25p1J81J48j63k28L60o7n7J25L9j06L20n32L91j77P8k45j03L72j80o9
$$ -286 -161 -232 -51 97 -66 -294 66 -1 -58 67 106 0 320 -212 179 2 80 -165 -268 104 -76 -145
4785a45j17J92PJ16k06K74P7l52K84P3l44lL33j71k24K02j00PJ66r6k06J65K00
$$ -145 -262 -70 -63 53 -153 121 198 -154 130 203 -141 -144 189 18 -206 -4 -104 -97 69 -27 -233 -68 132
4808A32j6k90K63j33j75J42K56j89J58J22l01j1j16K47R5r7M0O0n51J32L80j01
$$ 132 116 -174 89 -44 -219 -77 179 -10 148 270 -31 -42 -158 89 184 87 127 187 -364 -232 148 47
4830D7j63K00k42j10R1Q9m4K5J61j17k26K6L14k12K83k64L21j82J26l28K78j49
$$ 47 -116 84 -158 -268 -177 -88 -132 -107 54 -63 -289 -263 51 -161 122 -142 179 -3 123 -205 73 -76
4852g6k43K91L7o2M7p0r4o6M05Q7k44n7J44k39J79m2j5J90j29p2m8N2K38j76k35
$$ -76 -319 -28 9 -53 -6 -76 -170 -236 169 256 12 -45 99 -140 39 -3 -18 172 43 -29 -77 -25 213 37 -198
4877a98K06J0k5L74l53J0M4R3k31J66k84J10L44m21K52k32K10j05J12J62k91J16
$$ -198 8 18 -7 367 14 24 68 161 -70 96 -188 -78 266 -155 97 -135 75 -30 82 244 -47 69
4899F9j78J23j65J06L83l83l8J83j43J52J0j32J12l26L24j79J58K18k99R1j76
$$ 69 -109 14 -151 -45 338 -45 -83 100 -43 109 119 -13 99 -227 97 -82 76 294 -5 86 -90
4920i0K65j1k28nj4K30l42M2k4J08J04j5J61o6j83J41m05M24j64J0Q2j42L67l80
$$ -90 175 164 -64 -69 -83 147 -195 -153 -177 -69 35 20 181 115 -68 73 -332 92 -72 -62 20 -122 245 -135
4944a35k0M5o2J90j75J55j55N9k5M24o25M30M1J7J76J17n97j30L98k76J48m49
$$ -135 -155 -110 -172 18 -157 -2 -157 -98 -123 301 -324 106 147 164 340 457 -140 -270 128 -148 0 -449
4966d49N50J5l17J62j34K87J11m16K35r2Np1J05J82j61O1q3k83J14K22J18O2m25
$$ -449 101 116 -201 -39 -173 114 225 -191 44 -48 -43 -114 -9 173 12 73 -10 -293 -179 43 161 223 -202
4989b02J52j81K27mJ33kl13J26nM1N1j9o6r9K35L5j80J0j50K93P4m37L16p7k4
$$ -202 -50 -231 -4 -8 125 123 -190 -64 -69 -28 23 4 -62 -161 74 109 -71 -61 -211 82 156 -281 35 -42 -66
5014f6J59r8Pm6M0J49k11r5J55j46L0M0p3M31m5j06K9j93j17J66L8j09L3j16K10
$$ -66 93 -5 2 -44 -4 145 -66 -161 -6 -152 -122 -82 -155 276 231 125 154 -39 -156 10 48 -61 -28 -144 66
5039F6l13M9K36p9O6J28m55K29L63j58l22K72J83l90J67K5Q0l43J6L90k72r3J92
$$ 66 -247 -198 38 -41 25 153 -302 -73 290 132 -190 82 265 -125 42 67 147 -196 -180 210 -62 -155 37
5062C7j26K03k39M11k93m12K53Q5j25J08L62n1k29j20L16k53o9M1J54Q3j47j42
$$ 37 -89 114 -125 286 -7 -419 -166 -81 -206 -98 264 213 -16 -136 180 -73 -142 -101 53 136 -11 -153
5084a53K13j00L73m21j77M40k07j5J44o0n5K12j57K10J2j79L08j75n12L99n9K31
$$ -153 60 -40 333 -88 -265 175 -32 -47 97 37 -18 194 37 247 259 80 388 213 -299 100 41 272
5106B72k22p8R4j18q2K64r7P3R1q2m16L31N9k38p1L00p0J19l0n2j75K53n6KL3
$$ 272 50 -28 66 -52 -134 130 33 106 197 115 -301 30 89 -149 -220 80 10 129 99 47 -128 125 69 71 104
5131A04p0n4p5K03K9O1j60j8k00K95n11L43Q2j84J47j13N8J82k15K30l17K07K57
$$ 104 34 -20 -95 108 137 198 38 20 -180 115 -396 -53 29 -155 -8 -121 -63 119 -96 134 -183 24 281
5154B81m29j69L95Q6k86J26J18n75M69n8J64j6k35N51o12MJ25r7K49N2l44K66
$$ 281 -148 -317 78 164 -122 4 122 -453 16 -42 122 106 -129 422 -190 -186 -61 -158 91 143 -201 65
5176F5k25J21K03N7j98o7J9j85J87Q1j78j34M02N1K34m99L54l30N9j20K51M0j87
$$ 65 -160 -39 164 221 23 -44 -25 -210 -23 58 -120 -254 148 199 433 -66 288 -42 17 -103 148 188 1
5199Ak73K03J76r1R1Q0k17L1j94M90l48J8j98J67K52l61Q0P6N6l6J3k01J44K74
$$ 1 -272 -69 107 16 107 187 -30 1 -193 297 -51 -33 -231 -64 188 -173 -93 -17 39 3 16 -185 -41 233
5223B33m0l45L49m0j16K4l7m8p6J64j6j86Q2J05l99K04J09J69k80L89j69l19M50
$$ 233 193 -152 197 157 41 65 28 -20 -96 68 52 -134 -52 53 -346 -142 -33 136 -144 245 76 -243 207
5246B07n91M47O7Pl29K79j15J09j22L8J08q9nm0M4j99LJ72k68K84L9K2p8J85j94
$$ 207 -384 63 130 137 -192 87 -28 81 -41 -3 105 16 11 -29 15 -184 -181 -9 -277 7 46 68 -10 175 -19
5271a9m6L6J35Q7n46M41K11q9j96j14L88m00n6K19P6k59K76k01M39n28K82j74
$$ -19 -65 -29 106 193 -353 88 299 210 14 -100 288 -112 -168 51 127 -132 144 -57 382 -146 136 -38
5293c8J88M9j31j41J83k9r2k31L93j76o9J68j60K21k14p8J22k32J07M22m74K46
$$ -38 150 199 68 -73 110 81 -11 -242 151 -25 -94 74 -86 135 -79 -157 -35 -267 -160 262 -212 34
5315C4q5J25p9m4L7j81K37q8J4j79Q5J43N8j40N04k34l73K9O1K57l93J19L16m18
$$ 34 -51 74 -5 -49 -12 -193 44 -44 -30 -209 -124 19 77 -63 441 207 -166 -137 -76 181 -212 -93 223 -195
5339a95K29R1Q5l65N65k50J5l17L24M4n30J90J22r6k56J41j8J87K32o1j32r7J87
$$ -195 34 125 210 -155 410 160 175 -142 182 226 -304 -114 8 -88 -344 -203 -221 -34 198 137 5 -92 95
5362I5M5l40M7K87j08j35j04O1n7J44J42q2l13J66K88l66L32O9j20P8j21Q2J31
$$ 95 140 -200 -153 134 26 -109 -213 -152 -209 -65 77 -5 -318 -152 136 -230 102 171 51 129 8 90 221
5385B21r4P4k7k01j3K46j26j75J8l4j24L25q4k75M30j47J14mK44j36n78N73j93
$$ 221 127 201 174 -27 -40 206 80 -95 -77 -111 -235 90 6 -269 161 14 128 124 368 232 -346 227 34
5408C4j61J03J68j59J2J84k39O1J64j83K6lj21J29J1l1J38k13J14l43J76K48k39
$$ 34 -127 -24 144 -15 -3 181 -58 3 167 -16 10 7 -114 15 26 -5 133 -80 34 -309 -133 115 -124
5431a24j06L30r4N8j05p2K35R6k72Jp2L49r1k04J91J71p5o2p9j10l2J36M5M9j86
$$ -124 -230 100 6 64 -41 -113 122 218 -54 -53 -125 224 133 -71 120 291 216 154 75 -35 -67 69 114 163 -23
5456b3r9j18l7M5J10K02M8j05o2J52j88P9m94M53k58M41k37J11ol32M13q6k82
$$ -23 -122 -240 -277 -232 -122 80 128 23 -39 113 -75 4 -490 -37 -295 146 -91 20 14 -318 95 9 -273
5479b73K83o2J39P4k49J91j53k25J79J95l78K58j4K57k35J95l18J98m1m9j27J5
$$ -273 10 -52 87 161 -88 103 -50 -275 -96 99 -279 -21 -35 222 -13 182 -136 62 21 -28 -155 -140
5501a40J36J5J54j83O7p2j86J6K53l83K08L43J04k16j0j60L00j08k14R0Q2j65
$$ -140 -4 11 165 -18 49 -23 -209 -193 60 -323 -115 228 332 116 106 -54 246 138 -76 14 96 -69
5523f9J40k0j84J00K03j47J7r5K51l32k01K76L3j10L70J33l69J79q5K35l15l7
$$ -69 71 51 -133 -33 170 23 40 -55 196 -136 -337 -61 -28 -138 232 365 -4 175 90 325 10 -27
5545b7k13L19j7RR0m08N2J16k02N25j64j38J94p5n4j22K06O9l92K54R3j07k2J21
$$ -27 -240 79 62 71 161 -247 -195 -79 -281 244 80 -58 136 61 7 -115 91 160 -232 22 115 8 -14 107
5569A07j74K1j14k4J73k30J26J69j5k47K39o3J67j92K03J3k53Q1K81n52K27J27
$$ 107 -67 -46 -160 -184 -11 -241 -115 54 39 -208 31 -32 135 -57 146 159 -94 -13 268 -284 -57 70
5591G0M9m16M51k54J6K62k09j35q1N41j50O5j66O0j27k2k93O41m29J67L0r8j34
$$ 70 119 -297 154 -100 -84 178 -31 -166 -247 294 144 209 43 103 -24 -46 -339 302 -127 40 70 -28 -162
5614a62L20n4j49k9L70m07N7J87K2r3j7L2J33j91q4L31k13M2K75n22J81M7J20
$$ -162 158 104 -45 -74 296 -111 -54 133 155 62 45 77 210 19 -65 266 53 95 370 -152 29 76 196
5637A96r7l60L58j69L13l79K97m15K95N1nm2q7K05k69J09Q3j04j87o2K21K52m46
$$ 196 99 -261 97 -72 241 -138 159 -256 39 90 85 43 -44 161 -108 1 84 -20 -207 -269 -48 204 -242
5660b42R7J17K07j84K5N2j7j64K01j57K2n5q2R8J25m6N5O6l13K17M0r4J53j32
$$ -242 -145 -28 179 -5 20 72 55 -109 92 -65 -43 -98 -180 -82 43 -3 52 118 -195 22 62 -32 121 -11
5684a1L9K21l05j14J94K8Q7m19O56l74L5n4j40K3K69k2j26Nj65J13J87j05lj18
$$ -11 28 249 -56 -170 24 52 139 -280 376 2 37 -17 -157 -134 135 113 -13 -8 -173 -60 127 22 19 -99
5708i9P3n7K80K7J6j61r3M5k70M20N4j54M9j77K01k47K09l02K81j15m7k3L33m83
$$ -99 -26 -83 197 224 240 79 -14 31 -239 181 235 81 130 -47 154 -93 116 -186 95 -20 -67 -90 243 -240
5732b40L40L0j19J23k28N9m9J35m4j16R1j16K99m4o1q6J76k83K50K3j35K32k75
$$ -240 100 130 11 134 -94 -35 -84 51 7 -109 -18 -134 165 121 60 -26 150 -133 117 140 5 237 -38
5755c8J34n4K6rj54j51K67J3J06l5P9PP9k30N7rj29J80l5Q2l92L33o2j44J09r6
$$ -38 96 42 68 59 -95 -246 21 34 140 105 184 191 270 40 97 88 -41 139 104 186 -206 127 65 -79 30 -66
5781f6L7K11r7k1j5r8j5N8m1K4J40k29n6J91j75J09K87l11k13K54n2J34J14m69
$$ -66 -29 182 85 64 49 -49 -64 -6 -47 -23 117 -112 -168 23 -152 -43 244 -67 -280 -26 -78 56 170 -299
5805b99m6N81j19j81J52j67K03k45mK3oK33j91K0J25J40l42n5J1J94n0l16N74
$$ -299 -345 236 117 -64 88 -79 124 -121 -125 -102 -108 125 -66 -46 79 219 -123 -178 -167 27 -23 -339 235
5828B35L5j30k33O3K36r0k85qK18l12J71J18l73J76J77l2L5m6R4j27P0p9o1M0
$$ 235 270 140 -93 -30 206 116 -169 -177 41 -271 -100 18 -355 -179 -2 -34 1 -45 49 -78 -8 -87 -148 -108
5852a08K87r5k22L44j05j78K12o2p8J4N3l8n9%K04j81j36K64J3k72J58q9J79j76
$$ -108 179 84 -138 206 101 -77 135 73 -5 9 62 24 -35 -35 169 -12 -148 116 129 -143 15 -74 105 -71
5876g1M5Q1j3Q2Q9o04K74L62n8m8l68M34l07j42M76j37j19J60j37n2J25p9j96
$$ -71 -26 55 42 124 213 -391 -117 245 187 139 -229 205 -102 -244 232 95 -24 136 -1 -53 72 -7 -203
5899b03J01K69L2j66j4o7J42j06N3j72M53l78j19MN1J11PMl32K68L21j88k71J48
$$ -203 -102 167 199 33 19 -48 94 -12 41 -131 322 -56 -175 -171 -120 -9 -2 2 -330 -62 259 71 -200 -52
5923e2J94l84N63m20K09k70R7j42J51K13j27j6k89L15o2M4m7K17n9l78M11l0k44
$$ -52 142 -242 321 -99 110 -160 -63 -205 -54 159 32 16 -273 42 -20 24 -23 194 135 -243 168 138 -106
5946a06J43m9j44J39r3J38J01m14J68Q1Q1q2q7K43k90K97k57N0N3j55m7K46J46
$$ -106 37 -12 -156 -17 -110 28 129 -285 -117 -36 45 -37 -124 119 -171 126 -131 -81 -28 -183 -230 16 162
5969A62R1l11k16N36j29R5l2k53j65M3J08J83l55M26J99o34R5J67j19J99j1j86
$$ 162 253 -58 -274 262 133 228 196 -57 -222 -179 -71 112 -243 183 382 -252 -157 10 -109 90 79 -107
5991a07L58l70J29L3j48J31k45K5K38k02L47k10k1K23n2o7j96k58K38K71l74M62
$$ -107 251 -119 10 43 -105 26 -219 -194 44 -158 189 -21 -42 181 129 62 -134 -392 -154 117 -257 205
6013B05l38m12L87O2j39L76l73K94P6mj41M9m3j06MR7O9k03M4L16l22K83k94R5
$$ 205 -133 -545 -158 -96 -235 141 -232 62 138 134 -7 42 -1 -107 -103 -6 63 -140 -96 220 -102 181 -113 -18
6037a8O3j57J79j73k43J53J65K9j48Q7J45nJ13j28K9j87J05J6J54m40J26p1K9
$$ -18 45 -112 67 -106 -349 -196 -31 -2 -150 -63 82 77 190 62 91 -96 9 25 179 -261 -135 -206 -177
6060a77N5K25k43K22k21J30p7K61m4n9O0k62J08K63j96j4j7J0L8J36n1j67Jp0
$$ -177 -122 103 -140 82 -139 -9 -86 175 131 72 132 -130 -22 241 45 31 14 24 62 198 147 -20 -19 -89
6084h9J59R4l9k58J69n2j15o1L36l05J31J21Qn77M10j48M9K37rk52L07j45kl8
$$ -89 70 164 125 -133 36 -16 -131 -192 144 -161 -30 91 99 -478 -68 -216 -167 70 61 -191 116 -29 -31 -69
6108f9j26J15o2n6J37J05Q9N5j82O4J2r2J32lj86j5J24j11K4n5j21L63k41Q7o0
$$ -69 -195 -80 -142 -198 -61 44 133 188 6 70 82 -10 122 119 -67 -82 42 -69 -45 -100 -221 142 -99 -12 -72
6133g2J98k17N0j75K58k2j96j3J67l2j88L06j02jM01j62r6m09L35M9k12k54K20
$$ -72 126 -91 -41 -216 42 20 -176 -189 -22 -54 -242 64 -38 -39 362 200 104 -305 30 79 -133 -387 -167
6156a67K91j74l7j50M00k35J41K56j70j0j69J14O5j07r0J70M8j31q8j26K77k13
$$ -167 124 -50 -87 -237 163 -72 69 325 155 145 -24 90 155 48 -42 128 176 45 -43 -169 108 -105
6178a05K49k42J60n4J71j02q7%l7J4J89k36J90Rm65O16j93J4k00L36j58J24k19
$$ -105 144 -98 62 8 179 77 -10 -10 -47 -33 156 -80 110 119 -346 270 77 91 -109 227 69 193 -26
6201b6j6K49j4j6m24K54j20J00J58j80L5J04n2J49j45j02j31R1K0R8j45K76l68
$$ -26 -42 207 193 177 -247 7 -113 -13 145 -35 0 104 52 201 56 -46 -177 -86 -66 32 -113 163 -205
6224b05J01K05j37N0L05l77J39j42J83k36M29k15l1M4q1q3K4J3J15J00m25K41
$$ -205 -104 101 -36 14 319 -58 81 -61 122 -114 315 100 69 113 32 -51 -27 -14 101 201 -224 17
6246A7k4J08K5l33L53p5l75M51Q3k8m49L35l5j43nJ34j63N4J2k59L00J6M9Mq9
$$ 17 -7 101 126 -207 146 71 -304 147 230 202 -247 88 53 -90 -95 39 -124 -70 -58 -317 -17 -1 48 52 -37
6271c7j68J74K87j70l2N0J33k58K74k56J15j53K09j90K94l62Q1J54m42K38K67
$$ -37 -205 -31 256 86 54 104 237 -21 253 -3 112 -41 168 -22 272 -90 -9 145 -297 -59 208
6292B08O6m67J28l5R1J11j73J89l5j33r8P3J14k40K80k16k61N26o4N4k29J30Q6
$$ 208 274 -193 -65 -100 -9 102 -71 118 83 -50 -148 -75 39 -201 79 -137 -398 128 64 118 -111 19 105
6315A05k22K90m18J30K76k56K53J4l75L85j66P8j26J7O6k69M9J75R8n5o3M5j99
$$ 105 -117 173 -245 -115 161 -95 158 172 -203 182 16 94 -32 -15 51 -218 -169 6 104 49 -14 31 -168
6338a68pM11l91Q9q8jK83r7o8J39m1q6K60j79p8j7J95j67jo4J98O8l13K14o7J8
$$ -168 -175 236 -155 -66 -154 -155 128 31 -37 102 61 -25 235 56 -22 -39 156 -11 -12 -76 122 190 -123 91 24 42
6364D2M1k52J61m1L2j7k10J51j01Q3M22j31mj00j37K04j39Q9L0n6m5N2l9j73L18
$$ 42 83 -169 -8 -49 -17 -34 -244 -93 -194 -111 311 180 176 76 -61 143 4 93 123 67 22 74 35 -138 180
6389A80k54j6k61L50J5q0J59J7o2J19j91J79k68R9M3j28L7j69K34j15L5P7j35
$$ 180 -74 -90 -351 -1 14 -66 93 110 48 167 -24 155 -113 -14 29 -99 -62 -231 3 -112 -77 0 -135
6412a35L17N6m19q0J3M90m94M08k19M0M0J92j2j60k58L41j14j91J57j8q9J12K2
$$ -135 182 238 -181 -261 -248 242 -252 156 -63 -23 17 209 197 37 -221 120 6 -185 -28 -46 -135 -23 -1
6435ak5K4J60n2J29j69j33R2K84k77Jl2j63J36n2N8j21J81J35j60k22J34L66n58
$$ -1 -26 -2 158 106 235 66 -67 25 309 32 33 1 -162 -26 -78 -20 -141 40 175 15 -207 -73 293 -265
6459b65M18j67j7J56j66K73l38o9K53Q0l25L42l05m0Q0K25l33K17j56J2L78n39
$$ -265 153 -14 -31 125 -41 232 -106 -175 78 158 -167 175 -130 -170 -90 135 -198 19 -137 -125 253 -286
6481b86K19N3j52M7M09k87M1l6J93l77J67k93L35J6j24O9j45L69j99mk01K42N8
$$ -286 -67 -14 -166 -119 290 3 44 8 201 -176 -9 -302 33 49 -75 -6 -151 218 19 15 -186 56 114
6504A14k24K45j06j49K56l84R9N6Q9J48q0o5L14l55J15k54L08K2m92M55j61J2
$$ 114 -110 135 29 -120 136 -248 -149 -93 -4 144 64 -1 313 -42 73 -181 127 149 -343 112 -49 -37
6526c7q7K17n4j00k4nJ32O4m0l8r9l2K98k41l15K79j72M6R9O3N4j67K42j44J57
$$ -37 -124 93 39 -61 -85 -90 42 106 66 28 -71 -103 195 -46 -361 -82 -254 -208 -109 -46 8 -159 83 -61 96
6551I6j45j62L33j73m5K99k69P0j6N0j17K79K7k55n9K38J3j75j5j15K12j90M07
$$ 96 -49 -211 122 -51 -96 203 -66 4 -12 38 -79 200 227 -28 -87 151 164 -11 -26 -141 71 -119 288
6574B88m61J0L11r7l60L43R6j83p3J27O4P9M6j73L73o08M09k87rJ74n4M0j87J
$$ 288 -173 -163 148 51 -309 34 130 -53 -126 1 65 144 190 17 390 -218 191 -96 -105 69 15 55 -132 -131
6598a31J64j93M9K95k31J07k03P4J24l95J80L58k62j10M66k61j23P9K53k31l38
$$ -131 33 -160 -111 184 -47 60 -143 -69 55 -340 -160 198 -64 -174 292 31 -92 -13 240 9 -329
6619c29N73k55j91j11L03Q2J09l36K18j78J25qJ30k28J01J16m31L18P7k21L31
$$ -329 244 -11 -202 -313 -10 72 181 -155 63 -115 10 2 132 -96 5 121 -310 8 85 -136 195
6640A95l89L32j63J25O6k87K78k81J05J17k46L21j8O2j28k91L50j57j42J70P3
$$ 195 -194 138 -25 100 166 -121 157 -124 -19 98 -148 173 155 217 89 -202 148 -9 -151 19 92
6661I2l1J2j83J66o4N9J65l47n2K63k4n8p2K36k10k12L13J78j37m47N58Q0k10
$$ 92 61 73 -110 56 -8 51 216 -131 -183 80 56 -2 -74 162 -48 -260 53 231 94 -353 205 285 75
6684G5j01q8K07K8k20j22J05k12K49K02j40J49n9J0j59K14j75L6j66J83j12K34
$$ 75 -26 -114 93 121 -99 -221 -116 -328 -79 123 -17 132 73 83 -76 138 -37 -1 -167 16 -96 138
6706A38k34K04L5k31N7J68m0k4Q5l5K2l17L37l41M9K72k13K11k62K02j51j89K40
$$ 138 -96 108 143 -88 -31 137 97 73 158 123 145 -172 165 -176 -127 145 -68 143 -119 83 -68 -257 -17
6729a7J94l77JL55k10L18m52K28L8j86K75j45n7m1K9K15k63j10L43j7J13k61k82
$$ -17 177 -200 -199 156 -54 264 -188 40 78 -108 167 22 -35 -76 -47 168 -95 -205 138 121 234 -27 -309
6752c09N99m01j32J08J64M9r2r1R4nK21Nl05K27K14k88l0r3J39j8o2j09l1MN9
$$ -309 290 -111 -243 -135 29 78 -14 -105 -11 -16 205 210 -95 132 346 58 28 -65 74 56 -6 -115 -146 -142 -83
6777h3L03j05k69O8Q7j17J94k9o8P1O4k49l6J51j7qj38M95k44k25K72j08j38M33
$$ -83 220 115 -154 -86 1 -116 78 49 -19 52 116 -133 -169 -18 -35 -43 -181 314 70 -155 117 9 -129 304
6801C04l77j54L95k00Jk0J9r0j2J34r7j51N77k09m38K78J38j6p2k63L73l91K60
$$ 304 -73 -227 168 -32 -31 -51 -32 -122 -134 0 -97 -248 329 120 -318 -40 98 82 10 -253 120 -271 -11
6824a1j29J00OK25o8n6P7J92j44k71j62K90j8k2J36m34J86R2Q6l49K51K18j89
$$ -11 -140 -40 -34 191 123 67 144 336 192 -79 -241 49 31 9 145 -289 -103 -11 75 -274 -23 195 6
6847FJ38j97m4L73j78Rk7k12J26k52J62%m2J76j3n0p7J82KJ6k80K97q7P6%j15
$$ 6 144 -53 -97 276 98 107 80 -132 -6 -258 -96 -96 -138 38 25 -25 -102 80 82 98 -182 115 28 104 104 -11
6873a1K7J61j94l5j17m0K23k2j90%Q1R8L62l94J58l65M83k47J90k58L3L80m74
$$ -11 16 177 -17 -52 -169 -209 14 -8 -198 -198 -117 -19 343 -51 107 -258 225 -22 168 -90 -57 323 -151
6896a51K26j35Q3k21K78j13J34k90K28k73K13R0j6J03o2p4j99K43k46K41J77p2
$$ -151 75 -60 23 -198 80 -33 101 -189 39 -234 -21 69 53 156 94 20 -179 64 -182 59 236 164
6918A64j83O3k7L3j78K9K30k84K76j74P3j8M6Q5j77K21j14k57J54N6l28L68r7
$$ 164 -19 44 17 50 -128 -99 131 -153 123 -51 22 4 50 135 -42 179 65 -192 -38 18 -310 58 -39
6941c9m3L3J01j6K9j12j98J90N9m1k59L3L59j2l32r1K36m26L06L86l03K72j91
$$ -39 -82 -49 52 36 65 -47 -245 -55 4 -37 -296 -263 96 84 -248 -339 -103 -529 -223 163 -140 132 -59
6964e9K45j13N7l56L09q1j3k11P8PJ52J34k56K70k89K74p7m6J29k8j36r3K68j74
$$ -59 186 73 130 -226 83 2 -11 -222 -144 -137 15 149 -107 163 -126 148 71 25 154 126 -10 -103 165 -9
6988in3q8M37m66J80K40l19K82j06m6j98O7r5k27L92J88o5n4k04l2K00O5j35K96
$$ -9 -62 -150 287 -179 1 241 -78 204 98 52 -146 -79 -174 -401 -9 179 114 60 -144 -176 24 89 -46 250
7012B50l16j13Q9L9J8J73l14J66M9j33J60j54J35qL9k38O8K40k80K20J7L0k27
$$ 250 -66 -179 -90 -51 -33 140 -174 -8 41 -92 68 -86 49 41 80 -158 -90 150 -130 90 107 137 -90
7035i0J54l6j20J98p2J09j76kj62J55k30M15p6N1j94q3K77o2j00K8J78m2j33K13
$$ -90 64 28 -92 106 34 143 -33 -35 -197 -42 -272 143 67 118 -76 -159 118 56 -44 -16 162 120 -13 200
7059B00o9j75J70l01P7L8k24L41Q6K5k89j19L15O6j19k12J75P6J41j69P8l37L44
$$ 200 131 -44 126 -175 -98 -60 -284 57 143 168 -121 -240 75 141 22 -190 -15 61 202 33 111 -226 118
7082A18J25j83K9k37L31l32K43j08K02l43J00k97L07j8K05j49k9L06j90k14j29
$$ 118 243 60 89 -148 183 -149 94 -14 188 -155 -55 -352 -45 -63 142 -7 -36 270 80 -134 -263
7103b63K52k19L62j4j48k2R9Q7o7j63J71j19K68k40p2Q5J14l08K06J07Q1k85K99
$$ -263 -11 -230 132 118 -30 -52 47 134 67 -96 75 -44 224 -16 -88 -3 111 -197 9 116 197 -88 211
7126B11r3k31P4K83m62j25K47L5J82j38O0K7l5k6j42K13P4k79k15M28k60J77j89
$$ 211 118 -113 -39 244 -218 -343 -96 -61 121 -17 43 70 35 9 -133 80 154 -125 -340 88 -172 5 -184
7149a84O8J12j23M54m80J17L62j38m92J9K87k8j96M20l40K40M3m05K53oJ1j4R0
$$ -184 -116 -4 -127 327 -153 -36 326 188 -304 -285 2 -26 -222 198 -142 98 141 -264 -11 -17 -6 -20 70
7172G0p8k38L41j86N8K82k66j78K33p4K49m54K80K18m05J42j13j35J49J05M7J18
$$ 70 -8 -246 95 -91 -33 249 -17 -195 38 -36 213 -241 39 257 -148 -6 -119 -254 -105 0 47 165
7194A65l23K28r6J24N1l0m67L05K34j59m5j68J01J12M08n67r7K36r6l3L0N2r4
$$ 165 -158 70 -26 98 149 119 -348 -43 191 32 -13 -181 -80 32 440 -127 -224 12 -84 -117 -87 -35 -129
7217a29oJ44N3K10l46J24j60j56N25o5j98k50M32j47l2q5p3K53q8J21k74N6k19
$$ -129 -135 9 62 272 -74 50 -110 -266 259 194 -4 -254 178 31 -1 -86 -159 94 6 127 -147 -91 -310
7240c10J74P2L67l90m5L10k60N0M0P6k09K15j20R5l51M46j46r9J88L3p9j39J50
$$ -310 -136 -64 303 -87 -132 178 -82 -32 8 84 -125 90 -30 65 -286 160 14 -85 103 136 57 -82 68
7263F8N7O6k03q3J66j83J08j21P6J45Pk67nJ54k18J50j4j22K64k49J25j03J58
$$ 68 125 191 -12 -95 71 -112 -4 -125 -49 96 103 -164 -169 -15 -233 -83 -97 -219 45 -204 -79 -182 -24
7286b4n7K6Q6l28M45k76K3n3L28k91J14K19m32O3j72K66QN4K1j02J47j24M1J08
$$ -24 -81 -55 31 -297 148 -128 -105 -158 170 -121 -7 212 -220 -157 -329 -63 -55 -1 20 -82 65 -59 -18 90
7310I0L1k63J27p2n9J69j22K38j99L00k29J31l22J11m9J04j58J87k2j14j6M0K28
$$ 90 121 -142 -15 -87 -146 23 -99 139 -60 240 11 142 -180 -69 -118 -14 -172 15 -7 -121 -137 -97 131
7333A31j66N1n5O7j55r0L15k41K56l8p5j55K9K71k61Q1o1J55q4j17r4K55J07p8
$$ 131 -35 16 -39 28 -127 -217 98 -143 113 75 0 -155 -126 145 -116 -35 -96 59 -25 -142 -236 19 126 48
7357D8k0M9q4L1N5j78J02J90l30J68k7m8q2N4Ol9L0Q3Q4p5Qj30K01l80O19k38
$$ 48 28 77 -7 24 79 -99 3 193 -137 31 4 -44 -126 -72 -66 -105 -75 8 92 17 25 -105 96 -284 335 97
7383I7j1l2k76L66l51Q0K63l56Q9j74K97O1M1k00r8O3K05K4p1o4J59j23j17L47
$$ 97 86 54 -222 144 -207 -127 136 -220 -131 -305 -8 53 94 -106 -204 -141 64 88 17 -47 112 -11 -128 219
7407B19m9k28K2j07K15j01N7l3K3J81m07K48l07J44J07KK07l46M4R2kJ64j41n4
$$ 219 170 -58 -36 -143 72 -29 28 -5 18 199 -208 40 -267 -123 -16 -14 193 -153 -109 -17 -19 145 4 -50
7431e0o4l4J50j64M50k42kn8K8oK22j68j05J37Pl9J3L7j12O0m4K10n02K61ON8
$$ -50 -114 -148 2 -162 288 46 44 -14 14 8 230 62 -43 94 101 62 75 112 0 60 16 226 -276 -15 -9 49
7457D9j65N4j34LL09M2l20J61K43k74J7p0p5rK87n5J48k83L3Q1q3Q0M9m90M01
$$ 49 -116 -62 -196 -193 116 158 -162 -1 242 -32 -15 -85 -160 -169 118 63 211 -72 -39 42 -41 39 88 -402 -1
7482aj02R7j1K86k84M4k6k8k19K40mm9K50l54k4J06J44J9J90j21rJ26j55n2o3
$$ -1 -103 -6 -17 269 -15 29 3 -25 -244 -4 -8 -57 193 -161 -185 -79 65 84 274 153 144 270 115 63 0
7507@M0l86L81l8r6O2r9J1K77M1l11Q1j54K26m1j8J32k4q9R6R2k74M4J80k48J27
$$ 0 40 -346 35 -3 -99 -37 -136 -125 152 193 -118 -37 -191 35 -6 -24 108 84 -5 91 183 -91 -47 133 -115 12
7533A2L9j13j09o0J73K11o2j44P9O3Qk66K75M0P9m43O4oP4Q3j60J15M0m7J87j63
$$ 12 51 -62 -171 -231 -58 153 91 -53 26 89 97 -169 106 146 225 -218 -154 -160 -86 -3 -163 -48 -8 -55 132 -31
7559c1m2L9J3k7J52n8j65K0m3K29j26P9J07j47l0P1q9r7R2R0j32K83m56L61k10
$$ -31 -73 -34 -21 -48 104 46 -119 -99 -142 87 -39 40 147 0 -30 41 -48 -145 -53 37 -95 188 -268 93 -117
7584a17K77p3L8l02l8L45k50K16k47n8L94j27j9j21Q6j80L09J33k86KJ21j15l4
$$ -117 160 87 125 -177 -215 130 -120 96 -151 -209 185 58 39 -82 4 -176 133 266 -20 -18 103 -12 -46
7607d6K61l2m08K73j12j2N5j94R8oK21J44k88j38N5p6K96O0q8l76L18J5k56P0
$$ -46 215 183 -225 48 -64 -76 -21 -215 -117 -123 98 242 -46 -184 -129 -205 91 151 63 -313 5 20 -236 -166
7631a66K18j2o4j06J17K40k38j26K82J20l03J48Q7k04m6L4J03j62K8M08m36K61
$$ -166 52 40 -24 -130 -13 227 -11 -137 145 265 -38 110 197 -7 -53 -19 84 -78 -50 358 -78 183
7653A83l59K11k4L3J53k05j39j50K74l7j66J68J74l45L01j62J00m0j94J59J18
$$ 183 -176 35 11 44 197 -8 -147 -297 -23 -60 -226 -58 116 -229 72 -90 10 -30 -224 -65 53
7674E3r7K69o7k28J97k65L00N9l22R0J43J32m58q4M29l13K9j40L61m10N00q3k6
$$ 53 -44 225 158 -70 127 -138 162 221 -101 -11 132 264 -194 -278 151 -162 -133 -273 88 -322 178 95 69
7697F9j68J26M0p1J64l8j79O9P0j65j42J74O9k26J61p3J24k2J29j07J38k49L15
$$ 69 -99 27 67 -4 160 122 -57 12 82 -83 -225 -51 18 -208 -47 -120 4 -18 111 4 142 -107 208
7720B08l54K59n9j6j13J66j71K15k76ro3L34k46r2K25j60L10o4k99K68k04J60
$$ 208 -146 113 54 38 -75 91 -80 135 -141 -150 -213 121 -125 -217 8 -152 158 94 -205 63 -141 19
7742A9J10k93K53j93nj41L41J89j48k72L70k60k41J77J17J5Q3j13j84M29o4l01
$$ 19 129 -164 89 -104 -109 -250 91 280 132 -140 230 -30 -271 -94 23 38 121 8 -176 253 189 -112
7764a12K24J75m37K51R1j86K57l35M4MJ8m8j10L09k65J85J38R0l05l5P2k32J98
$$ -112 112 287 -150 101 192 6 263 -72 -28 -24 -6 -54 -164 145 -120 65 203 293 -12 -47 25 -207 -9
7787il6%j26K16o1J65l44J50j34o0O1L15k81J73N7o0J60l8o9j73M6j09L2mL22
$$ -9 -45 -45 -171 45 -16 149 -195 -45 -179 -239 -178 137 -144 29 86 26 186 148 79 -94 -48 -157 -125 -129 193
7812A93k50K49r8k55K53k13l1K28J44m29M5M11k91m2j5j17O0L95k34j32J15M2
$$ 193 -57 192 94 -161 92 -121 -152 76 220 -209 -164 247 -44 -86 -101 -218 -158 237 3 -129 -14 28
7834B8N2L0J83m05J82L5k44J23k11O4j75L59k36K87l50J88j08L11j18R8l35L39
$$ 28 80 110 293 -112 70 105 -139 -16 -227 -163 -338 21 -215 72 -278 -90 -198 113 -5 93 -242 97
7856I7M0j25J60o4q2Mk22K21K06j61p5O2m2k22L68M0m79L13O6o2J44k79L37l46
$$ 97 137 12 172 108 26 30 -192 29 235 74 -1 61 19 -203 165 205 -274 39 105 43 187 -92 245 -101
7880a01k2R3O2J6k27L24M4j05q2K23k22j47J69k24J45m1j54O3K00k3l69K82K84
$$ -101 -123 -30 32 48 -179 145 189 84 2 225 3 -144 25 -199 -54 -95 -249 -186 14 -9 -378 -96 188
7903A88o2l31RK49o0M9J2k62J56l98K40L35p3K6k01J09J4r5l5J97l01K52J62J88
$$ 188 126 -205 -196 53 -7 42 54 -208 -52 -450 -210 125 52 78 -123 -14 0 -95 -130 67 -234 18 180 368
7927C68l30J14l06L5K25j71R3r2n6K2j42K05j86M16l56J04L15n54J54k41M19l1
$$ 368 38 152 -154 -119 106 -65 28 -64 -120 -98 -240 -35 -221 195 -161 -57 258 -296 -142 -383 36 5
7949EK22l47J1K85j40M6j09oO0p7O3J04k25R5j35L28n8Q6p5k89L04k20L1l1j03
$$ 5 227 -120 -109 176 36 82 -27 -33 27 -50 13 117 -108 -13 -148 180 122 208 133 -156 148 -72 -41 -72 -175
7974a75J6N8K8j73L32Q4l26O1J59j68O6L8N0J62j79q3l9n3J18K39O5n9n7P3j39
$$ -175 -159 -101 -73 -246 86 170 -156 -95 64 -104 -38 0 50 212 33 -50 -89 -142 -24 215 280 221 164 237 98
7999I8j36j3l24M54j1k16K70r3J15k79M42o20Q3M0M9J35J6J51k56K20l03L53j66
$$ 98 -38 -51 -375 79 68 -148 122 29 144 -135 307 -313 -230 -190 -141 -6 10 161 -95 125 -178 175 9
8022IP6k0k72J76L5j65Q2J86j72K56n43N81j41j38Q5j49K48q1J86k54K71k19m1
$$ 9 85 65 -207 -31 4 -161 -79 107 -65 191 -352 229 88 -50 35 -114 134 53 239 -15 256 37 -4
8045dn0j29K91j59j36K25j13j43L60j8m9j30NJ76j20K44kk51m6J77P1j69J92q1
$$ -4 -54 -183 108 -51 -187 38 -75 -218 142 124 75 -55 -50 126 6 250 248 -3 -49 128 199 30 222 141
8069A41j52J24M9rj95qJ23M2j28J34N9k62M60m24L1n1p0J86P9j16M0p2M6l3J74
$$ 141 -11 113 162 153 -42 -50 73 115 -13 121 180 -82 378 -46 -15 -66 -136 50 129 13 53 -19 27 -6 168
8094A68j50k33K98k99J63R3k87L90k22M8k87J51J39K51m8J60m77r8L54o8j57J12
$$ 168 18 -215 83 -216 -53 40 -247 143 -79 -31 -318 -167 -28 223 175 335 -142 -240 114 46 -111 1
8116AK45m31k6M4K25k21L61j66j5j45J0r0J58J09K13j23k9n1j2o7%j29J87j26
$$ 1 246 -185 -211 -167 58 -163 198 32 17 -128 -118 -208 -50 59 272 149 120 69 57 -10 -10 -139 48 -78
8140g8N0J61k99L69j99J60l13R3J72J42j44P0J8q4l61j62M08J99j23J62l13L02
$$ -78 -28 133 -166 203 4 164 -149 -56 116 258 114 184 202 118 -243 -405 3 202 79 241 -72 230
8162B30m67K03p2N2k50O3J94rOJ11o2P2MJ02k41J1nJ11N6j43J10K18m77K97j23
$$ 230 -237 -34 -106 -54 -304 -241 -47 -56 -50 61 -1 71 75 177 -64 -53 -58 53 109 -34 76 294 -183 114 -9
8187ik81K64J56r7
$$ -9 -290 -26 130 33
8191C3
$$ Imaginary data points
##PAGE= N=2
##DATA TABLE= (X++(I..I)), XYDATA
0@%%%%%%%%%%Qj6J6j6K4l2M0n6O4p2Q9j13J36j60J90k22K57k97L45l95M52n21
$$ 0 0 0 0 0 0 0 0 0 0 0 8 -8 8 -8 16 -16 24 -32 32 -40 49 -64 72 -88 102 -120 137 -160 185 -210 242 -279
32b79N93o72P63q60R68j090J222j366J524j696J884k091K317k564K832l124L448
$$ -279 314 -358 405 -455 513 -577 645 -721 803 -893 991 -1100 1217 -1347 1485 -1639 1809
49A809l802M190m619N093n616O200o856P595q438R409j0542J1881j3495J5491
$$ 1809 -1993 2197 -2422 2671 -2945 3255 -3601 3994 -4444 4965 -5577 6304 -7191 8300
63H300j8031K1397k6100L3200m5346P1808k34506J44607K90190l38322l5389K00630
$$ 8300 -9731 11666 -14434 18766 -26580 45228 -189278 -44671 245519 -92803 -128192 72438
75G2438j8038j32874J34453M0841j57375J4212J93000r7578j02088J21270M449
$$ 72438 54400 -78474 55979 96820 -60555 -46343 146657 49079 -53009 68261 72710
86G2710j65639P3819R0264j21308p9537J49908L4223j25543L9326J25247j34326
$$ 72710 -92929 -19110 71154 -50154 -129691 20217 54440 -71103 -31777 93470 -40856
97d0856p4622J84805K1966j61388N3153J17610j00077o3426J40010J2224j92765
$$ -40856 -115478 69327 91293 -70095 -16942 100668 591 -62835 77175 89399 -103366
108a03366L6896J89094j07684j57161J54992Q8949j53000l3920J32951r76j01347
$$ -103366 -66470 122624 14940 -142221 12771 101720 -51280 -85200 47751 46775 -54572
119e4572L0909O7334o6647q884Q0706n1394n6508R7150J5057r1346L6976Q0812
$$ -54572 -23663 43671 -22976 -31860 48846 -2548 -59056 38094 53151 -38195 -1219 79593
131G9593p5974q2942R6819N8043j29471j7796J32111m4440r6800R4064N6093j05303
$$ 79593 3619 -79323 17496 75539 -53932 -71728 60383 15943 -80857 13207 69300 -36003
143c6003j5619R6255j4602q2099N5383N3956r6997n871J22628m4949j06408P0948
$$ -36003 -51622 44633 30031 -52068 3315 57271 -39726 -45597 77031 32082 -74326 -3378
155c378P2392o7776l6029N4989k084n8059L2169M0620o5282p459O8656l4068l8372
$$ -3378 69014 1238 -34791 20198 18114 -39945 -7776 32844 -32438 -39897 28759 -5309 -43681
168d3681O8424J0572p1726J3340P6319k2280o8062M7214M9105p7995j7129P9520
$$ -43681 24743 35315 -36411 -23071 53248 30968 -37094 10120 59225 -18770 -35899 43621
180D3621k7919p1014L6865M4256l2962k4107L1336P613l3287K2743L0347m4706
$$ 43621 15702 -55312 -18447 25809 -7153 -31260 76 7689 -25598 -2855 27492 -17214
192a7214j005O0233j2170l9153K2322J8949l1815k7565K3545J4572l6379M243
$$ -17214 -18219 42014 29844 -9309 13013 31962 147 -27418 -3873 10699 -25680 -21437
204b1437L3536k2286r512L3000j1038k4988K1225K2407j9186j7426L6646J7650
$$ -21437 12099 -10187 -19699 13301 2263 -22725 -1500 20907 1721 -15705 20941 38591
216C8591m8632K484M2620l8976l3669M2756J5215l7100m742L5190J06l6696J2774
$$ 38591 -10041 -7557 35063 -3913 -37582 5174 20389 -16711 -21453 13737 13843 -22853 -10079
229a0079K2697l1423M742L5318k8296j5582M2577M653l3756L018K9735j2408l2213
$$ -10079 12618 -18805 -14063 21255 -7041 -22623 19954 24607 -9149 -6131 23604 11196 -21017
242b1017K7617K1202m5550K200M0166k7463k3172K8506K280k1461R004K2866j4890
$$ -21017 6600 27802 -17748 -15548 24618 -2845 -26017 2489 4769 -16692 -7688 15178 288
255B88k3810L4044J6222m6226P901M2038k6971k1079L0855P232k5697o873K0184
$$ 288 -23522 10522 26744 -19482 -11581 30457 3486 -17593 13262 20494 -5203 -12076 8108
268H108j067k5620J3216J3449k4530R932K0398k6793m213L0270j334k0229K336
$$ 8108 7041 -18579 -5363 8086 -16444 -6512 13886 -12907 -17120 13150 11816 -8413 -6077
281f077K1730n236k3387J9483J5265l3283J455K6785j6545j3960J4261M502r897
$$ -6077 15653 10417 -12970 6513 21778 -11505 -10050 16735 190 -13770 491 4993 -4904
294d904l300J2625m378j8995K1568J4618l2249L581L1377j3296j5655J4076R315
$$ -4904 -8204 4421 43 -18952 2616 17234 -15015 -11434 19943 6647 -9008 5068 14383
307A4383j2278j0468J5000K144k1814J1101J0815k3114P298J8012j9572n108K0803
$$ 14383 2105 -8363 6637 8781 -13033 -1932 8883 -14231 -6933 11079 -8493 -13601 7202
320G202N67j8926q2K3991l765k2968K0491J4620k8018K398J9525j4097q787J0175
$$ 7202 7769 -11157 -11239 12752 8987 -13981 6510 21130 -6888 -4490 15035 938 -7849 2326
334B326J387p383N88R056j0439j1761K1815K06k7276J4678K0784j6033m355J2854
$$ 2326 3713 -3670 -3082 5974 -4465 -16226 5589 5795 -21481 -6803 13981 -2052 -6407 6447
348F447N09o541J923Q055p903p242J6061n613j8983J5413L886k1396O135J3958
$$ 6447 6956 415 2338 10393 2490 -4752 11309 5696 -13287 2126 6012 -15384 -9249 4709
362D709q367q246R439J1379r717p761J6856j323j2710J1873J239r716R162J782
$$ 4709 -3658 -11904 -2465 8914 -803 -8564 8292 6969 -5741 6132 7371 -2345 6817 8599
376H599j1943P74P208j970j2581J087J6063j0249j3768J7921L758j1845M440N225
$$ 8599 -3344 -2570 4638 2668 -9913 -8826 7237 -3012 -16780 1141 4899 -6946 -2506 2719
390B719p71K409J064o40o132O55J0047j0597q206J4918k424j0961Q732L576q964
$$ 2719 1948 4357 5421 4781 -1351 -696 9351 -1246 -9452 5466 3042 -7919 813 4389 -4575
405d575l589O952P396j0546n983J3678j637o317R382k965m689J1028K746p936
$$ -4575 -8164 -1212 6184 -4362 -10345 3333 1696 -4621 4761 1796 -2893 8135 10881 2945
419B945k225N584P55j4754j110J6127j0246j3491J4779N398r129J282M319Q48
$$ 2945 720 6304 7059 -7695 -8805 7322 -2924 -16415 -1636 3762 -5367 -4085 234 1082
433A082k723K323N433q021J82J2669j0049o553J5729k228j2294L295O388m481
$$ 1082 -1641 682 6115 -1906 -1724 10945 896 -5657 10072 7844 -4450 -1155 5233 752
447G52r881L929Q699j2835l775J7214j376p752O777Q52j166M770o22n284m769
$$ 752 -9129 -5200 3499 -9336 -13111 4103 2727 -5025 1752 2604 1438 6208 5586 302 -4467
462d467P462Q529j3963n416J5058l245j0001N606K270m752l800K747P101p375
$$ -4467 2995 11524 -2439 -7855 7203 3958 -6043 -437 1833 -2919 -6719 -3972 3129 -4246
476d246m892R648k142k705J0392k218n234P154M574k625p521K178O633j3549n324
$$ -4246 -9138 510 -1632 -4337 6055 3837 -1397 5757 10331 7706 185 2363 8996 -4553 -9877
491i877J5938n096j4914R351Q326o961m730O152N751r119K53J2006p540l122J6611
$$ -9877 6061 965 -13949 -4598 3728 -3233 -7963 -1811 3940 -5179 -4926 7080 -460 -3582 13029
506A3029o695j4955J3851R675j4489q626J1959M977j7647J293J6194j4916j0294
$$ 13029 6334 -8621 5230 14905 416 -8210 3749 8726 -8921 -7628 8566 -6350 -16644
519a6644K1563O63j7466Q094J1597p986n115J1425O51j6925Q979J9951j8570j2369
$$ -16644 4919 5582 -11884 -3790 7807 -179 -5294 6131 6782 -10143 -1164 18787 217 -12152
533a2152K4183m26k1514O794J3878j1629j2668J3247P683j8355J818J7236j4641
$$ -12152 12031 11605 -9909 -3115 10763 -866 -13534 -287 7396 -10959 -9141 8095 -6546
546f546q016K3414J01j8660J0542J5835j1889j2709J5103O683k4475J025K3253
$$ -6546 -14562 8852 8953 -9707 835 16670 4781 -7928 7175 13858 -10617 -9592 13661
559A3661j3571j5381J8995K857j8784L982J5708p306j1538J5267Q331k0617L842
$$ 13661 90 -15291 3704 6561 -12223 -8241 7467 161 -11377 3890 12221 -8396 -4554
572d554K2048j6849j4814K3003M944k2493O03J9539o509j7975J3115J1253k1584
$$ -4554 17494 645 -14169 8834 13778 -8715 -8112 11427 4918 -13057 58 11311 -10273
585a0273o1K2624j2306j4669J9868M254j9241L436J9831r566j8584J6893J3511
$$ -10273 -10334 12290 -16 -14685 5183 9437 -9804 -6368 13463 3897 -14687 2206 15717
598A5717k4193m95K4322j2226j6545J8406O262j9300j48J7296n892j6536J3872
$$ 15717 -8476 -8971 15351 3125 -13420 4986 11248 -8052 -8200 9096 3204 -13332 540
611E40R513k1755K968K2439j3225j4106K0160P836j9197k575J8290m017j8050
$$ 540 10053 -11702 -8734 13705 480 -13626 6534 14370 -4827 -7402 10888 6871 -11179
624a1179J1065J0880j8802j1J9067j0745j3240J4029O061j3971k58J5733m046
$$ -11179 -114 10766 -8036 -8047 11020 275 -12965 1064 7125 -6846 -7104 8629 4583
637D583j5253J2828J0358j9538j102J9336o486j2678J0082P279j1604m285J2223
$$ 4583 -10670 2158 12516 -7022 -8124 11212 4726 -7952 2130 9409 -2195 -6480 5743
650E743k341j4795Q672J0712j4290r03J4655o274j0981R469R407r879o204J3851
$$ 5743 3402 -11393 -2721 7991 -6299 -7202 7453 1179 -9802 -333 9074 -805 -7009 6842
664F842K889j5776M460J1321j1841l742J2358l307j1369N915Q599q195q533J1888
$$ 6842 9731 -6045 -1585 9736 -2105 -5847 6511 3204 -8165 -2250 6349 -1846 -10379 1509
678A509K361j3503P131J2910j2278m474J4393K03j2899J749J0772n091r925J0070
$$ 1509 3870 -9633 -2502 10408 -1870 -6344 8049 8252 -4647 -2898 7874 2783 -7142 2928
692B928L245j4013M181J0754j0850n085J2213m3r446K659J1735o037j0180J1273
$$ 2928 6173 -7840 -3659 7095 -3755 -8840 3373 3330 -6116 -3457 8278 2241 -7939 3334
706C334M934j4743K687J1892p158n344Q189J153r028R7Q865m420r590R646N325
$$ 3334 8268 -6475 -3788 8104 946 -4398 3791 4944 -4084 -3987 4878 458 -9132 514 5839
721E839j2314K728J0142p202n346P635M231p913k819J0651R41j0893M996N860
$$ 5839 -6475 -3747 6395 -807 -6153 1482 5713 -2200 -5019 5632 6573 -4320 676 6536
735F536r844P5Q078m945n831N482M677p337m254J0454P42j1245O312Q806j0317
$$ 6536 -3308 -3233 4845 -100 -5931 -449 4228 -3109 -7363 3091 3833 -7412 -1100 7706 -2611
750b611j595J0244j543q109K543O854n447n838R040J162j1457N336P572j0212
$$ -2611 -4206 6038 4495 -3614 -1071 5783 336 -5502 3538 4700 -6757 -1421 6151 -4061
764d061k087R853j995p946L875Q155o159o037J0578K712j2287M491P742p796j964
$$ -4061 -6148 3705 1710 -6236 -2361 5794 -365 -6402 4176 6888 -5399 -908 6834 -962 -2926
779b926P115j887o287K967O507o685o248R871P09j0583M900O963p473j398P850
$$ -2926 4189 2302 -3985 -1018 5489 -1196 -7444 2427 3136 -7447 -2547 4416 -3057 -4455 3395
794C395k39n621J547O530l449n596O650O92p592M159L908p576n32N720o71n102
$$ 3395 3156 -2465 -918 5612 2163 -3433 3217 3909 -3683 476 4384 -3192 -3724 1996 1325 -3777
810c777J139N581k768n062O560J827o781K649M151l888p24L112Pj968j46L755
$$ -3777 -2638 2943 175 -4887 1673 3500 -3281 -632 3519 -369 -1093 2019 2026 58 -88 3667
826C667k503m530M464Q86o292J337L756k487p25K674J031k123j304M361L42m539
$$ 3667 1164 -3366 1098 1984 -4308 -2971 785 -1702 -2427 247 1278 -845 -2149 2212 2554 -1985
842a985L653J774l672J718Q33k706m67J555L12l092j560M311l13m193L184J071
$$ -1985 1668 3442 -230 1488 2321 -385 -852 703 1015 -2077 -3637 674 361 -3832 -648 423
858D23k604J808J706p25O83K85Q21p84j521J501r08k355K733j323k310K266M6
$$ 423 -2181 -373 1333 608 1291 1576 2397 1613 92 1593 685 -1670 1063 -260 -2570 -304 -258
875b58q89P38q51Q03J076j510J489R6p43Q16j212Q12K073l058J56K910k051p16
$$ -258 -1147 -409 -1260 -457 619 -891 598 694 -49 767 -445 367 2440 -618 -462 2448 397 -319
893c19J089j504J43N91o92p75j181K491J481l721J667K999l341L38L164j824j499
$$ -319 770 -734 -591 0 -692 -1467 -2648 -157 1324 -2397 -730 2269 -1072 -734 2430 606 -893
910h93J998J325j068k746K327P94m400K664J853n069J145L924l000j518K368J735
$$ -893 1105 2430 1362 -1384 943 1737 -2663 1 1854 -3215 -2070 1854 -1146 -2664 -296 1439
926A439j846j693M488j39m427L083K724m392O49K925k725j130K125O5k439j056
$$ 1439 -407 -2100 2388 2249 -2178 905 3629 -763 -114 2811 86 -1044 1081 1146 -1293 -2349
942b349L762o62m479L049K379m230J033K864j996q33J842J541j212j475L218N10
$$ -2349 1413 751 -3728 -679 1700 -2530 -1497 1367 -629 -1462 380 1921 709 -766 2452 2962
958B962l784J827J085l733Q07K150k433j524Q41K396j694k502L561J262l387K832
$$ 2962 -822 1005 2090 -1643 -836 1314 -1119 -2643 -1802 594 -1100 -3602 -41 1221 -2166 666
974F66K397l004J64K468r46j630l8J659j578k853L682q3m754K781K438l717K84
$$ 666 3063 59 223 2691 1745 115 77 1736 158 -2695 987 904 -3850 -1069 1369 -2348 -2064
991b064K704k47j611O44K870j417k553L836O24m120K029J377l049J26K058j114
$$ -2064 640 393 -1218 -574 2296 879 -1674 2162 2786 -1334 695 2072 -977 -851 1207 93
1007I3k042M48K555j165k662L306N15l111K368R71k234Q79J287n93q35n0K140
$$ 93 -1949 -1501 1054 -111 -2773 533 1048 -2063 305 1276 -958 -79 1208 615 -220 -270 1870
1024A870r33j790K625j098k383K094M45k479P15L30m10N56n17J467L3r04J371
$$ 1870 937 -853 1772 674 -1709 385 830 -1649 -934 -604 -1014 -458 -975 492 525 -379 992
1041I92k2r90Q60l96o41J339j272R4P09j384O60M44j524M73P96k96j21o78P58
$$ 992 970 -20 840 444 -197 1142 -130 -36 673 -711 -51 393 -1131 -658 138 -158 -279 -957 -199
1060a99Q88j604Q09J608j889O00J520j285m10K88L15Lj499J098J89k145J423J060
$$ -199 689 -915 -106 1502 -387 213 1733 448 38 326 641 644 -855 243 432 -1713 -290 770
1078G70k643P73J792j044m60M34Q33N9j332J762K31j902J532J171k119J98Q54
$$ 770 -1873 -1100 692 -352 -812 -378 455 514 -818 944 1175 -727 805 1976 -143 55 909
1095I09r25m68j86N96l57j594J698R21k295J032J935j409R4J106j57o34o48J794
$$ 909 -16 -484 -670 -74 -431 -2025 -327 594 -1701 -669 1266 -143 -49 1057 900 266 -382 1412
1113A412O6k276J002J098k176R2J288j294p95J375P61r78j271K475M25k606J294
$$ 1412 1478 -798 204 1302 -874 -782 506 -788 -1583 -208 553 -425 -1696 779 1204 -1402 -108
1130a08J755j857qK294j596j053Q48R97j105j814K185K21k614J500J277k613K07
$$ -108 1647 -210 -218 2076 480 -573 275 1272 167 -1647 538 759 -1855 -355 922 -1691 -1484
1147a484K632p80j429O59J959j104j568K381L33k866J471J664k583l8J429n07
$$ -1484 1148 368 -1061 -402 1557 453 -1115 1266 1599 -1267 204 1868 -715 -753 676 169
1163A69j126J53J354j143j419K175P27k739J369J765j614K48Q83l3m09o45J673
$$ 169 -957 -804 550 -593 -2012 163 890 -1849 -480 1285 -329 -81 802 769 360 -285 1388
1180A388k38k158J003J500k395K85Q28j150j32J008L41o11j025J759O75k527J500
$$ 1388 1150 -1008 -5 1495 -900 -615 213 -937 -1069 -61 280 -331 -1356 403 1078 -1449 51
1197E1J612k000J38J427o81p25K1J343q35j750J252Q71k600O73K032k037m63K202
$$ 51 1663 -337 -199 1228 547 -178 -157 1186 351 -1399 -147 724 -1876 -1203 829 -1208 -1671 531
1215E31O8j349J07K083n28k520K473J083l259P93K398j813j167J914J03j937k63
$$ 531 599 -750 -643 1440 912 -1608 865 1948 -1311 -518 1880 67 -1100 814 917 -1020 -1283
1232a283K478j087k768L155J330l763R54K679j788j269J948J050k048k60K576
$$ -1283 1195 108 -2660 495 1825 -1938 -984 1695 -93 -1362 586 1636 -412 -672 1904
1247A904o49l190K533J398l627N11K273j439j653K085J110k462o66L394l64l275
$$ 1904 1255 -1935 598 1996 -1631 -1120 1153 -286 -1939 146 1256 -1206 -1872 1522 1158 -2117
1263b117K337J978k915j62K729p22k132J299J039j815j182K980r34l040K378J705
$$ -2117 220 2198 -717 -879 1850 1128 -1004 295 1334 -481 -1663 1317 383 -2657 -279 1426
1279A426l170q9L111m65k305J055K646j975j898L378L58m000K023K408l179r41
$$ 1426 -1744 -1833 1278 813 -1492 -437 2209 234 -1664 1714 2072 -1928 95 2503 -676 -1617
1295a617K780m90k276J094J912k046j694L774J65m220K154K688l012r24K926K03
$$ -1617 1163 673 -1603 -509 1403 -643 -2337 1437 1602 -2618 -464 2224 -788 -1712 1214 1417
1311A417k793R93K843k230k060L056J74l622J819K090k808r50L154k44k656Q56
$$ 1417 -1376 -383 2460 230 -1830 1226 1400 -2222 -403 1687 -1121 -2071 1083 839 -1817 -961
1327i61K943j843k248L452J69l001J655J931k338o13J926j8j959j53K460k106
$$ -961 1982 139 -2109 1343 1512 -1489 166 2097 -241 -854 1072 1054 -905 -1058 1402 -704
1343g04j518K953M6k957J498J923j408o48J370N54j255q7J912j034k007K209J59
$$ -704 -2222 731 777 -2180 -682 1241 -167 -815 555 1109 -146 -233 1679 645 -1362 847 1006
1360A006k261Q43J015p76p03J030O49j433q16K492r64k124K237R61k060L90J245
$$ 1006 -1255 -412 603 -173 -876 154 803 -630 -1446 1046 82 -2042 195 1156 -904 -514 731
1377G31m09m12O67P67j100q66J501l33j609J046L50j282L48J172m99j115M00J439
$$ 731 322 -90 577 1344 244 -622 879 546 -1063 -17 333 -949 -601 571 72 -1043 -643 796
1395G96o32j326J721J15j394J084N84q79j33M34K88q30k41R91p53j149J352p0
$$ 796 164 -1162 559 674 -720 364 948 69 -64 370 658 -172 -413 578 -175 -1324 28 -42
1413d2j529J170Q59o10jn6Q20M1o79Q70m75p40R62Q2r79L36K45J11n56k74P67
$$ -42 -1571 -401 458 -152 -153 -209 611 652 -27 843 368 -372 590 672 -307 29 274 385 -171 -445 322
1434C22n07r28J118L21j377L83J112n86k46O45M66l28k24P22l90j189R16L68j106
$$ 322 -185 -1113 5 326 -1051 -668 444 -142 -388 257 723 395 171 893 503 -686 230 598 -508
1453e08K1J039r39l42M43P48j158m20K047n64j403J088P19p70L17L74m29l37J82
$$ -508 -487 552 -387 -729 -286 462 -696 -1116 931 367 -1036 52 771 1 318 692 263 -74 108
1472A08Q29j207n60J359m89j457J395O99j809M20J254k10q21L73J035p55q56J547
$$ 108 937 -270 -830 529 40 -1417 -22 677 -1132 -712 542 332 -489 -116 919 164 -692 855
1490H55l96j239J161L8j067L69P45m75o46O35Q01j075r99J593K56j499R43N71
$$ 855 459 -780 381 419 -648 -279 466 -9 -655 -20 781 -294 -1293 300 556 -943 0 571
1508E71o03l25N98J46o12M19P50r62l88J084k44j235M61P44q58j63O01M25r42
$$ 571 -32 -357 241 387 -225 194 944 -18 -406 678 434 -801 -340 404 -454 -617 -16 409 -533
1527e33k93J488m80r16J151J7p02M57O14q35l8O08J49j187l9J446j062j048J516
$$ -533 -826 662 182 -734 417 434 -268 189 803 -32 -70 538 687 -500 -539 907 -155 -1203 313
1546C13J28j203L67O51k16m15J71P17l94n7O92o58l34P98j77q30M93J94l11l90
$$ 313 441 -762 -395 256 40 -375 -204 513 119 62 754 96 -238 560 383 -447 46 240 -71 -461
1566d61N10J0m76m47R80j32m74L33N99k39Q4r9Nj8J61J65m14j77R41m74r17O29
$$ -461 49 59 -417 -864 116 -16 -490 -157 442 203 287 188 193 175 336 501 87 -90 851 377 -540 89
1588H9r5k84J57m60O19j28n22R54J66r49O61O2j14R4k9K27l86J22K57m29m53N45
$$ 89 -6 -290 -133 -593 26 -102 -624 330 496 -453 208 270 156 250 221 448 62 184 441 12 -441 104
1610A04L6q48N83K40n99j37L21M55j59n74Q02K73m47J96K41o26N44k24k80j31
$$ 104 140 -708 -125 115 -484 -621 -300 155 -4 -578 224 497 50 246 487 -139 405 181 -99 -230
1630b30K20K44m52m41Q57m21n99R50K18r80K36O83k34L19m62K16J65l98O92l75
$$ -230 -10 234 -218 -659 198 -223 -822 128 346 -634 -398 285 51 370 -92 124 289 -109 583 208
1650B08p28P39J28o10K54R9k40k38j22Q20l75m61O33O7m76K88J26j34L10m44R5
$$ 208 -520 219 347 -263 -9 90 -150 -388 -510 310 -65 -526 107 174 -302 -14 112 -22 288 -156 -61
1671f1J41m05O04l72k88P40k79m98L56J23J76p96L58L10l25P1J47M17m00L33q5
$$ -61 80 -325 279 -93 -381 359 80 -418 -62 61 237 -559 -201 109 -216 -145 2 419 19 352 267
1692B67k52K03K59m57m47M43M83n47o82Q89j18n61L88J65p0n1J70J52p6l49K97
$$ 267 15 218 477 20 -427 16 499 -48 -730 159 41 -520 -132 33 -37 -88 82 234 158 -191 106
1713A06K59k93j7J29m21N74j92j76m0k43M71l38m97O67N00j146O39K38k49J48
$$ 106 365 72 55 184 -237 337 145 -31 -71 -314 157 -181 -678 -11 489 -657 -18 220 -29 119
1733A19j74O00k79l89M07M4m26J97K60o42j7N08l32m46J86N79m27m28O75j2p25
$$ 119 -55 545 266 -123 284 328 -98 99 359 -283 -300 208 -124 -570 -384 195 -232 -660 15 3 -722
1754g22O81N13m34K01O7M6m83L89M74q64n13R67l64j088P56P75o93k89Q57j83
$$ -722 -41 472 38 239 306 352 -131 258 732 -132 -645 322 -42 -1130 -374 401 -292 -581 276 93
1774I3m76K44J051q91n51R22j43p01N88L79p13m50J056j95p91K14Q56p30p54J616
$$ 93 -383 -139 912 21 -530 392 249 -452 136 515 -198 -648 408 213 -578 -364 492 -238 -992 624
1794F24q1j203N85R32q84m19Q71L01n68lN15p14m82J006K99j569N43Q67p26l49
$$ 624 543 -660 -75 857 -27 -446 425 726 158 155 670 -44 -526 480 779 -790 -247 620 -106 -455
1814d55L96M86p15k56J100m50q04R16Pn65N62L72p80L7O84M08j234j19J045r33
$$ -455 -59 427 -288 -544 556 106 -698 218 225 -340 222 594 -186 -149 535 943 -291 -410 635 -298
1834b98o23J119M37j090J33P09m99o18R52M68j073J4Q79j92r06J253P2r36K92
$$ -298 -921 198 635 -455 -322 387 -112 -730 222 690 -383 -369 510 318 -588 665 737 -199 93
1853I3N68n33o83P98O05j597J13R73l27p08N41L77o36j2R27n84m02Q69K12j187
$$ 93 661 128 -555 243 848 -749 -636 337 10 -698 -157 220 -416 -428 499 -85 -487 382 594 -593
1873e93L48J106p45q38Q36P85j611M84N92Oq88L61P51q22kR47m55o10R14k33m61
$$ -593 -245 861 116 -722 114 899 -712 -228 364 370 -518 -157 594 -228 -230 717 262 -348 566 333 -128
1894a28K3O61l93q08L73N59o02k71P80j39m29K67K07l16K10J01j4l78J3O93m15
$$ -128 -105 556 163 -645 -272 287 -315 -586 194 55 -374 -107 100 -216 -6 95 81 -297 -284 409 -6
1915fl86R38k88n86M44L44l03o95O24l0l57K51N06p00j75N82K4l81J04M30j92
$$ -6 -392 546 258 -328 116 460 157 -538 86 56 -301 -50 456 -244 -419 163 187 -194 -90 340 148
1936A48k8L50m9p39J24P68m95m48M94j01j66p5L16K29o82K04K40k21R0L99m73
$$ 148 120 470 421 -318 -194 574 79 -369 125 24 -142 -217 99 328 -354 -150 90 -131 -41 358 -115
1957a15m15O53J03l82K05J91om77J09M57m70l20N57k29L5J84j06q8k97O58j38
$$ -115 -530 123 226 -156 49 240 234 -243 -134 323 -147 -467 90 -139 -104 80 -26 -114 -411 247 109
1978A09l01L22J10k71k83O63l57n6M0o3m4l89N85J95m87J89L15m87o4K55kM08
$$ 109 -192 130 240 -31 -314 349 -8 -64 -24 -87 -131 -520 65 260 -227 -38 277 -210 -274 -19 -21 387
2000C87l60M1J03l75L52K40n49K38N59r25L7L26r9j05rm3N8j84K69J11k20P1L17
$$ 387 27 68 171 -204 148 388 -161 77 636 -289 -252 74 -25 -130 -139 -182 -124 -308 -39 72 -148 -77 240
2023B40l78k96P42j41m4L2J94k27rp1N1j43j4K8P1l03K45N4j66K38J33k32Q8k82
$$ 240 -138 -434 308 167 123 155 349 122 113 42 93 -50 -64 -36 35 -268 -23 31 -135 103 236 4 92 -190
2047a90N39l42j52O68m26j75J53k0l18L36K85m88J00k15N6L4L10R0m43R9K02J38
$$ -190 349 7 -145 523 97 -78 75 55 -263 73 358 -130 -30 -245 -189 -155 155 245 -198 -99 103 241
2069B41l9l81J56J72j61j51K39J09j60J23k65N8L13l10j16lK08r6l81L09K92k65
$$ 241 202 -179 -23 149 -12 -163 76 185 25 148 -117 -59 254 -56 -172 -175 33 -63 -444 -135 157 -108
2091a08L38rl30K45l9k79L9P0O2l5j46K52Q1Lj34j31j90L24o0R4N8k54K15L1m0
$$ -108 230 221 -109 136 97 -182 -143 -73 -11 -46 -192 60 141 144 10 -121 -311 13 -47 47 105 -149 66 97 57
2116E7j95J66j39q8K34j73M3j16k2J53L43m8n02J16L29k27m8K87l19K31l7n8p9
$$ 57 -138 28 -111 -199 35 -138 -95 -211 -233 -80 263 215 -287 -171 158 -69 -117 170 -149 82 45 -13 -92
2139i2K38K23k66m1l34M21l8k62J59nO2K6P6L1q9k71J84j79L16j48j19M0J37k74
$$ -92 146 369 103 62 -272 149 111 -151 8 3 65 91 167 198 109 -162 22 -157 159 11 -108 -68 69 -205
2163b05L36J70l95J35K5N6J31k96J72q1j97L74k38J78k04J16j53P8K57l04K36
$$ -205 131 301 -94 41 66 122 253 -43 129 48 -149 225 -13 165 -39 77 -76 2 259 -45 191
2184A91m55J34J56J5j15J32M7l74M23k84P7k8R6J0P1M6k09N5J02K57l51k9M9J71
$$ 191 -264 -130 26 41 -74 58 105 -269 154 -130 -53 -81 15 25 96 142 -67 -12 90 347 -4 -33 16 187
2208A87l16Q9mj92M51l41K18k3j48j2L10m24R1OR3o0K43l17P6Q0K29l99K24k93
$$ 187 -129 -40 -44 -236 215 -126 92 69 -79 -91 219 -205 -114 -108 -15 -75 168 -149 -73 7 236 -163 61 -232
2232b32K66M5j64R5j63K81j05l5j27O0P1Nn8q9J52m4L7J54l2j88j5K74k31j66
$$ -232 34 79 -85 10 -153 128 23 -12 -139 -79 -8 -3 -61 -150 2 -42 -5 149 117 -71 -86 188 -43 -209
2256b09R1K80Rjk22L2j60K69l06K86q9j46L56l40J59jo7J90o4k21K64j60km9O3
$$ -209 -118 162 171 170 -52 -20 -180 89 -217 69 -20 -166 190 -150 9 8 -59 131 67 -154 110 -50 -52 -101 -38
2281c8l7J99q9j37j21M39k84R9K5j44j33J41L43k58k07K03j48k28L74K79n74J27
$$ -38 -75 124 35 -102 -223 216 -68 31 56 -88 -221 -80 263 5 -202 1 -147 -375 -1 278 -296 -169
2303a69Q9J35K2j34L10l84J64J16l16N53l75Q5mn8r5J90l6j30j0j12J5K41k14
$$ -169 -80 55 77 -57 253 -131 33 149 -167 386 11 96 92 34 -61 129 93 -37 -47 -159 -144 97 -117
2326a17K29l69K55K7N3K2J2l37J53L17j80R1k91K41j34j07Q6k07J08J61J86m7
$$ -117 112 -257 -2 25 78 100 112 -225 -72 245 65 156 -135 106 -28 -135 -49 -256 -148 13 199 152
2348A52k80K01k9r5K40J30o39N99J26m44P4O9L8k15r1N40j93l05K81l53o2K99
$$ 152 -128 73 44 -51 189 319 -320 279 405 -39 35 104 142 -73 -164 376 183 -122 159 -194 -256 43
2370D3m1p9L6J62Pm15K38L88m48r5K74m1m49M31J83j75l75J75K67k53k06R00m12
$$ 43 2 -77 -41 121 128 -287 -49 339 -109 -204 70 29 -420 11 194 19 -356 -181 86 -167 -373 527 115
2393A15k64P7M03j44m89N44j39l21K84J6l08M1O98m44n98O38j83l90K41J29P4
$$ 115 -149 -72 331 187 -302 242 103 -218 66 82 -226 -185 513 69 -529 109 -74 -464 -223 -94 -20
2414b0m78J87N73l39p4J81J42k06L50l08mO8J03n9m06L52K44l60k97O27l67mK58
$$ -20 -498 -311 262 -77 -151 30 172 -34 316 8 4 72 175 116 -290 62 306 -54 -351 276 -91 -95 163
2437A63l02L65k53J66N4n40K26N24m83k17K98K31m49Q8M14k31k77j40M37m08K58
$$ 163 -139 226 -27 139 193 -347 -121 403 -80 -297 1 232 -217 -129 285 54 -223 -363 74 -334 -76
2458g6L59r6n07O95k64l75N21q3k60j43L76K27n43l8N02l39l38M65K14o13J88
$$ -76 283 187 -320 375 111 -264 257 174 -86 -229 147 374 -169 -207 295 -44 -382 83 297 -316 -128
2479a28L35n31q5M32L4l19L00K80m84k4L02R5j80k01L28K2l11N3J61l81k2M61
$$ -128 207 -324 -409 23 57 -262 38 318 -166 -190 112 207 27 -174 154 176 -135 -82 79 -302 -324 137
2501A37k41j20N90j88l29L09PK62o92L10M96n70k80M23j68j7K26j75ok30Q9K55
$$ 137 -104 -224 366 178 -151 158 165 427 -265 45 541 -29 -309 114 -54 -71 155 -20 -26 -256 -167 88
2523H8k97K37P1m06k6M24J10k85L15j37j56p0M79j39l28P1N51m47m10M79k74o1
$$ 88 -209 28 99 -307 -333 91 201 -84 231 94 -62 -132 347 208 -120 -49 502 55 -355 124 -150 -211
2545b11K16M6kk95M05K48n19j01P24l81rQ8n5k99J63J63J06n93M66L0m78M8K58
$$ -211 5 51 49 -246 159 407 -112 -213 511 130 121 209 154 -145 18 181 287 -306 160 190 -288 -240 18
2568A8k65O3L00P2n09R4M19l06l9p6O99p49J37N57m13j99O20o86J45j1K23j30
$$ 18 -247 -184 116 188 -321 -227 192 -114 -153 -229 470 -279 -142 415 2 -197 423 -263 -118 -129 94 -36
2590c6k49L81k32l7k0N37m77k70O79J10m96J86M3M7l05m2N32o55L28L03n58j4
$$ -36 -285 96 -136 -173 -193 344 -133 -403 276 386 -110 76 119 166 -139 -181 351 -304 24 327 -231 -245
2612b45L86J01m79J05M37l34p0L8L47k75L06k05k35J12N6J30m25J05L78o1m92
$$ -245 141 242 -237 -132 305 -29 -99 -61 286 11 317 112 -123 -11 45 175 -250 -145 233 172 -320
2633c20J45J93l19O0N38l34PJ49l02K71k87K15p1Q8P9K18k46j61M3o3j17J86L1
$$ -320 -175 18 -301 -241 297 -37 -30 119 -183 88 -199 16 -55 33 112 330 84 -77 -34 -97 -214 -28 3
2656Ck63k20L48L80m11J48NJ07K3P0k1O2m33L74J79m00R0R4p2lM2r0n3j5k0L23
$$ 3 -260 -480 -132 248 -163 -15 -10 97 120 190 169 231 -202 172 351 -49 41 135 63 60 102 12 -41 -56 -76 247
2682B47n64M59j3k54M25j99k4k69L48j26K36k58P8K9k1mk43J91m7J90m78J92Q0
$$ 247 -317 142 129 -125 300 101 77 -192 156 30 266 8 86 115 94 90 -153 38 -9 181 -297 -105 -25
2705b5j17J96k36K48K06n85M19j98L0J99J4j54j09J63m8J07l52J49j45K80JM2
$$ -25 -142 54 -182 66 272 -313 106 -92 -62 137 151 -3 -112 51 3 110 -242 -93 -238 42 43 85
2727H5l79J72J69J2k91K52J31R3l08J32O6l4j56J35l8p8J63k16J73K1j79k76M65
$$ 85 -294 -122 47 59 -232 20 151 244 -64 68 134 100 -56 79 41 -37 126 -90 83 104 -75 -351 114
2750A14j93K58n77L18L81j76K0l00K93j99q5K42j7j46J33r7j42K21q5Q1r7O7q
$$ 114 -79 179 -398 -80 301 125 145 -155 138 -61 -146 96 79 -67 66 -31 -173 48 -37 44 -53 14 6
2773FK2r0K10m5m17M86J75l86L2K47k24j45J38j58K33M7j83l20Q3L74k14j23M4
$$ 6 28 -62 148 103 -314 172 347 -39 -7 240 16 -129 9 -149 84 131 -52 -372 -289 85 -129 -252 -208
2796b08K01L4k52K92J33j02n1q1m8K64j80K14l30K71j39n4J35J7j14k49K7N8K28
$$ -208 -7 27 -225 67 200 98 47 -34 -82 182 2 216 -114 157 18 -36 99 116 2 -247 -220 -162 66
2819F6l4l52M18J09m77K35J10J68j66k6jk5p8k1o4lJ32k1J94l81K67p2n62N64
$$ 66 32 -320 98 207 -270 -35 75 243 77 51 50 25 -53 -74 -138 -141 -9 -30 164 -217 50 -22 -584 -20
2843b0K04n33J65K50R7k2j77L19k05j84L43j93k05K00j97r9K67J91l10j69P09
$$ -20 184 -349 -184 66 163 141 -36 283 78 -106 237 44 -161 39 -158 -257 10 201 -109 -278 431
2864D31m95J17l03L18J29o9m3J57J0k60J18pJ18l89K21k89J20L58k06k94L58o1
$$ 431 -64 53 -250 68 197 128 85 242 252 -8 110 103 221 -168 53 -236 -116 242 36 -258 100 39
2886C9j27K24l47K85M0j85K38J56l96L90J29n40K1L86k95q8K7K64p25J02O04j46
$$ 39 -88 136 -211 74 114 -71 167 323 -73 317 446 -94 -73 313 18 -70 -43 221 -504 -402 202 56
2908E6l94L96l0k87L27N9n1j58J72K39m07j27M60l2k07L2J46k41J8p9k27J75L6
$$ 56 -338 58 28 -259 68 127 76 -82 90 329 -78 -205 255 223 16 48 194 -47 -29 -108 -335 -160 -124
2931a24N09m85M3L40k62L7M3P1k39J26p2P9L5L2p4j3l29M82k7k15j2O7K5p3O9
$$ -124 385 -100 -57 283 21 58 101 172 -67 59 -13 66 101 133 59 46 -283 199 172 -43 -55 12 37 -36 33
2956C3P1l47K11M31k55k45L94j69L09m08J58l30l9J15j62J26j60L14r5l05J85
$$ 33 104 -243 -32 399 144 -101 293 124 433 25 183 -147 -186 -71 -233 -107 -267 47 -48 -353 -168
2977a68K59k13M80j06k00j27J52j38N5j93M46j78l59O58k05m23K40K13k94j91
$$ -168 91 -122 358 252 52 -75 77 -61 -6 -199 247 69 -290 368 163 -260 -20 193 -101 -292
2997b92L04K36n18J65K32n1k36L39l69j49L30R3J73j61j7P6j52m87O77N6o41M33
$$ -292 12 248 -270 -105 127 76 -160 179 -190 -339 -9 84 257 96 79 155 3 -484 193 249 -392 41
3019D1k04L15l85J66L44n49K56L51k99r2J33J2l00O26j34j34k81J59J70m26J01
$$ 41 -163 152 -233 -67 277 -272 -16 335 36 -56 77 89 -211 415 281 147 -134 25 195 -231 -130
3040a30M98m31k08O04j68n43K51L75l68k38M88J49m27m2M96r0l77L87J13m23p7
$$ -130 368 -63 -271 333 165 -378 -127 248 -120 -358 130 279 -148 -190 306 216 -161 226 339 -84 -161
3061a61K26l14r7N43R2j44j35O19o37k26L23R2k26J85n9l07j75L24L74n93J41
$$ -161 65 -249 -346 197 289 145 10 629 -8 -234 89 181 -45 140 81 -226 -401 -77 297 -296 -155
3082a55N86p72k19N04L12o07M2L83k28j6J68K87m71Q5N17n25LK24j7j94j64N22
$$ -155 431 -341 -560 -56 256 -351 -309 74 -154 -170 -2 285 -186 -101 416 -109 -106 118 101 -93 -257 265
3104B65Mn30K44J96o05k2O07j54j98M3M43l91k5M88k46j81L52m5l70L1K32j74
$$ 265 269 -261 -17 179 -426 -448 159 5 -193 -150 293 -98 -123 365 119 -62 290 245 -125 -94 138 -36
3126c6k86M42k1k87r1N32m0n71J19N49l60r4K76J64l75J83K03j28k57K76k2k29
$$ -36 -322 120 99 -188 -279 253 213 -358 -239 310 -50 -144 132 296 -79 104 307 179 -78 198 176 -53
3148e3r4N66m69j94N04k49m19L54K58k39j16L30O9l32nN1k11J00N93l63m67L08
$$ -53 -147 419 -50 -244 260 11 -408 -54 204 -35 -151 179 248 -84 -89 -38 -249 -149 444 81 -386 -78
3170g8J98l40j45L92L24n96j56O44m79J0K82j95K6m1K10Rk39M95j74j81J15N9
$$ -78 120 -220 -365 27 351 -245 -401 243 -236 -226 56 -139 -113 -154 56 65 -174 321 147 -34 81 140
3192A40n45M21L3n4r0J60lm0m48J71M33k96RJ94m2kj41N39l67m2J7O9l86M09L9
$$ 140 -405 16 49 -5 -95 65 62 22 -426 -255 178 -118 -109 85 43 41 -100 439 72 30 47 116 -270 139 178
3217A78k19m13M26p1j82J68L67k60l31L12J63k50R6j4j6P9r7K34j19j2J6m3l18
$$ 178 -41 -454 -28 -99 -281 -113 254 -6 -337 -25 138 -112 -16 -30 -46 33 -64 170 51 39 55 12 -306
3240c06J29N8l51N78M63n56k30K59J28nk55L78J20o75L15L17o00K12N12p01l0
$$ -306 -177 -119 -470 108 571 15 -215 44 172 167 -88 290 410 -265 50 367 -233 -21 491 -210 -240
$$ [...]
8191b26
##END NTUPLES=NMR FID
##END=
