##TITLE=1H_Ser 5308-N
 200.13Hz, CDCl3.
 8 sc
 
 17.4.2026
##JCAMPDX= 6.0         $$ Bruker NMR JCAMP-DX V2.0
##DATA TYPE= NMR FID
##DATA CLASS= NTUPLES
##ORIGIN= UXNMR, Bruker Analytische Messtechnik GmbH
##OWNER= pz
$$ XWIN-NMR		Version 3.5
$$ Fri Apr 17 15:39:03 2026 Russian Standard Time (UT+4h)  she@DPX200
##.OBSERVE FREQUENCY= 200.1313
##.OBSERVE NUCLEUS= ^1H
##.DELAY= (6, 6)
##.ACQUISITION MODE= SIMULTANEOUS
##.ACQUISITION SCHEME= undefined
##.AVERAGES= 8
##.DIGITISER RES= 18
##SPECTROMETER/DATA SYSTEM= spect
##.PULSE SEQUENCE= zg30
##.SOLVENT NAME= CDCl3
##.SHIFT REFERENCE= (INTERNAL, CDCl3, 0, 14.3821)
##AUDIT TRAIL= $$ (NUMBER, WHEN, WHO, WHERE, WHAT)
$$ ##TITLE= Audit trail, XWIN-NMR		Version 3.5
$$ ##JCAMPDX= 5.01
$$ ##ORIGIN= Bruker BioSpin GmbH
$$ ##OWNER= she
$$ F:/spectra/data/she/nmr/H-C/1/audita.txt
$$ ##AUDIT TRAIL=  $$ (NUMBER, WHEN, WHO, WHERE, WHAT)
(   1,<2026-04-17 15:37:18.93 +0400>,<she>,<DPX200>,
      <created by zg, POWCHK disabled, PULCHK disabled
       configuration hash MD5:
       00 E9 B6 7A A2 85 ED C7 34 08 36 98 17 FE 4E 26
       data hash MD5: 16K
       33 AC AE 3A 21 AD F6 D8 1B 21 F7 75 18 B6 0E 50>)
$$ ##END=
$$ 
$$ hash MD5
$$ 1F 01 26 F4 39 CD 80 EE 5A ED 54 3A BC D6 6B ED
##$RELAX= 
##$RELAX= 
##$RELAX= 
##$RELAX= 
##$RELAX= 
##$RELAX= 
$$ Bruker specific parameters
$$ --------------------------
##$DU= <F:/spectra>
##$EXPNO= 1
##$NAME= <H-C>
##$PROCNO= 1
##$TYPE= <nmr>
##$USER= <she>
##$AMP= (0..31)
100 100 100 100 100 100 100 100 100 100 100 100 100 100 100 100 100 100 
100 100 100 100 100 100 100 100 100 100 100 100 100 100 
##$AQSEQ= 0
##$AQ_mod= 1
##$AUNM= <au_zg>
##$AUTOPOS= <>
##$BF1= 200.13
##$BF2= 200.13
##$BF3= 200.13
##$BF4= 200.13
##$BF5= 200.13
##$BF6= 200.13
##$BF7= 200.13
##$BF8= 200.13
##$BYTORDA= 1
##$CFDGTYP= 0
##$CFRGTYP= 5
##$CHEMSTR= <none>
##$CNST= (0..31)
1 1 145 1 1 1 1 1 1 1 1 1 1 1 1 1 1 1 1 1 1 1 1 1 1 1 1 1 1 1 1 1 
##$CPDPRG= <>
##$CPDPRG1= <>
##$CPDPRG2= <>
##$CPDPRG3= <>
##$CPDPRG4= <mlev>
##$CPDPRG5= <mlev>
##$CPDPRG6= <mlev>
##$CPDPRG7= <mlev>
##$CPDPRG8= <mlev>
##$CPDPRGB= <>
##$CPDPRGT= <>
##$D= (0..31)
0 0.7 0 0 0 0 0 0 0 0 0 0.03 0 0 0 0 0 0 0 0 0 0 0 0 0 0 0 0 0 0 0 0 
##$DATE= 1776425838
##$DBL= (0..7)
120 120 120 120 120 120 120 120 
##$DBP= (0..7)
150 150 150 150 150 150 150 150 
##$DBP07= 0
##$DBPNAM0= <>
##$DBPNAM1= <>
##$DBPNAM2= <>
##$DBPNAM3= <>
##$DBPNAM4= <>
##$DBPNAM5= <>
##$DBPNAM6= <>
##$DBPNAM7= <>
##$DBPOAL= (0..7)
0.5 0.5 0.5 0.5 0.5 0.5 0.5 0.5 
##$DBPOFFS= (0..7)
0 0 0 0 0 0 0 0 
##$DE= 6
##$DECBNUC= <off>
##$DECIM= 32
##$DECNUC= <off>
##$DECSTAT= 4
##$DIGMOD= 1
##$DIGTYP= 9
##$DL= (0..7)
0 120 120 120 120 120 120 120 
##$DP= (0..7)
150 150 150 150 150 150 150 150 
##$DP07= 0
##$DPNAME0= <>
##$DPNAME1= <>
##$DPNAME2= <>
##$DPNAME3= <>
##$DPNAME4= <>
##$DPNAME5= <>
##$DPNAME6= <>
##$DPNAME7= <>
##$DPOAL= (0..7)
0.5 0.5 0.5 0.5 0.5 0.5 0.5 0.5 
##$DPOFFS= (0..7)
0 0 0 0 0 0 0 0 
##$DQDMODE= 0
##$DR= 18
##$DS= 0
##$DSLIST= <SSSSSSSSSSSSSSS>
$$ [...]
##$SUBNAM0= <"">
##$SUBNAM1= <"">
##$SUBNAM2= <"">
##$SUBNAM3= <"">
##$SUBNAM4= <"">
##$SUBNAM5= <"">
##$SUBNAM6= <"">
##$SUBNAM7= <"">
##$SUBNAM8= <"">
##$SUBNAM9= <"">
##$SW= 18.0517328524113
##$SWIBOX= (0..15)
0 0 2 0 0 0 0 0 0 0 0 0 0 0 0 0 
##$SW_h= 3612.71676300578
##$TD= 16384
##$TD0= 1
##$TE= 0
##$TE2= 300
##$TE3= 300
##$TEG= 300
##$TL= (0..7)
0 120 120 120 120 120 120 120 
##$TP= (0..7)
150 150 150 150 150 150 150 150 
##$TP07= 0
##$TPNAME0= <>
##$TPNAME1= <>
##$TPNAME2= <>
##$TPNAME3= <>
##$TPNAME4= <>
##$TPNAME5= <>
##$TPNAME6= <>
##$TPNAME7= <>
##$TPOAL= (0..7)
0.5 0.5 0.5 0.5 0.5 0.5 0.5 0.5 
##$TPOFFS= (0..7)
0 0 0 0 0 0 0 0 
##$TUNHIN= 0
##$TUNHOUT= 0
##$TUNXOUT= 0
##$USERA1= <user>
##$USERA2= <user>
##$USERA3= <user>
##$USERA4= <user>
##$USERA5= <user>
##$V9= 5
##$VALIST= <valist>
##$VCLIST= <CCCCCCCCCCCCCCC>
##$VD= 0
##$VDLIST= <DDDDDDDDDDDDDDD>
##$VPLIST= <PPPPPPPPPPPPPPP>
##$VTLIST= <TTTTTTTTTTTTTTT>
##$WBST= 1024
##$WBSW= 4
##$XGAIN= (0..3)
0 0 0 0 
##$XL= 0
##$YL= 0
##$YMAX_a= 259262
##$YMIN_a= -348215
##$ZGOPTNS= <>
##$ZL1= 120
##$ZL2= 120
##$ZL3= 120
##$ZL4= 120
##$ABSF1= 10
##$ABSF2= 0
##$ABSG= 5
##$ABSL= 3
##$ALPHA= 0
##$AQORDER= 0
##$ASSFAC= 0
##$ASSFACI= 0
##$ASSFACX= 0
##$ASSWID= 0
##$AUNMP= <proc_1d>
##$AZFE= 0.1
##$AZFW= 0.1
##$BCFW= 1
##$BC_mod= 2
##$BYTORDP= 1
##$COROFFS= 0
##$CY= -3
##$DATMOD= 1
##$DC= 2
##$DFILT= <>
##$DTYPP= 0
##$F1P= 0
##$F2P= 0
##$FCOR= 0.5
##$FTSIZE= 0
##$FT_mod= 4
##$GAMMA= 1
##$GB= 0.15
##$INTBC= 1
##$INTSCL= 1
##$ISEN= 128
##$LB= 0.25
##$LEV0= 0
##$LPBIN= 0
##$MAXI= 10000
##$MC2= 0
##$MEAN= 0
##$ME_mod= 0
##$MI= 1.114404
##$NCOEF= 0
##$NC_proc= 0
##$NLEV= 6
##$NOISF1= 3.799351
##$NOISF2= 2.8
##$NSP= 1
##$NTH_PI= 0
##$NZP= 0
##$OFFSET= 14.38212
##$PC= 1
##$PHC0= -3716.613
##$PHC1= 26.39229
##$PH_mod= 1
##$PKNL= yes
##$PPARMOD= 0
##$PSCAL= 0
##$PSIGN= 0
##$REVERSE= no
##$SF= 200.129724274929
##$SI= 16384
##$SIGF1= 3
##$SIGF2= 2
##$SINO= 400
##$SIOLD= 16384
##$SREGLST= <1H.CDCl3>
##$SSB= 0
##$STSI= 0
##$STSR= 0
##$SW_p= 3205.1282051282
##$SYMM= 0
##$S_DEV= 0
##$TDeff= 0
##$TDoff= 0
##$TI= <>
##$TILT= no
##$TM1= 0
##$TM2= 0
##$TOPLEV= 0
##$USERP1= <user>
##$USERP2= <user>
##$USERP3= <user>
##$USERP4= <user>
##$USERP5= <user>
##$WDW= 1
##$XDIM= 8192
##$YMAX_p= 0
##$YMIN_p= 0
$$ End of Bruker specific parameters
$$ ---------------------------------
##NTUPLES= NMR FID
##VAR_NAME=  TIME,          FID/REAL,        FID/IMAG
##SYMBOL=    X,             R,               I
##VAR_TYPE=  INDEPENDENT,   DEPENDENT,       DEPENDENT
##VAR_FORM=  AFFN,          ASDF,            ASDF
##VAR_DIM=   8192,          8192,            8192
##UNITS=     SECONDS,       ARBITRARY UNITS, ARBITRARY UNITS
##FACTOR=    0.0002768,     1,               1
##FIRST=     0,             0,               0
##LAST=      2.2672688,     0,               0
##MIN=       0,             -348215,         0
##MAX=       2.2672688,     259262,          0
$$ Real data points
##PAGE= N=1
##DATA TABLE= (X++(R..R)), XYDATA
0@%%%%%%%%%%%%%%%%%qJ6j6J6j6J6k1K9l2L6m2M6n3O1o9Q0q9R9j13J26j40J56
39H2j72J91k13K35k59K87l16L48l83M21m66N12n62O22o89P63q48R45j058J193
59F33j356J556j808K138k587L233m229N933r369J8750q8404k72705K80057L14812
73B46654j19742j63197O9853L5502n9034K2792L7085o8475n4297K4771L0927O874
85I713l8767p4288L6311J35830j7015j55760J8577J59835P13r4360L7220L9374
97E7383r0785k3231J14403L1317q9370m0930J9797J7019L5595n41q9187k4353
109h2883J05345L2235r8431j1777R1801k968p0715K5402N8848l0370l8479L9624
121A7632L1431m7348n0648K4376O0287J609o5848j7553O8416K3096o9607k4549
$$ plain form
0 0 0 0 0 0 0 0 0 0 0 0 0 0 0 0 0 0 0 -8 8 -8 8 -8 8 -13 16 -16 20 -22 24 -29 32 -37 43 -46 53 -60 66 -74 82
39 82 -90 101 -112 123 -136 151 -165 183 -200 221 -245 267 -295 327 -362 401 -447 498 -560 633
59 633 -723 833 -975 1163 -1424 1809 -2420 3513 -5856 12894 -75510 -348215 -68158 246654
73 246654 126912 -36285 33568 69070 10036 32828 69913 1438 -52859 -28088 2839 9713
85 9713 -29054 -103342 -67031 68799 51784 -103976 -85399 74436 75149 -19211 18009 57383
97 57383 -33402 -56633 57770 89087 -283 -41213 -21416 -4397 31198 30657 -58530 -82883
109 -82883 22462 54697 -43734 -55511 36290 33322 -37393 -11991 46857 16487 -21992 17632
121 17632 49063 1715 -48933 -24557 35730 37339 -28509 -46062 22354 45450 -24157 -48706
133d8706N8362O093n3440K1630O7934k5631o9900K8095O5283l1207o7397L0163
145a8721P3442j1380p6666j3344N7301J7204m1594l273L7791j3069m2857K0026
157a5140N3130k3310n6019J6720N1272m290k9795L711J7283j973j2230p008K731
170d918N145p824J293L1962K158o2012k5433P4334M9498o3404n8082M1741N1518
183C5976j4456l1924m531R811J2949N893o907k838j082j5648q35L3514l292n6115
197c9485M779P7104K365q2908n889P0641K117n3666J1260M3274k2990l5782K6801
210b379L5298j7852m1647N40M3092K5433m1504m4859L2627M8833l1899m8686L4578
223h425L8386l5569k0713M7785P027n7222j470O1674N928n7234j3859M3375K2461
$$ plain form
133 -48706 9656 15749 -37691 -16061 51873 26242 -43658 -15563 49720 18513 -48884 -18721
145 -18721 54721 43341 -33325 -46669 10632 27836 -13758 -17031 20760 7691 -35166 -15140
157 -15140 37990 14680 -41339 -24619 26653 22363 -7432 -3721 13562 11589 -641 -7649 -4918
170 -4918 227 -7597 -6304 25658 27816 -34196 -59629 14705 64203 799 -57283 -15542 35976
183 35976 21520 -10404 -14935 -5124 7825 13718 6811 3973 2891 -12757 -13592 19922 16630 -39485
197 -39485 -34706 42398 44763 -38145 -44034 26607 28724 -24942 -13682 29592 6602 -29180 -2379
210 -2379 32919 15067 -26580 -26040 17052 42485 981 -43878 -11251 37582 5683 -43003 -8425
223 -8425 29961 -5608 -26321 21464 28491 -28731 -30201 31473 37401 -19833 -33692 9683 32144
236C2144k4156k8023M022K4910L272k2963J99K5542j0080l4086J7806M4385k1102
249A1870n0141K3397N6317j6184n3371N721M2970J168l0012m594J8654K277j6043
262g971k29J8723o10k9459m589L9282J5620m4008k4714M4395L0990l8563l1179
275c2312L4991K7823k9767k0161L0056J2830l6477j4489L8817J8963l9990k7018
287c6734L5011L5230k6970l9980J6899M1164p607l5328O338L0792q853k7295J5330
300b003K8068k1849l2369K3865L8471k2824m5684J2816M5097k238l8760n145K9627
313G072P334k2324l938K1010P27k2293K553L1534m8l9407q132M2586J7218m0741
327f849k6300L1869K7687k3382k5552J5731J7601j4319j0055K0211R407k5896
$$ plain form
236 32144 7988 -20035 -16013 8897 12169 -10794 -10595 14947 4867 -29219 -11413 32972 11870
249 11870 -38271 -14874 41443 25259 -28112 -22391 20579 21747 -8265 -12859 5795 8072 -7971
262 -7971 -8200 10523 9913 -19546 -24135 15147 30767 -13241 -37955 6440 37430 -1133 -32312
275 -32312 2679 30502 735 -19426 10630 23460 -13017 -27506 11311 30274 -9716 -36734
287 -36734 -1723 33507 6537 -33443 -16544 24620 17013 -18315 -11977 18815 9962 -17333 -2003
300 -2003 26065 4216 -28153 -4288 34183 11359 -34325 -21509 23588 21350 -17410 -22555 7072
313 7072 14406 -7918 -11856 9154 9881 -12412 -9859 21675 21627 -17780 -25912 16674 33892 -6849
327 -6849 -33149 -1280 26407 3025 -22527 -6796 10805 -3514 -13569 6642 16049 -9847
339i847j2684L1775K3668l0797l3997K3282L9832j3583l8519M691L1589m471k5988
352a5049Q287K1954j6022k4962K1294L3236k0664m0619J4666M5351l766m1466
364a7760k823L6035Q185k8984r411K1003M271k0379R97K5310l280l5390k278L9842
378A5338J0605m0437j8219L6262K4016k6053j9898K0849J4358j9718j0196K2710
390I617J0463k5851j4761K6313J9911k8204k9430K3582L5920j5413l6340P906
402a6287L1667n368k5123P687K1474j0757j8464J7607K3827j8072l2285J0795
414a3299L4816k798l4771k627L3178M614l4080r105L0867Q635k6180l658K6151
427A1743N72k7053J825L0678J363l1642q146L0130J7338k4447k2091J5896K0513
$$ plain form
339 -9847 -22531 9244 32912 2115 -31882 -8600 31232 17649 -20870 -16179 15410 10939 -15049
352 -15049 -6762 15192 -830 -25792 -4498 28738 8074 -32545 -17879 27472 23706 -17760
364 -17760 -20583 15452 23637 -5347 -14758 6245 10516 -9863 -8866 16444 13164 -22226 -24504 15338
378 15338 25943 -14494 -32713 3549 27565 1512 -18386 2463 16821 -2897 -13093 9617
390 9617 20080 -5771 -20532 5781 25692 -2512 -31942 -8360 27560 12147 -24193 -16287
402 -16287 15380 10012 -15111 -7424 14050 3293 -15171 2436 26263 8191 -24094 -13299
414 -13299 21517 18719 -16052 -18679 14499 19113 -14967 -24072 6795 15430 -10750 -14408 11743
427 11743 12315 -14738 -12913 17765 19128 -12514 -20660 9470 26808 2361 -19730 -3834 16679
440A6679j8504j9942K1883J9821k1631j9668K4717J5285k9726j4770L3882K0403
452B8429k8393k3560K0675K6948r341k8341k395K2475O277j7240j26J9479j1070
465C817l1578J2420L9354j2088l9144J5653M1054j3381m1136M131L3705P085j9501
478C91q184J0012O198r711o331J4760N958k7446j2246L8237K1608l9996k8260
491c5010L4271K3547k7977j4588K6564J0942k0621p246J7212N266j6810j0693
503a5143J7341K0940j4205l2303J0118L5822n319m0927j675L5628K587k0411Q216
516F69J4021k0315j7544K1755K4417j3549k4069O462K5765L49l0402j1140K9280
529E699J7499k6391j7290K3681J2803k3787q346K1099J338k0935N065K8612L073
$$ plain form
440 16679 -1825 -21767 116 19937 -1694 -21362 3355 18640 -11086 -25856 8026 28429
452 28429 36 -23524 -2849 24099 14758 -13583 -15978 6497 12774 -4466 -4592 14887 3817
465 3817 -27761 -15341 24013 11925 -27219 -11566 29488 16107 -25029 -20898 12807 19892 391
478 391 -7793 2219 8417 -1294 -7625 7135 13093 -14353 -26599 11638 33246 -6750 -35010
491 -35010 -739 22808 -5169 -19757 6807 17749 -2872 -10118 7094 12360 -4450 -15143
503 -15143 2198 23138 8933 -23370 -13252 22570 17251 -23676 -25351 10277 12864 -7547 669
516 669 14690 -5625 -23169 -1414 23003 9454 -14615 -8153 17612 17961 -12441 -23581 5699
529 5699 23198 -3193 -20483 3198 16001 -7786 -16132 4967 6305 -14630 -9565 19047 22120
542B2120k9314j4932J8685K1466r610j9139Q907J7141j4359j8867J8082J8011
554A8191k1592j7813K3194J4089k3560j1923K5160J4987k0398k0889Q635K5264
566A3345P339j8320j2260J2613M687j9155K133K6438o928l0871J1582L3894j7097
579G400l4840J4782L0821r748k1780N982J4947K651p536j0418J33J4348r29j0233
593d420J2835J2568l1434k2549L7114K6600l8512k2339L7101J7037l2764r844
605a8607K5329L338j6995K053J0857N0o251n494L803J6265k417l0010K97L9851
619B2069Q01m3854m4L6868q224k9219J7773K3431k4080j7041K9303J6497k4339
632e9j7920J1273J7447L977j5376j6532J5913K4749j7698k8642J6485K2500j9627
$$ plain form
542 22120 -7194 -22126 -3441 18025 8415 -10724 -1817 15324 965 -17902 180 18191
554 18191 -3401 -21214 1980 16069 -7491 -19414 5746 20733 335 -20554 -11919 13345
566 13345 20684 2364 -9896 2717 7404 -11751 -9618 16820 9892 -20979 -9397 24497 7400
579 7400 -27440 -12658 18163 8415 -13365 -7383 7564 10215 2679 -7739 -7606 6742 5813 -4420
593 -4420 8415 20983 -10451 -33000 4114 30714 -7798 -30137 6964 24001 -8763 -18607
605 -18607 6722 10060 -6935 -4882 5975 6025 -226 -5720 -1917 14348 11931 -18079 -17782 22069
619 22069 22870 -20984 -21028 15840 7616 -21603 -3830 19601 -4479 -21520 7783 24280 -59
632 -59 -17979 -6706 10741 14718 -658 -17190 -1277 23472 5774 -22868 -6383 16117 -3510
645c510j1396K6003J906l3781J47L7011L209k9985m150K1618Q537j1896j2952
658i239J913J2608L066j2618n5J4498p455j9651J2848K4829j8108l0103J8197
671i270L3076j3598k9948Q109K4984j560j6668Q52J0841k639j0312L649J3813
684A1329o137k0548L911K5589J90k6775n762K5807P726k1915j0166J7367J0175
697A0791j2686n239J4473M551j7496m846K0149P240k4379j1146K2818J2669k0616
710c717j4131J5758J3881r817j0485N944Q172m764q429N069J0976m819j5335P728
724c969K2462o491k7622O233K7023p074k6600O063K0642q729j5155R948J2693
737I424q977r965P815J1645m104j4135l667J8828J0964j8826j7522J9542J9333
$$ plain form
645 -3510 -14906 11097 13003 -20778 -20631 16380 19589 -10396 -14546 7072 15609 3713 -9239
658 -9239 -7326 5282 8348 -4270 -4325 10173 2718 -16933 -4085 20744 2636 -27467 -9270
671 -9270 23806 10208 -19740 -11631 13353 11793 -4875 -4023 6818 4179 -6133 -2484 11329
684 11329 5192 -15356 -11445 14144 14334 -12441 -18203 7604 15330 -6585 -16751 616 10791
697 10791 -1895 -7134 7339 11890 -5606 -10452 9697 16937 -7442 -18588 4230 16899 -3717
710 -3717 -17848 -2090 11791 1974 -8511 -2567 5605 841 -7588 -2519 8457 3638 -11697 -3969
724 -3969 18493 12002 -15620 -9387 17636 10562 -16038 -9975 10667 1938 -13217 -3269 9424
737 9424 447 -9518 -1703 9942 5838 -8297 -11964 6864 17828 -998 -18520 1022 20355
750B0355j8946j6496J8162R267k1522l377K2388l08k4689J83K5250J896j9320
763g157m683J4163J0735o654j4391l28J4137J950j2832O60J4244p585j7113J3219
777a635K0577j6768k6138J5774K6510j1113k2590O197J7550j205j0351K499M978
790D285j838n330K574O975k495j3647j213K0477N867k3646j0507K1279J4419j9778
804b578j3434J6491Q125j2887k955J5316N43j5861j194J9108K685j6974r103J2552
818a66J3182r102j6714N716J5440l268j3196K942J2505n971j1663R209J4862j3586
832A90j5908J5067J7540r692j8993O398J5973l710j3323J80Q597k80p827N90R343
847D145j79j2467N21J6980K325k0946m793K2061O619j8247o430J6326M802j2889
$$ plain form
750 20355 1409 -15087 3075 12342 -9180 -12557 9831 9523 -15166 -14983 10267 12163 -7157
763 -7157 -11840 2323 13058 6404 -7987 -8315 5822 7772 -5060 -4400 9844 2259 -14854 -1635
777 -1635 18942 2174 -23964 -8190 18320 7207 -15383 -9186 8364 7159 -3192 -693 4285
790 4285 2447 -2883 -309 6666 4171 -9476 -10689 9788 15655 -7991 -18498 2781 17200 -2578
804 -2578 -16012 479 8604 -4283 -7238 8078 8621 -7240 -8434 10674 13359 -3615 -12718 -166
818 -166 13016 3914 -12800 -7084 8356 5088 -8108 -5166 7339 1368 -10295 -1086 13776 190
832 190 -15718 -651 16889 7197 -11796 -5398 10575 6865 -6458 -6278 2319 2039 -5788 -5198 4145
847 4145 3966 -8501 -7980 9000 11325 -9621 -14414 7647 14266 -3981 -10411 5915 10717 -2172
861b172l750J0629M86q610k634R939J864j2510n102J1737J2473j1167j4538Q581
875d774J8253o462j6377M208J3924n734j0683Q504J1289j2054j2156J1767J3728
888A3433j1702j5706P908J5704l225j5123k050J3489M770r203l950R428K139r436
902c524O54J3044k346j9598l53K3250M620k2803p462J8036O573j3785n977J0189
916E18L892o622j698P053P79q100k596J1122Q813j1905j3920J1307J6903r119
930F427k0467N808J7197m865j2187P575P852j0781p262J2137P719r963q905P873
944a842J1959k967j3811j173J4140M637j3631n657J1798L735j2525p02J4087m158
958C890j7006M032J9832r18j7335k621J3627M774r446o366Q002Q270n867o848
$$ plain form
861 -2172 -5922 4707 5193 -3417 -6051 3888 5752 -6758 -11860 -123 12350 1183 -13355 -4774
875 -4774 13479 7017 -9360 -5152 8772 3038 -7645 859 12148 94 -12062 -295 13433
888 13433 1731 -13975 -6067 9637 6412 -8711 -10761 2728 7498 -1705 -5655 3773 5912 -3524
902 -3524 -2870 10174 7828 -11770 -12123 11127 15747 -7056 -14518 3518 10091 -3694 -9671 518
916 518 4410 -2212 -3910 3143 3922 -4178 -6774 4348 13161 1256 -12664 -1357 15546 6427
930 6427 -14040 -8232 8965 4100 -8087 -512 7340 -3441 -10703 1434 9153 -810 -9715 -1842
944 -1842 10117 7150 -6661 -7834 6306 10943 -2688 -8345 3453 7188 -5337 -6039 8048 3890
958 3890 -13116 -9084 10748 9830 -7505 -10126 3501 8275 -1171 -7537 465 8735 2868 -3980
972c980M810O403r950p332J2389Q870j4433j0060J4543J0897j3979j2089R989
985c922J2486m680p969K465P469m130p683M387J0562m349j2608M633J4334m861
999F134j6862J310J6528l48j3811j253J2062q0p082p9O970l14q509J161J2459
1014H286J373j4620m378J4842P003j5809j0029J4533Q753r875o583O651K444o960
1028d369j485Q464L588r490k368R541O972j0324j2450Q862J6543o433j5507L621
1042d835J1917m907r718N528O960p847l467P679O341q158j0064N576J2885Q88
1056H778j3110k939J1583M862j1252n092J1290K310j1564L50J2566l640j4193
1069a0051L105J4102R81j5172l297J1637Q503p031r466M195R282m110p313N836
$$ plain form
972 -3980 830 7233 -2717 -10049 2340 11210 -3223 -13283 1260 12157 -1822 -13911 -3922
985 -3922 8564 3884 -4085 -1620 5849 1719 -5964 -1577 8985 4636 -7972 -3339 10995 6134
999 6134 -10728 -9418 7110 6762 -7049 -8302 3760 3680 -3402 -3481 3489 3175 -5334 -4173 8286
1014 8286 9659 -4961 -9339 5503 12506 -3303 -13332 1201 9954 79 -6504 147 2591 -4369
1028 -4369 -5854 2610 6198 -3292 -5660 3881 10853 529 -11921 -3059 13484 7051 -8456 -4835
1042 -4835 7082 2175 -7543 -2015 4945 -2902 -6369 1310 7651 -507 -10571 -4995 7890 8778
1056 8778 -4332 -7271 4312 9174 -2078 -7170 4120 6430 -5134 -4784 7782 4142 -10051
1069 -10051 -6946 7156 8137 -7035 -10332 1305 9808 2777 -6689 -2494 6788 2678 -4635 1201
1083A201N854r241n060J2065O603j5644r853J3083J1106p625j0949L915R196j573
1097C078p628L1R178o61p538J405R303l725j3351O161J5224m332j6253Q35J3140
1112D867L94q693j858N782O25m470N41O518k33q458r65J1418M804j2974q632J5017
1128C683Q531j4047q783J2252O706r333l425M505J418n182R15N617J896n564o587
1143g398N312J0581l568j2753L797J5134m042j4524K274J1749l989q207O120O259
1157F745r748o059Q490O829n446p774J865P019N623r427n280Q997O986q990o975
1172g145R728M192j0976r62J2210r48j4327q0J4549Q15j2581l720R942O040m918
1187A819o974K547O715j379o070M526O405p015q691Q666R595r615j1439Q603J2023
$$ plain form
1083 1201 7055 -2186 -7246 4819 11422 -4222 -14075 -992 10114 2489 -8460 -4545 4651 3078
1097 3078 -4550 -4519 4659 3998 -3540 -2135 7168 3443 -9908 -3747 11477 7145 -9108 -8273 4867
1112 4867 5261 -3432 -5290 492 1117 -3353 -2812 3706 3473 -4985 -5950 5468 10272 -2702 -11334 3683
1128 3683 12214 -1833 -10616 1636 8342 -991 -4416 89 1507 -3675 -2760 2857 4753 -811 -7398
1143 -7398 -2086 8495 4927 -7826 -4029 11105 7063 -7461 -5187 6562 2573 -5634 486 6745
1157 6745 -3003 -9062 -572 6257 811 -6963 -5098 1921 7544 -1883 -7163 1834 8820 -170 -7145
1172 -7145 2583 6775 -4201 -5163 7047 6099 -8228 -8308 6241 7056 -5525 -9245 697 6737 1819
1187 1819 -5155 -2608 4107 2728 -3342 1184 7589 574 -8117 549 10144 529 -10910 -2307 9716
1202I716p033j1224L712R320j784p380J475O000o79n187K592P155l305j0008K056
1217d574J2765M83j3607l842J0841M640q057m386O139K705n593j532P183Q83q980
1232d932j524J1180L107j1055m332J1505O429q710q346M694O242k658m228J586
1246a042K713l424l527N158O021o198q559O394J1735n003j2309L688J1517k636
1260D528q782K806O621l643m354L511L250m908m964L093O517m42q449k208R760
1275B336N389q876p244R679O183q416l158O964K713j0150J646R264j145r747k39
1290d801Q425J664p900m752M761O706k420n860J488O461j289n783L606O486n993
1305G99q375P217R872p380j1131N662J0655m024q691J957O300j214m933Q14L411
$$ plain form
1202 9716 2683 -8541 -4829 4491 2707 -4673 -3198 2802 2123 -3064 -472 6683 3378 -6630 -4574
1217 -4574 8191 8674 -4933 -8775 2066 6706 -1351 -5737 402 3107 -2486 -4018 3165 4048 -4932
1232 -4932 -6456 4724 7831 -3224 -7556 3949 10378 1668 -6678 -1984 4258 1600 -2628 -1042
1246 -1042 1671 -1753 -5280 -122 5899 -299 -8858 -2464 9271 4268 -8041 -4353 7164 4528
1260 4528 -4254 -1448 5173 1530 -2824 687 3937 -971 -5935 -2842 3675 3233 -5216 -7424 2336
1275 2336 7725 -1151 -8395 1284 7467 -949 -4107 2857 5570 -4580 -2934 6330 5185 -4562 -4801
1290 -4801 3624 5288 -2612 -7364 -2603 4103 1683 -4177 -2689 3772 2483 -3300 306 6792 799
1305 799 -7576 -359 9513 2133 -8998 -3336 7319 3295 -5396 -3439 2861 1647 -3286 -2472 939
1320I39o96l171J601O052M2q443j351J0020L859j1015n783Q854O142q123m394
1335e467O508K210o428j27P000j063p241p18Q230K473o565n045N829P631k305
1350D922q386J61O994p99o211J990M507m884m938P284O345q023p631P054Q416
1365F801l833q066J515O189R43m315j141L251J641l531K70M315j684p961L26R909
1381D629O67j1078k051J0524L219p691l326O219K574m673r32M187K79m828k36
1396b517N851J913o545m490O300O270n321q303K342P987j558o589K590O098k988
1411A040n227N023N327n867o323N972O941m748p182K708O551j126n711p88L996
1426E86K362l506l040L281K260n045n81P728J958q909k891J0091L156q680m331
$$ plain form
1320 939 243 -2928 -1327 4725 4767 -3676 -5027 4993 8852 -2163 -7946 908 7050 -1073 -5467
1335 -5467 1041 3251 -3177 -3304 3696 2633 -4608 -5326 2904 5377 -1188 -6233 -404 7227 4922
1350 4922 -3464 -3303 3691 2892 -3319 -1329 3178 -1706 -6644 640 6985 -1038 -8669 -1615 6801
1365 6801 2968 -5098 -3583 2606 3549 -766 -1907 1344 2985 -546 -276 4039 2355 -5606 -5280 4629
1381 4629 5296 -5782 -7833 2691 5910 -1781 -5107 1112 3686 -987 -1919 2268 2547 -2281 -2517
1396 -2517 3334 5247 -1298 -5788 512 6782 1461 -6842 -4500 3487 1929 -4660 -2070 4028 1040
1411 1040 -4187 836 6163 296 -6027 -55 6886 2138 -5044 -2336 4215 3089 -2622 -3410 586
1426 586 2948 -558 -3598 -317 1943 -3102 -3683 4045 6003 -2906 -5797 4294 7450 -1230 -5561
1441e561P061K484n473n57M179m42l596M81K703K78k989k034K942M455k618p587
1457f274L612Q276q87q540K025P328l798n581O029J891p010k934P405K954n216
1472g20l937K326N015o01l933l125N080M870m198m462N340J798n500P60O948k798
1488B863q412K108Q810j561r462k0O659K221k213l351J032K128n02j331J461L322
1504C752m178l666N806M524o824n546O856O294o467o368L417M701j290k928Q01
1519a116J407r73j313K340L726k441o251K022Q600q57r115j19P549M16o478M42
1535b161M252r75l641O18K851o17k686M23M583Q27n991l002O868N437o135n024
1551d373M925L264m321k187M064Q62m124l13L392Q46l584k719L411M402k064n528
$$ plain form
1441 -5561 1500 3984 -1489 -2046 2133 1691 -1905 -1424 1279 1557 -1432 -3466 -524 3931 1313 -6274
1457 -6274 -2662 5614 4727 -3813 -1788 5540 1742 -3839 2190 4081 -2929 -5863 1542 4496 -720
1472 -720 -4657 -2331 2684 2083 -1850 -4975 105 4975 777 -3685 1655 3453 -2047 -1287 5661 2863
1488 2863 -5549 -3441 5369 3808 -5654 -5674 985 3206 993 -2358 -1326 802 300 -1031 430 3752
1504 3752 -426 -4092 1714 6238 -586 -6132 724 7018 551 -5817 -2400 2301 1011 -1917 -1116
1519 -1116 291 -682 -1995 345 4071 1630 -4621 -2599 6001 5144 -3971 -4090 3459 3875 -2603 -2161
1535 -2161 2091 1116 -2525 -1907 944 327 -2359 -1936 2647 3474 -2517 -5519 1349 6786 651 -4373
1551 -4373 552 3816 -505 -2692 1372 2234 -1890 -2203 1189 2035 -1549 -4268 -857 3545 1481 -4047
1567d047J195O883q75o102J507N785k864m175L160K658m140k767M636K751l215
1582C90m444P53M372K074l594l555M255L293m161k521N277J200o008P36P380j854
1598C593p577O82O956p47n419n82L091J708r19l172l3L719J83l444J865L638l517
1615B5n042O065N903o903n680O187N230n192m891L089K623q71j577J89L0K43j245
1632a817J085L716m83n641l5O918R35p831L96P206n31o157j410M284q08j501J152
1649e22K471j770l598L82M563K131m421l735M834M823l742m660K871M026k760
1664H93l039L107J558l072j833L234J508m263k084K405N110j947n131J03N474
1679B023O36m718R41L076j148l342K760M158l952m178J830N596k304m587K79M088
$$ plain form
1567 -4047 -2852 4031 3156 -2946 -1439 4346 1482 -2693 467 3125 -1015 -3782 854 3605 390
1582 390 -4054 -3301 1071 3145 -449 -4004 251 3544 -617 -3138 2139 3339 -2669 -1933 5447 3593
1598 3593 -3984 -3302 3654 2907 -2512 -3094 -3 1705 786 -2386 -2419 1300 1483 -1961 -96 3542 25
1615 25 -5017 1048 6951 48 -5632 555 5785 593 -4298 -1209 1414 543 -1034 -845 -815 -572 -1817
1632 -1817 -732 2984 2501 -3140 -3175 3743 4678 -3153 -2757 4449 3918 -2239 -3649 635 -173 -1674 -522
1649 -522 1949 179 -3419 -3037 1526 3657 -764 -4499 335 5158 1416 -3244 -373 3653 893
1664 893 -2146 961 2519 -553 -2386 848 2356 -1907 -3991 -1586 3524 1577 -3554 -3451 2023
1679 2023 2659 -2059 -1118 1958 810 -2532 228 4386 434 -3744 -1914 3682 1378 -3209 -2930 1158
1695A158J841m673j310L061Q30j522j681M490l02l019j566N263J54n066n72M725
1711A811J298m052k792K510L207j691k120J371J356j147j995K060K342k203l030
1726c075M552K949l080m895K938M994k444l199k15L416j66k990j08K739j445k775
1742b804J839M414k067m443Q36M937J596o057k284N146K675l013j428O63J525
1757A535k657k60K385O12l489j359M549J917m400l025L802M291k741l645J748
1772g37L221j373k145J359J605k208j914K967K064k892l775K354M084j259m630
1787c279N62M760K40l466o87K772m12j619R26J981j09l179J11M341m98m554j273
1804c383L917K270l280k339K713J821k247j217K799Q79k983o46M045Q47m180k131
$$ plain form
1695 1158 2999 -1674 -2984 77 907 -615 -2296 2194 1892 -1127 -2693 2570 2724 -2342 -2914 1811
1711 1811 3109 -943 -3735 -1225 1982 291 -1829 -458 898 -249 -2244 -184 2158 -45 -3075
1726 -3075 1477 4426 1346 -3549 -611 4383 1939 -1260 -1475 1941 1775 -1215 -1323 1416 -29 -2804
1742 -2804 -965 3449 1382 -3061 -2225 2712 4308 -1749 -4033 1113 3788 775 -653 10 1535
1757 1535 -1122 -1382 1003 1615 -1874 -3233 1316 3233 -1167 -4192 -390 3901 1160 -2485 -737
1772 -737 2484 1111 -1034 325 1930 -278 -2192 775 2839 -53 -3828 -1474 2610 1351 -3279
1787 -3279 -2717 2043 2283 -1183 -1870 902 490 -1129 -203 1778 1669 -1510 -1399 2942 2444 -2110 -3383
1804 -3383 534 2804 -476 -2815 -102 1719 -528 -1745 1054 1933 -1050 -1696 2349 3196 -984 -3115
1820c115M342K325k996k965J290K925j212k268L93J982r75j900J968K463k053
1835B04l482K515M564k116m524J183M748q04l376n25K302K22j884M38J638j094
1851Ik265Q24L148j63l903r15M702K372m036k825L202K627k419j537J457J071
1867A349k213m85K656q5l181j025L546K140l040l106K052L763q57l296J13K855
1883A186L7j761Q08J644j949j872J903K930k468l424J629L485n97l771k10L153
1899G23J152k510m97J676J05j300L41K287m76l050m6L640Q54l861k174L204K363
1916B431k624k088K049J198j012j324K020J138l028n44L532J712l679j819J937
1931a01J832k40l228M2K907J080l122k44J557r97j929J604K866j688l259K029
$$ plain form
1820 -3115 1227 3552 556 -2409 -1119 1806 594 -1674 -1281 701 -274 -2174 -206 2257 204
1835 204 -3278 -763 3801 1685 -2839 -1656 3092 2288 -1088 -1613 689 911 -973 -535 1103 9
1851 9 -2256 -1432 1716 1553 -2350 -3265 1437 3809 -227 -3052 150 2777 358 -1179 278 1349
1867 1349 -864 -1349 1307 1222 -1959 -2984 562 2702 -338 -3444 -1392 2371 1514 -1782 -1669 1186
1883 1186 1223 -538 270 1914 -35 -1907 -4 2926 458 -2966 -1337 2148 1551 -2220 -2430 723
1899 723 1875 -635 -1132 544 649 -651 -310 1977 1501 -1549 -1595 2045 2899 -962 -3136 68 2431
1916 2431 -193 -2281 -232 966 -46 -1370 650 1788 -1240 -1784 1748 3460 -219 -2038 -101
1931 -101 1731 1491 -1737 -1695 1212 2292 -830 -1074 483 -514 -2443 -839 2027 339 -2920 -891
1947h91L971j825l168Q40K534M77k120o48P84Q20p78n39J810p11j647p03K950
1964A156J403l906k718M541L176m291j126J947J098j079n71K428j556j750J066
1979a82R97J08j143k410J149L130k62m202M85M171j61k448l61K744j306j701K371
1996I79J362k200j769K706Q68j253j828o2J445J068k045j362J523K717k323j978
2012b152K330J435k921r7L532n20l803L69L938J09k873n59J374M51k85j407mJ042
2030d1L94j874L90K621j163k278K601K583l257k938K676K955j755j918J102N56
2046F54l51n97k69K24K67q76L84J411k87k657J72M044N93m007o15L320K8k104
2064f66J90J461j100l35N13Q68o56j447K84J272J172k034k294K209K566j610k392
$$ plain form
1947 -891 3080 1255 -1913 -1073 1461 1938 -182 -830 -46 774 -4 -543 1267 556 -1091 -1794 1156
1964 1156 2559 -1347 -4065 476 3652 -639 -1765 182 1280 201 -370 2058 502 -1248 -182
1979 -182 815 923 -220 -2630 -1481 1649 1387 -2815 -2330 1841 1680 -768 -1129 1615 309 -1392 979
1996 979 2341 141 -1628 1078 1946 693 -1135 -1197 248 1316 -729 -2091 -568 2149 -174 -2152
2012 -2152 178 1613 -1308 -1405 2127 1607 -2196 -1827 2111 2220 -653 -1212 162 613 328 -1079 -1083 -41
2030 -41 353 -1521 -1131 1490 327 -1951 650 3233 -24 -2962 -286 2669 914 -1004 98 654
2046 654 303 -294 -563 -339 -72 -948 -564 847 560 -2097 -1925 2119 2712 -1295 -1910 1410 1438 -666
2064 -666 -476 985 -115 -450 63 931 275 -1172 -888 384 1556 -478 -2772 -563 2003 393 -1999
2081a999J478K329j501o99J597l52j770M14J635K31k006j331Q39K550P1k774n55
2098a843K753L29k801J93K136n04j338J938J051k091j328J817J524r97j504q83
2114a548J710J295j353k150J032K466j339j387K107N17l047j17L761l46l312L38
2130a373K750L83j928m87Q94K30K10n71j466P26Q98j306L67K045j500k539K370
2147b97K522j908k544K622K301k300j326R43J312j143m66M1L76o05L29J3J90P33
2165G93j734j324L463P77k825j717L384J006k171j14K058j137j752R97J772r25
2181E51j600N95M10M79n01j321j80K871o79k394R64K207q70j522J733J152k632
2198g37o31K953K11k109j248J459J094l30j301k74R17M04p22j575J755P56j448
$$ plain form
2081 -1999 -521 1808 307 -392 1205 853 -917 -503 1132 1363 -643 -1974 -1135 1415 1486 -1288 -1843
2098 -1843 910 1239 -1562 -1369 767 263 -1075 863 1914 -177 -1505 312 1836 839 -665 -1548
2114 -1548 162 1457 104 -2046 -1014 1452 113 -1274 833 1350 -1697 -1814 1947 1601 -1711 -1373
2130 -1373 1377 1760 -168 -655 239 469 679 108 -1358 -632 266 -1040 -673 1372 -128 -2667 -297
2147 -297 2225 317 -2227 395 2696 396 -930 13 1325 182 -284 -243 133 -472 -143 -130 60 793
2165 793 -941 -2265 1198 1975 -850 -2567 817 1823 -348 -462 1596 459 -1293 -296 1476 551
2181 551 -1049 -454 -44 435 -66 -1387 -1567 1304 625 -1769 -805 1402 532 -990 743 1895 -737
2198 -737 -1368 1585 1796 -313 -1561 -102 992 662 -639 -913 4 408 -314 -1889 -134 622 -826
2215h26n6J793J26k228P44K612q18k593m62K200O10p04j171O91O31j189j47J030
2233B43K34j253j41J857M30j850j149J972J559j084k174J062J574n34j223L58
2249a19L31q91n38J229J081j376j600J528J765r94j641P14J621k14j182R8N87
2266C99J42j141N26O86l44j148n6K008m98j986m71K562M58j675o34J499M45m76
2284B96p57J241l27p50j78J631k09j716k56J029J590j765j876J005K110o39j387
2301i58J103N20q75p09J260R98j124j277J296J211j330j164M96J667J61k022o30
2318a377J040J617k045p3J082O8q45k30J335L57k602P44J565Q12k120l28J114
2335A14J091p57j461Q74J46K32j083J182l6p45n97P17J228j248o95N14K406r84
$$ plain form
2215 -826 -882 911 1037 -1191 -447 2165 1347 -1246 -1708 492 1102 398 -773 -82 549 -640 -787 243
2233 243 477 -776 -917 940 1370 -480 -1629 343 1902 818 -1356 -294 1280 746 -477 -119
2249 -119 212 -679 -1217 12 1093 -283 -1883 -355 1410 416 -1225 -511 1110 896 -286 -188 399
2266 399 541 -600 -74 612 268 -880 -936 1072 574 -1412 -1883 679 1137 -538 -1172 327 772 296
2284 296 -461 780 453 -297 -475 1156 947 -769 -1025 4 1594 -171 -2047 -1042 1068 429 -958
2301 -958 145 665 -210 -919 341 1339 215 -1062 234 1445 115 -1049 -553 1114 1275 -747 -1377
2318 -1377 -337 1280 -765 -838 244 312 -533 -763 572 929 -1673 -929 636 1448 -672 -1000 114
2335 114 1205 448 -1013 -139 7 239 -844 338 302 -443 -1040 -323 905 -343 -1038 -524 1882 898
2353H98j346M13N10J54n92j6j46m99j97K1O82N73k059R34J251m68o77J08P32R39
2373A215j600m62P39M74n81k57J895j234r09M10J200P73k442L15n5J538j847n73
2391a401J793N55j053r7P95J30j137l62P49Q11j149o91R97K007j642p92N69J269
2409A351j378n57L34k8J33n04K74R00n74j176J158P85L57r41m45R64L88p72q03
2428e34L69N95j853R86P25l2j173K61J226J90q82n48J491K95q91q31J118P15r33
2447B94r53J97R27q35m33O96R6k19o55J223O69j255q66N67J677k46r51m11K54
2466b24N58j42j81N33K9o63j3O93k06j907N69J529N39k209j6J190J40nnl23M51
2487C37k59k03M00J86p99k59R49N98j011j297J160J020o87r61O39K73m24O23L68
$$ plain form
2353 898 -448 -35 475 629 37 21 -125 -624 -821 -800 -118 455 -1604 -670 581 113 -564 -456 276 1215
2373 1215 -385 -847 -108 366 -215 -472 1423 189 -720 -310 890 1663 -779 -464 -519 1019 -828 -1401
2391 -1401 392 947 -106 -203 592 722 -415 -777 -28 783 -366 -1057 -60 1947 305 -487 82 1351
2409 1351 -27 -584 -250 -278 -145 -649 -375 525 -49 -1225 -67 718 1075 134 -311 653 1041 269 -534
2428 -534 -165 430 -1423 -437 288 256 -917 -656 570 760 -122 -670 821 1116 225 -606 512 1227 294
2447 294 -659 -462 465 -370 -803 -107 -11 -230 -885 338 1007 -248 -1114 -547 1130 884 -67 -478 -224
2466 -224 334 192 11 544 573 -90 -103 590 384 -1523 -954 575 1114 -1095 -1111 79 219 214 209 -114 337
2487 337 78 -125 275 461 -338 -597 352 950 -61 -1358 -198 822 135 -826 -187 86 -338 285 653
2506F53l5m21l84J029o03R5o21r19K113Q02k851p32K162N97j488L55j86J50o01
2525h85Q19R9j147j90J878K25P3j015q5N14J139j113n93r7Q74q27l24P90K45j316
2545i36L19J296Q6j237K4M62Q02o16o74J329j211J251R7j405L16J29o34P96o10
2564d16j72n09P25J316j88r00p30J653n28j055N08R5K11M34l09M3j10M83q36L44
2584E9J179j476j3J002n09l21p45P53N40o16P03k86M4l45N03J80j43o87n11P53
2604F4R42p63j091N30R85m30p91M65P2j33l25N96K66o11j34L26O23l08n77K90
2624dM83K0q17m30R92M70r91p9O38k15r41R88Q23r44r34O81M43L48o07m41O11
2645I4P22l79p91J63P36m35r47R81M27j562P31O49M26j552m89J165O39l33l65
$$ plain form
2506 653 618 197 -187 842 239 334 -287 -1206 907 1709 -1142 -1874 288 885 -603 -248 -434 -284 -885
2525 -885 -66 33 -1114 -1304 574 799 872 -143 -228 286 1425 312 -281 -378 496 -331 -655 135 380 -936
2545 -936 -617 679 765 -472 -448 14 816 200 -474 855 -356 895 992 -413 -97 32 -602 194 -416
2564 -416 -588 -1097 -372 944 756 -144 -874 779 251 -804 -296 -201 10 444 135 178 68 551 -285 59
2584 59 1238 -238 -251 751 242 -79 -824 -71 469 -147 556 270 314 -31 472 652 509 -178 -689 64
2604 64 1006 243 -848 -318 667 237 -554 -89 -17 -150 -475 121 387 -224 -358 -32 591 283 -294 -4
2624 -4 479 499 -318 -748 244 714 -277 -356 282 67 -874 114 937 -7 -941 -260 183 531 -76 -517 94
2645 94 816 437 -354 -191 545 110 -837 144 571 -991 -260 389 815 -737 -1226 -61 578 245 -120
2664a20l07J28P97m1n27J83Q3o28m7J480q64j060j2J381o13p98R88P44j315k13
2684g61J505r96J98L14N36r03j19L5l95P48N93p92j010Q79J217r49r10R67Lr72
2704h12M27P98m51k13M25M91m07o84K15M71K22p9r84o1J007L99j232J70R39m83
2724A58q65R04K04p63k48O34O97n56n73L77M46k90k43l49L97M20m49j53L15J40
2744B03k45k14N32l60r61P96N70O31p73o67O45M96qq96k24N29p47M13O28o98M31
2765H1o19N69K88j44p12K46J006l11o12k54O83Oj72O2K93l46m28M20M20n47m89
2786e60K06O35P4q78J47r4O13j2j01O9K50l17j85M89k06m73K2N86L57o03o73P85
2808A31M01l37k83R5J15k08J96j48O2m1J34K17m6O1o08L8Q98j93j134K16P30j91
$$ plain form
2664 -120 -427 -299 498 457 -70 113 196 -432 -479 1001 137 -923 -935 446 -167 -965 23 767 -548 -761
2684 -761 744 -252 -54 260 796 -107 -226 -191 -586 162 755 -37 -1047 -168 1049 100 -810 157 160 -812
2704 -812 -385 413 -38 -251 174 665 258 -426 -211 260 482 403 -581 -642 365 764 -468 -298 641 158
2724 158 -707 197 401 -362 -610 24 721 165 -408 -31 415 125 -118 -467 -70 350 -99 -252 63 203
2744 203 -42 -256 276 -84 -1045 -249 321 952 179 -488 157 653 645 -251 -475 54 -693 -280 348 -350 81
2765 81 -538 31 319 175 -537 -291 715 404 -208 -462 221 227 55 117 410 64 -364 56 476 -71 -560
2786 -560 -354 281 355 -523 -376 -470 143 131 30 99 349 32 -153 336 130 -343 -321 265 622 19 -654 131
2808 131 532 195 -88 7 122 -86 110 -38 24 -17 117 334 288 349 -259 -221 677 484 -650 -434 296 105
2830A05m40j3L60Q4m15N93m0j72o63P68K12L26j122L48Q48k50n43N5J26L49m39
2851G7j22P97q79k38J38R25j04j002j02J235k73k68k78M11j00k66M78j03J21j51
2871B96l62K54J52M7j192O08M04J07p55M4Q88m15k93j08N60J19n17N54Q4l10l17
2892a52j11M37K17o80OM01K5l72l06N76m5j79m07M99K98j97Q7M42j57n17j21O03
2914C47j3o78J78M5K78K5j01k56L61k38j09K01j25j23l47M55O69l45k25n8P22
2935F63l22m44k91M94Oj48j8l2p3o2J96K17j85p21L39N50J65j86l48L43L58n37
2957c6k58L58J44j42O2k94L08j94k48O10J7o58OK77M26m89k2j76L96J15N9l00
2979c9L45l23J35J28r6j24m03L45L33k39m46J70M03l9k72R9K66l18J39pQ0K46
$$ plain form
2830 105 -335 -348 12 96 -319 274 234 62 -601 167 379 705 -417 -69 779 529 -14 41 167 516 77
2851 77 -45 752 -127 -365 -227 698 594 -408 -510 725 452 184 -94 317 217 -49 429 326 447 296
2871 296 -66 188 340 387 -805 -197 207 314 -441 -397 491 76 -217 -325 235 354 -163 391 475 165 -152
2892 -152 -263 174 391 -289 -283 118 143 -229 -535 41 -4 -183 -590 -91 207 10 97 539 382 -135 -256 347
2914 347 334 -344 -166 -121 157 182 81 -175 186 -52 -161 40 -85 -208 -555 -100 569 224 -1 -59 663
2935 663 341 -103 -394 100 106 -42 -60 -92 -165 -227 -31 186 1 -720 -381 169 334 148 -200 143 501 -36
2957 -36 -294 64 208 66 128 -166 142 -52 -300 310 327 -331 -325 -48 378 -111 -133 -309 87 202 261 -39
2979 -39 306 -17 118 246 150 26 -377 -32 301 62 -384 -214 189 150 -122 -23 243 -75 64 57 137 383
3001C83m15j16L51O9n26PJ97L37j59m43K47K06k14k26R6L05j65j32L00N7n63N11
3023A07n8L44m18k32J73J46J66j01j46J63m19J3L80k31n7%J29P4o4j83K01J92
3045A79J90m29j10K55K28m66j64M77j49j55J26J66j34o0k03L20N51o02k68M48
3065B00j0P8l06J12j32N9j03K47K05l68q9K10l4J6n22L64O9L04j79k42J35K45
3087B59k40o9L54j01k25q9N23k77m19M37j0q1m5l4J84m6k66n8L64k87k5R3K49
3110A91j3r2l71L24P5l34k02M59J08L1n67K73J54M8j32K00p5j28r8K81J67Q6m44
3133e9mL59j81l85RL33Q1l78L68j13j11l9J5K88k45J39k01O48k26l87k62L72L31
3156C52j81l65k13K65J09JM92n02j13j04K89K26k34j24L92j65j1l39K55R6O7j79
$$ plain form
3001 383 -32 -148 203 272 -254 -247 -50 287 128 -315 -68 138 -76 -302 -206 99 -66 -198 102 159 -404 107
3023 107 49 393 -25 -257 -84 62 228 127 -19 144 -275 -262 118 -113 -170 -170 -41 33 -31 -214 -13 179
3045 179 369 -60 -170 85 313 -153 -317 160 11 -144 -18 148 14 -46 -249 71 622 20 -248 200
3065 200 190 268 -38 74 -58 1 -102 145 350 -18 -107 103 69 85 -437 -73 -4 300 121 -121 14 259
3087 259 19 -50 304 203 -22 -111 412 135 -284 153 143 62 17 -17 167 121 -145 -203 161 -126 -151 -58 191
3110 191 178 86 -285 39 114 -220 -422 37 145 176 -391 -118 36 84 -48 152 77 -51 -149 132 299 385 -59
3133 -59 -63 296 115 -270 -261 72 153 -225 143 30 -81 -120 -105 183 -62 77 -124 524 298 -89 -351 21 352
3156 352 171 -194 -407 -142 -33 -32 460 -42 -155 -259 30 256 22 -102 290 125 114 -225 30 126 193 14
3178A4k58N72k79j26J31J67l37j94K81N27k15n74K79L39l88J05p33J198m06M12
3198E15p55J10L17l00J44K34j36l81K7M00m2k68R8M1J75l76J35J71j86J44M6K53
3220C66k44m80K96J45J1J0k76J95L12j64j47k39K43j84K23K4l3l68K89O8R7j87
3242d3k06L84j14J28j97j89L80j87N4jj70p3J06J35K10k0j42k42M60n1J01j70
3264A53m94R57m61M3o25N49M09q99Q08m64O67n03O56q10K02n57J283r11n64J094
3284E33K11K12n63L73r73K86l0p82O87m71N96M65p59J56k74N10o13J269n75q52
3304e94P65m18L46j80m10P05j22n19L03j21R5k83P7N97j61j38R4M9j80QM3l55
3326c99J09K07O3l4K19o6j80K78p9J04m76K65p1K31k21J81j3o5M8k13L04q0k50
$$ plain form
3178 14 -244 328 49 -77 54 221 -116 -310 -29 498 283 -291 -12 327 -61 44 -689 509 103 515
3198 515 -240 -130 187 -113 31 265 129 -252 -225 175 133 -135 -37 4 179 -197 -62 109 -77 67 113 366
3220 366 122 -358 -62 83 94 104 -172 23 335 171 24 -215 28 -156 67 91 58 -310 -21 47 144 -43
3242 -43 -249 135 21 149 -48 -237 143 -44 10 9 -161 -234 -128 7 217 197 55 -187 273 222 323 153
3264 153 -341 616 155 198 -427 122 531 -368 440 -24 643 140 796 -14 188 -369 914 3 -561 533
3284 533 744 956 393 766 -207 79 49 -733 -46 -517 79 544 -215 -59 -333 177 -436 833 258 -594
3304 -594 171 -247 99 -81 -491 214 92 -427 -124 -245 -150 -433 -356 241 80 -58 36 85 -95 -87 -44 -399
3326 -399 -290 -83 -20 -54 165 99 -81 197 118 222 -254 11 -60 171 -50 131 118 53 101 -112 192 112 -138
3349a38J6K14R2l01k38M35N8k0j90J72j5r2j41K53q0r0J07K70l2l32o8M39k67
3372E2k6l34N7K82j05J43K1p8J85j75r9J02Rk28L73m9k72NR0J76j58J81l05p6
3396b29J31K71j01p5J2r2J60k1K32l43JN0O3k80N38j98j07J11l19K99k6R5j56
3419A6K53j48k03k0j62L67m9J76l34M74j31k66r0M07j67m03K3L66q0j40J24J15
3441A28M8p5k22JJ55j03l96K82J90k28L51l43J49J8R8j47O9K4n6Q3J02j70N0J29
3465A37N7l4k31k9J53L7k13K36L7O3j38m85K31k02M77k38p1L00m10K61J84j44
3487b2J72Q0j38k91K8K75j98j36L9M24k67R4j26o3K71mN28n09m4m8l2K2k15N26
3511C66l27k66L78o3j88Q9j53K38K23m48K54j38j4k94M61j45J7p9J9M2j13q1J92
$$ plain form
3349 -138 -122 92 184 -117 -355 80 138 118 -72 100 85 -7 -148 105 25 -65 42 312 280 -52 -120 319 52
3372 52 26 -308 -251 31 -74 69 90 12 197 22 -77 25 34 -194 179 130 -142 -137 -47 129 -29 152 -153 -229
3396 -229 -98 173 72 -3 9 -83 77 56 288 -55 -54 -4 59 -221 317 119 12 123 -196 103 77 172 16
3419 16 269 121 -82 -102 -264 103 54 230 -104 370 239 -27 -117 290 123 -280 -257 109 29 -111 13 128
3441 128 176 101 -121 -120 35 -68 -464 -182 8 -220 131 -212 -63 -45 53 -94 -25 -1 -57 26 128 -42 8 137
3465 137 194 160 -71 -100 53 90 -123 113 150 213 75 -410 -179 -381 96 -142 -213 87 -323 -62 122 -22
3487 -22 150 230 92 -199 -171 104 -94 -230 -191 233 -34 60 -66 -129 142 138 666 157 113 65 33 55 -160 366
3511 366 39 -227 151 88 -100 -11 -164 74 297 -151 103 -35 -49 -343 118 -27 -10 -89 -70 -28 -141 -222 -30
3534c0J38m86K80O0L3L9j55L5K31k12o5K06QJ22j33PJ95j18j68p1L90k21l00L04
3558H9M9o4O9k13J83k01P5j07j13J35Q5p7P6L33l65n3J33J00J46p0Pk79K20o9
3582H9M9J8J02o11J58r0L56j20K40K26o13k04O06j71k26k17J37l23J63L46M79
3603C94j61J04p47Q7M14j45l00L58K52j53n0J41n52K06j63J058j062M44l89l78
3623f42Q14k73L18n57L96M06q0m70P2R2m99J78pN46p63Q42o03K73J70P1l01n5
3645g2n15P66K7n82L32j29K90o67j52M21L0L09R2l50k63O53Jl39L74j58M28p08
3667b12R3k07J02L46L83n50q2L47j03n22N11Q7M0k87j09L71n43N14p3j92Q8L91
3689C93j70L0l99L81l74j0Q81n90J83K8j164P73J00N9k71Ro43J554m17o35J575
$$ plain form
3534 -30 108 -378 -98 -38 -5 34 -121 -86 145 -67 -132 74 82 204 71 78 273 155 -13 -84 306 85 -215 89
3558 89 138 74 143 -70 113 -88 -13 -120 -233 -98 -13 -90 -14 319 -46 -99 34 134 280 210 217 -62 158 89
3582 89 138 156 258 -353 -195 -285 71 -49 191 417 -196 -400 206 35 -191 -408 -271 -594 -431 -85 394
3603 394 233 337 -410 -323 91 -54 -354 4 256 103 53 194 -358 -152 -315 743 -319 125 -264 -642
3623 -642 172 -101 217 -340 56 462 382 -88 -16 76 -423 -245 -252 294 -469 373 -230 43 213 284 -17 -72
3645 -72 -587 179 206 -376 -44 -173 117 -550 -702 -281 -251 58 150 -200 -463 190 191 -148 226 68 496 -212
3667 -212 -119 -326 -224 122 505 -45 -127 220 117 -405 106 193 233 -54 -163 208 -335 179 106 -86 2 393
3689 393 223 253 -146 235 -139 -149 732 142 325 353 -811 -38 62 121 -150 -141 -784 770 353 -282 1293
3710A293m92M14k126K183j453k90j040R44R26m86P73p2j169M15j93K76l01J206
3728H08j27j36p96l66P34m36J13j2K4P27jj245M53q3P43o24L37o86L24M60J48
3749C59q2p17N27j39j4P4k4J91K61q09L79m1k38O82k82j73j25k85M75j89K74j75
3771g1L97l36nJ54r3N3M3r9n1J3J86j63k6L7N6o9k45K26n7rJ42M9j19K0j0j25
3797a02J14N9K6l8n7j57M93k68j44j15P2j48j10N07J25m32M41J23n65O5n26N03
3819a34O5k06P80m5r84O98O0p40K66O43n65l24N21m54L70P26p66j064O28j0J43
3840c92J46J73J00j08N27j125J424j632J680q92j7%O98o01J76P8J25r7J00j97
3860A66j674J777k42m58J50Q64j790J089j99M54q46Q89l28K34j96m63P59m94O58
$$ plain form
3710 1293 801 1215 -911 1272 -181 -471 -1511 -567 359 -127 646 574 -595 -180 -373 -97 -398 808
3728 808 681 545 -251 -617 117 -319 -206 -218 -194 533 532 -713 -260 -343 400 -224 113 -573 -249 211 359
3749 359 277 -440 87 -52 -66 8 -16 175 436 -373 6 -35 -273 409 127 -46 -171 -456 19 -170 104 -71
3771 -71 326 -10 -15 139 46 99 142 43 -8 5 191 28 2 39 95 26 -219 7 -50 -59 83 132 13 33 23 -102
3797 -102 12 71 97 59 2 -155 338 70 -74 -189 -117 -265 -375 132 257 -175 266 389 -176 -111 -637 -134
3819 -134 -69 -275 505 460 -524 174 234 -506 -240 403 -162 -486 35 -419 -49 677 -89 -1153 -525 -535 -392
3840 -392 -246 -73 27 -81 446 -679 745 -887 793 -99 -116 -116 582 -19 157 235 360 263 363 166
3860 166 -1508 269 27 -431 -281 583 -1207 -118 -317 137 -709 180 -148 86 -110 -573 186 -308 350
3879C50j225J66J417j054O3k78P70o45M17O3j39k41j54N92j03j26o0k6M34l30
3899a09Q1p4OK46q8l82P2O56k51j84j76L94k49j23J70N07m86J5K82j96m15M26
3921A22N83m69J86j005O41J2j59j48j80J453l35p10l1m5R7m97K68J07j17K84k05
3942a48K97J00j34J11k09K34m74N33m61J61Q0Q1k0j20J17j71P2l63K77Q4k5r7
3964g5o3J46l3J13j50o7K64k84N58l65K04n7o18L56P3l31k69K77j98O12l58O45
3986C80o00j10J49j85j72O24K10m59L1L2J37L29j40J4P0j85l05L61N9j70J58N3
4008B81m4l42J75o2j47L57j83m54o9M88Rp4K95l77P0J12J22q4j90O9P0j31K6k83
4032c66J58RK81j4k15QJ82J8Qj03j26Q3J49K97k07j52r0L41n21K37L61k86QJ8
$$ plain form
3879 350 -875 -709 708 -346 -283 -561 209 -436 -19 44 -95 -336 -490 102 -1 -127 -187 -213 221 -109
3899 -109 -28 -102 -96 150 62 -320 -248 408 157 -27 -203 191 -58 -181 -11 496 10 25 307 111 -304 122
3921 122 705 236 422 -583 58 70 -89 -237 -417 1036 701 -9 -40 -85 12 -485 -217 -110 -227 57 -148
3942 -148 149 249 115 226 17 251 -223 310 -151 10 90 171 151 31 148 -23 49 -314 -37 47 22 -75
3964 -75 -138 8 -25 88 -62 -129 135 -149 409 44 248 191 -427 -71 2 -329 -598 -321 -519 93 -265 380
3986 380 -220 -330 -181 -366 -538 86 296 -163 -132 -100 37 366 226 240 310 125 -180 181 240 70 228 281
4008 281 237 -105 70 8 -139 218 35 -419 -488 0 9 -65 230 -147 -77 35 157 73 -117 -48 22 -109 -83 -366
4032 -366 -208 -199 82 68 -147 -139 43 61 69 -34 -160 -77 72 369 162 10 -80 261 -260 -23 338 52 60 78
4056G8J12n66K08Q4J97l4j42j31K99j43Q1n6j08j32L77k38M6N3m8J90k29m4J91
4079D5L3o4K8r4k41O9O91On14J66n2j66K45o50Q35r39K04n27J399p03R3J60p6
4102e2K8J37l86R43n08j44p14Q48j114J104J55n02L64O05q99M31M54m30p87r0
4122e57k45J040K9l28K26p7j23K36k2j38J90n83O08j47j32j07K19j25M43l03P3
4143A77l67L01l24JL06k20J11n8K54k91Q5J8J08n2l37K63o1M08l04r0r6J85m95
4166d78O11j64o8J64r2j5K19l47j73M17p53K26O12m06N98m75M97O6n45j74O44
4187C64j02n3O8j37J01m23M80l42J67l89L04O4R4J94o00J87M68p21M28q9k58K00
4209EK15q36J049j241N84N8k54P11o04o9j00P64L60p42k6M06m61m79L51P7n10
$$ plain form
4056 78 190 -376 -168 -84 113 79 -63 -194 105 -38 43 -13 -121 -253 124 -114 -68 -15 -63 127 -102 -146 45
4079 45 78 14 42 -52 -293 -224 467 473 -41 125 73 -93 152 -498 337 -602 -398 -925 474 -229 -136 24 -52
4102 -52 -24 113 -273 670 162 18 -696 152 -962 142 297 -205 159 764 -135 296 750 320 -467 -557
4122 -557 -802 238 267 -61 165 88 -35 201 179 41 231 -352 256 109 -23 -130 89 -36 407 104 177
4143 177 -190 111 -213 -212 94 -126 -15 -73 181 -110 -25 -7 101 49 -288 -25 -86 322 18 -72 -168 17 -478
4166 -478 133 -31 -99 65 -27 -42 177 -170 -343 74 -679 -453 159 -247 351 -124 373 439 -106 -280 364
4187 364 262 209 277 140 241 -182 298 -44 123 -266 38 102 196 390 -210 -23 445 -276 152 63 -195 5
4209 5 220 -616 433 -808 -224 -166 -420 291 -313 -382 -482 282 642 -100 -126 280 -181 -660 -309 -232 -742
4230g42J130L65j801J125j53M56n70k0l50P11O01l61m99M1k23m3O63Rm75k4R9
4251f1J80l95N21n15K35o58O05q89J188q4M05J190k090L14K50L52j824Q64o77
4270a089K272p23P0L5k07o64J56O09p59k23P83k9n35L4j43o4K43M10o71M68J1
4291a6m03J01M82p28Q7J84J545j368k67K34m49R28o30m9L89M97l90K8L40k43m60
4312a88J055N45j470m94J344j655P03K24p09M51J97J176j197k98L31K99k68J80
4330B26J46P0j659J566K31Po43l61J37m47Q99l34R0j97L88l68R99J34n53p12Q03
4351D22p41o20Q24Q4l12M88J50q9O36q14J24k41M47k43P6l88J99P19o36o22l82
4372i19K89P73M0K05L27o31L11m18K0k81J056p78n4K28j78j06l86O62k54k6J81
$$ plain form
4230 -742 388 753 -1048 77 -76 380 -190 -210 -560 151 752 391 -108 -67 -290 -333 330 339 -136 -160 -61
4251 -61 119 -276 245 -270 -35 -693 -88 -977 211 127 532 1722 -368 -54 196 548 -1276 -412 -1089
4270 -1089 1183 460 530 565 358 -306 -150 459 -300 -523 260 231 -304 -270 -413 -477 -234 176 -495 -27 -16
4291 -16 -419 -318 164 -564 -477 -293 1252 -116 -383 -149 -598 330 -300 -349 40 537 147 175 515 272 -188
4312 -188 867 1412 -58 -552 792 -863 -160 64 -645 -194 3 1179 -18 -316 15 314 46 226
4330 226 372 442 -1217 349 580 587 -56 -417 -280 -727 172 -162 -72 -269 119 -249 750 884 331 -381 422
4351 422 -319 -939 -115 -31 -343 145 295 206 842 28 152 -89 358 115 191 -197 2 721 85 -537 -919
4372 -919 -630 143 183 388 715 84 395 -23 -3 -284 772 -6 -60 168 -10 -116 -502 160 -94 -120 61
4393F1q6l08M79j96j24K4K42k37m6N72k32k69j92j1N32p73L55J86j43L90l63K41
4415A02k62M38j93k15m14J08P12m6j60O8j70o1P7m38K59j23k82O16m5J17m9n31
4437d92Q72m90j57o38J014j80j21K23k28j30J64J92O5oj95j2O6Q6q7ml08K84P7
4460eJ70mm10K35q1j6Q0M6J21%L9k17J00M3j22J19k27K80l88J24J71J28J4m9p9
4485G2k39K39l02M27j30MK3j91J40k21L14J55k01j19k54P6L60q1J0j77k1K75k22
4508f3q6L17k50L0L42o4j44k96R7L87l02mo5J26k7Q5j09J00j88RLL26k18l0J82
4533A58K27n33N8k40L21Q8j99M24k83O6q9L33m88P6K29k9k4R5k38L11l52J29n2
4556a2R7k59L87l30K77k89Q5j53K98K02k81j2j5j87PL34j70o4L25Q9l59m2k30
$$ plain form
4393 61 -25 -333 146 -50 -174 -150 92 -145 -191 381 149 -120 -312 -323 209 -564 -209 -23 -166 224 -139 102
4415 102 -160 278 85 -130 -544 -436 276 230 70 138 -32 -93 -16 -454 -195 -318 -600 16 -29 88 39 -492
4437 -492 380 -110 -267 -905 109 -71 -192 31 -197 -327 -163 29 94 88 -107 -119 -53 33 -54 -58 -366 -82 -5
4460 -5 165 161 -249 -14 -95 -111 -31 15 136 136 175 -42 58 101 -21 98 -129 151 -237 -113 58 186 200 151 72
4485 72 -167 72 -230 197 67 71 94 -97 43 -178 136 291 90 -29 -283 -207 153 72 82 -95 -116 159 -63
4508 -63 -149 168 -82 -52 290 226 82 -214 -117 270 -32 -36 -101 25 -2 83 -26 74 -114 -105 -102 224 6 -24 158
4533 158 385 -148 -90 -330 -9 79 -120 304 21 87 -2 331 -157 -81 148 119 95 190 -48 263 -89 40 -12
4556 -12 85 -174 213 -117 160 -129 -44 -197 101 303 22 10 -5 -192 -185 149 -21 -85 240 329 -30 -72 -302
4579c02N06k80j9n0J27j00M2K16k03J36m0l0j08r3L27j58j82P5l6L10j35Q2j1
4602G4J03J3j83Q4l7q0k21Q0J21K30j71j15l8P5P1r6O4J17j46j06L02Q5k29k31
4626b34Q0M38m06J41Q9M05k13j94r8O0J52j94J03l09R66o89L16l49k72K58J72
4647B22q23P93q2j91J83j29o2J28K44j26J8k12J51k4K94j140O36K78J10m32J42
4668b2M5l40M50j89p24J205m54n5j50l53L55L74q8j29j55J0j11K01L70k83N1J49
4690A57l2o41N72M6j43M1J00k16n9M52m87J18K69k36o26P95J0q4j29j29L16J68
4712B62j86M4j83L13m97J71j7Lj78N39j39k71K65k8j73Mj0J53L5k18J57N17m77
4735H6m8n2K22l49L63o2j11m41J43O49n37J62l72L64j74R3K8J0J27J38l72j1n0
$$ plain form
4579 -302 204 -76 -95 -145 -18 -118 -76 140 -63 73 33 3 -105 -198 129 -29 -211 -136 -172 138 3 85 74
4602 74 177 190 7 91 54 -26 -247 -167 -46 184 13 -102 -140 -65 6 -90 -26 91 -55 -161 141 226 -3 -234
4626 -234 -154 284 -122 19 108 513 300 106 8 68 220 26 129 -180 786 97 413 64 -208 50 222
4647 222 -601 192 110 -81 102 -27 -89 39 283 157 175 -37 114 90 384 -756 -120 158 268 -164 -22
4668 -22 23 -317 133 -56 -780 425 -29 -84 -234 -587 -232 142 54 -75 -230 -220 -331 -130 240 -43 8 157
4690 157 125 -516 56 102 -41 0 100 -116 -175 277 -210 -92 177 -59 -685 110 120 36 -93 -222 94 262
4712 262 76 120 -63 250 -247 -76 -93 -90 -268 271 132 -139 126 98 -75 -71 -81 72 107 -111 46 563 86
4735 86 38 -14 208 -141 222 160 49 -392 -249 400 -137 25 -347 17 -157 -64 -36 -26 101 239 -133 -144 -194
4758a94l82O17l40L73l26J17K08j03J71l38L35K7k52l51j44R21n93M3O56m61J08
4779I2k79N59m35j71K53J44k19j3L52l20K56k16R7j99K22m28R19o18P4n52N02
4800B0Q03p43R3l0k04K5K70n0j41k2J78m94J08K21l30J70N39l18R0l07M57k41
4822I4k58j0L95k58K70l5j63l1mM7K90n22K9jK46n13K98o59R09j31l73L13p87
4845h54J166p50M39o74j41Q89P4p16R99r79K04j40M50m49m03P81p71J107k3r20
4865g11Q0M46K14P48j187J23N72k23L00j071J252q78k29M42K32j138R37m26O98
4884A81j54n3J62k54RK33q11N28k96O29K72l37l47J58K05m30M23J45K48r01RM18
4906C7k47K7K82j17o86O67J98l61j40J57K48k01O42q88N9O97k52l81n32R89p3
$$ plain form
4758 -194 -576 41 -299 74 -252 -135 73 -30 141 -197 138 165 -87 -438 -582 339 -254 -211 445 -16 92
4779 92 -187 372 -63 -234 19 163 -56 -69 283 -37 219 3 100 -99 123 -305 614 -4 70 -482 20
4800 20 823 80 173 143 -61 -36 234 184 43 21 199 -295 -187 34 -296 -126 413 95 185 -122 335 94
4822 94 -164 -174 221 -37 233 198 35 4 0 47 337 -185 -156 -157 89 -424 -126 -785 124 -7 -380 -67 -854
4845 -854 312 -438 1 -673 -814 75 149 -567 432 -547 -343 -483 -33 -482 -885 -104 -875 232 209 -711
4865 -711 -631 -185 29 777 -410 -287 285 62 362 -709 543 -335 -564 -122 110 -1028 -91 -517 181
4884 181 27 -26 136 -118 -109 124 -687 -159 -455 174 446 109 -238 -80 125 -305 118 263 511 -390 -381 37
4906 37 -210 -183 99 -18 -704 -37 161 -200 -340 -183 65 -136 506 -382 -323 374 122 -259 -791 198 125
4927A25M89k97j25l09M27o53K02M73k17n99R67K90j286M05K0M66O3j345N42n17
4947h79J314j28L16q63J03k25J96K38O1n1j62r5L38L1l38N5L36k50L92m59j19
4968a89l2PL33ll10o1Q12n88M4Q9k17k14M85J70j51l46k4J79k47K27j50N1Q8L18
4992B71k84q4j93L24Q2k44N3J82m3J78j1j44n2l4l03Q7K49J37k00j79L74k70k12
5015c16M23j60q3K27m52M30q1K51j86n5n96N59J14j09l80O54o07P55n94K68j57
5036i5j55j13q8J35J5K36q43J440n57j39O00p06q43R13m12J73k98O90k45j16N9
5057c49m99J022r4k44N78j062M58o5J06n74M43K78J48m18M28j119O12P86j511
5076a076R13O84q02J85k9K75K7j39L2o12k13J662j140Q45o16r3L08K58n92L20
$$ plain form
4927 125 614 317 192 -117 310 -343 -141 332 115 -484 483 773 -513 -108 -88 378 441 -904 -362 -879
4947 -879 435 307 623 -240 -137 -362 -166 72 133 82 -80 -175 163 194 -144 -89 247 -3 389 -70 -189
4968 -189 -221 -214 119 116 -194 -255 557 -31 13 102 -115 -329 156 326 175 -171 -195 -16 -263 -36 -186 -135 -47 271
4992 271 -13 -97 -290 34 116 -128 -75 107 64 242 231 87 35 1 -302 -215 34 171 -29 -208 166 -104 -316
5015 -316 107 -53 -136 91 -361 69 -12 239 53 -2 -598 -39 75 -34 -414 240 -367 388 -206 62 -95
5036 -95 -250 -363 -451 -316 -301 -65 -908 532 -25 -164 436 -270 -1113 -200 -612 -439 -737 -47 -292 -408 -349
5057 -349 -848 174 80 -164 414 -648 -190 -255 -149 -723 -280 -2 146 -272 156 -963 -351 435 -1076
5076 -1076 -163 521 -281 -96 -125 150 177 38 70 -542 -755 907 -233 612 -4 -97 211 469 -123 197
5096A97r7p62P24j93N64l35J39n03Q86L5j565J003m44j08N89M88k93n05k85J3
5116d52J059j367J187j124l1K41R36m06K06n86N85j84Mj26n47L97j64J89R0M96
5136D03m01l7l3j02j32J77M59j37p25j04J136p86K48l25K01J54L8J04k09n35K
5157f04M69L08m8j6J29o67Q27J99j059M45O6l06O98o84K00Q7l4l42K23K18l38
5178b29j1L52j64K5J42j38o0l0K93k01M0K09n45L55l1K9j19L19m2k26j29L46k69
5201h4N3k43L67k31J34J55l20K70k70L0N4n5J03J10j96K73n5J63k70K20n34M81
5223A55n47K87k7K8O24k6L3p96J88K97k55k89L94L9n9K71OM2o60L20k74O82j50
5246B83m48O59m67K94l50J79J51m7r79K32M83J22l2k70q34J375o62M52l41J01
$$ plain form
5096 197 100 -662 62 -131 433 98 237 -266 620 655 -910 93 -351 -459 130 618 325 -180 -465 -452
5116 -452 607 -760 427 -697 -728 -487 449 43 249 -337 248 64 68 -58 -605 -208 -372 -183 -93 403
5136 403 2 -35 -68 -170 -302 -125 334 197 -528 -632 504 -282 -34 -359 -158 -4 34 138 -71 -606 -604
5157 -604 -135 173 125 109 238 -429 398 597 -462 -17 49 -257 441 -243 -43 44 10 -332 -109 109 -229
5178 -229 -240 112 -52 -27 115 -23 -83 -113 180 -21 19 228 -317 38 7 36 -83 236 194 -32 -161 185 -84
5201 -84 -31 -274 93 -138 -4 151 -169 101 -169 -139 -85 -140 -37 73 -123 150 95 258 -12 208 -326 155
5223 155 -392 -105 -132 -104 520 494 527 -269 -81 216 -39 -328 66 105 46 317 323 365 -295 25 -249 433 283
5246 283 -165 494 27 321 -29 150 301 254 -725 -493 -10 112 80 -190 -1024 351 -311 141 -200 -99
5266i9J94k83J15k2N84n62M14l02J7P33j084R17l30l89J94l47M9j34J16L35J80
5287B96J12j217M03P55K82l81j88Q22r89K39N2l29L11P6K08l09m00L9j3M74l38
5308i5j64J23L04m92L81k28N42l18K85o34O03o86L55N61n86O13m04q67Q56l75
5328b26j16L44o4L66k81J069r14o11O40n14R8N34m95L46j002N61Q5M11o44N85
5348A72k30q6J91k58J55j10K61k25j76L20N8L63j311Q03k07L79l48K74m69J258
5368H14l51r06M14J65K76m86Q99m68n58j33L94o08Q66m85M82r31J023l5n13o2
5388b03r0K87k55L93k00L37j15k84p67M60O35j70K5K4m08K03J99j44J98j75J18
5409F8j15J41k89J24J41J78j32p5K6r2J09m28L59P9j22r6J57k1k9M1J15j38m3
$$ plain form
5266 -99 95 -188 -73 -95 489 -73 341 39 56 789 -295 622 292 -97 97 -250 -201 -335 -219 116 296
5287 296 408 -809 -406 349 631 250 62 884 -105 134 186 -143 168 244 452 143 -257 -218 -231 243 -95
5308 -95 -259 -136 168 -324 57 -171 371 53 338 -296 307 -379 -24 537 -49 564 160 -707 149 -226
5328 -226 -342 2 -62 304 23 1092 178 -433 207 -307 -209 325 -170 176 -826 -265 -180 231 -413 172
5348 172 -58 -144 47 -211 -56 -166 95 -130 -306 14 72 435 -876 -73 -280 99 -249 25 -444 814
5368 814 463 -443 -29 136 412 -74 825 357 -201 -334 60 -548 318 -167 315 -616 407 372 -141 -203
5388 -203 -293 -6 -261 132 -68 269 154 -130 -897 -437 198 28 53 77 -331 -128 71 -73 125 -50 68
5409 68 -47 94 -195 -71 70 248 116 41 67 -25 84 -344 15 94 -28 -124 33 12 -17 24 139 1 -42
5432d2K9N8L24l27k73K64M7N1L0l18L11l01L17l15J41J78o0j48R3J09l11K56J12
5455B25l55J91m6p0K39j96N3k43J04k47O81m26n76P06K21l61j22N25j052M27N82
5476B60o21N70l96j9m03M21o4O23j03o98j55N46J87p67K80J97j12k20L93N4O84
5497F57l80m40o54K06R21n23O45j481J392n18m40R41l87o15N32k46K86q3k36J675
5517A252k021K03o3R33N6p51q9O38j49l58O37l85P8k51O23M8m7m47M04o51L35
5538eL89l79m35N09K42n92M93o55K94j50L94o9k6k6O8r97M83J056j73j362Q2Q69
5560A0l69j43N30k43nk48r0J85n49O95N65k49k57M46J91n98M83o92J283j014l29
5581c98L02K8L67K43n21o71M24o2N95j148L59J88j1N23n61k2O51O03m79K5k41
$$ plain form
5432 -42 -13 45 369 42 -231 33 80 131 161 -157 154 -147 170 -145 -4 174 114 -34 59 168 -143 113 225
5455 225 -130 61 15 -55 184 -12 41 -202 -98 -345 336 -90 -666 40 261 -100 -222 303 -749 -322 260
5476 260 -361 209 -187 -206 -609 -188 -252 371 268 -430 -585 -39 148 -619 -339 -142 -254 -474 -81 -27 657
5497 657 277 -163 -817 -611 310 -213 432 -1049 343 -175 -615 326 -61 -676 -144 -390 -104 -187 -423 1252
5517 1252 -769 -566 -629 304 360 -391 -480 158 9 -349 288 -97 -19 -270 353 401 354 -93 311 -340 -5
5538 -5 384 5 -430 79 321 -271 222 -433 -139 -289 105 36 10 -16 52 -945 -462 594 421 -941 -859 10
5560 10 -359 -502 28 -215 -220 -468 -558 -373 -922 -227 338 89 -168 278 469 -129 354 -338 945 -69 -398
5581 -398 -96 -68 299 542 21 -650 -226 -288 307 -841 -482 -294 -305 218 -343 -365 286 889 410 435 194
5602A94l86Q57o84r23P27m75l99l3J116p42J91R05r15P09L25o29O06q18o52J452
5622D26l61j25N56n71J69l98Q47k2o69J209r82k56R22m75m29k9L64o49M13P85
5642G25j169N01R0n0n96K2O6J170j144J72K07p78P64N01j95j386K392j468K88
5661A12O15m81L53p35L73j077M98N58j33k61m8J211j577P3K37N04J52k48M74r27
5681c27O2p40N80J180p65l41Q52p34K76p9M19J000j904R04l73M18N89r63K79K0
5701C53j054J036l99k76J11J425n38m16K16j255J631r48J257j205q28K308j873
5718d55J655j021n95J158p44P65L31j195j44Q12m32k73L49j47l25J13J99M10k85
5737A76r05J209L04m02m57K59Q8p29L06J39Q4K04l55J11k2j23J62k53j81O9K18
$$ plain form
5602 194 -192 665 -19 -942 -215 -690 -1089 -1122 -6 -748 -557 348 -567 142 467 -162 444 -374 -1026 426
5622 426 65 -60 496 -75 94 -304 543 521 -148 1061 79 -177 745 270 -159 -188 176 -473 -60 725
5642 725 -444 57 147 97 -499 -477 -411 759 -385 -213 -6 -784 -20 481 286 -1100 1292 -176 112
5661 112 727 246 599 -136 237 -840 -342 216 83 -178 -226 985 -592 -519 -282 222 374 126 600 -327
5681 -327 -265 -1005 -425 755 -10 -351 501 -233 43 -36 383 1383 -521 383 10 428 1017 54 333 353
5701 353 -701 335 -64 -340 -229 1196 658 242 458 -797 834 -114 1143 -62 -890 1418 -455
5718 -455 1200 179 -416 742 -2 763 1094 -101 -245 567 135 -138 211 64 -261 -148 51 461 176
5737 176 -729 480 784 382 -75 184 272 -457 -151 -12 72 276 -79 32 10 -113 49 -204 -385 -316 -98
5758i8J48O01p11M03k52Qj08j92m72N71L63n0j001M60J138o73Q46r22L21j981
5778a601J978r17K44l6m8p51J399K28m01N68j158K25N15m81L57j09J32j90j83
5797b29q5L70j19m7K62J79K3k25k08K97k9k54J31J88k91J68k73J52R1k45J71Q9
5819A16j98M7j34L54l53L29k49M04l47K32q1m52K75L4J46o2K7j84J83m9K14j74
5841G8l19P15o24k89L58j83N37mn60N90j02j87l42j81Q20l22M1J82Q2q09P54o75
5863d40k65P71L09k43m38l76N91K27l20K68K43n46n7J04M50n15Q9J79j48L64m79
5884b32J093p77M09o12P82l21q03J47k13K66M79m99j58J626r02j182O08J81N67
5903D59l65q18J23K73l62R33l53J94J86l77J64q87J253n93l88R43m40k60J72K83
$$ plain form
5758 -98 50 651 -60 343 91 99 -9 -201 -673 -102 261 211 -790 -330 808 135 981 59 380 -1601
5778 -1601 377 -540 -296 -332 -380 -1131 268 496 95 663 -495 -270 245 -236 121 12 144 -46 -229
5797 -229 -314 56 -63 -110 152 331 354 129 -79 218 189 -65 66 254 -37 131 -142 10 101 -144 27 116
5819 116 -82 -35 -169 185 -168 161 -88 316 -31 201 120 -332 -57 -23 123 61 88 -96 87 38 252 78
5841 78 -241 474 -150 -439 -81 -264 273 269 -291 299 197 10 -332 -513 307 -15 26 208 290 -519 235 -440
5863 -440 -705 66 375 132 -306 -682 -91 136 -184 84 327 -219 -276 -172 278 -237 -148 31 -117 247 -232
5884 -232 861 84 493 -119 663 342 -461 -314 -527 -261 218 -281 -439 1187 285 -897 -289 -108 459
5903 459 94 -724 -601 -328 -690 243 -110 84 270 -107 57 -830 423 -170 -558 385 -55 -315 -143 140
5923A40p07M05p4k41L49Jn38Q90J77p84P90l24k2j33J21j13M7k98K34J54j34K45
5945A85q2m25R20m33m16J79L7n4k49N07K8j62m52L87R7J97rN5o80M89p12L83J185
5968I75j033MJ48J36M10q67j42L72q49J137j75M04k49n6k52L1q1R1L5k61R46p87
5990f3j00m15J670j114J57j195Q85N19r36J379j029K12Q4k9O3p73N01R81j034
6009b37m1L13J61j19j06M61k61o19J28J80j32M98o62Q53L72j224l54J549l77M30
6029H13p31M08l82K09q31R39k11L19m19j60K82k13N79j276J148j065n7M51j016
6048a213J639k05K65q16J033o92n11Q40j546J254l51J36O06p63P8k4K4O16o60
6067b90m74M71K68N20r57k61p1q4J838j183m84O27k10L91L96m75L86K39k75l89
$$ plain form
5923 140 -567 -162 -236 -477 -128 -127 -665 225 402 -382 408 84 62 -71 50 -63 -16 -314 -80 74 -60 185
5945 185 103 -322 598 165 -251 -72 -35 -89 -338 169 197 35 -417 -30 67 264 255 310 -370 119 -593 -210 975
5968 975 -58 -54 94 230 640 -227 -369 3 -846 291 116 520 271 215 -37 -6 -87 4 39 -222 724 -63
5990 -63 -163 -578 1092 -22 135 -1060 -175 344 -592 787 -242 -30 54 25 88 -685 -184 797 -237
6009 -237 -278 35 196 77 -29 432 171 -448 -320 -140 -272 226 -436 417 789 -435 -789 760 383 813
6029 813 82 490 108 317 -514 425 214 533 114 -46 236 23 602 -674 474 -591 -648 -197 -1213
6048 -1213 426 221 486 -330 703 11 -500 340 -1206 48 -303 -167 439 -324 -246 -270 -246 370 -290
6067 -290 -764 -293 -25 495 -462 -723 -794 -878 960 -223 -707 -80 -290 101 497 22 408 647 372 -17
6087a7j72M8j40Q49j032M52k01m25J492r80O7l5r9l36J19N37k97L41k7l24K52
6108G2j57m54j50O69K3L83N5k58o24N31r06Q78M3k41R89j302M84N33P5r09J091
6129H25j024P7O89k21j82n37K73m15M17l93k74P97O41o01K23n08p6r7J038j019
6149c67J36N11o93J06K45j18n91L59Q7k20J202m17K21q67L37l58m30J850o15J96
6169E74k88M5l22l87J338p33J81j256J837k52R4j046p74J376j078J337j740O86
6187d08l85J226j344K87J99k73O02L94J82j001J74J763k052J230r96Q7K21k85
6205c79m50J415n04q3j275Q57K5J209m81p07J94O03q26L49j434O67J74Q44J113
6224A311j961J932j484J25p39J187j92n86K60J62j275K45J178k26J46J31o01K78
$$ plain form
6087 -17 -189 -141 -281 568 -464 -12 -213 -638 854 -126 -59 -94 -193 -529 -410 127 -170 171 144 -180 72
6108 72 -85 -539 -689 -20 3 386 441 183 -441 90 -816 62 105 -136 853 -449 35 568 643 -266 825
6129 825 -199 -122 567 346 164 -373 -100 -515 -98 -491 -765 32 673 72 295 -213 -289 -386 652 -367
6149 -367 -231 280 -413 -307 -62 -180 -771 -412 -325 -545 657 240 461 -406 -69 -427 -857 993 378 574
6169 574 286 331 9 -378 960 227 408 -848 989 737 831 -215 -989 387 -691 646 -1094 -408
6187 -408 -793 433 -911 -624 -425 -698 -96 298 480 -521 -347 1416 -636 594 -402 -315 -94 -379
6205 -379 -829 586 82 -1 -1276 -419 -394 815 334 -373 -179 424 -402 -53 -1487 -820 -646 198 1311
6224 1311 -650 1282 -202 -77 -816 371 179 -407 -147 15 -1260 -1015 163 -63 83 214 -387 -109
6242a09J093j16j772N33K43Q7l49L59k12R40j342Q15j67l45R94o66J76o98j83
6261g19O91q3o59Q98j61O70o28K68n73N25l13N08p91K47M23J07k74l8K86K4m03
6282EJ17j63k75N13n51O6J238j099m09j0K72O18k79l94l15R60M78o70N53o97K68
6303B26Q23q38n89j47R96L28j165K45L18P30j040J26K83k69J78K17J6l19j38R10
6323H91r08k82O04k43M96r64J185o86l29N90m34k24M17Q1l47K26J03J7j66K57
6343B84j23j91J8J13j93m0M83l88J93L42k75j02j88Q56j264N08N0L30J02o45L89
6364B59k08K03p4m22P75m97n04M06L23j85k71j22K77k25M92l10k17L18l92L89
6384A5lJ72o73J10J46M53l07m93K98L75l11M54k31N6N31o75L24l09L19n87K85
$$ plain form
6242 -109 984 868 -904 -371 -128 -41 -390 -31 -243 697 -645 170 3 -342 652 -14 162 -536 -719
6261 -719 -28 -111 -770 128 -33 637 9 277 -296 229 -84 424 -367 -120 303 410 136 98 384 408 5
6282 5 122 -41 -316 197 -354 -288 950 -149 -558 -568 -296 322 43 -351 -666 294 772 102 655 -42 226
6303 226 1049 211 -378 -525 471 799 -366 -121 197 927 -113 13 296 27 205 422 438 119 -19 891
6323 891 -17 -299 305 62 558 -406 779 93 -236 354 -80 -304 113 194 -153 73 176 193 27 284
6343 284 161 -30 -12 101 -92 -132 351 -37 156 498 223 121 -67 789 -475 33 83 413 515 -130 259
6364 259 51 254 180 -242 533 36 -468 -62 261 76 -195 -317 -40 -265 227 -83 -300 18 -374 15
6384 15 12 184 -489 -379 -233 220 -87 -580 -282 93 -218 236 5 61 592 -83 241 -68 251 -336 -51
6405e1L56l64J51J52p1n61L29Q1k24L32n30O80l00L75l97K89P8q63K10k09J034
6426D97l4o36J32L13l6J34k84j34K34K11N9n33l25O74n51L69K88L2m55k32J29
6447a48oP5N11j1Ok51j95J70m20M25P19n89n15N49n21k25K1R69m27l27N7J04K18
6470A89N57p28r6K78m29k9M18p67K49M10k10Q2q2L01l64N43m73N54n64J05N03
6491D47l15l85P2K39j54K60J21R3l05l71J83P8N03O1q07O0M56n71Q40m50k79O47
6513D23l39M21m48j22M22l59n53P67k13k67J12L37L71k35J9r56L7N45j02J99n29
6534d70p9M05J9P12m18N4j70m5K35p45Q18q94J254n25r95J556k86q14J213r86
6554a61J84o88N85J45J54n38P74n36L34J31k89M22N3R1m40J62k16J05m95N05j07
$$ plain form
6405 -51 305 -59 92 244 173 -388 -59 22 -202 130 -400 280 -20 355 -42 247 325 -538 -328 -537 497
6426 497 463 -173 -41 272 236 370 86 -48 186 397 456 -77 -402 272 -279 90 378 410 -45 -277 -148
6447 -148 -154 -79 432 421 427 176 -19 151 -269 156 875 286 -229 320 -201 -426 -405 564 137 -190 -133 -29 189
6470 189 746 18 -78 200 -229 -258 160 -607 -358 52 -158 -76 -158 143 -221 322 -151 403 -161 -56 447
6491 447 132 -253 -181 58 -96 164 285 378 73 -298 -115 -37 466 527 -280 -220 236 -335 505 55 -224 423
6513 423 84 505 57 -65 357 -2 -555 212 -1 -268 -156 181 552 317 336 -620 -583 -38 -140 59 -470
6534 -470 -549 -144 -125 587 169 223 53 8 243 -502 316 -578 676 151 -844 712 426 -388 825 -161
6554 -161 23 -665 -80 65 219 -319 455 -81 253 384 95 517 570 661 221 383 167 272 -223 282 175
6575A75J50M3m04m6n08K86J66J42j09m0J24p5K86q4K23m37K37K30n48P3K63j1
6597A36l12M2KK36K0j20J38j27o0L0O5K11m5o0q8p3l61L29p3K60k31M6n5J14Q6
6622A10l7k09L39j21m42K48N1J13J47j78k16J53N4l17J68K01p7J60j89R9k01K82
6644A38j79j84K1J52Qj11J32J40K7%n80M00K49l38j30L54m90L85P7j3p2L5J01
6667A22l44N4K89p6j6l0pM3j0k07O3n9J06j4J20J25l47P8M1J28j58K00q0j14R7
6692DM44k44l37K62l14M37l46K28j01J8J21J52l2m34N23m57o3L34k48k29K03k13
6714b92j15K97K62K24J0p8l79M67j12l08K35k94l8L49n86J87M5j5L66m08L63l01
6736a21L29l23J17k1j0L39k72r2J46r3j14R0Q3J58k42l3K6j5k8M3J54j25j64L33
$$ plain form
6575 175 325 368 -36 -82 -590 -304 -138 4 -105 -145 -21 -96 190 106 329 -108 129 359 -189 -116 147 136
6597 136 -176 -134 -132 104 124 4 142 15 -45 -15 50 261 216 156 68 -5 -366 -37 -110 150 -81 -35 -90 24 110
6622 110 73 -136 203 82 -360 -112 -61 52 199 21 -195 -42 12 -305 -137 64 -13 147 -42 57 -144 138
6644 138 -41 -225 -204 -52 -44 -155 -23 117 144 144 -436 -36 213 -125 -255 99 -391 -6 71 58 -14 21 122
6667 122 -222 -168 121 45 29 -1 -8 35 25 -182 -119 -178 -72 -86 34 159 -188 -110 -69 59 -99 101 21 -93 4
6692 4 448 204 -133 129 -185 252 -94 134 33 51 172 324 292 -142 381 -76 -139 195 -53 -282 -79 -292
6714 -292 -407 -110 152 376 386 308 -71 396 284 -24 211 -83 -121 228 -358 -171 -126 -141 225 -183 180 -121
6736 -121 208 -115 2 -19 -29 310 38 -54 92 -1 -115 -25 58 216 -26 -59 -33 -48 -76 -33 121 -4 -168 165
6760A65j27l38K61J62LM0p4j01n1L07l75m0K51J8j80K98j15l02k6L06k14L2Pj6
6784a09j80Q9J91L8q4K09j56k7k9P9r6L48j95j47J05l11M47k00j57Q0Q5Q0m4k18
6808b02K88q4j18L95l80N4M4j29K89O3q8m8k77K76k54J00j3q2Q4J9Q5J02k60J54
6832A8K17J47k92J90j91j29J1q1J31R9N1l2O7l6J16j53R3j97p1Kn2K50j12n3K14
6857B07m93N73o88M95l3k03j56L37L03n99L96m17O03j68j7O3l67N4k28L12K55
6878B29l95L03m78N25J4n1k28k04J084q22L97l91L49n25N44j35k1J9l20k81L96
6899Io1K59j058L80O40r49K51L96j33l90J584j630J146j12j98o8n09J085p41m64
6919e63M30j02O59n14M84L8k01l57l85L36N41o70l89M25J054n97N46j440J041
$$ plain form
6760 165 38 -300 -39 123 126 166 92 -9 -60 247 -128 -168 83 101 -79 219 104 -198 -224 82 -132 -100 -93 -109
6784 -109 -289 -200 -9 29 -55 154 -2 -29 -58 21 -75 273 78 -69 36 -275 172 -28 -185 -105 -20 60 16 -202
6808 -202 86 2 -116 279 -101 -47 -3 -132 157 220 132 84 -193 83 -171 -71 -84 -166 -82 -63 22 124 -136 18
6832 18 235 382 90 280 89 -40 -29 -110 21 120 171 139 206 170 286 133 226 29 -42 -40 -92 158 46 -7 207
6857 207 -286 287 -401 94 61 -142 -298 39 342 -257 139 -278 325 157 140 203 -164 -110 -338 -26 229
6878 229 -166 137 -341 184 198 147 -81 -285 799 -23 374 -17 332 -193 351 216 195 214 -106 -387 9
6899 9 -52 207 -851 -471 169 -780 -529 -133 -266 -656 928 -702 444 332 134 66 -443 642 -99 -563
6919 -563 -133 -235 424 -90 394 432 231 -126 -511 -175 366 -304 -693 -268 786 189 735 -705 336
6938C36m52L73J98j8j34L74o97O78l86k94k47j08M42j98o1K6N01j95M9j61R6p45
6960f23L59M66k48JN78m55o00N09K89l40Q4Q1mk65N24p25P45l83J80j33j00JJ73
6983A14o00J276o51n39P16n91L69l71M34k15q45J223l01n54J99j46J252o90K03
7002B83k43o20M12K55J63K1j66M2n03L25j145R49P22k98j59k0L62J05l63J100
7022A222q55m18K10J26j016R11J88o90J613k149J183j3J32J14q98J70M91o55L26
7041hk06j36N40j118O83L37K21o78k10M44n31j54K12P23j47j48n08n46N69R72
7061C11K79m74j158Q23j17j90L93n63L81L64r21M76R75J43j147P92p26j44L15
7080a88r6M08K14o88k12l88P31J55k83J398j457O49o4l1l13P05l32q7l67r0P05
$$ plain form
6938 336 -116 257 455 437 303 677 -20 658 272 -22 -269 -377 65 -133 -194 -168 333 138 187 26 122 -623
6960 -623 -264 202 -46 -45 533 78 -522 -13 276 -64 20 101 97 -168 356 -369 376 -7 173 40 -60 -59 114
6983 114 -486 790 139 -400 316 -275 94 -277 157 -58 -903 320 19 -535 -336 -482 770 80 283
7002 283 40 -580 -168 87 250 271 105 147 -356 -31 -1176 -227 495 197 38 18 380 485 122 1222
7022 1222 367 -51 159 285 -731 180 368 -322 1291 -858 325 312 444 558 -340 -170 321 -334 -8
7041 -8 -214 -350 190 -928 -245 92 313 -365 -575 -131 -662 -816 -604 119 -28 -176 -684 -1230 -661 311
7061 311 590 116 -1042 -219 -336 -526 -133 -696 -315 49 -872 -396 579 722 -425 367 -359 -503 -188
7080 -188 -284 124 338 -350 -562 -950 -219 -64 -347 1051 -406 243 179 148 -165 540 208 121 -246 -336 369
7101C69r07N15j001Q97J60Q80l13p85K5m26L09M97l82p36J602p44l33N51j331
7120a153Q82M48L07m31P34r57q5l12P11O81j753J011N51p30R1n83L82Q44k74j46
7140B18j28j61j086J559l47l45R39J4k04j082Q44j103J87J61M78L67O70r51M20
7159D50p08N23o28L85k08M95K8J97j67o72K23q5N8m09J316q11m0o99O62l50O10
7180A70N4r7j97N3m93K56j34K96M82N3j77l76O66o54Nj35K83J2J53n38O13K05
7202E00p26P07m83l14K17M39m53N2L35N5n57J36l6K24R9l63O8J21j32L82n17K74
7224B8L07m02r9L17L6j60J54k33k3J35j79N8Mo1J41J60j49j31P0k86M12r0K13
7247B22l49j2L46m55J86J96m1n6L8k12K12j08N1J06J52l44J07O0m4J71j1k4L2
$$ plain form
7101 369 -538 -23 -1024 -127 33 913 600 -185 -160 -586 -277 220 -162 -898 704 -40 -373 178 -1153
7120 -1153 -271 177 484 53 787 -170 -255 -567 144 825 -928 83 634 -96 -5 -588 -206 638 364 218
7140 218 90 -71 -1157 402 55 -290 649 663 459 -623 221 -882 -695 -534 -56 311 981 30 450
7159 450 -258 265 -363 22 -186 309 337 534 367 -305 -82 -167 -109 -518 798 -13 -53 -752 -90 -440 170
7180 170 224 127 -70 -17 -510 -254 -388 -92 390 443 266 -110 556 -98 -93 -228 55 67 220 -318 295 500
7202 500 -226 481 -2 -316 -99 340 -113 -61 274 329 -228 -92 -128 96 195 -168 -100 21 -111 271 -246 28
7224 28 335 -67 -166 151 187 27 181 -52 -75 60 -119 -61 -57 -118 23 183 34 -97 -27 -313 99 9 222
7247 222 -127 -139 207 -248 -62 134 93 37 75 -137 75 -33 18 124 276 -68 39 99 55 226 215 191 223
7270B23l15k18L10o5m1JL06k91K72o6j83O4n4K18j7k9j21K97m85L89k05p5J78
7293I3J96l36n8n4L42J74p17J73L68n7k12PK75j50l40J39N29l68k15M11k86J25
7315C9m13K56K57l03M0J78J87j75j92J12j74J01K55p4n6l8J78n9j46J97j02M3
7337A11l3r7j62J60J05J64l52J09q0j92M78o97J77N93J87m56Q1n47j59L37L10
7358C7j40J62L55l88l70j63J84L42Q9k91j5l34O48p4l3l65K84M08r8j34Ml0k70
7381a92O0K62Pl32L20k70K2J05J20p1o5J19O5j89Lj16K66o2j15L9r4m3M41k55
7405B5r1L05m57P14p04m9k4K32M00O15j692M50L99k54J64p3j08o8J29R2p3k3J31
7428D0j55P0J50O7m76M12j2L9r5Jj37J45j04k6J7j7r0J97l05K49Q8%j39k06M65
$$ plain form
7270 223 -92 -310 0 -65 -106 -105 201 -90 182 116 -67 -3 -57 161 144 115 -6 291 -194 195 -10 -85 93
7293 93 289 -47 -105 -159 183 357 -360 -187 181 124 -88 -81 194 44 -296 -157 372 4 -211 200 -86 39
7315 39 -374 -118 139 -164 -124 54 241 66 -126 -14 -188 -87 168 94 38 0 178 119 -27 170 68 111
7337 111 78 -19 -181 -21 84 248 -104 5 -75 -267 211 -486 -309 284 471 15 96 -451 -610 -273 37
7358 37 -103 59 414 26 -344 -507 -323 19 108 -183 -198 -532 116 42 9 -356 -72 336 238 104 108 78 -192
7381 -192 -132 130 137 -195 125 -145 -123 -18 102 31 -34 85 150 -39 -36 -152 114 52 -63 -24 -118 -161 280 25
7405 25 -66 239 -218 496 -208 -257 -281 -49 351 966 -726 -276 123 -131 33 -40 -148 -216 -87 5 -68 -91 40
7428 40 -115 -45 105 172 -304 108 96 135 40 41 -96 49 -55 -81 -64 -81 -171 26 -279 -30 58 58 -81 -287 178
7453A78j26J99l22j01J69N9j84L4J99k73Q1r6K18l7j53J48m4J70j79N4m1nPJ47
7477A02j26n3Q3K00k08J46M8l06PJ62k51K1K43m6J77l01K61q0j71k6Q3J49J23
7500B37j81q5o48N59J22m1j8K34l51j28K57K70l01O1n5J31J35m48L52n7j92K02
7522E5R4j98O4Q4O5J44l72J14k30M3J76J21j60J36J0OKj05M0k25J51M0R6j81j32
7547a62j15M89l42N99p22J58L67j50j8k82N22l83k1m6J85m7R7k95L6O4r6M75j84
7570A29k60o7K28o9l1j06N13o72L46J20j69P9J84k40m3K64ko5j60J15m1O5l15
7593a97K49J70J01n77M16j49J76k67J39j2J84m6m58J53K13q9j03L11k55o6p4J06
7615g5K63k20J3l67O1M67L4k38j82J94j36K19P5j94M9R3j43j00J42j35K04L6k6
$$ plain form
7453 178 52 251 -71 -172 -3 56 -128 -94 105 -168 -87 -183 35 -2 -155 -7 -51 119 -60 -6 -47 -52 -45 102
7477 102 -24 -77 6 206 -2 144 192 -114 -107 55 -196 -175 68 22 199 -102 159 79 -92 -118 -35 114 237
7500 237 56 -29 -677 -118 4 -37 -55 179 -172 -300 -43 227 -74 -13 -68 63 198 -250 102 45 -147 55
7522 55 149 -49 15 99 164 308 -64 50 -180 -137 39 160 0 136 146 152 154 49 89 -136 15 55 151 -30 -162
7547 -162 -277 212 -130 469 -253 -95 272 122 104 -178 344 -39 -60 -106 79 32 129 -166 -130 -66 -162 313 129
7570 129 -131 -198 30 -39 -70 -176 337 -335 11 131 -38 41 225 -15 -58 206 204 139 -21 94 53 118 -197
7593 -197 52 222 323 -254 162 13 189 -78 61 49 233 187 -271 -118 95 6 -97 214 -41 -107 -181 -75
7615 -75 188 -32 -19 -386 -325 142 176 -62 -244 -50 -186 33 108 -86 -37 56 -87 -187 -45 -180 24 60 34
7638C4j13J71j41K54m72J27k0K58k09J54N6j31J42j33Q5l56L38j41K4N1k51M30
7660A57k10K78j48q2j21m6n8N2J72o6J84nn3k21O8R0J40l45R9J93k10p9K38mJ38
7685A61j55p2L03j66n0K92j34l92l1L29L2j35J83J53j09j83N3k42M27m57O1R5
7707c7J92m36L92k01j30L1J61m3J30k75J13J77j84K63j41m9l6K02q2l19J24L97
7729B49j07l93J9L35j70q1J5MJ22N8p3J00j86Q9J62j49Q9k45K76J91l95Q8N5j92
7753a39J79J4J9k42q4p6L72m9k53J34j02M56K29o38N21j66k33j8J14n25M75Q79
7775H67j050o73J569j404J06R2O83m40N62o10J08J58O13m30r5N31r34M61l0j36
7795e2m82J068r84K96K42m49L38j07L76j90M73o86N60o22J30pj3O24j588R73p4
$$ plain form
7638 34 -79 92 -49 205 -267 -140 -160 98 -111 43 99 -32 110 -23 62 -294 44 -97 -73 -22 -273 157
7660 157 -53 225 77 -5 -126 -172 -230 -178 -6 -72 112 107 54 -167 -99 -9 131 -214 -115 78 -132 -211 27 23 161
7685 161 6 -66 237 71 21 313 179 -213 -244 85 117 -18 165 318 209 26 79 -163 264 -193 -132 -37
7707 -37 155 -281 111 -90 -220 -189 -28 -71 59 -216 -103 74 -110 153 12 -37 -73 129 47 -272 -148 249
7729 249 142 -251 -232 103 -67 -148 -133 -129 -7 51 -22 78 -108 -19 143 -6 83 -162 114 305 -90 -2 53 -139
7753 -139 40 54 73 -169 -253 -329 43 -6 -259 -125 -227 229 458 -180 341 175 -58 -76 38 -487 -12 867
7775 867 -183 -856 713 -691 -585 -493 190 -250 312 -298 -190 -32 581 151 56 587 -347 114 84 -52
7795 -52 -534 534 -450 -154 88 -361 -23 -130 246 56 529 -157 403 -219 -89 -96 -109 515 -1073 -100 -174
7816a74P90j210O62k51K04m11k69R27j36j066N11M68Q12p29o71J191q86M5o55
7835h48K42N94l4m94m5P55k42n75J003p80O83J22r37J46K2K22J26LJ95j10L43
7856C91r11L08k17mR88p16l4K48O03j288P08j93q9N52l43k81P3j481J512l9P4
7877a39K21j63j57J366j204J27r10Q83L15J73m05p41J53L01N79n14N64j113P41
7896G7K31Q7j04N7r42K67j47p5L72L32J77q4Nk32K95M98q50m92k86J143j130K85
7918e16L11K1N63l06j12j95kJ27L24k86j83l60N26j38k45L47P5O53q07J14NN41
7940D57l98q31Q7Q70l0j490M87J936j447M51P7o47J56J123o87n27L67m86J378
7959H46q28j03R0k9j14r15J237k57n24M52K67k05j78Rj2J15M74m70k02J05n3Q13
$$ plain form
7816 -174 616 -594 68 -183 21 -390 -659 268 132 -934 -423 45 857 128 -543 648 -238 -193 -848
7835 -848 -606 -12 -46 -540 -585 170 -72 -647 356 -424 259 381 -556 -410 -388 -166 -40 -37 158 48 391
7856 391 -520 -212 -429 -433 555 -161 -195 53 656 -632 76 -117 -206 346 3 -278 -205 -1686 -174 -213 -139
7877 -139 82 -81 -238 1128 -76 51 -859 24 339 512 107 -634 -481 -180 399 -115 449 -664 77
7896 77 308 395 291 348 -594 -327 -474 -549 -177 155 332 248 253 21 316 814 -36 -528 -814 329 -801 -516
7918 -516 -205 -184 379 73 -39 -234 -236 -109 215 -71 -254 -614 -88 -226 -471 -124 -49 604 -203 -89 -84 457
7940 457 59 -772 -685 185 155 -1335 -848 1088 -359 92 169 -478 -322 801 114 -413 -46 -532 846
7959 846 18 -85 5 -24 -138 -1053 184 -73 -597 -145 122 -83 -261 -252 -264 -149 325 -145 -347 -242 -295 518
7981E18o39J54L63j146J348p69J30l74O56n79N40j08n17J91J28J93j57K66o47
8000d49L03n18J118o27o7J92q22J213k49P06j604O81J96Q3M06l35r63j8J264j83
8020C27q50J0M92K17p80l8Q1L7N03M15m98K77j69J66J90n99J70J30l40O2q8L86
8042A01O6p5j20n9J21Q8r56O08k04J52J8P3M85p28l17J215j128Q17M0l53J24J12
8064H0p65R30l28r95J293j84K42K13m85l30m50L75M41K94Q1r0J97o56K42p66o05
8085a266O83O50M41l91p88R63l5j92L7K78L62j156N73Ql14R83q70m63Q32K8l1
8106C32q94j84J019l88L87o59N42K80j145J274o78J060j397O17j263J139N9R9
8124B00q13O88l1K1q15N02k53N99l24L05K86l5O5o97J32k43M80l76n0J62L58o69
$$ plain form
7981 518 -121 33 396 -750 598 -171 -41 -415 241 -338 202 94 -423 -232 -104 89 -68 198 -449
8000 -449 -146 -664 454 -173 -240 -48 -870 343 94 800 -804 -123 73 156 562 227 -736 -754 510 327
8020 327 -523 -513 -21 196 -584 -622 -541 -504 -1 414 -84 193 24 190 380 -219 -49 81 -259 -197 -285 101
8042 101 167 92 -28 -87 34 122 -834 -226 -430 -278 -260 -187 298 -430 -747 468 -660 157 197 -156 -32 80
8064 80 -685 245 -83 -1078 215 31 273 486 1 -329 -779 -404 37 331 412 322 519 -137 105 -661 -1266
8085 -1266 -583 67 508 117 -671 292 257 65 102 380 742 -414 159 167 -147 836 -34 -497 335 363 332
8106 332 -562 -746 273 -115 272 -387 155 435 -710 564 -114 946 -451 166 -1097 42 101 200
8124 200 -613 75 44 65 -750 -248 -501 98 -226 79 365 330 395 -302 -170 -413 67 -309 -359 -197 161 -508
8146e08N45J50j188Q28M85J54j555Q18j72K46j41j95K79N60j10n11J85Q20j064
8165c74J08j95N74k38n02J29j60J223k07j095K38Q8JN35o91J176q95N37k65kJ34
8186A19j62q4M05K4j465
8191a163
$$ plain form
8146 -508 37 187 -1001 -173 312 466 -1089 -271 -443 -197 -338 -533 -254 306 196 -315 -130 690 -374
8165 -374 -266 -461 113 -125 -627 -498 -658 565 358 -737 -499 -411 -410 125 -566 610 -285 252 -13 -15 119
8186 119 -43 -127 278 302 -1163
8191 -1163
$$ Imaginary data points
##PAGE= N=2
##DATA TABLE= (X++(I..I)), XYDATA
0@%%%%%%%%%%Qj6J6j6K4l2M0m8N6p2Q8j04J20j44J74k03K35k70L12l60M14m72
32b50N36o07O87p75Q70r77J092j219J359j511J676j857K055k273K509k765L050
49A600l363L704m080M497m960N476o056O715p468Q338r358J0572j2047J3883j6243
64h790J9409k3894L0787m2866P0106k43162L8503M19169k17397j92538Q1255J30519
76F1101o2918K7176M4252l7063n4110N7766L0529j2563n1445m6266K1593J01837
88G9889l9298j52194R944J64678r103j25480J5470P2060n7202j4202J17291L4271
100I6124j05965l6437N3040K8330N814j1261o7932j4762R8182K7363j09470k9166
112f6140R1556K686q0232J8954O7391k6586m5156L7435L5173m1573l7767L9983
$$ plain form
0 0 0 0 0 0 0 0 0 0 0 0 8 -8 8 -8 16 -16 24 -24 32 -40 48 -56 64 -80 94 -109 126 -144 168 -192 222 -250
32 -250 286 -321 366 -409 461 -516 576 -643 716 -795 881 -976 1079 -1194 1315 -1450 1600
49 1600 -1763 1941 -2139 2358 -2602 2874 -3182 3533 -3935 4403 -4955 5617 -6430 7453 -8790
64 -8790 10619 -13275 17512 -25354 44752 -198410 -159907 259262 41865 -150673 -69418 61101
76 61101 -1817 25359 69611 32548 -21562 36204 66733 54170 2725 -43541 -21948 79889
88 79889 40591 -111603 -101659 63019 53916 -71564 -56094 15966 -41236 -55438 61853 96124
100 96124 -9841 -46278 6762 35092 40906 29645 -38287 -53049 45133 72496 -36974 -66140
112 -66140 25416 28102 -52130 -33176 34215 7629 -37527 -92 35081 -6492 -44259 -4276
124d276N8973j0135o5445j3792O1938J9029p1643k6457O4509J6074n5659P872
136a9012N9125k6417p0237K8279P0247k6085o1028L3714O9765k3930p8060j037
148d4676O8227J9150m7885j1942L6425n997m2555J4280M7271k2260n4997K1574
160b3385N5009j0508m1134M714K4142j711j2769j012Q698P511m014k705J5408
173A8244k474m6735j2740P0713L7352p2208n7893N2350N6673k7990m3174N935
185b1947K3608J1625Q2j1220p792L794n359J767K5850k816m4505M410O6432l808
199D0121q2810n397P9061N143o3400K602M6015j5930l7869K7027L7506k3451l6765
212b8147J0535M4424J1819m4690l6463L6619M8924l1436n0705L1009M3814l5473
$$ plain form
124 -4276 54697 44562 -20883 -34675 27263 46292 -25351 -51808 12701 28775 -26884 -19012
136 -19012 40113 13696 -56541 -28262 41985 15900 -45128 -11414 58351 34421 -43639 -44676
148 -44676 23551 42701 -5184 -17126 19299 13302 -29253 -14973 32298 10038 -44959 -23385
160 -23385 31624 21116 -20018 -15304 8838 7127 -5642 -6654 2044 9555 5541 2836 18244
173 18244 15770 -30965 -43705 27008 64360 -7848 -65741 -13391 43282 15292 -27882 -21947
185 -21947 1661 13286 13368 2148 -5644 -1850 -7209 -5442 20408 17592 -26913 -22503 43929 40121
199 40121 -42689 -48086 30975 36118 -27282 -24680 21335 5405 -32464 -5437 32069 8618 -28147
212 -28147 -17612 26812 38631 -6059 -42522 -5903 43021 11585 -39120 -8111 35703 230
224B30l0705M1412J2797n2923k955O1937L137o1348q340N2805K0358l3537k5136
237b2268J2758K5908n0k3465l869K2238m620k9111J4265L8533k0702m9181K2682
250a6882N4151j9452n4922J2160M9313j007l5525k928K3931L720j6063m48J6210
263A2258j561k5087k945L3894Q738m2318k0666M5003K8822m1860l1827L6697L0714
276B9862l0900k2959L1179J6691l2998j3501L7391J6020m0243k2861L7707L1159
288C6547l1772l9288K0846M0017j2732l8733P335L3982o474k8154J2506K7825
300B1905j8087k9349K3876L5718k3461m2159J8009M4775q803m3089k321L4283
312A1297O304k5941o181J9605K517k1478J196K7566o01l4116k147M2544J2683
$$ plain form
224 230 -30475 10937 23734 -29189 -32144 29793 32930 -28418 -36758 16047 36405 2868 -22268
237 -22268 -9510 16398 16348 -7117 -10986 11252 6632 -22479 -8214 30319 9617 -39564 -16882
250 -16882 37269 17817 -37105 -24945 24368 23361 -12164 -15092 8839 12559 -3504 -3952 12258
263 12258 10697 -14390 -17335 16559 25297 -17021 -37687 7316 36138 -5722 -37549 -852 29862
276 29862 -1038 -23997 7182 23873 -9125 -22626 14765 30785 -9458 -32319 5388 36547
288 36547 4775 -34513 -13667 26350 13618 -25115 -17780 16202 9728 -18426 -5920 21905
300 21905 3818 -25531 -1655 34063 10602 -31557 -13548 31227 22424 -20665 -22986 11297
312 11297 17601 -8340 -14521 5084 7601 -13877 -12681 14885 14284 -19832 -21979 20565 33248
325C3248m3089k2182L6766K7630k7584k7382J8462K1334j5688j4688J5821Q733
337A1381k3246j0135L0109J8285l2215k8589K8543L8721j7117l9557R064L5754
349B0998m330k8843M714K2565j2051k2740J8708K8481k3014l8024J7774M2795
361B7033r171m3588P72M0335P434l2015r346K4785Q101j9339q40K2559l621l1025
375a7926L45L7421N445m2255j4963L8732K1689l1058k2991K2833J7101j9133j0518
388a5278K2405J0242k2973j1732K6008J6794k8236k4145K5957L2881j9810l7326
400b5213R986L3617p241k9235O119K3550q826j8660J5309K0648j8622k7550J5584
413a0534L5189n460l4504p4L3607L078l4711p963L2172Q575k8410o877K5301R67
$$ plain form
325 33248 -9841 -32023 4743 32373 4789 -22593 -4131 17203 1515 -13173 2648 11381
337 11381 -11865 -22000 8109 26394 -5821 -34410 -5867 32854 15737 -23820 -14756 20998
349 20998 16668 -12175 -7461 15104 3053 -19687 -979 27502 4488 -33536 -15762 27033
361 27033 17862 -25726 -24954 15381 22815 -9200 -18546 6239 14340 -4999 -5839 16720 13099 -17926
375 -17926 -17581 19840 25285 -16970 -31933 6799 28488 -2570 -25561 -2728 14373 -4760 -15278
388 -15278 7127 17369 -5604 -17336 8672 25466 -2770 -26915 -958 31923 12113 -25213
400 -25213 -15227 18390 11149 -18086 -11967 11583 2757 -15903 -594 20054 1432 -26118 -10534
413 -10534 24655 19195 -15309 -15383 18224 21302 -13409 -21372 10800 19375 -9035 -15912 9389 10356
427A0356k6779R10K9242j77l0107l374L2871J2655k6680k1410K0606K1472j6614
440B971j8503J9215J9228k2377k1403K1559J6884k7888j4147L2404J7945l2077
452f189k1580K4994K5555j5027k6739L708K7204P053j9671m503J6599p059k5850
465b1505J2560L5823j2205m0003J2565L8696j6139m1810R769M0014K472k5711
477e474q136J3995P836q594n821J2135O069k0180q871L3513J5889m1625k7105
490c6369L6777K6572l0337j9731K7645J2619k3997r482J8771P784j6557o234J9045
503F506J5335j6253k7032J2321L4066p119m1751L114L9072K039k9219J703J4659
516G441j5478j3954K1681K3375j7805k4293R864K5304k958k7431n195L0965J5624
$$ plain form
427 10356 -16423 -15513 13729 13552 -16555 -19929 12942 25597 -1083 -22493 -1887 19585 2971
440 2971 -15532 3683 22911 534 -20869 690 17574 -10314 -24461 7943 25888 -6189
452 -6189 -27769 -2775 22780 7753 -18986 -15278 11926 18979 -692 -5195 11404 4345 -21505
465 -21505 -8945 26878 14673 -25330 -12765 25931 9792 -32018 -22249 17765 20237 -5474
477 -5474 -13610 385 8221 -373 -6194 5941 12010 -8170 -17041 16472 32361 -9264 -36369
490 -36369 408 26980 -3357 -23088 4557 17176 -6821 -16303 2468 10252 -6305 -12539 6506
503 6506 21841 5588 -21444 -9123 24943 17824 -23927 -20813 18259 20298 -8921 -7218 7441
516 7441 -8037 -21991 -310 23065 5260 -19033 -9169 16135 13177 -14254 -19449 11516 27140
529B7140k7954j8530K3887J3765k4481j1247K2214M773k0105K595K4113l012l0007
542a6849r041K5720K0610j2708j9987Q335J8106j1613j6814J6195J9108k0835
554B27j8290K1283J4980k4120j3473K4489J2597k3376j7925J5241K5391J37k2383
567e222j1254J5464R456j5020O76K3328m066k9695Q234L2139j5141l5440J5590
580a0951L3615j2970k7318P432J8587k259j0568o080M358J3763J419j2424N341
593A945J0639k2370j6209L5812K5354l8424k5689L6810J9354l6286j3804K8293
605E425N898k0757P41J3315j367p356j175N031J1097k602k2418P85L5783K56m3046
620b0390j624M0821l535l4024J2930K6054k2300k0355K7197J6101k7680j6448
$$ plain form
529 27140 -814 -19344 4543 18308 -6173 -17420 4794 9567 -10538 -7943 16170 13158 -16849
542 -16849 -25890 -170 20440 7732 -12255 -3920 14186 2573 -14241 1954 21062 227
554 227 -18063 3220 18200 -5920 -19393 5096 17693 -5683 -23608 -8367 17024 17161 -5222
567 -5222 -16476 -1012 8444 -6576 -5900 17428 13362 -16333 -8099 24040 8899 -26541 -10951
580 -10951 22664 9694 -17624 -10192 8395 6136 -4432 -10512 -6154 7609 9028 -3396 1945
593 1945 12584 -9786 -25995 9817 35171 -3253 -28942 7868 27222 -9064 -22868 5425
605 5425 11323 -9434 -8693 4622 3255 -4101 -5276 -245 10852 8250 -14168 -13383 22400 22656 -20390
620 -20390 -22014 18807 15272 -18752 -5822 20232 -2068 -22423 4774 20875 -6805 -23253
632b3253J8910J7942j976j6171j0431J6111K1034j6787k6890J6285K6036j6973
644C837j8036K1630N518l0352m44L5424J065l3767m318K6316N719j6056r156P439
658e181J3882J500j2502k126J2954l501j7479J0179K2059j6580k8697J8609L1797
671B4914j6304l2336J0728K8366m865k1090R41J3194K99r117L881J2007n280j6586
685a1248N516K2512k149k7094l621K6449N845k5013r578K0250R604j4228p097
698i852J3396N199j5401m192J9243N880k2709q449K4014J2615k1987j3771J8958
711B944J3215j3369j3265O804Q794m741q732M358R393l877j2385O962J9567o941
725H727k4294O049K7392o507k6652O553K3092p191j7902Q423J3869j0501j0972
$$ plain form
632 -23253 -4343 13599 11623 -4548 -14979 1132 22166 5379 -21511 -5226 20810 3837
644 3837 -14199 7431 12949 -17403 -17847 17577 18642 -15125 -19443 6873 12592 -3464 -12620 -5181
658 -5181 8701 10201 -2301 -4427 8527 5026 -12453 -2274 19785 3205 -25492 -6883 24914
671 24914 8610 -23726 -12998 15368 10503 -10587 -9646 3548 3847 -5270 -1389 10618 5338 -11248
685 -11248 -5732 16780 14631 -12463 -16084 10365 16210 -8803 -18381 1869 11473 -2755 -9852
698 -9852 3544 8743 -6658 -10850 8393 14273 -8436 -16885 7129 19744 -2243 -16014 2944
711 2944 16159 2790 -10475 -3671 5123 382 -8350 -3992 5401 1524 -10861 -3899 15668 8727
725 8727 -15567 -9518 17874 11367 -15285 -8732 14360 7169 -10733 -2310 11559 1058 -9914
738i914P879R096o432j2387K77J7481Q749j8419j4755J9816K0361j7997j9206
751a5451J8362J1943j9508q039K2753J270k4876J494K5036o1k3276m102J7546
764C091P086r465j2323L140J4383K853j2893p93J3787l630j5229R612J8573j5297
778B895k3901J6069K5097j3008k6119R197K0450m294j2868J368P699k424l838
791c677K179O867j424j0913J619J7517J927k1386q558K2267J2163k1987j3543
804a6949J6427J0672j4629m560J4384Q70j5968J659J6838Q74j5995n383J4170
817B410J1656r254j5314O765J4695k589j4707L24J2451m395j2090P585J2440j0652
831f75j5634J5261J8125j3193j8562Q885J7544m669j4105N38J1720J418r041q27
$$ plain form
738 -9914 -2035 7061 629 -11758 -11481 6000 14749 -3670 -18425 1391 21752 3755 -15451
751 -15451 2911 14854 -4654 -12693 10060 11330 -13546 -12052 12984 12923 -10353 -14455 3091
764 3091 10177 712 -11611 -8471 5912 8765 -4128 -4921 8866 5236 -9993 -381 18192 2895
778 2895 -21006 -4937 20160 7152 -18967 -9770 10680 6386 -6482 -5114 2585 161 -3677
791 -3677 -1498 5369 3945 -6968 -5349 12168 14095 -7291 -15849 6418 18581 -3406 -16949
804 -16949 -522 10150 -4479 -9039 5345 6215 -9753 -8094 8744 9618 -6377 -11760 2410
817 2410 14066 4812 -10502 -3737 10958 8369 -6338 -6014 6437 2042 -10048 -2463 9977 -675
831 -675 -16309 -1048 17077 3884 -14678 -5793 11751 7082 -7023 -6485 5235 6653 -2388 -3215
845c215R413k78j2427o21J6617j326j9500l401K0917O828j9799p960J8917P977
859A2142j5697l990J2532K758j0340k333J0204K019j2384l677J2248R028j2698
872a88j4234R976J6941q108j7828N170J6752m083j2252Q098J0348r720j1751J2118
886A239J3289j2198j4360Q998J5918n928j6748M26J3823L493j1200m919R000L642
900D475q822j129J1765q53j5763J607K2261K673k3734o535K0220P493j6632o980
914i954J2049M566q672l053O215L65p136m38R897N191j0773j1306J1980J6027
928A4958r458j9370P707J9890n719j4499N264Q441r112p757J1548P212j1784q710
942a1389R228J0774m874j3268J024J4404M315j2961n771J3111M769j2611j743
$$ plain form
845 -3215 6198 5920 -6507 -7128 9489 8163 -11337 -14738 6179 13007 -6792 -14752 4165 12142
859 12142 -3555 -7545 4987 7745 -2595 -4928 5276 7295 -5089 -8766 3482 12510 -188
872 -188 -14422 -4446 12495 4387 -13441 -8271 8481 4398 -7854 244 10592 872 -10879 1239
886 1239 14528 2330 -12030 -3032 12886 6958 -9790 -9364 4459 7952 -3248 -8167 833 4475
900 4475 -4347 -5476 6289 5436 -10327 -8720 13541 16214 -7520 -14055 6165 13658 -2974 -9954
914 -9954 2095 6661 -2011 -5064 1151 1516 -5620 -6058 3839 9030 -1743 -13049 -1069 14958
928 14958 5500 -13870 -6163 13727 8008 -6491 -1227 7214 -1898 -9655 1893 9105 -2679 -11389
942 -11389 -2161 8613 3739 -9529 -8505 5899 10214 -2747 -8518 4593 9362 -3249 -4992
955d992J2349j942j5807M697J8226l567j9091j377J5809L457j1986n189R791P296
969G674o498p612O378O310p003o345J1319Q072j3660r648J3544J0125j4752j1451
983a3547J1587J2413p577j0787L038P980k700o875M786R280l981j1071M490J3804
997A0840m717j5973L991J6563j567j5916J10J1678l11r383q89Q029k82p443M14
1012d856J1130l38j2993j941J5609N599j5887q455J5724Q806j1422r355Q545L990
1026D156o234k406P662J201p956l700Q966N693r999r592J0915J4831p776j5069
1040i308L831J4292l711j1141M676Q500o907n539O630N664q715q732O939J1258
1054G737j045j3524k399J1559O392j0945n141J0685L873j0592J2J0611k627j2969
$$ plain form
955 -4992 7357 5415 -10392 -5695 12531 8964 -10127 -11504 4305 7762 -4224 -9413 378 7674
969 7674 1176 -6436 -58 6252 -751 -7096 4223 12295 -1365 -11013 2531 12656 -2096 -13547
983 -13547 -1960 10453 2876 -7911 -4873 3107 407 -6468 -1682 7598 3617 -7454 -2964 10840
997 10840 6123 -9850 -5859 10704 9137 -6779 -6669 5009 4698 -4685 -5574 2455 2173 -5270 -4856
1012 -4856 6274 5936 -7057 -8998 6611 12210 -3677 -12132 3592 12398 976 -8379 166 4156
1026 4156 -2078 -4484 3178 4379 -3577 -7277 1689 7382 -2617 -12209 -1294 13537 5761 -9308
1040 -9308 -5477 8815 5104 -6037 -1361 7139 232 -5307 1323 6987 -1728 -10460 -3521 7737
1054 7737 6692 -6832 -9231 2328 8720 -2225 -7366 3319 7192 -3400 -3388 7223 4596 -8373
1068h373M740J3082k068j4836k401J2034P587r969q905N763Q862l204q239M897
1082a030O847o856n076J2089M779j4923p695J4274J1075j0976j1420N414Q528
1095E030k322q388J696P126N4p810R13Q420l376r740N584J4701m883j6139J872
1110g262J5436l07j2125j947P541M76k972j607M412k66o094j337R590M205j1346
1125c603p790J5048P956j3415q972J3054P970r518n387N990J553o466R59N691
1139C070N63o367n129N850Q579l389j0976L155J3886l922j2993J98J5680l460
1153D745r412L786Q035q576o205J0153N625q015p551M158P908n7q219m758R355
1168I72O514r809n778R172O339r606k048J1334j61j4020J344J3885l74j3485k595
$$ plain form
1068 -8373 -3633 9449 7381 -7455 -9856 2178 9765 -204 -9109 -3346 5516 2312 -5927 -1030
1082 -1030 5817 -1039 -6115 5974 10753 -4170 -11865 2409 13484 2508 -8912 -3498 5030
1095 5030 2708 -5680 -3984 3142 3196 -4614 -3701 4719 1343 -8397 -2813 11888 7005 -9134 -7262
1110 -7262 8174 7867 -4258 -6205 1336 1812 -1160 -2767 1645 1379 -4715 -6052 3538 7743 -3603
1125 -3603 -11393 3655 11611 -1804 -10776 2278 10248 730 -4657 1333 2886 -3580 -2621 3070
1139 3070 3633 -2734 -7863 -2013 6566 3177 -7799 -4644 9242 5320 -7673 -7475 8205 4745
1153 4745 -4667 -881 7154 -1422 -7627 2526 8151 136 -7415 -3257 4651 4594 -3625 -8383 972
1168 972 7486 -2323 -8101 1071 7410 -2196 -4244 7090 6929 -7091 -5747 8138 7764 -5721 -8316
1183h316J0991M596p663o932L488P131j617n759K453O528n223o850Q055R344r418
1198H08r971Q921J1706p937j2289M777J0320k968q042P98O396p39n561J539O158
1213C916k855q511L521J2057n23j3379k308J2286M966r739m534O803K959o011
1227a352k405O101N64q087j157R800K971j1125l596J1454O005r997p306O917P618
1242F405l189m895J592L195k812l000L764M524n952p931N951J0459n533j2587
1256a0009M482J2211k495r447K841P341k957n203M136K997l424m270L967N397
1270E567j859q590j438J0680K765j0159n877Q974N976q102m672Q952J311p616
1284d088K42J0442r12r819QR334Q19q586l883N733O593l750p091J621O144j685
$$ plain form
1183 -8316 2675 7271 -392 -7324 -3836 3295 1678 -4081 -1628 4900 -323 -7173 882 10226 808
1198 808 -9163 -242 11464 3527 -8762 -3985 6335 3367 -4675 -3877 2519 1780 -3781 -2242 3916
1213 3916 1061 -7450 -3929 8128 7605 -5774 -8082 4204 9170 -569 -5103 1700 4659 -1352
1227 -1352 -3757 2344 2908 -5179 -6336 3464 6435 -4690 -8286 3168 9173 -824 -8130 -1213 6405
1242 6405 3216 -1679 -87 3108 296 -2704 1060 5584 -368 -8299 -2348 8111 2578 -10009
1256 -10009 -5527 6684 4189 -5258 -2417 4924 1967 -3236 900 3897 473 -3797 170 5567
1270 5567 3708 -4882 -6320 4360 7125 -3034 -8911 63 6039 -2063 -6735 2217 3528 -4088
1284 -4088 -3846 6596 5684 -4135 -4127 5207 6026 -2560 -6443 -710 5883 2133 -4958 -3337 2807 1122
1300A122o122K484O712m578o744O781R428p415r730O614J0971m912j0401L026
1314b764P223k069n679N20M106q81l237J545M406j123p041L7Q944K815j0477m722
1330h397J0802O384q685m919O575L605o500j722O063j253p028K45P899Q45p142
1345c228l598O673O654m028q294J958P450K22o429J379N247l232m731O160N315
1360G518q118p806P492Q102n687q656K226P852j4n150r20M035J945l277m68M028
1376C102j157o197J154Q994j6j0537j778J0329L242r526l984O627K909m910j973
1391c721M741M41m212N24N861J200o409l043O468N643o280p936M017Q073j998
1406C369p685J995O261k978n808L770N299n217n882O349P161n249o847L859P029
$$ plain form
1300 1122 -5000 -2516 4196 -382 -7126 -345 9083 1668 -8062 -1448 9523 4611 -5790 -2764
1314 -2764 4459 2390 -3289 -2769 1337 456 -2781 -1236 3170 2047 -4994 -4957 3987 6802 -3675 -8397
1330 -8397 2405 8789 104 -4815 1760 5365 -1135 -2857 3206 1953 -5075 -4830 3069 3914 -3228
1345 -3228 -6826 -153 6501 2473 -5821 -3863 3587 3809 -2620 -1241 4006 774 -3957 2203 7518
1360 7518 -600 -8406 -914 7188 1501 -7155 -4929 2923 2909 -2241 -3161 874 2819 -458 -926 3102
1376 3102 1945 -4252 -3098 5896 5880 -4657 -6435 3894 7136 -2390 -6374 253 3162 -1748 -3721
1391 -3721 1020 1461 -2751 -2227 3634 4834 -1575 -4618 1850 7493 1213 -6723 -2706 5367 3369
1406 3369 -4316 -2321 3940 962 -4846 -1076 4223 -994 -6876 -527 6634 1385 -5462 -1603 5426
1421E426j629o080k19M807J451m288k078K552J875l588j684O185J182p730k238
1436f056Q983L447r509l636Q547L686o157j952O226j84m583J69K987l08l186j420
1452b946K737L033k356n892J803R931k816r405K280Q280k399o016L659N257n800
1467f50k869O593K415n935m271L935L622j383m078k407N800L250m361l938M102
1482a75L981m632p16O396j320q036J873Q977k488q697K04P853J610m593l241J056
1498a948K283j90j876O18K939k509l714N131M358o156m783P619O244p244o568
1513e796M912N505k592l730K81J441l75j080J518K221k569m816K350P991j509
1528C752q963O10R339J12o855k53N148o57l773L74K884o94k789O53K821L12n326
$$ plain form
1421 5426 3797 -2283 -2502 2305 3756 -532 -2610 -58 1817 -1771 -3455 2730 3912 -3818 -6056
1436 -6056 2927 6374 -3135 -6771 1776 5462 -695 -2647 3579 3395 -1188 -1019 1968 1660 -1526 -2946
1452 -2946 -209 2824 468 -5424 -3621 6310 3494 -5911 -3631 4649 2250 -3766 -107 5150 -650
1467 -650 -3519 3074 5489 -446 -4717 -782 2840 1457 -2621 -5028 772 4022 -339 -4277 -175
1482 -175 3806 -826 -1542 4854 3534 -4502 -2629 6348 3860 -4837 -4633 3220 4830 237 -3004 -1948
1498 -1948 335 145 -1731 -1113 1826 -683 -4397 734 5092 -1064 -5847 1772 8016 772 -5796
1513 -5796 -884 4621 2029 -1701 -1420 21 -354 -1434 84 2305 -264 -5080 -2730 5261 3752
1528 3752 -5211 -4601 4738 4850 -2005 -2258 2890 2233 -1540 -1166 1718 1024 -1765 -1112 1709 2021 -3305
1545c305j909O561M294o160n161N207M956m488k467M343J425m362k84L652k1l709
1561a428j969L342L802k796n539J402O415j014o344J335O290j944n435L729L998
1576C844l800k586M273L157m607m092K200M173O41m340k964L784L411m303k771
1591c980M785K172n504j65O633r19p547J936P372q97o300K39M017J008k526k578
1607b254J58L360Q4l320M33L604k780m118N048N199o094n836P386N558n351n383
1623d306L612M261j968k286J21P28k56r33N36K302r68m970M46O741L02o834l61
1640c833P419Q91p202j109N523J093l211J154N11j189k963J233L826Q13n326k342
1656d712M336M392l978n201L969M386k663k394K858J894l833q71M083j12l168
$$ plain form
1545 -3305 -5214 1347 5641 -519 -5680 -473 4483 -5 -2472 1871 3296 -1066 -1350 2302 2281 -1428
1561 -1428 -3397 -55 3747 951 -4588 -3186 3229 2215 -4129 -2794 3496 1552 -3883 -154 3844
1576 3844 44 -2542 1731 4888 281 -3811 -1611 2562 3203 -1137 -4101 -317 3094 -1209 -3980
1591 -3980 805 2977 -2527 -2692 3941 3022 -4525 -2589 4783 3886 -2414 -2175 1842 2850 324 -2254
1607 -2254 -2096 1264 1348 -1972 -1539 2065 -715 -4833 215 5414 -680 -6516 870 6428 1077 -4306
1623 -4306 -694 3567 1599 -687 -566 162 -94 -1027 -491 1811 843 -4127 -3681 3060 3362 -3472 -3833
1640 -3833 3586 4477 -2725 -3834 1689 2782 -429 725 1236 47 -2916 -1683 2143 2956 -2370 -4712
1656 -4712 -376 4016 38 -5163 -1194 3192 529 -1865 993 2887 -946 -1817 2266 2154 -1014
1671a014j206K620K661j433o058J159N466l55m658P12L624q15k716K024K976j873
1687A114m449L842M018j650n556N88M389J57l628k174L394J810k736r35K174R24
1703A282m421l69N041O96m498J00M481J936m887j966K671L253k344k664J252J733
1719A296j577j625J364K742l417k397L618L342k829n722L929N799l159k939l60
1734a935M013l61l099K42K451j233j253L06K587K0n157N69N509l31n951J39N100
1751A616J394l609k167L102J268j702j062K817L58l223p10L655J302n093k432
1766d486M467L326k980l827J932L403p41k659J097K128j631j246K261K054k762
1781C36l368K479M077j862m614N96M629k07m183n47L575L12k977K68K765j133
$$ plain form
1671 -1014 -2220 400 3061 1628 -4430 -3271 2195 1840 -2818 -2106 1518 703 -2013 11 2987 1114
1687 1114 -3335 507 4525 2875 -2681 -2093 2296 2453 -1175 -3349 45 1855 -881 -1816 358 1282
1703 1282 -3139 -3508 1533 2229 -2269 -2169 2312 4248 -639 -2605 66 3319 975 -1689 -437 1296
1719 1296 -281 -1906 -542 2200 -1217 -3614 4 3346 517 -5205 -1276 4523 1364 -1575 -1935
1734 -1935 2078 1717 -1382 -1140 1311 78 -1175 -869 1718 1738 -3419 -2850 2659 2328 -3623 -3484 1616
1751 1616 3010 -599 -2766 336 1604 -98 -1160 1657 2015 -1208 -1918 1737 3039 -2054 -4486
1766 -4486 -19 3307 327 -3500 -1568 1835 1094 -1565 -468 1660 29 -1217 1044 3098 336
1781 336 -3032 -553 3524 1662 -2952 -2356 2273 2066 -2117 -2664 911 1223 -1754 -1486 1279 146
1797A46k453K032L452q44m234m83M177J582l469k704K445K260k300j667K490J150
1813A580l377k85L601M75l875j403M391K396l270k921K582K892j271k435L0K226
1829A336o55k142J260K247k056l428K308M290k191m602J819M679o21m218L04L169
1845A499K96j966k50J582q59j553N16K862j239l312m32M323J412m408j996L506
1861a9K726k771j886K476J276k225l93K284L33k888l35K978J541l625l022K602
1877i48L688j736l260J2L330k0k208O29J666j163j676K278K257j961l293J575
1893h30L788r06l869k68L370M97k656j114J627N41j225N63J830n70k857Q18L824
1910B563J96m147j013K829K641k864k305K185J655k047j174J286J545k823J1K355
$$ plain form
1797 146 -2307 -275 3177 2333 -1901 -2384 1793 3375 -94 -2798 -353 1907 -393 -2060 430 1580
1813 1580 -1797 -2082 1519 1994 -1881 -3284 1107 3503 233 -2688 -106 2786 1515 -920 -890 1336
1829 1336 681 -1461 -201 2046 -10 -3438 -1130 3160 969 -3633 -1814 2865 2244 -1974 -1670 1499
1845 1499 1795 -171 -421 1161 302 -1251 -735 2127 888 -2424 -2856 1467 2879 -1529 -3525 -19
1861 -19 2707 -64 -1950 526 1802 -423 -816 1468 1801 -1087 -1422 1556 3097 -528 -3550 -948
1877 -948 2740 1004 -2256 -2244 1086 1066 -1142 -513 1153 -10 -1686 592 2849 888 -2405 -830
1893 -830 2958 2052 -1817 -2085 1285 1782 -874 -1988 -361 180 -1045 -482 1348 778 -2079 -1261 2563
1910 2563 2759 -1388 -2401 428 3069 205 -2100 85 1740 -307 -1481 -195 1350 -1473 -1462 893
1926H93R44l564k97J719L743l126k178J038J916J250k722p50J351K35j874J414
1942hK115k027l102K184L455j853l618P23L823K00k421j195K168Q55r76K06L54
1959H83M99k693M32K267P30l237k752M434J876l440j781K877J806l109k6J512
1975B78j44j654J216J342R8j126j234J732J558j358l231O78L122K03l541r69M206
1992A176j234j512K280J268k386j696K649J562j778j585J182J527L11j811j866
2007a913J754K482k236k227J974J331k398o16L087j0l861J017M211m50l086j85
2023a126J931N45n61p33o21J464K63j860k44K148r21k332J840K508l113k786L415
2040a83K873k152k117J512J411p37n85K63JN9k30k30M91j04j741r5L186M25l980
$$ plain form
1926 893 1837 -1727 -2024 -305 3438 312 -1866 -828 1088 2338 -384 -1134 217 452 -1422 -8
1942 -8 2107 80 -3022 -838 2617 764 -2854 -2131 1692 1892 -529 -1724 444 1299 323 529 883
1959 883 1382 -1311 -879 1388 2118 -1119 -3871 563 2439 -1001 -2782 95 1901 -1208 -1234 278
1975 278 134 -1520 -304 1038 1136 10 -1224 508 2066 708 -2523 -1845 1277 1480 -2061 -3030 1176
1992 1176 -58 -1570 710 1978 -408 -2104 545 2107 329 -1256 -74 1453 1764 -47 -1913
2007 -1913 -159 2323 87 -2140 -166 1165 -1233 -1849 1238 1228 -2633 -1616 2595 2145 -941 -1126
2023 -1126 805 1350 789 56 -565 899 1162 -698 -942 1206 285 -2047 -207 2301 -812 -3598 -183
2040 -183 2690 538 -1579 -67 1344 607 22 285 286 345 115 -115 376 272 -1469 -1564 1622 2047 -1933
$$ [...]
8191i1
##END NTUPLES=NMR FID
##END=
