##TITLE=1H_Ser 5237-2
 DMSO
 8 sc, 
 28.6.2024
##JCAMPDX= 6.0         $$ Bruker NMR JCAMP-DX V2.0
##DATA TYPE= NMR FID
##DATA CLASS= NTUPLES
##ORIGIN= UXNMR, Bruker Analytische Messtechnik GmbH
##OWNER= root
$$ XWIN-NMR		Version 3.5
$$ Fri Jun 28 15:50:18 2024 Russian Standard Time (UT+4h)  she@DPX200
##.OBSERVE FREQUENCY= 200.1313
##.OBSERVE NUCLEUS= ^1H
##.DELAY= (6, 6)
##.ACQUISITION MODE= SIMULTANEOUS
##.ACQUISITION SCHEME= undefined
##.AVERAGES= 8
##.DIGITISER RES= 18
##SPECTROMETER/DATA SYSTEM= spect
##.PULSE SEQUENCE= zg30
##.SOLVENT NAME= CDCl3
##.SHIFT REFERENCE= (INTERNAL, CDCl3, 0, 15.7039)
##AUDIT TRAIL= $$ (NUMBER, WHEN, WHO, WHERE, WHAT)
$$ ##TITLE= Audit trail, XWIN-NMR		Version 3.5
$$ ##JCAMPDX= 5.01
$$ ##ORIGIN= Bruker BioSpin GmbH
$$ ##OWNER= she
$$ F:/spectra/data/she/nmr/H-F/1/audita.txt
$$ ##AUDIT TRAIL=  $$ (NUMBER, WHEN, WHO, WHERE, WHAT)
(   1,<2024-06-28 15:48:45.98 +0400>,<she>,<DPX200>,
      <created by zg, POWCHK disabled, PULCHK disabled
       configuration hash MD5:
       00 E9 B6 7A A2 85 ED C7 34 08 36 98 17 FE 4E 26
       data hash MD5: 16K
       26 BF C0 3B 71 EF A3 1F BE C1 BC 45 60 1B 82 A9>)
$$ ##END=
$$ 
$$ hash MD5
$$ 4E 44 EF 47 FF C9 F6 57 18 75 19 FA 0F E4 BF 62
##$RELAX= 
##$RELAX= 
##$RELAX= 
##$RELAX= 
##$RELAX= 
##$RELAX= 
$$ Bruker specific parameters
$$ --------------------------
##$DU= <F:/spectra>
##$EXPNO= 1
##$NAME= <H-F>
##$PROCNO= 1
##$TYPE= <nmr>
##$USER= <she>
##$AMP= (0..31)
100 100 100 100 100 100 100 100 100 100 100 100 100 100 100 100 100 100 
100 100 100 100 100 100 100 100 100 100 100 100 100 100 
##$AQSEQ= 0
##$AQ_mod= 1
##$AUNM= <au_zg>
##$AUTOPOS= <>
##$BF1= 200.13
##$BF2= 200.13
##$BF3= 200.13
##$BF4= 200.13
##$BF5= 200.13
##$BF6= 200.13
##$BF7= 200.13
##$BF8= 200.13
##$BYTORDA= 1
##$CFDGTYP= 0
##$CFRGTYP= 5
##$CHEMSTR= <none>
##$CNST= (0..31)
1 1 145 1 1 1 1 1 1 1 1 1 1 1 1 1 1 1 1 1 1 1 1 1 1 1 1 1 1 1 1 1 
##$CPDPRG= <>
##$CPDPRG1= <>
##$CPDPRG2= <>
##$CPDPRG3= <>
##$CPDPRG4= <mlev>
##$CPDPRG5= <mlev>
##$CPDPRG6= <mlev>
##$CPDPRG7= <mlev>
##$CPDPRG8= <mlev>
##$CPDPRGB= <>
##$CPDPRGT= <>
##$D= (0..31)
0 1.2 0 0 0 0 0 0 0 0.06 0 0.03 0 0 0 0 0.0002 0 0 0 0 0 0 0 0 0 0 0 0 
0 0 0 
##$DATE= 1719575325
##$DBL= (0..7)
120 120 120 120 120 120 120 120 
##$DBP= (0..7)
150 150 150 150 150 150 150 150 
##$DBP07= 0
##$DBPNAM0= <>
##$DBPNAM1= <>
##$DBPNAM2= <>
##$DBPNAM3= <>
##$DBPNAM4= <>
##$DBPNAM5= <>
##$DBPNAM6= <>
##$DBPNAM7= <>
##$DBPOAL= (0..7)
0.5 0.5 0.5 0.5 0.5 0.5 0.5 0.5 
##$DBPOFFS= (0..7)
0 0 0 0 0 0 0 0 
##$DE= 6
##$DECBNUC= <off>
##$DECIM= 32
##$DECNUC= <off>
##$DECSTAT= 4
##$DIGMOD= 1
##$DIGTYP= 9
##$DL= (0..7)
0 120 120 120 120 120 120 120 
##$DP= (0..7)
150 150 150 150 150 150 150 150 
##$DP07= 0
##$DPNAME0= <>
##$DPNAME1= <>
##$DPNAME2= <>
##$DPNAME3= <>
##$DPNAME4= <>
##$DPNAME5= <>
##$DPNAME6= <>
##$DPNAME7= <>
##$DPOAL= (0..7)
0.5 0.5 0.5 0.5 0.5 0.5 0.5 0.5 
##$DPOFFS= (0..7)
0 0 0 0 0 0 0 0 
##$DQDMODE= 0
##$DR= 18
##$DS= 0
##$DSLIST= <SSSSSSSSSSSSSSS>
$$ [...]
##$SUBNAM2= <"">
##$SUBNAM3= <"">
##$SUBNAM4= <"">
##$SUBNAM5= <"">
##$SUBNAM6= <"">
##$SUBNAM7= <"">
##$SUBNAM8= <"">
##$SUBNAM9= <"">
##$SW= 18.0517328524113
##$SWIBOX= (0..15)
0 0 2 0 0 0 0 0 0 0 0 0 0 0 0 0 
##$SW_h= 3612.71676300578
##$TD= 16384
##$TD0= 1
##$TE= 0
##$TE2= 300
##$TE3= 300
##$TEG= 300
##$TL= (0..7)
0 120 120 120 120 120 120 120 
##$TP= (0..7)
150 150 150 150 150 150 150 150 
##$TP07= 0
##$TPNAME0= <>
##$TPNAME1= <>
##$TPNAME2= <>
##$TPNAME3= <>
##$TPNAME4= <>
##$TPNAME5= <>
##$TPNAME6= <>
##$TPNAME7= <>
##$TPOAL= (0..7)
0.5 0.5 0.5 0.5 0.5 0.5 0.5 0.5 
##$TPOFFS= (0..7)
0 0 0 0 0 0 0 0 
##$TUNHIN= 0
##$TUNHOUT= 0
##$TUNXOUT= 0
##$USERA1= <user>
##$USERA2= <user>
##$USERA3= <user>
##$USERA4= <user>
##$USERA5= <user>
##$V9= 5
##$VALIST= <valist>
##$VCLIST= <CCCCCCCCCCCCCCC>
##$VD= 0
##$VDLIST= <DDDDDDDDDDDDDDD>
##$VPLIST= <PPPPPPPPPPPPPPP>
##$VTLIST= <TTTTTTTTTTTTTTT>
##$WBST= 1024
##$WBSW= 4
##$XGAIN= (0..3)
0 0 0 0 
##$XL= 0
##$YL= 0
##$YMAX_a= 114902
##$YMIN_a= -166879
##$ZGOPTNS= <>
##$ZL1= 120
##$ZL2= 120
##$ZL3= 120
##$ZL4= 120
##$ABSF1= 10
##$ABSF2= 0
##$ABSG= 5
##$ABSL= 3
##$ALPHA= 0
##$AQORDER= 0
##$ASSFAC= 0
##$ASSFACI= 0
##$ASSFACX= 0
##$ASSWID= 0
##$AUNMP= <proc_1d>
##$AZFE= 0.1
##$AZFW= 0.1
##$BCFW= 1
##$BC_mod= 2
##$BYTORDP= 1
##$COROFFS= 0
##$CY= 11.3945322036743
##$DATMOD= 1
##$DC= 2
##$DFILT= <>
##$DTYPP= 0
##$F1P= 15.6554695791079
##$F2P= 12.8336369535428
##$FCOR= 0.5
##$FTSIZE= 0
##$FT_mod= 4
##$GAMMA= 1
##$GB= 0.15
##$INTBC= 1
##$INTSCL= 1
##$ISEN= 128
##$LB= 0.24
##$LEV0= 0
##$LPBIN= 0
##$MAXI= 10000
##$MC2= 0
##$MEAN= 0
##$ME_mod= 0
##$MI= 1.114404
##$NCOEF= 0
##$NC_proc= 0
##$NLEV= 6
##$NOISF1= 3.799351
##$NOISF2= 2.8
##$NSP= 1
##$NTH_PI= 0
##$NZP= 0
##$OFFSET= 15.70392
##$PC= 1
##$PHC0= -25330.68
##$PHC1= 29.98748
##$PH_mod= 1
##$PKNL= yes
##$PPARMOD= 0
##$PSCAL= 0
##$PSIGN= 0
##$REVERSE= no
##$SF= 200.130013532006
##$SI= 16384
##$SIGF1= 3
##$SIGF2= 2
##$SINO= 400
##$SIOLD= 16384
##$SREGLST= <1H.CDCl3>
##$SSB= 0
##$STSI= 0
##$STSR= 0
##$SW_p= 3612.71676300578
##$SYMM= 0
##$S_DEV= 0
##$TDeff= 0
##$TDoff= 0
##$TI= <>
##$TILT= no
##$TM1= 0
##$TM2= 0
##$TOPLEV= 0
##$USERP1= <user>
##$USERP2= <user>
##$USERP3= <user>
##$USERP4= <user>
##$USERP5= <user>
##$WDW= 1
##$XDIM= 8192
##$YMAX_p= 0
##$YMIN_p= 0
$$ End of Bruker specific parameters
$$ ---------------------------------
##NTUPLES= NMR FID
##VAR_NAME=  TIME,          FID/REAL,        FID/IMAG
##SYMBOL=    X,             R,               I
##VAR_TYPE=  INDEPENDENT,   DEPENDENT,       DEPENDENT
##VAR_FORM=  AFFN,          ASDF,            ASDF
##VAR_DIM=   8192,          8192,            8192
##UNITS=     SECONDS,       ARBITRARY UNITS, ARBITRARY UNITS
##FACTOR=    0.0002768,     1,               1
##FIRST=     0,             0,               0
##LAST=      2.2672688,     0,               0
##MIN=       0,             -166879,         0
##MAX=       2.2672688,     114902,          0
$$ Real data points
##PAGE= N=1
##DATA TABLE= (X++(R..R)), XYDATA
0 0 0 0 0 0 0 0 0 0 0 0 0 0 0 0 0 -1 8 -8 8 -8 8 -13 16 -16 18 -24 24 -32 34 -40 46 -53 60 -68 76 -85 94 -107
38 -107 118 -132 146 -162 181 -200 221 -244 270 -296 328 -360 397 -436 482 -531 589 -652 725
57 725 -809 907 -1023 1164 -1341 1565 -1864 2279 -2904 3940 -5978 11501 -59439 -166879 -31477
72 -31477 95131 114902 70711 37867 6940 12444 25625 21116 7773 -9668 -55187 -65438
84 -65438 -12888 18912 -14983 -37288 -26928 -9601 21850 45757 7674 -32997 -491 46252
96 46252 27322 -11732 -15264 8554 28760 14499 -27207 -28163 13335 11674 -25775 -12493 21984
109 21984 847 -30517 -9626 22713 22098 -1191 -24085 -15758 26085 35752 -8356 -30028 -4986
122 -4986 10020 5175 4714 -6429 -18465 125 16507 2051 947 20281 8492 -20299 -13686
135 -13686 6587 3492 -12692 -24900 -16574 19217 31337 -9877 -30461 8941 33747 10759
147 10759 -1968 6718 2729 -6508 -5493 -5162 -2496 1294 -15016 -28144 -4752 18020 7064 -4493
161 -4493 1371 3587 6871 13916 637 -12966 6714 22530 -300 -17472 -959 9876 -1252
174 -1252 -12757 -14408 -3812 8505 -2399 -17616 3339 27532 7647 -16007 703 19076
186 19076 6999 -7943 -8722 -4148 4358 4639 -9781 -10940 6251 9024 -2146 -2274 1506 -273
200 -273 3215 3832 -7788 -4746 13249 7820 -13289 -5965 16128 12204 -7852 -15462 -6883 5001
214 5001 2125 -13323 -9777 14813 15596 -7241 -5598 15846 11756 -7518 -8805 -424 1033 -1630
228 -1630 -6822 -8586 600 7807 1620 -2107 2329 782 -1111 3845 1028 -7008 1132 9873 -2833
243 -2833 -11780 2344 12224 1903 -9555 -7638 1584 6544 -1978 -10553 394 12754 2100 -8504
257 -8504 4206 14914 3107 -8805 -6499 -951 1085 -1519 -7465 -5767 4331 5051 -2699 -1096
271 -1096 6359 5930 2410 1273 -1755 385 5179 -847 -10619 -4348 6112 961 -8738 -4777 4491
286 4491 6501 1315 -4175 -971 7498 4619 -6141 -3956 6912 6029 -3315 -4605 -261 1418 299
301 299 -2272 -5939 -2048 3824 1567 -3650 -1158 4450 4840 861 -2824 -1265 5207 4244 -5465 -6041
317 -6041 4006 5703 -4680 -8041 434 4924 243 -4854 -2220 4324 4957 -1920 -2785 3954 6335
332 6335 -753 -4729 -1491 1565 555 -947 -3337 -3194 293 2815 -65 -1905 1118 4497 2943
347 2943 -1872 -2621 2608 4743 -2086 -7295 -2015 3951 -225 -6526 -3061 4941 4732 -1674 -2275 3741
363 3741 6304 1399 -2563 -60 2400 -405 -3677 -3466 -1440 -304 -736 -905 -273 1089 2745 2777 -455
380 -455 -2227 887 2998 -1441 -5109 -579 5195 2015 -3456 -1016 4658 3780 -3519 -5754 409 4295
396 4295 -1815 -6661 109 7244 3186 -2919 47 4259 2227 -2735 -4508 -2531 455 -785 -3959
411 -3959 -2599 2262 3391 1532 971 1785 2029 3486 1264 -2960 -1528 3409 476 -5254 -3454 1274
427 1274 137 -2781 -3321 -1147 1819 1627 -1570 -1172 4149 4451 11 188 2591 1283 -234 -521 -2807
444 -2807 -3451 -5 -294 -4257 -2259 2762 2971 -126 -817 1144 2941 2912 -2447 -4401 2571 4124 -3520
461 -3520 -4528 3289 3922 -1590 -2410 147 1416 1021 -1902 -3221 648 3031 -742 -2154 2473 2216
477 2216 -1081 904 2005 -1732 -1079 1984 -634 -3538 -155 1799 -214 -442 338 554 2642 1252
493 1252 -3988 -2466 3569 348 -6190 -1418 4671 691 -2158 1221 3140 1749 595 -1962 -1424
508 -1424 2993 964 -4913 -1534 3786 176 -2811 1045 711 -2362 268 1396 -2084 -964 3055
523 3055 754 -1763 573 1193 77 611 -1236 -3438 1532 2769 -4026 -4117 3490 2740 -3761 -975
539 -975 4311 1914 -352 -59 -454 708 2048 -2374 -3107 2467 1718 -4193 -1781 2899 -351 -2293
555 -2293 1339 507 -2209 1793 3060 -1029 -864 1868 -585 -1011 1124 -1258 -1788 2719 1321 -3317
571 -3317 382 4075 -1882 -4085 1387 1713 -1850 18 467 -910 2162 3247 -1579 -1571 1856 -562
587 -562 -2316 1667 1262 -2881 34 2136 -1958 -932 3913 592 -3699 421 2383 -1341 -1157 60
603 60 -1066 487 1582 -1572 -1086 4051 1521 -4304 16 3276 -2375 -3896 1791 1639 -1356 549
619 549 1050 -199 1743 1289 -2281 -608 1888 -2203 -2651 2919 1266 -3740 810 4025 -1233 -2116
635 -2116 1866 811 -1937 -293 93 -767 579 -705 -2620 1625 4845 -1694 -3506 3066 2917 -3364
651 -3364 -1497 1509 -1733 -2334 662 484 827 1982 -765 -2010 2634 2179 -3804 -1620 2361 -1206
667 -1206 -2661 2829 2458 -2309 -142 2111 -567 -435 1028 -1305 -1394 1160 -846 -1479 2702 1820 -2975
684 -2975 81 3576 -530 -2602 1650 792 -3055 -754 739 -1269 193 1965 41 -123 2095 -1036
700 -1036 -2226 2111 1344 -3635 -863 3176 -583 -1598 2170 1353 -2170 -560 614 -899 24 269
716 269 -2049 -140 3566 -554 -2509 2053 2272 -2078 77 2615 -999 -2569 519 655 -788 448
732 448 -227 -2090 871 2335 -483 -258 1783 -977 -2889 1510 1481 -2069 -577 2093 -577 -754 2108
749 2108 347 -1518 477 593 -1228 327 294 -1733 -310 2115 -847 -1958 2065 1305 -2215 156
765 156 2428 -944 -1794 718 87 -659 595 441 -536 1387 1296 -1432 317 1570 -1777 -2469 1452
782 1452 1192 -2750 -400 2363 673 -265 963 -132 -245 762 -676 -1311 1512 851 -2499 -645
798 -645 2208 -533 -2310 859 1386 -1273 -336 972 -449 -155 463 -95 115 1469 -955 -1338 1912
815 1912 1290 -2147 -837 1759 -857 -2245 425 1496 -567 -328 462 335 1328 979 -1520 -674 1612
832 1612 -454 -1966 417 1206 -1029 -526 1093 362 -448 771 130 -880 585 346 -743 -156 562
849 562 -579 82 1212 -162 -1028 1099 896 -1294 -487 987 -166 -744 540 533 217 557 196 -260
867 -260 394 20 -1360 -821 479 -699 -1359 415 917 -730 240 1659 395 -518 327 153 -378 -132
885 -132 -429 -737 375 316 -1012 -70 1026 -274 -1207 267 457 -653 -400 580 162 -29 153 160 41
904 41 423 19 -576 341 317 -781 -591 -11 -292 -206 646 407 -421 285 890 -75 -549 134 163 -116 -609
925 -609 -471 253 693 200 -638 121 1289 -224 -1027 140 628 -118 -838 -152 459 101 -162 -97 197 23
945 23 -360 -683 61 -79 -404 -66 414 316 -131 319 866 -5 -494 -424 225 -387 -1159 -425 468 149 -550
966 -550 -14 1107 657 -3 -242 554 814 -513 -1016 41 620 -274 -560 560 751 -58 -222 -157 229
985 229 109 -249 -597 -211 377 37 -131 439 513 -224 -222 -227 -525 -226 323 84 -429 99 492 -155 191 450
1007 450 -195 -69 189 -107 -129 158 296 -733 -320 332 39 -180 635 259 -238 338 136 -370 -198 521
1027 521 -337 -224 317 -270 -212 427 123 -619 351 696 -821 -680 835 527 -621 19 338 104 207
1046 207 33 -730 -49 336 -837 -896 632 417 -552 -183 730 -229 143 671 -21 -665 483 67 -718
1065 -718 57 196 -315 -314 275 -447 40 1138 255 -1128 632 737 -612 -625 724 289 -668 345 223
1084 223 -178 377 64 -535 -52 595 -532 -727 826 257 -752 381 862 -310 -162 854 -290 -453
1102 -453 252 -27 -541 226 -2 -593 246 1016 -610 -520 1046 229 -1165 182 811 -687 -319 463 -73
1121 -73 -238 802 -91 -296 680 591 -1220 -228 1124 -702 -777 702 129 -512 307 552 -596 -228 567
1140 567 -874 -625 840 -299 -661 636 551 -966 313 1100 -535 -914 777 -209 -917 525 316
1157 316 -901 71 855 -328 -586 1095 219 -671 686 428 -1035 258 435 -760 -106 1129 -211
1174 -211 -724 852 692 -1142 -143 378 -644 19 516 -573 -452 1131 339 -795 605 1149 -920
1191 -920 -813 678 -194 -1007 368 143 -852 250 626 -761 -119 912 -512 -918 961 160 -1271
1208 -1271 329 1176 -702 -472 887 -2 -540 388 -209 -953 47 53 -872 -127 1123 -342 -758 1407
1226 1407 698 -1085 184 693 -1117 -679 1008 -325 -764 789 363 -724 417 342 -904 -175 657
1243 657 -965 -1014 1158 110 -1153 441 744 -329 -281 999 -302 -498 360 -418 -674 536 373 -970
1261 -970 211 1006 -560 -702 1261 341 -905 450 775 -557 -281 873 -538 -375 598 -415 -935
1278 -935 606 249 -1198 271 722 -730 -464 797 262 -785 385 605 -783 552 398 -919 -342
1295 -342 988 -484 -815 678 733 -864 17 1146 -199 -719 554 -328 -365 863 406 -845 85 902
1313 902 -695 -244 543 40 -477 354 421 -653 20 582 -583 -120 987 -331 -1102 822 687 -955
1331 -955 108 539 -466 -498 575 -389 -341 818 137 -821 426 925 -495 -201 857 -192 -669 269
1349 269 231 -556 7 345 -396 166 897 -681 -638 873 137 -842 193 726 -406 -299 437 -145 7
1368 7 515 -5 -441 453 349 -721 51 592 -269 -934 742 426 -640 313 589 -333 -152 492 5 -508
1388 -508 583 110 -567 622 241 -534 -19 581 -356 -509 478 249 -560 175 418 -214 157 12 -210
1407 -210 -145 544 -416 -507 489 323 -524 -14 486 -12 141 602 341 -258 468 213 -376 -376 126 -603 -308
1428 -308 491 291 -297 661 173 -488 45 473 -362 -358 416 261 -589 270 144 -132 240 425 -406 -177 208
1449 208 -132 -299 91 149 -586 -94 253 82 111 402 -174 -388 290 140 -826 -57 -51 -302 25 695 40
1470 40 -236 435 171 -753 -191 52 -172 -302 282 197 16 360 91 -200 -22 385 -428 96 356 -83 -71
1491 -71 303 -27 -253 114 96 -232 -340 42 191 -323 28 27 -110 160 258 -9 210 297 44 -466 120 57
1513 57 -189 -400 6 -104 -218 -212 -235 292 299 22 73 238 195 -154 -34 -20 -5 -105 164 72 -56 102 254 339
1537 339 -19 -47 293 142 -70 -181 22 312 11 -170 -57 41 37 -255 -108 -47 -50 40 -351 146 24 224 -15
1560 -15 62 -118 33 268 -36 66 78 -288 136 -151 234 202 268 -256 -574 -71 135 -185 -129 -57 195 91
1582 91 -104 411 148 163 149 -109 -214 363 58 -438 -39 82 -137 -89 100 -14 -56 82 38 -74 359 79
1604 79 -444 -172 -76 71 181 102 -52 49 313 243 -152 -77 145 127 -203 -181 -69 76 399 -146 -211 191 563
1627 563 -218 -470 167 48 -440 -219 357 178 130 303 -285 -159 332 54 -548 -170 -11 -140 -98 -67 58
1648 58 -399 449 71 -235 362 461 -355 -125 273 -166 41 73 -279 -353 441 407 -468 -254 61 -184 -226 91
1670 91 205 -236 402 88 -480 22 429 -448 -314 216 -196 -59 52 3 -235 393 616 -453 -121 663
1690 663 168 -852 -342 152 -76 -365 -120 -359 24 148 -174 -629 436 550 -628 64 347 -314 -77
1709 -77 248 -139 -194 515 377 -600 -103 590 -227 103 125 -81 208 397 221 -486 360 941 -260 -276 426
1730 426 -209 -246 -28 -225 -239 78 228 -668 -252 499 -81 -374 152 224 -21 400 -23 -355 -261 710 -386
1751 -386 -609 205 143 -293 39 499 55 429 496 -333 -131 752 332 -489 80 510 -568 -283 104 -151
1771 -151 -119 213 -285 -678 487 895 -478 -258 434 120 -197 22 -178 -397 119 127 -552 -2 630 -161
1791 -161 -398 189 321 -338 536 67 -211 309 612 -448 -393 497 401 -516 78 101 -196 271 310 -235 -145
1812 -145 898 9 -632 335 543 -77 -65 189 -323 261 192 -630 -859 464 456 -517 -319 644 381 -52 200
1833 200 -255 -263 643 33 -685 190 802 -518 -577 310 310 -179 113 87 -359 273 736 -295 -279 478 136 -195
1855 -195 78 206 -545 208 128 -800 -104 609 31 -281 464 438 -55 16 341 -188 158 662 -397 -555 235
1876 235 291 -631 -183 634 61 -52 82 147 -183 795 -58 -766 254 153 -192 -208 -103 33 162 346 -343
1897 -343 -509 324 396 -802 -307 473 193 52 -22 173 26 257 -93 -483 -342 609 -134 -620 -152 308
1917 308 35 109 240 -100 427 235 -446 -325 582 163 -513 -72 298 -40 -87 172 -340 11 747 -127 -648
1938 -648 323 427 -79 -66 171 145 80 223 -394 -353 290 363 -492 -524 506 -107 -391 -68 104 161 374 231
1960 231 -538 49 630 -415 -464 195 189 -188 -8 48 -321 175 161 -439 -104 445 207 -260 -87 73 237
1981 237 -92 155 -158 -79 302 103 -477 72 390 -109 -391 175 -96 124 11 -203 -188 235 509 -488 -474
2002 -474 425 248 -150 -138 -258 -17 420 -337 -220 242 318 -137 -529 316 188 -13 -24 -510 -439 136 173 -634
2024 -634 -376 348 -30 -313 -128 78 188 162 -60 -405 358 348 25 -161 304 49 -242 -26 46 142 356
2045 356 236 -245 79 351 7 -122 -55 91 -179 -154 -325 -177 200 404 -200 -223 6 311 40 64 5 153
2067 153 82 108 -638 -135 302 208 -357 -396 353 -130 -139 -108 331 19 142 -240 -16 203 601 -86 -259 85
2089 85 332 -207 -39 -23 -103 -309 -170 -284 95 363 174 -306 128 105 247 268 -110 -37 268 150 -97 -235
2111 -235 255 438 -356 -98 -250 -53 17 -51 20 -293 348 196 -5 32 34 33 -48 -22 213 43 -187 -168 -140 27
2135 27 8 -92 29 -150 372 189 -195 -37 -117 254 -249 -357 201 51 166 91 -181 297 386 -55 -99 8
2157 8 69 35 -196 -146 204 291 -64 -276 -2 154 212 -166 -164 337 422 -90 117 10 161 231 -297 -100 -289 -25
2181 -25 -1 3 -91 -198 -160 20 35 -131 229 -133 -226 51 -120 198 -15 -54 -125 202 -80 -72 -86 -253 493 136
2205 136 -285 328 159 -13 -35 -62 27 132 56 -213 -74 129 74 -305 -344 18 139 49 -34 -261 76 190 -243
2228 -243 -126 111 561 -84 -338 288 147 -90 -210 -151 -294 242 6 -80 171 46 35 -168 144 40 126
2249 126 173 177 -102 107 362 -85 -107 45 494 -26 -57 42 60 95 176 -180 -24 273 -53 -226 -180 129 -142
2272 -142 238 220 -2 -218 160 -51 -49 308 241 -191 -213 192 -65 -38 -15 -208 -177 -35 -169 -260 -366 -15 -2
2295 -2 176 -100 -23 -125 -119 -146 -226 112 -122 -34 -424 263 352 -65 133 75 20 -15 -17 -117 -200 229 -87 21 82
2320 82 94 32 17 -7 -321 -53 27 -72 -26 73 299 12 -30 94 32 273 137 -251 -47 400 -23 -173 -79 208
2344 208 -115 198 201 153 -173 80 144 -326 132 317 -70 -71 134 108 -36 -131 264 -373 -200 -77 152 55 19
2367 19 56 -93 75 -36 -66 -77 25 -242 -96 -66 196 -145 152 83 -235 -11 -43 -209 0 386 269 -122
2389 -122 197 -59 -154 -115 170 0 185 -144 -31 -137 130 166 -80 227 -30 -328 -261 -43 12 -1 127 179
2411 179 26 -241 24 -23 -1 6 -226 -261 301 268 -278 113 312 -82 -111 290 -98 -277 57 -70 17 132 102
2434 102 45 -135 239 -340 85 358 119 -23 158 227 267 -124 134 -68 -66 400 -192 -354 331 -88 58 244
2456 244 72 -94 -87 -7 -87 40 100 48 -266 14 154 -154 -36 205 -155 -63 27 -14 -374 181 -98 26 -369
2479 -369 98 -128 88 266 306 -204 128 -96 -206 51 381 -23 -271 156 188 42 -169 -54 2 -319 92
2500 92 -435 -408 118 -288 -201 -114 15 -135 -70 138 228 -209 348 -126 -359 62 -8 -213 -100 -58 -25 -238 145
2523 145 101 -341 283 331 116 12 314 97 -338 209 214 78 -251 165 15 -4 80 85 -222 4 159 -262 152
2546 152 -94 -16 -113 219 -22 -39 461 181 -176 39 67 -147 -24 -37 -155 -67 369 -48 -47 326 1 -72 113
2569 113 111 30 -182 -1 -113 -11 62 168 145 -4 359 -84 96 -31 71 -108 15 99 19 84 -89 -202 -194
2592 -194 249 63 73 -167 -299 -137 -247 55 -94 -75 157 236 -170 -49 130 -23 -95 -67 42 -21 23 125
2614 125 152 268 196 -117 172 310 -102 -238 -136 347 28 240 144 -62 -143 158 -106 -84 48 65 -63 190
2636 190 180 245 -129 133 96 -215 29 -116 -482 95 124 -192 -1 -226 116 111 -10 277 14 148 253 -14
2658 -14 59 -179 -251 86 225 36 -99 264 195 150 120 -185 253 97 -88 45 118 128 203 -186 -168 -138 -46 -124
2682 -124 52 71 24 27 -276 85 -22 267 -106 231 161 -57 239 58 174 196 -430 -99 46 -52 -187 179
2704 179 66 -59 62 -268 24 233 -132 -92 -98 -45 109 -59 141 228 -88 41 -39 -10 161 58 -19 70 -179
2727 -179 265 114 -33 -26 -81 -164 82 -218 -157 224 -124 5 -240 -164 -161 383 -37 -45 113 -33 -127 73 29 51
2751 51 -130 -32 138 41 171 131 92 58 -104 35 59 -126 190 139 -67 78 -259 100 43 96 -126 34 186
2774 186 -90 -93 -17 75 282 -17 246 177 -15 75 55 167 -90 240 -42 -1 -31 -348 -147 169 242 110 -114
2797 -114 -152 53 55 -295 168 -40 -149 77 -141 -43 -195 193 327 12 -102 -144 145 265 -12 191 415 159
2819 159 38 -75 -5 20 -99 53 88 -99 -153 168 -136 115 -81 -134 181 -296 -277 -165 153 103 -133 15
2841 15 79 153 -119 -209 -120 -293 -254 92 -79 55 -15 -83 239 -146 -46 205 -117 -57 -192 -87 -36 184 215 168
2865 168 66 301 74 -124 46 149 -36 18 -105 293 -105 119 -105 -97 -52 116 -204 -137 18 96 72 -36
2887 -36 288 31 -159 -25 -64 34 102 139 -225 -80 201 121 -194 -95 -194 -144 150 -46 52 -91 70 -142 93
2910 93 286 -208 -5 163 118 -190 152 246 116 12 -32 94 -260 -278 -94 202 128 -50 -265 159 -102 101
2932 101 54 -454 -97 165 5 -235 45 -243 66 154 -153 212 163 51 -224 79 -67 166 374 42 113
2953 113 85 -11 66 6 44 38 -163 -23 -139 213 -21 -105 -176 31 -35 -29 41 38 -38 -153 353 -30 -212 122 87 -96
2979 -96 41 210 -181 101 -306 -21 -10 52 225 -172 -13 96 11 -209 102 89 96 -5 207 -174 20 -46 -193
3002 -193 -148 71 101 59 194 155 -28 327 192 -251 -138 -8 33 5 -37 -40 -6 34 106 -62 -62 138 -66 -272 178
3027 178 47 86 122 181 81 -123 94 142 34 62 -116 -30 286 -83 -89 -251 -15 24 -101 226 -161 -239 -45
3050 -45 162 -131 -94 1 -187 40 -117 -4 -357 90 18 -284 -21 -80 65 5 -149 -28 -79 -50 235 -31 -56
3073 -56 260 -165 -70 8 213 -139 15 160 -77 165 45 -1 -194 -113 102 -216 46 151 -283 -112 197 -180
3095 -180 -132 -84 84 -355 60 93 256 91 55 252 32 33 -21 -428 5 -105 7 -84 30 109 213 -76 56
3118 56 -227 188 244 58 -73 -93 27 -118 95 -89 -282 -95 1 123 70 173 176 149 178 -117 221 80 97
3141 97 -394 49 -17 -134 -154 227 -105 -258 65 -284 -105 73 3 111 -140 192 57 9 173 381 -182 -55
3163 -55 25 68 -167 59 73 -1 -146 248 135 15 338 -18 29 -79 -35 -298 75 248 -199 114 11 -5 -71
3186 -71 65 104 56 15 -185 234 -134 79 217 -289 217 303 -124 -39 -133 159 -175 -288 -243 121 69 134 -37
3209 -37 207 134 6 -15 75 -114 -172 239 72 97 9 46 -378 -149 25 -217 -27 -182 -15 85 -78 3 60
3232 60 -81 72 15 129 -19 -10 -2 133 -46 -328 145 235 -132 60 58 -155 -142 17 89 81 271 235 -88 -43 -72
3257 -72 22 -109 -6 67 -228 213 -27 7 -135 -223 163 119 -10 -101 39 -195 -166 83 69 -35 -87 -91 -22 165
3281 165 21 57 -126 68 -324 59 220 -101 99 -117 -199 103 -36 68 -164 61 -7 198 219 23 -14 -80
3303 -80 62 -152 193 39 99 -83 -52 -278 91 171 -117 40 2 -14 -195 122 -197 -209 -140 21 15 -100 105
3326 105 -25 18 88 -59 216 -171 334 272 227 6 -135 299 -58 -304 126 147 19 129 -139 -123 227 28
3348 28 -348 58 10 32 -14 52 -78 -24 -341 32 104 159 156 -177 -389 -64 -36 -34 -130 -43 112 185 225 24 65 -9
3374 -9 31 -117 -54 0 80 -10 -72 116 18 -88 -151 -105 -80 -13 -82 -226 167 192 -54 -24 -3 -265 221 12 91 49
3400 49 47 -173 93 167 -189 -165 55 132 -311 26 115 -48 48 12 282 -227 21 -164 230 -52 67 33 -245
3423 -245 -112 49 19 -153 -80 226 125 -1 -177 132 -240 -33 -10 83 196 -129 58 -129 9 -17 -99 140
3445 140 303 187 -205 -122 -294 47 -60 -242 163 -75 112 270 -1 141 -114 1 -104 -47 272 218 -175
3466 -175 -231 271 -82 19 -45 -240 191 53 25 39 -35 126 57 182 281 49 -181 -152 47 10 38 -127 -163 123
3490 123 139 -124 59 76 281 126 -150 -110 76 88 190 4 69 -24 234 92 -412 20 -25 -147 -5 287
3512 287 -146 -122 44 -49 175 121 254 -84 11 5 -70 -138 249 106 -23 -27 -155 51 151 195 -112 202 32 134
3536 134 243 156 -118 -56 -74 184 -85 291 131 -25 -17 -47 -1 -216 115 -85 25 -6 124 -4 -15 8 -9 -25
3560 -25 319 174 -114 97 76 -57 -36 315 -122 -32 121 151 -120 28 104 32 -42 -9 251 44 83 -81 32
3583 32 20 229 -216 15 -8 240 7 124 182 -176 -113 -106 -121 -179 -91 80 106 -29 -89 108 -102 -195 -101 132 36
3608 36 -100 -152 296 185 25 108 136 -167 -128 183 -211 -75 81 72 88 47 200 158 18 74 -201 12 371 124
3632 124 -196 -21 73 -60 -11 -21 107 34 455 -2 27 59 44 6 -56 128 -73 -238 86 154 -103 -53 50 33
3656 33 5 -330 29 88 -68 81 19 39 -283 247 170 153 -97 96 265 -11 1 -85 -143 -24 10 -239 36 -88
3680 -88 159 -141 46 116 -113 -83 -245 -14 113 209 130 -32 -91 -68 -138 -240 95 -68 -328 105 -96 188 90
3703 90 51 70 -106 0 324 -93 -154 270 -84 -173 140 -108 -121 -64 -60 -36 212 76 132 -83 -67 615 -57 69
3727 69 -82 -65 -33 407 -57 -2 -247 -144 -91 174 -7 -186 -57 148 -113 88 182 123 4 -116 212 34
3749 34 20 317 25 -80 22 123 -23 1 -15 99 -47 67 -154 25 243 392 163 -334 315 -109 147
3770 147 -7 31 14 19 88 -194 -118 12 -178 -132 408 -122 6 -89 50 -80 104 165 -185 -174 44 -146 -160 296
3794 296 93 -122 40 -17 -41 19 -237 58 139 -120 -44 69 151 215 57 60 -77 19 -22 -81 3 -55 -219 241 23
3819 23 178 -60 106 -84 24 82 53 -103 193 48 232 27 108 -297 335 54 -114 154 -39 -21 207 143
3841 143 149 67 107 -197 123 4 -158 270 55 -54 29 -173 243 -353 -22 190 1 39 185 167 190 -112 5
3864 5 30 76 -216 62 37 41 -133 108 -99 -86 -32 51 50 -81 18 -52 162 27 -272 -9 170 156 47 -277 -16
3889 -16 -123 300 173 -61 129 107 -19 -30 156 15 -96 -304 -288 -6 280 84 -32 -96 399 167 -43 -152
3911 -152 -213 -2 100 -108 -30 58 -133 62 -174 54 108 -141 -65 216 -46 -68 -277 -66 240 -53 200 -192
3933 -192 -53 121 106 0 -38 135 -34 -2 -180 105 -151 338 -94 31 -102 -226 -127 -173 -149 288 -63 -107
3955 -107 -251 27 30 47 -172 72 -31 -405 238 126 36 204 113 89 -23 142 -6 108 99 -64 -67 -204 -184 -181
3979 -181 -384 152 40 -83 -99 -241 -75 45 -18 98 -294 -22 177 -239 148 208 83 -81 -28 -182 90
4000 90 -85 -73 -65 346 33 -213 229 179 16 -370 -103 -38 -307 -210 75 116 27 -309 42 84 -141 -69 46 -42
4024 -42 -36 -83 -84 -96 -18 175 -54 203 -134 243 -91 163 -45 339 -106 -212 90 21 10 45 -64 -90 -109 0
4048 0 36 116 25 186 59 -29 154 8 -35 61 175 -123 41 160 -2 -75 32 -142 -142 171 -25 -6 -160 -44
4072 -44 -144 -76 -85 -25 -212 154 -42 77 -2 -88 35 -15 198 301 42 31 133 54 -129 42 -136 -11 0 180
4096 180 -124 -13 -170 -18 35 24 111 6 175 -127 -169 109 50 -40 -327 -4 16 36 -19 21 -278 237 -78
4119 -78 -46 186 13 3 -235 -270 -159 32 278 156 13 -124 144 -51 -229 298 77 -41 108 -41 128
4140 128 53 -115 -251 148 -40 -208 -212 11 -15 103 -36 -34 95 -86 236 56 206 119 253 141 231 263 69
4163 69 -165 98 -86 -70 -60 36 -311 -16 -121 -90 -153 -21 107 -191 234 -261 -185 168 224 -131 281 31 -125
4186 -125 -90 93 -216 -74 89 177 -60 -87 148 29 1 272 -144 23 149 -37 -236 -3 87 -7 -58 -206
4208 -206 5 -327 -53 -47 -171 -172 92 -30 -278 149 -32 65 124 -137 -241 -192 -46 4 -115 77 291 30 114
4231 114 -179 -23 4 105 -66 -250 109 54 39 -18 39 49 83 145 56 -153 -21 -11 204 62 262 -39 310
4254 310 209 59 -199 19 -74 -69 -263 90 -82 -167 -38 -232 -60 20 18 11 112 84 -6 -68 -73 -62 10 -12 155 -175
4280 -175 58 26 -15 226 63 -297 -172 301 -102 157 -48 40 -58 48 -11 -18 -81 -96 196 14 21 15 -120 115
4304 115 175 27 49 362 -83 -31 -97 -21 -53 38 -20 -79 -55 -198 115 224 463 -305 -152 126 212 113 250 233
4328 233 -10 143 266 51 -476 -142 178 -116 -21 -7 -67 68 229 -6 -39 62 -68 175 71 -11 -56 130
4350 130 134 178 107 359 -41 -254 -249 24 161 -115 88 -85 -66 -75 -55 -46 383 99 202 -365 -55 37 -16 41 168
4375 168 -207 50 -252 -57 -131 -304 142 -204 -6 19 0 111 10 -82 130 29 -49 129 -64 -146 25 -110
4397 -110 -45 -48 -223 25 74 -353 377 -71 129 -16 14 3 116 -496 -179 -156 -166 150 22 175 -101 -201 9
4420 9 48 109 32 39 -178 232 215 -14 -57 -52 -115 86 -151 192 30 -33 97 170 -497 -2 140 82 -210 -185 -9
4445 -9 -246 7 134 -66 -160 -259 -247 -138 -90 -243 243 148 -87 63 -189 179 -50 174 99 123 -22 -269 -18
4468 -18 178 40 11 -162 -131 136 213 -7 184 -83 -171 0 45 -328 -29 91 -30 244 34 354 -6 36
4490 36 142 -114 -1 -136 214 -153 157 246 168 -197 -215 160 324 217 -36 1 176 91 175 -170 -102 55 54
4513 54 23 -205 -68 125 108 11 -15 228 77 -44 -181 -316 -4 -24 -316 -23 191 235 262 118 -22 180 -4
4536 -4 -46 173 -43 -240 7 99 -150 -15 111 -37 15 -171 -171 -29 48 -121 -332 -68 12 191 -40 2 79 -136
4560 -136 -416 -13 192 -140 109 -30 8 -208 -49 133 -29 432 133 -172 -85 -105 286 60 -279 -196 149
4581 149 -309 138 8 -265 -71 131 -51 140 24 -15 35 -163 10 4 50 -189 -50 -5 -77 -81 30 101 146 -107
4605 -107 -13 -187 267 173 74 -3 -375 63 -101 -209 -198 -62 -12 -123 -82 66 0 -286 -118 -147 26 -213 -111
4628 -111 61 -46 -40 73 73 45 127 1 -59 141 -6 177 168 93 82 -173 -143 -8 200 -233 223 -62 205 162
4652 162 205 202 -171 -70 104 -39 74 -75 66 185 -323 -65 183 4 -36 -79 156 -155 -348 33 58 56 -391
4675 -391 241 9 32 38 -148 -93 48 -258 -164 120 -102 -113 -58 -60 -93 124 -212 69 164 241 -25 146 -241 -56
4699 -56 36 -101 -96 -151 -45 436 121 -33 -121 -52 -21 -94 68 -7 77 97 -42 -153 -1 20 -218 48 -81 -23 -231
4724 -231 -54 111 263 176 64 -24 -239 87 -152 -172 -65 73 -107 -87 -52 -137 288 -193 -126 -73 149 -12 -93
4747 -93 184 172 -389 -122 -177 129 104 62 -172 -107 30 170 -86 102 -19 -43 45 -157 -134 3 253 102 -110
4770 -110 -202 233 -85 -122 -44 182 -37 -249 210 -31 -9 -171 -344 6 92 163 398 -39 14 -107 190 -41
4792 -41 -237 63 118 -119 -141 -46 13 -110 4 33 126 255 117 182 -175 121 -159 5 161 315 -151 27 50
4815 50 171 -22 15 -331 -17 5 190 -65 -209 57 21 88 -27 -290 43 158 -1 -78 -94 -141 -13 51 141
4838 141 -23 -14 170 85 72 -214 -94 -64 -82 75 13 -48 13 -278 -169 -24 133 -137 -8 338 4 -57 -10 -149
4862 -149 -14 -95 -58 110 218 3 3 25 57 279 287 36 63 194 73 95 -22 -252 -3 148 -13 -54 74 -49
4886 -49 132 -125 84 -26 -117 60 145 -210 -141 104 -134 251 -11 -22 149 -164 -97 2 91 66 308 181 -222
4909 -222 230 98 -460 18 17 89 17 150 173 109 222 86 140 -67 -280 -41 72 -36 30 -189 79 -43 318
4932 318 -26 -319 -238 -138 -124 -237 -116 -39 21 311 106 -41 81 -100 -97 189 -237 92 5 38 -45 85 48
4955 48 213 76 -76 61 38 11 -300 -128 72 22 211 -13 50 211 -20 -27 -152 -187 -45 83 -470 -123 192
4978 192 35 54 96 53 56 -116 5 72 236 159 -201 268 197 247 196 3 121 29 194 128 56 28 -31 -156 -252
5003 -252 27 54 176 -200 -174 -74 136 -132 -125 -75 -121 -10 -158 70 187 166 -50 4 102 -39 73 40 -199
5026 -199 -191 130 19 -118 -85 -134 -75 -181 -107 260 36 -64 -11 241 -202 -81 -55 -19 207 -199 29 84 151 116
5050 116 105 -121 -99 20 36 -71 -145 97 12 -8 21 37 38 58 -43 31 73 300 -92 -23 -80 80 -93 -303 -192
5075 -192 -198 -142 -52 90 -144 76 -71 43 -5 -36 118 201 -434 -123 145 50 -168 -10 -25 -20 -67 71 -57 335
5099 335 -116 168 45 -244 168 198 120 -4 -95 -96 -55 130 37 8 -27 143 -178 -125 -406 -33 -64 47 -46 367
5123 367 -84 -107 99 -8 116 165 -189 -76 -91 245 525 102 94 -35 57 65 -114 -87 212 321 54 -56 -51 -198
5147 -198 1 -286 -126 156 117 -14 80 -50 -154 59 206 45 65 -197 -169 57 211 37 -68 161 70 229
5169 229 -65 28 -211 45 -64 88 159 -171 109 92 115 -120 2 98 -52 13 -249 -164 -351 -84 -247 -235 460
5192 460 -89 -5 77 -268 -91 179 -162 -228 85 -6 73 148 -68 -98 76 -48 122 -52 -27 125 -52 -288 -233
5215 -233 -129 -133 61 -103 37 -30 -28 -276 -62 16 234 -21 234 85 196 -100 73 -70 44 112 98 170 -122
5238 -122 19 113 -107 -158 8 -208 -117 423 -295 151 227 11 143 31 -31 -122 -19 -25 64 -41 155 -208 -11
5261 -11 -66 144 24 285 -162 75 142 70 6 -53 -164 -71 -22 -162 -133 52 -43 -60 6 -197 164 -117 -289 54
5285 54 -16 -157 -87 -157 44 -2 36 192 189 116 20 285 281 155 -272 106 23 121 140 -32 -255 121 -57 -88 259
5310 259 288 45 -412 -10 110 -255 -85 -2 131 -189 63 -385 109 78 -9 46 68 96 -249 24 -84 13 75
5333 75 -71 24 74 -245 -32 147 -72 97 -294 108 -123 -181 -169 -436 54 -82 320 -80 70 49 16 -152
5355 -152 -60 0 48 -144 156 142 208 28 134 88 -29 251 -87 175 -1 -230 142 -148 -26 254 136 217
5377 217 295 -86 -168 88 -25 183 -69 55 108 -49 19 -180 -45 -112 100 35 113 49 289 -104 284 -63 -23
5400 -23 130 145 130 97 -80 209 -193 -115 14 73 21 203 60 43 96 44 59 -31 158 309 92 57 190 -283
5424 -283 17 -9 -248 105 171 -58 -32 -78 -144 -64 -239 -344 153 -191 -22 -129 244 1 -27 -138 5 -115
5446 -115 -84 -44 -379 51 160 57 41 -8 133 67 -36 347 -63 67 -263 -32 276 226 312 -218 -357 91
5468 91 -17 100 14 -165 -69 -248 3 -60 -13 -115 209 -94 -62 51 -124 43 199 48 -188 83 -153 139
5490 139 81 -44 -107 56 53 152 -61 -55 0 155 28 83 244 -52 -174 -209 -40 172 -74 -86 -9 92 84 -282 219
5515 219 -35 74 99 -127 -53 -207 -12 -14 73 -194 214 47 -188 -140 -108 213 -168 7 -46 -26 -137 -101 159
5538 159 -31 -64 -20 -79 233 108 161 -112 -230 66 -150 -239 192 101 61 155 188 -135 -242 5 172 39 -117
5561 -117 -259 26 -143 68 9 -69 244 27 143 -36 -38 105 113 -51 9 -173 288 -26 237 132 173 161 -18
5584 -18 52 222 -120 -221 140 56 -124 -31 61 -50 -187 -125 -309 -135 -213 272 -172 12 -55 -199 165 -32 194
5607 194 -13 -207 110 188 38 33 -8 49 59 -74 -117 58 -16 182 -40 -78 11 -6 58 -99 182 97 -37 22 -36
5632 -36 83 200 120 -250 -123 258 -81 52 -6 65 -155 198 202 -74 252 -50 -81 -215 -62 -94 -104 -45 -10 185
5656 185 69 43 80 51 132 148 -20 -172 0 -105 82 -76 27 -79 -37 -97 142 -162 -208 47 -280 29 -79
5679 -79 -183 -357 -82 -23 22 -53 -213 -33 9 195 175 7 -64 96 3 -22 54 214 6 200 92 -43 -66 -100
5703 -100 180 178 65 -100 -75 -187 126 -172 66 -103 -28 -65 -106 129 -88 225 49 -184 -161 22 16 -106 -139
5726 -139 -93 85 -181 281 -271 35 73 -152 140 28 386 22 -258 181 -43 234 109 -230 241 190 109
5747 109 66 90 116 -65 82 -268 7 -150 -124 -392 -76 144 177 -74 60 5 47 -41 -77 291 236 -126 -177 24
5771 24 -9 40 55 157 76 222 -18 -160 44 14 -97 -331 68 160 -44 -84 227 -220 122 99 -188 58 104
5794 104 -214 -45 111 161 83 -9 128 79 99 -66 -208 -134 40 -171 -49 -63 138 31 -124 -44 14 75 268
5817 268 -27 -185 103 -34 7 -160 -5 85 12 -133 94 135 -75 -47 97 32 63 0 -11 251 -30 62 5 -286
5841 -286 -59 -115 -126 -47 183 -332 -113 65 -55 -75 -27 -173 -22 151 57 2 56 200 -62 65 142 -21 142
5864 142 104 -156 -9 -14 104 3 -258 -94 -26 -262 441 -257 -57 248 80 -23 193 -223 -228 321 -161 72
5886 72 276 -222 -24 -155 152 -222 -100 38 -103 173 140 -11 -9 -84 13 165 -31 118 172 -38 -82 22 68
5909 68 -47 -89 -41 102 -10 -120 -47 45 130 52 -19 -18 -45 -10 119 162 235 -3 234 48 -6 -82 148 151 0 53
5935 53 -25 180 -217 26 -133 192 94 254 -110 -266 13 184 79 76 71 -25 -108 45 104 -15 -164 -111 41 173
5959 173 66 50 -44 83 199 -49 161 173 178 18 -29 29 -142 -210 130 241 -48 347 37 13 -130 -49 104
5982 104 -37 314 19 -89 36 55 -143 59 142 -62 -43 103 13 -158 46 -124 208 23 -38 -64 153 390
6004 390 331 96 -183 18 -200 87 55 196 -55 35 -218 37 175 89 90 142 27 -148 -122 -11 57 12 141
6027 141 -62 -155 -183 169 246 -92 88 -180 -48 212 -54 -75 138 34 109 351 -38 -63 64 -142 239 109
6049 109 -68 -40 -65 16 23 -97 54 44 89 -83 72 403 -70 205 22 143 -254 -152 29 37 -12 31 12 69
6073 69 -33 -433 187 -286 -165 -89 -42 215 26 -71 42 125 138 168 -183 -78 -49 -388 108 43 -226 216 36
6096 36 120 -111 52 -46 -41 83 9 -104 -71 9 -210 -181 5 -132 -220 213 207 166 151 -70 185 -94 4 -66 2 125
6122 125 146 452 -208 -7 21 2 -75 -209 86 -25 -165 -111 67 -205 -110 155 -24 239 -32 69 -44 -202
6144 -202 219 -103 122 -165 179 -68 -45 121 -170 -157 -239 -131 -31 34 18 -124 85 -80 45 89 28 -129
6166 -129 110 81 103 -62 41 -65 118 185 11 -75 -62 -354 -38 294 8 -108 -170 -291 52 92 -66 207
6188 207 -204 -138 98 -85 55 -51 205 -230 -49 -229 -27 131 -44 238 -1 -54 -6 -118 -35 -178 -182 461
6210 461 -155 32 0 62 -97 -97 -143 -65 215 245 -20 32 176 143 177 -62 56 -172 -329 -168 -162 -97 -294 160
6234 160 -105 -132 77 -167 147 83 28 143 -133 -30 -75 -16 112 -86 -107 -293 7 111 -161 -17 19 236
6256 236 192 -1 -72 -57 115 105 104 -1 31 6 -215 -166 -93 81 -120 -207 -82 176 108 16 -50 -87 132 -56 -66
6281 -66 -114 84 22 -150 198 -324 435 -24 -61 127 10 -58 -30 207 3 180 -103 -24 68 -116 27 -111 -7
6304 -7 -97 -237 -121 -61 11 211 -110 287 188 -210 113 -14 207 -16 120 -145 -140 124 -133 -42 96 -138 -170
6327 -170 330 -6 31 -43 -269 -36 -258 -100 174 -158 181 44 -231 -18 131 58 274 261 -88 77 -51
6348 -51 -99 -179 -243 184 -166 -17 -80 -123 300 11 -148 55 -149 -108 -107 -61 27 40 119 -319 22 -67 -4 -100 -122 38
6374 38 319 -99 1 -138 -275 -71 -38 -169 -4 115 -226 -45 -24 361 -96 101 199 -69 45 -141 -13
6395 -13 10 187 -54 -139 17 -87 28 53 133 6 -67 89 261 -165 -110 99 205 -152 -224 -224 -145 143 -35 -44
6419 -44 -324 -122 28 -55 -215 -158 127 5 -77 -176 -29 -44 -97 100 -25 133 -65 33 210 301 100 84 39 -77
6443 -77 -76 164 49 1 110 13 -172 26 -288 -18 -117 -105 38 -21 -64 234 220 -192 -54 237 83 182 -116 -59
6467 -59 271 -88 -119 93 78 -239 63 -312 -221 -186 228 34 -16 5 -43 11 96 -30 -150 -182 -155 -172 -158 232 30
6492 30 85 -50 -5 -245 38 82 222 -2 69 -24 40 66 -101 130 117 -5 236 -161 -172 274 -209 32 259
6515 259 122 72 302 -138 -16 163 -257 10 -91 59 -271 54 -261 -73 -104 -12 -64 -126 -81 174 157 8
6537 8 -105 160 75 -121 -191 11 -231 181 67 254 -257 113 148 110 -58 20 -99 54 105 -83 -154 26 -81
6560 -81 -192 75 -142 -87 -107 134 -95 55 -53 -46 20 -25 90 -105 -82 -73 82 -60 305 39 73 106 16 -214
6584 -214 230 -54 -127 65 108 229 214 -240 -76 -24 86 -124 250 -3 -115 -100 -101 106 50 221 0 84 -126
6607 -126 187 -160 15 -28 14 51 65 157 10 201 -65 -23 83 61 -197 90 158 62 -136 -114 227 -20 -78 -195
6631 -195 -54 -41 -13 -58 2 153 -201 -153 138 130 81 181 -98 187 114 -242 69 66 2 139 -120 -260 -162 -236 -85
6656 -85 352 14 -255 -160 -95 -197 311 -26 -93 -167 113 95 291 59 -226 -69 -13 64 -215 108 -33 99 -86
6679 -86 -86 -63 -205 186 -32 -157 78 168 -23 -295 111 -62 357 -225 -1 79 -38 -4 69 79 -26 -45 -230
6702 -230 -149 -146 -131 -390 4 -61 -113 -137 147 140 189 181 10 241 -94 -154 -215 -58 272 72 39 136 -93 -4 83 133
6728 133 -283 -104 -42 -98 -23 32 -98 45 4 378 -80 9 108 -218 -7 69 145 -69 -100 136 188 -104 68 -111
6752 -111 -28 -58 233 -23 31 146 59 -153 205 279 66 67 -116 156 -27 71 275 22 -132 244 121 -2 -239
6775 -239 -14 -26 297 32 -329 -5 223 -21 22 -243 -83 -54 -199 -123 -214 257 -74 47 74 81 102 -141 -178
6798 -178 -76 56 -195 116 32 75 -76 126 134 124 9 33 -8 -176 177 -40 154 -82 -93 296 171 -44 -149
6821 -149 18 -400 -89 -18 -155 -90 86 123 35 -87 10 57 191 199 -66 172 -31 137 -160 -349 -40 159 -239
6844 -239 -72 89 166 99 80 56 178 -225 6 45 28 -144 9 -48 -25 150 -17 -22 -91 -117 90 70 -82 -99 54
6869 54 241 -128 -167 -134 -234 -163 109 27 -31 -88 -71 -328 -191 -50 -67 -125 -326 -303 31 -205 151 -178 212 -47
6893 -47 -200 -70 149 137 -20 -156 -9 219 137 -14 -187 120 0 102 400 6 -119 136 83 1 -120 -233
6915 -233 -56 239 236 78 27 39 34 -7 -122 -15 -281 -15 -170 -294 -172 46 -49 -3 87 -238 -110 -20 -62 91
6939 91 -160 -186 137 -54 -144 69 -7 85 -81 -164 -317 -28 -261 -46 -212 116 48 -97 50 -73 -52 -59 5 189
6963 189 -96 -286 -211 -161 34 156 -57 -382 139 93 67 -238 -66 -187 53 102 60 -43 -105 52 44 -46 27 123
6987 123 43 69 -51 103 14 162 21 -48 177 -98 23 4 -370 98 201 36 49 240 79 -87 -219 -39
7009 -39 -104 -122 -42 -184 -38 -129 101 -254 38 24 437 122 -220 -104 78 -33 -3 -3 194 144 -87 -262 19
7032 19 91 200 92 34 62 -232 -217 -22 -7 -192 -9 633 270 14 75 -230 99 -138 -51 -13 -47 -123 -252 5
7056 5 -60 -23 103 -256 158 -146 -82 240 -97 -254 -215 -103 -132 -70 18 -199 -180 62 169 39 223 -177 105
7079 105 262 151 -87 12 46 124 22 152 19 -149 -212 -338 -52 -87 190 74 181 159 7 74 -15 -60 230
7102 230 175 -139 -97 67 179 -283 -281 18 -48 -70 -143 148 -160 64 188 69 0 -38 195 -7 19 76 -1 101
7126 101 -85 -129 6 190 -85 -238 122 247 -176 93 281 -22 -58 -18 256 -341 75 -91 176 212 15
7147 15 35 86 -21 -39 -41 156 -268 108 60 56 -139 -28 -204 18 209 16 41 65 -184 42 -60 27 0 -187
7171 -187 56 231 106 -192 65 132 -18 161 -90 -227 -92 95 213 46 -172 178 231 127 -165 63 59
7192 59 79 -252 -28 86 301 -93 213 -82 -74 14 -24 -141 120 83 -167 23 -118 59 239 280 -150 -56 33
7215 33 86 -326 234 -407 207 -212 -86 409 -183 -168 -140 14 57 42 327 -179 -79 100 -36 96 197 43
7237 43 5 8 -68 -8 145 -47 -168 299 14 -129 -3 -152 391 120 -36 228 53 -124 -334 121 -41 -240
7259 -240 45 -157 30 -233 -115 110 -22 334 -239 -77 -108 -40 -103 15 -81 -126 240 112 -201 417 -41 149
7281 149 -261 -114 -66 -132 307 -100 56 -126 -33 36 -153 -121 -191 169 108 27 245 -190 163 163 91 -50 304 17
7305 17 71 -154 -315 31 55 -140 -56 50 243 -143 -426 16 84 -259 54 315 -326 -212 -161 210 83 366
7327 366 62 14 203 68 109 -135 -100 123 -19 65 113 32 164 197 147 -56 -323 -127 -60 51 -225 -207 28
7350 28 67 -84 -66 330 211 -177 5 10 19 171 136 340 -158 -86 -81 -103 -103 -123 22 120 -83 57 -1 159 -158 -59
7376 -59 161 -337 158 -19 215 126 -355 101 135 -72 -31 84 130 268 -62 103 57 72 96 71 67 -66 -90 -166
7400 -166 -194 -95 85 216 -100 33 -338 -12 137 18 51 -109 414 42 208 131 125 -135 -82 154 136 -193 47
7423 47 23 -19 -75 -175 47 -160 326 379 -61 -86 -55 9 8 149 -233 -112 46 -311 -118 -251 170 -151 262
7446 262 -59 99 -179 -138 158 -65 -274 -127 -229 184 34 -186 49 -151 -93 113 95 143 93 31 116 66 13
7469 13 -11 160 -116 65 113 213 114 185 -171 -215 141 187 219 86 209 48 -208 -88 158 13 168 6 14
7492 14 112 -85 -17 88 -214 222 123 -49 -319 -1 85 -271 9 -263 -82 -75 249 114 -104 141 -15 -49 -7
7515 -7 147 -153 -55 20 -23 -90 -230 -65 106 -89 -32 74 -15 32 207 -119 1 -128 -106 177 -15 -223 -2
7538 -2 108 24 -33 -21 16 44 21 160 30 -192 -32 -102 149 274 -19 -34 -12 109 204 -142 -191 -15 449 -178
7562 -178 -46 38 129 -109 -85 59 0 136 -33 -56 28 -50 285 -303 -199 -6 -31 42 46 -357 75 140 -95 -284
7586 -284 -68 269 -250 211 32 -38 249 -33 -59 127 -197 -143 214 12 69 188 -68 -205 194 -167 41
7607 41 -258 -193 33 -71 104 -223 169 -155 204 -77 72 -278 -68 134 -278 119 52 -173 -54 74 -137
7628 -137 -80 52 -74 -85 -75 -226 94 -187 -334 -78 -27 13 -12 127 -74 -111 -224 -372 -261 -300 129 -76 -43
7651 -43 -12 -253 -22 155 268 4 11 83 -182 -110 115 13 119 92 73 72 -29 -72 24 91 16 80 -67 238 24
7676 24 45 -191 101 -119 265 -66 -80 -3 -3 -14 34 -70 105 69 -124 -119 -19 2 -41 -239 187 -152 -118 -14 -5
7701 -5 112 -202 -37 349 17 -60 23 60 149 15 -25 -186 -77 112 -61 20 12 62 59 111 140 -39 -216 6 57
7726 57 -82 -196 57 168 131 -58 -127 9 -265 9 62 -259 19 -89 -19 9 -59 334 34 224 148 -176 112
7749 112 102 77 264 -362 -89 125 -58 -88 -24 261 -17 -95 -158 -182 -80 -27 105 -8 -58 217 263 -5 -157
7772 -157 -299 -175 -118 0 125 48 374 -35 -114 -30 129 -88 311 -122 145 -67 -85 -56 -142 11 242 -234
7794 -234 -46 119 -152 -24 26 414 -209 154 -153 -285 134 -58 -62 -277 292 171 35 -164 -134 40 -6 29
7816 29 -47 25 -40 -141 94 -85 -68 -175 -154 -10 143 -11 -69 -56 128 265 -86 224 61 165 -247 65 293
7839 293 -112 80 -109 -36 -14 80 -115 24 105 124 -29 -53 -126 -50 77 46 -14 43 -89 -246 -85 311 -112 119
7863 119 -105 -23 49 -147 54 -148 -195 95 -78 -75 39 -10 -222 63 -84 -292 164 84 -265 -287 24 -292 -47
7886 -47 -126 -318 160 -80 44 37 142 327 -157 -131 -55 273 -616 -155 218 -241 122 178 66 44 -57 -218 -86
7909 -86 -80 121 130 -65 -137 -583 -109 49 -249 -173 76 -37 -191 -27 84 266 13 -115 136 144 13 -10 222
7932 222 25 -115 62 41 -62 37 108 -65 -72 299 182 114 -146 -327 -138 -53 335 95 242 62 -109 5
7954 5 -141 64 168 -283 60 150 21 6 60 -166 110 -28 -27 -356 -170 111 -26 -153 -120 236 -202 144 132
7977 132 492 -273 -27 -210 -7 -64 -19 210 -175 -210 228 -14 68 106 143 24 77 174 181 -79 -271 -72 -2 50
8001 50 14 147 -365 -178 -6 499 57 55 -217 -101 349 -82 361 222 131 -179 -144 -58 9 213 -230 -321 -256
8024 -256 15 52 416 -20 -276 71 -202 110 -53 54 209 -80 -134 74 -21 154 -68 -48 26 -77 71 -101
8046 -101 87 -250 -75 141 -154 -40 -244 -287 51 -98 -63 82 252 110 77 -58 139 -143 42 16 108 142
8068 142 188 41 188 6 -26 57 -125 -163 -125 197 -222 -63 20 -203 208 -126 -358 166 160 322 -89 -361 -148
8091 -148 -293 -105 -41 -65 -23 108 240 -233 219 -20 -22 123 -274 13 -108 -100 106 -106 7 91 56 -160 -74
8114 -74 50 -98 57 180 97 36 206 -68 -28 17 -166 -3 -379 -39 46 -23 137 160 -39 -91 -1 87 70 -75
8138 -75 147 -156 -87 116 -3 -53 -26 -29 412 247 -26 220 -75 -58 19 205 5 25 -246 216 -216 -341 30
8161 30 -52 -14 272 99 -128 -123 138 137 139 -57 167 -21 15 -113 151 79 -167 220 318 -120 -120 34 -42 -20 -129
8186 -129 -56 185 -39 99 -89
8191h9
$$ Imaginary data points
##PAGE= N=2
##DATA TABLE= (X++(I..I)), XYDATA
0 0 0 0 0 0 0 0 0 0 0 0 0 0 8 -8 8 -8 15 -16 16 -24 24 -32 40 -47 55 -64 72 -84 96 -111 127 -143 164 -184
34 -184 208 -235 264 -295 331 -370 412 -457 507 -561 622 -686 757 -836 919 -1013 1116 -1230
52 -1230 1355 -1497 1652 -1831 2031 -2263 2531 -2848 3229 -3697 4285 -5053 6105 -7633 10086
67 10086 -14636 26048 -122914 -124993 94601 38564 -42703 -65079 423 36929 59045 40431
79 40431 41856 28493 -5819 -23309 33912 54796 -1043 -48222 -25434 -3743 5398 232 -33060
92 -33060 -59092 -13011 34004 13049 -24852 -11638 19526 33141 16328 -13481 -9595 30853
104 30853 27896 -15916 -16010 14359 -6298 -37602 -11830 24160 15711 -9087 -18744 -3494 27774
117 27774 25748 -21667 -39266 -2292 20442 8163 1076 -3447 -12133 2354 16530 -653 -9997
130 -9997 8412 5039 -16122 -3485 22157 15198 -6266 -13763 -5134 15809 15276 -25590 -43208
143 -43208 40 26626 -1784 -18079 792 8632 4505 11475 16878 14599 11349 -5056 -20217
156 -20217 -4658 11134 -8266 -25617 -13821 -2167 870 7204 1071 -9029 8038 22744 171
169 171 -16451 3631 18022 3498 -8170 -4873 3464 8733 -3112 -18325 -2609 17932 -2291
182 -2291 -25483 -4870 18685 5128 -10116 -2898 6924 11571 8683 -4565 -8088 5628 6280 -9142
196 -9142 -10203 -1092 -489 752 3567 -3851 -3631 10808 6025 -13906 -5937 17793 12629 -8407 -9998
211 -9998 2911 10883 3055 -13329 -12236 7625 7457 -14519 -11629 13674 12830 -6765 -5362 7125
225 7125 6855 35 -4525 -4774 2554 7915 -263 -6421 -1047 -191 -3654 292 328 -6082 -112 9197
241 9197 -117 -8987 5258 14712 1511 -9807 -4211 4805 5286 -4340 -12306 -3429 7586 -1286
255 -1286 -11470 2649 15567 3863 -7403 -681 7196 4985 -878 -6565 -5850 2154 2102 -6471 -4658
270 -4658 3935 3263 -1862 -1850 -1267 779 5258 2528 -5014 837 10817 3954 -7663 -4207 4291 2588
286 2588 -4992 -8495 -3696 3778 2148 -6016 -2961 9583 8204 -2552 -2712 4039 4337 1000 -2624
301 -2624 -5196 -2216 2237 -395 -5350 -1746 4386 3542 -901 -3243 -450 4431 2769 -5657 -5285 5378
317 5378 7238 -2870 -4763 4690 7831 -215 -6501 -4019 1299 205 -6058 -5703 2491 6406 -28
332 -28 -1961 3449 6670 3504 -942 -3378 -3600 -1502 -603 -3614 -4724 -315 3466 2077 -1110 142
348 142 5030 5532 -1320 -5761 -716 4720 -254 -6664 -2621 4892 2852 -4512 -4434 2021 3662 -1365
364 -1365 -3941 214 4190 2074 -645 845 3123 2636 -28 -1913 -2269 -1712 -821 -986 -2489 -2498 1577
381 1577 4117 317 -2618 1218 5272 807 -5283 -2177 4065 2671 -3524 -3874 2733 5768 -1043
396 -1043 -6052 -104 5807 298 -5871 -1743 4293 2665 -1825 -1098 2356 4089 1075 -2906 -2563 1054
412 1054 368 -3464 -3392 -1658 -265 1024 899 -1228 1510 6221 4217 -1531 178 4391 1799 -3080
428 -3080 -3492 -1620 -319 -1578 -4739 -3810 2114 2913 -1378 -704 3653 3142 888 1550 153 -550 1766
445 1766 1152 -3111 -2543 2266 1475 -2562 -2366 -64 2001 1234 -2491 -3236 2789 4550 -3007 -3726 4315
462 4315 5244 -1856 -2697 1307 1709 -160 -2146 -2892 -27 2481 -1010 -2867 2062 2934 -1301 -342 2148
479 2148 -1097 -1661 1904 411 -3421 -156 2826 -34 -1245 502 1061 1569 1420 -2929 -1312 4303
495 4303 1061 -5817 -1549 4609 64 -4268 262 2802 611 -611 -1462 -633 2390 1069 -3953 -1126
511 -1126 4555 1574 -1972 1598 2178 -1936 -1031 642 -3092 -3088 1538 407 -2428 877 3087 1338
527 1338 1216 591 -1045 1220 2563 -4045 -4660 2489 2346 -4664 -2175 3940 1787 -1379 66 558
543 558 901 1680 -1250 -3006 2237 2494 -3056 -1095 4457 1011 -2583 476 499 -3175 -829 1300 -2297
560 -2297 -1939 1954 1325 261 2449 963 -1202 1655 700 -4130 -744 3687 -1182 -3684 2346 3586
576 3586 -1363 -1052 1099 -615 314 1693 -1815 -2497 1597 692 -2259 1610 2108 -1843 -102 2800
592 2800 -547 -1770 2999 254 -4690 -830 2799 -654 -1707 1181 862 484 1667 -1293 -2010 2511
608 2511 1245 -4505 -748 4403 -787 -3592 2255 2894 -1902 -768 1110 -675 643 1549 -2050 -1592
624 -1592 2218 -1088 -2078 2507 2123 -3438 -51 4151 -1048 -3698 1101 1116 -2451 -706 1180 -168
640 -168 517 512 -1623 1125 3445 -2505 -4925 2527 3390 -2730 -1518 2924 356 -1658 1099 761 -918
657 -918 -22 -1085 -2285 2063 2164 -3115 -1859 3276 -48 -2507 2421 2440 -2492 -1099 2519 -465
673 -465 -1457 652 -645 -1559 1298 311 -1162 2174 2205 -2737 -1125 3395 -338 -3355 1395 2421 -1913
690 -1913 -681 1761 -408 -668 1412 -183 -1382 1244 -139 -2177 1612 1325 -3163 -1508 3135 140
706 140 -2091 2275 2308 -1622 -374 1238 -777 -1212 -125 -1724 -572 2545 -156 -2560 1713 3371
722 3371 -1932 -816 2168 -664 -2690 1141 1733 -639 38 358 -1371 530 2162 -1146 -1710 1350
738 1350 -747 -2553 1067 1913 -1968 -918 1822 260 -935 1710 864 -1833 -215 973 -1081 -742
754 -742 668 -1174 -26 2858 307 -1568 1780 1283 -2573 -1149 2146 -845 -2377 906 1148 -541
770 -541 543 676 -554 706 1088 -1389 -830 1873 -700 -2182 1656 1747 -2178 -880 1954 572 -1262
787 -1262 178 398 -603 -57 -276 -1029 1243 1081 -1478 -52 3019 482 -2318 493 1219 -1962 -2003
804 -2003 725 -642 -738 787 475 33 752 3 -1087 1551 1416 -2288 -1420 1799 113 -1957 537
821 537 1889 -718 -1075 402 -35 183 433 -1237 -803 1353 241 -1394 552 1820 -612 -780 1093
838 1093 167 -1336 -171 -107 -1060 -28 738 -306 310 1195 302 265 1129 -405 -1186 371 671 -1345
856 -1345 -917 1232 80 -1320 350 812 39 248 322 152 421 476 -911 -659 1265 82 -1127 373
874 373 757 -718 -503 984 -72 -1253 -430 134 82 335 723 190 685 701 -465 -112 732 -257 -1212
893 -1212 60 581 -697 -1052 529 387 -82 273 423 221 252 -168 -737 234 400 -654 -468 370 217
912 217 49 299 358 -57 77 491 -319 -773 -57 476 143 -353 -124 276 889 20 -919 101 675 -360
932 -360 -1158 137 875 -316 -476 356 684 520 -320 -48 439 257 -623 -623 264 -268 -646 -194 317 327 -21
953 -21 320 782 210 -663 96 459 -100 -841 -157 552 244 -607 -513 646 188 -664 -769 171 482 -468 -810
974 -810 425 1147 164 -516 151 602 -443 -469 -348 56 -184 -320 -371 -76 381 -180 137 606 596 -268 -144
995 -144 204 40 -326 -353 227 -404 55 530 -192 45 279 125 -30 37 -173 -413 26 197 -521 202 599
1016 599 76 -403 368 276 -455 -7 13 -371 -102 439 114 -431 106 505 227 402 77 -546 47 419 -812
1037 -812 -882 753 318 -537 83 648 194 77 31 -266 178 611 -541 -979 469 711 -728 -167 795
1056 795 -271 -355 488 -173 -403 454 637 -322 55 685 48 -146 634 -168 -627 460 -191 -1200 -80
1075 -80 1031 -633 -652 751 770 -391 396 512 -205 275 326 -596 -194 324 -428 -827 972 513 -704
1094 -704 110 1042 -321 -597 667 -46 -739 33 422 -266 345 589 -646 -137 1091 -689 -1034 887
1112 887 498 -1287 36 870 -131 -484 648 319 114 466 -112 -1136 196 583 -1053 -508 1036
1129 1036 -123 -940 726 717 -804 52 633 -530 -362 498 -206 -778 632 338 -837 391 614 -724
1147 -724 -224 1246 56 -695 621 387 -632 472 463 -680 -46 724 -548 -771 936 70 -1429 256
1165 256 449 -414 240 781 -130 -667 864 28 -878 644 918 -932 -607 880 -212 -589 597 -188
1183 -188 -977 713 396 -1240 -61 1024 -808 -874 1019 362 -729 455 909 -736 -43 339 -745
1200 -745 -582 595 -362 -1013 717 386 -1148 276 1140 -404 -804 704 127 -906 456 584 -591
1217 -591 177 607 -851 -572 878 -289 -1331 890 529 -1241 77 898 -682 -643 681 -118 -858
1234 -858 540 386 -718 349 755 -718 13 838 -352 -1046 966 353 -985 339 1315 -401 -580
1251 -580 602 64 -920 333 479 -534 597 570 -832 -48 1330 -269 -1107 813 480 -1281 262
1268 262 600 -664 -589 688 -141 -318 860 407 -735 438 444 -895 -506 992 -372 -970 739 513
1286 513 -684 322 973 147 -200 384 -768 -568 668 62 -888 334 717 -976 -71 1092 36
1303 36 -688 489 192 -639 379 480 -649 -55 1046 -235 -670 665 124 -707 455 204 -890 -117
1321 -117 494 -461 -406 1031 123 -804 318 744 -589 -249 528 -402 -491 671 -159 -510 578 217 -996
1340 -996 23 926 -495 -696 428 19 -910 141 475 -406 -122 354 -649 -83 619 -431 -1097 442
1358 442 252 -1142 270 979 23 -436 266 -40 -560 -254 3 -696 466 406 -573 148 787 69 -677
1377 -677 276 522 -643 -41 637 -484 -393 239 -190 -459 316 246 -238 482 503 -484 -232 542 -351 -656
1397 -656 431 352 -663 17 726 -125 -264 338 40 -453 354 -61 -348 343 90 -534 -173 496 -167 -549
1417 -549 461 196 -295 177 461 -291 135 526 -255 -532 467 -316 -573 125 296 -733 -59 450 -295
1436 -295 -406 382 184 -364 155 109 38 121 446 -383 -154 603 -123 -464 -192 274 -311 -175 370 193 -31
1457 -31 162 -159 -388 198 451 -493 44 267 -159 -105 322 -120 -163 514 166 149 -90 367 -512 -161 19
1478 19 -26 -199 319 45 -161 233 326 -67 -387 160 -15 -274 72 35 27 375 443 -306 -222 338 -27 -568 -118
1501 -118 207 62 -329 -218 90 333 339 -101 -293 405 33 -366 -89 22 190 -159 -207 19 184 113 -155
1522 -155 -296 -47 275 92 151 187 253 -277 237 -31 -326 -166 63 -190 348 -459 -421 197 1 -395 312
1543 312 447 181 59 241 203 -2 -110 -120 232 163 134 -376 253 41 272 364 -284 0 117 -227 -140 -189
1565 -189 80 -69 -31 -50 211 180 14 45 -365 -185 -3 -351 -651 -115 344 -205 -6 -95 13 -197 288 -210
1587 -210 -305 224 -17 -105 -288 330 -145 -175 326 -6 1 180 260 -185 -253 223 -284 -208 397 281 -246 -189 -7
1610 -7 -109 50 149 -518 -170 271 565 33 433 102 224 48 184 -144 -103 124 35 -505 167 592 -579
1631 -579 -127 184 134 219 301 -139 -141 426 -31 -608 183 487 -264 -99 125 -141 -86 98 -245 -223 112 203 -242
1654 -242 -175 194 258 -245 231 83 33 173 277 -172 -315 535 -110 -356 190 -49 -69 263 46 -89 -302
1675 -302 684 58 -478 68 93 -473 -126 88 -154 89 186 -652 -259 841 502 -362 -152 307 137 -335
1695 -335 -24 -251 -19 259 -364 -827 275 396 -249 -166 302 -140 -179 128 276 -113 260 407 -463 86
1715 86 444 -279 -360 304 -140 -301 -136 128 -70 222 785 1 -368 267 289 -314 -105 383 -400 -246 295
1736 295 -398 -623 448 -179 -911 -31 303 -552 -122 184 -96 11 501 -113 -298 500 648 -458 -394 51
1756 51 -158 -69 16 -465 -103 663 290 -560 181 644 -57 -229 337 -106 -189 274 -181 -656 261 561 -406
1777 -406 -413 523 -81 -383 377 305 -138 345 232 -637 -214 857 -60 -629 98 361 -353 148 382 35 100
1798 100 808 -107 -614 556 881 -340 -167 428 -196 80 132 -266 -270 601 89 -850 -92 630 -85 -168 461
1819 461 215 16 455 -68 -429 534 705 -626 -308 217 95 -375 -203 -27 -611 549 133 -662 160
1838 160 713 -150 -490 228 486 -318 -80 -143 -322 223 321 -526 -88 436 53 -424 92 184 -416 -115 334
1859 334 -452 19 593 -334 -488 -72 260 -140 43 54 -10 145 438 -109 -368 507 605 -720 -290 435 183
1880 183 -202 -44 -249 -318 206 187 -821 -47 636 36 -350 323 369 -53 169 6 -233 131 307 -530 -441
1901 -441 435 390 -498 -150 150 41 87 458 -270 101 596 70 -509 448 322 -150 -464 5 -321 2 463
1922 463 -209 -279 443 418 -447 104 110 139 -54 -28 19 4 423 63 -575 -16 410 -311 -244 25 -16 42 244 -54
1946 -54 16 472 395 -546 -215 368 126 -380 -159 113 117 231 27 -254 205 636 -380 -463 334 238 -53 -50 212
1969 212 -62 181 218 -343 -402 283 357 -406 -214 343 84 77 64 -14 370 328 -34 -702 16 166 -206 -262 -182
1992 -182 -105 -86 377 -131 -141 282 135 -498 -211 238 46 -184 51 -33 8 330 -85 -311 -71 332 -384 -470
2014 -470 163 148 73 -79 -84 -102 47 210 -355 -63 653 106 -627 -322 186 -252 -64 -55 -182 -7 431 -220
2036 -220 -165 434 74 -54 -22 -113 107 -44 -96 -270 -57 254 234 -185 -7 273 111 51 -140 40 86 380
2058 380 -151 -293 84 329 -117 -299 65 299 -49 -101 132 -225 423 121 -278 158 80 235 -42 11 -124
2079 -124 73 -100 -320 -110 96 190 90 -326 195 335 -258 -239 -28 -10 131 22 -217 191 138 310 -242
2100 -242 -219 40 129 -148 -271 140 257 -64 -67 -4 35 211 -212 -242 -142 74 68 -132 -459 22 -184 -153 -218 -95
2124 -95 169 23 -14 2 159 206 266 -293 -9 142 170 -202 -260 -56 38 252 -14 120 -47 265 -161 -185 -3
2147 -3 164 54 -287 99 122 42 128 -185 -305 306 274 -97 -468 -38 90 156 -388 265 162 39 -56 -94 -150
2170 -150 74 45 -147 -126 117 1 -112 -57 -19 290 -110 -230 -315 160 5 -69 -52 40 66 -152 98 -24 300
2193 300 -13 110 -247 382 108 -79 84 26 71 179 -167 -364 -181 109 88 -115 -179 66 516 141 -121
2214 -121 85 101 200 -375 259 184 30 -174 -76 -91 109 129 236 -49 140 -4 8 -67 -223 97 161 115 145 -112
2238 -112 255 139 -290 -367 453 92 -179 -173 103 -88 -123 299 -34 285 253 -97 -371 -22 235 58 -266 3
2260 3 -85 -41 123 -185 -8 132 143 -173 -125 31 -101 5 179 -74 12 11 -67 -382 -143 202 -98 -297 354
2283 354 -123 25 -189 312 -12 215 -78 -177 142 40 -187 -202 228 67 89 105 135 -100 73 41 -4 -353
2305 -353 7 145 -323 -151 63 79 256 282 -159 -127 407 150 -261 151 412 -98 -37 35 47 103 -28 -87 -137
2328 -137 268 63 -104 -24 87 338 86 199 -292 -244 72 41 -407 -158 362 197 -198 -47 49 -10 181 25
2350 25 -342 279 107 -215 -299 218 -110 39 188 25 -310 29 320 -134 -115 272 -161 77 160 3 117
2371 117 178 -134 -76 154 161 -89 20 0 62 -137 38 364 -238 -125 221 40 -184 88 399 121 -20 183
2393 183 -94 -255 96 -103 158 126 21 17 76 378 -82 -168 -14 44 -211 108 -104 137 18 -41 -152 -223 -45
2416 -45 -138 -303 58 51 -257 -151 179 36 118 232 71 -10 32 157 -94 -75 2 12 -69 22 -196 -28 101 40
2440 40 -109 -69 -6 -129 -155 -81 -76 99 89 -171 -166 128 162 -257 64 -113 -87 -240 344 35 -292 66 29 -234
2464 -234 -162 156 21 91 358 -70 3 227 -9 -248 75 -192 -233 -141 119 78 -79 189 -117 -52 142 73 -458
2487 -458 -109 141 -140 -250 24 179 156 56 102 11 -27 191 -189 45 -168 54 -57 29 118 -16 -94 -88 139
2510 139 -150 22 33 -123 -30 409 -68 65 211 -93 -55 -227 145 -54 -8 192 -283 -252 96 -203 69 95
2532 95 103 134 -155 334 63 13 166 -9 -287 -183 62 -77 -147 6 -101 44 -179 -102 -115 7 275 -82 -319
2555 -319 152 49 -114 154 -98 -156 -56 -92 -240 189 259 71 20 -84 -177 -109 120 -9 -267 -128 233 -60
2577 -60 -46 57 -286 -20 38 108 60 100 78 -463 17 -104 -169 -186 97 -92 -97 135 45 305 91 -58 -146 -23
2601 -23 -23 -34 266 41 34 84 41 282 211 -18 2 -156 183 171 -80 -185 143 41 83 -86 242 -14 -223 53
2625 53 358 68 114 24 76 97 145 212 -208 -22 -268 -6 -19 -191 81 49 40 -114 71 74 48 391 144 -216 -18
2650 -18 -241 98 65 -120 245 -190 2 181 73 -245 214 410 155 -44 -212 -76 104 214 83 -82 -211
2671 -211 51 -14 185 303 265 -195 138 214 11 66 178 -104 -54 -30 15 47 37 -16 -206 -208 -135 -202 -42 65 59
2696 59 203 132 319 225 336 -289 -157 -4 -20 23 22 -173 227 69 31 311 80 98 -158 60 -39 -96 -4 187
2720 187 -85 1 303 69 211 240 3 109 26 -25 -126 -210 22 -53 -82 12 -177 88 -62 -23 45 -200 113
2743 113 13 34 -64 -137 304 18 -21 -178 113 34 -168 -181 -224 98 -27 43 133 163 162 83 115 -169 26 107 -37
2768 -37 340 11 -80 -154 -55 -76 112 243 142 219 -121 143 -281 -59 -72 14 -216 27 11 217 56 -37 10 -86
2792 -86 87 83 -128 -276 -60 48 50 38 127 20 -25 109 -94 239 12 -128 35 298 -61 263 203 -41 119
2815 119 -27 -159 160 186 -98 -10 -110 4 76 -164 48 191 109 9 95 121 -131 -28 65 13 -133 461 -56
2838 -56 166 -214 -45 -154 36 98 62 -15 111 -191 -123 234 157 -136 257 179 -242 132 227 -43 -247 137 -87
2861 -87 -120 -319 139 -49 110 193 149 60 413 170 -161 -15 -256 -190 48 -110 59 -131 155 -401 49 -235
2883 -235 143 -392 -218 -67 76 -158 46 220 85 -12 26 67 -42 221 -60 166 120 106 -127 100 -258 10
2905 10 -21 54 -170 130 235 -125 243 -104 196 -211 -67 180 -212 -345 -119 70 -169 249 -63 39 -42
2926 -42 -7 -212 -16 7 92 -89 6 -87 -85 3 -12 3 -281 183 152 131 49 -232 -236 -74 257 13 -39 240 13 -70
2952 -70 45 80 -77 10 94 -113 -146 153 -121 56 204 -37 -140 -190 -199 -328 -99 -170 287 -257 -229 244 -144
2975 -144 -89 116 40 132 82 -67 -67 115 90 31 -96 -37 71 150 93 -109 -35 -24 140 29 16 9 -237 46 209
3000 209 -49 -192 -45 48 -70 -188 56 19 -89 85 8 -72 23 246 169 139 128 -12 246 208 -155 267 -298
3023 -298 85 1 -80 35 -50 -156 -118 162 -214 -155 89 37 26 95 48 -391 -88 -49 -20 59 5 -81 -123 -73 -164 -23
3049 -23 251 -199 -294 165 -198 -107 -24 -52 42 134 113 36 -168 66 339 -86 94 -53 -118 68 64 46 -277 111
3073 111 -197 -94 -10 -103 -94 79 175 -83 -222 11 287 -171 -72 194 -403 9 133 74 55 75 -200 -193 105 47
3097 47 -367 -17 3 -65 -42 28 42 11 229 -100 -147 47 126 -184 -91 -12 -178 -340 23 -58 -60 64 90 236 136
3122 136 151 -106 -30 103 -130 -79 -79 -37 32 76 90 -203 55 6 46 -175 327 64 -72 -43 220 -18 -14 -136 -67
3147 -67 -215 -185 162 -11 54 234 12 -14 -67 -51 -106 -53 396 14 -197 83 -3 44 222 -45 -83 39 122 38
3171 38 182 228 100 -8 147 91 -267 -64 -30 -264 56 -38 -237 -27 -82 61 -303 -14 -56 -126 -88 -50 23 -59
3195 -59 -36 97 76 310 122 -140 -335 69 -44 -196 -182 114 34 -77 -95 -29 -83 111 8 71 117 -68 6 67
3219 67 -32 99 268 -4 -185 -120 74 -186 -231 171 50 -31 -130 -43 -11 -70 38 7 -105 -11 -143 281 203 160
3243 160 -136 -15 -42 -351 -155 -112 70 -99 -165 -278 -180 -149 144 99 -144 98 -48 79 -104 74 -93 -71
3265 -71 -21 -196 -167 -59 -236 15 61 67 122 -110 33 61 -129 -22 -197 -124 241 203 -9 8 -17 29 -25 -167 267
3290 267 5 61 -25 -300 39 92 47 -210 -99 -53 47 104 63 237 175 116 -5 -82 139 222 -461 101 64 -182
3314 -182 -72 -136 -140 -51 -30 -6 53 121 26 193 2 -27 -47 11 -252 219 -214 119 91 -154 175 63 141 -193 -96
3339 -96 43 159 179 -41 58 -81 -18 116 -87 234 95 123 -6 -144 -219 -25 103 185 407 130 -198 168
3361 168 -13 13 99 -184 4 8 75 89 117 -56 -133 -389 -78 62 -137 -96 -181 -126 163 108 3 -28 14 -84 -8
3386 -8 190 102 -26 36 -13 37 -78 29 217 -64 -38 -15 -100 -155 34 -330 50 -124 70 108 114 -97 20 50 -14
3411 -14 -146 -82 -13 -175 174 -51 -220 50 -183 -173 77 -27 -26 -128 -197 -365 -71 -203 116 98 236 -94 -239
3434 -239 -33 -47 -55 -53 -95 126 -108 158 296 -342 77 173 -163 103 -120 9 39 111 -165 -86 -220 225 -27
3457 -27 -236 -115 -152 83 -95 -44 -103 -43 -57 -134 43 -221 46 -88 -11 -129 29 -13 21 91 230 -13 -177 -155
3481 -155 -52 -206 275 35 140 130 -85 236 199 11 -192 1 128 -2 -172 38 -44 25 -193 -127 -1 175
3503 175 50 49 32 -18 90 -50 -200 -54 119 128 136 -34 -210 -19 -53 -12 164 132 -605 226 -70 50 69 184
3527 184 16 -412 313 202 215 2 -67 -100 -166 118 -4 139 -98 -10 -269 102 109 303 187 -28 -31 -141 -40
3550 -40 73 -95 -170 202 -84 17 152 40 -55 -97 -10 -259 -92 397 -23 199 -48 -104 -19 13 10 2 -241 152
3574 152 6 122 71 -200 -257 -46 100 -293 101 -23 103 -64 4 191 -195 -48 171 418 -204 37 102
3595 102 -148 13 194 -115 -58 -147 -306 -317 -86 45 49 103 184 -6 154 74 -172 -83 -13 24 -199 36 -147 122
3619 122 21 -49 136 236 -104 104 -126 138 -52 -5 81 85 -98 -60 138 72 -42 146 -91 66 11 -195 -357
3642 -357 -67 106 -58 -116 173 -191 51 241 10 -85 73 -32 -73 42 -50 -262 -84 -7 237 -34 26 39
3664 39 -233 -95 384 264 171 30 -46 -222 79 98 89 209 -119 10 -258 89 129 36 346 90 -28 -372 9
3687 9 -244 -226 187 119 136 -82 -238 -172 -8 291 89 -243 155 -94 7 64 336 -155 18 125 -141 -257
3709 -257 191 52 111 -24 -219 -35 210 -154 -231 -265 -10 -71 25 111 -89 74 -22 -169 -6 56 162 62 -207
3732 -207 232 133 -62 28 127 -78 -224 -188 142 -92 -110 -61 -125 -14 2 93 28 35 110 -156 -16 -84 -80 26 -55 -76
3758 -76 -42 12 -147 -383 12 -5 18 80 81 -187 -242 190 98 -79 -233 103 80 -91 152 -30 309 50 128 -136
3782 -136 260 18 146 -120 138 95 -155 225 -7 -30 363 61 -38 -232 87 289 -130 96 181 12 -162
3803 -162 110 166 -12 -189 -59 -214 -63 15 -144 94 -72 -104 200 87 154 -46 134 -25 -155 171 -93
3824 -93 -122 -82 85 -258 144 -70 68 18 123 115 211 160 5 -8 50 60 6 116 207 222 105 -151 -72 -196 65
3849 65 39 -128 -152 -29 136 57 85 -33 28 -261 -21 219 -361 114 24 107 24 61 40 -70 362 53 -5 -329
3873 -329 5 -62 -33 -10 -237 -117 149 223 41 231 -153 23 181 -51 3 141 -31 8 -204 57 -92 -31
3895 -31 18 16 -12 130 -4 8 3 -13 -130 -111 129 -146 -185 -143 -166 -31 27 -73 347 -24 -102 -154 57 -90 -11 -163
3921 -163 240 19 105 -68 88 102 -224 -7 -103 -177 283 -41 -67 144 -86 33 -66 -82 161 -10 -29 327 18
3944 18 -242 -184 142 -36 238 440 59 231 160 -119 468 68 77 86 171 -134 -32 21 -146 -112 12 146 57 -143
3968 -143 23 -40 69 -217 -149 -5 -68 -327 57 141 276 -160 24 136 -137 39 227 -171 25 -155 -84 -25
3990 -25 114 44 138 52 -119 -15 45 209 108 -378 -344 230 -198 68 210 292 2 349 25 -89 190 -160
4012 -160 -81 134 -122 20 -178 74 15 89 390 139 -274 -237 -90 -50 190 -137 76 11 -102 222 10 -278
4034 -278 119 -169 81 -127 6 29 156 -14 -34 57 -61 -128 -216 196 -2 28 -101 -34 -3 232 -219 -150 156
4057 156 120 -62 -7 -72 129 175 -117 -140 186 26 -314 -76 -67 320 -108 -262 -28 -76 74 -212 20 125 48
4080 48 97 -217 68 15 34 57 -98 40 292 -145 18 -57 152 -122 23 -431 194 91 249 6 -21 1 -299
4103 -299 154 -41 116 7 -213 105 -81 -41 -68 69 194 124 66 95 -81 -189 -164 84 35 -31 126 334 -32
4126 -32 -167 -125 -211 35 184 -139 -139 -142 171 -17 303 172 86 -58 -13 163 -107 121 -67 -110 -270 141 -130
4149 -130 -92 206 -10 -39 98 -211 -89 -388 134 182 -44 99 265 -20 -97 25 233 65 64 -155 197 -193
4171 -193 -94 26 58 261 -38 -36 33 278 104 50 -9 114 264 -18 2 135 103 59 -32 73 -7 -98 278 165
4195 165 5 42 43 -12 -150 -142 5 -119 -45 -121 -84 -89 -132 11 -61 -3 -111 -158 252 -94 -244 159 -211 45 182
4220 182 38 66 66 52 -136 -56 -46 -34 -107 61 -126 -117 112 166 388 -146 -3 90 17 83 310 102 26 29 -215 -8
4246 -8 79 131 86 172 -403 -80 -66 -33 148 -248 -1 226 -8 -145 39 -4 -214 118 -206 101 431 161 -326
4269 -326 -158 127 -218 -185 132 271 -49 8 239 92 -90 -1 -171 92 -91 -297 -219 -158 -147 -211 -7 -84 -65
4292 -65 -175 12 -211 -320 -102 -163 -108 -366 2 -217 -87 246 38 87 179 80 -77 130 329 -128 116 117 -8
4315 -8 -208 -67 -155 -5 -18 -265 -153 -19 276 14 -169 173 68 136 113 104 -129 253 -4 -37 88 -134 141
4338 141 135 -162 -74 18 -74 75 -17 196 -321 21 -96 180 -40 -42 125 3 -60 194 122 139 -244 -43 -177 -33
4362 -33 -92 11 -163 -52 221 -105 28 233 -12 407 -115 21 -38 -112 95 -53 116 106 98 -218 -20 7 324
4385 324 156 100 156 181 -22 -79 63 240 -33 -87 -126 -136 -85 -226 162 18 -84 -25 -43 42 -42 -8 -75 -140 161
4410 161 -226 -39 -151 -135 -172 -73 14 92 -121 -127 117 5 222 -135 -140 -60 52 145 103 155 -24 -249 245 96
4434 96 -91 -21 18 -273 -60 101 -157 -112 82 -27 -113 117 -85 -52 -91 236 -28 325 161 109 -185 3 91
4457 91 -32 31 390 -485 176 7 101 -154 206 -11 136 -149 5 165 63 155 361 -22 54 227 257 -360
4479 -360 -11 211 -138 64 -136 -74 49 -203 22 96 10 -216 -195 -171 95 -5 -434 -30 90 -190 172 -87
4501 -87 -132 -26 38 40 7 -237 -60 79 -288 -123 -6 -305 -86 -310 -368 122 -91 57 7 252 43 249 -110
4524 -110 -73 116 -42 62 224 229 64 -157 -381 241 -122 -77 -66 243 114 150 -84 -36 215 -132 238 -115
4546 -115 -379 95 -465 -117 123 -14 64 -31 -97 129 -129 -19 -73 -234 115 49 24 316 134 7 -44 139
4568 139 -98 -86 194 95 -192 57 283 43 66 -77 64 232 -212 15 -24 -366 -174 -48 56 7 83 -170
4590 -170 -139 -69 -85 -102 -220 -134 300 93 -148 -309 95 309 -227 227 197 -93 -178 -20 14 189 -98 233 154
4613 154 -288 55 57 -206 58 126 149 -87 18 -74 130 -78 -267 -25 52 188 53 135 32 23 -67 34 105 -116
4637 -116 200 116 41 -17 -48 83 -97 -186 89 -42 -3 190 187 218 -57 -143 105 56 -129 15 130 83 -22 -88
4661 -88 -34 1 -53 -104 270 -250 1 -192 -72 305 92 -27 209 49 45 -61 -82 -107 71 237 48 72 7 -147
4685 -147 89 226 352 -129 179 102 97 191 346 -12 -67 -284 177 112 233 37 22 -36 -3 36 -256 17 115 58
4709 58 -232 3 -59 -140 -2 -27 -102 -180 -107 200 195 129 -74 -206 -21 -152 89 237 272 -282 25 -33 102 -41
4733 -41 31 65 -120 92 -207 -137 -165 140 -29 183 -193 -58 78 220 -355 -270 -49 -52 -86 122 110 -54 -42 -20
4757 -20 63 -282 65 -212 -55 254 -158 -131 30 374 -201 -277 -85 -199 -4 230 -56 -102 -58 -99 -204 58
4779 58 141 63 -63 76 -159 -346 4 100 -204 -170 -62 -62 -41 -115 58 -54 -102 -165 -47 -168 58 143 154 -349
4803 -349 54 -87 100 -117 156 57 42 88 321 -380 94 -421 213 -175 -103 146 97 12 -170 69 -115 251
4825 251 -109 102 81 -54 69 180 -473 -198 -44 324 -243 382 32 32 191 -114 -197 -283 55 -73 112 140
4847 140 177 -5 -153 -51 -129 -30 -253 -116 185 163 -129 -121 25 -110 -115 -98 -2 88 -78 -7 20 -111 244 114
4871 114 147 -1 58 -79 -121 29 -118 178 129 36 -74 111 88 142 -141 -55 -139 -84 -142 95 253 -32 -124 59
4895 59 -208 -122 -306 -4 37 -34 225 -223 -275 -101 11 -66 6 -85 199 -8 -116 67 -22 -254 -176 -45 87
4918 87 -86 63 -18 -125 -50 -13 -152 -214 46 -89 -149 -254 -42 87 -53 168 35 50 -9 -10 -61 -115 89 188
4942 188 25 -322 42 81 250 270 151 47 112 190 64 -95 -49 94 -157 115 -233 244 0 224 165 -74
4964 -74 36 -28 -204 -148 246 -218 267 67 402 -66 -161 161 -85 -192 -14 -6 221 -138 -58 -45 -45 -212 -6
4987 -6 260 -30 244 31 -210 -51 -41 157 202 133 15 -125 -186 84 65 168 -231 -81 -49 -256 13 -188 19
5010 19 -30 104 81 129 -270 192 45 298 -75 28 113 -151 -172 135 -94 -27 -186 -281 127 -25 -67 17 182
5033 182 -104 -158 48 -174 -37 114 201 28 -65 -5 22 160 -68 23 -150 -98 -120 -83 -67 17 101 -60 193 -149
5057 -149 -171 -127 20 -20 -7 -14 176 116 160 -9 77 106 -35 -32 -317 312 121 -16 -261 35 -142 -313 12 276
5081 276 -53 -36 -316 -92 -80 -61 -52 9 6 -257 22 -126 -118 441 -200 87 0 -35 79 0 164 -133 5 84 100
5106 100 -151 260 298 -245 60 191 -145 182 86 39 47 19 -265 -241 260 -82 209 -36 288 54 518 32
5128 32 69 -223 -3 -3 213 -74 -51 -10 -103 -90 -41 26 94 -111 62 149 -203 138 -50 123 9 -76 59 204
5152 204 -16 -92 140 -34 25 -216 80 199 -218 11 -26 -113 25 77 7 169 235 105 -20 233 -16 36 57
5175 57 -167 -351 23 -94 21 22 -86 25 26 56 24 -26 -18 235 -238 27 112 101 -83 -188 -156 143 -18 -96 -102
5200 -102 48 55 182 19 -114 -110 -162 -198 -51 -234 -129 -352 -8 -129 -23 -213 -189 -64 -209 9 -85 4 16
5223 16 193 -20 31 -186 124 53 -59 506 -57 -167 76 207 -48 119 22 -12 -95 98 -100 -139 -98 -212 -15
5246 -15 273 116 106 -321 -122 -64 179 -137 -252 -152 -124 101 -76 -45 -352 190 -94 3 390 59 -59 323
5268 323 176 -161 280 72 6 282 144 -182 180 36 -66 -121 262 -8 -184 28 68 -216 -122 -6 -43 22
5290 22 5 -58 -42 65 -41 -2 49 320 -40 -116 41 16 21 207 49 196 -17 187 -17 -177 175 26 -42 158
5314 158 -3 -160 -4 87 115 -134 45 163 49 0 31 60 -30 56 -77 -99 -340 -126 187 -138 80 246 -110
5337 -110 -196 -57 19 -262 -188 36 49 -1 153 50 -36 -63 -146 -81 -12 111 -193 -11 -143 144 370 -28 -13 210
5361 210 78 -31 124 2 -71 -102 568 -13 111 390 34 -112 -62 15 136 116 -27 238 77 -1 81 288
5383 288 -93 31 6 -317 -235 13 -44 236 -14 136 188 79 134 230 28 -70 134 204 -65 -71 91 48 112 223
5407 223 117 -243 59 -198 -76 -30 -14 -177 -202 197 -71 151 -82 111 -172 32 -81 162 -45 -142 -154 23
5429 23 172 -130 -395 23 221 -48 -118 -66 34 253 61 -73 38 -15 11 184 121 -117 27 -50 -75 138 15
5452 15 -3 -86 -258 -237 -17 -105 -45 1 -219 49 -86 139 -37 -104 252 -58 27 68 66 53 40 91 -64 -124 -47 -282
5478 -282 74 -267 -258 -109 63 -134 -91 -12 8 183 169 63 -11 -133 39 161 -176 -232 100 -48 -12 -163 64
5501 64 -290 76 -98 117 -34 199 -50 -159 -150 -152 -91 -268 -149 45 5 -182 -18 -76 94 -197 23 -194 -74
5524 -74 185 25 -182 90 10 13 -229 -172 206 258 -223 -126 -332 -48 -14 -119 -47 220 110 -139 35 -262 5
5547 5 193 -135 -267 59 -11 103 212 -156 107 -116 -66 -64 66 -231 -74 91 134 -181 178 16 -64 144 -67
5570 -67 294 -105 -45 99 63 -70 68 -232 -53 221 67 -202 -254 -214 48 -103 210 -6 -6 83 77 88 -348 67
5594 67 -25 -259 91 20 326 -262 -7 -61 -286 116 204 -144 -146 88 -53 73 124 2 -19 181 -79 17 -1 -198
5618 -198 -77 28 -147 -63 190 -5 -23 75 14 61 10 -74 -19 33 131 62 -92 -133 -154 85 -19 -126 26 74 105
5643 105 174 -46 -117 388 -192 -148 132 -65 165 -295 -78 -11 -24 -110 -90 -26 37 -153 -100 60 56 -176 77 22
5667 22 329 -232 52 36 -81 -112 6 -93 -83 86 60 -62 99 -276 42 69 63 82 -174 -144 88 -110 11 184
5691 184 -315 -123 -35 -30 -23 -218 -270 -46 -25 273 -143 -140 195 -69 -77 95 140 179 -27 2 -16 -153 97 -118 -249
5716 -249 -195 -97 273 207 262 15 232 -75 -202 -33 -45 111 235 41 -52 12 -235 35 87 -62 372 63 -65
5739 -65 -108 -51 95 -215 -253 -64 -33 -163 107 2 -368 -34 -43 -280 -20 24 -85 137 161 -66 321 -237 99
5762 99 201 -106 -155 -81 9 169 83 -203 39 -172 -65 -185 -12 -74 20 -93 -32 40 241 85 -102 -25 -193
5785 -193 191 -26 47 150 -66 171 -125 67 139 121 -213 391 49 -7 28 8 298 -123 -63 36 -125 144 -38
5808 -38 -76 66 -183 7 -13 -117 23 52 116 -206 10 33 56 -31 -6 6 10 -9 323 107 260 103 -103 -13 168
5833 168 48 -147 -115 -18 9 106 -100 -50 8 98 -240 -116 -71 -216 -30 -101 128 253 -7 -72 21 -74 -103 -29 244
5858 244 -54 -4 -95 92 260 -41 53 169 269 402 -119 12 -78 199 -271 -181 212 -60 -113 -157 288 45
5880 45 55 32 -115 -170 25 69 113 -342 -15 -65 60 70 -97 -316 217 193 55 -41 28 103 67 11 52 87 -48
5905 -48 205 -2 251 -169 -95 142 -94 180 -131 -143 -189 -84 46 -124 -131 251 -136 203 130 29 31 -309 219
5928 219 -143 -74 -190 262 88 57 -299 28 -315 -11 94 -90 -19 96 200 61 -96 135 122 -78 227
5949 227 -9 -7 -30 74 46 45 -272 22 -43 39 -45 -61 7 -103 123 68 104 -30 -111 205 112 -92 -148 34 110 -76
5975 -76 -328 -20 -12 -280 -30 -102 10 311 207 -450 163 -38 -92 -82 -276 -95 -10 50 -114 -66 250 335 95
5998 95 -146 87 -119 124 -75 -65 -185 -29 -66 162 134 -87 199 -82 220 -141 76 -92 132 -89 -153 -109
6020 -109 167 -14 -19 74 -61 184 -165 -69 130 -39 -49 -238 154 -98 192 -5 -57 -161 -8 176 -55 66
6042 66 3 272 56 -39 -173 -88 14 -74 17 111 89 -51 183 15 -89 -192 -222 141 -78 25 -111 204 -347
6065 -347 -359 -16 -4 -143 -296 -65 -217 167 44 -42 47 -156 221 -288 -104 34 147 0 82 166 -99 105
6087 105 166 -32 -12 -116 -281 -67 14 -48 -23 -143 -64 107 27 4 167 -24 61 85 70 -60 227 -46 156 4
6111 4 -46 329 -33 -156 9 75 -65 92 -97 61 74 -78 -79 -9 -89 47 -52 -400 -84 51 -395 -112 221
6134 221 -63 -136 166 -62 -132 -34 162 83 38 -53 148 259 92 -232 11 90 -133 -76 -130 -194 143 -66 -10 -214
6158 -214 108 190 -108 346 437 -113 -90 134 -7 -86 -38 -137 74 340 -201 3 87 181 -231 22 -109 21 -247
6181 -247 162 227 -287 73 59 13 112 25 19 29 34 102 128 4 -81 -180 73 -31 7 92 249 59 97 107 -192 36
6207 36 -28 65 -63 -28 -204 68 -77 -183 87 19 200 -113 -133 194 290 -43 -267 -282 -157 72 -82 32 -316
6230 -316 178 -123 317 146 -32 299 -139 137 65 -215 -115 92 6 260 -42 -87 37 147 79 11 0 5 -176
6253 -176 74 3 -83 -242 -502 -200 127 193 -177 72 -117 44 -109 140 198 -98 53 193 191 158 -348 -113
6275 -113 -131 -30 -37 154 -134 34 285 81 -208 23 -154 -227 32 134 103 -319 -17 -389 -97 -207 121 90
6297 90 -172 -20 51 150 -311 -355 -125 162 -74 -55 -60 -188 304 272 -72 264 179 248 100 -92 -184 -109 150 -204
6321 -204 246 -150 4 -91 66 -319 -119 -58 213 146 50 -253 -109 191 115 -19 45 77 -59 -3 22 21 8 237
6345 237 126 -45 -172 -75 -253 -34 -17 17 37 19 7 -118 98 -179 -93 -5 66 -38 -62 -90 143 189 145 -66
6369 -66 -2 -123 17 -30 -47 -99 -182 -49 11 70 -97 -309 72 -86 153 131 -189 291 6 -13 200 79 -169
6392 -169 65 -479 98 102 305 159 -55 -204 -46 85 -148 22 -129 -156 -193 -118 35 135 198 13 -85 -140 -137
6415 -137 19 -16 85 0 -168 56 94 -498 -48 16 -114 -71 174 -198 3 93 -18 56 158 34 -54 30 -98
6438 -98 -282 242 133 79 -238 -114 47 -228 218 -185 234 3 -100 -33 -51 -5 82 125 157 158 -22 39 -20 36
6462 36 147 -202 -28 75 -75 -224 -85 159 98 -33 -323 45 40 -69 -60 -97 87 209 194 -186 -73 307 135
6485 135 -76 -149 142 -238 124 -375 -103 -81 179 -6 -67 -187 14 -71 -26 -201 -52 13 -219 46 -125 21
6507 21 -56 -19 32 94 -95 -254 198 115 -37 -29 57 -364 -186 178 151 90 34 -169 -77 93 -281 56 -69 -73 -100
6532 -100 -238 44 108 131 -80 162 -3 21 39 171 163 -119 -199 131 -14 -8 211 -102 70 300 -35 212 -125
6555 -125 -194 50 57 -40 123 139 48 -26 45 148 -42 -53 -61 -15 -239 -291 179 36 -19 -25 18 -36 -10 186 79 69 -128
6582 -128 -80 119 51 -196 -28 26 -125 186 -34 -131 195 -14 -290 162 113 66 -69 21 16 -195 109 -76 -131
6605 -131 52 -6 -60 -182 -178 -178 -127 -163 101 150 -176 422 243 247 90 -324 -2 -250 102 107 34 26 -76 -70 -129 -147 177
6632 177 -59 -171 -21 -165 -2 1 -146 105 -119 -54 -105 -60 -141 124 52 -131 83 28 5 -348 -98 136 -98
6655 -98 43 -215 -31 472 101 89 -43 -80 38 207 188 130 -110 -397 122 293 -25 48 133 -241 73 23 45
6678 45 -187 114 -94 -37 257 283 -138 52 41 -41 -134 -154 183 -281 171 -97 -121 -15 30 -43 11 96 -83 165
6702 165 119 36 137 34 -53 0 73 10 -27 -12 57 240 56 -166 -173 -101 -172 -94 160 -50 303 8 94 104 -225
6727 -225 103 91 11 46 41 17 13 39 151 -270 195 -141 94 44 -412 458 -77 83 119 92 68 69 -80 -16 -31 -179
6753 -179 152 157 -165 131 -76 64 -80 232 266 -163 -50 106 -220 45 46 -178 -95 74 13 -238 188 -55
6775 -55 73 -31 65 332 -79 74 166 84 -60 -278 236 97 -20 -43 -137 -224 11 132 141 83 -38 52 -140 30
6799 30 -37 168 -143 7 -50 -107 -19 62 -118 129 209 -29 -14 71 97 46 241 -117 -105 76 160 -130 -10 -127
6823 -127 108 143 104 223 40 220 -193 58 52 24 -396 -55 3 171 -112 317 66 36 134 -28 -191 -145 -91
6846 -91 -11 78 -66 412 -196 92 223 -10 -4 -177 -115 -22 144 5 -38 -93 -187 82 -250 -417 123 234 33
6869 33 140 152 27 -60 229 153 31 50 284 -53 -82 13 43 -85 -22 -61 -67 -6 34 265 87 -89 45 -75 -204
6894 -204 -188 371 365 182 236 71 -177 -109 -29 -270 -32 200 1 150 -73 138 198 -134 -26 -55 -103 94 137
6917 137 57 -37 -15 35 59 59 -180 -82 -6 34 44 45 -45 -189 -67 35 -75 146 235 -157 98 94 142 44 -155 147
6943 147 145 416 -225 258 174 -98 24 71 -225 -168 221 -62 48 -130 -178 54 30 -36 124 1 -226 -132 -54
6966 -54 30 75 -341 55 80 -76 118 -163 35 -74 -126 -62 -19 113 -166 -120 -4 165 -186 71 190 136 36
6989 36 32 -93 171 -14 -476 74 272 137 136 -141 50 61 25 121 -13 -1 -174 -191 -177 -13 -4 -38 -37 -28 -318 -114
7015 -114 -82 -105 43 17 109 397 -148 -77 -69 57 -143 7 -99 190 -238 179 186 200 -7 141 12 61 -275 -137
7039 -137 -18 52 102 -284 440 202 217 -58 -111 -45 233 63 -120 75 38 -141 35 -4 60 239 -155 184 -158
7062 -158 -118 -268 -162 -15 -71 -93 -150 168 -493 276 -84 -267 16 53 -206 51 248 -26 51 94 8 -131 296
7085 296 167 -268 142 -35 -5 246 68 -68 -121 179 5 -14 193 -107 -153 42 0 -32 -139 -180 -293 -359 365
7108 365 -104 -39 -228 81 179 123 131 56 32 -55 -116 203 -73 280 -12 201 -261 -43 -265 31 15 235 -35
7131 -35 -31 118 -136 -16 -3 127 296 -100 -161 -230 -94 54 -35 -225 -78 68 -83 213 182 -45 -183 -139 146
7154 146 -15 -22 -65 70 171 308 231 -60 94 -221 -45 -80 -103 -185 -34 -261 88 18 -87 183 -52 115 -63
7177 -63 47 167 72 -194 -106 72 -12 -1 161 -7 -127 -65 118 10 -46 -86 -61 -56 2 136 3 164 34 42 -149
7202 -149 -267 -79 74 -111 -39 38 6 4 61 43 -100 87 30 -111 -31 45 -45 37 -57 49 -144 191 -181 -9
7226 -9 -6 -194 -20 400 -26 180 -46 141 -224 -264 -190 -279 -36 -83 71 -82 226 -68 168 138 -13 113 14
7249 14 175 -72 -261 -337 238 179 0 282 -179 15 65 78 -8 63 -78 166 -11 -69 99 -131 195 -26 124
7272 124 -80 -6 34 8 110 218 -207 122 3 -278 127 38 -186 66 -66 144 172 189 -227 93 -229 146
7294 146 67 11 -4 -89 -174 66 -111 49 140 120 -362 -1 65 179 -92 32 26 157 -224 16 -129 177 1
7317 1 -226 75 -96 -14 99 -12 69 378 -263 198 45 80 87 -67 -186 -244 7 35 182 -7 12 -72 6 -37
7341 -37 161 280 -132 -389 56 5 88 2 37 -81 158 230 87 -54 -26 -33 292 214 102 203 54 186 84
7364 84 -113 97 -135 58 6 -262 -111 -175 248 -97 -95 -136 -63 -70 196 -129 70 -117 64 66 -237 132 47 211
7388 211 44 66 -16 189 309 -171 -152 77 -23 -115 -154 -175 -131 -41 -191 -54 85 86 -138 356 23 130 -5
7411 -5 -28 178 -7 16 270 36 -141 92 166 16 45 -92 5 149 55 205 41 -53 -147 -23 -83 -140 -261 -55
7435 -55 -96 -179 -301 51 17 19 211 -12 -7 -20 -75 233 80 70 -46 98 -22 189 -12 -82 170 -149 -191 -108 226
7460 226 -6 -3 -132 34 -43 136 84 55 2 209 -189 -37 70 7 -80 298 -97 -144 -10 -248 140 203 121 26
7484 26 270 -126 -30 113 151 -16 156 -218 -181 72 -20 -181 -180 -88 175 147 10 -5 195 -31 194 286 -181 -89
7508 -89 -159 34 76 -17 131 -97 -291 266 -11 140 343 -255 -93 -126 -49 -134 -265 -163 18 -40 64 -50 28
7531 28 -55 31 -298 52 -129 -10 74 -202 -107 -54 -12 -83 -65 294 -18 109 -57 151 -57 -60 -134 -21 240 126
7555 126 37 -160 4 -60 179 -88 -67 234 6 -18 169 -26 4 -135 -40 -149 -16 214 -174 2 81 -15 120
7578 120 76 -9 112 131 -170 -3 -109 145 -59 97 -73 -6 -52 -3 -188 177 -68 -176 -23 169 217 -31
7600 -31 -487 -31 4 -10 -150 89 -14 -57 145 -129 86 -4 7 -140 127 71 -44 -49 94 82 131 -187 -183 90
7624 90 -34 162 207 -52 -252 -120 100 -66 169 153 1 7 -172 -138 108 -78 312 -171 -154 -55 -6 176 -18
7647 -18 175 -289 91 228 84 -121 22 98 104 -282 115 -71 41 196 -51 37 -114 -2 -209 192 -92 7
7669 7 153 -67 -86 188 28 -246 -15 95 -226 -57 31 201 -9 -44 229 155 35 109 -189 26 104 257 -81
7692 -81 128 148 209 -53 71 -195 157 205 -92 -69 -327 117 168 -130 -144 52 229 32 -123 100 -122 45
7714 45 -51 -87 -77 432 40 -69 62 -90 108 -117 170 151 -19 83 96 2 -63 196 169 62 -237 6 79
7737 79 265 -35 -64 92 -161 -64 37 -164 56 361 131 -33 59 98 -20 208 -22 102 -341 38 79 43
7759 43 -31 120 9 -34 -51 -183 68 -140 -27 133 15 44 -294 45 173 -129 106 -234 233 -68 -116 -199
7781 -199 22 128 295 156 58 -34 -138 -40 -138 162 186 194 -57 67 94 -71 -248 150 -327 -177 154 132 325
7804 325 174 38 611 119 -199 -237 -134 47 18 -117 -25 -134 247 -177 176 192 -57 -32 27 -194 -52 -13
7826 -13 57 34 -32 -282 5 -14 41 49 57 -58 -76 110 65 147 -42 46 -50 0 -117 -12 -155 36 -67 71 126 -262
7852 -262 7 -137 -174 248 244 268 -186 -34 211 4 -44 -110 297 243 9 16 -139 243 315 -39 -128 6 107 188
7876 188 -12 -70 251 -40 122 67 81 127 197 -221 -68 -75 -45 115 42 135 -59 249 -41 -173 -71 148 -42
7899 -42 156 -59 -83 -122 86 15 67 -183 -40 12 288 -122 -95 186 -42 -66 170 22 -146 -102 88 -153 -274
7922 -274 -72 -148 -131 -19 29 38 -55 156 240 -22 113 33 74 164 104 53 -101 -118 -94 141 53 37 32 78 -310 307
7948 307 -311 -58 -3 -73 -146 34 26 141 -108 -128 -4 -158 -16 43 109 -52 -345 -60 96 -47 -63 268 69
7971 69 -211 123 70 141 -75 223 115 55 139 -3 22 -28 39 59 -43 282 -74 93 -59 -209 160 269 -25
7994 -25 -221 1 87 -454 32 129 -124 120 -32 8 64 31 86 -35 -365 -9 -115 -104 -35 -14 47 373 84 8
8018 8 -431 -56 -26 63 -118 8 85 206 130 2 -73 -116 172 18 -258 -140 -90 -292 34 20 -244 216 -61
8041 -61 -5 -90 9 80 239 -126 -17 181 201 -55 123 212 18 173 -59 -22 16 -77 -64 102 59 44 -34 86 51
8066 51 87 -121 -51 15 58 -101 121 -127 158 -66 -64 -51 -590 88 -192 53 183 -283 11 162 -1 79 -72
8089 -72 60 -71 -95 119 196 -34 131 51 69 217 62 7 16 265 -97 -104 80 -8 -215 103 41 296 143 -135
8113 -135 -17 1 -24 -5 -101 56 -152 124 -178 -23 175 84 50 -214 -59 -240 -361 216 234 191 215 -65 -112
8136 -112 -32 95 68 234 -76 177 33 -107 51 72 -30 -214 150 154 255 -101 94 19 -138 99 -135 78
8158 78 87 186 25 49 -18 83 86 -203 95 -74 277 -382 179 117 168 115 -51 -153 186 -114 192 147 80 66 -17
8183 -17 1 -163 6 -66 210 -109 -82 134
8191A34
##END NTUPLES=NMR FID
##END=
