##TITLE=1H_Ser 5232-H
 CDCl3
 8 sc, 
 11.9.2024
##JCAMPDX= 6.0         $$ Bruker NMR JCAMP-DX V2.0
##DATA TYPE= NMR FID
##DATA CLASS= NTUPLES
##ORIGIN= UXNMR, Bruker Analytische Messtechnik GmbH
##OWNER= root
$$ XWIN-NMR		Version 3.5
$$ Wed Sep 11 15:47:14 2024 Russian Standard Time (UT+4h)  she@DPX200
##.OBSERVE FREQUENCY= 200.1318
##.OBSERVE NUCLEUS= ^1H
##.DELAY= (6, 6)
##.ACQUISITION MODE= SIMULTANEOUS
##.ACQUISITION SCHEME= undefined
##.AVERAGES= 8
##.DIGITISER RES= 18
##SPECTROMETER/DATA SYSTEM= spect
##.PULSE SEQUENCE= zg30
##.SOLVENT NAME= CDCl3
##.SHIFT REFERENCE= (INTERNAL, CDCl3, 0, 15.7039)
##AUDIT TRAIL= $$ (NUMBER, WHEN, WHO, WHERE, WHAT)
$$ ##TITLE= Audit trail, XWIN-NMR		Version 3.5
$$ ##JCAMPDX= 5.01
$$ ##ORIGIN= Bruker BioSpin GmbH
$$ ##OWNER= she
$$ F:/spectra/data/she/nmr/H-F/1/audita.txt
$$ ##AUDIT TRAIL=  $$ (NUMBER, WHEN, WHO, WHERE, WHAT)
(   1,<2024-09-11 15:46:07.29 +0400>,<she>,<DPX200>,
      <created by zg, POWCHK disabled, PULCHK disabled
       configuration hash MD5:
       00 E9 B6 7A A2 85 ED C7 34 08 36 98 17 FE 4E 26
       data hash MD5: 16K
       9A 2E F4 FB C3 19 4A CC 8A AF 60 41 90 99 D2 E7>)
$$ ##END=
$$ 
$$ hash MD5
$$ DE 7D 49 FE C5 E7 91 5A 8A 49 FB B4 20 E4 DF 26
##$RELAX= 
##$RELAX= 
##$RELAX= 
##$RELAX= 
##$RELAX= 
##$RELAX= 
$$ Bruker specific parameters
$$ --------------------------
##$DU= <F:/spectra>
##$EXPNO= 1
##$NAME= <H-F>
##$PROCNO= 1
##$TYPE= <nmr>
##$USER= <she>
##$AMP= (0..31)
100 100 100 100 100 100 100 100 100 100 100 100 100 100 100 100 100 100 
100 100 100 100 100 100 100 100 100 100 100 100 100 100 
##$AQSEQ= 0
##$AQ_mod= 1
##$AUNM= <au_zg>
##$AUTOPOS= <>
##$BF1= 200.13
##$BF2= 200.13
##$BF3= 200.13
##$BF4= 200.13
##$BF5= 200.13
##$BF6= 200.13
##$BF7= 200.13
##$BF8= 200.13
##$BYTORDA= 1
##$CFDGTYP= 0
##$CFRGTYP= 5
##$CHEMSTR= <none>
##$CNST= (0..31)
1 1 145 1 1 1 1 1 1 1 1 1 1 1 1 1 1 1 1 1 1 1 1 1 1 1 1 1 1 1 1 1 
##$CPDPRG= <>
##$CPDPRG1= <>
##$CPDPRG2= <>
##$CPDPRG3= <>
##$CPDPRG4= <mlev>
##$CPDPRG5= <mlev>
##$CPDPRG6= <mlev>
##$CPDPRG7= <mlev>
##$CPDPRG8= <mlev>
##$CPDPRGB= <>
##$CPDPRGT= <>
##$D= (0..31)
0 1.2 0 0 0 0 0 0 0 0.06 0 0.03 0 0 0 0 0.0002 0 0 0 0 0 0 0 0 0 0 0 0 
0 0 0 
##$DATE= 1726055166
##$DBL= (0..7)
120 120 120 120 120 120 120 120 
##$DBP= (0..7)
150 150 150 150 150 150 150 150 
##$DBP07= 0
##$DBPNAM0= <>
##$DBPNAM1= <>
##$DBPNAM2= <>
##$DBPNAM3= <>
##$DBPNAM4= <>
##$DBPNAM5= <>
##$DBPNAM6= <>
##$DBPNAM7= <>
##$DBPOAL= (0..7)
0.5 0.5 0.5 0.5 0.5 0.5 0.5 0.5 
##$DBPOFFS= (0..7)
0 0 0 0 0 0 0 0 
##$DE= 6
##$DECBNUC= <off>
##$DECIM= 24
##$DECNUC= <off>
##$DECSTAT= 4
##$DIGMOD= 1
##$DIGTYP= 9
##$DL= (0..7)
0 120 120 120 120 120 120 120 
##$DP= (0..7)
150 150 150 150 150 150 150 150 
##$DP07= 0
##$DPNAME0= <>
##$DPNAME1= <>
##$DPNAME2= <>
##$DPNAME3= <>
##$DPNAME4= <>
##$DPNAME5= <>
##$DPNAME6= <>
##$DPNAME7= <>
##$DPOAL= (0..7)
0.5 0.5 0.5 0.5 0.5 0.5 0.5 0.5 
##$DPOFFS= (0..7)
0 0 0 0 0 0 0 0 
##$DQDMODE= 0
##$DR= 18
##$DS= 0
##$DSLIST= <SSSSSSSSSSSSSSS>
$$ [...]
##$SUBNAM2= <"">
##$SUBNAM3= <"">
##$SUBNAM4= <"">
##$SUBNAM5= <"">
##$SUBNAM6= <"">
##$SUBNAM7= <"">
##$SUBNAM8= <"">
##$SUBNAM9= <"">
##$SW= 24.0689170037331
##$SWIBOX= (0..15)
0 0 2 0 0 0 0 0 0 0 0 0 0 0 0 0 
##$SW_h= 4816.95568400771
##$TD= 16384
##$TD0= 1
##$TE= 0
##$TE2= 300
##$TE3= 300
##$TEG= 300
##$TL= (0..7)
0 120 120 120 120 120 120 120 
##$TP= (0..7)
150 150 150 150 150 150 150 150 
##$TP07= 0
##$TPNAME0= <>
##$TPNAME1= <>
##$TPNAME2= <>
##$TPNAME3= <>
##$TPNAME4= <>
##$TPNAME5= <>
##$TPNAME6= <>
##$TPNAME7= <>
##$TPOAL= (0..7)
0.5 0.5 0.5 0.5 0.5 0.5 0.5 0.5 
##$TPOFFS= (0..7)
0 0 0 0 0 0 0 0 
##$TUNHIN= 0
##$TUNHOUT= 0
##$TUNXOUT= 0
##$USERA1= <user>
##$USERA2= <user>
##$USERA3= <user>
##$USERA4= <user>
##$USERA5= <user>
##$V9= 5
##$VALIST= <valist>
##$VCLIST= <CCCCCCCCCCCCCCC>
##$VD= 0
##$VDLIST= <DDDDDDDDDDDDDDD>
##$VPLIST= <PPPPPPPPPPPPPPP>
##$VTLIST= <TTTTTTTTTTTTTTT>
##$WBST= 1024
##$WBSW= 4
##$XGAIN= (0..3)
0 0 0 0 
##$XL= 0
##$YL= 0
##$YMAX_a= 251202
##$YMIN_a= -133116
##$ZGOPTNS= <>
##$ZL1= 120
##$ZL2= 120
##$ZL3= 120
##$ZL4= 120
##$ABSF1= 10
##$ABSF2= 0
##$ABSG= 5
##$ABSL= 3
##$ALPHA= 0
##$AQORDER= 0
##$ASSFAC= 0
##$ASSFACI= 0
##$ASSFACX= 0
##$ASSWID= 0
##$AUNMP= <proc_1d>
##$AZFE= 0.1
##$AZFW= 0.1
##$BCFW= 1
##$BC_mod= 2
##$BYTORDP= 1
##$COROFFS= 0
##$CY= 11.3945322036743
##$DATMOD= 1
##$DC= 2
##$DFILT= <>
##$DTYPP= 0
##$F1P= 15.6554695791079
##$F2P= 12.8336369535428
##$FCOR= 0.5
##$FTSIZE= 0
##$FT_mod= 4
##$GAMMA= 1
##$GB= 0.15
##$INTBC= 1
##$INTSCL= 1
##$ISEN= 128
##$LB= 0.24
##$LEV0= 0
##$LPBIN= 0
##$MAXI= 10000
##$MC2= 0
##$MEAN= 0
##$ME_mod= 0
##$MI= 1.114404
##$NCOEF= 0
##$NC_proc= 0
##$NLEV= 6
##$NOISF1= 3.799351
##$NOISF2= 2.8
##$NSP= 1
##$NTH_PI= 0
##$NZP= 0
##$OFFSET= 15.70392
##$PC= 1
##$PHC0= -26001.24
##$PHC1= 23.98748
##$PH_mod= 1
##$PKNL= yes
##$PPARMOD= 0
##$PSCAL= 0
##$PSIGN= 0
##$REVERSE= no
##$SF= 200.130013532006
##$SI= 16384
##$SIGF1= 3
##$SIGF2= 2
##$SINO= 400
##$SIOLD= 16384
##$SREGLST= <1H.CDCl3>
##$SSB= 0
##$STSI= 0
##$STSR= 0
##$SW_p= 3612.71676300578
##$SYMM= 0
##$S_DEV= 0
##$TDeff= 0
##$TDoff= 0
##$TI= <>
##$TILT= no
##$TM1= 0
##$TM2= 0
##$TOPLEV= 0
##$USERP1= <user>
##$USERP2= <user>
##$USERP3= <user>
##$USERP4= <user>
##$USERP5= <user>
##$WDW= 1
##$XDIM= 8192
##$YMAX_p= 0
##$YMIN_p= 0
$$ End of Bruker specific parameters
$$ ---------------------------------
##NTUPLES= NMR FID
##VAR_NAME=  TIME,          FID/REAL,        FID/IMAG
##SYMBOL=    X,             R,               I
##VAR_TYPE=  INDEPENDENT,   DEPENDENT,       DEPENDENT
##VAR_FORM=  AFFN,          ASDF,            ASDF
##VAR_DIM=   8192,          8192,            8192
##UNITS=     SECONDS,       ARBITRARY UNITS, ARBITRARY UNITS
##FACTOR=    0.0002076,     1,               1
##FIRST=     0,             0,               0
##LAST=      1.7004516,     0,               0
##MIN=       0,             -133116,         0
##MAX=       1.7004516,     251202,          0
$$ Real data points
##PAGE= N=1
##DATA TABLE= (X++(R..R)), XYDATA
0 0 0 0 0 0 0 0 0 0 0 8 -8 8 -8 8 -16 16 -17 24 -27 32 -40 43 -51 59 -67 77 -89 100 -115 130 -146 164 -183
33 -183 205 -229 254 -284 314 -348 388 -429 475 -526 582 -646 717 -795 888 -989 1113 -1255
51 -1255 1428 -1640 1906 -2256 2736 -3444 4589 -6759 12394 -61495 -117957 -18097 61886 131874
65 131874 141093 113139 52102 12327 6324 42372 76997 84402 41129 -27329 -89805 -102677 -61176
78 -61176 13970 76318 95349 63116 10760 -24691 -15143 30724 81110 95349 57055 -18477
90 -18477 -91184 -122985 -99927 -42566 10515 25870 -1494 -48405 -77087 -62813 -9655 52599
102 52599 86163 70464 15530 -47106 -81536 -72269 -31754 9330 21952 -1802 -44777 -75690
114 -75690 -69631 -24286 39773 90791 105633 83789 44631 14525 11012 32874 59645 70031
126 70031 52005 10520 -33816 -60620 -58601 -33044 -618 19845 20714 4155 -16044 -26390 -20805
139 -20805 -3472 15409 23140 14605 -7561 -33499 -52503 -57030 -46239 -26738 -6894 4699 5422
152 5422 -2316 -10754 -12468 -3931 12478 29205 36774 29215 8878 -15902 -33172 -33554 -16859 7660
166 7660 27221 32251 21870 5282 -4461 2261 24578 50124 63991 56971 29654 -4337 -29031
179 -29031 -34008 -19593 1028 13289 7047 -13235 -36042 -46321 -37443 -13222 12447 25439 18515
192 18515 -2571 -25609 -37612 -33842 -17083 106 8443 3808 -9140 -21383 -24265 -14430 3360
205 3360 21135 31172 30422 20957 8750 -327 -2236 1819 9551 15155 15972 9982 773 -8665 -12397
220 -12397 -7528 4236 18268 27119 26686 15265 145 -11403 -12614 -3099 9708 16655 11162 -6535
234 -6535 -27598 -39981 -36218 -18603 2502 14629 10821 -6252 -23784 -30453 -20308 1634 22067
247 22067 28367 16364 -6384 -26013 -29773 -16132 6898 24629 27059 13758 -5129 -16437 -11450
260 -11450 7121 28370 39064 32815 13080 -7872 -18711 -14506 81 13749 17481 8164 -8365
273 -8365 -21233 -22658 -11203 5818 18764 20184 10558 -3528 -14076 -15621 -9206 -456 3660 110
287 110 -9200 -19048 -23155 -19322 -9004 1825 8813 9220 5423 543 -1493 142 4331 8325 9861
302 9861 6965 2133 -2568 -5237 -4789 -1965 2205 5821 8283 8027 6992 5504 4530 4215 4954 6065
318 6065 6608 4630 861 -4183 -8192 -10170 -8798 -5441 -1542 456 -996 -4803 -8134 -8854 -5892 -13
334 -13 5516 8032 5424 -793 -7085 -9839 -7228 -1639 3861 5810 2077 -4464 -9813 -9627 -3620 5731
350 5731 12631 14076 9012 1892 -3705 -3233 2608 10056 13451 10378 1942 -7818 -12642 -10218 -2865
365 -2865 5048 8634 5781 -951 -6739 -7309 -3014 3960 9021 8141 2564 -5690 -10772 -10215 -5502 784
381 784 3983 1953 -2729 -6969 -7704 -4581 1135 5450 7068 4039 259 -2330 -2484 -271 2574 4221
397 4221 3063 378 -1302 -1577 -127 2486 3752 3434 1483 -700 -1361 -631 757 1545 1225 464 -921
414 -921 -1119 -199 1454 1653 1303 -355 -2312 -3235 -2232 -752 744 690 -713 -2532 -3973 -3008 -1116
431 -1116 1713 2898 3097 826 -725 -1796 -680 909 2134 2315 800 -1074 -2461 -2422 -811 1867
447 1867 2687 2615 807 -1058 -1962 -1129 70 1760 2385 1338 -519 -1423 -1474 -115 1553 1697 469 -1153
465 -1153 -2380 -1989 -592 632 1328 121 -1333 -2815 -1968 360 2533 3689 2957 37 -2547 -2598 -665
482 -665 2151 3969 2492 -1136 -5201 -6353 -3854 780 5359 5978 3086 -1688 -5089 -4347 -34 5001
498 5001 7314 4841 -552 -6386 -8087 -5007 701 5639 6371 1889 -3338 -7421 -5889 -62 5830
513 5830 8437 6020 -357 -5792 -7218 -3326 2305 6314 5946 1139 -4336 -7193 -5161 77 5231
528 5231 6606 2975 -1832 -5859 -5267 -807 4026 6576 4240 -363 -4980 -5301 -2426 2211 5147 4386
544 4386 -239 -4276 -6130 -3585 1323 4808 5122 1630 -2225 -4764 -3217 1196 4762 5551 1959 -2849
560 -2849 -6096 -5200 -947 3564 5654 3067 -1883 -5213 -5320 -1148 4463 7335 5704 -208 -6039 -7931
576 -7931 -4912 1444 6451 6859 1621 -5547 -9703 -8039 -645 7443 11353 8577 808 -7270 -10102
591 -10102 -5899 2846 10342 11478 5070 -4992 -12343 -12296 -4284 5933 12185 11029 2499 -7308 -13118
606 -13118 -10351 -863 9521 14131 10016 -187 -10302 -14203 -9142 1025 9922 12486 7011 -3013
620 -3013 -11181 -12654 -6585 2864 9961 10937 4580 -3685 -9727 -9786 -3663 3933 9226 8868 3874 -3075
636 -3075 -7277 -7261 -2279 3439 7410 7559 3811 -737 -4198 -4760 -2589 974 3943 5092 3098 42
652 42 -3365 -5605 -4988 -2925 486 3087 3313 1228 -3060 -6389 -6682 -3884 1165 5427 6786 4223
668 4223 -400 -4629 -5738 -2802 2162 7101 7833 4248 -1915 -6691 -7878 -4792 463 4715 5759
683 5759 2434 -2080 -4845 -4246 -148 4803 8149 8285 5036 799 -2330 -3019 -1279 1063 2489 1693
699 1693 -616 -3923 -5897 -6236 -4509 -2223 510 2360 2550 1170 -668 -2900 -2959 -1942 212 2129
715 2129 2354 202 -2675 -5609 -5837 -2757 1933 6292 7605 5646 1642 -1417 -1603 1298 6274 8434
731 8434 7145 1469 -4971 -9701 -9186 -4373 2109 5248 3679 -1184 -6200 -6658 -2383 5489 11308 12311
747 12311 6992 -821 -7201 -8229 -3902 2266 5747 3058 -3997 -11985 -15300 -12701 -4281 4511 8577
762 8577 6695 203 -5884 -7283 -2350 5738 12102 12602 6828 -1652 -8477 -8672 -3191 4895 10274 10041
778 10041 4015 -3345 -7339 -5791 524 7691 11342 8729 1712 -5669 -9788 -8384 -3233 2281 4508
793 4508 2232 -2894 -7979 -9023 -5799 32 4944 7121 5589 1587 -2569 -4609 -2979 -657 1455
808 1455 2320 766 -2321 -5513 -6629 -6105 -3871 -707 2119 3710 3834 3002 1435 1059 1689 4103 7009
825 7009 8857 8629 5651 1200 -2599 -4353 -2615 1236 4181 4219 916 -4110 -8408 -8965 -5373 576
841 576 5231 5610 1592 -4719 -9067 -9357 -4273 2308 6457 5693 568 -5502 -9246 -7631 -2015 5256
857 5256 9271 8017 2620 -3710 -6554 -4668 811 6489 8422 6245 108 -5362 -7359 -4298 822
872 822 6421 8230 6321 1810 -2302 -3028 -365 4429 7913 8183 5291 -170 -4885 -6864 -5633 -2832
888 -2832 2 524 -1474 -4936 -7728 -8198 -5985 -1699 1976 3288 2136 -402 -2718 -3817 -2560 620
904 620 3300 4143 2865 188 -2471 -3269 -1664 1670 4902 6340 5273 2769 73 -1393 -759 1403
920 1403 3756 4601 2761 -51 -3066 -4478 -3338 -436 2059 3552 3130 823 -1844 -3077 -2689 -138
936 -138 2639 3070 1303 -2190 -6023 -7601 -6924 -4561 -1171 838 454 -2292 -4180 -4529 -2882 1107
952 1107 4929 6522 5625 2223 -825 -2379 -1129 1910 4916 5681 3606 54 -3052 -4003 -1076 2684
968 2684 5911 6291 3847 103 -2756 -3530 -1735 1263 2885 2439 -371 -3712 -5578 -5547 -2868 5
984 5 2219 2169 -3 -2417 -3954 -3076 -1243 931 2464 2065 -206 -2366 -3610 -3253 -1528 219 2006
1001 2006 2654 1503 240 -365 -402 763 2364 3844 4335 3474 1551 56 -696 -280 1065 2297 2950
1018 2950 1768 -105 -1922 -2898 -2194 -239 1689 1813 1065 -1176 -3390 -4510 -3422 -1238 865 1485
1034 1485 465 -1654 -3039 -3346 -2127 471 2202 2400 1001 -993 -2768 -3110 -1552 1069 2562 2934
1050 2934 1874 -448 -1859 -1286 276 2786 4155 4265 2740 505 -1378 -1221 -59 1415 2416 1944
1066 1944 149 -2120 -3041 -2344 -850 1240 2061 1518 -4 -1676 -2530 -2098 -821 668 654 89 -1670
1083 -1670 -2936 -3518 -2642 -1390 281 851 715 96 -488 -71 252 1256 1770 1633 1472 266 -6 263
1101 263 -46 -391 214 586 778 1126 817 166 404 663 341 1161 1702 1654 897 -214 -1341 -2392 -1544
1120 -1544 -987 -7 106 -756 -1722 -2582 -2263 -1261 495 1249 1123 453 -1265 -1925 -1334 -314 1240 1953
1138 1953 1238 38 -1820 -2015 -779 786 2429 2416 1316 217 -744 -714 649 1786 2592 2470 806
1155 806 -306 -1256 -617 161 1116 1216 493 -701 -1200 -1549 -834 -111 329 187 -61 -818 -1002 -840 -729
1174 -729 -356 -91 131 -401 -527 -763 -640 -509 -315 -121 223 339 251 178 247 247 59 864 1257 1351 1235 536
1196 536 258 -114 210 636 892 661 122 -363 -804 -504 -307 113 705 549 -157 -312 -383 -512 -185 84
1216 84 288 -385 -909 -1122 -1476 -765 -490 -451 -338 -518 -480 -488 288 711 970 795 288 -369 -472 -258 632 355
1238 355 833 295 -623 -932 -234 626 1482 1962 1511 305 -631 -978 -216 785 1695 1695 124 -1155 -2000
1257 -2000 -2153 -1002 556 1431 1197 3 -1618 -2187 -1758 449 2020 1951 1357 -819 -2549 -2636 -1437
1274 -1437 257 1961 1809 297 -1352 -2474 -2232 -578 1619 3183 2511 1073 -801 -1884 -1291 475
1290 475 2309 2578 1233 -331 -1896 -2352 -1039 401 1798 1660 740 -662 -1297 -882 86 983 1111
1307 1111 917 173 -559 -1115 -648 -325 94 -282 -704 -1002 -741 194 422 624 -250 -50 -183 -73 1164
1326 1164 1247 1106 404 -1103 -1380 -953 222 1183 1466 616 -1035 -1846 -1425 4 1551 2591 1980 1097
1344 1097 -709 -1724 -1484 186 1521 2306 1195 -422 -2335 -2448 -1626 12 1775 1695 182 -1419
1360 -1419 -2309 -2202 -1035 1051 2448 2233 593 -1326 -2275 -2004 -77 1332 2227 2047 17 -1720 -2084
1377 -2084 -1591 265 1706 2263 1276 -319 -1375 -2060 -1109 628 2466 2251 1290 -507 -1712 -1416 -521
1394 -521 1051 1902 1682 710 -1126 -2044 -1875 -432 629 1362 1287 342 -969 -1806 -975 17 1164 1545
1412 1545 843 -144 -1435 -2079 -1674 -811 226 634 759 562 -465 -436 -372 574 1466 1779 1971 1509 276
1431 276 -596 -1022 -690 -322 158 206 -294 -1170 -1734 -1946 -1253 286 1846 2531 2297 958 -517 -1022 -561
1450 -561 521 1600 1781 770 -938 -2592 -3397 -2524 -667 1193 1644 1284 -360 -1388 -1816 -671 1167
1467 1167 2790 2547 1471 -931 -2504 -2692 -1786 53 1584 2050 899 -615 -1329 -1348 -137 1596 3059
1484 3059 3313 1762 -170 -1613 -2226 -1862 -528 566 382 -335 -2014 -2996 -2916 -1116 735 2388 2803
1501 2803 1754 298 -580 -1136 -297 1020 1918 1691 341 -1409 -3141 -3096 -1815 -312 1432 1559 736
1518 736 -520 -1803 -1195 -209 1498 2384 2369 1329 -417 -1589 -1811 -767 156 1651 1689 685 -556
1535 -556 -1587 -1318 -667 932 1570 1727 722 -846 -2079 -2395 -1351 -369 512 968 -39 -1196 -1807
1552 -1807 -1949 -921 913 1948 2497 1341 629 -533 -1221 -440 631 1688 1473 405 -1319 -2296 -2336
1569 -2336 -1193 311 1109 1737 635 -358 -1189 -1005 -266 1174 2458 2212 1469 21 -1409 -1511 -553
1586 -553 224 1257 891 377 -1179 -1989 -1890 -1238 213 1319 1302 517 -693 -1717 -1901 -937 34 773 1684
1605 1684 588 -774 -1711 -1434 -710 1081 2016 2202 1864 386 -775 -1066 -487 669 1896 1975 349
1622 349 -1069 -2305 -3024 -1641 -41 1551 1568 617 -895 -1914 -1386 138 1827 3034 2720 970 -683
1639 -683 -2088 -2017 -1202 693 1089 803 -813 -2213 -2636 -2071 -600 1552 2017 1545 665 -656 -1393 -907
1657 -907 394 1696 2134 1475 -266 -1752 -1451 -1365 66 1238 2151 1624 531 -173 -340 -289 474 1337
1675 1337 1651 918 -769 -1770 -2403 -1691 -844 92 632 419 -485 -670 -705 -239 642 1683 1904 1322 605
1694 605 -583 -1254 -1446 -919 -744 -4 34 -475 -1437 -1171 -995 113 1079 1775 1757 1144 478 -263 -229 111
1714 111 952 1197 727 -41 -876 -1320 -1664 -546 736 1187 1432 641 -5 -1130 -1030 -356 360 1081 702
1733 702 -126 -1519 -2324 -1975 -948 369 1206 1282 136 -598 -1068 -708 454 1177 1692 1212 -135 -1131
1751 -1131 -1650 -1134 -10 852 956 468 -611 -787 -783 -158 762 1329 1279 561 38 -693 -983 -556 363 344
1771 344 124 207 -400 -634 -137 -263 117 415 644 655 15 -462 -768 -1199 -786 -430 -101 28 163 -170 -495
1792 -495 -401 -40 767 1473 1449 981 91 -541 -810 -476 265 659 690 31 -808 -1228 -1390 -350 736 1358
1812 1358 1476 806 47 -986 -1117 -23 1340 1114 931 -411 -1561 -1787 -1575 -468 496 1101 906 -38
1830 -38 -837 -976 -514 645 1354 1543 531 -342 -1490 -1605 -1179 311 718 944 256 -514 -1210 -823 39
1849 39 1071 1898 1110 537 -322 -711 -712 -103 134 455 -15 -707 -1090 -1181 -739 212 827 727 607 159 -280
1870 -280 -32 -98 485 533 254 -630 -653 -601 -297 -91 -222 -114 -135 -283 78 460 824 615 559 -64 -54 -174
1892 -174 -259 192 188 -87 -731 -553 -674 -51 379 405 791 252 -194 -311 191 316 909 555 151 -670 -819
1913 -819 -787 -469 55 110 136 -157 -394 -460 -211 559 933 917 490 -303 -771 -964 -230 -87 61 272 -376 -633
1935 -633 -498 -502 43 379 557 554 309 65 -81 50 -14 -112 49 -291 -408 -558 -195 -193 126 115 402 31 238
1958 238 242 218 169 431 -23 285 -179 -470 -138 -224 -462 51 -32 -71 32 340 -124 -10 586 818 186 349
1980 349 -309 -312 -376 -208 -339 4 -354 -166 -303 -269 -76 235 191 377 310 -183 -275 -476 67 190 79 38 -405
2003 -405 -547 -327 -485 284 766 539 -9 417 -132 -137 297 256 345 54 -265 -585 -497 -294 169 487 539 73
2025 73 392 -195 -73 343 410 273 431 -183 -396 -883 -776 -413 -147 102 189 -93 -380 -192 308 434 654
2046 654 608 402 37 22 -548 -111 -42 -54 188 -62 -424 -355 -373 -33 359 348 437 292 212 -234 28 -147 171
2069 171 97 -157 15 -482 -359 -305 19 -216 178 164 146 209 85 386 80 237 373 6 244 -52 -142 -47
2091 -47 -599 -441 -236 -167 300 212 60 146 -201 -196 -43 68 928 784 225 -306 -658 -319 -222 381 568 598 -135
2114 -135 -759 -791 -405 544 854 1413 126 -329 -884 -986 -391 681 1505 855 259 -684 -1256 -957 -223 825
2134 825 942 565 59 -735 -1418 -986 -226 389 998 766 219 -625 -894 -620 90 959 1040 502 -368 -1122
2154 -1122 -1013 -817 73 721 836 357 -395 -497 -663 -454 417 972 867 600 -55 -407 -927 -472 -298 462
2174 462 204 -72 -240 -517 -336 -442 962 1076 1053 259 82 -433 -627 -163 -25 72 120 -196 -394 -789 -800
2195 -800 -254 89 428 471 390 335 -29 80 325 343 37 150 46 -274 -117 -581 -350 -125 -27 216 562 658
2217 658 261 79 -237 -211 -181 287 125 384 232 -488 -913 -544 -372 201 827 593 5 -522 -315 -85 381
2238 381 1120 1224 377 103 -1010 -1059 -687 -183 467 773 282 -544 -846 -971 -321 535 1444 1102 162 -528
2258 -528 -922 -905 -131 925 1220 732 -36 -1050 -1388 -1012 -280 557 851 740 -51 -609 -988 -900 105 1005
2278 1005 1065 838 -415 -1113 -1268 -436 385 931 1080 653 -324 -853 -700 -186 956 1009 675 123 -518 -849
2298 -849 -1246 -314 469 734 636 135 -414 -739 -624 -297 622 745 646 329 -122 -209 -166 372 591 577 451 -45
2320 -45 -154 -727 -436 -435 -299 -144 -183 -63 -461 -370 -211 -410 67 647 945 741 467 -170 -561 -587 -86 6
2342 6 365 365 228 -945 -917 -610 -86 987 970 722 326 -68 -913 -764 74 551 785 226 -653 -1052 -1064 -612
2364 -612 297 894 916 660 401 -308 -73 172 679 926 643 0 -488 -876 -924 -802 -221 175 -37 136 -155
2385 -155 -279 -201 65 676 761 787 496 157 -191 -24 -190 -233 180 2 193 -238 -596 -590 -152 93 219 550
2407 550 598 372 1 -160 -141 -77 251 568 529 253 -489 -839 -749 -115 503 772 699 414 -246 -595 -383 152
2429 152 366 632 426 -132 -895 -1214 -918 -185 211 331 516 -37 -496 -773 30 385 742 834 626 -537
2449 -537 -383 -781 -565 -64 707 539 312 -325 -544 -627 -330 74 591 416 125 -284 -798 -367 -210 287
2469 287 787 914 431 104 -536 -478 -237 372 739 486 271 -804 -676 -711 -407 194 579 408 234 -172
2489 -172 -821 -350 47 99 447 210 154 -311 -594 -446 -550 496 126 337 239 -507 -479 -431 -293 181 516
2510 516 349 -284 -139 -332 -249 -251 -91 610 135 138 -173 -151 -515 -69 436 222 399 -74 45 -575 -174 -79
2532 -79 118 400 314 -194 -489 -165 -70 -71 -219 332 81 182 0 28 -116 -489 -181 289 150 21 204 127
2554 127 -65 -221 -326 18 123 -138 61 -83 104 90 -78 192 373 107 43 -239 -66 127 -151 324 152
2575 152 245 65 -155 56 -106 300 99 137 247 -46 -381 -157 -50 340 401 19 -93 -456 -540 -270 -231 115
2597 115 348 135 -66 -530 -723 -653 158 185 231 139 -183 -2 1 113 204 564 670 129 -202 -284 -250 173 247
2620 247 399 127 -124 94 174 59 -68 574 87 283 17 -71 13 -115 -360 205 127 83 213 -234 -282 -129
2642 -129 -239 -291 117 -231 265 -77 -456 -240 -149 -60 -12 59 152 27 79 72 -88 -54 317 504 359 358 -108 -149
2666 -149 -157 71 244 159 482 416 -39 -274 -17 -225 178 -108 186 225 -108 -279 -373 -93 65 128 461 89
2688 89 -169 -38 -495 -230 -388 84 -109 26 -565 -340 -351 74 138 549 313 234 78 -315 -251 -297 -72 272
2710 272 89 134 191 -19 -213 -36 179 247 384 192 251 -190 -53 -1 159 442 13 38 -444 -209 -508 -214
2732 -214 16 17 -43 -300 -170 -86 -249 -233 -96 -237 -48 -186 -98 -157 220 -139 290 -266 -206 -39 121 205 92
2755 92 274 -82 -149 -82 -126 182 402 408 108 -336 -280 -427 159 45 449 455 198 -372 -696 -514 -204 16 743
2778 743 351 250 -701 -709 -522 -58 657 374 401 -180 -720 -982 -200 20 553 668 87 -156 -500 -215 -148
2799 -148 494 410 357 -138 -229 -311 -112 229 609 362 213 -42 -402 -161 289 213 79 292 45 -216 -299 -52
2821 -52 134 335 47 -352 -328 -207 185 182 384 56 18 -439 -480 -213 312 18 -41 149 -389 -193 -134 316 240
2844 240 233 -2 -248 -351 46 -81 298 318 156 -6 -323 -358 -140 309 455 496 447 218 50 -392 -81 259
2866 259 368 212 -148 -485 -359 153 343 -37 48 4 -309 -164 -185 -38 243 139 228 -226 -234 -358 -9 -87
2888 -87 160 188 42 7 -262 -349 48 375 169 245 482 236 -112 -48 92 261 540 86 -79 -204 -153 172
2910 172 -71 85 79 43 -220 275 -247 -444 246 12 55 203 -103 78 -281 -196 -237 97 -275 222 -161 -18
2932 -18 -262 -135 -116 135 467 -1 470 -305 -88 -515 158 176 546 157 115 -313 -514 -194 -132 541 343 246
2954 246 38 -81 -375 -386 -123 345 609 453 230 -281 -326 -212 120 110 165 499 96 -570 -373 -302 -143 280
2976 280 74 348 -156 -320 -401 -302 316 130 314 122 -338 -183 -249 331 147 1 322 488 278 152 137
2997 137 196 24 -99 336 34 85 -267 -396 -247 -258 107 206 -51 326 210 -209 -137 -271 207 352 197 197
3019 197 -397 -188 -360 -228 183 148 81 117 -147 -203 -430 181 -69 472 382 129 -434 -194 -256 -54 150 165
3041 165 356 -172 -148 -254 -214 -216 377 604 94 -39 65 -121 -186 60 -135 355 312 -63 -564 -353 -285 -433
3063 -433 286 222 201 248 -144 147 -351 236 374 463 322 548 3 -286 -248 -502 -212 55 89 74 -177 -228 -55
3086 -55 -214 67 424 657 252 -82 -405 53 182 313 32 442 68 -340 -391 -472 -321 431 171 129 444
3107 444 -136 -25 -541 -122 65 131 193 10 -229 -12 -406 -98 257 226 581 518 -82 -237 -172 18 -56 343
3129 343 632 -101 -199 -648 -411 -33 -317 -76 -108 -85 -285 -258 13 48 526 172 620 -2 -388 -315 -289 332
3151 332 93 147 27 36 -545 -168 -179 167 73 424 44 117 48 -500 339 -132 40 205 36 163 -549 8
3173 8 -40 -181 304 315 231 -308 -104 -322 2 -113 255 -33 95 -17 -298 -161 -246 -165 -76 420 182 -30 -121
3196 -121 -232 -42 38 26 313 322 -84 -377 -301 -213 195 167 47 7 -87 -384 -282 -173 -218 -74 -56 277 195 347
3220 347 124 -29 123 189 -36 99 329 132 13 39 111 201 311 245 31 -159 -277 -224 -5 -8 152 253 79
3243 79 -453 -344 -338 103 295 -60 305 31 -379 -204 -318 184 246 78 -55 -341 -487 -83 -110 278 451 -87
3265 -87 -48 -199 -129 -29 168 434 327 -240 -52 -139 -39 -15 204 120 117 -3 -359 -36 -10 174 274 48 250
3288 250 24 -181 -309 -23 -276 -96 57 46 -79 162 102 -64 33 58 -54 165 103 12 226 -70 -178 -134
3310 -134 -185 -327 173 202 -177 -242 9 -398 -383 49 95 228 -82 -569 -293 -333 120 305 323 299 -111 -74 -292
3333 -292 12 -145 124 191 253 -182 -129 -151 3 242 512 301 189 -267 -609 -220 -147 102 529 170 125 -174
3355 -174 -267 -73 -259 57 337 28 202 -168 -256 -47 -100 189 63 145 -46 -198 -117 125 -97 77 -183 202
3377 202 -232 59 245 -173 314 128 -224 -207 10 -144 117 -93 119 -207 -8 -179 39 47 360 345 -109
3398 -109 -219 -41 -46 98 233 -53 -287 20 -100 -46 319 97 46 -118 93 -67 38 -133 -70 9 209 -164
3420 -164 64 -218 -73 324 21 -112 -147 -304 -76 -116 -20 58 174 92 210 -3 -266 -187 205 69 -319 -282
3442 -282 -202 -243 4 129 179 -220 37 0 119 87 160 281 -137 122 109 -148 25 -149 96 182 208 36 -38
3465 -38 35 23 276 -98 -314 49 72 -70 29 174 214 -479 -72 -234 227 49 142 -81 -155 -36 245 -8 -110
3488 -110 8 29 7 -287 -5 -322 49 -472 128 59 230 91 -9 98 55 103 -122 62 44 -220 147 -129
3510 -129 152 175 171 128 65 -128 -99 212 62 128 81 -83 1 -126 -115 192 254 61 -280 20 215 13 -407 -17
3534 -17 -236 61 -54 116 267 -205 78 -146 -147 -103 204 213 56 94 189 -71 193 152 -70 -33 205 162 14 10
3558 10 38 75 109 175 -117 111 -101 267 -51 -239 68 -87 250 -39 -220 -142 -73 -233 330 -106 -38 118 -301
3581 -301 -121 -239 48 -6 82 139 -152 40 -9 -327 28 95 127 -175 -5 9 -196 -113 2 -6 139 234 90 -20
3605 -20 86 -54 114 181 -239 -33 186 104 224 -163 -75 -33 -153 1 -149 229 -99 -38 -171 -141 289 96
3627 96 284 82 82 79 -38 -134 89 -48 210 266 -162 -188 -72 -108 220 273 233 268 -164 -182 -354 -126 -234 386
3651 386 249 377 81 26 -225 -177 -19 158 178 202 -124 -23 -281 137 227 360 87 -239 -87 -55 -183 -213
3673 -213 -303 -125 45 -281 -108 -355 -204 75 -84 412 104 -47 161 -19 -128 133 -105 320 120 -261
3693 -261 -306 -53 193 -54 96 -38 82 -133 0 -41 361 -51 -63 65 -77 -199 -15 -76 -203 243 196 -17
3715 -17 -94 88 156 83 -116 19 -234 -100 167 144 59 191 -152 -133 -257 -157 356 84 151 277 103 -235 91
3738 91 -186 169 238 67 12 44 -406 -210 509 490 261 10 86 -138 -185 127 78 195 240 19 -519 -634 -510
3761 -510 63 -203 -51 -135 -153 -176 -29 -53 19 283 23 45 146 -41 -198 -92 86 269 -30 -19 -55 -225 -7
3784 -7 -51 10 224 133 100 104 -69 115 36 23 126 -76 89 53 104 134 -81 -64 186 88 263 47 212 -3 45
3809 45 -357 184 -175 59 -240 -260 94 -69 61 -69 -111 221 110 86 -112 -62 26 311 58 293 174 -152
3831 -152 -263 35 12 94 471 176 -171 -221 -250 310 67 397 110 155 19 -282 -363 -145 -59 196 38 299
3853 299 -426 -270 -382 -157 56 243 102 -115 4 -131 -74 161 119 -266 -46 -192 -394 -450 -134 -199 204
3874 204 45 190 156 38 120 62 9 371 -271 -261 -39 123 -81 6 25 100 194 -129 -70 -444 -160 -416 -102
3897 -102 -26 -119 83 -156 111 271 99 131 -121 -192 275 135 157 47 -206 -215 143 -282 221 90 44 -309 -59
3920 -59 107 -203 -5 348 27 52 -246 -279 54 20 159 97 -3 -212 -14 -240 -224 53 -4 111 -404 -19
3942 -19 103 -278 176 -191 -169 172 144 -262 27 133 109 69 -217 135 -85 -18 273 -85 -59 -39 -31 253 324 134
3966 134 186 -113 195 -104 -92 133 52 249 40 50 -232 -216 158 196 265 350 -35 97 -209 -220 56 156 -29
3989 -29 8 6 -92 38 -122 -132 278 -2 -142 -240 -501 -354 174 -14 -38 106 -117 -277 160 -22 -47 251 141
4012 141 107 -69 -323 50 -85 179 101 -21 -28 -63 -364 -224 -38 149 222 -113 14 -76 58 -125 219 54
4034 54 12 -4 -111 52 -171 -207 33 10 -285 -171 48 184 -150 99 -93 -77 -32 -28 109 -106 -172 25 6 -164
4058 -164 -3 60 -127 -63 276 105 9 -103 -313 127 141 -86 82 249 -39 -221 236 -162 -6 416 201
4079 201 79 -56 122 149 335 -49 -233 80 -206 -393 125 262 8 88 18 -299 -43 -74 -100 317 -41 -100
4101 -100 -268 -240 56 162 140 94 -89 -94 274 69 104 507 -26 -60 89 102 -157 -63 -16 36 175 -78 -197 -249
4125 -249 -334 -73 355 -46 236 222 14 119 -185 183 -94 -308 -122 179 -152 -45 -190 79 -220 179 4
4146 4 -90 169 10 -44 -22 87 114 91 -308 -57 88 115 44 44 -69 247 81 68 88 96 67 231 -27 8 -170 -173
4172 -173 -1 -46 40 6 16 55 15 45 171 -19 9 -242 180 -22 214 344 112 -17 -129 -270 -8 -56 264
4195 264 189 26 161 194 -292 -57 -149 96 87 268 -67 -240 -135 -85 64 -4 -27 -102 -7 -68 -234 27 159 11
4219 11 152 -96 -19 -181 164 -24 295 262 17 -156 120 25 67 -150 159 -32 -62 -37 -111 229 58 105 -397
4242 -397 -212 -102 -72 -138 -118 185 121 -146 -127 -182 -87 69 222 -42 -32 330 -62 129 -86 167 295 311 -49
4265 -49 -81 126 102 158 -59 161 104 -286 94 -89 77 83 -210 -135 -245 -188 -197 16 -114 -133 15 -111 -25 -173
4289 -173 -402 -54 -68 8 -369 34 -272 -144 154 113 350 254 -41 -64 -59 157 63 -227 -72 32 -132 -279 180
4312 180 -1 158 -23 -23 -189 -13 2 -278 -144 -131 103 -332 93 177 21 -122 -1 62 51 206 -130 123
4334 123 59 -200 82 -252 109 -384 -45 -17 197 153 -221 53 14 -101 125 182 138 46 88 -226 -116 -234 323
4357 323 363 285 -266 -43 -4 110 227 -25 -34 13 18 20 183 280 305 268 -45 -25 -72 -29 239 -61 197 -333 -297 181
4383 181 -46 132 188 107 -9 -55 -95 251 -18 382 72 191 5 -350 209 14 104 291 194 -99 -1 -82 146
4406 146 155 -29 188 118 -158 -1 -137 157 406 -79 -42 53 -15 -47 -48 65 177 24 -105 37 -81 -407 378
4429 378 283 116 -136 -55 -90 14 43 286 -263 104 230 -142 199 27 13 -59 181 -27 -26 136 -70 -172 272
4452 272 129 166 18 24 157 19 49 362 286 0 -37 -31 -231 -277 393 113 185 285 -164 -2 250 214 15 -181
4476 -181 -73 -132 92 -55 -287 59 -351 -191 -14 19 -140 -122 210 30 -152 46 38 -80 -101 -46 -146 -77 -119
4499 -119 37 197 39 -109 -27 225 -149 -128 -263 -130 403 128 162 5 -114 -25 -228 -47 104 -82 76
4520 76 33 -96 -146 -11 73 156 135 -93 -60 -194 -217 81 264 -184 -189 30 -255 174 -415 -55 176 -149 -142 -169
4544 -169 -80 105 215 105 37 -52 5 -1 135 32 -12 260 211 -469 -36 43 317 -169 -216 -282 21 -136 -74 352
4568 352 106 97 -121 -465 -98 101 182 -22 114 242 -193 -39 -121 -356 134 159 -19 -27 -106 -177 -50 -52 -45 81
4592 81 -194 39 -150 32 3 -32 -52 -18 -203 -113 -335 186 247 107 216 -428 93 -23 -220 29 543 171
4614 171 158 105 -52 -138 169 -323 251 -31 146 84 -123 -103 -230 -11 68 50 145 148 -122 -198 193 6 -10 35
4638 35 277 -11 -37 -159 230 213 32 -160 -38 -67 -513 238 -60 209 12 -3 97 35 92 161 -89 154 193
4661 193 -39 -103 1 17 -404 216 -86 -201 -60 257 -91 192 40 -108 -73 236 -52 172 207 29 -115
4682 -115 -355 -113 296 132 112 151 -181 7 122 249 -110 405 -95 183 -78 -130 125 191 0 -146 -207 -69
4704 -69 -27 -10 -153 44 75 177 -5 -185 66 26 2 332 86 165 41 -4 224 192 -226 -233 -90 -341 92 263
4728 263 -379 -72 -11 -17 78 -43 -96 -179 144 -14 348 355 -36 -42 185 43 232 443 -220 34 22 -138 117 -267
4752 -267 9 35 117 116 -75 183 -166 29 -86 170 121 332 278 -29 -200 -91 -1 88 10 -196 101 308 105
4775 105 -150 -105 -236 54 102 115 147 108 -79 -54 -38 -137 22 101 210 266 -100 -24 -129 15 -19 15 -36 291 223
4800 223 248 -139 -51 4 47 501 60 -24 86 159 216 24 -197 171 49 -237 -86 -170 -13 -186 -70 63 157
4823 157 -113 -63 37 -109 57 166 66 84 -46 230 -79 -91 158 178 91 62 -35 149 331 120 -152 37
4845 37 -240 162 -81 46 -73 -176 237 46 166 398 12 -117 25 -59 -96 -100 125 82 173 170 172 -234 205 166
4869 166 129 199 141 126 -76 -210 -231 343 -126 -187 -102 166 -123 121 -110 -10 124 -137 -108 113 33 -7 -96 208
4893 208 9 110 83 11 12 -243 173 47 84 -195 -151 254 -48 -226 69 -140 -204 -74 131 -253 -54 184
4915 184 115 -289 47 -128 48 98 -78 329 92 -143 -134 -11 49 116 104 -23 154 -98 48 -53 34 197 -57
4938 -57 24 226 180 -176 24 103 10 59 -24 -152 -149 -172 197 -112 -41 -211 44 -34 -22 196 61 99 299 -52 -129
4963 -129 -115 -90 1 13 117 105 -6 -106 -102 25 125 22 -312 199 81 85 332 113 52 -273 -304 -482 162 -245
4987 -245 4 -19 13 -44 -495 -14 103 -115 114 -17 -34 -66 -93 111 147 278 135 -128 -152 178 205 -132 46
5010 46 -211 76 -37 -102 256 22 105 330 -3 -126 -204 62 224 101 -28 519 37 54 109 73 416 402 95
5033 95 214 -29 83 -13 3 -43 38 -139 -272 84 -251 65 11 -316 -116 41 203 44 65 -56 -119 79 55
5056 55 -436 -149 -46 92 -116 -70 -33 -243 57 -181 -17 113 188 125 -211 -27 -207 -87 165 -114 202 -228
5078 -228 -141 96 -69 103 315 231 9 -184 86 350 -295 -109 -85 73 -80 -76 65 0 96 25 -69 32 -166
5101 -166 -57 187 107 309 -131 14 235 -218 -150 28 63 112 -105 -485 -99 128 68 -183 62 191 163 157 224
5124 224 19 -213 -82 44 213 100 151 -64 -115 -226 -71 -91 -132 96 -151 2 -3 -62 -222 245 -219 52
5146 52 -44 -39 -72 -80 432 116 -70 -165 98 40 79 49 -93 243 108 45 30 198 19 -153 -63 -214 240 50 51
5171 51 -126 -145 -161 197 -166 97 -301 -16 -300 366 50 294 161 -151 118 -34 126 -219 43 55 6 235
5193 235 -47 100 303 -23 54 168 141 2 154 -3 -180 36 2 215 -204 83 -85 -244 190 32 -186
5214 -186 289 297 16 176 87 -257 347 264 -109 -38 127 -244 144 87 -228 17 -151 55 74 202 -77 132
5236 132 -83 342 -58 137 -138 75 -66 -459 -169 -172 122 56 -277 -232 369 -199 -39 -12 192 -344 -190 46
5258 46 -9 -241 -48 4 -213 -55 1 -127 -235 1 115 -84 192 142 156 -57 97 188 -151 -157 -39 37 52 17
5282 17 -56 89 -22 129 -397 124 -277 34 105 -51 79 198 79 34 22 -148 -78 179 130 -220 134 -126
5304 -126 53 116 273 -160 -29 -46 97 235 -168 43 146 -101 -71 -120 -99 48 -195 63 27 296 -213 24
5326 24 46 150 -41 -182 -102 229 107 31 53 142 148 175 -153 -169 96 -171 163 149 3 172 -140 145 28 -192
5350 -192 16 -93 47 -292 -141 84 101 -51 -5 147 -40 -1 184 75 -264 24 21 289 -320 -151 43 -104
5372 -104 32 191 28 -238 15 -24 177 -42 -292 161 -88 -251 4 11 -108 110 102 35 -161 129 105 -301
5394 -301 -202 427 68 18 -64 -87 -186 -268 10 -133 236 -37 -150 -182 27 -41 178 97 175 -90 -88 92 -244 -169
5418 -169 27 -135 -91 -249 -65 133 28 -47 -88 229 211 -66 312 11 -335 -84 -137 -101 -59 -191 -247 -63 -239
5441 -239 -526 -331 -102 -190 -96 396 42 189 89 -62 69 -131 -106 203 -172 154 67 164 -190 21 -308 111
5463 111 140 333 -120 -78 219 -147 -93 124 91 -74 -104 99 11 -115 289 -50 -79 223 82 132 59 165 18
5486 18 54 240 150 -107 -37 -31 -96 -76 -176 -103 -48 -177 275 20 23 208 -314 206 -96 -44 -15 -154 -67 109 31
5511 31 293 202 25 54 270 -68 298 114 -57 -174 72 175 -189 -8 115 45 92 -90 26 -135 253 176
5533 176 -219 162 -257 162 -160 94 129 25 39 182 -28 -183 -151 82 88 233 -17 -259 257 -42 -165 -127
5555 -127 -40 -152 -147 326 -77 -228 177 227 -140 56 -58 -90 -209 -41 237 11 222 226 -4 -189 -79 93
5577 93 136 2 84 291 -135 86 -132 -7 -356 -32 -83 66 -84 19 64 45 -94 -178 176 14 -5 -25 38
5600 38 21 -15 -67 28 -171 -264 -241 227 186 -264 -2 41 67 88 92 -75 -1 107 -99 55 16 40 -217 -141 -161 -22
5626 -22 49 -147 -200 31 181 -89 -66 172 -34 55 81 24 338 82 105 102 -204 -67 -42 -179 -339 191 300 -106
5650 -106 -74 -2 420 -121 59 120 -214 -30 -1 88 117 -165 77 253 104 -13 127 -345 98 -47 3 -217
5672 -217 80 -70 -33 103 -41 37 140 111 30 254 113 77 94 105 -46 2 113 289 -57 144 -222 118 87
5695 87 98 -29 263 22 -37 64 120 87 104 379 209 -411 -316 2 -63 118 113 93 191 35 268 40 -71 -183
5719 -183 202 -14 281 -69 -80 -80 130 131 -3 -239 -188 -62 -95 115 -33 -86 -186 -104 253 -33 134 156 70 -158
5743 -158 157 -49 -29 128 105 41 142 217 -50 -60 21 21 247 -67 -53 81 -250 83 -191 -30 79 -153 50
5766 50 -109 53 71 -241 -181 -125 161 -6 -71 -286 221 -26 -209 192 -137 303 -338 -34 -105 94 217 50
5788 50 374 75 40 -126 -167 113 112 173 -7 -109 -16 30 -107 103 51 166 45 92 -240 -68 115 78 136 177
5812 177 -50 27 176 -101 153 161 88 -218 40 135 247 -59 -223 -60 74 316 -278 28 282 146 -264 -131
5834 -131 -31 -28 -71 -5 -181 -180 -134 -148 15 -240 111 78 -107 -428 -238 145 -96 131 236 -227 57 -89 46
5857 46 -154 80 183 95 124 -197 -122 145 70 275 -160 -189 356 26 271 123 25 56 -54 0 68 -61 156
5880 156 3 -117 81 116 -209 -189 -19 -61 -156 -67 -64 17 53 79 -134 110 -84 -150 -57 160 -19 -73 -149 -30 114
5905 114 -100 174 129 -243 202 -13 -170 68 -40 14 11 395 108 -45 -106 -37 56 -210 -254 -42 59 -250 -30
5928 -30 -87 161 30 234 -14 -48 -268 -134 -282 42 280 391 -15 103 85 -266 -150 -96 12 -345 -102 101
5950 101 49 -133 -11 -16 149 8 19 -225 298 80 -77 51 15 -149 -192 43 81 79 -121 -217 22 88 -201 -84
5974 -84 22 203 249 -96 -353 29 -185 -201 109 227 12 -156 -112 -370 82 -346 -60 9 -42 -208 63 -477
5996 -477 -275 45 54 110 99 -90 82 354 -12 54 -99 -61 -6 245 16 71 80 -4 201 -174 230 -27 -162 -241
6020 -241 198 373 -419 -76 -388 228 96 121 48 351 116 7 128 -40 102 152 -204 -149 -6 140 -322
6041 -322 69 10 73 -83 -184 67 22 -100 18 -353 46 -44 117 105 -159 -119 -115 -227 137 -298 193 29 89
6064 89 148 -149 120 -41 129 -335 -18 -60 180 -97 85 121 -87 -21 -72 30 -210 -113 177 -133 233 -95
6086 -95 74 -40 55 40 119 179 135 137 208 80 186 -2 59 14 168 168 148 -85 135 -10 -161 271 -103 -101 380
6111 380 29 19 130 154 4 46 60 -165 104 -35 -154 84 73 57 132 -222 242 -157 289 243 -73 -226 220
6134 220 -2 -29 -147 36 135 6 -251 -63 -81 -177 -43 -406 271 -82 -127 -137 -179 -75 25 275 9 255
6156 255 -330 -86 -133 -60 -81 37 223 -184 215 306 11 -55 -252 -219 180 -141 -85 35 -214 -29 -157 138
6178 138 -263 231 130 -38 -78 -78 213 -44 -17 -193 78 181 273 37 -25 -46 -81 -157 247 70 104 -10 -129
6201 -129 -147 -25 74 55 -250 -143 54 -39 -220 296 -71 80 -97 -8 -67 -147 133 -219 87 123 -78 12 1
6224 1 54 -24 -328 -12 -202 -174 -14 97 -153 216 -315 118 234 -44 101 108 -59 -34 76 127 -225 242 -86
6247 -86 74 -89 -29 382 31 14 -41 -258 -243 39 66 53 -63 -94 -47 -69 91 -90 200 -137 119 68 14 -26
6271 -26 -151 97 -167 61 148 -122 -392 -87 -60 87 144 -137 -132 -21 318 -195 244 -157 -138 -39 -17 -88 -45 23
6295 23 -220 -26 31 -148 -51 146 -75 88 14 -134 -180 40 -190 28 -187 98 159 197 -6 -293 -101 -103 77
6318 77 204 74 -45 -152 -197 156 -125 -156 316 138 -105 339 54 -237 109 -185 332 -1 -190 259 -29
6339 -29 -31 59 195 85 60 -64 42 116 1 23 57 -28 -22 -207 5 16 -64 143 125 -168 -84 -36 258 64 -64
6364 -64 -71 378 -31 -165 274 -63 -16 231 443 71 110 31 222 149 -199 -201 -168 -145 -85 31 -54 -33 56 -18 206
6389 206 285 -12 -62 162 -29 -53 -26 -37 -153 -130 91 4 -134 107 28 147 -118 86 -84 87 -99 -59 26
6412 26 4 61 141 157 153 58 -71 -300 200 -47 -117 85 -44 -63 -301 -105 -11 -15 190 -162 8 -213 -49 -237
6436 -237 -6 191 24 8 -268 -17 35 -147 -86 82 181 -45 -275 -366 254 24 324 452 58 289 9 268
6458 268 -482 130 -349 -68 333 174 -205 181 145 -156 -61 279 -88 -255 -204 138 -112 72 -6 -30 133 73
6480 73 -191 -187 74 345 -282 -134 7 35 -39 27 151 -115 139 197 282 -61 235 18 69 -157 39 82 272
6503 272 28 -257 -51 221 -86 -47 38 205 200 0 -202 -107 34 -73 -25 182 62 -184 344 -81 -132 154
6525 154 -99 127 -119 270 -38 -68 77 10 -372 125 -229 -225 -288 -132 -81 -257 -49 -27 9 199 -181 19 -99
6548 -99 323 292 -337 75 -264 -91 -371 369 40 -145 266 -30 -30 175 -97 260 107 23 163 143 197 28
6570 28 -80 -136 -65 -235 -306 -180 -9 122 -49 -122 -134 -237 -177 -113 249 -7 144 -77 254 -102 -5 173 -177
6593 -177 -362 170 -155 -136 -199 169 -7 -38 -49 134 -83 19 -9 76 -185 92 310 -228 -94 -85 -153 66 185
6616 185 194 55 -301 17 47 -87 280 36 -6 30 -99 12 -47 126 -162 -160 -102 181 -245 -68 -171 35 156
6639 156 227 46 116 -135 -27 38 -32 250 -468 -191 -345 -288 -155 -13 134 -144 36 -115 -176 -126 -144 40 89
6662 89 -11 59 -71 371 39 141 -90 -92 76 29 122 144 129 -118 -16 -87 7 -432 -73 -35 -49 71 -194 -60
6686 -60 128 -123 -161 -6 -115 169 -260 -170 43 -68 -220 -11 -97 -12 -157 108 196 520 -290 76 142 -130
6708 -130 72 -193 -45 -220 87 207 91 233 296 -80 -61 -67 -57 -256 219 -67 -197 -217 -316 230 -197 26
6730 26 161 -138 24 -36 29 187 76 30 -29 -78 -26 -117 30 -69 -223 93 70 73 308 -81 232 -212 44 167
6754 167 56 102 162 163 47 -46 5 341 -136 -49 -254 -178 -13 152 -13 -154 -387 118 -131 96 8 -147 -172
6777 -172 16 83 -212 290 38 68 -75 74 -64 116 -154 -231 265 18 -198 99 36 206 193 -313 97 41
6799 41 76 -79 -116 -21 96 23 -15 -17 161 125 -291 -166 -192 2 -44 -59 -239 143 27 311 -127 396 189 -303
6823 -303 -31 -98 56 -297 -61 115 -235 -136 -162 135 188 -73 110 -180 24 -290 -150 -4 -10 -209 -96 -5
6845 -5 -20 88 72 -218 -161 -193 -60 -97 -223 165 267 170 363 -5 -128 194 -52 238 -96 69 -155 117 142
6868 142 -46 8 -139 -82 -72 1 142 -13 -8 -8 -264 -20 -20 -8 -347 30 -105 -203 131 -160 147 213 18 2 -215
6893 -215 -136 -129 124 189 246 -30 -240 -17 -345 135 -62 69 298 345 -82 10 110 -130 353 111 40 245 -99
6916 -99 92 111 -260 -4 86 132 32 -204 365 -94 -321 17 37 -148 -79 81 -127 213 18 91 101 -118 77
6939 77 -357 -108 28 -185 -45 -321 -112 10 -224 -4 -186 -239 -121 47 -119 64 -97 -201 -171 -57 9
6960 9 183 16 -81 -279 -216 -40 -122 -42 -48 -131 -148 -165 -110 -158 327 154 -46 102 -161 -98 -24 -56 68 -31 -145 -84
6986 -84 232 174 -59 203 114 -201 -78 -13 134 -32 -69 40 98 29 -151 -3 -70 108 241 93 186 -124 -7
7009 -7 38 86 -41 140 108 29 286 -271 -104 186 -8 -48 -116 80 111 40 -57 205 -14 30 186 154 -21 -77 -221
7034 -221 102 78 -33 -17 5 82 44 -224 40 -192 -108 -17 -313 -88 -309 -167 125 -14 -66 -274 52 -130 -139
7057 -139 -122 102 141 -264 139 -42 304 -114 -128 124 153 -120 16 230 80 207 -41 151 159 -90 101 192
7079 192 -54 -44 159 57 -61 -40 104 105 -25 -17 40 184 -202 232 331 -196 -57 -39 116 31 -25 27 12 140
7103 140 -146 191 -290 134 -152 114 -65 195 -42 65 396 4 -83 -117 9 70 96 -148 94 141 73 55
7125 55 -53 80 79 4 -34 -169 -45 -41 1 98 -21 83 -50 -29 -14 -290 -367 29 -117 30 -173 265 81 187
7149 187 -96 -103 15 86 302 -70 -7 -18 -26 150 -198 187 232 45 -99 106 71 -115 236 -91 -367 -201 195
7172 195 -73 -145 -185 156 -20 -281 274 318 -5 -113 87 -22 -130 -16 192 142 -106 -31 70 30 -186 94
7194 94 220 -37 -8 -130 47 -198 -125 51 -317 -65 -63 224 -127 -65 116 22 -55 4 -21 -1 56 -83 -178 285
7218 285 299 9 31 161 307 337 -130 -87 62 49 -23 501 -241 140 212 -151 143 20 -39 -36 201 235 147 21
7242 21 17 130 120 33 -194 -45 -92 98 -270 -42 -91 -254 -40 -138 -31 76 -90 360 19 1 -8 -159 -78 -60
7266 -60 31 120 171 156 -12 -43 -192 -30 -253 -13 49 61 -79 -26 132 63 117 7 -94 -7 85 277 -209 -36
7290 -36 -32 19 -234 66 -38 -40 -152 -119 -66 -81 -163 -262 48 -146 -20 -87 145 -211 -129 211 -88 -105 -64 14 68 13
7316 13 105 122 232 92 -178 150 217 66 22 -256 150 -212 -48 229 50 -104 -228 130 -145 2 57 -85
7338 -85 168 -47 -79 64 20 3 -136 0 -197 -151 -62 39 -166 163 -231 -151 -34 -76 -179 -75 134 225 83
7361 83 359 35 7 113 -44 204 145 71 -93 -273 -104 -74 -296 203 135 59 -88 -131 -55 -51 45 -8 -114 162
7385 162 -19 -253 -66 188 -146 -81 -134 33 -202 119 -168 -97 196 -32 -249 -218 202 -219 -196 76 34 -179
7407 -179 16 -112 183 172 -153 98 -133 92 211 -275 353 -13 96 115 -106 -128 13 96 -294 6 18 -2
7429 -2 -239 -188 -108 -196 155 83 220 -36 61 66 -152 275 -193 -98 -96 108 -41 -241 -29 -47 138 73 -26 -289 117
7454 117 72 -42 10 -370 -66 22 -212 -134 209 86 242 -85 90 148 -29 116 67 -262 -258 146 184 -196 -22
7477 -22 -54 -73 -19 -77 -141 215 47 -3 236 321 -4 -196 65 368 -74 -184 -56 -188 -54 72 -12 419 -160
7500 -160 -4 -29 15 57 68 54 63 -64 -105 -152 -308 333 199 -151 263 -48 165 12 -38 32 -66 -113 76 29 -240
7525 -240 353 -158 -319 183 -5 -2 279 7 34 279 84 214 8 -41 -161 -189 -79 49 -99 78 -228 -365
7547 -365 -50 -9 253 -117 245 349 -96 -105 -146 -305 11 -94 3 91 47 -6 -206 279 -27 -54 38 -53 139 -214
7571 -214 -146 391 -73 -161 -71 208 45 -77 151 222 139 128 1 -99 -65 -23 -7 -451 294 -197 124 228 -45
7594 -45 77 142 12 -18 -135 20 122 -117 -286 -7 3 -119 -56 10 -159 80 227 168 -52 -152 16 -89
7616 -89 -203 0 -103 198 -179 29 -195 -186 167 128 422 -199 86 -9 -206 -63 -51 239 -124 89 219 82
7638 82 -57 -46 31 -68 173 45 313 175 39 -114 -18 125 132 -167 270 56 34 -314 154 40 165 -19 -19
7661 -19 -191 105 -29 -223 -79 -398 49 -141 104 -189 26 252 152 -175 32 6 -266 -192 -160 -198 144 76
7683 76 39 25 16 215 -63 3 -188 -98 -28 179 -54 41 -306 91 129 91 -95 97 2 194 95 23 154 -200 -16
7708 -16 -103 -383 -152 -409 -149 -192 -263 248 43 185 162 -220 -19 -22 75 25 91 70 -117 -129 -204 -6 9 16 -92
7733 -92 341 328 246 239 76 84 148 -178 -104 240 20 121 -51 54 84 -132 22 -166 173 -173 173 277 -28
7756 -28 -199 -161 182 52 139 146 -160 -421 192 -87 48 51 -204 -134 -146 -112 -43 -7 -242 -93 -136 -18 -239 -56
7780 -56 71 -76 261 -27 -48 161 -2 -42 277 54 51 7 -77 158 259 -126 41 -90 116 -364 -188 15
7802 15 -19 211 59 48 199 82 -84 5 242 -34 0 53 -14 -90 184 -109 -154 -21 202 -76 -18 30 -201 -54
7826 -54 -78 -39 -242 -58 -131 -10 -14 -133 -23 -140 -190 -92 -169 162 -248 96 394 -46 -52 -175 -367 135 -228 -153
7850 -153 -178 90 -83 -34 234 -53 333 -170 -52 -277 -61 -393 -291 90 145 -75 30 -244 139 -133 219
7871 219 -38 -11 -333 -267 301 -117 -123 -25 -24 -62 -164 336 4 1 -169 -229 -170 -407 141 -48 -394 46 -100 -78
7895 -78 -208 256 37 80 -19 61 110 -148 -192 71 177 -82 169 -53 -69 -143 -101 -195 -75 33 -70 19 -59 -266
7919 -266 -10 120 90 -50 -24 214 194 -219 194 126 147 177 297 -209 114 -201 -69 -46 164 -22 152 -128
7941 -128 288 -244 -43 190 -172 -191 -11 390 -225 -65 -159 16 -240 6 135 -10 -121 -90 120 90 -121
7962 -121 256 -161 179 386 131 119 204 38 -182 291 126 -25 -154 262 -111 162 -360 -224 -15 430 75
7983 75 219 275 -283 0 -77 -2 -99 145 222 160 137 447 40 -201 156 -135 127 45 124 -62 -207 -27 116
8006 116 -302 -210 25 181 136 -85 229 -341 -217 184 -66 212 81 15 188 425 85 225 -71 -287 173
8027 173 -40 34 337 86 205 181 -211 373 69 -110 -156 48 -193 27 -124 -204 -85 70 104 42 -56 130
8049 130 -82 -196 -94 -190 73 -303 -117 165 56 -24 -57 -62 273 99 9 49 137 -16 -175 -26 17 -158 -23
8072 -23 -255 236 206 333 -15 -81 -264 -31 5 -74 -16 112 289 125 -148 -347 -227 -32 -37 -93 66 -81 1
8095 1 -2 -128 27 -4 163 31 21 323 64 -317 -279 4 -139 -9 85 145 76 200 -157 109 59 -316 -44 -132
8119 -132 170 -305 -171 154 -332 -84 186 10 -137 81 80 -59 -55 89 191 61 38 22 -18 -62 -131 -231 -43
8142 -43 -34 41 170 53 -86 170 310 249 -218 44 -92 62 329 -80 102 82 29 28 112 -76 5 61 -343 95
8166 95 -407 158 -121 -261 116 60 -129 -96 24 75 -119 -126 -229 -124 -199 -177 -49 197 -91 -247 218 66 -20
8189 -20 237 -10
8191a0
$$ Imaginary data points
##PAGE= N=2
##DATA TABLE= (X++(I..I)), XYDATA
0 0 0 0 0 0 0 0 8 -8 8 -8 16 -16 18 -24 32 -32 40 -48 57 -72 80 -96 112 -128 145 -168 192 -217 246 -278
30 -278 313 -352 396 -443 493 -549 611 -679 755 -835 924 -1023 1133 -1255 1392 -1544 1715
47 1715 -1910 2135 -2396 2703 -3073 3526 -4099 4850 -5877 7384 -9816 14413 -26284 126320
61 126320 251202 104887 42909 -12910 20136 63205 109570 83881 17252 -79337 -132584 -133116
73 -133116 -68496 7458 66756 70616 38587 -9095 -30876 -21926 13592 42145 45948 15106 -31762
86 -31762 -75870 -94642 -88319 -64260 -39740 -21360 -12484 -5248 2997 13896 22361 27207 26469 24665
100 24665 24523 25257 20919 6949 -16656 -39617 -50276 -38523 -7995 27607 51436 52659 36128
113 36128 17642 15674 35487 69095 93517 89924 52706 -3008 -51812 -71145 -56853 -23813
125 -23813 1689 1163 -26774 -63711 -82843 -69939 -26921 22567 52406 47718 13716 -28100 -51675
138 -51675 -45612 -16526 14741 26144 10186 -22360 -50571 -55449 -30577 10812 47626 61794
150 61794 49740 22293 -2046 -8138 4521 25563 38404 32915 11797 -14617 -31523 -29189 -9688
163 -9688 15444 33574 36417 26393 11954 2582 2673 11080 19240 19397 8042 -11670 -31866 -45179
177 -45179 -47454 -38734 -25538 -14248 -9420 -11353 -17029 -19580 -15387 -4661 8435 18307 18229 8009
191 8009 -6813 -19201 -20802 -11145 5245 19524 24233 16764 3720 -5300 -2115 13405 32696
204 32696 44154 39810 19740 -4955 -21488 -20962 -5446 13685 23506 15972 -4604 -25596 -33096
217 -33096 -20985 3530 26039 33073 19981 -5133 -27331 -33682 -21651 -773 14664 13052 -4934
230 -4934 -28522 -43185 -39996 -20300 4179 19643 19350 5697 -10089 -16735 -9893 6335 22512
243 22512 28511 22010 7190 -6394 -12135 -7270 3065 13265 17179 14589 8297 3361 1876 4223
257 4223 8189 11304 12301 10051 5008 -1299 -8426 -14265 -16573 -15038 -10277 -4059 808 43 -4958 -10139
273 -10139 -12785 -8356 1281 10710 14351 8400 -4464 -17825 -24092 -19981 -7493 5191 10960 6640
287 6640 -3736 -12498 -12482 -2029 14673 27402 29625 19660 3224 -9963 -13081 -4836 7853 17114
301 17114 16156 5065 -9330 -17896 -15437 -3244 11731 20834 18680 7403 -6180 -14643 -13108 -4278
315 -4278 5654 9427 4357 -7503 -18730 -22606 -17327 -5630 5472 10002 6126 -2236 -9922 -11103
329 -11103 -5059 5199 12559 13843 7899 -1120 -8043 -8765 -4116 2834 7240 7163 2441 -2623 -4937
344 -4937 -2569 3093 8781 11504 9950 5669 1570 -837 -416 1549 2761 1966 -869 -3813 -6361 -6453
360 -6453 -5939 -4631 -3061 -1941 -524 1075 1961 2234 1022 -1096 -2573 -2378 -1391 230 160 -1407 -4065
377 -4065 -6111 -5691 -2981 2261 5433 6176 3678 -440 -2407 -1291 2526 6951 8744 6457 745 -4409
393 -4409 -6403 -4251 932 5440 6755 3920 -1234 -5011 -5654 -1961 2364 5439 4282 -146 -4727
408 -4727 -6889 -5535 -648 3780 5255 3390 -1140 -4884 -6380 -4305 -373 2815 3062 908 -2975
423 -2975 -4951 -3790 -1317 2709 4352 3968 1421 -1221 -1254 53 1646 3506 2992 528 -1731 -2843
439 -2843 -2603 -483 1541 2133 1159 -181 -1353 -1463 -163 1665 2151 1270 -801 -2312 -2360 -1119 1474
456 1474 2780 2045 -65 -2719 -3563 -2409 428 2454 3169 742 -2266 -3832 -2731 -323 3267 4771
472 4771 3403 312 -2782 -3819 -1433 1967 4387 3475 111 -3507 -5722 -4723 -910 2742 4466 3202
488 3202 194 -2474 -3249 -508 2560 4230 3308 247 -2920 -3898 -2854 -287 1763 1543 164 -1627
504 -1627 -2064 -845 2118 3197 2383 303 -1559 -1906 209 2556 3401 1831 -1953 -5101 -5258 -1618
520 -1618 3183 6076 4538 106 -5590 -7639 -4469 2337 8154 9050 3954 -3925 -9391 -9174 -2536 6122
536 6122 11096 8859 508 -8385 -12773 -8707 858 10333 12795 7537 -2631 -10989 -11888 -4923 5728
551 5728 13317 12232 3960 -6994 -13295 -11350 -2635 7201 12129 8570 -286 -8678 -11780 -6800 2110
566 2110 9601 11148 5838 -2677 -9002 -9309 -4128 3241 7461 6564 959 -5107 -7430 -5079 296 5643
582 5643 7560 4892 289 -3487 -3849 -1285 1668 3351 1849 -795 -3428 -3450 -2093 756 1869 1440
598 1440 -590 -2313 -1943 262 2285 3692 1844 -989 -3250 -3426 -792 2518 3701 2593 -900 -4462
614 -4462 -5371 -2768 1842 5368 5654 1956 -2741 -6038 -4830 -416 4917 7167 5390 -42 -4688 -6196
630 -6196 -2947 2286 6918 6981 3010 -3044 -7175 -5803 -657 5113 7828 5348 -404 -6448 -8303 -5462
646 -5462 332 5264 6214 2036 -4039 -8248 -8120 -3188 2777 6589 5675 979 -4463 -7017 -4522 1193
662 1193 6749 8987 6415 749 -4290 -6163 -3396 1436 5666 7073 3827 -1345 -6190 -7497 -5266
677 -5266 -600 4310 6108 4818 647 -3245 -4867 -2658 2479 6866 8980 6546 559 -5440 -9131
692 -9131 -8407 -3764 1959 5198 3780 -2205 -8719 -11619 -8987 -1533 6954 11545 9426 2245 -5953
707 -5953 -9608 -6977 706 8484 11330 7219 -1365 -9473 -11415 -6098 3165 11935 14594 9532 1080
722 1080 -6549 -7794 -3279 4719 10093 9712 2895 -6333 -12859 -13224 -7692 311 5589 6274 2201 -2920
738 -2920 -5841 -4236 982 6177 9372 7823 2907 -2487 -5960 -6773 -5463 -3274 -1256 -1147 -2753 -4124
754 -4124 -5035 -4445 -2481 770 3852 6603 7606 7403 5453 2623 348 -26 1321 3635 5101 3893
770 3893 953 -3526 -6140 -5770 -2363 2969 6637 5831 2159 -3488 -7343 -7197 -2642 2727 5205 3566
786 3566 -2135 -8708 -12205 -9909 -3195 3953 7939 6435 536 -5508 -7217 -3648 3487 9501 10588
801 10588 5823 -2183 -8845 -10119 -5637 1418 6724 6717 1678 -4707 -8316 -6167 955 8686 12855 11306
817 11306 5196 -1618 -4319 -2195 3313 8042 8863 3881 -3742 -9378 -10925 -7206 -1811 2480 2402 -1113
833 -1113 -6857 -9517 -8544 -3417 2252 5135 4222 573 -3552 -5571 -4102 -445 3315 4841 4145 945
849 945 -2032 -2969 -1711 1160 4247 5691 4802 2761 318 -1178 -1703 48 1925 3134 3070 1390 -875
866 -875 -2930 -3087 -1926 775 3506 4916 3932 1576 -1461 -3374 -3029 -702 2196 2594 768 -3455
882 -3455 -7659 -9896 -8557 -4934 -479 1810 921 -2037 -4770 -5257 -2655 1918 6680 8642 6548 2308
898 2308 -1969 -3830 -1838 2419 6434 7343 5236 299 -3349 -4321 -1908 2802 6447 7643 5244 525
914 525 -4064 -5448 -3902 -262 3022 3430 1157 -2876 -6430 -6892 -4559 -184 4057 4911 2916 -1131
930 -1131 -4326 -5447 -3113 79 2853 2851 -17 -3930 -6693 -7353 -4544 -168 3769 4916 3678 1159
946 1159 -773 -520 1573 4939 6759 6919 4686 1819 -1323 -2290 -1154 1109 2856 2794 1088 -1143
962 -1143 -2866 -3275 -2201 287 2373 2793 1483 -975 -3205 -4682 -4373 -2778 -942 627 234 -1754
978 -1754 -3726 -4684 -3397 -829 1980 3403 3382 1246 -1428 -3115 -2302 177 3004 3945 3124 306 -2762
995 -2762 -3464 -2220 1122 4385 6053 4742 1678 -1033 -1808 -628 2219 4119 4370 2386 -982 -3605
1011 -3605 -4285 -2319 251 1975 1706 99 -2689 -4316 -4493 -2584 -132 1201 1037 -313 -2332 -3565
1027 -3565 -3536 -1694 541 1919 2110 1154 -638 -1455 -1312 187 1447 2829 2582 1279 -251 -1106 -1138
1044 -1138 129 1690 2641 2868 1967 486 -588 -736 356 1589 2500 2162 1333 -671 -2125 -2722 -2233
1061 -2233 -1324 -39 344 -118 -1108 -2253 -2542 -1849 -164 823 1492 1051 -633 -1943 -2670 -2117 -889 969
1079 969 1497 918 -652 -1738 -2069 -941 988 2978 4066 3529 1709 161 -828 -342 982 2677 2990
1096 2990 1296 -852 -2363 -2768 -1602 884 2584 2478 921 -1010 -2463 -1788 -602 1360 2338 1479
1112 1479 -410 -2659 -3631 -3184 -1443 201 911 111 -1436 -2151 -1682 -666 1005 2207 1948 1064 -179
1129 -179 -886 -450 586 1149 1366 1107 381 -235 -210 124 558 1084 939 839 504 470 670 390 623 2
1149 2 -278 -206 -385 -166 201 -350 -960 -1529 -1522 -986 -296 -187 -17 -497 -926 -1257 -711 2 396 427 342 -303
1171 -303 -729 -565 -534 556 557 864 403 166 122 -131 296 799 992 803 648 398 683 758 657 598 328 208
1193 208 278 452 291 -18 -436 -627 -893 -703 -81 433 462 -355 -666 -906 -396 -186 161 651 -171 -746 -1143
1214 -1143 -1533 -1049 -146 339 683 492 -222 -476 -166 261 1345 1402 1633 935 6 -254 -54 359 826 836
1234 836 -30 -256 -631 -663 -86 519 1043 999 269 -84 -446 -258 475 252 451 -400 -920 -1410 -1137 -699 -475
1255 -475 -286 -203 -783 -1098 -834 55 881 1281 928 346 -614 -864 -645 330 749 773 -33 -581 -1176 -884 516
1276 516 1379 1807 1076 166 -576 -562 256 1594 2105 1535 330 -1279 -2279 -1770 -471 1066 1280 91
1294 91 -1166 -2364 -1754 -519 1537 2307 1881 251 -1851 -2231 -1459 122 1832 2136 468 -1474 -2902
1311 -2902 -2618 -804 1414 2557 2337 351 -1401 -1846 -1160 843 2737 3501 1921 -674 -2154 -2713
1327 -2713 -1029 1233 2346 2199 514 -1584 -2685 -2456 -81 1784 2712 2407 497 -1424 -2451 -1669
1343 -1669 -163 1926 1751 1037 -729 -1959 -2417 -1716 -384 1284 1408 702 -398 -1523 -1417 -615 197
1360 197 1437 1638 1017 317 -572 -829 -715 -208 708 1139 1126 493 -178 -519 -734 -520 -62 652 833 613
1380 613 27 -520 -1213 -863 -62 756 1288 1222 376 -793 -1460 -1495 -571 282 1201 1165 345 -1166 -2046 -2109 -763
1401 -763 653 1808 1872 766 -573 -1870 -2236 -837 945 1910 1562 270 -1722 -2677 -2164 -260 2009
1418 2009 2689 2753 916 -857 -1721 -1070 686 2434 3142 1928 -535 -2358 -3664 -2276 -1046 973
1434 973 1568 795 -820 -1830 -2012 -409 1421 2516 2825 1957 66 -1389 -1808 -1327 -155 787 632
1451 632 -197 -1556 -2558 -2275 -1089 299 1635 2009 1436 594 -390 -563 152 1066 1226 1291 328 -649 -1890
1470 -1890 -1786 -1212 -43 1061 1765 1435 446 -156 -570 -223 823 1754 1308 565 -1114 -2473 -2688 -2364
1488 -2364 -1088 371 633 -89 -835 -1118 -1253 -14 1454 2630 3065 2058 305 -904 -1959 -1008 -88
1505 -88 531 440 -186 -1812 -2483 -2599 -917 866 1634 2207 1754 562 -416 -739 -350 1417 2491 2079 952
1524 952 -660 -2121 -2376 -1685 -120 1398 1906 726 -857 -2046 -1986 -1113 604 1461 1650 376 -1475
1541 -1475 -2559 -2980 -1388 258 1688 1937 833 -610 -1493 -1703 61 1951 3041 2842 1629 -650
1557 -650 -2028 -2007 -1121 562 1324 1457 180 -1366 -2654 -2535 -843 737 2372 2269 1148 -334 -1295
1574 -1295 -1261 -273 1366 2480 2031 892 -923 -2306 -2504 -1232 162 1329 1234 304 -958 -2089 -2208
1591 -2208 -560 1121 1970 1846 836 -885 -1871 -1624 -530 1104 2127 2195 873 -338 -1880 -1064 394
1608 394 1608 2208 2344 633 -573 -1532 -1459 -619 422 817 564 -868 -1749 -2293 -1978 -783 475 1368
1626 1368 1428 720 32 -243 -35 441 1108 1608 681 -119 -1154 -1465 -1991 -1487 -794 -25 238 243 -414 -654
1646 -654 -490 78 1008 1989 2110 1505 365 -474 -710 -740 492 1436 1103 741 -636 -1400 -1432 -804 982
1665 982 1584 2242 1275 -21 -1444 -1490 -1020 -267 802 677 -389 -1454 -2778 -2225 -1116 546 1366 1818
1683 1818 829 32 -389 -855 572 1501 1790 1457 251 -1812 -2391 -2577 -1266 173 1114 825 384 -902
1701 -902 -1240 -430 879 2273 2435 2286 853 -923 -1751 -1068 -266 678 654 426 -868 -2104 -2028 -909
1719 -909 327 1395 1706 866 -49 -769 -1398 -854 118 442 608 302 -1097 -1649 -1489 -837 371 1144 1604
1738 1604 1134 635 -419 -538 -711 487 842 1120 848 -48 -783 -1425 -1102 -501 241 996 1507 797 -15
1757 -15 -814 -1012 -59 761 1466 1299 496 -523 -1877 -1532 -835 484 1023 1079 297 -848 -1338 -1537 -421
1776 -421 965 1672 953 -152 -1302 -1764 -1353 -194 922 1434 934 -28 -880 -895 -130 877 1465 1748
1794 1748 1026 -306 -1142 -1524 -578 169 681 472 -56 -617 -881 -548 -63 784 954 1024 513 -203 -331 -325
1814 -325 151 -116 -173 -190 -594 -852 -607 -631 -249 217 258 393 569 459 250 87 220 -41 -296 -53 -252
1835 -252 110 -321 -630 -731 -430 -427 260 564 683 924 431 57 -349 148 479 424 617 -180 -772 -1367 -1269
1856 -1269 -313 172 428 672 229 -274 -556 38 440 1292 1172 658 -226 -1036 -1131 -564 -133 399 537 -278
1876 -278 -859 -1137 -955 -19 1164 1633 1016 677 -615 -809 -743 42 735 539 171 -874 -1417 -1479 -687 839
1896 839 1127 981 247 -51 -313 -521 279 971 1049 524 -299 -994 -759 -419 -309 669 370 -145 -434 -456 188
1917 188 243 822 859 512 40 -361 -531 -398 -415 -192 -44 175 -222 -298 -42 -291 -133 287 303 566 399 205
1939 205 52 373 -226 -219 -304 -289 -582 -226 -104 31 108 -8 201 21 367 62 -95 -69 44 -157 -63 -280
1961 -280 -11 -246 -204 -108 22 -234 -43 -79 54 440 405 425 130 112 -3 56 -684 -582 4 -105 -116 -215 -396
1984 -396 -283 66 292 821 232 250 -32 -302 -230 -257 122 181 145 -15 -493 -485 -347 -271 232 409 274 175 190
2007 190 -226 26 178 120 -103 -291 -354 -374 -392 -112 -20 -252 261 359 268 260 443 72 -28 164 -191 -37 47
2030 47 -200 -411 -391 -312 -450 -326 352 364 721 623 349 -222 137 121 283 126 641 -250 -769 -503 -902 -674
2052 -674 258 444 563 175 -424 -384 -250 387 697 760 876 -278 -697 -978 -677 -158 46 310 162 -320
2072 -320 -843 -522 91 202 875 764 657 -229 -513 -586 -266 54 553 303 -70 -508 -1192 -848 -204 485
2092 485 586 768 442 -445 -805 -149 458 728 720 155 -151 -783 -770 -264 420 348 398 -535 -524 -511 -396 -54
2114 -54 193 444 259 26 -322 -392 -76 234 451 231 -186 -149 -54 -288 -163 150 -87 187 -100 29 256
2135 256 83 162 -116 -166 -158 -6 333 425 290 -55 -105 -203 12 -36 296 -30 -86 -529 -370 -547 -90 638 803
2158 803 720 123 -267 -545 -216 198 574 369 52 -240 -1051 -929 -363 235 797 1017 236 192 -238 -286 35
2179 35 648 1099 1274 421 -559 -1228 -1235 -544 250 470 747 362 156 -824 -706 51 766 1446 1209 474 -497
2200 -497 -1087 -1143 -103 518 1044 761 77 -1091 -1603 -850 -161 860 1586 864 -173 -741 -1222 -472 68
2219 68 651 1326 597 -138 -1035 -1112 -613 454 952 1164 644 -304 -827 -807 -138 618 1220 768 126 -750 -1203
2240 -1203 -857 -484 235 735 527 30 -425 -485 -100 160 566 1077 583 217 -238 -306 -98 150 170 239 -50
2261 -50 -307 -378 -633 -341 -204 -31 194 140 -19 260 -143 -154 -304 -276 111 160 278 232 -189 -194 -459 -256 -129
2284 -129 194 283 484 145 -169 -809 -165 -291 336 382 130 -267 -1046 -961 -707 226 707 813 288 -336 -454
2305 -454 -685 -163 677 1050 1149 351 -152 -574 -391 140 573 581 385 -303 -1051 -1511 -993 -90 417 1109 617
2326 617 -160 -584 -661 -20 695 1133 1196 568 -126 -889 -1026 -597 -32 484 310 121 -578 -689 -867 -66 641
2347 641 836 944 128 -79 -628 -546 -593 177 442 251 228 -79 -449 -495 -128 603 747 936 825 490 -314
2368 -314 -227 -565 -59 264 405 14 -449 -776 -1171 -701 -247 734 767 672 312 -350 -677 -14 187 1108 1178
2389 1178 695 -340 -934 -1171 -760 -316 381 733 662 -316 -1058 -1106 -327 591 982 1211 548 -261 -676 -619
2409 -619 -13 247 588 631 207 -443 -892 -782 -18 618 867 654 20 -203 -409 -540 -90 155 519 395
2429 395 -232 -866 -613 -663 -327 100 559 311 474 170 163 -252 211 322 372 484 0 156 -422 -397 -332 -184
2451 -184 456 239 468 104 -198 -487 -213 36 290 247 357 160 -301 -470 -482 94 616 289 159 89 -157
2472 -157 -384 77 -336 338 265 367 -360 -398 -120 -405 -6 487 730 328 128 -486 -325 -338 -98 254 499
2493 499 9 -106 -152 -313 -447 435 188 232 269 -128 -292 -104 -363 78 175 564 332 -129 -319 -36 18 182
2515 182 488 484 108 258 -59 -78 -199 322 549 290 -37 14 -221 -149 -188 38 129 396 320 248 -577 -638 -266
2538 -266 -49 605 380 259 -210 -656 -452 126 455 601 373 1 -159 -446 -267 -143 323 591 445 47
2558 47 -296 -597 -347 116 315 666 446 -42 -314 -924 -508 -207 110 638 445 -242 -306 -408 -128 215 366
2579 366 363 43 -184 -467 -435 -387 -102 191 430 -56 7 -402 -242 -187 11 17 308 302 -168 71 -46 -222 -439
2602 -439 355 181 553 34 69 130 -311 -195 168 -72 220 329 144 -137 -505 -328 65 42 -125 237 10
2623 10 -486 -563 -503 -399 278 375 126 16 -422 -337 -233 -7 385 366 191 -268 -82 121 -198 60 225 113
2645 113 90 -19 -101 -94 -200 36 402 247 233 11 -172 99 126 -56 278 0 248 127 -222 -26 32 25 -26
2668 -26 -295 -7 -160 30 -15 -120 -38 -77 -168 -208 -395 -192 64 15 90 89 34 -54 -147 -97 283 -117 6 -405 -249
2693 -249 -156 -422 -85 360 299 288 112 152 175 434 144 648 36 -266 -120 7 201 144 83 393 147 121 -160
2716 -160 77 27 90 379 -13 -96 -190 -390 -243 -600 188 -168 111 -333 -457 -253 -142 -107 172 371 132 134
2738 134 -73 -228 313 -80 159 161 95 -104 -133 -6 -69 360 171 309 13 -85 19 275 203 657 65 110 -80
2761 -80 13 -196 118 500 284 -252 -182 -348 -428 -198 222 162 85 -457 -482 -232 -48 440 261 -4 241 -425
2783 -425 -389 -365 -6 251 634 313 -160 -369 -254 -26 468 683 437 145 -275 -262 -217 131 277 515 -102
2804 -102 -3 -338 -200 190 253 389 321 -165 -356 -508 158 177 200 413 -50 -605 -100 -270 141 606 389 -43
2826 -43 -454 -543 -666 326 516 647 585 -52 -404 -385 -20 80 864 624 37 -231 -372 -581 47 640 602 298
2848 298 -241 -333 -504 -594 -146 307 667 -14 -203 -250 -231 -168 142 284 335 194 -201 -563 -248 -104 116 -28
2870 -28 273 37 -237 -311 -228 -27 316 150 226 366 -37 -147 -108 341 -200 323 32 -162 -42 -21 -220 -529
2892 -529 -20 77 15 175 461 -2 18 -255 -167 351 -93 71 273 -202 -41 -342 -488 -168 92 212 349
2913 349 95 -96 -281 -101 105 -22 307 288 -87 -526 -186 -105 -183 445 97 289 53 -469 52 -153 114
2934 114 557 234 113 33 -157 38 -97 -78 150 -74 -179 -230 -166 40 63 227 -135 246 41 -27 69 -657
2956 -657 -95 -39 -14 207 39 -229 -211 -202 -327 62 43 335 270 300 -162 -99 -94 -40 58 529 189 259 -66 -404 -355
2981 -355 -26 343 173 62 -18 -224 -87 -97 111 869 275 443 -249 -375 -579 -378 181 19 429 102 -649
3002 -649 -591 -452 -172 240 243 352 111 183 -385 -281 300 137 63 117 -380 -594 -388 -250 -34 19 226 -101
3024 -101 -196 -118 -95 -67 -22 166 -199 272 -36 -210 -287 -294 74 15 23 -65 -2 -15 107 -118 28 88 434 118 262
3049 262 32 -286 -149 -180 -42 -9 -327 -32 -247 -426 -386 88 30 439 472 362 301 100 -3 329 126 2
3071 2 85 -405 -310 -562 -673 -291 211 304 106 2 29 -171 16 326 355 193 -45 -161 -293 -562 -64 -8 131
3094 131 124 -54 186 -466 -278 -229 143 554 84 267 -44 -27 -379 -380 61 94 -230 58 132 62 -412 -242 70
3117 70 217 82 120 241 -7 -187 83 64 69 113 204 -83 -256 -204 -246 195 263 104 3 -125 -23 -215 -154 327
3141 327 236 215 299 -244 -141 -160 -336 -128 48 290 163 -40 18 -184 -315 -226 43 314 415 -149 -525 -39
3163 -39 -187 -57 -130 438 126 331 -44 -283 -215 138 192 446 68 -295 -14 -153 -165 172 73 334 24 72
3185 72 43 -394 -146 79 290 176 410 428 -114 -261 197 -6 378 264 -74 67 53 -11 -243 200 132 88
3207 88 309 82 -51 -425 -102 81 124 221 105 -37 -140 -453 113 -53 240 393 -111 -133 -428 32 -153
3228 -153 106 77 55 174 11 -462 -251 -75 -22 150 -77 -12 -126 126 -214 -87 95 310 310 146 6 8 54
3251 54 143 53 -143 87 81 116 45 -189 24 -176 37 211 338 105 473 -336 -358 43 -110 226 156 237 -151
3274 -151 -23 -476 15 140 522 440 152 -118 -440 -306 73 212 227 280 -127 -368 -107 -304 296 382 393 390
3296 390 -179 -414 -23 -197 65 272 -13 -201 -213 -90 -78 -94 367 192 218 8 -333 -298 -208 -73 4 91 -139
3319 -139 129 -334 72 134 12 105 -190 -113 -331 -160 65 162 365 44 65 -153 -130 45 224 249 4 -170
3341 -170 -163 46 -155 3 -108 -148 91 -323 -396 -71 90 146 -32 -20 130 8 -26 128 151 61 132 -201 187
3364 187 -114 -185 96 68 -159 63 -79 -36 176 463 289 52 -146 52 -192 164 174 109 89 15 -248 -655
3386 -655 -242 -226 -102 288 280 103 27 -638 -153 51 246 -4 53 -61 -241 -103 -109 148 15 443 108 200 -582
3409 -582 -260 -79 -47 391 264 -134 -38 -29 -170 38 37 93 -161 119 -43 135 116 -237 -69 105 -155 153 -27
3432 -27 188 62 15 -95 -4 -190 -39 -32 321 -68 -98 -196 28 -91 341 378 397 -51 -35 -105 -429 8 258 208
3456 208 143 -96 -137 -393 -213 33 179 270 -220 -4 -357 -134 -302 259 -106 -47 -44 108 -57 -170 -113 -332
3478 -332 27 7 -6 132 88 2 159 -118 -122 111 115 -16 116 64 43 -208 57 356 197 222 24 -22 -269 -7
3502 -7 122 -16 156 66 -211 -128 61 -66 -120 73 67 -148 264 -367 -371 301 -180 -125 -105 -88 -221 -50 -63 2 23
3527 23 -93 65 -93 -169 -95 73 -84 -263 179 -195 107 68 -61 -197 -223 -149 -329 169 -39 19 -138 122
3549 122 12 77 107 -40 83 174 128 95 169 -60 -230 -6 -359 -7 -193 202 -126 -443 -306 95 180 268 205
3572 205 221 -5 -221 36 -70 188 254 130 -54 -102 -80 40 -57 161 250 -165 -1 -165 -45 -1 172 193 96
3595 96 -58 96 -349 -43 13 85 -231 -41 197 -211 -40 -154 180 85 30 -351 -22 37 -235 -71 -309 -59
3617 -59 -99 -154 -148 -109 -143 -174 163 -24 -80 -237 -146 -30 145 66 136 -244 323 352 69 -232 205 -378 -134 68
3641 68 87 79 36 -173 99 119 75 -102 -150 -59 -24 150 -52 -200 -286 -297 -255 -194 -219 216 109 -106 -25 37 103 -14
3667 -14 -158 260 -201 -392 -151 -3 -60 109 138 234 137 -265 153 -24 -275 -15 92 283 -15 -344 124 86
3689 86 323 -257 -164 -49 -234 -222 13 158 110 121 49 -77 -183 -66 -379 133 524 -48 -119 -193 -35 74 -31
3712 -31 163 519 -236 -22 -253 -167 -71 147 293 -50 33 -173 165 122 -70 295 462 -27 -17 35 -260 -87
3734 -87 252 341 50 83 -240 -458 -175 177 79 288 154 -89 105 4 -272 78 -119 -31 -217 -230 -278 -397
3756 -397 -452 -61 -142 60 -15 -69 -112 -41 296 -142 -37 -46 -135 -21 239 -129 -350 -180 -164 -53 -84 238 476 56
3780 56 114 -450 -148 -14 36 460 128 -34 -289 -516 -324 -224 208 303 -182 81 -497 -246 -226 -241 341 237
3802 237 -57 -70 -245 -28 -273 -37 73 87 -231 -123 -315 -95 -84 -123 -88 -10 237 -178 -43 120 32 59 463
3825 463 92 -197 -220 -118 59 73 -75 -217 300 361 13 94 78 79 -133 188 -3 -105 6 86 113 93 -81
3848 -81 0 -218 126 341 243 34 129 -2 -66 -26 183 231 145 50 -387 -161 117 155 73 130 -156 -278 -224 -265 303
3873 303 555 301 118 -83 -343 -226 -46 190 218 16 -320 -89 -265 -285 -297 36 -3 -135 54 -379 -141
3894 -141 29 290 249 190 -20 -336 -384 -366 33 44 223 27 120 350 61 154 128 311 -174 374 49 -116 73
3917 73 108 83 207 31 -242 -57 86 327 -175 -138 -19 99 64 14 20 19 132 -15 -159 59 -42 -64 -123 -43
3941 -43 -299 -106 -74 23 74 167 42 -230 16 -311 -159 14 102 141 -85 74 -67 -31 198 59 -51 -279 111
3964 111 -82 -24 -237 264 -134 51 198 -29 -133 -76 149 343 -79 481 -2 -239 -156 -99 1 57 271 -163
3986 -163 -78 -354 -65 5 -99 -210 -124 87 17 -73 1 40 -42 81 75 -338 86 15 236 -131 19 -124 21 -320
4010 -320 286 330 -10 -319 -123 288 22 -52 130 -69 203 -32 9 -87 41 165 -85 149 -142 22 25 -69
4032 -69 -14 -36 189 156 -122 -278 -29 195 -75 119 7 82 -46 -93 35 101 -107 128 332 -32 -240 -119
4054 -119 65 186 499 210 -199 -224 -70 -516 279 273 9 241 152 -281 -75 36 -91 231 -71 -191 -74
4075 -74 -180 -293 -184 143 -182 334 211 76 -104 18 49 43 69 144 -134 -304 76 -126 62 108 35 -90 -229
4098 -229 -117 222 124 258 -251 -33 -250 66 265 -74 47 -336 -149 -38 -150 90 50 169 -58 34 -121
4119 -121 8 -94 -17 17 -50 125 0 -149 133 85 82 23 -25 -108 18 42 101 69 140 -250 -90 58 -30 14 -369
4144 -369 41 -72 -166 -46 -16 58 94 101 237 41 74 98 48 -252 -79 -20 -65 41 -24 -264 -154 -50 33 42 125
4169 125 -377 61 -197 -94 396 80 -239 -177 -52 -26 -122 -157 -186 219 -69 1 -587 -203 -154 102 184 277 20
4192 20 -32 -155 67 -30 -179 -54 289 -25 68 174 25 73 -70 78 82 25 -59 -124 -65 53 346 367 114 -407
4216 -407 -98 -25 28 26 73 33 -229 -498 -290 166 104 8 337 -203 -153 -273 -150 390 299 6 -20 -277 15 54
4240 54 138 -92 -178 -1 -129 -82 138 -27 -37 231 58 -208 22 -162 172 4 255 11 -17 -240 327 36
4262 36 -96 220 178 206 145 102 -201 -5 265 160 -41 175 -322 -409 -314 102 273 -3 -124 -18 -82 -120 -42
4285 -42 72 156 53 -299 -115 -5 237 334 125 51 -131 -81 -44 -69 -55 85 119 105 -210 -327 -160 57 119 -175
4309 -175 306 -66 -263 -86 158 88 -321 -136 -258 20 -35 -83 -17 -146 -153 34 -7 -219 -77 -278 126 332
4331 332 -72 -150 -51 111 -83 401 76 153 6 -365 37 196 406 94 -18 -359 -44 185 44 -19 -235
4352 -235 17 86 -167 34 -8 224 208 -87 -248 -65 -44 -8 -117 31 143 116 -237 65 -20 -26 -210 -73 -22
4375 -22 -159 -256 282 7 121 -38 64 167 13 -12 -51 173 414 -9 -67 -129 -288 -103 168 37 479 10
4397 10 -119 15 -374 95 -23 55 204 -10 -25 -333 -358 127 -1 159 185 -51 -91 -289 -186 76 -229 289
4419 289 46 -274 -119 115 -58 416 374 -264 9 -242 88 105 329 -203 -237 -141 -173 -84 -105 34 200 -15
4441 -15 113 -253 -30 34 -95 179 -42 225 -239 55 128 -18 148 -95 -305 -261 35 -104 -129 199 121 63
4463 63 -182 -34 83 67 233 185 101 -159 -115 -29 -82 93 28 -139 12 -87 108 -160 247 219 330 26 -1 -126
4487 -126 -18 -75 -37 134 -182 214 -204 -191 -15 25 397 61 -331 -14 -69 -66 -75 314 -161 -104 -99 -144 -350 -2
4511 -2 -33 12 5 -392 -389 -127 251 -78 228 251 -193 -245 -11 -152 53 272 35 -218 -361 -201 301 328 197 -29
4535 -29 146 -9 14 -173 134 -3 42 212 -135 -276 -267 -212 -33 31 124 -66 -121 -498 126 -32 423 347 -31
4558 -31 -313 59 -151 392 238 241 162 -79 204 -197 -113 406 -68 -45 33 -436 -323 -114 0 33 -74 -140 -226
4581 -226 -227 -275 -99 -14 9 116 -29 87 -56 -278 76 170 263 335 -280 92 28 -126 115 -74 -37 18 18 -169
4605 -169 -63 -355 70 297 37 -125 -153 -38 280 -252 -76 24 28 -126 75 -89 -17 -83 122 -150 -145 216
4627 216 -247 72 2 11 70 205 -81 -43 55 53 301 -27 -41 -315 -158 27 -3 -3 -51 246 311 165 306 118 74
4652 74 -100 -51 -144 -198 -231 -6 18 367 178 -46 -127 -29 -105 -88 78 40 36 -254 -21 -3 -36 -24 199 -67 143
4677 143 55 23 -216 231 295 -94 195 -127 -108 59 11 10 -39 -140 -163 -77 45 236 -152 -132 -303 -139 163 -239
4701 -239 185 -49 -229 204 -185 -211 123 -142 -8 -127 242 170 183 -62 48 -118 -198 129 -61 -115 -25 84
4723 84 308 -44 -219 197 -296 -185 -25 -116 191 -311 40 366 -244 19 32 -3 -90 262 -16 -154 -185 -331
4745 -331 55 62 59 -295 -210 164 -291 -221 25 24 -178 244 198 43 166 -99 348 -41 65 63 75 -158 -55 26
4769 26 112 -45 20 53 -30 -257 -98 86 -188 -63 24 27 -28 -24 4 168 76 263 -92 8 49 158 72 -40 257
4794 257 21 21 -36 -128 169 -178 291 80 21 -238 -78 -84 -18 72 -5 -63 -9 263 78 -60 -43 65 -73 -12 306
4819 306 -46 334 -41 -255 -130 42 241 -69 5 -264 95 98 117 -13 220 136 24 220 -289 161 -25 -249
4841 -249 -92 -10 93 -179 244 -185 13 36 45 -191 411 -176 -365 -133 53 105 372 187 238 -149 -155 -26 28
4864 28 153 475 -224 -98 81 -107 93 103 -61 -153 202 223 155 80 214 -159 52 -106 -352 -124 136 -207
4886 -207 98 58 172 -24 -175 -33 76 234 208 27 -40 160 -95 -357 -23 94 95 -273 -177 29 -212 67
4908 67 204 -382 -120 113 -76 32 -58 191 -2 128 38 157 -186 -189 246 118 57 86 -38 119 -396 -13
4930 -13 -12 111 125 -1 419 194 266 130 -260 119 264 -133 -156 278 45 -160 380 164 -194 -78 -155 -50
4952 -50 97 -243 56 117 -238 261 -35 -279 276 26 201 3 -24 -7 -49 72 118 -377 -205 -138 99 187 -126
4975 -126 254 191 41 151 -138 343 125 -139 321 -73 -31 74 -15 -19 -60 -197 302 13 -155 36 59 222
4997 222 187 -77 -162 141 59 45 12 57 270 -217 -211 -331 -237 -173 190 -38 13 175 6 47 68 242 -165 -9
5021 -9 -23 -1 -43 59 -86 -69 -20 -16 33 111 4 242 -179 -210 -68 -116 -104 -284 161 220 172 -96 -72 228 -56 7
5047 7 36 -81 -113 129 248 61 55 256 43 87 73 -65 -142 49 42 -57 54 -193 -190 184 34 131 42 -140 24
5072 24 -44 -248 -54 382 -44 -33 -12 47 35 160 -76 -32 196 -99 -108 -439 -164 -43 103 -128 132 124 78 -24
5096 -24 -43 260 -78 -111 78 74 -360 17 -65 -107 8 216 147 38 344 -46 62 -90 32 -167 -113 -235 193
5119 193 38 -139 125 335 29 -34 104 -165 145 -112 -181 148 -57 16 -79 99 -11 -38 41 47 65 112 -95
5142 -95 213 256 -22 53 50 -44 -57 106 -346 -172 -29 304 -264 -173 -248 -24 -249 -104 246 -24 59 -113 46
5165 46 96 443 -227 219 -148 73 -77 -113 -44 225 -168 -279 214 -225 -87 -243 -144 -225 -209 98 -213 17
5187 17 197 -104 47 -43 -36 8 247 -76 -180 347 242 54 126 299 51 -77 21 -439 151 12 81 -264 -10
5210 -10 -257 -225 115 189 193 197 -103 -170 -104 162 -184 1 45 -53 86 -8 40 -43 183 -59 217 -94 -92 -188 -484 83
5236 83 28 -260 54 -84 -179 -159 22 26 48 -28 125 -26 -38 -51 72 225 150 -33 -183 -11 -144 38 -203 -231
5260 -231 16 -156 -52 294 266 72 -322 -171 54 -307 -93 136 -136 52 96 -191 -106 14 52 217 76
5281 76 204 121 341 -205 210 -101 -76 233 -211 253 -141 285 117 196 -98 -266 -134 -101 79 -115 -180 -111
5303 -111 -136 138 78 205 -70 -75 -18 -129 67 -20 -340 -190 -111 -116 -121 -177 221 -24 21 154 -14 -151 -48 -167
5327 -167 66 -104 -226 -275 30 -13 -109 -36 75 151 78 -61 41 -97 170 41 104 104 -257 259 -70 -61 181 186
5351 186 84 92 176 -104 164 -33 455 -144 -230 -278 66 156 150 -18 84 -286 68 -90 21 36 -63 -53 508 135
5375 135 -63 129 -164 -155 -270 -129 -166 240 -44 -222 -294 127 -113 190 78 148 -20 0 -76 22 -10 -51 -19 173
5399 173 157 90 -13 -1 -225 -49 -134 127 15 -135 164 218 -163 333 93 -303 96 -120 138 30 -154 -79
5421 -79 91 -217 87 151 25 -10 -7 -207 58 -146 -46 -57 111 -43 -86 86 -243 447 184 -21 -173 -104 -78
5444 -78 241 28 -228 -115 -64 -121 -112 86 -244 -151 17 259 -198 -294 279 -44 237 67 327 -140 80 -71
5466 -71 -162 -277 35 -2 -305 -94 -30 189 95 -133 109 -201 -86 -46 -94 56 -101 -205 -68 -172 -160 -231 227
5489 227 120 228 1 -2 192 -125 245 -199 -274 1 -145 165 -232 -88 144 -92 27 262 -254 -12 331
5510 331 -91 -198 22 165 -40 182 77 -59 263 -75 -118 373 28 -83 21 28 247 -46 14 293 -60
5531 -60 -173 139 -59 -28 -4 195 -2 -37 19 339 147 -81 149 42 -88 13 60 -89 25 63 -36 -95 -137
5554 -137 -59 -242 238 65 105 -84 92 -29 58 124 1 -427 84 116 -211 -125 83 76 275 144 70 157 -183
5577 -183 -144 96 213 -334 -178 -52 -50 65 289 -108 253 70 -188 -121 -372 -140 66 -175 104 7 -137 -20
5599 -20 138 -149 137 210 106 293 -7 53 -18 -237 159 -127 78 -253 236 -378 59 -61 -10 273 100 19
5621 19 -104 -152 -51 -145 -103 149 -86 -129 103 -110 -13 -214 380 143 -18 60 -167 79 59 63 359 180 -37
5644 -37 81 -233 69 -103 -7 36 72 -26 -36 -25 36 90 69 -347 -240 -10 221 158 131 397 42 -64 315 142
5668 142 -72 104 -211 130 -187 -31 110 -92 566 -184 111 -200 -384 238 210 -73 -267 -81 -219 60
5688 60 -374 -17 187 86 -176 -39 -164 79 55 47 -11 290 -43 148 -220 9 -121 -118 101 163 2 -318 -258
5711 -258 -41 113 -116 42 -312 -24 -166 61 -120 299 -190 379 225 -284 -64 -43 98 327 96 315
5731 315 -97 7 92 -126 165 73 -53 -190 160 -92 90 9 52 -350 -158 135 255 -216 -42 226 -77
5752 -77 -62 -9 111 101 290 -54 -52 78 93 110 76 125 -53 -20 196 -96 -2 117 139 -48 212 121 -97 230 -45
5777 -45 -119 67 316 26 -211 22 19 181 30 -189 -164 -61 -32 -214 2 -96 121 -41 -182 84 11 -148 164
5800 164 -94 221 160 30 -313 -59 129 -100 203 -195 -2 180 297 132 248 267 -382 -206 192 102 1
5821 1 -59 59 -22 281 -212 209 114 -84 113 -35 49 177 67 -187 125 -116 -386 -102 -40 -152 -370 -166
5843 -166 -84 106 -75 -137 52 -95 -273 -242 -452 -175 205 -138 -184 205 -46 299 35 -24 -113 -89 71 424
5865 424 -200 262 -19 -120 16 -134 193 -143 -209 94 349 16 -81 -136 272 -257 -38 -13 -112 360 165 -329
5887 -329 -52 156 -136 -122 258 -166 171 27 -170 -252 45 262 -68 126 261 359 -124 27 142 183 126 -168
5909 -168 -102 -51 98 -59 -130 -157 -35 366 22 -54 -141 -158 -307 33 171 -32 13 111 -397 -250 -95 -56 139
5932 139 -35 232 3 -5 -86 -233 -229 51 -198 232 -245 -138 21 352 299 14 -158 -41 134 55 49 -109 26
5955 26 147 190 54 -209 125 -67 54 -218 17 138 18 -196 -351 -139 222 -207 -247 -69 349 40 -185
5976 -185 -98 152 -159 -284 321 140 -303 67 -284 25 -135 -280 -37 -82 -83 -50 153 -235 -3 -269 120 280
5998 280 24 -90 56 123 -218 8 -183 67 63 -134 -155 -139 7 67 125 201 -163 48 288 -42 224 -138 71
6021 71 65 -205 186 114 -61 350 166 -186 -175 -156 40 232 57 -209 -262 -29 -13 -92 414 -157 -42 240 35
6044 35 1 51 -161 -489 123 -16 -54 109 44 235 239 -120 -20 -52 -32 -231 -196 -213 308 143 138 120 63 103 -94
6069 -94 109 -56 -15 -376 -152 229 -36 199 -144 140 -145 -102 -125 191 33 -92 81 -46 299 -148 101
6090 101 -109 386 -228 291 176 -296 -167 9 -171 -178 47 204 202 248 209 22 294 -36 165 -213 -348 -7
6112 -7 71 174 -266 -226 -237 139 -273 -55 -310 -49 130 17 168 -182 149 -53 -378 -110 59 6 -1 190 -182
6135 -182 -96 -6 -363 -84 -99 23 -72 150 -170 -77 132 -41 226 -52 -99 -69 135 113 123 128 -34 -127 17 -25
6159 -25 125 195 103 86 294 66 -98 234 -35 340 -32 -66 175 -108 125 139 -140 -39 -7 -6 -86 91 124 -117
6183 -117 122 23 -229 -160 82 -102 171 19 -81 -8 -43 28 168 47 183 -42 -243 77 48 -230 -79 42
6205 42 -410 -325 -137 -77 109 58 -99 135 256 -79 5 203 144 -246 0 7 -207 -98 -28 -99 191 -17 14 -224
6229 -224 -262 80 -62 -28 168 245 -134 -250 188 -119 -66 -30 -258 72 48 100 -46 49 29 198 -29 397 290
6252 290 -83 189 86 -108 122 332 -94 70 -286 176 40 -166 101 -358 -51 128 114 48 -143 -192 147
6273 147 32 -45 204 46 -102 179 -72 49 14 -195 138 207 -161 126 -163 219 175 -135 138 -16 161
6294 161 -83 65 210 41 127 93 -192 -90 48 -68 175 139 379 281 -69 -48 -182 -185 -70 107 -96 10
6316 10 70 -112 176 119 -8 -50 -113 -35 -158 8 20 249 -25 -304 95 -123 102 -280 -276 -60 -45 16 -109 -210
6340 -210 -255 -108 231 45 189 27 22 33 -326 66 170 -87 -62 -45 93 47 -78 -78 -307 189 25 124 18
6363 18 158 132 145 -76 166 -74 29 -38 -218 24 -72 -149 58 6 62 -53 91 9 -72 41 -327 -102 99
6386 99 72 -234 55 64 -183 -349 352 76 299 117 171 78 7 -49 47 -272 20 60 356 -98 3 -317 62
6409 62 175 -60 83 -38 190 -76 -164 -137 -202 -127 11 -54 -8 65 30 -125 -23 146 123 -67 -318 -50 58
6432 58 -270 -208 -149 -28 205 -61 -144 179 155 254 -76 -135 233 -71 -256 35 35 -88 -67 6 14 30 75 151 -83
6457 -83 109 113 326 149 -94 -110 132 226 12 -103 4 246 89 297 166 -62 -9 57 -14 109 -60 101 -96
6480 -96 19 -50 25 -117 -163 -167 -145 -34 -39 255 3 49 111 -91 11 39 248 246 -63 83 -149 141 25 -30 172
6505 172 86 36 78 -300 -336 -6 1 101 -18 8 117 -134 -101 75 196 -97 253 -86 351 147 -161 14 90
6528 90 220 -54 71 269 -17 -202 217 160 -108 10 191 -95 -98 -34 -48 42 -69 195 -11 -9 -16 175 -38 156
6552 156 -381 104 118 130 90 231 -1 -278 67 -29 -129 69 67 260 -123 -238 -185 33 -92 24 35 -24 -84
6575 -84 -19 60 152 -108 91 278 -68 -253 -188 -319 -262 -15 4 -117 33 57 0 116 -160 113 -26 -31 -339 211
6599 211 -162 -65 125 189 -136 318 -52 216 235 8 135 197 -115 -5 42 -13 16 100 56 -136 -73 -88 143 160
6623 160 183 -99 8 174 408 147 -45 -132 147 3 -7 -186 -158 151 43 40 -53 26 33 144 -14 -9 -72 179
6647 179 1 -150 28 63 -130 12 -155 46 -87 -13 -45 -27 234 30 87 -59 -46 105 82 257 6 -167
6669 -167 -36 234 250 -13 -42 219 74 -234 126 189 -105 183 -172 -148 132 31 83 -191 -308 -21 -185 -13
6691 -13 10 169 116 -148 -114 136 137 28 85 -101 -19 34 4 48 -274 -22 -62 -227 -197 -226 27 56 -134 -316 129
6716 129 70 156 -152 -24 -5 -227 -22 -159 97 109 236 -119 -145 -146 471 -106 109 170 -246 -2 -54 187 81
6739 81 225 -27 -160 103 -90 -172 -203 94 254 -211 -22 76 -123 104 85 -86 -92 -56 -93 -26 58 -58 -148 32
6763 32 -50 -6 125 5 66 48 -24 -347 157 154 356 226 154 -262 163 150 32 21 22 -22 217 352 -103 74 -140
6788 -140 123 122 -106 161 -33 -145 -272 6 -94 -153 -15 -111 110 256 -194 71 16 349 248 -68 -159 -320
6810 -320 81 -82 -56 -220 1 118 22 83 140 -55 -264 -146 -118 7 -73 48 259 9 228 -54 112 -486
6832 -486 -150 -156 285 -17 -128 357 -300 -91 157 22 11 -161 -146 62 -29 -170 220 55 19 -73 66 -303
6854 -303 302 -22 -99 161 -235 166 -19 -18 -82 -45 -19 281 -16 356 -83 -42 -25 -313 34 -144 -68 -154 13
6877 13 -91 142 13 78 56 15 53 -9 -7 261 164 82 -257 152 -14 -14 -79 -128 -440 -337 60 56 7 -70 -326 156
6903 156 -153 -21 57 121 347 -345 102 286 141 -188 -225 67 -11 -172 174 14 110 3 -38 -96 -229 -275 -140
6926 -140 -89 417 107 32 -238 169 -7 150 233 -20 -129 -178 178 -6 65 72 145 43 -285 2 398 -169 301
6949 301 167 128 -21 -328 -219 -20 186 59 -116 -125 78 55 -88 -21 -2 9 -229 185 163 12 188 110 24
6972 24 -44 106 -107 154 46 100 164 109 -151 192 -188 -308 -122 -94 -88 -287 -15 -20 83 -101 243 -71 260
6995 260 215 69 131 -212 -114 324 201 -80 115 -190 -53 -153 -133 47 142 142 -19 -246 213 -150 -259 110
7017 110 -296 21 101 22 -192 -34 -202 -60 -154 70 -37 -63 206 155 -88 88 -159 76 -21 -215 144 -203
7039 -203 81 -5 -149 -54 53 36 -96 -7 -357 -255 193 -41 -264 -35 -293 90 56 38 -187 -54 -146 243
7061 243 394 -159 -29 50 -64 -18 -91 -98 -57 -88 -100 54 -56 -376 -199 60 -111 -195 -201 11 426 -192 171 -12
7085 -12 -206 121 210 -144 33 -18 108 -171 21 53 97 262 -78 -36 -7 -99 -100 22 -60 -132 237 -81 36 -114
7109 -114 -37 -182 -158 217 15 151 145 277 -259 -61 194 -149 -5 -86 -37 121 -236 -167 -59 -287 209 -26
7131 -26 -199 23 -1 -164 -74 -76 4 17 -35 -62 -142 -211 -4 -12 -65 136 96 3 309 22 -179 -183 53 420 14 78
7157 78 -97 -87 0 -179 -123 -1 26 -125 13 -6 50 202 -154 -171 -85 -8 -229 -50 -326 -107 -86 -92 -165 -46 -111
7182 -111 30 -339 169 314 -84 168 -7 204 -28 -142 230 -62 134 181 21 -171 -214 62 35 127 -201
7203 -201 -221 -104 286 -139 -147 40 -50 181 -179 -179 -81 -260 59 174 49 54 12 160 147 118 -37 166 -171 -13
7227 -13 -203 -218 -138 -361 120 237 -23 60 16 63 -70 98 -19 -3 244 -122 50 -62 -216 -271 -15 37 110
7250 110 -112 135 -365 -173 -256 245 174 293 250 117 -102 23 -105 -143 -119 85 22 -58 312 -21 2 239 -58
7273 -58 -60 -3 -118 -19 -156 52 -20 64 -247 22 -61 -3 -139 52 215 -42 -148 -55 -156 -13 -32 -68 -146 -115 225
7298 225 -52 -147 -27 67 -15 -30 -211 29 -188 -153 -9 -118 19 -164 21 -11 71 -134 -140 -44 38 -27 171 206
7322 206 80 97 -236 -7 -65 -100 -103 -108 -115 93 -65 177 -220 188 3 175 296 -169 106 21 338 -238 -269 56
7346 56 46 -98 38 -129 -267 119 -46 -67 -180 130 -27 0 31 185 -110 -133 271 -54 -16 56 102 84 -8 -150
7370 -150 -450 -18 -292 51 115 7 262 138 84 -85 -53 -64 -128 -333 -96 -96 -219 -177 105 88 -160 -3 -97
7393 -97 -218 148 -31 119 108 248 -69 -312 197 -384 -12 80 25 56 -399 -22 -191 -222 -89 -121 208 12
7415 12 -244 8 -27 14 -217 -46 -119 246 -54 -92 148 133 -455 -91 230 508 -50 -116 -37 111 196 54 329
7438 329 -198 96 -162 -119 80 -35 57 -292 -126 99 210 -105 84 315 -87 -366 -37 250 -70 22 -49
7459 -49 135 17 -142 150 8 76 -7 13 -312 -90 -43 -111 -78 -133 -123 16 210 17 241 -100 111 -111 53
7482 53 -195 45 -141 -160 -252 -141 -209 -65 40 170 -100 225 90 -76 65 -177 62 -121 -74 -208 -59 -256
7504 -256 -133 148 138 -111 -78 -86 -189 -125 -92 -187 -261 120 -309 250 -54 -104 -272 1 -274 -78 -55 -146 -28 -291
7528 -291 -171 -38 -68 187 382 -148 -123 -34 37 -27 51 87 15 73 73 37 8 -170 134 -179 -8 51 -191 58 196
7553 196 175 -320 -148 69 -139 -26 69 -82 -37 81 -50 27 72 -45 -250 -31 -136 350 10 107 -8 131
7575 131 306 -133 28 -56 163 -174 228 -88 -45 21 108 24 155 -106 -15 252 -274 -42 41 -153 -272 -22
7597 -22 -228 -21 9 -171 -62 -79 -8 100 -116 278 274 362 129 288 -141 50 -170 57 151 132 76 -344 -30
7620 -30 -258 157 145 310 134 70 -56 -194 168 47 135 50 -158 -93 71 -233 -135 -367 37 -50 60 -71 -79
7643 -79 72 -194 319 -407 58 -29 95 8 -125 -16 352 141 -55 -112 -36 -73 -10 -79 111 -96 -52 159 50
7666 50 -116 134 235 247 111 -172 51 -18 -137 241 34 73 -95 132 -38 66 -98 -69 -1 -41 38 113 70
7689 70 9 -46 133 -219 -72 94 -248 231 -72 98 -73 -30 241 134 -5 67 -52 -15 -109 66 -11 -232 450
7712 450 76 127 -137 58 -261 -4 32 -114 -121 -221 -113 -107 -104 -63 245 -36 44 -209 183 110 68 -206 -91 40
7736 40 169 -144 -80 162 120 -115 -42 15 124 150 106 57 33 -298 73 -86 -32 11 -144 -46 147 92 -171 0
7760 0 60 81 -72 109 157 -57 -248 3 -84 55 226 -94 50 329 240 -86 -26 73 -156 -59 155 132 -37 -179
7784 -179 -185 88 -77 -145 171 -75 271 135 142 10 -263 54 98 246 -248 -2 119 51 61 97 -4 -114 13
7807 13 -40 -73 -22 -210 -258 67 -72 -165 -6 155 191 -166 -83 15 -67 160 65 -177 69 79 173 73 151 -142 196
7832 196 160 -221 -225 16 97 89 -52 102 -251 -104 194 -11 -83 -59 -389 -5 -56 108 133 -105 -161 323 -125 -34
7856 -34 192 11 154 -23 -91 -256 57 -38 2 -37 103 -96 13 -238 -248 -343 -55 123 222 -2 17 112 -80
7879 -80 -33 212 -168 64 -38 -199 -132 36 69 157 -199 -412 24 -89 -51 -1 4 -45 164 108 65 246 -114 78
7903 78 -16 244 -26 -5 -230 81 125 25 389 -81 -133 -133 -57 -28 25 -7 -39 35 96 -61 8 -283 -45 -19 35 143
7929 143 84 -99 103 -164 32 74 -136 308 -214 125 -189 -113 14 50 -148 245 0 8 -4 -159 -357 -20
7951 -20 -162 96 -5 -4 -275 240 -92 -36 315 -137 -112 -69 -210 355 203 57 -76 -37 156 79 150 22 127
7974 127 245 -156 -198 66 -85 164 -128 144 -188 24 96 -136 -19 46 -41 329 -135 -166 139 125 267 36
7996 36 -162 -64 416 64 46 195 345 88 -13 220 -65 526 28 -87 96 22 -176 144 72 46 62 -116
8018 -116 -182 260 -50 -196 229 -59 22 281 95 75 25 -99 -116 245 54 34 214 -107 -13 -110 -90 161 -43
8041 -43 252 -47 -49 100 -41 -91 152 -42 353 -346 -161 259 71 129 -48 39 -141 66 -416 264 -121 32
8063 32 239 -154 92 103 -216 -273 -108 -121 -117 -60 122 184 252 -245 156 210 137 -128 -89 58 277 100 -128 -39
8087 -39 140 298 -22 75 49 37 229 -32 -194 -197 -87 227 -45 224 144 -176 47 138 293 -232 -328 -26 56
8110 56 3 21 -14 -82 -77 -147 -175 -135 -109 -103 -131 -259 152 252 -78 -74 147 -24 128 -175 26 -126 -51 -194 -289 62
8136 62 -116 77 164 275 117 -146 -248 90 168 -49 -46 80 206 78 230 16 -260 -160 -180 -199 39 -209
8158 -209 34 -69 -26 -73 -8 32 126 -128 64 50 446 165 238 227 32 -78 -43 23 -108 -84 -220 21 -164 -220
8182 -220 -121 -79 -113 -46 190 -71 33 68 -310
8191c10
##END NTUPLES=NMR FID
##END=
