##TITLE=1H_Ser 5157
 CDCl3
 8 sc, 
 26.10.2022
##JCAMPDX= 6.0         $$ Bruker NMR JCAMP-DX V2.0
##DATA TYPE= NMR FID
##DATA CLASS= NTUPLES
##ORIGIN= UXNMR, Bruker Analytische Messtechnik GmbH
##OWNER= root
$$ XWIN-NMR		Version 3.5
$$ Wed Oct 26 13:58:38 2022 Russian Standard Time (UT+4h)  she@DPX200
##.OBSERVE FREQUENCY= 200.1313499994
##.OBSERVE NUCLEUS= ^1H
##.DELAY= (6, 6)
##.ACQUISITION MODE= SIMULTANEOUS
##.ACQUISITION SCHEME= undefined
##.AVERAGES= 8
##.DIGITISER RES= 18
##SPECTROMETER/DATA SYSTEM= spect
##.PULSE SEQUENCE= zg30
##.SOLVENT NAME= CDCl3
##.SHIFT REFERENCE= (INTERNAL, CDCl3, 0, 15.7039)
##AUDIT TRAIL= $$ (NUMBER, WHEN, WHO, WHERE, WHAT)
$$ ##TITLE= Audit trail, XWIN-NMR		Version 3.5
$$ ##JCAMPDX= 5.01
$$ ##ORIGIN= Bruker BioSpin GmbH
$$ ##OWNER= she
$$ F:/spectra/data/she/nmr/H-F/1/audita.txt
$$ ##AUDIT TRAIL=  $$ (NUMBER, WHEN, WHO, WHERE, WHAT)
(   1,<2022-10-26 13:57:49.37 +0400>,<she>,<DPX200>,
      <created by zg, POWCHK disabled, PULCHK disabled
       configuration hash MD5:
       00 E9 B6 7A A2 85 ED C7 34 08 36 98 17 FE 4E 26
       data hash MD5: 16K
       E7 07 12 47 89 E9 B5 E4 69 D2 FA DE 54 F0 FD 02>)
$$ ##END=
$$ 
$$ hash MD5
$$ 66 77 35 59 AF 75 86 46 F6 C8 37 A0 3D 31 ED 47
##$RELAX= 
##$RELAX= 
##$RELAX= 
##$RELAX= 
##$RELAX= 
##$RELAX= 
$$ Bruker specific parameters
$$ --------------------------
##$DU= <F:/spectra>
##$EXPNO= 1
##$NAME= <H-F>
##$PROCNO= 1
##$TYPE= <nmr>
##$USER= <she>
##$AMP= (0..31)
100 100 100 100 100 100 100 100 100 100 100 100 100 100 100 100 100 100 
100 100 100 100 100 100 100 100 100 100 100 100 100 100 
##$AQSEQ= 0
##$AQ_mod= 1
##$AUNM= <au_zg>
##$AUTOPOS= <>
##$BF1= 200.13
##$BF2= 200.13
##$BF3= 200.13
##$BF4= 200.13
##$BF5= 200.13
##$BF6= 200.13
##$BF7= 200.13
##$BF8= 200.13
##$BYTORDA= 1
##$CFDGTYP= 0
##$CFRGTYP= 5
##$CHEMSTR= <none>
##$CNST= (0..31)
1 1 145 1 1 1 1 1 1 1 1 1 1 1 1 1 1 1 1 1 1 1 1 1 1 1 1 1 1 1 1 1 
##$CPDPRG= <>
##$CPDPRG1= <>
##$CPDPRG2= <>
##$CPDPRG3= <>
##$CPDPRG4= <mlev>
##$CPDPRG5= <mlev>
##$CPDPRG6= <mlev>
##$CPDPRG7= <mlev>
##$CPDPRG8= <mlev>
##$CPDPRGB= <>
##$CPDPRGT= <>
##$D= (0..31)
0 1.2 0 0 0 0 0 0 0 0.06 0 0.03 0 0 0 0 0.0002 0 0 0 0 0 0 0 0 0 0 0 0 
0 0 0 
##$DATE= 1666778268
##$DBL= (0..7)
120 120 120 120 120 120 120 120 
##$DBP= (0..7)
150 150 150 150 150 150 150 150 
##$DBP07= 0
##$DBPNAM0= <>
##$DBPNAM1= <>
##$DBPNAM2= <>
##$DBPNAM3= <>
##$DBPNAM4= <>
##$DBPNAM5= <>
##$DBPNAM6= <>
##$DBPNAM7= <>
##$DBPOAL= (0..7)
0.5 0.5 0.5 0.5 0.5 0.5 0.5 0.5 
##$DBPOFFS= (0..7)
0 0 0 0 0 0 0 0 
##$DE= 6
##$DECBNUC= <off>
##$DECIM= 32
##$DECNUC= <off>
##$DECSTAT= 4
##$DIGMOD= 1
##$DIGTYP= 9
##$DL= (0..7)
0 120 120 120 120 120 120 120 
##$DP= (0..7)
150 150 150 150 150 150 150 150 
##$DP07= 0
##$DPNAME0= <>
##$DPNAME1= <>
##$DPNAME2= <>
##$DPNAME3= <>
##$DPNAME4= <>
##$DPNAME5= <>
##$DPNAME6= <>
##$DPNAME7= <>
##$DPOAL= (0..7)
0.5 0.5 0.5 0.5 0.5 0.5 0.5 0.5 
##$DPOFFS= (0..7)
0 0 0 0 0 0 0 0 
##$DQDMODE= 0
##$DR= 18
##$DS= 0
##$DSLIST= <SSSSSSSSSSSSSSS>
$$ [...]
##$SUBNAM2= <"">
##$SUBNAM3= <"">
##$SUBNAM4= <"">
##$SUBNAM5= <"">
##$SUBNAM6= <"">
##$SUBNAM7= <"">
##$SUBNAM8= <"">
##$SUBNAM9= <"">
##$SW= 18.0517283424941
##$SWIBOX= (0..15)
0 0 2 0 0 0 0 0 0 0 0 0 0 0 0 0 
##$SW_h= 3612.71676300578
##$TD= 16384
##$TD0= 1
##$TE= 0
##$TE2= 300
##$TE3= 300
##$TEG= 300
##$TL= (0..7)
0 120 120 120 120 120 120 120 
##$TP= (0..7)
150 150 150 150 150 150 150 150 
##$TP07= 0
##$TPNAME0= <>
##$TPNAME1= <>
##$TPNAME2= <>
##$TPNAME3= <>
##$TPNAME4= <>
##$TPNAME5= <>
##$TPNAME6= <>
##$TPNAME7= <>
##$TPOAL= (0..7)
0.5 0.5 0.5 0.5 0.5 0.5 0.5 0.5 
##$TPOFFS= (0..7)
0 0 0 0 0 0 0 0 
##$TUNHIN= 0
##$TUNHOUT= 0
##$TUNXOUT= 0
##$USERA1= <user>
##$USERA2= <user>
##$USERA3= <user>
##$USERA4= <user>
##$USERA5= <user>
##$V9= 5
##$VALIST= <valist>
##$VCLIST= <CCCCCCCCCCCCCCC>
##$VD= 0
##$VDLIST= <DDDDDDDDDDDDDDD>
##$VPLIST= <PPPPPPPPPPPPPPP>
##$VTLIST= <TTTTTTTTTTTTTTT>
##$WBST= 1024
##$WBSW= 4
##$XGAIN= (0..3)
0 0 0 0 
##$XL= 0
##$YL= 0
##$YMAX_a= 317238
##$YMIN_a= -532803
##$ZGOPTNS= <>
##$ZL1= 120
##$ZL2= 120
##$ZL3= 120
##$ZL4= 120
##$ABSF1= 10
##$ABSF2= 0
##$ABSG= 5
##$ABSL= 3
##$ALPHA= 0
##$AQORDER= 0
##$ASSFAC= 0
##$ASSFACI= 0
##$ASSFACX= 0
##$ASSWID= 0
##$AUNMP= <proc_1d>
##$AZFE= 0.1
##$AZFW= 0.1
##$BCFW= 1
##$BC_mod= 2
##$BYTORDP= 1
##$COROFFS= 0
##$CY= 11.3945322036743
##$DATMOD= 1
##$DC= 2
##$DFILT= <>
##$DTYPP= 0
##$F1P= 2.36226072786647
##$F2P= -0.459571619588291
##$FCOR= 0.5
##$FTSIZE= 0
##$FT_mod= 4
##$GAMMA= 1
##$GB= 0.15
##$INTBC= 1
##$INTSCL= 1
##$ISEN= 128
##$LB= 0.24
##$LEV0= 0
##$LPBIN= 0
##$MAXI= 10000
##$MC2= 0
##$MEAN= 0
##$ME_mod= 0
##$MI= 1.114404
##$NCOEF= 0
##$NC_proc= 0
##$NLEV= 6
##$NOISF1= 3.799351
##$NOISF2= 2.8
##$NSP= 1
##$NTH_PI= 0
##$NZP= 0
##$OFFSET= 15.70392
##$PC= 1
##$PHC0= -18400.29
##$PHC1= 19.4007
##$PH_mod= 1
##$PKNL= yes
##$PPARMOD= 0
##$PSCAL= 0
##$PSIGN= 0
##$REVERSE= no
##$SF= 200.130013532006
##$SI= 16384
##$SIGF1= 3
##$SIGF2= 2
##$SINO= 400
##$SIOLD= 16384
##$SREGLST= <1H.CDCl3>
##$SSB= 0
##$STSI= 0
##$STSR= 0
##$SW_p= 3612.71676300578
##$SYMM= 0
##$S_DEV= 0
##$TDeff= 0
##$TDoff= 0
##$TI= <>
##$TILT= no
##$TM1= 0
##$TM2= 0
##$TOPLEV= 0
##$USERP1= <user>
##$USERP2= <user>
##$USERP3= <user>
##$USERP4= <user>
##$USERP5= <user>
##$WDW= 1
##$XDIM= 8192
##$YMAX_p= 0
##$YMIN_p= 0
$$ End of Bruker specific parameters
$$ ---------------------------------
##NTUPLES= NMR FID
##VAR_NAME=  TIME,          FID/REAL,        FID/IMAG
##SYMBOL=    X,             R,               I
##VAR_TYPE=  INDEPENDENT,   DEPENDENT,       DEPENDENT
##VAR_FORM=  AFFN,          ASDF,            ASDF
##VAR_DIM=   8192,          8192,            8192
##UNITS=     SECONDS,       ARBITRARY UNITS, ARBITRARY UNITS
##FACTOR=    0.0002768,     1,               1
##FIRST=     0,             0,               0
##LAST=      2.2672688,     0,               0
##MIN=       0,             -532803,         0
##MAX=       2.2672688,     317238,          0
$$ Real data points
##PAGE= N=1
##DATA TABLE= (X++(R..R)), XYDATA
0@%%%%%%%%%Oj4J6j6K4l2M0n6P2q7J03j20J44j72K01k37K76l22L74m32M96n67
$$ 0 0 0 0 0 0 0 0 0 0 6 -8 8 -8 16 -16 24 -32 40 -47 56 -64 80 -92 109 -128 148 -174 200 -232 264 -303
31c03O47p36Q38r48J068j203J350j511J687j880K093k324K574k847L150l481L838
$$ -303 344 -392 446 -502 566 -637 713 -798 889 -991 1102 -1222 1352 -1495 1655 -1826 2012
48B012m231M662n135N657o232O871p586Q391r299J0334j1528J2920j4575J6579
$$ 2012 -2219 2443 -2692 2965 -3267 3604 -3982 4409 -4890 5444 -6084 6836 -7739 8840
62H840j9058K2221k6418L2284m1129N6136q8115K74015l38219l27096P02075o2536
$$ 8840 -10218 12003 -14415 17869 -23260 32876 -55239 218776 -119443 -446539 255536 193000
74A93000l78372J83189J23603l56359J96645L14408l60243k30138M51519N4036
$$ 193000 -185372 -2183 121420 -234939 -38294 276114 -84129 -314267 137252 191288
84A91288l47065J00913K20537j81985r165J26143k02641n8268L41695m7654l36617
$$ 191288 -155777 -54864 165673 -16312 -25477 100666 -101975 -160243 181452 133798 -202819
95b02819J33278K32306j88124m7137J76718j41760j29781K78543N4909k90913
$$ -202819 -69541 162765 -25359 -72496 104222 -37538 -167319 111224 166133 -124780
105a24780L5571J95645j41432m8307K10349q3362j93705K04003J20078k67627
$$ -124780 -89209 106436 -34996 -83303 127046 43684 -150021 53982 174060 -93567
115i3567k1134K51653j02726k03161J76151J15957j90411j2237J47814r0261p8668
$$ -93567 -114701 136952 34226 -168935 7216 123173 -67238 -79475 68339 -21922 -100590
126a00590J66761L0993j62989K5189J20767n7960n8258N2588j4629l1696N4278
$$ -100590 66171 97164 -65825 -40636 80131 22171 -36087 16501 1872 -29824 24454
137B4454q536m8513O4138R126j25334L2614J56209o3978j36985Q6865P6157r7018
$$ 24454 15918 -32595 31543 40669 -84665 -52051 104158 40180 -96805 -9940 66217 -30801
149c0801J69Q0161p8029m3449J39932L158j51816N2363J27738j07552q7820J27924
$$ -30801 -30632 49529 -28500 -71949 67983 71141 -80675 -28312 99426 -8126 -95946 31978
161C1978L0075j10546L2449N8381q8206Q162J20200o9761j11785J21914Q0308
$$ 31978 62053 -48493 -16044 42337 -45869 -37707 82493 12732 -99053 22861 103169
172A03169j34427j8787J15240n5951q4235J00337L2447j08347K4950P7159p7387
$$ 103169 -31258 -50045 65195 9244 -74991 25346 57793 -50554 -25604 51555 -25832
183b5832k3985J04682l7014r6678Q8710O0706j09602K83R6938o6887n8757J11543
$$ -25832 -49817 54865 17851 -78827 9883 70589 -39013 -38730 58208 -8679 -67436 44107
195D4107L577j11876O6378Q0492j21845k5120J44761m1180j30085R3690P6125
$$ 44107 47684 -64192 2186 82678 -39167 -64287 80474 39294 -90791 2899 79024
206G9024j20785k820J10115p3131p1231J21147J3252j23671N7386Q9175j12293
$$ 79024 -41761 -44581 65534 -7597 -78828 42319 55571 -68100 -10714 78461 -33832
217c3832l0666J30607l6670j10937Q8662N5535j09518J8577R4947q5723m9584
$$ -33832 -64498 66109 29439 -81498 7164 62699 -46819 -28242 66705 -19018 -68602
228f8602J25062r977j18071P2030P5479j11849j2963J13434n3328p8478J00567
$$ -68602 56460 46483 -71588 442 75921 -35928 -48891 64543 11215 -67263 33304
239C3304J7507j12880N0209Q7504j04935l6411J23938k8368j05619Q5368N4936
$$ 33304 50811 -62069 -11860 75644 -29291 -65702 58236 29868 -75751 9617 64553
250F4553j17210P402J12089o4408p0439J02488J0225j04015N4838P6307j01601
$$ 64553 -52657 -45255 66834 2426 -68013 34475 44700 -59315 -4477 71830 -29771
261b9771k7325J16606k7846r6123P2281M8153r3213J1455Q1921o5518m4228R8064
$$ -29771 -57096 59510 31664 -64459 7822 55975 -37238 -25783 56138 -9380 -53608 44456
273D4456p539r9959N5534P0608q8800k2813R2052l1595o6624P5568K1280r4144
$$ 44456 36917 -63042 -7508 63100 -25700 -48513 43539 11944 -54680 20888 42168 -51976
285e1976L1744Q3862p5303m6285R7839m021r1110N2733N8316q4581r096R1269
$$ -51976 -20232 63630 -11673 -57958 39881 35860 -55250 -2517 55799 -28782 -37878 53391
297E3391m1038o8563P9276K6554r2875K2129P8192o5030m2526Q5660n903q1932
$$ 53391 12353 -56210 23066 49620 -43255 -21126 57066 -7964 -50490 35170 29267 -52665
309e2665M8820N2463p6607q655P9828l6241n7483O9285J9114p9972K5392O6598
$$ -52665 -3845 48618 -27989 -36644 43184 6943 -50540 18745 37859 -42113 -16721 49877
321D9877o0765l2688P8101r494p0435M9458M1811p2938M17P4076m1822n3170P0860
$$ 49877 -10888 -43576 34525 25031 -45404 4054 45865 -27073 -26656 47420 5598 -47572 23288
334B3288J5523q0095K5905O3738o0995k9403P6068j3641o8869N1896M0543p4288
$$ 23288 38811 -41284 -15379 48359 -12636 -42039 34029 20388 -48481 3415 43958 -30330
346c0330r40P4673l9241n2050O7174J4664p4130K7016N9735n8677k5983P2560
$$ -30330 -31270 43403 4162 -47888 19286 33950 -40180 -13164 46571 -12106 -38089 34471
358C4471j3276o3495M9285L5073o8541L232O6543m0819m4970O4562R655o9395
$$ 34471 21195 -42300 6985 42058 -26483 -23251 43292 2473 -42497 22065 31720 -37675
370c7675K7757N1539n6789j8960O6992j9512n7822N1348L0434o7600O084O3214
$$ -37675 -9918 41621 -15168 -34128 32864 13352 -44470 6878 37312 -30288 -24204 39010
382C9010l9936l9356O2684N257o6007L1672N0146n7163j8924O6395j7871n3952
$$ 39010 -926 -40282 22402 27659 -38348 -6676 43470 -13693 -32617 33778 15907 -38045
394c8045M8076K6087o4456J0049O0433m3193l8782O1876N060o2261K9708M1193
$$ -38045 10031 36118 -28338 -18289 42144 -1049 -39831 22045 27105 -35156 -5448 35745
406C5745n5854q140O3766k8398n2395N5740K6128o6343P968N7060l7602k9274
$$ 35745 -20109 -28249 35517 7119 -45276 10464 36592 -29751 -21783 35277 -2325 -31599
418c1599N6172o611n6199M1544L8885o2215j0292O3946k0082m5468M3828J3179
$$ -31599 24573 17962 -38237 3307 42192 -20023 -30315 33631 13549 -31919 11909 25088
430B5088n3898K2916M6591n2959k5369O6242m760o0796L1310L7654m8600n682
$$ 25088 -28810 -5894 40697 -12262 -37631 28611 23851 -36945 -5635 32019 -16581 -22263
442b2263N0516k7366l6480N1601J2185n9234J5274M9512l6712k3304M6785q695
$$ -22263 28253 887 -35593 16008 28193 -31041 -15767 33745 -2967 -26271 20514 11819
454A1819m1611L8934K4005n6615J041N8260k7609m1931M7217J3200n4176J6859
$$ 11819 -29792 9142 33147 -23468 -22427 35833 8224 -33707 13510 26710 -27466 -10607
466a0607M5478m1822k5084N2610k112m8520K6882K9509m2885k327M4272k5224
$$ -10607 34871 -6951 -32035 20575 18463 -30057 -3175 26334 -16551 -18878 25394 170
478A70l0847M5956O858n0581K0051L9750m0912j4425N1700j5645m6913M2407K9148
$$ 170 -30677 15279 22137 -28444 -8393 31357 -9555 -23980 27720 12075 -34838 7569 36717
491C6717n7145k543N4436k4297l6431M2928P618m8740K1309L7209m3003j4602
$$ 36717 -20428 -22971 31465 7168 -29263 13665 21283 -27457 -6148 31061 -11942 -26544
503b6544N0237j3210m1144L6397J6973m8074J4270M4783m2266k7783N9255M356
$$ -26544 23693 10483 -30661 5736 22709 -25365 -11095 33688 -8578 -36361 22894 27250
515B7250n9307K1227M1729l7834j2648M3974j7538l5696L9964J6210m8762O975
$$ 27250 -32057 -10830 30899 -6935 -19583 24391 6853 -28843 11121 27331 -21431 -14456
527a4456M2409k7822k2519L6590m476l2159L0037J4383n0125J0020N7138l2444
$$ -14456 27953 131 -22388 14202 9726 -22433 7604 21987 -28138 -18118 39020 6576
539F576n0061M6202K8985m7824J36L8114k8090j8234M7225m043n1218K5521M1110
$$ 6576 -43485 2717 31702 -16122 -15986 22128 -5962 -24196 23029 18986 -32232 -6711 34399
552C4399l9667j8985M2315n068l1632K5530Q221l7187J9863L7181m5230k6567
$$ 34399 -5268 -24253 18062 12994 -18638 6892 15113 -22074 -2211 34970 -10260 -36827
564c6827N7258P231n3232J4433L2520l4684k935M5120k4960m2012M3409K4572
$$ -36827 20431 27662 -25570 -11137 21383 -13301 -16236 28884 3924 -38088 5321 29893
576B9893m6864K197L5973k6599j3754M2012j2270m0389L6347K3565n0631K436
$$ 29893 -16971 -14774 21199 -5400 -19154 22858 10588 -29801 6546 30111 -20520 -18084
588a8084N1094k7226l6016M2618Q732m6698K1499L8049m6177k0104N4140j458
$$ -18084 33010 5784 -30232 12386 21118 -25580 -4081 33968 -12209 -32313 21827 20369
600B0369m5513J9721K3160l1824M116L3252k6625k2268L7470K968l4812J9802
$$ 20369 -25144 -5423 17737 -14087 -9971 23281 -3344 -25612 11858 14826 -19986 -184
612a84K2436l6546l652M2824j4603l4375K8660J5170l4276Q253L0751k9143j8340
$$ -184 22252 -14294 -17946 24878 10275 -24100 4560 19730 -14546 -6293 24458 -4685 -23025
625b3025L9882q2m0256J7528K9084k9050j1564K9950r148k0945K7944L261l9698
$$ -23025 16857 16775 -23481 -5953 23131 -5919 -17483 12467 3319 -17626 10318 13579 -26119
638b6119J5985M1258k9933l0830L6114J1411l1873J1741K0252l0142k530M0215
$$ -26119 -10134 31124 1191 -29639 6475 17886 -13987 -2246 18006 -12136 -14666 25549
650B5549j5199l7058K7817K3246l3378k576K7531j7194j4034L0624n556l4166
$$ 25549 10350 -26708 1109 24355 -9023 -11599 15932 -1262 -15296 15328 9772 -24394
662b4394K2720K5943l4006q869L3916j1776k4015K9477O572l8337J3335L5835
$$ -24394 -1674 24269 -9737 -18606 15310 3534 -20481 8996 15568 -22769 -9434 26401
674B6401k7882k2177L5197J876l0696J8684J8149l2586R41L6136j9491k8607L1603
$$ 26401 -1481 -23658 11539 13415 -17281 1403 19552 -13034 -12093 24043 4552 -24055 7548
687G548J2787l4706O278K6113k2613j0214L0520q514l0671K4579J9907l2812l851
$$ 7548 20335 -14371 -8093 18020 -4593 -14807 15713 7199 -23472 1107 21014 -11798 -15649
700a5649L1048j3031k0728K5318N333k8922J1657K3129k3446r560K9541o584k6728
$$ -15649 15399 2368 -18360 6958 12291 -16631 -4974 18155 -5291 -14851 14690 8106 -18622
713a8622K1480J6374k8967j021K8184j4670j8921K5191L999k8832J1276K3197
$$ -18622 2858 19232 -9735 -10756 17428 2758 -16163 9028 13027 -15805 -4529 18668
725A8668k4335j0850K9992n086k7922J9025J6990k7535o33K7005j5212j8329K6359
$$ 18668 -5667 -16517 13475 8389 -19533 -508 16482 -11053 -11686 15319 107 -18222 8137
738H137M852k9299J1448K3341k3858r005K9768p175k6629K1440J5543k8696Q53
$$ 8137 12989 -16310 -4862 18479 -5379 -14384 15384 8209 -18420 3020 18563 -10133 -9280
751i280K6444j6777j6480K7203O39l0011J4881K3157k6472r621K9144o553k3738
$$ -9280 17164 387 -16093 11110 11749 -18262 -3381 19776 -6696 -16317 12827 6274 -17464
764a7464K0141J0624k7387O384K5613k0281j6403K8884K175k7875J3192J9038
$$ -17464 2677 13301 -14086 -7702 17911 -2370 -18773 10111 12286 -15589 -2397 16641
776A6641k2804m878K6236j0826k0759K3100Q656k7608N237K4508j8639j4160K5465
$$ 16641 -6163 -11041 15195 4369 -16390 6710 15366 -12242 -7005 17503 -1136 -15296 10169
789A0169j203k5079J5459J6390k4876l411K6041j0780j9663K2412O262k5882P865
$$ 10169 8966 -16113 -654 15736 -9140 -12551 13490 2710 -16953 5459 11721 -14161 -6296
802f296K2655j9388j1750K5527j725k3750J5945J4399k3738j060K4500j2587j7507
$$ -6296 16359 -3029 -14779 10748 9023 -14727 1218 15617 -8121 -9181 15319 2732 -14775
815a4775K2258N576k6088Q196K0846j9274j0399K3987l846k1819J6052J2818k3935
$$ -14775 7483 13059 -13029 -4833 16013 -3261 -13660 10327 6481 -15338 714 13532 -10403
828a0403L25K3917j3227j6558K2080M943k4347Q384J9686j8490q302K3186n198
$$ -10403 -10078 13839 612 -15946 6134 11077 -13270 -4886 14800 -3690 -11992 11194 5996
841E996k0180J7516J1517k3583M29K2587j1941j5544K0432L060k2290R262J6777
$$ 5996 -14184 3332 14849 -8734 -8305 14282 2341 -13203 7229 10289 -12001 -2739 14038
854A4038j9146p176K3474o315k0025J6255J1206k2345J954K0575j3342j3426K1538
$$ 14038 -5108 -12284 11190 4875 -15150 1105 12311 -10034 -8080 12495 -847 -14273 7265
867G265K140k2323J0069J6968j8505n787K1719o662j7965J7207R092k2692K994
$$ 7265 9405 -12918 -2849 14119 -4386 -10173 11546 4884 -13081 4126 13218 -9474 -6480
880f480K0789j3491j3537J9946J524k0295J0099J4070j9081m448K1681o917j8526
$$ -6480 14309 818 -12719 7227 8751 -11544 -1445 12625 -6456 -10904 10777 3860 -14666
893a4666J6260R428k0176K520J8091j3233j0233K0261o18k0620J1746J5448j8941
$$ -14666 1594 11022 -9154 -6634 11457 -1776 -12009 8252 7634 -12986 -1240 14208 -4733
906d733n124K1041o473j6227J6077O826k0644M390J8758j4774j1659K0181L94
$$ -4733 -9857 11184 4711 -11516 4561 11387 -9257 -4867 13891 -883 -12542 7639 8033
919H033j9863J0882J2194j8745j252K0049j0046j5557J8654O135k1669N660J8127
$$ 8033 -11830 -948 11246 -7499 -8751 11298 1252 -14305 4349 10484 -11185 -5525 12602
932A2602j5523q800K1052k369j9919J3448J3369j9639k435J9974q928j3928J6682
$$ 12602 -2921 -11721 9331 6962 -12957 491 13860 -5779 -8214 11760 2832 -11096 5586
945E586L776j9110P044J4842j5833o020J8798m643j6860J3591Q821j8849J505
$$ 5586 9362 -9748 -2704 12138 -3695 -9715 9083 4440 -12420 1171 9992 -8857 -7352
958g352J8529j1735j1957J7883K729j8228P049J3646j4048m729J7183m473j4885
$$ -7352 11177 -558 -12515 5368 8097 -10131 -3082 10564 -3484 -8213 8970 4497 -10388
971a0388J2651P999j5741Q85J4380j0283q299J6111l2j7757Q511J3511j5164n889
$$ -10388 2263 10262 -5479 -4594 9786 -497 -8796 7315 7283 -10474 -1963 11548 -3616 -9505
985i505J7358l870j4900J1518Q272j6010N91J5878r065j1032J4564L879j5200
$$ -9505 7853 3983 -10917 601 8873 -7137 -6546 9332 267 -10765 3799 7678 -7522
998g522M582J1007j1100k365J4407o546j3112J4047P918j7827N85J5859r329r831
$$ -7522 -2940 8067 -3033 -5398 9009 2463 -10649 3398 11316 -6511 -5926 9933 604 -9227
1012i227J6072J85j7760Q593J3689j5432o145J7353l425j4317J1497O581j4994
$$ -9227 6845 7030 -10730 -2137 11552 -3880 -10025 7328 3903 -10414 1083 7664 -7330
1025g330L026J3353j1318p092J6668j037j6825R888J1077j4681j747J5573p812
$$ -7330 -4304 9049 -2269 -9361 7307 6270 -10555 -667 10410 -4271 -6018 9555 1743
1038A743j2034J5276N262j7861K648J4798j0017p719J3735j619j3160Q746Q172
$$ 1743 -10291 4985 10247 -7614 -4966 9832 -185 -7904 5831 4212 -8948 -202 7970
1051G970j2924j264J2978o958q853J2674K624j4503M851J2219j0897n553J4422
$$ 7970 -4954 -6218 6760 -198 -9051 3623 6247 -8256 -3405 8814 -2083 -7636 6786
1064F786k161j3913R427J0234j3509l282J3891m298j0919J1085M225j3862K748
$$ 6786 4625 -9288 139 10373 -3136 -6418 7473 3175 -7744 3341 7566 -6296 -3548
1077c548J2389r880o514J3357k160j3109R567Q685j4276j634J4628o783j0275
$$ -3548 8841 -1039 -7553 5804 3644 -9465 102 8787 -5489 -7123 7505 722 -9553
1090i553J3676L244j6556N082J4520j1868o699J4943k324j3393J0824Q030j5399
$$ -9553 4123 7367 -9189 -4107 10413 -1455 -8154 6789 4465 -8928 1896 9926 -5473
1103e473N03J4287q675q879J4560j04j5666Q030J1805j4057m045J5134n637j1952
$$ -5473 -4970 9317 642 -8237 6323 6219 -9447 -1417 10388 -3669 -7714 7420 1783 -10169
1117a0169J2993N449j6499K772J3975r442p317J2748r7j2622P865Q467j2159j012
$$ -10169 2824 8273 -8226 -5454 8521 -921 -8238 4510 4413 -8209 -344 8123 -4036 -5048
1131e048J2501n978q879J1403L255j3172L384J0344q936m697J1662k148j1728
$$ -5048 7453 1475 -7404 3999 7254 -5918 -2534 7810 -1126 -5823 5839 3691 -8037
1144h037P890Q040j1266k485J0473l718p955R475K202j1343L417J0293p398o207
$$ -8037 -147 7893 -3373 -5858 4615 897 -7058 2417 4619 -6724 -3307 6986 -412 -6619
1158f619J0049L82r868O060O892j0277j104J1499m329r428R510M269j2090J865
$$ -6619 3430 3812 -6056 4 6896 -3381 -4485 7014 2685 -6743 2767 7036 -5054 -3189
1172c189J0456p961n410J0850q61j1645P506P917j1820k291J2030m133r154R757
$$ -3189 7267 -694 -6104 4746 3885 -7760 -254 7663 -4157 -6448 5582 1449 -7705 2052
1186B052K822j1671L536J1104r327n613J2036j174j0152P733O133j1739J72J1682
$$ 2052 4874 -6797 -3261 7843 -1484 -7097 4939 3765 -6387 1346 7479 -4260 -4088 7594
1200G594o044q072J0194J637j1034M803Q095r697l199J1154l280r400Q355M583
$$ 7594 1550 -6522 3672 5309 -5725 -922 7173 -2524 -5723 5431 2151 -7249 1106 5689
1214E689j0820R89J0046o293o133R762P28j0413N335Q123r253l014J0293k304
$$ 5689 -5131 -4142 5904 -389 -6522 3240 3968 -6445 -1110 7013 -2240 -5254 5039 2735
1228B735q616P650M550j0271P83R657n254o452Q183J313r386M123P114q381l254
$$ 2735 -5881 1769 6319 -3952 -3169 6488 1234 -5218 2965 4278 -5108 -985 6129 -2252 -5506
1243e506R775k035q438O427M536q941R32Q365n790n594R473P28r795M681P245
$$ -5506 4269 2234 -6204 223 4759 -4182 -3250 5115 -675 -6269 3204 3932 -5863 -1182 6063
1258F063q290k344R981l058q401Q420L810j0377J134R880o637n796R232M7r490
$$ 6063 -2227 -4571 5410 2352 -6049 2371 6181 -4196 -3062 6818 181 -5615 3617 3664 -5826
1273e826N146O869r708j378R703l582q016Q121L087r392K235Q529o956m758R792
$$ -5826 -680 6189 -3519 -4897 4806 1224 -6792 1329 4416 -4976 -2741 5788 -1168 -5926 3866
1288C866n84q908N348O228q412j028Q989m205o936Q635J922r269K911P769p629
$$ 3866 3282 -5626 -278 5950 -2462 -3490 5499 1294 -5642 2993 4915 -4354 -1443 6326 -1303
1303a303l554R252j702q604O067N111r140N9Q660m500o470Q058J764q635L144
$$ -1303 -4857 4395 2693 -5911 156 5267 -3873 -3814 4846 346 -6124 1934 3698 -4937 -1793
1318a793P120p273k945Q868j540p570N852M602q530O43Q401n159n604P973J003
$$ -1793 5327 -1946 -4891 3977 2437 -5133 719 5321 -3209 -2566 5835 676 -4928 3045 4048
1333D048q641L691O521p649k504R123k548p749N855M277q373O79P852m826n227
$$ 4048 -4593 -902 5619 -2030 -4534 4589 2041 -5708 147 4424 -3949 -3270 4582 -244 -5471
1348e471P691J126q121L792O024o813k166Q042k188o520O110L357p995J054P423
$$ -5471 2220 3346 -4775 -983 5041 -1772 -3938 4104 1916 -4604 1506 4863 -3132 -2078 5345
1363E345n139m417P475j24p546M078N085p012j517P736k659o524O173K644p680
$$ 5345 206 -4211 3264 3140 -4406 -328 4757 -2255 -3772 3964 1305 -5219 954 3598 -4082
1378d082J642P082n737l842P784k94p330M439N285o978j391P683k769n900O416
$$ -4082 -2440 4642 -1095 -4937 2847 2553 -4777 -338 4947 -2031 -3422 4261 1492 -4408 2008
1393B008K645p877J651O727n428l838P273p37o524L928M287o431j314P353l201
$$ 2008 4653 -3224 -1573 5154 -274 -4112 3161 2424 -4100 -172 4115 -2316 -3630 3723 522
1408E22n454N821K119p139K011O121n201k760O644l64o552M490M202o598k00O643
$$ 522 -4932 889 3008 -4131 -2120 4001 -1200 -3960 2684 2320 -4232 258 4460 -2138 -2338 4305
1424D305l099n222O058J901p154K092N872n414l093P041j064o673M593L722o582
$$ 4305 1206 -4016 2042 3943 -3211 -1119 4753 -661 -3754 3287 2223 -4450 143 3865 -2717
1439b717o84P087l495m810N961J388o533K423N346n172k516P077j317o159N067
$$ -2717 -3401 3686 191 -4619 1342 2730 -3803 -1380 3966 -1206 -3722 3355 2038 -4121 946
1454I46L364o893N58O895m555m172O555P42o931K734N170n728k231O467j760n393
$$ 946 4310 -2583 -2025 4870 315 -3857 2698 3440 -3491 -757 4413 -1315 -3546 2921 1161 -4232
1470d232N092K176o527J242N996m232l364N665J67o051L743M315o053q19O494
$$ -4232 860 3036 -3491 -2249 3747 -485 -3849 1816 1983 -4068 -325 3990 -2063 -2882 3612
1485C612j973n219M704K644o343J198N116l729k985N101n4n230L152L518n153
$$ 3612 1639 -3580 1124 3768 -2575 -1377 3739 10 -2975 2126 2072 -3158 -6 3512 -1641
1500a641j144N515j840m407M242J688n571J073N491l705l568N973J40n560L065
$$ -1641 -2785 2730 890 -3517 725 2413 -3158 -2085 3406 -299 -3867 2106 2246 -3314 -249
1515b49L764m953j461O245j771m738M319K404n856Q40N517l963l587N759k4n840
$$ -249 3515 -1438 -2899 3346 1575 -3163 1156 3560 -2296 -1456 4061 98 -3489 2270 2246 -3594
1531c594L549L736n895q96O563k685m929M895K000o192J997N226n057k273O184
$$ -3594 -45 3691 -2204 -3100 3463 778 -4151 744 2744 -3448 -1451 3775 -1282 -3555 2629
1546B629j109m908M109K702n738L48O097l721l403N281L29n531L032L738n340
$$ 2629 1520 -3388 721 3423 -2315 -1967 4130 409 -2994 2287 2616 -2915 117 3855 -1485
1561a485j314N565j545m705M012K237n699J077M807l352k810M314K18m276K343
$$ -1485 -2799 2766 1221 -3484 528 2765 -2934 -1857 2950 -402 -3212 1102 1320 -2956 -613
1576f13L559m247j053M457r25l523L203J834m138J90M651k770l254L971Q93m047
$$ -613 2946 -1301 -2354 2103 1178 -2345 858 2692 -1446 -1256 3395 625 -2629 1342 2235 -1812
1592a812J436L232l846j937N437j014m423K893K166m300K95N001l340l407M578
$$ -1812 -376 2856 -990 -2927 2510 1496 -2927 -34 2132 -2168 -1873 3128 -212 -3619 959
1607I59J086m595J704M157m689j661N864q89n177L585L007n084L35N365l807l597
$$ 959 2045 -2550 -846 3311 -1378 -3039 2825 1936 -3241 344 3351 -1733 -1398 3967 160 -3437
1623c437N627M02n205K329L334m897o68N421k157m519M476J391m960J595M257
$$ -3437 2190 2592 -2613 -284 3050 -1847 -2515 2906 749 -3770 706 2097 -2863 -1268 2989
1638B989m116k005N333n74m559L235K502m890N68N078k836l545M228J098m376
$$ 2989 -1127 -3132 2201 1627 -2932 303 2805 -2085 -1517 3561 725 -2820 1408 2506 -1870
1653a870J903K782l751j239M665j371l540K689J684l802J68L750k028k903L514
$$ -1870 33 2815 -936 -2175 2490 1119 -2421 268 1952 -1850 -1682 2068 40 -2863 651
1668F51Q79l499R88L117l024j476M021j37l522J877K455l277kL586k058l003L466
$$ 651 1530 -1969 -981 2136 -888 -2364 1657 1520 -2002 -125 2330 -947 -949 2637 579 -2424 1042
1685A042J496l859O79L036k792j900M267o02l911K546K223l863l31M208k294l142
$$ 1042 2538 -1321 -642 2394 -398 -2298 1969 1367 -2544 2 2225 -1638 -1969 2239 -55 -3197
1701c197M177J316m844J568L795m014j268M974j300l810K836K482m125L81L667
$$ -3197 980 2296 -2548 -980 2815 -1199 -2467 2507 1207 -2603 233 2715 -1410 -1029 2638
1716B638k176k694M013K63m106K028K635l715o40M270j997l311L233J356l753
$$ 2638 462 -2232 1781 2044 -2062 -34 2601 -1114 -1754 2516 519 -2792 441 1797 -1956
1731a956P51L108k665j542L766n2l867K219K383l389j43L451j580k616L228R69
$$ -1956 -1205 1903 -762 -2304 1462 1410 -2457 -238 2145 -1244 -1387 2064 484 -2132 1096 2065
1747B065l458P94L103k553j740L427j70l522J865K288l164o45L292j161k797K485
$$ 2065 -1393 -599 2504 -49 -1789 1638 1468 -2054 -189 2099 -1065 -1710 1582 421 -2376 109
1763A09J470l325N59K737k051j584L179L13l279J673K183k848o06L489j259k895
$$ 109 1579 -1746 -1187 1550 -501 -2085 1094 1407 -1872 -199 1984 -864 -1470 2019 760 -2135
1779b135L087J136l408R23K779k504j714L334k01l442J911K527l596m74L505j614
$$ -2135 952 2088 -1320 -397 2382 -122 -1836 1498 1297 -2145 -234 2293 -1303 -1777 1728 114
1795A14k399K885P46l365J211K868k623j406L620n43k988K181J890l622L01L323
$$ 114 -2285 600 1346 -2019 -808 2060 -563 -1969 1651 1108 -1880 301 2191 -1431 -1130 2193
1811B193j762k112K837O96l535J415K505k697j330L140o00k661J893J720l217
$$ 2193 431 -1681 1156 1852 -1683 -268 2237 -460 -1790 1350 750 -1911 -18 1702 -1515
1826a515jL325j908j889K894k9k891J297K465k299j062L413r51k820K424J640
$$ -1515 -1516 1809 -99 -1988 906 877 -2014 -717 1748 -551 -1613 1800 849 -1971 453 2093
1842B093l341M39K903j854j831K940r8k810J657J918k984n27K941r20k545J925
$$ 2093 -1248 -809 2094 240 -1591 1349 1251 -1559 98 2016 -968 -1495 1446 526 -2019 -94
1858i4J663l216O90K541k046j476K735K34k829J206K392k654k63K608p57k272
$$ -94 1569 -1647 -957 1584 -462 -1938 797 1031 -1798 -592 1800 -854 -1117 1491 734 -1538
1874a538K231J179k843O52K424k024j635K862j90k480J154J971k657l50K383r94
$$ -1538 693 1872 -971 -319 2105 81 -1554 1308 1118 -1362 -208 1763 -894 -1244 1139 145
1890A45k060K115J122k971P61K273j825j415K755J02k802J803J982k899k67K759
$$ 145 -1915 200 1322 -1649 -888 1385 -440 -1855 900 1002 -1800 3 1985 -914 -1181 1578
1906A578j106j993K206Q52k425K50K421j698j359K419r0k694J482J424k105j89
$$ 1578 472 -1521 685 1537 -888 -638 1783 85 -1274 1145 1055 -1639 -157 1267 -838 -1027
1922a027K320j177k109K594M92k620R28J983j637j147K320j04k265J529J605k355
$$ -1027 1293 116 -1993 601 1093 -1527 -599 1384 -253 -1400 920 816 -1449 80 1685 -670
1938f70l12K609j110k064K246Q96k466J57K424k144q49K634n89k405J288J656
$$ -670 -982 1627 517 -1547 699 1595 -871 -714 1710 -434 -1283 1351 762 -1643 -355 1301
1954A301k314n56K924j513j886K513M13k460J050K002j916q54K639o12k246J979
$$ 1301 -1013 -1569 1355 -158 -2044 469 882 -1578 -528 1474 -442 -1296 1343 731 -1515 464
1970D64J237k495K41K342j657j598K498K55k498J260J633k168o11K391r11k448
$$ 464 1701 -794 -553 1789 132 -1466 1032 1287 -1211 49 1682 -486 -1097 1294 383 -2065
1986b065K334Q35k337J95K397j691j001K084j09k027J016J744k121r5K224j212
$$ -2065 269 1104 -1233 -1038 1359 -332 -1333 751 642 -1385 -369 1375 -746 -841 1383 171
2002A71j484K027N75k052M92J804j720r00K081j76j930J083J026j430n60J906
$$ 171 -1313 714 1289 -763 -271 1533 -187 -1087 994 818 -1112 -29 997 -433 -993 913
2018I13o27j677J591Q68k113o2J827q64j038J917j0k046J133J445j226q44K139
$$ 913 286 -1391 200 1068 -1045 -1107 720 -144 -1182 735 725 -1321 -188 1257 31 -813 1326
2035A326o97j741J765O91j823k08J816j100j212K017K26k496J006J790k110m21
$$ 1326 629 -1112 653 1344 -479 -687 1129 29 -1183 834 1060 -1436 -430 1360 -750 -1171
2051a171K111q83j785K129N96k113L93K085j734r06K391n45k025J756J048j791
$$ -1171 940 57 -1728 401 997 -1116 -723 1362 -372 -1278 1113 568 -1457 299 1347 -444
2067d44J77J560j003j453K122J18k227R46J554j629m10J835j164j557J939N71
$$ -444 -267 1293 290 -1163 959 1077 -1150 -204 1350 -279 -689 1146 -18 -1575 364 935
2083I35k043N05J401j273n13J625r9j685P83J487j334l28J522j011p64J085N89
$$ 935 -1108 -603 798 -475 -988 637 538 -1147 -364 1123 -211 -539 983 -28 -792 293 882
2100H82j410L25J059p18n97J159q7j625R94J027j046p66J218k02j064O98J045
$$ 882 -528 -203 856 138 -459 700 613 -1012 -18 1009 -37 -803 415 213 -851 -153 892
2117H92j637k72J535m24j189J492K16j702M19J785j034q95J694k61j545J379O51
$$ 892 -745 -1017 518 94 -1095 397 613 -1089 -670 1115 81 -814 880 619 -926 453 1104
2134A104j660l4J873r34j138J513r3j914R02J625j782n80K006r12j696J940P74
$$ 1104 -556 -590 1283 349 -789 724 631 -1283 -381 1244 -538 -1118 888 -24 -1720 220 994
2151I94k260N66J706j278n50J626n73j271J329Q87j741jJ444n59j156J621K92
$$ 994 -1266 -700 1006 -272 -822 804 231 -1040 289 1176 -565 -566 878 319 -837 784 1076
2168A076j903J012Q94j125n53J393q23j092J376L30j095m3J185p18p70J093J95
$$ 1076 -827 185 1079 -46 -599 794 -29 -1121 255 585 -510 -553 632 -86 -856 237 432
2185D32j407Q54R90r39p05J324o4j052P63O88j234k09R99O7r86J115J19j309L02
$$ 432 -975 -121 869 -70 -775 549 485 -567 196 884 -350 -559 440 507 -479 636 755 -554 -252
2204b52J129r01p69R41L39j280N11J041j527LJ293k08j301J245L8j232Q13Q78
$$ -252 877 -24 -793 148 487 -793 -282 759 -768 -765 528 320 -981 264 302 -930 -117 761
2222G61j022o21J380Jj322J116O58j266p4J637j136r19J667j02j551R66P59j175
$$ 761 -261 -882 498 499 -823 293 951 -315 -389 1248 112 -807 860 758 -793 173 932 -243
2240b43o43J542l93j340J417J04r54p6J336j092p64J481Mj221P77P96j114k13
$$ -243 -886 656 263 -1077 340 444 -510 -586 750 -342 -1106 375 379 -842 -65 731 -383 -596
2258e96J232m34r94J108L88j078K69J023p01o93Q93k67r15P72P81j123j99R40
$$ -596 636 202 -792 316 704 -374 -105 918 217 -476 417 150 -765 7 788 -335 -534 406
2276D06n60n00N77N02j251M64P87r78k57R28K77j032N64P23r95q6J171j90j128
$$ 406 -154 -654 -77 425 -826 -362 425 -553 -810 118 395 -637 -73 650 -345 -431 740 550 -578
2295e78J012K73j156K79J109p03p28Q23n3j002O74N18p53k36R86k87q49Q03K01
$$ -578 434 707 -449 -170 939 236 -492 331 278 -724 -50 468 -285 -521 465 178 -671 132 333
2314C33j125L14J163o88l97R92l15o75M89L90p09l4J037m43q55R32J96r45L88
$$ 333 -792 -478 685 -3 -400 592 277 -398 91 481 -228 -262 775 332 -523 409 605 -340 48
2333D8P17q25m62R45j41r76M55P18j124lJ052n99l75N73O40j293O21N65n90m76
$$ 48 765 -60 -522 423 282 -694 -239 479 -645 -648 404 -195 -570 3 643 -650 -29 536 -54 -530
2353e30J020k17p21O12M11q54J77Q81n71m69Q62j58p96M32N31o56m42R02j63q56
$$ -530 490 273 -448 164 575 -279 -102 779 208 -261 601 443 -353 79 610 -46 -488 414 251 -605
2373f05O63L83j044J85Q74n28m82R84j22p17M81N48q10n13J273m98o91R22K38
$$ -605 58 441 -603 -418 456 -72 -554 430 308 -409 72 620 -190 -703 570 72 -619 303 541
2392E41j020M02O13n74l61O96m5p50N02N37j033K04P63l63p10P47qo23M4Q44l39
$$ 541 -479 -77 536 -38 -399 297 252 -498 4 541 -492 -288 475 112 -598 149 141 -482 -438 406 67
2413F7o21P75l8o54M60L84q51J78Q34j38p83N71J81p19M63L00l87n70Q74P7q90
$$ 67 -554 221 183 -471 -11 373 -478 -300 534 396 -387 184 365 -354 109 409 22 -548 326 403 -487
2434d87L22N19q26N9Q62n21n56N23M42j007L63O81m19l27P03k43n74O04K25m90
$$ -487 -165 354 -472 -413 449 -72 -628 -105 337 -670 -307 374 -45 -372 331 88 -486 118 343 -147
2454a47o6J017o12n02O61Rp18M23L66k89m58N73J6q93M15M22n26m5P75m65p19
$$ -147 -213 804 192 -310 351 360 -358 65 431 142 -316 257 273 -620 -205 217 -309 -354 421 -44 -763
2475g63Q43J98p64M81O41q38k03O36k27m90P39K35n75j66P16j98o59O31J79p86
$$ -763 80 278 -486 -5 636 -202 -405 231 4 -486 253 488 -87 -253 463 265 -394 237 416 -370
2495c70M19O04p85j36K48O7p67Q72k1o88J73N45j17o40P87j29o62O21M30p52J40
$$ -370 49 653 -132 -268 -20 47 -720 152 131 -557 -384 161 44 -596 191 62 -600 21 451 -301 -161
2516a61P50o30k46L72J77o54M23M74l38m9J15J79n85K37L36n00l15O57k80l31
$$ -161 589 -41 -287 85 262 -392 31 505 167 118 233 412 -173 64 400 -100 -415 242 -38 -369
2536c69J15L17n55K51P09m87m60M88J28n41M85N7l47o5P63k98r7j65M00p06L83
$$ -369 -254 63 -492 -241 468 -19 -479 9 137 -404 81 138 -209 -274 489 191 94 -71 329 -377 6
2557FO61m15n42K45L95o05kM16k99j54O81l62m89M38K70q65K33P33m67l09O07
$$ 6 667 252 -290 -45 350 -255 -257 159 -140 -294 387 25 -464 -26 244 -621 -388 345 -122 -431 176
2578A76l4l73K36O64p27J9L95l38l29P39K1o17K48N14o35m22Q82j09n37N58k60
$$ 176 142 -231 5 669 -58 -39 356 18 -311 428 449 -168 80 594 -41 -463 419 310 -227 331 71
2599G1l33kO50n59k49N51l7n39M73L09m56j73O34k60k09M00l43k46M06M48l13
$$ 71 -262 -264 386 -173 -422 129 92 -447 26 335 -121 -294 340 80 -129 271 -72 -318 88 536 223
2620B23k66J65K54n64rN26m34l1K74M4n47J94K06l98n6R64n42m93K68O20o46l2
$$ 223 -43 122 376 -188 -197 329 -105 -136 138 182 -365 -171 35 -363 -419 545 3 -490 -222 398 -248 -280
2642b80N33k62r4J85K41m95K73K6k87K19N17l86n07N10K45o69K00M87o98PN59
$$ -280 253 -9 -103 82 323 -172 101 127 -160 59 576 190 -317 193 438 -231 -31 456 -242 -235 324
2663C24k06n84N13L5n65J84M88n65M3O19k8p02N34J95n54P0P29n30j47N29l5n92
$$ 324 118 -466 47 82 -483 -299 189 -376 -333 286 258 -444 90 285 -269 -199 530 0 -147 382 347 -245
2685b45O01j6n83NM82J9q20O69jk93q3N19n25j79N23r4k69L38J82l97O7K35j61
$$ -245 356 340 -243 -238 244 263 -557 112 111 -182 -265 254 -271 -450 73 -21 -290 48 230 -167 -100 135 -26
2708b6q7m5L75o51M25M12k51m02N75n3j43j20J60j59k74L68P0n45P8K63j65k07
$$ -26 -113 -158 217 -434 -9 403 152 -250 325 272 129 9 169 10 -264 104 174 -371 -293 -30 -195 -402
2730d02M77J31o70L11N44m01o1L23m48l74Q04n6n41K39L57k95J13L56l56j86M99
$$ -402 75 206 -464 -153 391 -10 -71 252 -196 -570 234 178 -363 -124 233 -62 51 407 51 -135 364
2751C64R3o03K9O82p70p4N42k25l27J86kj57K00K18k92l34M96J7n60L66K60j66
$$ 364 457 -146 -117 565 -205 -279 263 38 -289 -103 -105 -262 -62 156 -136 -470 26 43 -517 -151 109 -57
2773e7J03K12j42k94K98K73k90j23L18j99l37M64j74l61O14n8l38oL38m84j45
$$ -57 46 258 116 -178 120 393 103 -20 298 99 -238 226 52 -309 305 247 -91 -97 241 -243 -388
2794c88M33o1j20j37K88l6k86L85M4l47O0N10l79p1N09j63l79L19M1n64K86J98
$$ -388 45 -16 -136 -273 15 -21 -307 78 122 -225 -165 345 -34 -105 404 241 -138 181 222 -342 -56 142
2816A42q7k41K78l3j83J97J18k07l27P10m00l2N1K30n95R7N77k22j80J48jk86
$$ 142 55 -186 92 59 -124 73 191 -16 -343 367 -33 -65 -14 216 -379 -282 295 73 -107 41 40 -246
2838b46L64L70m32j41K95q8k91M88j30m13L00j12j02oL22J44l50j31M04n78k2
$$ -246 118 488 56 -85 210 122 -169 319 189 -224 76 -36 -138 -144 178 322 -28 -159 245 -333 -355
2859c55L31j63l94P84l3n31J55L42j66k63M94J1n54N10Q9l80j70N56k28L1J70
$$ -355 -24 -187 -581 203 170 -361 -206 136 -30 -293 201 212 -342 168 257 -123 -293 263 35 66 236
2880B36n8k79K19m8l57J80J35K5k16jK40j12M4K03k14m31M97p2k8O4L33m86K03
$$ 236 178 -101 118 70 -287 -107 28 53 -163 -164 76 -36 8 211 -3 -434 63 -9 -37 27 360 -126 77
2903G7R1q1j59J39J27m86L61K68l31J23K7K4l10K23m5j50j11Q4K8r2K18J35n19
$$ 77 168 87 -72 67 194 -292 69 337 6 129 156 180 -130 93 48 -102 -213 -129 -101 -193 25 160 -359
2926c59K27J31r4j82J30L08j01k38J59j28P7L06j35j55N4K84j80p5J1J68k59J48
$$ -359 -132 -1 -95 -277 -147 161 60 -178 -19 -147 -70 236 101 -54 0 284 104 29 40 208 -51 97
2948I7k5m10M69J64l03p4J58j86j35K39J63j47k9L01j13m15M65k48J4J83P1j81
$$ 97 72 -338 131 295 -8 -82 76 -110 -245 -6 157 10 -19 282 169 -246 219 -29 -15 168 239 58
2970E8j66M06l30k60K01L78k67o8K48k70k06L68R9n22M11l44J53l13O68j07l01
$$ 58 -108 298 -32 -292 -91 287 20 -48 200 -70 -276 92 191 -331 80 -264 -111 -424 244 137 -164
2991a64J85J5j77k87O38k86J53o4L07m74J19K08j73J57M11m73j18J12K02m42m6
$$ -164 21 36 -141 -428 210 -76 77 13 320 -154 -35 173 0 157 568 95 -23 89 291 -151 -197
3012a97N49m49k74K95J13k97J02J68j99L30j02ln65M63J51k35n5M17k08k21N51
$$ -197 352 -97 -371 -76 37 -260 -158 10 -189 141 39 36 -529 -66 85 -150 -205 212 4 -217 334
3033C34j69j51J58J35k73n1J55l67K6J93M0k17J41K9J75j91lM0k03M18k85j78
$$ 334 165 14 172 307 34 -17 138 -229 -203 -10 30 -187 -46 -17 158 -33 -36 4 -199 219 -66 -244
3055b44Q3L46k02j52K01%m3O2nJ57j33J34k24K63l03L60m48j5M86j33k19N8K42
$$ -244 -161 185 -17 -169 32 32 -11 51 46 203 70 204 -20 243 -60 300 -148 -163 323 190 -29 29 271
3078B71m60L9K39k7l20L13J71k71j49N30m61M7L69l15j52L57j91k23J61L77j66
$$ 271 -189 -150 89 62 -258 55 226 -45 -194 336 -125 -78 291 -24 -176 181 -10 -233 -72 305 139
3099A39r5J87l80j59L34K68n04J27K81ol88L08j64k34J93J19j38m0L41j12l22
$$ 139 44 231 -149 -308 26 294 -210 -83 198 192 -196 112 -52 -286 -93 26 -112 -152 189 77 -245
3120b45L06k43K42j9K76k82j95L05j04j08K28j04r9J98k09j32J81J23M0j97P9
$$ -245 61 -182 60 41 317 35 -160 145 41 -67 161 57 -42 156 -53 -185 -4 119 159 -38 41
3141D1N3r1r9R7q5j82P9L43m4k03Q9K28j62k55J86Kk9J93J03l37L2N8J13r6J21
$$ 41 94 3 -96 1 -84 -266 -187 156 112 -91 -2 226 64 -191 -5 -3 -32 161 264 -73 -41 17 130 34 155
3166A55j00j68K36J94k61L29k95j26k9L59k92j7j54L16k10J27K62n66J44M4o1
$$ 155 55 -113 123 317 56 385 90 -36 -65 294 2 -15 -169 147 -63 64 326 -240 -96 -52 -113
3187a13J75J2J2l15L28r8L30o08M88l07P7L7L33n56J42K58k04Q3l52nL33o1J87
$$ -113 62 74 86 -229 99 1 331 -277 211 -96 -19 18 351 -205 -63 195 -9 74 -278 -283 50 -11 176
3210A76k12m58M64J58k73J13j11j6K46j46j72K04J35j31L7j53J92J20l24K76r2
$$ 176 -36 -494 -30 128 -145 -32 -143 -159 87 -59 -231 -27 108 -23 14 -139 53 173 -151 125 33
3231C3k2R2nj1R0L6m64J00J06P1o4J49l47R6M0L3k38L49l66K33j73P6K81l3k32
$$ 33 11 103 98 87 177 213 -251 -151 -45 26 -38 111 -236 -140 -100 -67 -305 44 -322 -89 -262 -186 95 62 -170
3256a70K36K35m26R8K11q6j97L75l05L7o6P8j04K13Lj53l06K16K29Mk12M7k6n4
$$ -170 66 301 -125 -27 184 98 -99 276 -29 8 -58 20 -84 129 132 -21 -327 -111 118 122 -90 -43 -69 -123
3280a23J3J77k91J23N5JJ06L70o20J14K82j04j08j30J73j39K11J13k92k1K06j31
$$ -123 -110 67 -224 -101 -46 -45 61 431 -189 -75 207 103 -5 -135 38 -101 110 223 -69 -90 116 -15
3302a5j14K2j35J83k2Q1R5k97Q0J56k21J35J24k70M9K44O6k37N7L20l43J2J84
$$ -15 -129 -107 -242 -59 -81 0 95 -202 -122 34 -187 -52 72 -198 -149 95 161 -76 -19 301 -42 -30 154
3325A54J32M4l82L36n32J70N3q9j43L25k05O3Q1n4m0J10o5K1j23k46O13l1q4q4
$$ 154 286 330 -52 284 -248 -78 -25 -114 -257 68 -137 -74 7 -47 -87 23 -42 -21 -144 -390 223 192 108 24
3349B4Jj03J7L2j66K15j2J19j34J20r5l8K60j31l92L20J81j5j16k78J83l13L21
$$ 24 25 -78 -61 -29 -195 20 8 127 -7 113 18 -20 240 109 -283 37 218 203 87 -191 -8 -321 0
3372@m7N9k52M55k47J12j38l4m0J30J15l6n4J53q4k47J26J22j69J96o3j02K2l8
$$ 0 -47 12 -240 215 -32 80 -58 -92 -132 -2 113 77 23 176 92 -155 -29 93 -76 120 57 -45 -23 -61
3396f1J68k14O5K11k20rK2J93k52rJ11l46L20k89L31k79J19Q0j53M27k2j97M4
$$ -61 107 -107 -42 169 -51 -60 -38 155 -97 -106 5 -341 -21 -310 21 -258 -139 -59 -212 215 193 -4 40
3419D0J33m05K59j74K52j09l9J56j46N3k17L34l50J59K86l97R1N0p3j23Q2J67
$$ 40 173 -232 27 -147 105 -4 -43 113 -33 20 -197 137 -213 -54 232 -165 -74 -24 -97 -220 -138 29
3441B9K7j09K67l29%Q3J0n6J65J22j26j68J48p3r0L23l6k17J24j13q5J72J37k15
$$ 29 56 -53 214 -115 -115 -32 -22 -78 87 209 83 -85 63 -10 -100 223 187 -30 94 -19 -104 68 205 -10
3465a0ln2K22k48j78K48j71J5r7L26j90K9nK05j22Q7Qk41J21K21L1m03N10m8m65
$$ -10 -13 -65 157 -91 -269 -21 -192 -177 -274 52 -138 -109 -114 91 -31 56 64 -177 -56 165 196 -207 303 255 -210
3490b10J21j9k7N5K24j81m1j38K35k2j77J9M4O7L01k07ok19J79Q6j97P8R4k06
$$ -210 -89 -108 -135 -80 144 -37 -78 -216 19 -3 -180 -161 -117 -50 251 44 38 -181 -2 84 -113 -35 59 -147
3514a47K60j46P7RP5j09r9P7j19K16j89l6o2J62J16j34j38R3L05j84m3kj34R8
$$ -147 113 -33 44 53 128 19 -80 -3 -122 94 -95 -131 -193 -31 85 -49 -187 -94 211 27 -16 -18 -152 -54
3538e4L32J9n51L9K16j10L43j32q7j07J52J55l91J17L8j47N0L60k40N8N4K1j43
$$ -54 278 297 -254 -215 1 -109 234 102 15 -92 60 215 -176 -59 -21 -168 -118 242 2 60 114 135 -8
3561hR0o9k58K38mJ8p9K08j23o4R5r1r0K69j14%R0j79N7OL51j61Q8m41L25o6O4
$$ -8 82 13 -245 -7 -11 7 -72 136 13 -51 44 -47 -137 132 18 18 108 -71 -14 -8 343 182 270 -171 154 88 152
3588A52j84J69j42j19N5K51P5n08N1j53K09J48j0q5j27L80k42j16J79P5j23P2
$$ 152 -32 137 -5 -124 -69 182 257 -251 -200 -353 -144 4 -6 -91 -218 162 -80 -196 -17 58 -65 7
3610GJ38k21J50r1n7O4o3J85P0j55K08m1l63N08n00L83j87m0o1J36k7l82K10M02
$$ 7 145 -76 74 -17 -74 -10 -73 112 182 27 235 194 -169 339 -161 222 35 -5 -66 70 43 -339 -129 273
3634B73l18q4J2j3K61j88K95l47J01L1J10j0K07l54J68k6k9L4l26K46J51m09L36
$$ 273 -45 -129 -117 -130 131 -57 238 -109 -8 23 133 123 330 -24 144 118 89 123 -203 43 194 -215 121
3657A21j25r9O2K26m43J60J95j53J06N1j42J36O7j19JK45j70L4k28j96l5K35j15
$$ 121 -4 -103 -41 185 -258 -98 97 -56 50 101 -41 95 162 43 44 289 119 153 -75 -271 -306 -71 -186
3680a86J2M71m30K26l69N10m44K71J7j43j33L60L3k29j6J75k17j02L94k22j24
$$ -186 -174 297 -133 93 -276 234 -210 61 78 -65 -198 162 195 -34 -50 125 -92 -194 200 -22 -146
3701a46K7J60k34M11l07J90L7j67j11J71P8j90J64n7M2j86M03l43n9j6K23nq0
$$ -146 -119 41 -193 218 -89 101 138 -29 -140 31 109 -81 83 26 68 -118 285 -58 -117 -133 90 85 5
3724EJ92l53jM8J27j13j33M5J04pj50J44Mn0K40j01Q3J05ql39R1Q5j24J53P8%
$$ 5 197 -156 -157 -109 18 -95 -228 -183 -79 -86 -236 -92 -88 -138 102 1 84 189 181 -158 -67 18 -106 47 125 125
3750A25j41o7J74j93K29j99R1J13o9k06J64l27N26j89k41K12M9j66J17P8J03m00
$$ 125 -16 -83 91 -102 127 -72 19 132 63 -143 21 -306 220 31 -210 2 51 -115 2 80 183 -217
3772b17M19J8k46o3K3J52m09L43q2m6O3R6l32K84Q2j36j08J98k03J24p8J21J78
$$ -217 202 220 -26 -89 -66 86 -323 20 -62 -108 -45 51 -281 3 85 -51 -159 39 -164 -40 -118 3 181
3795A81k91K42o8j5Q2j74J04L3J58j69N5k61K62l11J21K56m44J81J5K33k29j68
$$ 181 -110 132 64 49 131 -43 61 94 252 83 138 -123 139 -172 -51 205 -239 -58 -43 190 -39 -207
3817b07K06nr5K21k33J28O7j32J63p1M0j13K5n3K15j49O7L8J22p5J11l26M16l85
$$ -207 -1 -6 -101 120 -113 15 82 -50 113 42 82 -31 -6 -59 156 7 74 112 234 159 270 -56 360 -25
3841b5Q3o8r8J55J81m03R0J2o2K61l50j15K10p6K40kJ2k28j64M54j1l27J31J74
$$ -25 58 -10 -108 47 228 -175 -85 -73 -135 126 -224 -339 -129 -205 35 33 45 -183 -347 107 96 -231 -100 74
3865G4k1J29p1k49j37L29r4P8m9L25k47j6J19j80k98K76J41k52J26j0m6k8J97
$$ 74 53 182 111 -138 -275 54 -40 38 -11 314 67 51 170 -10 -308 -32 109 -143 -17 -27 -73 -101 96
3888I6k84K08j23j12J34Q1p6J50r6p0R5m5J46r2J07O4l20l4J51J13N1q9j81J16
$$ 96 -188 20 -103 -215 -81 0 -76 74 -22 -92 3 -42 104 12 119 183 -137 -171 -20 93 144 55 -126 -10
3912a0K62j31k17L23k13j48n5J37K72o7j31j51PJ55k48M5K82K6j63o4J29Q3j98
$$ -10 252 121 -96 227 14 -134 -189 -52 220 153 22 -129 -122 33 -215 -170 112 138 -25 -89 40 123 -75
3935g5J23M8k00K38n5k66J54K54p1j15p9R1k78J56R4j9L6q5L7k05K21j20K8p8
$$ -75 48 96 -104 134 79 -187 -33 221 150 35 -44 47 -231 -75 19 0 36 -49 -12 -217 4 -116 -88 -166
3959a66K22K08l49J81k50J55P4j58O0j6K18k49J32mm9M4M6l51K76j31K05Q3o4
$$ -166 56 264 -85 96 -154 1 75 -83 -23 -39 179 -70 62 58 9 53 99 -252 24 -107 98 181 117
3982A17j70J49p7k7n2J04m4M2k03K9K77l00M30k99K57k28j35M31l44N2K3j37R
$$ 117 -53 96 19 -8 -60 44 0 42 -161 -132 145 -155 275 -24 233 5 -130 301 -43 9 32 -105 -96
4005i6L47j04Rl20J40m0J7M0J13O7l11R8o8K44k00l0q8m9J53L20j59k54J28J71
$$ -96 251 147 156 -164 -24 -64 -47 -7 106 173 -138 -40 -108 136 -64 -94 -182 -231 -78 242 83 -171 -43 128
4029A28j78L13j46p7m2kJ99O8j03q0P7j07Jq8J42k46mK40N2p7k55K24m6j42q5
$$ 128 -50 263 117 40 -2 -4 195 263 160 80 157 50 51 -37 105 -141 -145 95 147 70 -185 39 -7 -149 -234
4054b34L50P6l0n21N16m34K94J07j34j24J82R4k64K52k37M4N9pJ56j47j21P6Q6
$$ -234 116 192 162 -359 157 -277 17 124 -10 -134 48 142 -122 130 -107 -63 -4 -11 145 -2 -123 -47 39
4077C9rk4j06J48M5k35K8J22k6K57j56k08M25n37M79l00K59R9m04L3J11j26M19
$$ 39 30 6 -100 48 93 -142 -114 8 -18 239 83 -125 300 -237 242 -58 201 300 -104 -71 40 -86 333
4100C33l86j38J88n0k2N2rO5K1J05k20J47N0k13N7n4K22k40J12j50jjJ93L8K1
$$ 333 -53 -191 -3 -53 -75 -23 -32 33 54 159 -61 86 136 -77 -20 -74 148 -92 20 -130 -131 -132 61 99 120
4125A20k03l0O9k19L47j14J3P8p9K27k04l3R2j4j71J36r8P8K8j24K21j60R5k52
$$ 120 -83 -113 -44 -263 84 -30 -17 61 -18 209 5 -28 64 50 -121 15 -83 -5 23 -101 120 -40 55 -197
4149a97L65k69Q7M5J4j41R5Q9j61j9J63P4k75L29kj58P5N5L5o5j41K6j46P8R4
$$ -197 168 -101 -14 31 45 -96 -1 88 -73 -92 71 145 -130 199 197 39 114 169 204 139 -2 24 -122 -44 50
4174E0N7j70P6o4j31L92k37q6J20j84qK98J8j97M7j34L25l38k5N8o1L17j34R4
$$ 50 107 -63 13 -51 -182 210 -27 -113 7 -177 -185 113 131 -66 -19 -153 172 -166 -191 -133 -194 123 -11 83
4198H3j2J42l60L60P0l44R5k75K58j5K04k74P3j35J72j96K34k00j6K62k84j73
$$ 83 71 213 -147 213 283 -61 34 -241 17 2 206 -68 5 -130 42 -154 80 -120 -136 126 -158 -331
4220c31K68Ok8J30L1n9m6j27J90r1O8Q8J13l27J97j34p4J81J35m06K53j33L3%
$$ -331 -63 -57 -85 45 76 17 -29 -156 34 -57 11 99 212 -115 82 -52 -126 55 190 -216 37 -96 -63 -63
4244f3n7K07j69J10M5J15l48J61n9J78j59J56k06K5P5L8j62P4l2L08j91q8K13
$$ -63 -120 87 -82 28 73 188 -160 1 -58 120 -39 117 -89 -64 11 49 -113 -39 -71 237 46 -42 171
4267A71k06r5j26M22r2j8J46m13J0O9M2j03K62j03J37l31L39L4L3r9k25j3KJ91
$$ 171 -35 -130 -256 166 74 56 202 -211 -201 -132 -90 -193 69 -34 103 -228 111 145 178 79 -146 -159 -157 34
4291C4j71L21o1k48J76K4j99J07p9K57J04l53N6r2j08L43n31N55P6k15j14n3K08
$$ 34 -137 184 123 -125 51 75 -124 -17 -96 161 265 -88 -32 -124 -232 111 -420 135 211 -4 -118 -171 37
4314C7J28m4L9l45K9Q2P4j66K07P3k34J74j6q6L9J63l60J40N4k47M39j06j41J26
$$ 37 165 121 160 -185 -156 -74 0 -166 41 114 -120 54 38 -48 -9 154 -206 -66 -12 -259 180 74 -67 59
4338E9k0j12J89L1P4k90P7j40L21j57K3n4r1J88Qk87L55l29K99k07J83p6o4l3
$$ 59 39 -73 116 147 221 -69 8 -132 189 32 55 1 -90 98 106 -181 174 -155 144 -63 120 44 -20 -53
4362e3J14j09L3J77j26K68o42L44J47l08K7j8L37l83M0J05J21r5L03o8L2k2k84
$$ -53 61 -48 -15 162 36 304 -338 6 153 -155 -128 -146 191 -192 -152 -47 74 -21 282 214 246 224 -60
4385f0J66l23J91j29K22m7K39m1j97k03J81P5j20J54Rj81K79k76J22Q3j23ko5
$$ -60 106 -217 -26 -155 67 20 259 218 21 -182 -1 74 -46 108 117 -64 215 -61 61 144 21 19 -46
4408d6m8J38r2J39mn9n6L8k07rK71j26J81k32J14RP0L5J37k13j54J17p3K28J2
$$ -46 -94 44 -48 91 87 28 -28 10 -197 -206 65 -61 120 -112 2 11 81 116 253 40 -114 3 -70 158 170
4433A70m9L4j8n3P5k80M4j61K33j64L43l08K62j70j53J87j6J29R2m6q6p6L42j99
$$ 170 121 155 137 84 159 -121 -77 -238 -5 -169 174 -134 128 -42 -195 -8 -24 105 197 151 65 -11 331 132
4457A32j56l4R4k90L38j41M0p3o6n1nK50O4j14l4l2j10K16O8J39L1k60J20K12
$$ 132 -24 -58 36 -254 84 -57 -17 -90 -156 -207 -212 38 102 -12 -46 -78 -188 28 96 235 266 6 126 338
4481C38l59M8N9R9m9j12j30J27J6K3n1l43P8O6L4J64q2L26l10J80j61j23J87J6
$$ 338 -21 27 86 185 136 24 -106 21 37 60 9 -334 -256 -190 -156 8 -74 252 -58 122 -39 -162 25 41
4505D1n1n3N9K31j25r0k6J38j06k7R5J15q2k35J00j34M31l03M6j91J7R9K22l37
$$ 41 -10 -63 -4 227 102 12 -14 124 18 -9 86 201 119 -116 -16 -150 281 -22 24 -167 -150 -51 171 -166
4529a66J92J6j72K27k60K11r2J83k2k44L55j48k40K39m8K02l48K7R9j9j06K26
$$ -166 26 42 -130 97 -163 48 -44 139 117 -127 228 80 -160 79 31 233 -115 -88 11 -8 -114 112
4551A12j23j10j84M61R2k50J90o6J27k70K0j06L07k7l49J86p3J77m7%j51PJ03
$$ 112 -11 -121 -305 156 248 -2 188 122 249 -21 -1 -107 200 173 -176 10 -63 114 67 67 -84 -77 26
4574B6n6M7qj57K59q3k60L04J59k97J9j16K82j05k08R1P2J34k64lJ61J1K00k99
$$ 26 -30 17 9 -148 111 28 -232 72 231 -66 -47 -163 119 14 -194 -103 -31 103 -161 -164 -3 8 208 -91
4598i1K37j7j59J65k65K41l60K38o3J58j79J76n8J75j15k24J82n9j22L63l79K84
$$ -91 146 129 -30 135 -130 111 -249 -11 -74 84 -95 81 23 198 83 -141 41 -18 -140 223 -156 128
4620A28q4P6j11j13K88k72p2j53J16K86j90o9K68r5r1n5J78j39J27j8L7j13PK9
$$ 128 44 120 9 -104 184 -88 -160 -313 -197 89 -101 -170 98 3 -88 -143 35 -104 23 5 42 -71 -64 -35
4644c5J08J06k9k20K48k99J06j6J88k24J45j28p4O6K0j38K17p5P9K4m8q6J78j24
$$ -35 73 179 150 -70 178 -121 -15 -31 157 -67 78 -50 -124 -58 -38 -176 41 -34 45 69 21 -65 113 -11
4668a1Q8j74J53J9L7J0p0K7p0MK1k20M5K62k29Q5J90j82J35j83J06j03JP7k38
$$ -11 77 -97 56 75 112 122 52 79 9 13 34 -186 -141 121 -108 -23 167 -15 120 -63 43 -60 -59 18 -220
4693b20K20q6l7O7j30O5oK84p5r5j32k1L44l08n1L57O0j82O7m94L66J12J14l29
$$ -220 0 -86 -123 -56 -186 -121 -127 157 82 -13 -145 -166 178 -130 -181 176 236 54 121 -373 -7 105 219 -110
4717a10Qo4J64K06j26j07M3m20J95K42k48N27l61j67Q5M2K16j14k9n3mJ26m0O4
$$ -110 -102 -166 -2 204 78 -29 14 -406 -211 31 -217 310 -51 -218 -133 -91 125 11 -18 -71 -75 51 11 75
4741G5j32J5k0j49P9K16k15J7K18l9N6j77J94r7ln4J49k2j26J73k76L61m17L32
$$ 75 -57 -42 -62 -211 -132 84 -131 -114 104 65 121 -56 138 41 38 -16 133 111 -15 158 -118 243 -174 158
4765A58j99J6N2J2j40Q0N9p2N8j90O8K53k23m9K15q4l5qM9j1j52K6K11r7Q6l85
$$ 158 -41 -25 27 39 -101 -21 38 -34 24 -166 -98 155 -68 -117 98 14 -21 -29 20 9 -143 -117 94 -3 83 -302
4791c02K72O6o3OK3j48K03k3l9nN7L7j34Q0Q9P4j82j39O1K38j91K00l20K54p9
$$ -302 -30 36 -27 -21 2 -146 57 34 -5 -10 47 84 -50 30 119 193 11 -128 -67 171 -20 180 -140 114 35
4816C5J10k46J46p2j14L20j34j57R7M4Q8l03L01j09P5l8N6L5n6j39K31m32M06
$$ 35 145 -101 45 -27 -141 179 45 -112 -15 29 117 -186 115 6 81 43 99 134 78 -61 170 -262 144
4839A44lK4k3n5J4j41K9J28j35J96l20J21k9J91k76K8J30K31m21J08L07j49m2
$$ 144 141 165 142 87 101 -40 -11 117 -18 178 -142 -21 -50 141 -135 -107 23 254 -167 -59 248 99 57
4862E7p6K7k1j7R2k2m8K31k28o7p0K8J37J25p1j97R4j39J62n1JK23k31P3J66L3
$$ 57 -19 8 -13 -30 62 40 -8 223 -5 -72 -142 -114 23 148 77 -120 -26 -165 -3 -54 -53 170 -61 12 178 211
4888B11j21j42j68J61K37m9j27Ml7j84L9J20k40K43J08R3p0j52L82m06o1l5o0
$$ 211 90 -52 -220 -59 178 129 2 6 -31 -215 -176 -56 -296 -53 55 148 78 -74 308 -98 -159 -194 -254
4911b54K50J50k5l33K88J82j48o2M9j48J4J37q9r5K22j64J26K7j14LQ6k16k9K31
$$ -254 -4 146 121 -212 76 258 110 48 97 -51 -37 100 11 -84 138 -26 100 127 13 16 102 -114 -143 88
4935H8r9P5m1M0k04L05k7n01M08R1j77k53K36j19J31J45Q1j92j59K43l51J24J24
$$ 88 -11 64 23 63 -141 164 137 -364 44 135 -42 -295 -59 -178 -47 98 179 -13 -172 71 -280 -156 -32
4958c2J07Q2k76j75L00p7K3J04J8j80J48MM9M5j07j41L45j62J49l67K20j73pK35
$$ -32 75 157 -119 -294 6 -71 -48 56 74 -106 42 46 95 140 33 -108 237 75 224 -143 77 -96 -103 132
4982A32n3%j61L26k45o2o0J54J30o2l1k17P3k5N6K39j26l0J65k54Q4J99k64k5
$$ 132 79 79 -82 244 -1 -63 -123 31 161 99 68 -149 -76 -101 -45 194 68 38 203 -51 33 232 -32 -57
5006e7K7N6o9L9L9j18oK26j65K46ql60L02l04J0K89j12p3J86k22J32N8r3o4mr4
$$ -57 -30 26 -43 -4 35 -83 -89 137 -28 218 210 -150 152 -152 -142 147 35 -38 148 -74 58 116 23 -41 -45 -139
5032a39J14J74K4j56j18j95L12O5N6q2n5J8j68J13j54K32j31J79kk54L81j00j27
$$ -139 -25 149 173 17 -101 -296 16 81 137 55 0 18 -150 -37 -191 41 -90 89 87 -167 214 114 -13
5055a3r5P0Q9j73K96j90J13k18L83k46J12l05J22O6m3Q3j05K73m53J99K48K8l36
$$ -13 -108 -38 51 -122 174 -16 97 -121 262 16 128 -177 -55 11 -32 51 -54 219 -234 -35 213 241 -95
5078i5oK47M6m73J71R5L9K50l24n9L12o2k96K31p4O2L6k05J27p2J9o8J93o8L5
$$ -95 -101 146 192 -281 -110 -15 24 274 -50 -109 203 141 -155 76 2 64 100 -105 22 -50 -31 -99 94 26 61
5103F1k4q1l3K83r1%k17K12l29L11n3J10Ok84n7K76j01M8j6j84J4LL00j71J18
$$ 61 37 -44 -77 206 115 115 -102 110 -219 92 39 149 155 -129 -186 90 -11 37 21 -163 -149 -146 154 -17 101
5128A01p3k9k31L23k60K38r4N8J7p5j99J95j5o1P9M3J11l26K39j27J04pJ40j8
$$ 101 28 -1 -232 91 -169 69 -25 33 50 -25 -224 -29 -44 -105 -26 17 128 -198 41 -86 18 11 151 133
5152A33j89m6J13mk07K0L15j07l19L05k42L21O3k52K89j06r4J46k05J45r6O0j27
$$ 133 -56 -102 11 7 -200 -180 135 28 -291 14 -228 93 156 -96 193 87 -7 139 -66 79 -17 43 -84
5175h4j42J10J07P5J05k54J77l7k30K5q8K61k80J77P1n9M5l5N0OP9k62J83J60
$$ -84 -226 -116 -9 66 171 -83 94 57 -173 -148 -236 25 -255 -78 -7 -66 -21 -56 -6 0 79 -183 0 160
5199A60j02J89l97r6L5J71M7P4J15j22j40J00j7l9j81K07KPMj37R8o3J05K31k48
$$ 160 58 247 -150 -246 -211 -40 7 81 196 74 -66 34 17 -22 -203 4 6 13 17 -120 -22 -85 20 251 3
5224CJ5O7j51j14Q5J32k44J45J0J32P2k49J88l45K94k3J34j59%n9J05q4p0R5k46
$$ 3 18 85 -66 -180 -95 37 -207 -62 -52 80 152 -97 91 -254 40 17 151 -8 -8 -67 38 -46 -116 -21 -267
5249b67L44O5k43J54q4P0k73L61nM5j56j16J97J3k06k6J9k5L86rl01J66j91RK30
$$ -267 77 142 -101 53 -31 39 -234 127 122 167 11 -105 92 105 -101 -127 -108 -133 253 244 -57 109 -82 -73 157
5274A57p1j2j70K78k85k18L33J17M2o4o9j52J01J55j83J12J91l19PK9j14L83P3
$$ 157 86 74 -96 182 -103 -321 12 129 171 107 38 -114 -13 142 -41 71 262 -57 -50 -21 -135 248 321
5297C21m83K75m0l14K35j4J5L3l9p7J00j38L31J38m00J38J44j40j85L20j35j1
$$ 321 -162 113 73 -241 -6 -20 -5 28 -11 -88 12 -126 205 343 -57 81 225 85 -100 220 85 74
5319G4k05rq5K66j48K80j02j27K50l20o5J60K04l3k72n0N0K54Rk53K88k88r9P7
$$ 74 -131 -140 -225 41 -107 173 71 -56 194 -126 -191 -31 173 140 -132 -182 -132 122 131 -122 166 -122 -221 -144
5343a44L17k88M23l18L1K1k00J51J85j91K8oJ5k01L2P1Q9l35M79l11K31m9J53
$$ -144 173 -115 308 -10 21 42 -158 -7 178 -13 15 9 24 -177 -145 -74 15 -320 159 -152 79 30 183
5366A83q1k98L84q5K5l94K85l60M07j53M7p2J53J53k55K61r2k09K25p2J27j58
$$ 183 102 -196 188 103 128 -266 19 -341 66 -87 -40 -112 41 194 -61 200 108 -101 124 52 179 21
5388B1K2Pj36J28J97j71j19J25Ok6O9J00q1j48k11M42j68k73M15k45k4J44j89
$$ 21 43 50 -86 42 239 68 -51 74 80 54 123 223 142 -6 -217 225 57 -216 199 -46 -70 74 -115
5411a15J06J55pl04Q1J66k11J82q5j69K79j87p6j37M18j46K60k21J49j15j5j53
$$ -115 -9 146 139 -165 -84 82 -129 53 -32 -201 78 -109 -185 -322 96 -50 210 -11 138 23 8 -145
5433a45J09R3o7r8K55j19q6Q2K17j80j3J81l9k06O1j76L32j42j37J21j43M1J03
$$ -145 -36 57 -10 -108 147 28 -58 24 241 61 48 229 190 -16 45 -131 201 59 -78 43 -100 -59 44
5456D4j31l0K58j41Q3j27K06j52j29Q4R4j21K15l1j81k4Q5n9n9k3L87l67K01M4
$$ 44 -87 -117 141 0 83 -44 162 10 -119 -35 59 -62 153 122 -59 -83 2 -57 -116 -139 248 -119 82 126
5480A26j96k1P0N7J2m38M29k26L52j89J59L6jn2q1K25m27J17n9J70no1J79j33
$$ 126 -70 -91 -21 36 48 -390 39 -187 165 -24 135 171 170 118 37 262 -165 -48 -107 63 58 -3 176 43
5504D3l19L41J53Ml67J77n1R3n1m35M38M0o1J40j7j39K30p2j43j57L5J90k51L92
$$ 43 -276 65 218 222 -145 32 -19 74 23 -412 26 66 5 145 128 -11 219 147 4 -153 -118 72 -179 213
5528B13j37k00J09P4j14O9MJ03l27K46mM4k8j03L7QK1j01r8K19K8m5n6j25J82
$$ 213 76 -124 -15 59 -55 14 18 121 -206 40 36 80 52 -51 -14 -6 15 -86 -184 35 63 18 -38 -163 19
5553A9jJ64j22J03j88K00j98l1P4J17k45j98K83j34L1N5Q6j24K07Rm8K8j0j7l45
$$ 19 18 182 60 163 -25 175 -23 -54 20 137 -108 -306 -23 -157 -126 -71 15 -109 98 107 59 87 77 60 -285
5578b85J85J31j98K14RJ3j05k0K15o7k26J14J59j48L90j60k50K25l6j88n5l4J67
$$ -285 -100 31 -167 47 56 69 -36 -56 159 92 -134 -20 139 -9 381 221 -29 196 160 -28 -83 -117 50
5601E0n6m7ql0J5P9j31K37k08O2J31L9m6J25j69j66K68k56J72Q7k50k13L45J20
$$ 50 -6 -53 -61 -91 -76 3 -128 109 -99 -37 94 133 87 212 43 -123 145 -111 61 148 -102 -315 30 150
5625A50k00J1K15m7j73K76k49J8q5J47P1n4j45J9n3J06J71m9j83K7j5M8j16j8
$$ 150 -50 -39 176 129 -44 232 -17 1 -84 63 134 80 -65 -46 -99 7 178 129 -54 -27 -42 6 -110 -128
5649a28J24R8k31L57k10oL9P1k93K58q5J6k24L10M2q6J6K19k77j9K43j45j82M3
$$ -128 -4 94 -137 220 10 4 43 114 -179 79 -6 10 -214 96 138 52 68 287 10 -9 234 89 -93 -50
5673e0J27J53k05j80J01K30j22j63l9K79j18k3l0J87K06l63k9k47K44l80O03k65
$$ -50 77 230 25 -155 -54 176 54 -109 -148 131 13 -10 -40 147 353 -10 -39 -286 -42 -422 181 -84
5695h4R9M3L4Mk78K71q7m7O6k33J44J24J29p8j05J7n2l5J70k3q5J56k73p7L61
$$ -84 15 58 92 96 -182 89 2 -45 21 -212 -68 56 185 107 2 19 -33 -68 102 79 -6 150 -123 -200 161
5720A61j22j90R5NK46k25p9K28k96J28K42k4m8k45K88n1j09J32j50j7J2p8K83
$$ 161 39 -151 -56 -51 195 -30 -109 119 -177 -49 193 169 121 -124 164 113 4 136 -14 -31 -19 -97 186
5743A86j52J77k32or6K49L6j03j14J33j05P2j03J5j87J54J61q6Lj64J46L7k66
$$ 186 34 211 -21 -27 -123 126 162 59 -55 78 -27 45 -58 -43 -230 -76 85 -1 2 -162 -16 21 -245
5766b45J30J33j71K11q0L05j67j21j60J25L3N2N1K2o1k56J45M72o59K44J10r0
$$ -245 -115 18 -153 58 -22 283 116 -5 -165 -40 -7 45 96 118 57 -199 -54 418 -241 3 113 23
5788B3n9p3O8J52M2k80L05J3k02m1N5K9l8j80M2j85J63O0m2Q2J37j89rK21m6j18
$$ 23 -36 -109 -41 111 153 -127 178 191 -11 -52 3 32 -6 -186 -144 -329 -166 -106 -148 -66 71 -118 -127 94 48 -70
5814g0J54j07l5R1j47MJ01Q2R6j71M4r7j2J52m8j57J13R1r3Q0j13Q5J59j82J43
$$ -70 84 -23 -58 33 -114 -110 -9 73 169 -2 42 -55 -67 85 37 -120 -7 84 -9 71 -42 43 202 20 163
5839A63R3k99Q3P6k87P9K9j05k3J38K88k98L01m21K58Q5j21j67R6nJ8K04j91Q5
$$ 163 256 -43 40 116 -171 -92 -63 -168 -191 -53 235 -63 238 -183 75 160 39 -128 -32 -37 -19 185 -6 79
5863G9Q4m12K61J97l46rJ71Q1l05K54J9k2q3m8K3J08R3j25j2j86K40NR9k04J59
$$ 79 163 -249 12 209 -137 -146 25 106 -199 55 74 52 -31 -79 -56 52 145 20 8 -178 62 67 166 -38 121
5888A21j58J1K21l00J99J5m00J75J08o1l1M8M5J3l6K25m02K20j19R6L1l6j09R0
$$ 121 -37 -26 195 -105 94 109 -291 -116 -8 -69 -100 -52 -7 6 -30 195 -207 13 -106 -10 21 -15 -124 -34
5912c4K7l0K02k21Q2J68o4k72J27j06k6l0k6K72k6P1k24j1N0j32K87o6J88k46
$$ -34 -7 -37 165 -56 26 194 130 -142 -15 -121 -147 -177 -203 69 43 114 -110 -121 -71 -203 84 18 206 -40
5936d0J89j81N8o0p4q4J95j36K30Rj87J22j48j31L36q9L2O5l8r6o3Q0m8j4J67
$$ -40 149 -32 26 -34 -108 -192 3 -133 97 106 -81 41 -107 -238 98 9 41 106 68 -28 -91 -11 -59 -73 94
5961I4N6N3j83P1l4l68J81J19j73O5R3J86k55j30O5K08k84K01q0K61k28m9J63
$$ 94 150 203 20 91 57 -311 -130 -11 -184 -119 -26 160 -95 -225 -160 48 -236 -35 -115 146 -82 -131 32
5984C2j92P6j70Q9J27J41l91L08k63K21J43j28K8k05O5J30j50J23M09l86L38j82
$$ 32 -160 -84 -254 -165 -38 103 -288 20 -243 -22 121 -7 21 -184 -119 11 -139 -16 393 7 345 163
6006A63k11k4J89k9J38j02l0k48J93J52j05l1l1J82k78J52r8J29l38L04p3k7K2
$$ 163 -48 -72 117 88 226 124 94 -154 39 191 86 55 24 206 -72 80 -18 111 -227 77 4 -23 -1
6029aj57L13j69K13j85K04n5qk9j4j66J07Mj50Q2JJ29l99L90l56J63J30J81k71
$$ -1 -158 155 -14 199 14 218 163 155 126 112 -54 53 57 -93 -11 -10 119 -280 110 -246 -83 47 228 -43
6053d3J09J32k18l86K93j51o3L32j34M02l41O4J14lo0k57J94qO3k6K43l20k5O8
$$ -43 66 198 -20 -406 -113 -264 -327 5 -129 273 -68 -4 110 107 47 -210 -16 -24 39 13 256 -64 -89 -21
6077b1l9j00J39j17K65j56oR3K12k30R2j63j30J65q6R4K8J84j31j76Q6k93M57
$$ -21 -60 -160 -21 -138 127 -29 -35 58 270 40 132 -31 -161 4 -82 12 40 224 93 -83 3 -290 167
6100A67k37J44p5J15J05o5o1q3k1J63l23K02k09k8J87J71j40j12K36j07j60K6
$$ 167 -70 74 -1 114 219 154 93 10 -11 152 -171 31 -178 -206 -19 152 12 -100 136 29 -131 -105
6122a05K76n5j69J01Qk35J55K7k23j27L18N3K50j00l27K79j73m6J10m9L69n49
$$ -105 171 116 -53 48 56 -179 -24 3 -220 -347 -29 24 274 174 -153 126 -47 -93 17 -32 337 -212
6144b12JJ64L1j16J02k6K10l2M1j65j0k47J87K6qK71j45k2J04k47R1m4K49m20
$$ -212 -211 -47 -16 -132 -30 -56 154 122 163 -2 -12 -259 -72 -46 -54 217 72 50 154 -93 -2 -46 203 -217
6168b17K68q4QM8O5j59J55k8q4K2j48K86j59j38J81j27N3J7J65j83J39l2j89K30
$$ -217 51 -33 -25 23 88 -71 84 56 -28 -6 -154 132 -27 -165 16 -111 -58 -41 124 -59 80 48 -141 89
6192H9j15P9r5N4k2l0j26j0K00K05l34j3L67k98J23R8pj37Q1j99j8J12J50q6j90
$$ 89 -26 53 -42 12 -10 -40 -166 -176 24 229 -105 -118 249 -49 74 172 165 28 109 -90 -108 4 154 68 -122
6217a22J99k15l1L42N2j07j11J91l26O3K3O0J09n4R1k48J50J19q4k02P5J66m01
$$ -122 77 -138 -169 173 225 118 7 198 -128 -65 -42 18 127 73 164 -84 66 185 101 -101 -26 140 -261
6240b61K08r2K77j82J20Lj26N4Q0O5j50k3j07N8m2M7n1K34j7m6k26J82K43k94
$$ -261 -53 -145 132 -50 70 73 -53 1 81 146 -4 -27 -134 -76 -118 -71 -122 112 95 49 -177 5 248 -46
6264d6j15J54M3j42l5J25j05N9K96k36r4m7R1K04J7l02j48K55O0j1N8k34J38J75
$$ -46 -161 -7 36 -106 -141 -16 -121 -62 234 -2 -96 -143 -52 152 169 -133 -281 -26 34 23 81 -153 -15 160
6288A60m52M43k21J89j43K54k50R9L4k35J65k00K96j74K56q9m6M7j4j08j56Q4
$$ 160 -292 151 -70 119 -24 230 -20 79 113 -122 43 -157 139 -35 221 132 86 133 119 11 -145 -61
6310f1J50N5k02j45J47J83m5j87J37N8r7K09n34P17n18J76k4l92K74K3j22P7j55
$$ -61 89 144 -58 -203 -56 127 82 -105 32 90 -7 202 -332 385 -133 43 19 -373 -99 -76 -198 -121 -276
6333b76K40K71j96j23j26K79j24L9k1p9R8P3Ol5o7J20m1M2m9k08K06j5M9j2K15
$$ -276 -36 235 39 -84 -210 69 -55 -16 -37 -116 -18 55 61 26 -41 79 38 80 31 -177 29 14 63 51 266
6358B66l60K60j44R2l36M1L64j50m0k28M05k0n0j80K60n6m9j45o7J88j45N4K9
$$ 266 -94 166 22 114 -222 -181 183 33 -7 -235 170 150 100 -80 180 124 75 -70 -137 51 -94 -40 -11
6381a1R1M1r8N8j74O9j20L0L11k61J32l0nJ4k18J83J66r5j35j8N7N4L1p2mj09
$$ -11 80 121 23 81 -93 -24 -144 -114 197 -64 68 38 33 47 -171 12 178 83 -52 -70 -13 41 72 0 -4 -113
6407a13J75j31N9LJ2K63j13o7k63O9J70l5j46K0J10j9J1j36J30q5J62j23j03j7
$$ -113 62 -69 -10 -7 5 268 155 88 -175 -106 64 29 -117 -97 13 -6 5 -131 -1 -86 76 -47 -150 -167
6431a67K68N8r9RK2q8n4P7l0O7j97LoM1k1k9J65j57L4J83j85m0J61n2K4j75K12
$$ -167 101 159 60 69 91 3 -51 26 -4 63 -134 -131 -137 -96 -117 -146 19 -138 -104 79 -106 -146 15 -37 -13 -188 24
6458B4M3R0l33K57j43J73J16j77K5K5r3j95J65l6J62Q9l20Q1L7J6J01j32J9k20
$$ 24 67 157 -176 81 -62 111 227 50 75 100 7 -188 -23 -59 103 192 -128 -47 -10 6 107 -25 -6 -226
6482b26L21J8k52J89o7RN2p2jK67k91K36j08r8j15M07k24J28k63K10j72J74oj01
$$ -226 95 113 -139 50 -17 -8 44 -28 -29 238 -53 183 75 -23 -138 269 45 173 -90 120 -52 122 116 15
6506A5K73l40J52j10M8r1l34K63J65j07L41l67J69K8j34Q1M0K16k11J0j4k97L47
$$ 15 288 -52 100 -10 38 -53 -387 -124 41 -66 275 -92 77 105 -29 52 92 308 97 107 93 -204 143
6529A43Mj53R2J5K62l63l00K46J19q5j8R9j69pQ4k2P9k08K06J84l54K03n3q3K69
$$ 143 147 -6 86 101 363 0 -300 -54 65 -20 -38 61 -108 -115 -31 -53 26 -182 24 208 -146 57 4 -79 190
6554A90k13k39K36j22m0J33l2P9L6kl1N4k0J07j25p4J05r4J40o5k29K83r6J21
$$ 190 -23 -262 -26 -148 -188 -55 -87 -8 28 26 -5 49 29 136 11 -63 42 -52 88 23 -206 77 -19 102
6578A02m4lQ6p6LJ70J8m43K00J24Km9O9k00O7m03M97n8k2k1j13L1k74M01Jk15
$$ 102 58 55 141 65 68 238 256 -187 13 137 139 90 159 -41 26 -377 120 62 40 19 -94 -63 -337 64 65 -150
6604a50M1j3k1J41J28j73J34L6r2p2J02n8q9K62j13n1p8J86J5k57j12k7K77M5
$$ -150 -109 -122 -143 -2 126 -47 87 123 31 -41 61 3 -86 176 63 12 -66 120 135 -122 -234 -261 16 61
6628F1j50m2K61l60K17N6J03l00K40k54J07R7j16M05k96K09k48M7l04L75j07N7
$$ 61 -89 -131 130 -230 -13 43 146 -154 86 -168 -61 36 -80 325 29 238 -10 37 -267 108 1 58
6650E8N1oN4r7n0j44P2K90j25k37N9J53K8J2M6j41j45K54p0L7n5n0j5J66j25K64
$$ 58 109 103 157 60 10 -134 -62 228 103 -134 -75 78 106 118 164 23 -122 132 62 99 44 -6 -21 145 20 284
6676B84l85Q3J40j42p9om9J61J74k6q8n4R5j26J16p8k1l5J98k20j59Q3R0O2N6
$$ 284 -101 -18 122 -20 -99 -105 -154 7 181 155 67 13 108 -18 98 20 -1 -36 162 -58 -217 -134 -44 18 74
6701G4q0Jn0K41j23k62L16k44P8J4j03J35Pj13J18N5K81n35J17k19J60L18J8n6
$$ 74 -6 -5 -55 186 63 -199 117 -127 -49 -35 -138 -3 4 -109 9 64 345 -190 -73 -292 -132 186 204 148
6725A48M6Pj28j25O5K6l54J24M92l07L7N7N2k44K33j98o7J04j1K05m3o4J10k12
$$ 148 194 201 73 -52 13 39 -315 -191 301 -6 31 88 140 -104 129 -69 -136 -32 -43 162 119 55 165 -47
6749d7K37l92K11O0j0j36j93L50j84J8J00o6j20K93j1j33j56J29J18k36J71Mk6
$$ -47 190 -202 9 69 59 -77 -270 80 -104 -86 14 -52 -172 121 110 -23 -179 -50 68 -168 3 7 -19
6772a9j02R6J31j77J85l0Kk9j03Q3j30R2L8K69n47M22k58K28k01J00J14j9j13
$$ -19 -121 -25 106 -71 114 84 86 57 -46 37 -93 -1 37 306 -241 181 -77 151 -50 50 164 145 32
6795C2j15K11j02j59K22j38R3q2J35j47j6k04K24j08P9L31k11J1k38L38j85K05
$$ 32 -83 128 26 -133 89 -49 44 -38 97 -50 -66 -270 -46 -154 -75 256 45 56 -182 156 -29 176
6817A76k77J50M0l9k40K7J03o4K96j13l0K53n76M7L89q0k10J40J0M3nr0m1O1J52
$$ 176 -101 49 89 50 -190 -163 -60 -124 172 59 29 282 -294 -247 142 62 -148 -8 2 45 40 -50 -91 -30 122
6842A22j01k14K08J21j86J27j93K38O1k67J10o8K09J19n09M43k80P9l6Mj34K01
$$ 122 21 -193 15 136 -50 77 -116 122 183 -84 26 -42 167 286 -223 220 -60 19 -17 -13 -147 54
6864E4j58J39l38L69j61N8J82j52J43L3k78J33J8P7j70P9L4j59L13k51J60j25
$$ 54 -104 35 -303 66 -95 -37 145 -7 136 169 -109 24 42 119 -51 28 62 -97 216 -35 125 0
6886@R8L5k15lr6K68k77J8K31N5r9j00J0j18M4L3K11j64M2J45k70J13J55j00J83
$$ 0 98 133 -82 -85 -181 87 -190 -172 59 114 15 -85 -75 -193 -149 -116 95 -69 -27 118 -152 -39 116 16 199
6911A99j72m7n5R8Q9k53NK23l06N2Q1L55l42p8J81Rr6J28j50J99k00l5j2J86n2
$$ 199 27 -20 -75 23 112 -141 -136 87 -219 -167 -86 269 -73 -151 30 39 -57 71 -79 120 -80 -115 -127 59 7
6936GK59k55k5R6k33J05r8M43n84K93Lk43K3J25m4K94P1o03O06k47j37O5K1K62
$$ 7 266 11 -14 82 -151 -46 -144 299 -285 8 11 -232 -209 -84 -128 166 237 -366 240 -7 -144 -79 -58 204
6960B04r6J21j38j4j45m9l2J93J3o6K0j13J49J1l93M54j17J74l77K94j51K1O6
$$ 204 108 229 91 77 -68 -117 -149 44 57 -9 11 -102 47 58 -335 119 2 176 -201 93 -58 -37 29
6983B9m5rJ15k15p7N5N9j5L17k19j25L2J52j44N4N3P3n6J17J1n5k36J60Q4p4P5
$$ 29 -16 -25 90 -125 -202 -147 -88 -103 214 -5 -130 -98 54 -90 -36 17 90 34 151 162 107 -129 31 115 41 116
7009A16J9j42J40j44K10j77l7J43j12j24j5j08K48lJ89j96J52l36J0J54p4J24
$$ 116 135 -7 133 -11 199 22 -15 128 16 -108 -123 -231 17 14 203 7 159 -177 -167 -13 -87 37
7031C7j08P1j7J2L3J46l89K90j17K46lj46j11L5r2k8J70j01K47k54K61l41J08
$$ 37 -71 0 -17 -5 28 174 -215 75 -42 204 201 55 -56 -21 -113 -141 29 -72 175 -79 182 -159 -51
7054e1J23j7l9p4k16J26K85m9j74j5K95k10j54L33l15J83k07L52j01n2j13p2J94
$$ -51 72 55 16 -58 -274 -148 137 88 -86 -101 194 -16 -170 163 -152 31 -176 176 75 23 -90 -162 32
7077C2j78J15nL8J93k72J18N8j32q5J88J15k48J80J8m18O9M13j45j3k2J11l48
$$ 32 -146 -31 -36 2 195 -77 41 99 -33 -118 70 185 -63 117 135 -283 -214 199 54 41 19 130 -218
7100b18J16J34J09j36J86J06j56k07q0Q5K94j52OJ20k78K72m34nQJ05J70j82J28
$$ -218 -102 32 141 5 191 297 141 -66 -146 -61 233 81 87 207 -71 201 -233 -238 -230 -125 45 -137 -9
7123iJ46J19k81j78M68k69O8N2j52o9R5rq8J86j11J17k24J45J63L9l49lK60k52
$$ -9 137 256 -25 -203 265 -4 64 116 -36 -105 -10 -19 -107 79 -32 85 -139 6 169 208 -141 -144 116 -136
7147a36J80M5j16l6l0J17J25r2j7J77k52m6K12l09O1K34j57P7J6n5j39M02k32
$$ -136 44 89 -27 -63 -93 24 149 57 40 217 -35 -81 131 -178 -117 117 -40 37 53 -2 -141 261 29
7170B9l2J65pl06K09J07l58p3L23j16o3K32j07l6k2M0o2j88M8N28j85j62j6Q0
$$ 29 -3 162 155 -151 58 165 -193 -266 57 -59 -122 110 3 -33 -55 -15 -77 -265 -217 311 126 -36 -52 28
7194B8k10J28j80J40p1J83Q3j98o9L50l57M9J71j38K68j28J27K9j27q8K2j8J42
$$ 28 -182 -54 -234 -94 -165 18 101 -97 -166 184 -173 -124 47 -91 177 49 176 205 78 -10 12 -6 136
7217A36q4p1J74j93p5O0M7Kj28M4oK52p3j51J10J37k50Q2M4j50J88PN8M1j27M0
$$ 136 52 -19 155 -38 -113 -53 -6 -4 -132 -88 -94 158 85 -66 44 181 -69 13 57 -93 95 102 160 201 74 114
7243A14k12M0K07m38L66o6Q9j02n9m1j4N6J14k89K22J09k38K45N5M4k15j19O8
$$ 114 -98 -58 149 -289 77 11 100 -2 -61 -102 -116 -60 54 -235 -13 96 -142 103 158 202 -13 -132 -64
7266f4J6J72k55M45l37J06q3r2J02J76l58J02Qj05P3K01l65P1K43M0m5l16L07
$$ -64 -48 124 -131 314 -23 83 0 -92 10 186 -172 -70 -62 -167 -94 107 -258 -187 56 96 51 -265 42
7289D2j28L07Q5m16M8J25K5j37j2N8J53l7k34J25Q7k04k8P9j89L13j30J47k30
$$ 42 -86 221 306 -110 -62 63 88 -49 -61 -3 150 113 -121 4 91 -113 -141 -62 -251 62 -68 79 -151
7312a51Q5Q9j03J21N8k11OM9k4L21j20l58Q0N8lj5K58j32j04L07k33M0R1N1p3
$$ -151 -66 23 -80 41 99 -112 -106 -57 -81 240 120 -238 -158 -100 -103 -118 140 8 -96 211 -22 18 109 160 87
7337H7k6pL8j37J88k42K97l18q4K20j27K24j10k6k22J02l0p1L55j10Q2J65j90
$$ 87 61 54 92 -45 143 -99 198 -120 -204 16 -111 113 3 -23 -245 -143 -173 -244 111 1 83 248 58
7360E8j31N5N4l2qK39l58K12j04j92L73k66K40k24K9j01K75l70M46j30j06J02
$$ 58 -73 -18 36 4 -4 235 -123 89 -15 -207 166 -100 140 -84 -55 -156 119 -251 195 65 -41 61
7382F1j6k10L16j11j15m2k4J62q8j28j16L55j7n9j0J30k02J51l26L80K6j19J31
$$ 61 45 -165 151 40 -75 -117 -141 21 -67 -195 -311 44 27 -32 -42 88 -114 37 -289 91 117 -2 129
7405A29j14M61m18J53j37j27Rj83J10J65K1k07j88K01L05k48J72R8Pk38j30J52
$$ 129 15 476 58 211 74 -53 -44 -227 -117 48 69 -138 -326 -125 180 -68 104 202 209 -29 -159 -7
7427gk05L42J3j55l0j90J13M5J37j87J36J79qk47J40j97O4K27k77J18M7l3J93
$$ -7 -212 130 143 -12 -42 -232 -119 -74 63 -124 12 191 183 -64 76 -121 -57 170 -107 11 58 25 218
7450B18k65m3J76L7j63J61j10J1m0J4j56J87j52P3O3J3m2j77L29l34k9K50J98
$$ 218 -47 -90 86 123 -40 121 11 22 -18 -4 -160 27 -125 -52 11 24 -18 -195 134 -200 -229 21 219
7473B19l88J50j19J60l2J13l27L5L59q5j51J26R8j20J9J1k03J4r9L57K5k54o4
$$ 219 -169 -19 -138 22 -10 103 -224 -189 170 85 -66 60 158 38 57 68 -135 -121 -220 137 162 -92 -156
7496a56L6L9K7q9J40jK2r6M7R5L5j4j26j37J39j69J94j19JJ49j32J2N6J38q7o4
$$ -156 -120 -81 -54 -143 -3 -4 18 -78 -31 64 99 85 -41 -178 -39 -208 -14 -133 -132 17 -115 -103 -47 91 4 -60
7522f0o1L6j9J41l1P0j8K5k35K91j66J00j03R7p2m6j93M23l25N0oJ87j77L1n9
$$ -60 -121 -85 -104 37 6 76 58 83 -152 139 -27 73 -30 67 -5 -51 -244 179 -146 -96 -102 85 -92 -61 -120
7547a20K52j87K64k1k93Q6LJ4j31K59m05J89K89l02KJ1Pm7P0j06o9J43j9M6J10
$$ -120 132 -55 209 188 -105 -19 -16 -2 -133 126 -279 -90 199 -103 -101 -90 -83 -130 -60 -166 -235 -92 -111 -65 45
7572D5L5o6k11M7J84Jr1K38n61N00o0k86K93J70Q3l88P0J05m3j9j53J2N7K6p6
$$ 45 80 14 -197 -150 34 35 -56 182 -379 121 61 -225 68 238 321 -67 3 108 65 46 -107 -95 -38 -12 -88
7597h8k6j6J69qj17%q8J33j54L30j5k35kN8J05J23l07L3k1J32J49m5O8k19K0K63
$$ -88 -114 -130 39 31 -86 -86 -174 -41 -195 135 120 -115 -117 -59 46 169 -138 -105 -126 6 155 110 178 -41 -21 242
7623B42k27j05J03J20k24K43k01K67Ll0k76j10OL7O23o79K06N7J91l37L47j58
$$ 242 15 -90 13 133 -91 152 -49 218 221 191 -85 -195 -189 -152 471 -208 -2 55 246 -91 256 98
7645I8k7J8j69k1K70p9j01j75J34L44l81K11n7r5L37l99k78N47k11K25k76N8J97
$$ 98 71 89 -80 -101 169 90 -11 -186 -52 292 -89 122 65 -30 307 -92 -370 177 -34 191 -85 -27 170
7668A70j28p4j60R1P9K53j62m7k19J56%j25J1L5n0K11k52J83k4L0j36l4K70k49
$$ 170 42 -32 -192 -101 -22 231 69 22 -197 -41 -41 -166 -155 -120 -170 41 -211 -28 -52 -22 -158 -192 78 -171
7692a71L26l20J03R3K35k03j29R0j2l6j79L11k76N7j7LR6j81L18j02Pk87M4M01
$$ -171 155 -165 -62 31 266 63 -66 24 12 -24 -203 108 -168 -111 -128 -125 -29 -210 108 6 13 -274 -230 171
7716A71k15J85j21R3k24J71j68J8O0L1J09L4k70R1R1Q0m36J66J20O0j5r2n2J3
$$ 171 -44 141 20 113 -111 60 -108 -90 -30 1 110 144 -126 -35 56 136 -300 -134 -14 46 31 -61 -113 -100
7740a00pj60L66K1l66M81j11j81K30j78P6j42P9J9l24L34N0Rq5j08M7pK12j50
$$ -100 -107 -267 99 120 -246 235 124 -57 173 -5 71 -71 8 27 -297 37 87 96 11 -97 -50 -57 155 5
7764Ej40J9K25K5j59J36r4j55J80M7m19K99K08k77Q2l8K04j63j71K05l14K87J04
$$ 5 -135 -116 109 134 -25 111 17 -138 42 89 -330 -31 177 -100 -18 -56 148 -15 -186 19 -295 -8 96
7787I6P8k67J50j39N0k26K81QJ3k99K76R2j26n1J02M9j24j83P6O1r3K50k9Kn2
$$ 96 174 -93 57 -82 -32 -258 23 31 44 -255 21 113 -13 -64 38 87 -37 -220 -144 -83 -176 74 45 47 -5
7812ej2J59P6j64Oo3J70K36k84m2n8l6J77j7k86K32p4o6m4K84o6k44J24J40o4
$$ -5 -17 142 218 54 60 -3 167 403 119 77 19 -17 160 143 -143 89 15 -51 -95 189 123 -121 3 143 79
7837G9N8j61%J05k69O4j9K01J45j22l7r8N9J96j78j85K70j48mM3j08J02L4l51
$$ 79 137 -24 -24 81 -188 -124 -143 58 203 81 44 -54 5 201 23 -162 108 -40 -44 -1 -109 -7 27 -324
7861c24K14J81k03O0J16K3k5k62J97J79j10Q0k8j75P7m4J38QP6m01J14J0R6o5
$$ -324 -110 71 -132 -72 44 67 42 -220 -23 156 46 126 98 -77 0 -44 94 102 178 -223 -109 -99 -3 -68
7885f8K46k71J53l8K3n8P2O2l50O2J00K40r7jj32j28J79m6J79k15J01L06n34L07
$$ -68 178 -93 60 22 45 -13 59 121 -229 -167 -67 173 76 75 -57 -185 -6 -52 127 -88 13 319 -215 92
7909I2j84k9Q4N0o4L5o4J03LN9k3j38M75m80R2j29R2K48k03j47K6p3K97j96L93
$$ 92 -92 -121 -37 13 -51 -16 -80 23 26 85 62 -76 399 -81 11 -118 -26 222 19 -128 -102 -175 122 -74 319
7934C19m67K9K79k9j45P7j49L41k29k02M4j00K00N9j81K59R1k01J24l20M23k59
$$ 319 -148 -119 160 131 -14 63 -86 255 26 -176 -132 -232 -32 27 -154 105 196 -5 119 -201 222 -37
7956c7o6P9o5J02K38m08J26pJ35k52K34j54J37K4p4r3K0J89o1q7M5k47L09k55
$$ -37 -103 -24 -89 13 251 -157 -31 -38 97 -155 79 -75 62 86 12 -81 -61 128 67 -20 25 -222 87 -168
7980a68J91j33J77R8j03l3L8j21M1j06Q7K1R5l45L20k20J08R6O5R0l8r1l4J61
$$ -168 23 -110 67 165 62 29 67 -54 -13 -119 -32 -11 84 -261 59 -161 -53 43 108 198 160 69 35 196
8004A96j3l41P6K34j72j30K56oM9k11L6K3n4R5j73n9L00r5q9Q7J65j60o2m8K61
$$ 196 183 -158 -82 152 -20 -150 106 100 149 -62 -26 -3 -57 38 -135 -194 106 11 -78 9 174 14 -48 -96 165
8029A65j58j14J33R8ok03J74j23K73l53K8K71j47K4j17P9J18k10N2J96l88L38
$$ 165 7 -107 26 124 118 -85 89 -34 239 -114 -86 185 38 62 -55 24 142 -68 -16 180 -208 130
8051A30l85M5J41M7R4p0K17k01l8J70k22j3j78K81Qj99J34j01Q8j1J61j52J78
$$ 130 -255 -210 -69 -22 72 2 219 18 -20 150 -72 -85 -263 18 26 -173 -39 -140 -52 -63 98 -54 124
8074A24N5j87L7j5K8P0q4m3J55k36J89k24J98m3p8J06P2j35J43j65O4j60L75l61
$$ 124 179 -8 29 14 42 112 28 -15 140 -96 93 -131 67 24 -54 52 124 -11 132 -33 31 -129 246 -115
8098a15P7J42J32k20j20rM2l7K19j60l9M9jJ03r6j88O6L34j50j86K66p9o3K41
$$ -115 -38 104 236 16 -104 -113 -71 -108 111 -49 -88 -39 -40 63 -33 -221 -155 179 29 -157 109 30 -33 208
8122B08j76j8J51k47K95l04L6P8m9J65pl86J94P7l8o9o0R6k20K12m5J58j13K14
$$ 208 32 14 165 -82 213 -91 -55 23 -26 139 132 -254 -60 17 -21 -90 -150 -54 -274 -62 -107 51 -62 152
8146A52j53O9J74k22J23j46m8J05J94k10q7P9J93k68q0J23J64l05K00j4k02r7
$$ 152 -1 68 242 20 143 -3 -51 54 248 38 -49 30 223 -45 -125 -2 162 -143 57 43 -159 -256
8168b56M12j29j8J36k28j5M5Q5n1j02K68j77k90M53k2m9j27Q3J12j72j4j05K36
$$ -256 156 27 9 145 -83 -98 -53 32 -19 -121 147 -30 -320 133 111 62 -65 18 130 -42 -56 -161 75
8191G5
$$ Imaginary data points
##PAGE= N=2
##DATA TABLE= (X++(I..I)), XYDATA
0@%%%%%%%%%%Qj6J6j6J6k4L2l2M0m8N6p2Q6r9J17j36J55j79K05k33K69l08L48
$$ 0 0 0 0 0 0 0 0 0 0 0 8 -8 8 -8 8 -16 16 -16 24 -24 32 -40 46 -53 64 -72 83 -96 109 -124 145 -163 185
33A85l93M43m99N59o24O96p77Q67r62J063j175J299j436J584j747J924k116K331
$$ 185 -208 235 -264 295 -329 367 -410 457 -505 558 -617 682 -754 830 -917 1007 -1109 1222
51A222k569K832l126L459l835M261m753N329o013O842p866R167j0886J3269j6791
$$ 1222 -1347 1485 -1641 1818 -2017 2244 -2509 2820 -3193 3649 -4217 4950 -5936 7333 -9458
66i458K2500l3236N9887k36986l35510P49072J00969n20072J14694K66499l00656
$$ -9458 13042 -20194 39693 -197293 -532803 216269 317238 -202834 -88140 178359 -122297
77a22297M6543L35130k91358k90524M31592J45902m01532L3258L01209j56145
$$ -122297 -75754 259376 -31982 -322506 109086 254988 -146544 -113286 187923 31778
87C1778j16244J59825j03073j03686K80405m431l61618Q6145K95556j66598j39080
$$ 31778 -84466 75359 -27714 -131400 149005 144574 -217044 -130899 164657 -1941 -141021
98a41021J95894m0558j49224K29905R7581k99697j4830K50363r5149j28149J80008
$$ -141021 54873 14315 -134909 94996 192577 -107120 -121950 128413 33264 -94885 85123
109H5123k2587k12879J48609J63769k41298p0072K70919l9926k30692J45788J60247
$$ 85123 62536 -150343 -1734 162035 -79263 -149335 121584 81658 -149034 -3246 157001
120A57001j95916p0045J70903m2605j13318J36863N6594j69748Q14J48053m3845
$$ 157001 -38915 -108960 61943 19338 -93980 42883 99477 -70271 -69457 78596 34751
131C4751r0659N8177J8665m7035L6799J0845n9432L3586L1976r3737J6796J50967
$$ 34751 -55908 2269 20934 -26101 10698 21543 -37889 -4303 27673 -66064 -49268 101699
143A01699m5541j49560P8533J10636r5874m2312Q8624m3771o6808J10613K2505
$$ 101699 56158 -93402 -14869 95767 -107 -42419 46205 2434 -64374 46239 68744
154F8744j52634K4061J44258p9874j07422J24785O1549j24043K87Q6424o4129
$$ 68744 -83890 -59829 84429 4555 -102867 21918 83467 -40576 -40289 46135 -17994
165a7994k6933J07695l9520j19094J01000J01586j31006n0627J29099j9330j01143
$$ -17994 -44927 62768 23248 -95846 5154 106740 -24266 -74893 54206 34876 -66267
176f6267Q1490N8365j11090o498R4362n4635n2490R5243n531j03233O7192Q3181
$$ -66267 15223 73588 -37502 -44000 50362 -4273 -56763 38480 32949 -70284 -3092 80089
188H0089j02991l2484J06811l5981q2211R2277L2357j17688L0762R9804r6529
$$ 80089 -22902 -55386 51425 15444 -66767 25510 57867 -59821 -29059 70745 -25784
199b5784n3546J40457o562j40868P1159J07545j11629m1457J18785l7641r4605
$$ -25784 -79330 61127 54565 -86303 -15144 92401 -19228 -60685 58100 20459 -74146
210g4146J01890M4059j28034K2582J10521q7793o2080J26411l799j26387O4881
$$ -74146 27744 71803 -56231 -33649 76872 -10921 -73001 53410 49611 -76776 -11895
221a1895Q5454j05091k0401J05756n4144p4780J11187K2158j25140M3245J01451
$$ -11895 73559 -31532 -51933 53823 -321 -75101 36086 58244 -66896 -23651 77800
232G7800r4801m5660J18028k1706j00452P9828M9795j11976J6745J04745q0724
$$ 77800 -17001 -62661 55367 33661 -66791 13037 62832 -49144 -32399 72346 -8378
243h378o4331J20080M788j19179N8640Q2552j06399k5210J18561l8436r5359Q6430
$$ -8378 -72709 47371 52159 -67020 -8380 74172 -32227 -57437 61124 22688 -72671 13759
255A3759M1942j07378K3599R3990q0718n3220J14359m83j10298N2397P4468q6416
$$ 13759 55701 -51677 -28078 65912 -14806 -68026 46333 45850 -64448 -12051 62417 -23999
267b3999j8715R1680m0020o4949Q5948J9668j02865L3041Q8872p5467m8502R3116
$$ -23999 -42714 48966 8946 -56003 29945 49613 -53252 -20211 68661 -6806 -55308 37808
279C7808n489q3219N4670M5256q8972M939R2392n4861o7606R0011K2354r7857
$$ 37808 32319 -50900 3770 49026 -39946 -35007 57385 2524 -65082 24929 47283 -50574
291e0574K9355P7644p1421l4608R1482j6045q2998O2711M9944q9309j458Q9315
$$ -50574 -21219 56425 -14996 -49604 41878 25833 -57165 5546 55490 -33819 -35277 54038
303E4038m4889o2494P8464J8749q7582K8187O9467o6000l2174Q1210j5045p1314
$$ 54038 9149 -53345 25119 43868 -43714 -15527 53940 -12060 -44234 36976 21931 -49383
315d9383N4891L9648p8290L627P6218m5240n1846P1797J2406p7124L0630N8209
$$ -49383 5508 45156 -33134 -29507 46711 1471 -50375 21422 33828 -43296 -12666 45543
327D5543o2887k1047P7035k1513o5700N9215L6117p8458N888P4336m5167m8596
$$ 45543 -17344 -38391 38644 17131 -48569 10646 46763 -31695 -25807 48529 3362 -45234
339d5234P0859Q292p5854L3761N6951o6237k1522P7311k0193o6436N5047L4559
$$ -45234 25625 33917 -41937 -8176 48775 -17462 -38984 38327 18134 -48302 6745 41304
351D1304p4057O340O9490m4899m4102O8635O642p0712L3071N1994o0895j6083
$$ 41304 -32753 -26413 43077 -1822 -45924 22711 29353 -41359 -8288 43706 -17189 -33272
363c3272P0341k2544n7545N4717K8308o9315Q954O2951m3852l7017O4520m17o5077
$$ -33272 37069 14525 -43020 11697 40005 -29310 -20356 42595 -1257 -38274 26246 25829 -39248
376c9248L6609M5584o2276j3407O7980k4056n4050N3317K3020o7083J4153O0068
$$ -39248 -2639 42945 -19331 -32738 35242 11186 -42864 10453 33473 -33610 -19457 40611
388D0611m6255l5105O4667Q87o2452L4478M1879n8078q083O5191k7521n1602N5149
$$ 40611 -5644 -40749 23918 24805 -37647 -3169 38710 -19368 -27451 37740 10219 -41383 13766
401A3766K2597o4512J2769N3588m4186k6063O1758j0651o0787M3229M0661o4010
$$ 13766 36363 -28149 -15380 38208 -5978 -32041 29717 19066 -41721 1508 42169 -21841
413b1841r763O4192k4109m4929M8784J1719n8111K5174M9328n3538k5638O6160
$$ -21841 -31604 32588 8479 -36450 12334 24053 -34058 -8884 40444 -13094 -38732 27428
425B7428m812n6970L4025L0609n0534N199N2766l9427l7231O1988J0756o6336
$$ 27428 22616 -34354 -329 30280 -20254 -15055 37711 -1716 -38947 23041 33797 -32539
437c2539J8547N1085m2058k2928N1407j1764m5543M1015K4972n8101J808N6654
$$ -32539 -13992 37093 -4965 -27893 23514 11750 -33793 7222 32194 -25907 -24099 32555
449C2555k7202l7795M3115P509m6020K5399L4259m9563j1397N9968j4786n1189
$$ 32555 5353 -32442 10673 18182 -27838 -2439 31820 -17743 -29140 30828 16042 -35147
461c5147L8632K8699n1979K112N1871l0584l6805M8962J1728n3149J5445M0241
$$ -35147 3485 32184 -19795 -17683 34188 3604 -33201 15761 27489 -25660 -10215 30026
473C0026l7044j6554M5375j2539l9303L6777J9543n0701P151M6676l1412k8282
$$ 30026 -7018 -23572 21803 9264 -30039 6738 26281 -24420 -17269 29407 -2005 -30287
485c0287M8252n00n1217L0668L9831n1168j6252N8027j0635m7152L5216K3157
$$ -30287 17965 17465 -33752 -3084 36747 -14421 -30673 27354 16719 -30433 4783 27940
497B7940m7979P355M4930l3878k7232M8799L23m7937K5453K9973m4060j654M7975
$$ 27940 -20039 -12684 32246 -1632 -28864 19935 20258 -27679 -2226 27747 -16313 -17967 30008
510C0008k9825l7703N2509J6262o1036Q483N2328l0141k8436M3156k670m1231
$$ 30008 183 -37520 14989 31251 -29785 -21302 31026 885 -27551 15605 12935 -28296
522b8296L0279K7381m5882m233M7517j8282l3486L3750R998l6428J7613K4436
$$ -28296 1983 29364 -16518 -20751 26766 8484 -25002 8748 18746 -17682 -69 24367
534B4367m1556k690N5561k2667n6003M0784M0805m9251j5022M4408j4893k9120
$$ 24367 -17189 -19879 35682 13015 -42988 -2204 38601 -10650 -25672 18736 3843 -25277
546b5277L8874P178n0979J5313M8276l3435l0855M2722P277l8566J6452K1655
$$ -25277 13597 20775 -30204 -14891 33385 -50 -30905 11817 19094 -19472 -3020 18635
558A8635l2669N950L9064l3725l3168N3410J7545n7817L475M4345k5377j8255
$$ 18635 -14034 -8084 30980 -2745 -35913 17497 35042 -22775 -19300 25045 -332 -18587
570a8587M0817j2147m5342L5220L4377m6992j1722M2892j5197k5873L6120Q30
$$ -18587 22230 10083 -35259 -39 34338 -12654 -24376 18516 3319 -22554 13566 14396
582A4396m3156K5451L3475m4635j0686N2978j4970m5215L6336K3802m6268O926
$$ 14396 -28760 -3309 30166 -14469 -25155 27823 12853 -32362 3974 27776 -18492 -11566
594a1566M3657l5090k9774N1957R572n2397J0828L5358k7187r474L3880j6690
$$ -11566 32091 -2999 -32773 19184 28756 -23641 -12813 22545 -4642 -14116 19764 3074
606C074k9723L3501J3222l7764Q533K9969k9632j3160M1369n649m0040K2751K5897
$$ 3074 -26649 6852 20074 -17690 -9157 20812 -8820 -21980 19389 13740 -26300 -3549 22348
619B2348l2349k888L3781j9049k5394L5643R806m1493R136L6179k4358k1322L0691
$$ 22348 -10001 -12889 20892 1843 -23551 12092 21898 -19595 -10459 25720 1362 -19960 10731
632A0731R25k6897J8960J2700l5578O275M1925k4042l7409L3830K1994l5390M40
$$ 10731 11656 -15241 3719 16419 -19159 -12884 29041 4999 -32410 1420 23414 -11976 -11536
645a1536K6876k1607j1480L6490o404l9814K3017L0839l1277j3076L2099p512
$$ -11536 15340 -6267 -17747 18743 12339 -27475 -4458 26381 -4896 -17972 14127 6615
657F615k2156K5340M889l4296J4878L1157k9618j8364L5153j524l0651K1380J5471
$$ 6615 -15541 9799 14688 -19608 -4730 26427 -3191 -21555 13598 12074 -18577 2803 18274
670A8274l5491L232L8736k1496l0423L2582J2500l4247Q966K5890k6828q645L5609
$$ 18274 -17217 -13985 24751 3255 -27168 5414 17914 -16333 -7367 18523 -8305 -16950 18659
683A8659j0164l3188K6620K1708l4160l340L1753j4677j9309K7890P48l1917J7223
$$ 18659 8495 -24693 1927 23635 -10525 -13865 17888 3211 -16098 11792 12540 -19377 -2154
696b154K6146k9863j2839L2816n153k7035J9740J3442k8401K968K7140j8026j6882
$$ -2154 23992 -5871 -18710 14106 8953 -18082 1658 15100 -13301 -10333 16807 -1219 -18101
709a8101K7448J300k8614J4786K2374k6132q569K9790p034k4243K0831J2380k8274
$$ -18101 9347 10647 -17967 -3181 19193 -6939 -15508 14282 7248 -16995 3836 16216 -12058
722a2058L815K7525j8607j8125K8418K846l0438J2964K2807k4413r295K8059p936
$$ -12058 -8243 19282 675 -17450 10968 13814 -16624 -3660 19147 -5266 -14561 13498 5562
735E562k3869K1726J1982k9278L659K7158j8216j7011K8121J232k9330J5281K2312
$$ 5562 -18307 3419 15401 -13877 -10218 16940 -1276 -18287 9834 11066 -18264 -2983 19329
748A9329k6133p096K8370q848k2211K3014R041k9599P445K7596k1700j7144K8856
$$ 19329 -6804 -13900 14470 5622 -16589 6425 15466 -14133 -6688 20908 -792 -17936 10920
761A0920J616k7894J3791J7482k4837k180K6971j3996k1688K5230R629k9483N777
$$ 10920 12536 -15358 -1567 15915 -8922 -11102 15869 1873 -19815 5415 15044 -14439 -8662
774h662K4313j8466j2518K5855l292k3870J7717J5874k6868j132K7470j2386k0029
$$ -8662 15651 -2815 -15333 10522 7230 -16640 1077 16951 -9917 -11049 16421 4035 -15994
787a5994K3139O266k6076Q693K1328k0891j0607K6116l813k4015J6942J3621k5012
$$ -15994 7145 13411 -12665 -3972 17356 -3535 -14142 11974 8161 -15854 1088 14709 -10303
800a0303k9K5132j4193j7767K3362N050k5527R508K0149k0660q203K5305n368
$$ -10303 -10332 14800 607 -17160 6202 11252 -14275 -4767 15382 -5278 -13481 11824 6456
813F456k2114J8513J2156k4658J454K4124j4134j6293K2430L347k3584J0082J7880
$$ 6456 -15658 2855 15011 -9647 -8193 15931 1797 -14496 7934 11281 -12303 -2221 15659
826A5659k0953o720K4490p088k1035J7860J1093k4168J801K2694j4068j4174K1442
$$ 15659 -5294 -12014 12476 5388 -15647 2213 13306 -10862 -9061 13633 -435 -14609 6833
839F833J537k2455J1685J6855k0880n738K4231o401j9500J6888R744k1940L419
$$ 6833 8370 -14085 -2400 14455 -6425 -12163 12068 5667 -13833 3055 12799 -9141 -5722
852e722K0442j4756j2825K2237K88k2502J1250J6284k0467n099K2119p932j7719
$$ -5722 14720 -36 -12861 9376 9664 -12838 -1588 14696 -5771 -10870 11249 3317 -14402
865a4402J8012P732k3023M251K0736j5153j1768K1264n63k0138J2434J4178k0226
$$ -14402 3610 11342 -11681 -7430 13306 -1847 -13615 7649 7086 -13052 -618 13560 -6666
878f666l368K2790q401j7965J7841P943k0897M116J8410j5217j0114K1350j607
$$ -6666 -10034 12756 4355 -13610 4231 12174 -8723 -4607 13803 -1414 -11528 9822 8215
891H215k1233J1985J4090j8511m146J9786q112j4959J7161N069k1496O515J8734
$$ 8215 -13018 -1033 13057 -5454 -9600 10186 2074 -12885 4276 9345 -12151 -5636 13098
904A3098j5790j0407K0567k59j9079J1889J1954j9019r29K0786j0241j5646J8306
$$ 13098 -2692 -13099 7468 7209 -11870 19 11973 -7046 -7975 12811 2570 -13076 5230
917E230O236k0578N324J6621j5520p272K0223m823j8980J5102J1075k1167k95
$$ 5230 11466 -9112 -3788 12833 -2687 -9959 10264 5441 -13539 1563 12638 -8529 -8824
930h824K0557j1279j3819J8874L187k1282Q560J7141j7033q078K1026l244j7656
$$ -8824 11733 454 -13365 5509 8696 -12586 -4026 13115 -3918 -11996 9030 5786 -11870
943a1870J3570R257j8327J526J7992j2019j0651J8042M72j8522R749J2955j7063
$$ -11870 1700 10957 -7370 -5844 12148 129 -10522 7520 7992 -10530 -781 12174 -4889
956d889l878J9197p177j5699J5258P607j9212K294J6529j0903r649J6421j28j6537
$$ -4889 -8767 10430 3253 -12446 2812 10419 -8793 -6499 10030 -873 -10522 5899 5771 -10766
970a0766Q903J2189j4443l556J5518n699j1365J4127L875j7408M901J5964j2209
$$ -10766 -1863 10326 -4117 -7673 7845 2146 -9219 4908 8783 -8625 -3724 12240 31
983C1j0004J6649N87j6441Q052J1525j4348m004J6281n276j3984J2013P934j5666
$$ 31 -9973 6676 7263 -9178 -1126 10399 -3949 -7953 8328 3052 -10932 1081 9015 -6651
997f651m9J4007p962o988J3230j849j4587J1016J1108j6454l678J7714n046j3021
$$ -6651 -6700 7307 -655 -7643 5587 3738 -10849 167 11275 -5179 -8857 8857 3811 -9210
1011i210J2962N542j7476M188J6372j2558j0553J7182J166j6537P549J0468j3343
$$ -9210 3752 9294 -8182 -3994 12378 -180 -10733 6449 7615 -8922 -1373 9095 -4248
1024d248k370J4519p475j0921J4961K796j7370N722J4861j2971o673J6031k971
$$ -4248 -6618 7901 426 -10495 4466 7262 -10108 -4386 10475 -2496 -9169 6862 3891
1037C891j4328J1817R323j6965q54J6668o510j1146J2200K936j3739N073J1051
$$ 3891 -10437 1380 10703 -6262 -7116 9552 3042 -8104 4096 7032 -6707 -1634 9417
1050I417j1703m591J3333l206j1452J0227N845j4602J250J3563p813r315J2616
$$ 9417 -2286 -6877 6456 3250 -8202 2025 7870 -6732 -5482 8081 268 -9047 3569
1063C569J995j4554N924J2783j1781p021J4515m79j2734Q192Q070j3393l24J3405
$$ 3569 5564 -8990 -3066 9717 -2064 -9085 5430 4951 -7783 409 8479 -4914 -5238 8167
1077H167n950r517J1420K140j3428N460J1742j2668n642J5008k716j3045J0576
$$ 8167 2217 -7300 4120 6260 -7168 -1708 10034 -2634 -8276 6732 4016 -9029 1547
1090A547O950j5990P65J6280q995j1097J4109K464j4776P140J1031j3720l694
$$ 1547 8497 -7493 -6728 9552 557 -10540 3569 6033 -8743 -1603 9428 -4292 -7986
1103g986J5786m801j1926J2290M596j5887M574J4398j1362q278J4618o25j3799
$$ -7986 7800 2999 -8927 3363 7959 -7928 -3354 11044 -318 -8596 6022 5397 -8402
1116h402R283Q865j5383j420J5705o298j1782J1757L669j3285M392J0536j0251
$$ -8402 881 9746 -5637 -7057 8648 2350 -9432 2325 5994 -7291 -2899 7637 -2614
1129b614m899J2812k331j1260R370O288j2308J44J2089o211p319J0271J325j1805
$$ -2614 -7513 5299 2968 -8292 1078 7366 -4942 -4798 7291 1080 -6239 4032 5357 -6448
1143f448N083J0364j0023n697J1577r52r340O249N229j1106L97J1195n394q796
$$ -6448 -1365 8999 -1024 -6721 4856 3904 -5436 813 6042 -5064 -4667 6528 1134 -7662
1157g662R367L080j0540L262Q534q272m286J1605j677j0670P494O899j0911j036
$$ -7662 1705 4785 -5755 -2493 6041 -2231 -6517 5088 3411 -7259 235 7134 -3777 -4813
1171d813J1692m921q449R773K775j1755M086J0226j0118n707J2609j008j1398
$$ -4813 6879 1958 -6491 3282 6057 -5698 -1612 8614 -1504 -7211 5398 4390 -7008
1184g008P356O012j1331L86J1848o837q806J0898K346j1349M495Q745r885l179
$$ -7008 348 6360 -4971 -4585 7263 426 -8380 2518 4864 -6485 -1990 6755 -3130 -6309
1198f309J2293l142r980Q451N170j1115K027R948p170o423J1144R8j1013O035
$$ -6309 5984 2842 -7138 1313 6483 -4632 -2605 7343 173 -6250 4894 4992 -6021 14
1212A4O834j0033j583J0538m082q281Q160L689j1096K877R138p284n485R751L17
$$ 14 6848 -3185 -4768 5770 1688 -6593 1567 5256 -5840 -2963 6175 -1109 -6594 3157 3474
1227C474r820N698O601r007j877J0375l079q278P355L814r302J845Q533o411n320
$$ 3474 -6346 -648 5953 -3054 -4931 5444 2365 -5913 1442 5256 -4046 -2201 6332 -79 -5399
1242e399R244O00r483M515O370q216j829R028l662p362P944L047r994K078Q840
$$ -5399 3845 4445 -5038 -523 5847 -2369 -4198 4830 1168 -6194 1750 4797 -5197 -3119 5721
1257E721o852m769R243m52r311N976O811r789j446J0978m316p923Q783K937j0073
$$ 5721 -1131 -5900 3343 2891 -6420 -444 6367 -3422 -4868 6110 1794 -6129 2654 5591 -4482
1272d482K685Q569p535m363R795r65r558O093N771r577n87R223m626p021Q756
$$ -4482 -1797 6772 -763 -5126 4669 3704 -5854 239 6010 -3567 -4154 5069 443 -6578 2178
1287B178K111j0103L239Q212p627l293R426j922q040O655M635r291N55R225n237
$$ 2178 4289 -5814 -2575 5637 -1990 -5283 4143 2221 -5819 836 5471 -3820 -3265 5960 723
1302G23n883Q345J394r236L616P343p746k987R333k635p995O520M415r115M48
$$ 723 -5160 3185 4579 -4657 -1041 6302 -1444 -4431 4902 2267 -5728 792 5207 -3908 -3460
1317c460Q325n232n325Q162N34q414M275O216p414k081Q665k500p234O917L776
$$ -3460 4865 -367 -5692 2470 3004 -5410 -1135 5081 -2333 -4414 4251 1751 -5483 1434 5210
1332E210q745J257Q021n646m571Q317J7q648M140O250p651j710Q287l302o481
$$ 5210 -3535 -2278 5743 97 -4474 3843 3860 -4788 -648 5602 -2049 -3759 4528 1226 -5255
1347e255O470L010q338J416P358n572m048P902m41p477M618M840o941j293Q261
$$ -5255 1215 4225 -4113 -2697 4661 -911 -4959 2943 2502 -4975 -357 4483 -2458 -3751 4510
1362D510l222o015O497K770p972K096O672n878l682Q193q13p463M484M700p382
$$ 4510 1288 -4727 1770 4540 -3432 -1336 5336 -542 -4224 3969 3156 -4307 177 4877 -2505
1377b505q55P668l588n881O747K063q400K707O575n701l574P748p36o906M690
$$ -2505 -3360 4308 720 -5161 1586 3649 -4751 -2044 4531 -1170 -4744 3004 2268 -4638 52
1392E2M322o902l83P553l516n409O532J637p286K431N748n761k638P327j435o276
$$ 52 4374 -2528 -2911 4642 1126 -4283 2249 3886 -3400 -969 4779 -982 -3620 3707 2272 -4004
1408d004M419L936o943j72O672l917m645O176J135o923K903N415n872k088O819
$$ -4004 415 4351 -2592 -2764 3908 -9 -4654 1522 2657 -4266 -1363 4052 -1820 -3908 2911
1423B911j360n744M913L353o866N78O856l996m668O643R65o955K667N726n982
$$ 2911 1551 -4193 720 4073 -2793 -2215 4641 645 -4023 2620 3585 -3370 -703 5023 -959
1438i59k552O951j454o121M758K938o767Q18O308m521l887O712K02o618L053N098
$$ -959 -3511 3440 1986 -4135 623 3561 -3206 -2388 3920 -601 -4488 2224 2426 -4192 -1139 3959
1454C959o258j156P034k373n537N683K364o742J335O354m533l696O545j2o389
$$ 3959 -2299 -3455 3579 1206 -4331 1352 3716 -3026 -1691 4663 130 -3566 2979 2967 -3422
1469c422L658M002o204p97O787l211n286N664J702o084J539N125m872k785O455
$$ -3422 236 4238 -1966 -2763 4024 813 -4473 1191 2893 -3191 -1652 3473 -1399 -4184 2271
1484B271l52n782L263M093n461p59N979k230m244M381J824n222J495M500m143
$$ 2271 1919 -3863 -600 3493 -1968 -2727 3252 1022 -3222 1159 2983 -2239 -744 3756 -387
1499c87k402N425n39m930L089K734m975j17N472k886m741M976J817n643J298M929
$$ -387 -2789 2636 2097 -2833 256 2990 -1985 -2102 3370 484 -4257 719 2536 -3107 -1809 3120
1515C120l872l115N870O8n664K958M027n097o57N883k770m352N085K085o168J747
$$ 3120 -752 -3867 2003 2071 -3593 -635 3392 -1705 -2362 3521 751 -3601 1484 3569 -2599 -852
1531h52N053n235k325O672j091o091L877L537n763j07N937l740m185N934Q09n804
$$ -852 4201 -1034 -3359 3313 2222 -3869 8 3545 -2218 -2325 3612 -128 -4313 1621 2430 -3374
1547c374K362L947m885j125O321k328m812M704K149n652J655N204m666k856O114
$$ -3374 -1012 2935 -1950 -3075 3246 918 -3894 810 2959 -2693 -1038 4166 -500 -3356 2758
1562B758j90n548L080L275m739r11N567k247m350M104J461m283Q89L641l466k159
$$ 2758 2568 -2980 100 3375 -1364 -2275 3292 1045 -3305 799 2260 -2023 -1134 2507 -959 -3118
1578c118M589n6m164K088K783l891j56M578j590m110L619K134m128K45M013k727
$$ -3118 1471 1415 -2749 -661 2122 -1769 -1925 2653 1063 -3047 572 2706 -1422 -1177 2836 109
1594A09k442M323N88m856J501L365l494j161M598j444m394L761K470n172L18M626
$$ 109 -2333 1990 2578 -2278 -777 2588 -906 -2067 2531 1087 -3307 454 2924 -2248 -1930 2696
1610B696l408k852N318K22n624K683M451m929p45N313k404m337M722K315n859
$$ 2696 -712 -3564 1754 1976 -3648 -965 3486 -1443 -2188 3125 721 -3616 1106 3421 -2438
1625b438J201M730l946k081N546j063n174L513L037n055l9M852l484l005M712
$$ -2438 -1237 3493 -453 -2534 3012 1949 -3225 288 3325 -1730 -1769 3083 -401 -3406 1306
1640A306O88n166J832L867m170r67M966j783m014L515K747m770O86M249l289k129
$$ 1306 1994 -3172 -1340 2527 -1643 -2610 2356 573 -3441 74 2821 -1949 -1263 2986 -303 -2432
1656b432M642q2m160J753K858l188q07L933j740l391L164J867l807J08L017k000
$$ -2432 2210 2128 -2032 -279 2579 -609 -1416 2517 777 -2614 550 2417 -1390 -1282 1735 -265
1672b65k375L537Q42m194J084L076k483j230L402n86l624K932K474l783k99L653
$$ -265 -2640 897 1739 -2455 -1371 1705 -778 -2008 1394 808 -2816 116 2590 -1193 -1492 2161
1688B161j830k135L644O93m652J896L200l457j515M017j023l872L276K074m277
$$ 2161 331 -1804 1840 2533 -2119 -223 2977 -480 -1995 2022 999 -2873 403 2477 -1800
1703a800k0M105k351k757M107J50m033J636L445l702q91M232j453l251L612J556
$$ -1800 -1820 2285 -66 -2823 1284 1434 -2599 -963 2482 -1220 -2111 2121 668 -2583 1029 2585
1719B585m238P26L650k915j797L933l61l955K498K550l780o24L820k013k330L398
$$ 2585 -1653 -927 2723 -192 -1989 1944 1583 -2372 126 2676 -1104 -1728 2092 79 -2251 1147
1735A147M93l789J170L085k976j408L620l85l368K459K034l147o32L627j451k111
$$ 1147 1640 -2149 -979 2106 -870 -2278 1342 957 -2411 48 2082 -1065 -1697 1930 479 -1632
1751a632K844O79l555J010L191k753j302L227m43l211J901K332l160o56L166j269
$$ -1632 1212 1891 -1664 -654 2537 -216 -1518 1709 1266 -1945 -44 2288 -872 -1528 1638 369
1767C69k592K970O74l372Q89L089k627j697L451m39l068K322K317l550l02L636
$$ 369 -2223 747 1421 -1951 -1062 2027 -600 -2297 1154 715 -2353 -31 2286 -1264 -1566 2070
1783B070j464k578L133N84l394J209K816k665j544L744q95l049K457J712l428
$$ 2070 606 -1972 1161 1745 -1649 -440 2376 -289 -1833 1911 1016 -2033 424 2136 -1292
1798a292l28L374j804k288L114N72l621J562K710k785j254L679r69k858K856J155
$$ -1292 -1620 1754 -50 -2338 776 1348 -2273 -711 1999 -786 -2040 1639 670 -2188 668 1823
1814A823l183L77L089j956k024K914M14l016J536K446l070r75L567j184k784K295
$$ 1823 -1360 -983 2106 150 -1874 1040 1454 -1562 -26 2420 -650 -1625 1942 758 -2026 269
1830B69J510l316L81K930k018j900K835L73l176J615K294k683q60L162j057k234
$$ 269 1779 -1537 -1156 1774 -244 -2144 691 1064 -2112 -497 1797 -886 -1746 1416 359 -1875
1846a875K473J352l190P76K546k043j550L079p9l370K083J852k745n86K905j169
$$ -1875 598 1950 -1240 -464 2082 39 -1511 1568 1489 -1881 202 2054 -691 -1277 1628 459
1862D59k422K372J118k924L67K657k022j576L134n78k482J692J929k505k97K760
$$ 459 -1963 409 1527 -1397 -1030 1627 -395 -1971 1163 585 -1897 -205 1724 -781 -1078 1682
1878A682j300k258K821O88k740O85K353j857j430K656n05k336J903J570k987K8
$$ 1682 382 -1876 945 1633 -1107 -422 1931 74 -1356 1300 795 -1541 362 1932 -1055 -1027
1894a027K600j595j867K360N18k520N77K521k220p90K485m22k190J601J450k280
$$ -1027 1573 -22 -1889 471 989 -1531 -954 1567 -653 -1443 1042 620 -1570 31 1481 -799
1910g99k82K747j370j801K428M44k504P70K213k175q54K575l28k502J863R99k312
$$ -799 -1081 1666 296 -1505 923 1367 -1137 -367 1846 -329 -1183 1392 1064 -1438 425 1424 -888
1927h88m22K617j440j694K459M10k673P79K213j884r86K530n86k046J780J169
$$ -888 -1310 1307 -133 -1827 632 1042 -1631 -852 1361 -523 -1509 1021 435 -1611 169 1338
1943A338j892p3K141j562j131K107L54k213Q34J532j895m45J853l46k205J512
$$ 1338 -554 -627 1514 -48 -1179 928 1282 -931 -97 1435 -460 -905 948 602 -1603 -91
1959i1J516k662J95K268j308j613K387J36k635J283J801j973n01K452o84k169
$$ -91 1425 -1237 -1042 1226 -82 -1695 692 828 -1807 -524 1277 -696 -1197 1255 571 -1598
1975a598K069R12k492O07K452k155r18K210k68k332J486J768k244p14K343p72
$$ -1598 471 1383 -1109 -502 1950 -205 -1123 1087 819 -1513 -27 1741 -503 -1217 1126 354
1991C54j745J814O20k389N50J983j619j085K135k16k081J686J258k045j7J916
$$ 354 -1391 423 1043 -1346 -796 1187 -432 -1517 618 402 -1679 7 1265 -780 -797 1119
2007A119j062j103J831J96j674M64J688j356j088J985j24j981J292J106j948M1
$$ 1119 57 -1046 785 981 -693 -229 1459 103 -985 1000 876 -1105 187 1293 -655 -614
2023f14J242n08j345J462N19j734K91J792j176j285J903k8j751J026J497k281
$$ -614 628 120 -1225 237 756 -978 -687 1105 -71 -1356 547 519 -1232 -206 1291 -990
2039i90J08K259q11j615J665O70k352P50J676j081j608K223j24k185J493J112
$$ -990 -882 1377 566 -1049 616 1286 -1066 -316 1360 279 -1329 894 770 -1415 78 1190
2055A190k109j35K262j138j528J966L00k181J199J723k085r09K404n19j776J921
$$ 1190 -919 -1054 1208 70 -1458 508 808 -1373 -174 1549 -536 -1445 959 440 -1336 585
2071E85N84k195M69K090j401r17J875m68j676J235J105j724N2J269o49j082J483
$$ 585 1169 -1026 -557 1533 132 -785 1090 622 -1054 181 1286 -438 -386 883 234 -848 635
2088F35J87k133O22J542j131p21J249k34j288J294R85j379m77J481l28j071J037
$$ 635 822 -1311 -689 853 -278 -999 250 16 -1272 22 1007 -372 -849 632 304 -767 270
2105B70M91j148q6J612q27r57J148o0j024O48J042j288q70J748k63j325P87Q40
$$ 270 761 -387 -473 1139 312 -645 503 443 -581 67 1109 -179 -1049 699 436 -889 -102 738
2123G38j632J22J866r63j162J243M22j598O35J490j854o68K215k83j566J317Q48
$$ 738 -894 -772 1094 131 -1031 212 634 -964 -329 1161 -693 -1361 854 571 -995 322 1170
2140A170j817N94J614j609j059K201m56j589J171R99j950j65K112r43j383J437
$$ 1170 -647 -53 1561 -48 -1107 1094 638 -951 220 1219 -731 -896 1216 273 -1110 327
2156C27M11k090Q82J506j629k08J904j013j111J414L45j601M86J539q96j044J129
$$ 327 738 -1352 -470 1036 -593 -801 1103 90 -1021 393 738 -863 -377 1162 266 -778 351
2173C51L87j449R33Q33j207l34J143l04q86P71J37r11K21J021p61q53Q82K39r84
$$ 351 738 -711 222 1055 -152 -486 657 353 -533 238 375 -536 -315 706 -55 -908 -26 213 -771
2192g71M86P16o18p14J407j60j009Q12O19j289L66J074o10j033J178K60j244O33
$$ -771 -285 431 -187 -901 506 346 -663 149 768 -521 -155 919 309 -724 454 714 -530 103
2210A03N73p41p87J517Lj399O75R17j430K08J005p06j395J751K58j453L86J349
$$ 103 676 -65 -852 665 668 -731 -56 861 -569 -361 644 -62 -1457 294 552 -901 -515 834
2228H34j261l12J399k74j382J167O00j417N68J112j063o60J502j51j347J009L77
$$ 834 -427 -739 660 386 -996 171 771 -646 -78 1034 -29 -689 813 662 -685 324 701
2245G01j015l94J608q56p67J137J81j438O01Q59j126l52J152k9j134Q12P90j299
$$ 701 -314 -708 900 44 -723 414 595 -843 -242 617 -509 -861 291 262 -872 -60 730 -569
2263e69J85R86n48n19O41M24j172N31N76m44n20J023o7j042N25M05p82n6J019
$$ -569 -384 602 54 -465 176 600 -572 -41 535 91 -429 594 527 -515 10 415 -367 -423 596
2282E96n71p34P23K89j157M12N89l62m37R20j18n86L18P51j157r7J231m90q11
$$ 596 25 -709 14 303 -854 -442 147 -215 -652 268 150 -436 -118 633 -524 -621 610 120 -691
2301f91Q27N65j225M93P54p96j63O69J29j239N15N19p63j68J031n27p90J119J92
$$ -691 136 701 -524 -31 723 -73 -236 433 562 -677 -162 357 -406 -574 457 -70 -860 259 451
$$ [...]
8191d7
##END NTUPLES=NMR FID
##END=
