##TITLE=1H_Ser 5-8-V-H
 CDCl3
 8 sc, 
 5.04.2022
##JCAMPDX= 6.0         $$ Bruker NMR JCAMP-DX V2.0
##DATA TYPE= NMR FID
##DATA CLASS= NTUPLES
##ORIGIN= UXNMR, Bruker Analytische Messtechnik GmbH
##OWNER= root
$$ XWIN-NMR		Version 3.5
$$ Tue Apr  5 15:44:14 2022 Russian Standard Time (UT+4h)  she@DPX200
##.OBSERVE FREQUENCY= 200.131346
##.OBSERVE NUCLEUS= ^1H
##.DELAY= (6, 6)
##.ACQUISITION MODE= SIMULTANEOUS
##.ACQUISITION SCHEME= undefined
##.AVERAGES= 8
##.DIGITISER RES= 18
##SPECTROMETER/DATA SYSTEM= spect
##.PULSE SEQUENCE= zg30
##.SOLVENT NAME= CDCl3
##.SHIFT REFERENCE= (INTERNAL, CDCl3, 0, 15.7039)
##AUDIT TRAIL= $$ (NUMBER, WHEN, WHO, WHERE, WHAT)
$$ ##TITLE= Audit trail, XWIN-NMR		Version 3.5
$$ ##JCAMPDX= 5.01
$$ ##ORIGIN= Bruker BioSpin GmbH
$$ ##OWNER= she
$$ F:/spectra/data/she/nmr/H-F/1/audita.txt
$$ ##AUDIT TRAIL=  $$ (NUMBER, WHEN, WHO, WHERE, WHAT)
(   1,<2022-04-05 15:43:05.31 +0400>,<she>,<DPX200>,
      <created by zg, POWCHK disabled, PULCHK disabled
       configuration hash MD5:
       00 E9 B6 7A A2 85 ED C7 34 08 36 98 17 FE 4E 26
       data hash MD5: 16K
       0B 68 2A 2F 00 52 A6 09 2D 09 42 C0 6C CA 8E 60>)
$$ ##END=
$$ 
$$ hash MD5
$$ BF 5D 4A E4 8A 1E BB 7D E3 D0 71 F8 E5 77 68 34
##$RELAX= 
##$RELAX= 
##$RELAX= 
##$RELAX= 
##$RELAX= 
##$RELAX= 
$$ Bruker specific parameters
$$ --------------------------
##$DU= <F:/spectra>
##$EXPNO= 1
##$NAME= <H-F>
##$PROCNO= 1
##$TYPE= <nmr>
##$USER= <she>
##$AMP= (0..31)
100 100 100 100 100 100 100 100 100 100 100 100 100 100 100 100 100 100 
100 100 100 100 100 100 100 100 100 100 100 100 100 100 
##$AQSEQ= 0
##$AQ_mod= 1
##$AUNM= <au_zg>
##$AUTOPOS= <>
##$BF1= 200.13
##$BF2= 200.13
##$BF3= 200.13
##$BF4= 200.13
##$BF5= 200.13
##$BF6= 200.13
##$BF7= 200.13
##$BF8= 200.13
##$BYTORDA= 1
##$CFDGTYP= 0
##$CFRGTYP= 5
##$CHEMSTR= <none>
##$CNST= (0..31)
1 1 145 1 1 1 1 1 1 1 1 1 1 1 1 1 1 1 1 1 1 1 1 1 1 1 1 1 1 1 1 1 
##$CPDPRG= <>
##$CPDPRG1= <>
##$CPDPRG2= <>
##$CPDPRG3= <>
##$CPDPRG4= <mlev>
##$CPDPRG5= <mlev>
##$CPDPRG6= <mlev>
##$CPDPRG7= <mlev>
##$CPDPRG8= <mlev>
##$CPDPRGB= <>
##$CPDPRGT= <>
##$D= (0..31)
0 1.2 0 0 0 0 0 0 0 0.06 0 0.03 0 0 0 0 0.0002 0 0 0 0 0 0 0 0 0 0 0 0 
0 0 0 
##$DATE= 1649158984
##$DBL= (0..7)
120 120 120 120 120 120 120 120 
##$DBP= (0..7)
150 150 150 150 150 150 150 150 
##$DBP07= 0
##$DBPNAM0= <>
##$DBPNAM1= <>
##$DBPNAM2= <>
##$DBPNAM3= <>
##$DBPNAM4= <>
##$DBPNAM5= <>
##$DBPNAM6= <>
##$DBPNAM7= <>
##$DBPOAL= (0..7)
0.5 0.5 0.5 0.5 0.5 0.5 0.5 0.5 
##$DBPOFFS= (0..7)
0 0 0 0 0 0 0 0 
##$DE= 6
##$DECBNUC= <off>
##$DECIM= 32
##$DECNUC= <off>
##$DECSTAT= 4
##$DIGMOD= 1
##$DIGTYP= 9
##$DL= (0..7)
0 120 120 120 120 120 120 120 
##$DP= (0..7)
150 150 150 150 150 150 150 150 
##$DP07= 0
##$DPNAME0= <>
##$DPNAME1= <>
##$DPNAME2= <>
##$DPNAME3= <>
##$DPNAME4= <>
##$DPNAME5= <>
##$DPNAME6= <>
##$DPNAME7= <>
##$DPOAL= (0..7)
0.5 0.5 0.5 0.5 0.5 0.5 0.5 0.5 
##$DPOFFS= (0..7)
0 0 0 0 0 0 0 0 
##$DQDMODE= 0
##$DR= 18
##$DS= 0
##$DSLIST= <SSSSSSSSSSSSSSS>
$$ [...]
##$SUBNAM2= <"">
##$SUBNAM3= <"">
##$SUBNAM4= <"">
##$SUBNAM5= <"">
##$SUBNAM6= <"">
##$SUBNAM7= <"">
##$SUBNAM8= <"">
##$SUBNAM9= <"">
##$SW= 18.0517287032376
##$SWIBOX= (0..15)
0 0 2 0 0 0 0 0 0 0 0 0 0 0 0 0 
##$SW_h= 3612.71676300578
##$TD= 16384
##$TD0= 1
##$TE= 0
##$TE2= 300
##$TE3= 300
##$TEG= 300
##$TL= (0..7)
0 120 120 120 120 120 120 120 
##$TP= (0..7)
150 150 150 150 150 150 150 150 
##$TP07= 0
##$TPNAME0= <>
##$TPNAME1= <>
##$TPNAME2= <>
##$TPNAME3= <>
##$TPNAME4= <>
##$TPNAME5= <>
##$TPNAME6= <>
##$TPNAME7= <>
##$TPOAL= (0..7)
0.5 0.5 0.5 0.5 0.5 0.5 0.5 0.5 
##$TPOFFS= (0..7)
0 0 0 0 0 0 0 0 
##$TUNHIN= 0
##$TUNHOUT= 0
##$TUNXOUT= 0
##$USERA1= <user>
##$USERA2= <user>
##$USERA3= <user>
##$USERA4= <user>
##$USERA5= <user>
##$V9= 5
##$VALIST= <valist>
##$VCLIST= <CCCCCCCCCCCCCCC>
##$VD= 0
##$VDLIST= <DDDDDDDDDDDDDDD>
##$VPLIST= <PPPPPPPPPPPPPPP>
##$VTLIST= <TTTTTTTTTTTTTTT>
##$WBST= 1024
##$WBSW= 4
##$XGAIN= (0..3)
0 0 0 0 
##$XL= 0
##$YL= 0
##$YMAX_a= 233339
##$YMIN_a= -463272
##$ZGOPTNS= <>
##$ZL1= 120
##$ZL2= 120
##$ZL3= 120
##$ZL4= 120
##$ABSF1= 10
##$ABSF2= 0
##$ABSG= 5
##$ABSL= 3
##$ALPHA= 0
##$AQORDER= 0
##$ASSFAC= 0
##$ASSFACI= 0
##$ASSFACX= 0
##$ASSWID= 0
##$AUNMP= <proc_1d>
##$AZFE= 0.1
##$AZFW= 0.1
##$BCFW= 1
##$BC_mod= 2
##$BYTORDP= 1
##$COROFFS= 0
##$CY= 11.3945322036743
##$DATMOD= 1
##$DC= 2
##$DFILT= <>
##$DTYPP= 0
##$F1P= 2.36226072786647
##$F2P= -0.459571619588291
##$FCOR= 0.5
##$FTSIZE= 0
##$FT_mod= 4
##$GAMMA= 1
##$GB= 0.15
##$INTBC= 1
##$INTSCL= 1
##$ISEN= 128
##$LB= 0.24
##$LEV0= 0
##$LPBIN= 0
##$MAXI= 10000
##$MC2= 0
##$MEAN= 0
##$ME_mod= 0
##$MI= 1.114404
##$NCOEF= 0
##$NC_proc= 0
##$NLEV= 6
##$NOISF1= 3.799351
##$NOISF2= 2.8
##$NSP= 1
##$NTH_PI= 0
##$NZP= 0
##$OFFSET= 15.70392
##$PC= 1
##$PHC0= -17676.8
##$PHC1= 21.00078
##$PH_mod= 1
##$PKNL= yes
##$PPARMOD= 0
##$PSCAL= 0
##$PSIGN= 0
##$REVERSE= no
##$SF= 200.130013532006
##$SI= 16384
##$SIGF1= 3
##$SIGF2= 2
##$SINO= 400
##$SIOLD= 16384
##$SREGLST= <1H.CDCl3>
##$SSB= 0
##$STSI= 0
##$STSR= 0
##$SW_p= 3612.71676300578
##$SYMM= 0
##$S_DEV= 0
##$TDeff= 0
##$TDoff= 0
##$TI= <>
##$TILT= no
##$TM1= 0
##$TM2= 0
##$TOPLEV= 0
##$USERP1= <user>
##$USERP2= <user>
##$USERP3= <user>
##$USERP4= <user>
##$USERP5= <user>
##$WDW= 1
##$XDIM= 8192
##$YMAX_p= 0
##$YMIN_p= 0
$$ End of Bruker specific parameters
$$ ---------------------------------
##NTUPLES= NMR FID
##VAR_NAME=  TIME,          FID/REAL,        FID/IMAG
##SYMBOL=    X,             R,               I
##VAR_TYPE=  INDEPENDENT,   DEPENDENT,       DEPENDENT
##VAR_FORM=  AFFN,          ASDF,            ASDF
##VAR_DIM=   8192,          8192,            8192
##UNITS=     SECONDS,       ARBITRARY UNITS, ARBITRARY UNITS
##FACTOR=    0.0002768,     1,               1
##FIRST=     0,             0,               0
##LAST=      2.2672688,     0,               0
##MIN=       0,             -463272,         0
##MAX=       2.2672688,     233339,          0
$$ Real data points
##PAGE= N=1
##DATA TABLE= (X++(R..R)), XYDATA
0@%%%%%%%%%Qj6J6j6K4l2M0m9N7p2Q8j10J34j60J91k23K58k99L50m06M66n34O10
32C25o93P85q88J001j128J267j417J581j762J962k178K414k673K955l262L599
48A888l968M370m814N305n845O444p115P868q720R694j0816J2129j3689J5576
62H307j7918K0913k4894L0481l8952N3459q4941K75142k16117l16346N05956r2037
74A03053j76900K49899q812l97797J64303K46657j94616m7302K29858j62289j67456
85a61402K25688R7534j87809M7528R7227j58586o3418J96030J0227j37793O4754
96B9980O1936j59704J2336K02266m2655j72400M7485N9185m1195N8656J8400j41322
108f7032K6354J26175j04975n9065J59218k5556j34701R3339M5937j25613M9274
$$ y = [0, 0, 0, 0, 0, 0, 0, 0, 0, 0, 8, -8, 8, -8, 16, -16, 24, -25, 32, -40, 48, -62, 72, -88, 103, -120, 138, -161, 189, -217, 249, -285, 325, -368, 417, -471, 530, -598, 669, -748, 833, -929, 1033, -1145, 1269, -1404, 1551, -1711, 1888, -2080, 2290, -2524, 2781, -3064, 3380, -3735, 4133, -4587, 5107, -5709, 6420, -7269, 8307, -9611, 11302, -13592, 16889, -22063, 31396, -53545, 221597, 5480, -310866, 195090, 103053, -73847, 176052, 167240, -230557, -66254, 180403, -14213, -61515, 168343, 6054, -161402, 64286, 161820, -25989, 21539, 118766, -39820, -103238, 92792, 103019, -34774, 29980, 91916, -67788, -55452, 146814, 104159, -68241, -20756, 38429, -2766, 55890, 74290, -67032, -40678, 85497, -19478, -78543, 80675, 55119, -79582, 13757, 59694, -65919, -16645]
119a6645R7574j12081k5298J17553o2353p8550J19016J8646j09679L2395M0617
130B1195n6650M7133O1721r8139m5027R1119m181o7976M7755L9689o5044r844
142c8249N0030j7406k0156L5547r096m5838K6559L3343m4335j089O8862k9810
154H362p5393M8286N7394l3193Q476J9567p3204r568R6134j9849q3444M7261L0642
167B1471p3970K4000O9771n2266j9321O5349l6737n4281P6680L7735o5210N9K4018
180A7298n2369L039P3012j0012m9908R60n004M351N1847P287n6627j2074L0503
193B303J770J379K3699p669l4905p800J3183J3797J8867M765k8652l0619J1443
206a8439L2469J0522m663j6640l4547j114M4240J6725j7919o920j9659k5221L5413
$$ y = [-16645, 80929, -31152, -56450, 61103, -1250, -79800, 39216, 57862, -51817, -19422, 21195, -35455, 11678, 73399, -24740, -69767, 21352, 17171, -50805, -3050, 36639, -28405, -38249, 11781, -5625, -25781, 9766, 670, -45168, -18609, 14734, -29601, -30690, 38172, 8362, -67031, -18745, 38649, 5456, 13932, 33499, -39705, -49273, 46861, 27012, -56432, -9171, 21471, -52499, -28499, 41272, -10994, -30315, 35034, -1703, -55984, 20696, 58431, -6779, -6720, 17298, -35071, -32032, 40980, 30968, -18940, -17980, -22984, -18633, 33214, 40501, -16126, -28200, 2303, 4073, 5452, 29151, 21482, -13423, -21223, -8040, 5757, 24624, 29389, 737, -29882, -18439, 14030, 24552, 19889, 3249, -31298, -32412, 11828, 28553, 10634, 3714, -15945, -41166, -5753]
219e753N0009k3906l4931P562q886m902M1585Q319l5463m523J544j1709L0385
232I331K9287l4340k9643J3568j357K289L1936q109l8454M913J3831n281J6900
245D871J2423k3434j5406R585P465Q615P433j4698j7018R198J0464j278O796K790
259G806j2923q421O310J1105J974n301o0m476q511Q392Q907o639j575K443r678
274a0647j857J4970J954p717P046l342j4442J4531J3696j5205L197J2523k0130
287e423p786K2424K469j0372P438l819j7346J1249J7473r549k266L661j8410j617
301a1874K3728K515j1019L22p060j0790J4352K0151o443j5391k605k971K996J8079
315A3990O815j4472j2380j782N633J2715J0940q260k0345m663R977O780J0845
$$ y = [-5753, 44256, 20350, -14581, -7019, -15905, -20807, 20778, 29097, -6366, -10889, -9345, -21054, 9331, 38618, 4278, -25365, -11797, -13154, -10865, 21071, 12962, -25492, -20579, -6748, -12029, 4871, 17294, -6140, -21546, -11961, -4496, 4119, 11552, -3146, -20164, -10966, -502, -1780, 5016, 7806, -5117, -13538, -7228, 3877, 5851, 550, 490, -3986, -12497, -4105, 4802, -1837, -3412, -969, -10647, -12504, 2466, 4420, -3297, 3749, 407, -14035, 496, 14192, -1013, 2184, 14707, -5423, -13209, 9215, 11684, 1312, 8750, 4931, -12415, -1166, 16307, 6758, 4492, 8153, -10257, -11874, 11854, 14369, 3350, 3672, -3388, -14178, 174, 20325, 13882, -1509, -4114, -7085, -4089, 13990, 20805, 6333, -6047, -7829, -2196, 10519, 21459, 13199, -7146, -11809, -1832, 4948, 15793]
328A5793L144k2520j7009J2522J3893K072J874p340k1333j751K2760J1012l554
341I563m100j6079r160J9460J5709m780o849j0076j4300P483K4878L199j6200
354a252o019m118k612J8430J4678j3042j5347l174k76O997J4113r41j7650p896
368a8109M685N473J3570Q671j6489j3652Q648P777K812O799l199j6947m448J2906
382a503N594j129K198p645r433P385R565R08O09l917j0093o08J0769L491m698
397A493j379l789n589Q137R622l966n645L141J778l968J338O197O52l208q61l948
413Em1Q759L219o445k500r64k678M311O028o350o319O251j514o398Q708P286n945
430E413M7K376p876P13J1195R20p877n931p462K494J7651K326j6821k173O408
$$ y = [15793, 18937, -3583, -20592, -8070, 5823, 7895, 9769, 2429, -18904, -20655, 2105, 13117, 9563, 5463, -10616, -19776, -316, 15393, 10613, 3764, -6312, -20612, -13129, 11749, 14948, -1252, -7271, -11389, -14001, 4429, 19107, 6065, -9282, -12456, -12732, -5735, 8378, 7437, -10213, -18109, -13424, -7951, 5619, 14290, -2199, -15851, -7203, 574, 3386, 10185, 6986, -9961, -14409, -1503, 4091, 2962, 5160, -2485, -11918, -4533, 5032, 5940, 6549, 2632, -7461, -8069, 2700, 6191, 1493, 114, -3675, -9264, -1127, 8495, 4529, -1116, 2025, 3803, -165, 1173, 7370, 8022, 4814, 3953, 5, -36, 8723, 11942, 5497, 2997, 2033, -645, 3666, 9694, 3344, -2975, 3276, 1762, -4636, 4072, 11358, 5413, 5460, 7836, -40, 673, 11868, 12788, 4911, -1020, -8482, -5988, 11663, 13989, -2832, -5005, 1403]
445A403r05O664Q308p508q755O8J07J364P256K98q452p284k887O523J4226K361
461A2787j3649p953J201N694Q655K811q260j2465o666R896J6282o01j1875m168
475h311J214J913Q668P989m994q398o426l428J1388J1909j1595j2038J023k551
489a3637M357J5870k204j5958J235M962l992P303R893q906r550N2j616J1696J4161
504A3666j3314j5308O713M188J113J0161k051j6292l018Q957N002M761k106j2039
518i567J023R882l492k413O044k965n280r11l450L217R356l03q771m696M099J2022
534C795P738q735r567O167N999k635L90k520n240N306k37q302M701M630o183L160
550a533M773j0385k446J3127J926o150j101p712q24J8560Q82j6681L494Q116n113
$$ y = [1403, 498, 7162, 15470, 7962, -793, -725, -618, 746, 8002, 8300, -152, -7436, -10323, -3800, 10426, 12787, -862, -8815, -7614, -1920, 6735, 9546, 1286, -11179, -17845, -7949, 8333, 7732, -4143, -8311, -7097, -5184, 3484, 11473, 6479, -1919, -8345, -11773, -385, 11524, -71, -12109, -11086, -13637, -9280, 6590, 4386, -11572, -10337, -5375, -9367, -2064, 7829, -1077, -10627, -10575, -12191, -495, 13666, 352, -14956, -8243, -4055, -2942, 7219, 5168, -11124, -14142, -5185, -183, 4578, 2472, -9567, -8544, 1338, -2154, -4567, 1477, -1488, -6768, -7679, -11129, -7912, 1444, 1141, -7630, -12326, -8227, 3795, 11533, 2798, -6769, -602, 5397, 2762, 3152, 632, -4608, 698, 461, -7841, -3140, 1490, -4693, -1533, 3240, -7145, -9591, 3536, 5462, -688, -1789, -9501, -10325, 8235, 9117, -7564, -4070, 4046, -1067]
565a067M991N058r130P85P757q758o834R814K554o345l94m632k550J1642L177
580F068q226K035J488o380L205O780M74k805o541m543Q831O667n621q35K766p656
596d293j473J1168K682l326j964q794j051J2635K882m197j231q266l795J3452
610D429N241r041m48K81j1087L613J5588K04p517n885p321R260J8299n458j2989
625b831K820j33l056J0208M298j0934m198K840j997L813O612m715l920J20l262
640d335N130Q312m186n411L58l685k86R103K574o848n653j060N653Q934l498q618
656c516L509K199n014M901M188o143K86J725o161J959Q498k510m252J477l481
671b335j221R545j411q759L398J273o301N300O199p495k997M182q79K31K786j806
$$ y = [-1067, 3924, 8982, -148, 637, 8394, -364, -7198, 2616, 5170, -1175, -1569, -6201, -8751, 2891, 6068, -2158, -123, 1365, -5015, -1810, 4970, 5444, 2639, -3902, -8445, 386, 7053, 1432, 597, 3363, -4293, -5766, 5402, 8084, 4758, 2794, -6000, -7051, 5584, 8466, 4269, 3038, -5228, -9023, 4429, 9670, 629, 181, 462, -10625, -7012, 8576, 8780, 1263, -4622, -11943, -2683, 15616, 10158, -2831, -11, -144, -3200, 7008, 11306, 372, -3826, -986, -2983, 830, 7442, 2727, -1193, -1073, -4335, 795, 9107, 4921, -490, -132, -3817, -4103, 5000, 7574, 726, -4927, -5987, -334, 8600, 5102, -3516, -7, 2192, -2822, 2079, 6267, 124, 410, 2135, -4026, -2067, 6431, 3921, -331, 1146, -2335, -3556, 5989, 4578, -4181, -783, 490, -5811, -511, 5688, -1807, -4804, -622, -1501, -1270, 1516, -290]
687b90n75K954k649k888M709J173k651K007j899l771L569K464j698j18j495k897
703d055K545J558j185L016j311p057J368O679k007o79L000m977k786O193J135
718A437r52K835m463n236N991L850l135K234k0q723R56R337j353k707J467n090
734c572l248P424K587k272Lm293l624N596N070k316j320j091l948J679P193J009
750D877j946l096l498J889M863O80L71k941o412J384O823R41j065j341m943j496
766d910O771K730k159n6m306n022P041M947m606N94P9o792K555Q766j562m083
782a3J158k683j622P311J750n502O09m33m545N018N660n005k467J206k556N11
798a603M277m02l511l56k98n8L074J159j932l26j433k54L524Q60j643o39j290
$$ y = [-290, -865, 2089, -560, -3448, 1261, 2434, -217, 1790, -109, -3880, -311, 2153, 455, 337, -1158, -4055, -1510, 48, -1137, 1879, 568, -6489, -5121, 1558, -449, -1128, 1872, -3105, -5891, 302, 1437, 485, 3320, -1143, -6379, -388, 3462, 327, 2561, 2541, -6182, -5226, 4111, 2758, 51, 1518, -3572, -6820, 604, 3191, 919, 922, -3371, -6995, -1399, 3671, 1355, 35, -1056, -5004, -3325, 3868, 4877, 2931, -165, -3663, -1774, 3089, 3769, 4140, 1199, -5213, -3829, 2994, 3935, 2870, 1529, -3414, -4910, 1861, 4591, 2432, 2376, -1930, -6952, 89, 5036, 430, 1024, 1103, -5689, -3134, 5632, 4070, -13, 1145, -1538, -3160, 4151, 5901, 399, 1008, 575, -3970, 1048, 6708, 1703, -764, 442, -2114, -1603, 2674, 2272, -1239, -1595, -1893, -1951, 1123, 2282, 350, 24, -1409, -1663, 1861, 2721, 1078, 439, -851]
815h51m81K388r1q94J277r03k364K267K110k491Q00J697l681j473L580j371j350
832a831K949k788k857L982N51j796K964K44l835J174K985j905J07K788k943l482
848c693L119J242j19J554j841l190J828K148N77J99j458l017q94K593J530o00
864b2j098j862n59Q50K618K413j083l451m53J593J077K881K50m958j664K056K052
881F40K308K29m074k962K830K039r54J768r70n167Q44L339j04J175Q55l875k905
898d984L519L636J3m32k826l407K331M801n19j323j293j892O39L939J204j995
914A411j265Nj058K28K677L15k432j702n82Q03K784J656j765k897k24K084J900
931A938P76j692k975L49K199j7K40N37j163r27J608J077n40J114L96k562j160
$$ y = [-851, -1332, 1056, 965, 71, 1348, 445, -1919, 348, 2458, -33, 767, 2464, -1217, -2690, 890, -481, -1831, 1118, -1670, -4527, -545, 6, -1790, 1174, 1418, -2417, -1243, 1742, -163, -56, 2732, -211, -3693, -574, 668, 549, 2103, 262, -2928, -1100, 1048, 1625, 1824, 366, -2651, -3545, -952, 578, -22, -1120, -2982, -3541, -2691, -73, 2340, 1257, -2194, -2647, -1054, 23, 2904, 3154, -1804, -3468, -1412, 640, 2948, 3177, -897, -3859, -1029, 1010, 56, 1824, 854, -4313, -3469, -130, -234, 941, 1796, -2079, -4984, -1465, 2171, 2184, 1752, -1074, -4481, -2150, 2651, 2132, 809, -484, -2376, -1737, 2202, 3406, 1411, 146, 151, -907, -679, 1998, 2313, -119, -1821, -2403, -1600, 1184, 2840, 1075, -1822, -2046, 38, 1938, 2714, 1022, -1953, -1604, 595, 578, 818, 1355, 192, -735, 873, 1950, 1410, 2524, 2920, 358, -802]
948h02J972P36k88m02k158n22J573P67q17j26Q95r46m22K002l87j319J288L32
966A376j866p3K012N89j150J27q2n16R61O88j163R2O44k185J07J478p56m03J919
985A799p41l771J276L519k84j867q26j561J401L076p30j615l04o28N69K369J46
1002A828r95o04N30j205k40K283O47j648k236j018K182J934k78j081j847j481
1018c229K274K333n96j853j754rK312J063j086p06J257r15r05K502Q34q95O24
1035A251j529k392K135K227m92j216k164j314K582K765j255k251J69r15R7L554
1051A252j17k344k72n61L21K265L18j186j54q73p22K133K354j566j963M26m38
1068a127J255K016j340k249J094k34K0J981j137j612J140l56j048J823N81j709
$$ y = [-802, 1170, 1906, 1618, 1216, -942, -1464, 109, 876, 59, -67, 828, -118, -540, 1462, 1075, -244, 1044, 1376, -490, -563, 1449, 2038, 888, 1015, 933, 417, 1378, 2066, 903, 995, 1639, -546, -439, 1039, 283, -120, 1799, 1058, -2713, -1437, 2082, 1798, -69, -895, -2456, -1055, 2021, 1291, -324, -628, -1256, -687, 1682, 1828, 833, 229, 759, -446, -686, 1597, 2244, 596, -1640, -2658, -476, 1458, 1180, 99, -1748, -3229, -955, 1378, 782, -1071, -2825, -2834, -522, 541, -545, -1251, 6, -909, -1814, 688, 1522, 627, 1251, -278, -2670, -535, 1692, 1200, -16, -2180, -3494, -912, 1853, 598, -1653, -1484, -2399, -2302, 1252, 1135, -1209, -1481, -2042, -1721, 544, 862, -324, -478, -1351, -2073, 60, 2414, 848, -1115, -689, -1127, 128, 2144, 804, -1445, -351, -585, -565, 1416, 279, -1333, -193, -549, -1597, 226, 807, -902]
1084i02n52J346l80J08J679j496m34K116j413m31J582l94o12Q29m50r09P97O03
1102A087n99J36j25j450O92J338m00m27r25q13J572J042j430j39N08n48O40O23
1120G82j074L08J920j220j257J291J82o96J905o86l151J984J540j847R02J141
1136B024k890m46K391r51k26J374j428j980K286M22j564J984K06l795J457K784
1152A648r08O2K08k150k71K930N73j329m19r46m96K247R28j423n20p10r10J391
1170i5J126j96r50j412M2J476J26r1L53n95j558J057J872j327M67L88k135P45
1188g07K418r51n95R73j820j015K847J09k186J261Rk763J632K710k351p16J320
1205A75j757l5K762r87j563J412q32j219K553R12j894j16J119j361Q02J640j035
$$ y = [-902, -1454, -108, -488, -380, 1299, -197, -631, 1485, 72, -359, 1223, 829, 217, 1046, 596, -313, 484, 1087, 488, 624, 499, -951, -259, 1079, 679, 252, -673, -1486, 86, 1128, -302, -441, 67, -481, 159, 782, -292, 16, 1936, 716, -541, 750, 932, 236, 2141, 1455, -1696, 288, 1828, -19, 883, 2024, -866, -1312, 1079, 128, -98, 1276, -152, -2132, 154, 576, -988, 996, 1202, -2593, -1136, 1648, 740, 802, 1010, -1140, -1411, 1519, 2092, 763, 344, -602, -1098, 1149, 2077, 654, 134, -576, -1486, -95, 1031, 835, -115, -1527, -1485, -9, 117, 26, 379, -216, -1774, -717, 1155, -172, 295, 683, -1452, -707, 1711, 760, 165, 1138, -682, -1697, 1150, 1259, -927, 334, 343, -2420, -788, 1922, -429, -1145, 175, -1582, -1617, 1145, 158, -1405, 7, -825, -2044, 509, 1421, -473, -589, 530, -831, -29, 1611, 576]
1222E76j338Q00j63L11N40r08k47M56o81R9O46l23o40L40n0o1N32o13j28Q15m82
1243e19o49J532k45j285J576O08k083P88J255j484K76J554j514p44J660p42p17
1260g33J724p50j823J531K24j505J597L71k248N30J715j275j75J678j290o78J377
1277B70m3j92J061k56j919J562M11q66R32l44j162N36L77L1N72m52j080j03N73
1296i2p9P13L30j986k36J808j81l22Q93j081p26J509k87j37J288j017j484J249
1314A62J042o21M46J41j596q2J717n21n53Q35j382o30J578k12m08K96q28j008
1332a624J578R42j022K30J47j034M43J280n13N4K60j408M52J620o51j18j02q70
1350c36O2J257j69j033J39K20o45L45N35q68O19m44j092J429M41r52K27M94q17
$$ y = [576, -762, 38, -125, 186, 726, -182, -429, 27, -654, -555, 91, -232, -872, -532, -582, -643, -111, -724, -852, -37, -519, -1168, 364, 119, -1166, 410, 1018, -1065, -277, 978, -506, -230, 1324, -190, -934, 726, -16, -733, 991, 241, -1582, -51, 173, -1332, 265, 636, -1612, -1082, 633, -642, -817, 861, -429, -1107, 270, 227, 35, 1096, 840, -1079, 483, 894, 28, 960, 616, -546, -10, 367, 398, 970, 518, -562, -665, -92, -171, 542, 872, -1114, -1350, 458, 277, -45, 848, -233, -959, 550, 263, 126, 1414, 397, -1087, 162, 1204, 583, 1029, 1170, -426, -508, 1209, 688, 135, 970, -412, -1042, 536, 324, -84, 212, -616, -1624, -46, 896, -126, 104, 251, -783, -340, 940, 427, 481, 741, -667, -215, 1405, 754, 636, 534, -336, -274, 983, 814, -219, -80, 140, -505, -160, 375, -493, 126, -318, -1410, 19, 460, -492, -265, 229, -588]
1369e88M66P43m52n06O50k59k98J144k39j260Q99M29r08M51J18j038M33P13q25
1388c27m08O49J05o59M62o06l3J004l96n67O43K05r04J015k57j85L56L92k53k36
1408@j88P9P55j35o95j02L51o2j68N49o13k56N02k85p6K94m2l96J84l65L74O35
1430C40nq95p1P08J30K60J86p43j23M02L16K36J40r98O0L30J42k10J2J42q39j99
1452f79P32m8L32l02q17K03O11O7K31k7p46K46L03M10q7l10L74m55K45L91r9M
1474E79K6m54l12O54p7K97p96k58k06O12K48l97k94l3J9M11L61m58L6Nn8M09r0
1497B24Q8J11k39J9k42K38N25k83m74k1j52K41O15k39q44j95M39N49k54m31j99
1518e24l61N87M90n59k28O25m07M01P9j17j76M44J80o80K69K44j55l17L27k7%
$$ y = [-588, -122, 621, 169, -337, 313, 54, -244, 900, 661, -599, 300, 729, -179, 272, 390, -648, -215, 498, -327, -735, -86, 19, -640, -178, -784, -817, 187, -209, -776, -133, 72, -832, 183, -74, -259, 97, 489, 236, 0, -188, -109, 646, 511, -184, -286, 65, 3, -165, 384, -229, -485, 17, -268, -344, -50, -92, -488, -304, -669, -295, 340, 335, -560, -631, 77, 207, 467, 653, -90, -213, 189, 505, 741, 881, -117, -57, 273, 415, 205, 217, 359, -480, -679, 53, 5, 337, 35, -782, -579, 32, 99, 330, 303, -443, -197, 106, 516, 429, 119, 493, 38, 283, 674, 575, 579, 605, 151, -161, 493, 416, 713, -83, -341, -547, 65, 313, -84, -378, -411, -392, 19, 380, -78, -42, -37, -95, 314, 224, 312, 423, 184, 203, -39, 199, 724, 441, -33, -54, -206, 35, 650, 411, -433, -628, -189, 360, 106, -325, -524, -885, -298, 192, -367, -595, 30, -377, 24, 103, -14, -190, 254, 434, -246, 23, 267, 112, -205, 122, 95, 95]
1539I5M0j78j49j02N66m36n78L03K33l06N43k49p21K95Q12j11m94N04l49m70Q18
1560F6M16m97m8L43o09K56P67o53k17L16k34m33P24n8q19L68J61n27K13J047j171
1581e89nL86k05p3L90L90l88l7j16k42O04M78m04m27L10j16M0N39P3o54m37L14
1603a69K24K28l02P9j084M41P92j64j37M0k81n36J104L18n62N8N4l58q0J356o16
1624D05o73O65k19k45P75J42r74Q4M68n51M7P54n87o67Q19k53o05P55R9l66k6
1645a53K11m55K79N82m06j41J64r1j49O54P9p25K48J1R4M08j13j27l46k14L53
1666A63L08o01L51l61k20L78J15r1l42L49j21k56N77j02l92M08J95o02K52N43
1686E51m85R7O49n63m64O93q2n62O34J03j101L59M38n39J54J78o95M2Q02%n36
$$ y = [95, 135, -43, -192, -294, 272, -164, -742, -439, -206, -512, 31, -218, -939, -644, 168, 57, -437, 67, -282, -752, 66, 482, -15, -63, 280, -329, -73, 694, 41, -176, 140, -94, -527, 197, 139, -680, -312, -151, -678, -465, 582, -589, -594, -208, -413, -486, -96, 294, -94, -131, -247, -489, 115, 593, 189, -238, 72, -44, -4, 535, 608, -46, -483, -169, 55, 283, -19, 60, -1024, -583, 209, 45, -92, -52, -333, -869, 235, 553, -9, 49, 103, -255, -335, 1021, 405, -268, 397, 178, -67, 708, 850, -124, -40, 428, -123, -76, 678, 91, -576, 243, -10, -615, 140, 239, -127, -153, 58, -397, -118, 464, 58, -83, 81, -10, -159, 495, 574, -151, 97, 108, 202, 610, 497, 370, 24, -190, 163, 471, -130, 221, -140, -360, 18, 133, 42, -300, 49, -72, -328, 249, 147, -245, 163, 358, -244, 8, 551, 66, 163, 812, 249, -215, 478, 396, -166, 468, 571, -530, -171, 267, -272, -118, 60, -635, -593, 209, 209, -327]
1707c27K70L9p84O15N34k19j2M6l69M11L41m62P7j42l27L07K71J37r1m41j13K40
1729Al7j34O8o9k73j48O02j38j32J45k33l74N85M47n82N89n38j70L33L34kk98
1751b4M30o42l2P76j35m07J22k62l54P50P3n38k90K32l96M33L90j33m10R5m08
1772g30M89M69m7n06K48l51L78L89j30p8k03j1J59K17j88p1j27Q7m59M35K92l61
1794i9k1Kl80J35M47m98L02K53l60j48L65N2k62J9M75o38N68K80m55O9K45o07
1816b56K78L24n03J81J90m79l9R4K39k98L86k5n06L64O1k16M95m34m26M51L12
1837A93j11J4K52o10K97K11Nk0K22l47k50J69P5j3L33l11m27L82O6j90K1j9m96
1860e54L62M4K24k50M1j85j81Q04k26q9N15l48l00K89K15j8k44p1k44O4N26j55
$$ y = [-327, -57, -18, -802, -187, 347, 128, 116, 162, -207, 204, 545, 83, 160, 18, -309, -2, 269, 406, 315, -126, -239, 1, -36, -170, -102, -171, -444, -592, 10, -128, -260, -115, -348, -722, -137, 310, -272, 317, -221, -391, -58, 276, 274, -24, 406, -236, -268, 508, 373, -34, 88, -174, -528, 222, 295, -243, -533, -301, -697, -264, 126, -7, -417, -322, -730, -241, 228, 181, -325, -77, -428, -50, 339, 209, 131, -72, -83, 76, 293, 105, 34, -93, -6, -465, -30, 262, -99, -120, -118, -498, -363, 84, -414, -112, 141, -219, -367, -2, 50, -212, -193, 282, -356, 212, 492, 37, 106, 351, -256, 22, 346, -157, 24, 214, -265, -304, -210, 29, -269, 117, 92, -414, -50, 11, -205, 290, -144, -570, -119, 193, 82, 96, 348, -262, 35, 246, 251, 231, 453, 106, -144, 25, 100, 87, 420, 109, -318, 64, 130, -60, -39, -58, -554, -192, -148, 76, -174, -133, -318, -499, 305, 79, -10, 505, 157, -143, 146, 361, 343, 99, 28, -216, -152, 374, 219]
1882B19j38j44l72L48L15m1k95K44m05r0P2J87LJ37o22L23L04M4M1j6k63l44N71
1905G8L30m27L72k39m23l4M32n9j16j5l92K26O71j56k60R5k88k71J19N77k02j36
1927a18K14k68J04P1J8n5J56m9j63M51O5k56J34l91K52n7J10J65l04j06j91L57
1949A39k34J8J98k62m9J70Om2l8L8R6j86K53R1J44K2j7l41K50k32J77M08k93k79
1973C7j07K48R7l17R1j3n8o3J89l95N01j36n69L47J72n3J17k17j53j64K93N13
1995C60r8j85j21J0j06N01j82J47m06K52l3j05J19M8n30J22j6l5O53j74m91lJ71
2018a02n4K15R6N2l01j83M01p2o5L88l45k60M48j53J20L6j66j72K4MJ15%P1m64
2042c67K02L37j06n8K7j88o84P02K97p0j63J01n5l55N86K57m98K05k54k49N75
$$ y = [219, 81, -63, -435, -87, 228, 187, -108, 136, -269, -359, -287, -100, -97, 40, -582, -259, 45, 89, 130, 114, -149, -493, 78, 408, -19, 353, 114, -309, -343, 89, 30, -86, -101, -493, -267, 404, 248, -12, 83, -205, -476, -357, 220, 18, -118, 96, -172, -68, 3, 21, -34, 122, 73, -90, 361, 426, 170, 304, -87, 165, 108, 218, 383, 79, -27, -218, 139, -95, -77, 121, -141, -190, -20, -14, -56, -94, -56, 40, -146, 107, 198, 342, 364, 347, 6, 256, 24, 201, 609, 316, 37, -70, 178, 275, -42, 49, 36, -22, -85, 104, -291, 210, 74, -495, -148, 24, -29, 88, -129, -282, -446, -153, 360, 262, 77, -44, -34, -140, 361, 179, 326, -80, 172, 139, 34, 153, 201, -329, -207, -223, -258, 395, 221, -270, -273, -102, -156, 59, 155, 207, -94, -277, 124, 52, -13, 375, 30, -230, 218, 65, 185, 221, 55, -117, -93, -89, 26, 26, 97, -367, -165, 172, 66, 8, 35, -153, -837, -135, 162, 92, -71, 30, -25, -380, 206, 463, -35, 170, -84, -333, 242]
2063B42j04N07n60l23L13OJ82j7m45J33J82n00O9L71j30j51J40j54j02L06M04
2084C69j96l37K45o8QM15j62m23l3M28j95J55K04j84n64M63L0j28L83k58l78J1
2106b15J70J46k39L22j93n11N06Q3j58j58L38j00m20N64M0l52J22J06k07Q5L32
2127B61k45j05J61m5k68L39qk74K01j14m18M58L76l81p3p2j19J77K34K47l59n1
2149g8R7j37K83K24j92j33j74K55RK32o7k85j19J45j71L83Q0l39n26L52L97m42
2171b06J54q4k2K8K46m7m08N65k71j36K5L09l9J48k54J55l54L04L24m09K52m84
2193b04l1J26K74j76p3j59K5n0J42J66j12J18P9n68K39K66R9k39K01l62J54K92
2215B07J23J27n77K78j09p4M07m60J25q0J76k52K56j00j23j44M6N2m0l6L18l70
$$ y = [242, 138, 645, 85, -238, 75, 81, 263, 246, -199, -66, 116, -384, -315, 56, -74, -225, -85, -239, -341, -35, 369, 173, -164, 81, 13, 21, 436, 274, -149, -182, 246, 51, 206, 410, 226, -338, 125, 155, 27, 410, 152, -226, -215, -45, 101, -138, 184, -9, -520, -14, 69, -89, -247, 91, -9, -429, 135, 175, -177, -55, 51, -156, -71, 261, 16, -89, 72, 27, -241, 98, 90, -184, 17, -97, -515, -57, 319, -62, -135, -207, -326, -149, 85, 332, -27, -78, 19, -118, 165, 389, 197, 64, -110, 145, 154, 386, 319, 34, -85, 60, -111, 272, 352, 13, -513, -161, 236, -206, -52, -136, -158, -130, 116, 69, -339, 226, -45, -181, -156, 153, 114, 262, 8, 163, -191, 113, 437, 28, 280, -204, -235, -109, 165, -11, -84, -243, -218, -268, -126, 40, -72, 46, 125, -443, -204, 62, 161, -78, 123, -239, -85, 207, 330, 457, -120, 158, 49, -25, 382, -78, 47, -33, 143, -109, 147, 47, -76, -220, -174, -122, -162, -198, 120, -250]
2237b50R3J65l9J43Q0j98l42M29k06K29j55L86o07K96J34Lj92L33l61J1J0j84
2259b22K04R2j26j60J7K97o3M1r1m07k07L56M34j49L35l51j47Q4J92J20l3q6j05
2282B5j66L79l34J31m9l12k3K68k4L06j73k23j09K07K44r2l6l56J29J76M3J92
2304B03N5l68Q6L4n0K40J89j48k57RJ01l12K94jk38J04J02k04K52P5k79j64K35
2327d2p0J24J21J12k51m0J06m5R9Rm13J82K65j47R1K72j91l65J74j12J74J38j72
2350A9J34k04o1Q6J06k32moq4M20k28J32r0m43M10j30J42J25oj29n3K52L91m80
2374F7K2j48r3K99k80R6L31k12m34L55M2l7R5L0j47j04Q2J51L0p9q8k86J73K10
2398G5j96L18k07J27j39K6J36O3m65J27j29K88K03J8k44l04L04J8J3n6K2j51O0
$$ y = [-250, -157, 8, -31, 112, 192, -6, -348, 81, -125, 104, -51, 335, -272, 24, 158, 161, -31, 302, -59, -48, -38, -222, -18, 74, -52, -212, -195, 102, 39, 80, -11, -418, -625, -269, 165, 16, 351, 0, -147, -63, 129, 249, 216, 130, 25, -141, 238, -96, 35, -14, -326, -349, -81, -105, 201, 28, -195, -304, -97, 147, 55, 19, -337, -208, -32, 11, 203, 258, -110, -24, 10, -40, 200, 389, 241, -16, -7, 94, -218, 76, 75, -163, -59, 43, -161, 91, 166, -113, -277, -42, -112, 12, 133, 245, -6, -46, 60, 15, 114, 123, -290, -108, 157, 10, 101, 373, 182, -183, -9, -121, 53, 191, 19, 153, -51, -112, -26, 80, -152, -156, -162, -246, 174, -54, 78, -12, -455, -45, -175, -33, 92, 86, -43, -96, 156, 547, 67, 89, -59, -152, 147, -133, -37, 294, 82, -352, 3, 45, 8, 103, 133, -14, -118, -36, 115, 145, 66, -22, -308, -135, 75, -121, 197, -10, 117, -22, 4, 140, 203, -262, -135, -264, 24, 227, 245, 1, -303, 1, 19, 32, -24, -2, -153, -93]
2421i3l1J07N2M6m8m03K24L6K92J3j86l1o7r3M63m7l09J97m25L24m7K33j91l81
2445c65L57o2J06J1k10N4MM3N1k3L8n2k1O6k4K30j41J15l27K41o7J03P8J08l17
2470dR8J32k78J33J62l52r3J98q9K20J42k79j26J41j49K30J9L5k29j89J31m6J19
2493g4J55l22K25j97K72n8J58l09m1J14K5J46K04n9l00J06j88l4N1J02r6JN9r4
2517a54J68K29l67QL06l15R8M59k00k34J00k71Q1L24L7k63j79J26R9m0L52k91
2539G3j97K2p6J80Q3j22k18k3n0K99o6J85j74L7r7K22M5K4l8l7J9j1r7K4J12j70
2565e1n3J15j91K68pK0k12k47N64j76L63k84l62n7O3M44n9k21p9J23k24M18J16
2588B71k97j82J97j08J15L72j01k72j51l20N29J83j32n1k72L08j79O6J95m4j88
$$ y = [-93, -124, -17, 35, 81, 33, -370, -146, -110, 182, 195, 9, -22, -89, -182, 281, 234, -75, 122, -303, 21, -26, 207, 16, -365, -8, -70, 36, 47, -163, -109, -105, -62, -11, -34, 4, -48, -69, -3, -27, 203, 62, 177, -150, 91, 24, 127, 205, 313, -4, 94, 226, -52, 81, 243, -109, -202, -4, -93, 127, 269, -10, -136, 5, -144, 86, 105, 140, -89, -278, -147, -193, -74, 81, -241, -16, -213, 59, 1, 159, -150, -191, -77, -52, 94, 298, 239, -61, 45, -143, -177, -126, -24, -120, -119, -60, -154, 14, 243, -124, -116, 190, -125, -27, 432, 232, -2, 98, -173, -92, 232, 269, 6, -173, -47, 52, 12, 364, 73, -124, -102, -178, 2, 85, -37, -255, -278, -328, -29, -95, 90, -84, -47, -144, 78, 123, 147, 109, 72, 91, 80, -17, 7, 119, -51, -104, 11, -180, 88, 81, 101, -111, -358, 206, 30, 393, 109, -253, -310, -247, 197, 138, -83, -162, -39, -263, 155, 271, -26, -208, -11, -119, -4, 368, 267, -5, -156, -476, 53, 236, 104, 53, -219, 89, -90, -24, 171, 127, -61]
2609f1j96K12L6K95k24o1n5k8R3J07j45K39J2l38K16j70J10K13l87j08L74j91
2631e7N4Nj12j22o1J35K83O1K8l16k37K02J16J10R8k60j00J03J63K7j83L8j78
2654b03J82Q3L06j98n4j85J59j24J24p6Ql71J09K70J46J15n24N5N8r2J29M11m10
2677h2l8j01J35n8L06J62k76j19k37L41K95p0j06m30J2J48j12M52J10o0j94k84
2699b06J63q4J78j98j21j12M13J22o1l8j09p6L51K4K30l11j00j86K38J3l2K60
2721C58l86r2m3O5L01q0j46j4j8q7P2J39J22l20j13J82J12j1K29n18J37o1J41
2744c1J80J90l87r0O1L3K67l18K13m60J07M3J52L7J32m92L40%QK70m5j79m86J96
2768b59L79k11J90m7j28m3q2K60m5J54O4k25j92L17o4J4j40j52R3J48N6q9J67
$$ y = [-61, -257, -45, -9, 286, 62, 1, -54, -82, 11, 118, -27, 212, 224, -114, 102, -68, 42, 255, -132, -240, 134, -57, -3, 2, -110, -232, -293, -158, 125, 186, 214, -102, -339, -137, -21, 89, 187, -73, -173, -70, 93, 120, -63, -25, -203, -21, 62, 368, 170, 116, -69, 90, -34, 90, 14, 22, -349, -240, 30, 176, 291, -233, -178, -120, -212, -83, 328, -82, -120, -221, -86, -144, 162, 324, 48, -71, -308, 33, 328, 258, 152, -278, -266, -118, -230, 222, 332, 272, 78, -206, -43, -127, 51, -147, -268, -380, 33, 155, 94, 56, -53, -129, 222, 246, 476, 165, 65, -121, 117, 130, 98, 358, -28, -120, -163, -98, 203, 123, -23, -37, -55, -142, -70, 69, 191, -129, -242, -60, 52, 41, 270, -248, -111, -172, -31, 149, 339, -48, -138, -77, -44, 223, -95, 118, -342, -235, -192, -40, -3, 129, -363, -23, -23, -15, 255, 210, 31, -455, -259, 120, -91, 99, 52, -76, -119, -201, 59, 14, 168, 232, 7, -185, 132, 68, 82, -58, -210, -117, 31, 87, -2, 165]
2791A65k65j73L03M2K27l1l87L1jK92j15n3j5j75N5J9J27M6J02o9l69m6K26K3
2815d1L20k61j44j73J58M28j59l80K61l07J46L12k19J51j56j00JL08L46l70J1
2836A32l70K33L03j74k07j21J61q7K84O6j87k44m2J60k0J67O3M8k9p0j22K16J64
2859C24n36L29j81k1L25m1j46j68J10j5L3K52j99j80J52k78K96J07J5l83J80l18
2881c43J15Q6M37k15m5j25j21J04L02K4k76n2q1j23M09Q1k45ok64K80j25L20n2
2904H5o8lj61K28N0O7m08J91r3K03l4N1k7m09K43k49K37J45L5j56o5l2K60rj21
2929d0K48l54P7o4OJ66n9J7j71oJ86J0J25k38jjL13R8n38ON0N5J04K0J8n6k1l6
2957h6J54j60L61l66p2PO6K68k51P0k87O2j26M46P0j72O2j44k00K79J04O9M3k30
$$ y = [165, -100, -273, 30, 72, 299, 268, -119, -88, -89, 203, 88, 35, 20, -155, -100, -81, 46, 92, 194, 125, -244, -290, -64, -41, 279, 18, -126, -299, -141, 287, 128, -252, 9, -298, -152, 160, -59, 92, -64, -164, -163, 145, 491, 121, 132, -238, -5, 298, 124, -83, -204, -43, -130, 154, 220, 33, -211, -253, -93, -113, 54, 117, 165, 136, 66, -56, 160, 324, -212, 117, -64, -85, 240, 199, 53, -115, -5, -20, 13, 265, 66, -114, 38, -240, 56, 163, 178, -205, -25, -343, -228, -142, 295, 80, 35, -90, -211, -107, 195, 219, -57, -109, -190, -313, 96, 177, -68, -74, -338, -58, -183, 137, 85, 17, 14, -147, 81, 131, 198, -210, -19, -112, 91, 57, 108, 81, -328, -85, -334, -97, 48, 83, -73, -138, -170, 90, 81, -40, 208, -146, -69, -133, -127, 39, -20, -3, -174, -180, 6, 16, 141, -97, -98, -99, 214, 312, -226, -220, -170, -115, -11, 9, 27, -29, -50, -86, 68, -92, 269, -97, -169, -162, -96, 172, -79, -9, -296, -234, -360, 86, 156, -16, 46, -98, -298, -19, 85, 154, 197, -33]
2981c3p5o1K37j39Q8j05%K07j55J06j93J77N2m00L69k06O0P8l7j96PK89j2L5j47
3006e4j12J3K54J38k05p3q9J6K46r2P4j2J68k36j40K43n5J7l33K86q2l2L80l49
3030b9K7J43j79Q2K71j03k39ON3k39K35j6J82l54j55K11O8K33K6l80O8N8L48k29
3054H8j09L9J06k41L23j3j8j92j29P9K57l55OJ72l2j44J7R3M6j87M21m89J17J78
3078C3M2J10n33L55r8p4K99j69J73l34K32j61k24N20j49k1q3J92j4j3l2j12J06
3101D5Lj67J71J14k6j08k39K64J41o6j34O9p9j44L12k60l8l0J46J81k72Q4K68
3124B35k42j17m4p5M04k55K94o6m61L39p8K09j10k20r1J79K73k32M3N8l46K39
3146f4J08K20j90J50m28J64J05N6k6k07N0P2j06K63j34k3r3m2L5j7K4j35R1K89
$$ y = [-33, -108, -169, 68, -71, 17, -88, -88, 119, -36, 70, -123, 54, 106, -294, 75, -131, -71, 7, -30, -226, -219, 70, 58, 93, -54, -166, -153, 101, 239, 34, -39, -128, -112, 134, 42, 116, 104, 272, 36, -104, 139, 84, 101, -232, 54, -28, -60, 320, -29, -2, 141, -38, 44, 315, 212, -27, -21, 32, -207, 28, 12, 194, -160, -315, -104, -36, 197, 223, -157, -89, -31, 317, 88, -21, 18, 124, -117, 206, 193, 175, -17, -146, -67, 190, -165, -159, 13, -19, -163, -146, -53, -7, -194, 227, -262, -145, 33, 75, 185, -348, 7, -91, -165, 134, -35, 138, -196, 36, -125, -349, 171, 22, 1, -82, 110, 96, 83, 51, -61, 45, 48, -119, 52, 166, 140, 32, -207, 57, 198, 132, -2, 67, -12, -156, 156, -104, -142, -172, -26, 155, -117, -33, 235, -7, -124, -168, -243, 161, -94, 200, 134, -327, 12, -66, 143, 33, -187, -278, -99, 174, -58, -15, 43, -303, -64, 44, 264, 74, 224, -204, -40, 65, 121, 95, -112, -62, 10, -96, 167, 33, 10, -83, -125, -90, -107, -83, -218, -127, 162]
3170A62k59P1K7N7q4J19r9j44K83p2J42k66j25L65k18J48L4Ql77Q8K4M18J22m00
3194B4j99j46L48j53K01k49R1k90J19L33O0k59K54j57PJ68j69r6o4J49j79j14
3216c21N86k62j49P3PM0m0K46j18J1p3j2m2K74l00m8K29K26k45J0L33n47Q0m6
3240h8n8J52M5J62m51K78q2L7m9J89J4n74K84K51l8MO8j65K88l35J6J74j29P5
3264F8k68K14p5J13J3j5j84P0k1L23k50j87J93q8J7J32J5q3J11l47K09L1J23l5
3288G9j74k7j78L79K09l24q5Q7J82o2j52j74L01k84Q8L05K9P5k44j42q7J78K0
3311an4J30J15n7l30J69K34n0k82R2Q1lmJ09K31n81N6J59k03L1K29j0m4K5k54
3336b12J79J9RL7r6m6q0J93j78J59k07K77Pk1k4J01l55M9K02J30p0N9j14po2J57
$$ y = [162, -97, -26, 1, 58, -26, 93, -6, -150, 133, 61, 203, -63, -188, 177, -41, 107, 141, 149, -228, -140, -116, 302, 424, 24, -175, -321, 27, -126, 75, -174, -83, -373, -254, 79, 139, -120, 134, -23, -16, 152, -17, -113, -177, -28, -207, -321, 265, 3, -146, -73, -66, -26, -66, 180, 62, 73, 0, -12, -54, 220, -80, -128, 101, 327, 82, 92, 425, -122, -42, -88, -146, 6, 51, 213, -238, 40, -42, -5, -54, 135, 149, -425, -141, 110, 72, 76, 144, -21, 267, -68, -52, 122, -7, 68, -200, 14, -61, 52, 65, 50, -134, -64, -85, 238, -12, -199, -6, -94, -77, 55, 70, -13, 98, -249, -40, -9, 114, 79, -95, -122, -300, 79, 288, -36, -121, -34, 148, 86, -66, -240, 61, -223, -135, 170, 199, 274, 30, -112, -199, -21, -1, -55, 75, 190, 133, -197, -28, 206, 156, -126, -34, 47, 44, 40, 149, 380, -201, -145, 14, -189, -158, 71, 61, 17, 42, -212, -33, -14, -5, 32, -64, -110, -190, 3, -175, -16, -223, 54, 61, 40, 16, 117, -238, -189, 13, 143, 73, 132, 18, 11, -51, 106]
3362A06K5n5l4j13K1K34j3j83J88m02qL47j26K56l62k1K35k13K80k8p9j40P1j01
3386a15L93k21m1nMO7m0l2J14j34r7j76M52j85L68j60j91q8QK24k37M4O6K5p3
3411c0j52O5K44k14L42l69J34K9%j84J42R4j91M23l68j57J57p2p4J24J83l32K58
3434E2j0k05K47k2P4K3q5j99J89Q5J27k33P7j55j7l7J46M9p5L7l08L39j03P2j03
3459c5K65k83j28J60j45J80l1k41J62K57j94k76N19j18j73K60j41k30K88J2j28
3480b0K1J33J5k96j4j03K85j05K46j40J49q3O8Jk25K79l26j63K98L9k03jK49l74
3504b70K13J76j95Q8o6J80j41K91k47L04l17l20J73J97l7J3k0n2J29j01j8J27
3526A07n2j7K04l77J22J74k68J91o4J13m3k44L13j70R9p1O3m0k81L35q3kJ69k59
$$ y = [106, 131, 76, 42, -71, -50, 184, 171, -12, 176, -226, -234, 113, -13, 243, -119, -140, 95, -118, 162, 134, 55, -85, -14, -115, 278, 57, 16, 11, 15, 82, 42, 10, 124, -10, -107, -283, 169, -16, 352, 192, 1, -87, -79, 145, -92, -48, 18, 43, -30, -182, -117, 127, -87, 255, -114, 20, 49, 49, -135, 7, 101, -90, 333, -35, -192, -35, -107, -181, -57, 126, -206, 52, 42, -163, 84, 62, 136, 159, 74, -125, 64, 149, 276, 43, 120, -35, -52, -89, 57, 106, 31, 68, -240, 99, -4, 68, -35, 230, -53, -181, -21, -166, 14, -17, -258, -96, 161, -33, -309, 210, 92, -81, 179, 38, -192, 96, 108, -20, 1, 134, 149, -147, -161, -264, 21, -84, 162, 22, 171, 88, 156, 157, -68, 211, -115, -278, 20, 59, -144, -145, 104, -270, -57, 119, -76, 12, -54, 126, -15, 276, 29, 333, 16, -304, -131, 66, 29, 42, 22, -30, 99, -2, -20, 107, 55, 38, 242, -135, -13, 161, -107, 84, 20, 133, 90, -154, 159, -11, 88, 17, 80, 40, -241, 94, 11, 9, 178, -81]
3550h1j6L31k66j20L4k25K83J24m1Lmk02K27j25Q2q2n2j1L73k89K1qJ5o2r2J72
3576a1L7o8rR9k16K21O3j57O4N7m46M92j2p2j45O6j9JO9m2N1k0j79K13J57k36
3602d2J50j46j6K00j03j97L06j22p6J88j55J97j40r3J30n3k3L1Kj53J06l19M01
3625G3J07j25r1p1J01j84r1K52k25J61m2Q2J44K00k64k62L47p8J05j41n2R0J09
3648A45j59J22l11L54l77M60j80k41M9J96j33q8R1r9O9K46p1j02J17o7j63K23
3670H1j77l1J6K03J10L3k84K27k78L1L4J10n5o5O6k87L08m7k7J24j53K42k56o3
3694a38O4J00N9k12J96k8k57KM25k01mml6M5K38l95J76qJ44l06K35j80K26l87
3718b46J43j5P0q1J65l37K75K91j97R6j44k2k6j09J24N9j01J99k60j16J80K9k58
$$ y = [-81, -97, 234, -32, -152, -118, -343, -60, 64, 23, 26, 22, -180, 47, -78, 4, -78, -130, -141, 232, -57, -36, -44, -29, -91, -183, -11, 26, -42, -51, 48, -168, 53, 116, -41, 23, 80, -366, 126, 114, 42, -103, -37, -56, -55, 14, -28, 23, 3, -176, 37, 194, -42, 108, -38, -54, 146, 43, -154, 152, 30, -46, 142, -13, 184, 44, -49, 81, 28, 5, 36, 38, -115, -9, -328, 73, 180, 55, -36, -107, -6, -190, -281, -29, -254, -93, -135, -53, 91, 291, 27, -235, 112, 34, 139, -2, -54, 36, 145, -14, 108, -203, 151, -226, 234, 54, -187, -138, 58, -75, -163, -72, -171, -102, 144, 73, -29, 88, 21, -142, 81, -96, -127, -111, 92, 202, 235, -49, 178, -100, -69, -35, 75, 20, -45, 21, -266, 42, -5, -32, 92, -61, 181, -75, -138, -74, 26, 85, -127, 69, 41, -216, -214, 211, 10, 6, 2, -34, 11, 249, -146, 30, 22, 166, -140, 95, -85, 141, -246, -103, -118, -48, -129, 36, -301, -26, 265, 68, 164, 20, -2, -28, -137, -13, 46, -55, 144, -116, -232, -52, -23, -281]
3741b81K45j3K4l24M45P7k62K26j52q6j28L42k48j59K94p2j20J31J92l34M41l47
3763a09J92n3K71k45k9P6K3J61m14J60j88M0j4Q5J88l02L75k08k11M01q2k13O8
3786b8j06J4J13j17N4Q8k4j07jL08J5k92K19l33PJ66J65l60K21J62k47L04l31
3809a10J37L3j92J45J0k7j45K8L88l29j84J72N3J4J62j31l48N94l01Q9k14J8N3
3832h5j5O7J97l04J40j96N1J57l8R8l47J80k3j3P9O4k40J46J54l3N7l09n0M14
3856A51l44p0L95j78N6J43l2k09J10J70J4k23M7r8J20J97l97N5L2j31Q7J46o1
3879b0J99k67kJ49l02K10L5k19J55J0j2L82m73K88J0j84K8j24N7J67L8L7r6j24
3903e8K23N8k41J90j87o6M8R5j13J47p1n5m6j81jJ61j05M39l23K13k42M7q0K35
$$ y = [-281, -36, -49, -25, -349, 96, 173, -89, 137, -15, -101, -229, 113, -135, -294, 0, -72, -192, -61, 131, -203, 238, -109, 83, 30, 301, 56, 27, 103, 126, 287, -127, 33, -155, -115, -129, -44, 144, -158, 217, 9, -202, 199, 117, -96, -28, -134, -120, -7, -124, -70, 18, -6, -113, -114, 194, 209, -83, 136, -197, -190, -24, 141, -219, 2, 164, -83, 221, -110, 27, 60, -132, 13, 23, -4, -149, -121, 267, -62, -246, -74, -21, -7, 155, 24, -324, 270, -31, 58, -156, -138, -85, -100, -33, 164, -140, 0, -196, -145, 12, -26, 72, -275, -95, -118, -131, -52, 12, -228, -82, 72, 39, 96, -213, -263, 151, -193, -263, 132, -46, 10, 153, 121, -88, 22, 192, 206, -17, 30, -68, 52, 249, -148, -93, -61, -192, -105, 41, -20, 179, -88, -90, 59, -243, -33, 2, -217, -62, -52, -64, 318, -155, 133, 143, -41, -13, -137, -80, 87, 125, 162, 66, -58, 165, 223, -18, 172, -15, -81, -33, 62, -51, 96, 25, -30, -76, -257, -258, -97, -202, 237, -86, 127, -115, -68, -148, 87]
3927H7r4n0J49j67L6j22L22MP8j64k14J57j73J28J70l67L22j11k34K74K83l71
3949e7J63j50k25J67K86k59J36n4k6k2Q1m8J59k4p5j15L2Rkj22l9J49m0L42j65
3974A01k44M77k63r1L9N8l8Q8k58J93k6J50k91J18j98J30j15P0Q1PL4J07o1k6
3998D2j25m6J09J6j4l8o4J9R3j35J44j22K36l70J34L33l12J71J15l50J47p1j25
4021b13K37J3r3n4j2M9J51k7k5k57K00O1j13%K1k5j8J99J15p0j33L3k47K90j51
4046f9J42j10p2K06j52J92j29jj11K02L9K2m13J38K20j64K8k7J8j44J6L7Q3J22
4070G3M5m80N16N8l32N2K92j26j40q0J18j34l6M5J57J06l58J46L1j3j41L93k08
4093a6j72K8K74k17M28l02k26J71M3r9K34j87n8J84O6k12j0J58J27j61j83P2p8
$$ y = [87, -7, -57, 92, -75, -39, -161, 161, 165, 243, 79, -135, 22, -151, -23, 147, -220, 102, -9, -243, 31, 314, -57, 106, -44, -269, -102, 184, -75, 61, 7, -19, -41, 40, -8, 151, 127, 52, -63, -31, -22, -24, -146, -185, -36, -76, 266, 101, -143, 334, 71, -20, 19, 77, 39, 127, -131, 62, 36, 186, -105, 13, -185, -55, -170, -100, -19, -12, 22, 129, 68, 42, -83, -129, -20, -4, -18, -56, -120, -101, -8, -143, 1, -121, 115, -255, -121, 212, -100, 71, 186, -164, -17, -88, -213, 24, 37, -56, -110, -122, -73, 78, 51, 26, -231, -31, 30, -83, -83, -62, -87, -105, 94, 209, 139, 6, 39, -208, 82, -69, 73, -37, -109, 97, -55, 137, 8, 7, -104, 98, 137, 159, -254, -116, 104, -60, -32, -59, -41, -185, -169, -132, -49, 73, 118, -362, 154, 212, -120, -68, 224, 98, -42, -122, -4, -138, -174, -129, 28, 134, -224, -78, -47, -60, -201, 192, -16, -188, -160, 114, -103, 325, 23, -203, -32, 11, -88, 146, -41, -99, 85, 151, -61, -71, 87, 214, 53, -130, -58, -136]
4116a36j4K01l3j47J69l8j19P1j75M1L75r2j21j48Q4j22M32k74l6J58j17j38J14
4139f5j20J61K06j17k41J28P8j74K20l53L60M4P2l39J49j07J75j7k20J34K15j63
4161B6k1L8j70K11j78K15r9J00k44o5K56j79K30n17K90P1j41J74J31J5M0J3j31
4184F5j40O0o3L27m17O6K3L51k78R5j89K41j6l22K28n2J13k24m9L52k44J34M3
4207A04j98O6j73K32n5m5M9J26m3O6k22J63p6P5j48n2K29r0R7p1J74l80oM17k51
4232a2n8k7Q2j05N7K06j06k6o8J6L06q4J12m50j55K93n9Q7j57J58j81J76l8j55
4256a88J07J33j4j1o5p1j33K98J31k89k90K01J82j06R9m5o4Q9pr6J08K3J05r7
4280@j97J09J38K3K15Jl62PJ49j10J87l39M48j66P3j08j88O2n5J62J09m22L77
$$ y = [-136, -150, 51, 18, -129, 40, 2, -117, -46, -221, -180, 195, 103, -18, -166, -82, -204, 228, -46, -82, 76, -41, -179, -65, -185, -24, 182, 65, -176, -48, 30, -144, 76, -277, 83, 127, 199, -140, 9, -98, 77, 60, -160, -26, 189, 26, 5, 43, -127, 84, -94, 121, 22, 122, -122, -187, 69, -110, 120, -397, -107, -36, -177, -3, 128, 143, 183, 196, 65, -75, -15, -78, 249, -168, -102, -79, 272, -6, 89, -100, 141, 125, -197, 31, -21, 92, -132, -181, 171, -73, 61, 104, -94, -28, -201, 31, -24, -69, -20, 106, 63, 129, -93, 70, -6, 69, -79, -131, 98, 8, 105, 34, 208, -172, -178, 239, -12, -70, -97, -15, -120, -63, 143, 37, 11, -57, -41, 265, 181, 293, -157, -312, -19, -78, 9, -148, 10, -171, 5, -33, -188, -81, 52, 38, 27, -38, -109, -242, 56, 187, -102, -392, -191, -9, -115, -16, -61, -125, -36, -43, -139, -31, -8, 97, 0, -197, -88, 50, 73, 288, 289, -73, -66, 83, -27, 160, -179, 269, 103, 176, 68, -120, -58, -113, 49, 158, -264, 113]
4303A13q3j7j57J52o6n1K6o3R8Q9j99K80k48J82j69j2M3J42k96K47P6k74J62L0
4327EK41l84L75l95K56j57K05Nj09k6L7j41J7J11QJ52k78m7J04J56k79J74r2K06
4351A44l00N5L81l33J26j98l3J32J31K8j30k5o4J70m3j15K56k30m1Q9J05o0k90
4374b45N45l28J23k8k5p1J28K3q5j30j82J22L44j28J0j40J25J32k14p7j61J89
4396g3Q7r2MK03k8j52J8J64j64o1jJ71j47N7M6J14L4Ml30Q6K69m16N42m2l52K7
4422c2N6J42k63mJ01j30K49q9K31k92Q7l21M12j03j37L0n6jq2J51J74k52J07L37
4446C15m36J15j13J91Nj65L0L30l23J1J75O4l1k81O7j2mK89k88Pn7j93J95l3J86
4471D4l36J54J91j57j22O7K51r0j16l8L17k28L71l05N5k65J25K88q0j11L2O9r6
$$ y = [113, 30, 13, -144, 8, -58, -109, -83, -146, -48, 41, -158, 122, -126, 56, -113, -125, -82, 60, -236, 11, 87, -187, -25, 5, 246, -138, 237, -158, 98, -59, 146, 151, 42, 16, 53, -88, -71, 40, 48, 200, -78, -125, -21, 135, -144, 30, -62, 144, -156, -101, 280, -53, 73, -125, -158, -26, 105, 133, 3, -22, -86, 84, 41, -74, 182, -48, -89, 0, 105, 45, -245, 300, -28, 95, 67, 42, -29, 99, 122, 37, -93, -275, -153, 191, 63, 73, -67, 58, 190, -24, -101, -262, -73, 14, -78, -74, 129, 101, -51, -33, 131, -33, -94, -95, 76, -71, -14, 32, 146, 180, 184, -146, -60, 209, -207, 335, 293, -59, -32, 24, 166, -97, -101, 0, -130, 119, 30, 261, -31, 56, -265, 147, 44, -93, -63, -119, -120, -202, -51, 123, -129, -22, 315, -121, -6, -119, 72, 77, -88, -58, 272, -51, -40, 135, 199, 168, -113, -46, -58, -62, 227, -61, -54, -111, -304, -109, -142, 44, -292, -138, 53, -104, -226, -159, 92, 2, -114, -152, 165, -63, 308, 3, 58, -207, -82, 206, 126, 15, 47, 116, 20]
4494B0L4J9o7q5M0Pk1K44j11k5j50M0Lj18K43n9L1qk30J82R5j15P2M7O9k73N5
4521f1Q7j25L42m7r1j18k5j91J57J72k43Q6k6J70j07K6j72J9J84l61L33j45J45
4544IN8k63K08j2j5K3J9p6q1Q0n7NL23j12Q3j97M9j00N6K6K5n6n3L0j2q6K27K5
4572A26q0k3k64K38L4m5PK35j56J1Mk57J23K65j64Q2j31j69L55j47J1j02J17k40
4596a70J41LO2j05LL69k79j98J54K63l40K23m9q5J2j58K19J46k74q2K75Q2k56
4619d4k11J14J03M7j14J69j3j05J37j1lj46M2O2q4m4K00J40l4p4k74M2J83j81
4643i9JR5J18j87R4K5r8K42j75N5n2L4l6p0J76k35J56K8j61q5K15L4k05Q4P4k0
4669Hj09K8J39J5p9M0j84K18j89P7J43M0m24K13O5lk22nO7J03R2P8k36j09K59
$$ y = [20, 54, 73, 6, -79, -39, -32, -53, 191, 80, 55, -95, -55, -52, -170, 73, 14, 45, 37, -193, -11, 84, -31, 41, 88, 157, -116, -61, 26, -99, 243, 196, 105, -13, -38, -229, -72, 100, -143, -57, -83, 87, -20, 6, -166, -147, 37, -324, 9, -136, 9, 67, -196, 12, 0, -15, 8, 27, -49, -130, -50, -107, -102, 221, 109, 192, -5, 44, -56, 0, 26, 51, -5, -58, -28, -40, -126, 101, 126, 46, 23, -241, -3, 31, -14, -7, 228, 72, 83, 87, -170, -47, 218, 54, 136, 5, -164, 191, 44, 55, -47, 70, -170, -29, -26, 36, -69, -66, 303, 24, -174, -20, 243, -97, 126, 77, -8, 4, -154, 65, 211, -63, -145, 130, 212, -44, -255, -141, -38, 9, -105, 64, 51, -54, 83, 72, 69, -77, -35, 27, -57, -101, 99, 239, 205, 131, -143, -101, 82, -99, -98, -3, 115, -72, 22, 47, -51, 191, 16, 71, 19, 53, 17, -53, 123, -112, 44, 72, -89, -174, 41, 75, -130, -46, 28, 8, -101, -73, 66, 81, 2, 42, -142, 76, -113, -36, 107, 147, -277, -64, 1, -2, -224, -229, -162, -59, 33, 111, -125, -234, 25]
4694B5M7l1p7K30l10K13j23K58k94N4K0j17J68J09j76L32k74l41L45J41k18%M3
4717B4k03J18R8k29k8K96j46L1K9K03l6k50J69j80K57j61J49L2n62L64M0m07L83
4740il8J70p9j35L1l8J14J97m80K71Q0J58j66j15J11k85L59l3j0j62J86j48Nj84
4764b00L70j52j03r3L07q1m5L2p4J46k78K62k9k02p6L63j70J7J95l24K09r5J15
4787I4j53J53j6j19k10J91K11j33j22J44k69K93k23j26K56l8K24k33Q1j0j15L40
4809B20n14J88J21l4K13m4p1K6k25L44j51p8RJ04j24k32M93k63l10K08K43q9J7
4832E1m3j02K63j04m19O72m62j12O1J43j13N3M4R3j20j04J23M7l2j91K02q8K15
4855G7j32O1n5j36K70J21k98j52K40P1j87J49j17l4Q4J35J01j44Q3j98Q1k8q1
$$ y = [25, 72, 41, -36, 194, -116, 97, -26, 232, -62, -8, 12, -105, 63, 172, -4, 328, 54, -287, 58, 199, -19, -19, 24, -179, -61, 37, -192, -220, 76, -70, -39, -10, 193, 157, -93, 76, -104, 153, -8, 141, 173, -389, -25, 15, -392, -9, -47, 123, 44, -91, -60, -98, 16, 213, -267, 4, 84, 242, 76, -39, 72, -213, 146, 113, 103, -59, 127, -21, -16, -200, 170, 18, -85, -178, 129, 48, 3, 35, -39, 107, -171, 91, 62, -140, -216, 147, -23, -6, 189, -135, 74, -21, 94, -59, 94, 78, -41, -251, -60, 151, 18, -104, 40, -229, 64, -159, -285, -29, -67, 157, -76, 5, -5, -120, 220, -294, -106, 15, -19, 194, 150, 79, 105, -120, 224, 73, -5, 4, 108, -16, -248, 245, -18, -328, -120, 123, 34, 51, 8, -94, 169, 65, -354, 318, -144, -256, -195, -52, -165, -112, -68, 25, -95, -199, -76, -29, -61, -252, -50, -138, 77, -55, 6, -49, -185, 85, 206, -92, -244, -4, 67, -120, 29, -88, -122, -38, 97, 198, 54, 137, -61, 20, -8, -89]
4878h9J02j89J83J01k74J06J20J4j44J43J7q1Mj46K02p7Rk99L78P4k34J08j39
4901a11j68J10K03Q0j66l8L01k17P7Q8k72K86l26J52k02M5P3J24L5K0k1k93K55
4924C5J9o3k12K85j05K01M6l22p0J71J29k58J34q1L9J92j22N8q2%J40j46J8K14
4948B20m8j87J14j88J79j33K07k4N8j36j4r1J00m6j31K73j73J01k28J4N3J8K69
4971B07q8N0k80P8l8K31Qj57J0MNL3m3j8K01k61j03J37J60k29n2J69o4L7M4k68
4997b27K20jP9K7j76Q1l6o2Q4J13j33ol7m7J04L9j64L18k11j93L9J39N5K80l18
5022c3j92O6K73m0j78M6p4Q1K9K17j84J45Q3k66Q5j6k11M53Nm45J69j03M8R5j31
5047g8K44k58K75j67p2NJ61q2L9R1k80m6J24O5O6J18r4R7j96j18O9M00m42k7M6
$$ y = [-89, 13, -176, 7, 108, -166, -60, 60, 74, -70, 73, 90, 9, 13, -133, 69, -8, 1, -298, 80, 154, -80, 28, -111, -279, -169, 34, 114, -52, -90, 211, -6, 71, 159, -113, 173, -153, -1, -203, -158, -85, 39, 74, 94, 73, -220, 35, 54, -9, -221, 64, -41, 160, 206, -116, -186, -15, 114, -144, -10, -91, -52, 140, 18, 76, -6, -6, 134, -12, 6, 220, 172, -15, 99, -89, 90, -43, 164, 140, 198, 62, 48, -43, 57, 11, -120, 153, -20, 81, -147, -133, -80, -62, 207, 119, 169, -111, -33, -71, 160, 168, 11, 21, 25, 30, 63, 20, 2, 203, -58, -161, -24, 136, -93, -145, 24, -40, -3, 41, -227, -7, -8, 71, 98, -78, 3, -33, -95, -11, 102, -31, -37, -74, -121, -17, 22, -142, 176, -35, -228, -189, -50, 5, 285, -33, -225, -159, 114, 74, -104, -58, -132, -51, -22, 195, 11, 156, 239, -27, 58, 42, -169, 284, 289, -156, 13, -90, -42, 53, -78, 166, -92, 183, 16, -56, -51, 110, 28, 67, 158, -122, -168, -44, 21, 87, 205, 111, 208, 12, -106, -37, 363, -79, -106, -60]
5072f0K01j97M7O3j5J52L5j04m67L87K41k91J3M6P4k11Q6p9J39j21J81j93R6j22
5096i9o2J47j64K98j31qr2L13rJ7k08n2P9jm7K50j90O7K19k02k95j00L53jj57
5121g5J30l9j9R5p5J6o1M6o4j7p4N7J26J42k1j72r9kj74J11J01j7J65l8K71l22
5147ij32L30k30o7M6N3K52l12Q9K8O1j8k19L21j02J15k13K65k44M4L68n02o2j63
5171c01K41L9O6k24M2J00J46n6k00P6L1n6L15k66J05j07r8K77k9j91J40j23O2
5194a1M1j52k9N5K69p8J3O1Rk56j6J65P2q7j85k2K49rk80K22P1l52J03j88K44
5219i1K0k7J2J61J43O6o26N53j26l04J25p1J26N4p9j57lK86m4k56L48O9j05j69
5243i5J46o5pM2o4K84mk27j20L31l44K51k5j83J65j75J69j76O7j1J10q8k5J21
$$ y = [-60, 141, -56, -9, 54, 39, 191, 226, 122, -345, 42, 283, -8, 5, 51, 125, -86, 0, -79, 60, -61, 120, -73, 23, -99, -161, -14, -178, 120, -11, -19, -111, 202, 193, 210, 2, -50, 29, 28, -19, 231, 41, 108, 327, 125, -170, -270, 83, 82, -75, 55, 16, -3, 92, 17, 33, -28, 18, -46, -63, -137, -80, 46, 188, 167, -5, -104, -106, -280, -169, -68, -85, 80, 42, 313, -9, -141, 189, -41, -108, -62, -9, 243, -69, 20, 48, 109, 91, -128, 193, 91, 206, -7, 258, 14, 58, 426, -76, -138, -301, -60, -21, 45, -179, -137, -37, 109, 53, -147, -71, -40, -96, 219, -47, 58, -49, -147, 130, 101, -90, 50, -73, -11, 30, -122, -151, -96, 173, 95, 108, 169, 178, -78, -94, 71, 143, 56, -129, -151, 98, 89, -191, 31, 102, -250, -147, -335, -91, -71, -98, -86, 75, 218, 284, -342, 211, 85, -219, -94, -165, -39, 15, -64, -221, -224, 62, 18, -238, 110, 179, 74, -95, 51, -14, -21, 21, -43, 241, 237, 10, -110, 221, -123, 128, 103, -80, 85, -90, 79, -97, -30, -41, 69, -19, -44, 77]
5267G7k23J69o8L3J14j94R4k66J91J32k5n1m7k79L33L02l27Q7l6k5j11K8J07J3
5291B8j5M8J0nL9K59l38O2r2j01J0J24j84L32j21J44l31m0M0L59k79K24j23j13
5315f3J07J9l45L73k43J47J25k45K42J10k07k35J83p2Q2Q5K20m59L3J60R1j05
5337Co2K21lk52J6m0k41N95l91J36P0j04L10o06M76j97j63J17j26K34J69j75J21
5360A08k68K51o2L7k82K26N9j79J13K16k30n6j2J17j30J65j22o6K89j96q8M8J01
5383C9P2m2j5jN4n4m2P1j77LJ32R0j25k03K13K5k58M06l21J39j99n7L10O5K6p3
5409G8j04j5j10N1L02m49J36J35j5J98r0j09j35M30j83k33J10j08o9M50l36o5
5431a31J89j33J57k20K64j23rJ2L2R4q5K6M7Lk6j0j2M5k79J33J05j08j99K89q1
$$ y = [77, -146, 23, -45, -12, 102, -92, 2, -264, -73, 59, 34, -17, -64, -343, -10, 292, -35, 52, 16, -9, -120, -92, 15, 28, 13, 61, 71, 66, 105, 364, 26, 88, -4, -105, -95, 29, -155, 177, 56, 200, -131, -171, -131, 228, -51, 173, 50, -63, 44, 63, -282, 91, -152, -5, 120, -125, 117, 227, 20, -215, -32, -104, -22, 63, 283, -176, -143, 17, 108, 3, -59, 162, 159, -93, -77, -117, -358, 237, -154, -18, 52, -52, 258, -348, 128, -69, -232, -115, -241, -7, 162, -13, 108, -160, 91, 29, 66, -216, 10, 69, -110, 3, 219, -11, -67, -79, 38, -92, 73, -49, -115, 174, -22, -110, -62, 39, 111, 69, 54, 53, 107, 53, 11, 82, -95, -92, 40, 130, 5, -198, 15, 40, -218, 188, -133, 6, -193, -250, 60, 125, 151, 78, -26, -41, -151, -100, 202, -247, -111, 24, 9, 207, 117, 8, -127, 303, 120, -113, -3, -111, -180, 270, -66, -131, 58, -75, 82, -138, 126, 3, -6, 6, 38, 132, 47, 73, 120, 123, 97, 87, 75, 120, -159, -26, 79, -29, -228, 61, -20]
5456b0j36K1J40J08l78N09k87J53j46J50k20R1J5K13m61M25j30k73K32r7NJ2l4
5479a08L03n7p8j80q2J46k9J70r4K9J07n5r5o6N3K0k27L81J10l5P8j53k8q8p8
5504e6J43r4m2K14l3q6j78J23J59j82Pk7J09q9p9J08N0j48J57j26R1l7j38Q0O0
5529a4q3J35O8Rj13K58m35L26j38j93K1J73K8k11M19k52J27pm1n0Q5k60jJ01L5
5554a3J88l22M3J06L1K23k54j4J29k25J21j30J18J48k48K97l10K35j03R9j19J15
5576A15j81o6J12K9O5j74m2J00J15Q3m04j6J97J76j36j78J96j83J05l9M9m6qJ35
5600DJ0J92k83K8N8J30l75K43K90l51K36l88J65K73k02J02m01L14M7k06K74k55
5622i5J46k75J26K67j17j04L72l11j43J27m0J82k85J21N6j80J83M2J82k89j00
$$ y = [-20, -156, -135, 5, 113, -265, 244, -43, 110, -36, 114, -106, -15, 0, 213, -248, 177, 47, -226, 6, -91, -86, -74, -108, 195, 138, 60, -120, -202, -56, -85, 85, -9, 20, 127, 72, -23, -89, -36, -16, -243, 138, 248, 213, 291, 138, 110, 22, -56, 87, -7, -49, 165, 132, 46, -132, -9, 150, -32, -25, -52, 57, -32, -111, -3, 47, -101, 56, -70, 21, -16, -154, -74, -14, -97, 38, 106, 115, 2, 260, -175, 151, 13, -180, -159, 14, 42, -169, 250, -2, 125, 118, 77, 27, 112, -148, -149, -48, -13, 175, -147, -104, 2, 33, 256, 2, -12, 117, -108, 13, -117, 1, 149, -99, 198, -112, 123, 20, 119, 0, 115, -66, -132, -20, 9, 74, -100, -142, -42, 73, 156, -248, -264, -67, 109, -27, -205, -9, -192, -87, -126, -77, -123, -131, 4, 14, 206, -77, -49, 9, 139, -236, 7, 297, -54, 182, -206, -41, 232, 30, 132, -269, 45, 92, -114, 160, -95, 51, -224, -98, 169, 52, -52, 320, 9, -134, -7, -47, 135, -150, -29, 27, -153, 30, 72, 254, -35, -135]
5643a35p8K07nK37m93rN65l32Nj71L80n03N41mk2pk03J61l47N15m57K43j94n1
5667a57L05k65K25k83K69m48L37K7K81m80J72J3J2L0l8J48k92K50k81K2K71j84
5689f6K2J9K06l97L24o1J13k17J4J73J43l06j74K28L7O0q0k35J48J52J1l55J55
5712h6J06M2k48M54j12n25M80p1j78K0N5p4M31j11j32P5j36K21j69j0j53K57j43
5735gL7J27j83K42l79J41m0L04j93q4J71k06K33P7k09j66j55K83kj49K95j20J5
5758C2M6j61j33J21J09j47K49J52j22l67K93R2l16m0J87rQ9Rk7j31NqQ6o5P1J37
5784A52j94K09k76L71k67M2p6M7J65p0J73l54K5O8M7j56N0K38n53K20J09J10k44
5807a64L53p2P6k61k05J92N2J62j26rN9J13o7J75Kk12k02J51J99k29R2P2l8k19
$$ y = [-135, -213, -6, -11, 226, -267, -276, 289, -43, -38, -209, 171, -332, 209, 205, 183, 176, -27, 134, -213, 302, -155, 88, -106, -157, 148, -117, 108, -175, 94, -354, -17, 10, 291, -189, -17, -4, 8, 38, 0, 148, -144, 106, -175, -153, 118, -66, -44, -25, 181, -216, 108, 47, 160, -57, -43, 130, 273, -33, -207, 21, 58, 118, 38, -197, -49, 103, 114, -241, -86, 20, 62, -186, 268, 156, -369, 111, 40, -138, -118, -63, -137, 294, 183, 51, 126, -10, 211, 42, 32, -121, 136, -7, 30, 157, -26, 216, -163, -22, -62, 242, 49, -35, 136, -70, 163, 240, 31, -135, -290, -7, -9, -158, 137, 17, 32, 78, -83, -216, -95, 14, -133, 116, 268, 146, -221, 72, 164, -152, -192, -5, -14, 75, 84, 57, -74, -69, -77, 9, -56, 15, 152, -42, 167, -109, 262, -5, 37, -39, 8, 173, 103, 276, -78, -53, 15, 62, -94, -44, 194, -359, -139, -30, 80, -164, 189, 117, 193, -68, -273, -81, -29, 133, 7, -2, 57, 170, 103, 278, 280, 68, -134, 17, 216, -13, 79, 151, 113, -106]
5831a06L9R7J8j10J61n2n3j73K67j17L3Pl8p2Q9jJ90l90J39K3J87J4j65L0M0J17
5857A74j81J09q5J50k1k45j29J65L45m54m5K96Q6l4m8o6Q9j37R2J07q1k96K08
5880aK42k57l6k4J29o4N9k65K16N1j40K10k61J33o1p9K28N0j6j41J10j88J3N6
5904c6K02j68J22j71J53J34j25j4q3j39J9J46k8J85l26Q7j41J81r1j71J13L63
5926B12l19o7OK37O5j31J07o2q1K17j81j9k3K08m50M35r8j43j8kL0J29n2j84K73
5951H9J24k42J02J40j12p2j91L44Rj99j7j5j50K48k30K12j60K8J0j2Q6N1m7L2
5975B8L25l90N0J52j09K9oj33K45j27m3l1l9nr3L81k39m2N4o1J42K7L9k56j06
6000b08L21k11J3l4j21J91l5q8L30k63j69L80k60J70L0N3m8k40R6J35k7k27K08
$$ y = [-106, -67, 30, 48, -62, 99, 47, -6, -179, 88, -29, 4, 11, -27, -99, -10, -11, 179, -211, -72, -49, 138, 152, -13, 17, 57, 174, -7, 102, 17, 167, 146, -99, -228, -63, 282, -172, -217, 79, 165, 131, 83, 17, 106, -31, 61, 168, 87, -209, -1, 241, -16, -52, -76, 53, -11, 48, -217, -1, 50, -90, 120, -141, -8, -69, -148, 80, 130, 114, -27, 83, -105, -92, -36, 166, -2, 120, -51, 102, 236, 111, 97, 14, -125, -106, 40, 12, 197, -129, -42, -183, -2, -93, -264, -151, 212, -107, -174, -168, 69, 134, 3, 110, 48, -33, 184, 3, -16, -39, 169, -281, 154, 56, -87, -105, -107, -77, 52, 0, -184, 89, 213, -29, 73, 213, 101, 29, -162, 182, 191, -8, -25, -40, -190, 58, -172, 40, -120, -92, -82, -94, -8, 43, -4, 28, 353, -37, 13, 165, 56, 85, 79, -54, 191, 64, 21, -10, -49, -54, -147, 234, -5, -47, 7, -54, 88, 115, 154, -102, -208, 113, -98, -85, -119, -240, -49, -84, -172, 158, -105, -274, 106, -154, 16, 46, 99, 51, -189, -93, 42, 15, -212, -4]
6023dp8O1L8m3Q1K35l27j8J77r0NO1k0j21M5j78K67J00n6J26l96j8K0o0J72J11
6049I0LQk38J46mK1k32K83j45o0J59j64J39K9J2m5k33K70N5j98J39p1r3J92Rj00
6075b8Q9n1l8K56j50k6K11k03k78J59l4J3J13Qj1o5N8J06j78q3K09k04l4M16k48
6100Gk04R5k5J99j64Q0J95j95J40r5k4l5J46J24k77O6j39K60k13Q0J51k65Q6J46
6124A39j35M5j11N3M5J4j16J3K73k43r3K45j61K79j03j94LMN6j64P4J04k0m0J49
6149A16l73K36j28J58k20J90l4j00J47K16k78K25m7j25R4l24L29r8R8k48J83R
6171B6j36M09k19j25nJ7J73l07m2K82j75K82k15P0q3N3K57k84N5N6k80J58n5K31
6195A43j69j53p8K37n7K42k2j44J93k7j99J62k82J61N7J7L5k07Q0lP0n9q1j36
$$ y = [-4, -82, -21, 17, -26, 55, 290, -37, -55, 122, 32, 37, 98, 78, -43, 2, -176, 91, 191, 135, 261, -135, -153, -133, -193, -21, 90, 93, 101, -137, 9, 5, 26, -206, 77, -68, -128, 31, -133, 6, 35, 47, 2, -231, 39, 94, -104, 35, -36, -129, 63, 72, -28, 61, 10, -28, 228, 78, 52, 263, 60, -218, -59, -93, -80, 33, 41, 30, -35, 23, 129, -49, -132, 77, -127, -161, 255, 7, -197, -102, -127, 72, -92, -12, 183, -12, 128, 33, 9, -26, 120, 244, -33, 33, -106, 154, -59, 21, 172, -93, -7, 139, 4, 49, -62, -9, 36, 50, -66, -53, 220, -23, -116, 129, -32, 247, 144, -50, -47, -43, 13, -151, -77, 27, 7, -33, 116, -257, -21, -149, 9, -211, -21, -55, -155, -8, 208, -70, 155, 108, -17, 77, -247, 82, -16, 82, -166, 17, 26, -110, 299, 80, -45, -50, -33, 140, -167, -209, 73, -102, 180, -35, 35, -48, 5, 262, -22, 33, 89, -191, -33, -88, 143, -26, -179, -257, -20, -77, 165, 143, -1, 192, 165, -34, 128, -154, 7, 64, 81, 116, -91, -11, -14, 56, -3, -84, -220]
6219b20K41j79K36j66P9J44k8J82l04j09O3J53q7j77J15j15J93j58N5J25QN5k09
6242a03R9j8J8K18l54J83k10j65J89J04j17k2M3J38R4j16J37J74k03Q8k79p1Q4
6265h9O2k2R7j01K8o4M4P7k90J10K3R7K29k10j72K53j44Q6P8k36J61Q3o6mK4j30
6291g6O1L9j91l6L03j21j18J70Mj04j14J17M2P6o4p1M9r2J83j23n2Q5o3P7J54
6316A35m48L31r0K08l61K45k6l8J46k59J35Jj68M33k10o2j4J72j34kjk58K82L5
6340E2J1J17j79J62m9r6J09j26J09j96rl0P1J55k49J49J8n6O1k22J69l8J66k67
6364a68J11m1K42k89R5j60K31k55N7P4K60r1O7m0j94J20j03J68m1K7j30R5j84
6387a49K54k49r6L67j67L46l31k70L83N9p7r2J2j67kRK49r1L6n4J51M6j85j58
$$ y = [-220, 21, -158, 78, -88, -9, 135, 107, 289, -15, -124, -61, 92, 5, -172, -57, -172, 21, -137, -82, 43, 51, 106, -103, -4, -22, -4, 214, -140, 43, -167, -332, -143, -39, -156, -178, -135, 3, 97, -19, 118, 292, 89, 177, -102, -173, -89, -27, -49, 48, -53, -25, -89, -45, 32, -258, -148, -125, -28, 201, -9, -181, 72, -72, 14, 92, -144, 17, 100, 34, 30, 54, -76, -15, 24, -167, -203, 100, -21, -139, 31, 35, -69, -183, -66, -24, 52, -12, -83, -34, -126, 57, -66, -118, -33, -96, -19, 135, -313, 18, -72, 136, -225, 20, -6, -44, 102, -157, -22, -21, -189, 244, 34, -28, -42, 130, -4, -6, -7, -265, 17, 52, 63, 180, 1, 163, 114, 18, 127, 1, 110, -86, -95, -125, -54, 101, -148, 1, 19, -37, 24, -198, -29, -67, 99, -168, -57, -98, 144, -145, -50, -210, 21, -234, -177, -103, 157, 66, 133, 93, -101, 19, -84, 84, 43, 70, -60, 35, -149, 105, -144, -240, 127, -40, 306, -25, -295, 88, 147, 70, -22, -10, -177, -179, -170, 79, -12, 24, -30, 121, 167, -18, -176]
6411a76j1n2K04j19K70k45L14q9j35k9J89r9j44K05J53l35J94K47j12j90q5J35
6433I0j90R0j00N1k69K88Q1j55P3O9N1r8j26J01P6j63K04K0J42j98l0q2N3j04
6457a26L94l08R6j13o4J26lJ24k63K59r8j60N8j0P0J27k29M34k04P7o4j6r3J0
6481B4j65j19L46k86K37J20l2j37j51J6M1Q9J11L7P1k78K85l45J00K11k64J72
6503H3k02QL67k28l4m9j25K14k07M08k41j54L18L5l56J18K99n14K81j64m4P6K06
6526I5p0p1J67p3l48L74k12Q5K2J91m9k44K30l3k07L59k42L2J38l07J53Rk4n3
6550g8N0k2p7J83r9K5n7N0k62J11P8P8l13K40j27M06K8k53J85n7M8j08K8j66K99
6575A90N8l51K19R7j47n25L31K39k07K67l00J60l6k52L80Kp0l38M29l5J4j06J7
$$ y = [-176, -187, -239, -35, -154, 116, -129, 185, 96, -39, -68, 121, 22, -122, 83, 236, -99, 95, 342, 230, 40, -45, 90, -100, -10, -110, -59, -328, -40, 41, -114, -41, 28, 79, -19, -145, -44, 32, -131, 73, 93, 235, 37, 7, -75, -22, -126, 268, -40, 56, -57, -121, 5, 2, 126, -137, 122, 24, -136, -78, -88, -18, 109, -120, 314, 110, 187, 123, 107, 14, 24, -141, -260, 86, -200, 37, 157, 125, -12, -163, -147, -106, -17, 94, 131, 202, -76, 209, -136, -36, 175, -89, 83, -119, -111, 256, 28, -6, -55, -180, 34, -173, 235, -6, -160, 158, 193, -163, -45, 254, -260, 21, -143, -187, -111, 95, 25, -46, 121, 48, -300, 74, -138, -53, -31, 160, 111, -133, 97, 64, -143, 216, -26, 6, 144, -163, -10, -1, -25, -78, -28, -50, -127, 56, -43, -18, -75, -25, -287, -176, -98, -20, -333, -93, -220, 186, 214, -39, 146, 89, 137, 29, 57, -109, 190, 248, -103, 116, 213, 66, -459, -128, 111, -96, 171, -129, 31, -5, -257, 123, 125, 55, -283, 146, 111, 125, 19, 36]
6598C6Rj95K51j46P1j71L45j94J02k68M07k03M8j28J32k80K22J05r6Q5j3p3k6
6621B0q4J9K22k94K52L4l1o0M0J4k05J96n0r0J78j74j53J27N9j00R5j03P2O3J92
6646B39n04J84j35N4K28J82n53J20K31J0k34K68j71q8J61P8k3Kk47R8L28l5k03
6669a0k29k2L10j6j78J82J32p5J2m43J99K40k23l28N51N1l16L4L20n9l16J04J94
6692A14n9L2j25mL42l5l35R7j27K8J13j07O3J12k81K14j75L52k96J43pP6j92J04
6716D7j73J28j24J19k5J74kj97R6l11L29o6l9r3M98m82O8m1J83R5l59J28J00L0
6740H3j35o2J88m2l00K74pJ86k3j13k00P6M59l49oR6k40P8N9J50J14l10N1k84
6764b57L40q4P4j72q5Q8R5J32M2k81r0J57R5k40J19N7m8J50K4p4j53o7K63j1l11
$$ y = [36, 45, -150, 101, -45, 26, -145, 200, 6, 108, -160, 247, 44, 92, -36, 96, -184, 38, 143, 47, 132, 119, 46, 20, -64, -45, 177, -117, 135, 169, 138, 78, 118, 132, -73, 123, 73, -17, 161, -13, -166, -39, 20, -80, 15, -88, -16, 47, 239, -265, -81, -216, -162, 66, 248, -305, -185, 46, 56, -178, 90, -81, -169, -8, 70, 47, 49, -198, -100, 228, 193, -10, -239, -261, 49, 33, -145, 37, 169, 94, 106, -337, -138, 102, -121, -449, 102, 153, -163, -129, 191, 132, -184, -80, 114, 55, 87, -38, -42, 300, 265, -70, 27, -100, -72, 41, -66, -3, 109, -172, 42, -133, 219, -77, 66, 59, 135, -57, 47, -126, 2, -122, -3, -28, 146, 144, -53, 43, -268, 61, -5, -44, -137, 361, -121, -53, -94, 89, 184, -175, -47, 53, 83, -52, -114, 74, 32, -268, 6, -1, 185, 162, 49, -151, -75, 384, 35, 29, 125, -115, -37, 22, 172, 286, -24, 27, -257, 83, -1, 73, -99, -184, -96, -1, 131, 173, -108, -198, -41, 54, -186, -67, -10, -58, 92, 116, 42, -111, -178, 85, 74, -237]
6789b37J68J58l69L13J31m34L16R2k57J28L2r9L08k73J42j3k41K6m9O5K34r7j26
6812h2J96j97Mj68J19J81j83O1q6K19J8l03L34R7n2k4j72R6n3m3R9j72K64k71
6836a18R2Nj51j23J63k3J54m9j9N7k5K83j14r6J36k77K52k68J23Q1o7R3j22j71
6860a84K99J6l50L8J23j77k4K66m6j72J83j01J65p8J81l50L26m23K18L06l66K44
6882I4n6K8J8k17k18J83JJ06Kq6J20j96L98j47J54m4k28K9j7r0K77k44J34K56
6906B57m32Q6J26J72p2o4J49k26J32j90J7P3K46k37k19K74k17LK49k27J6L2p4
6929a26M0Q7Mj78J52l3J10q5j20N5j59M12k17R8J08k56P6Q1j47K3j56L89j84J03
6953G7R3k74K76r0J69k87q6J08M6JM7J2M3q5k41K33m9L1Q9l44L67k48N8O8K3P5
$$ y = [-237, -69, 89, -280, 33, 164, -270, 46, 138, -119, 9, 41, -58, 250, -23, 119, 106, -135, -109, -158, -93, 141, 44, -82, 114, -83, -79, -247, -128, 53, -130, -69, -155, 64, 82, -221, 113, 210, 158, 134, -38, 58, 5, -38, 61, -111, 153, -118, -26, -21, -172, -295, -132, -155, -1, -50, -69, -12, -37, 246, 132, 36, 172, -105, 147, -121, 2, 83, 16, 109, -13, -184, 115, 131, -219, -181, -58, -235, -259, 7, -39, -211, -28, -129, 36, -42, 139, -211, 115, -308, -90, 216, -150, 94, 38, 66, 84, -133, -351, -168, -167, -61, -59, -145, -25, -221, 177, 30, 184, 140, -88, -59, -76, -166, 111, -133, 1, 257, -175, -89, 37, 209, 137, 73, 222, -4, 128, -62, -45, 28, 274, 37, -182, 92, -125, -122, 127, -100, -84, -52, -126, -86, 1, 5, -173, -21, -54, 56, -29, -149, -94, -253, 159, -58, 40, 148, -108, -32, 49, -98, -75, -231, 158, -26, 77, 170, -104, 172, 82, 251, -36, -122, -14, 32, 33, 80, 92, 135, 50, -191, 42, -7, 24, 113, -231, 136, -112, -54, 14, 37, 112]
6979A12m7M8n4p8R2k3k19L11j74J30J95j40K8l4j04M1j59j4M2N4J50O2l13M3l4
7004h5r2J34o7L9J29o2l75K68K13k33J42J56k86j49L79J02l67K65k37L90l50L69
7026B83k90p0K21j05J41k06m2J91M2P6j44j92q6J11L06k85J05R6j21J14j21k22
7048a98M48l63K10j27P3o0j22L39q5m3J14k13o1K12m4n1j07j5q8M02k39Mp4K8
7072f0J67m3j28M0J28k00Q6O2N0k92l1Q6M8K42k32J31j25n0K09k29O5j73K87m0
7096bn0J00l14K82K01k65j10K73j30Q0j54P6Q9m0j22k7O1o0J22o3j59L67j58J04
7120A01M9k50O6rP6j93L18j63j55K04R9p9j00K04q6J1j82J00L6j64P7J42J63k85
7144b0j91J17J55j45k4K25j84J72j77R3N3j63l0J54R6R0n14L50j36M7N6n1R5J84
$$ y = [112, 65, 113, 59, -19, 73, 50, -169, 142, -32, 98, 293, 153, 181, 147, 43, 84, -75, -89, -47, 7, 157, 219, -94, -51, -85, -177, -43, -110, -71, 58, -4, -379, -111, 102, -131, 11, 167, -119, -268, 111, 213, -154, 111, -126, 264, -86, 283, -7, -77, 144, 39, 180, -26, -68, 123, 165, 241, 97, -95, -181, -70, 236, -49, 56, 152, 31, 145, 24, -198, 250, -113, 97, -30, 43, -17, -139, 200, 115, 72, 186, -27, -88, 124, 80, 29, -78, -93, -181, 221, -18, -14, -88, -60, 107, 64, -64, -24, 104, -96, -10, 52, 102, -190, -221, -135, -87, 155, -77, 54, -71, -121, 88, -141, -76, -249, 38, -2, -52, 48, -266, 16, 217, -48, -158, 115, -15, 65, -89, -13, 76, 36, -86, -113, -52, -112, 10, -53, -212, 155, -3, 101, 150, -100, -34, -43, 33, -160, 158, -5, -160, 44, 143, 64, -36, 168, 82, 93, -89, 11, 47, -117, -40, 102, 265, -20, -211, -94, 61, -84, -108, 117, -67, 105, -72, 21, 74, -89, -119, 35, 131, 221, -293, 57, -79, -32, 24, -27, 68, 252]
7168B52k48n5j14K0L17j79kr4J2Q5j17n5M05k32j47L84l98L27l60K87k42lP8m9
7192a28J20k3m7M4M8l11L21J01r0j44J90k16J90J14m02L26n3r8K9K1L5oN8j30
7216e1O2K6r1oJ54k58Q0K31j05L05k88mn0l17J94j7O1k2L08m13J44P9M2k77J92
7241b1M7j08J95q7l21M63j05n0R7o1j98o0J31M07k20M0j92q6R8q2K79r5j59M1
7265d7R1o4J41L0O5l94J49J06Q8p7k09L21l69R8J57J34k76j08R8J32q1j1K2k50
7289b54K83K31k34K37k34K06j39lJ53k22Kj64K64M9j95k42M68k59N5o7O2j47L9
7312a11J47J24k89N5J51j19k65L70P9k09L42l60K1J88k28K52k06L2n8K4j78K16
7334b2j50Q6J44L1j75o3K77l46J41L19j54j04K41k22q5K41j82k0K5J1J29p2L01
$$ y = [252, 4, -51, -165, -145, 172, -7, -9, -103, -91, -6, -123, -178, 227, -5, -152, 232, -166, 161, -199, 88, -154, -157, -79, -128, -8, -31, -78, -34, 14, -297, 24, 125, 35, -109, 81, -135, 55, 169, -233, 93, 40, -58, -29, -8, 27, 21, 79, -51, 11, 37, -54, -60, 94, -164, -84, 147, 42, 347, 59, 55, 5, -312, -118, -135, -74, -96, 212, -201, -57, 22, 64, -213, -21, 26, -82, 113, 26, -295, 168, 63, 13, 110, 49, -149, -209, -78, 329, 109, 149, -43, -129, -31, -113, 166, 71, -88, -47, 44, -20, 121, 151, 216, -178, -29, 77, 165, 88, -121, 200, -169, -71, 86, 220, -56, -164, -66, 66, -15, -26, -4, -254, 29, 260, 26, 263, 29, 235, 96, 93, 246, 24, 26, -138, 126, 175, -20, -262, 206, -53, 2, -65, -3, -150, -111, 36, 160, -129, -74, 77, -42, -307, 63, 142, -67, 275, -85, -64, 124, -104, 148, -58, -26, -84, -60, -238, -22, -172, -86, 58, 89, -86, -149, 128, -218, -77, 242, 88, -16, 225, 3, -82, 159, -23, -43, -18, -7, 122, 50, 351]
7357C51l34L8n1k03K43j75lJ85o9K99q6j82j45K1M6J5M3K84m12L00j40k86K8L39
7381A06j87J64K2j30k1k3l4R0R1q4j0l4j22J24l4l6J15K29k73J13l7m4k11L19
7405I3M7j28p0LJ06l14K20J8J6om8k26K95j36J04J41J24j66o8m5K39k18J5K74
7429B70j91j75K26k56J25o4j07J81k59J20q2K23p7Q8j03Q2On5j5Rj62L31n2J29
7453A92O8l11l7o2L04J9m21J59j01L89k20n2J68j69J52j29J73j80J63j12P4J1
7475G8k88K07m4J03K3j20P7K12l19m6L7P8qK7J66j61P3L1L1j68k2K00r1J02p0
7500A08l21J2J00J75q9K4K9j98J08J18K1n8m5J02k74J61j46R6K12j6M5k66K60
7523A58j57j07j3L19l62l0L05k60K48k08oR5J99l37K68j89k10M11k70K88j50K79
$$ y = [351, 17, 55, 4, -199, 44, -131, -134, 51, -18, 281, 195, 13, -132, -111, -65, -50, -7, 277, -135, 165, 25, -261, -233, 106, -81, 83, 105, -25, -46, -69, -103, -13, 78, -6, -16, -50, -172, -48, -82, -118, -3, 226, -47, 66, 29, -15, -226, 93, 140, 12, -58, -55, 51, -263, -43, -25, -9, -15, -63, -289, 6, -130, -26, 115, 239, 73, 5, -40, 199, -19, -4, 270, 79, -96, 130, -126, -1, -65, -172, 9, -250, -130, -212, 11, -66, 22, -81, 1, 7, -48, -63, -54, -216, 115, 63, 192, 260, -51, -88, -150, 154, 173, -248, -89, -190, 199, -21, -73, 95, -74, 78, -51, 122, -58, 105, -7, 67, 78, -210, -3, -47, 56, 79, -41, 36, 248, -71, -117, -80, -2, -10, 17, 183, 22, 95, 126, 157, -11, -33, 167, 76, 178, 108, -213, -201, -101, 74, -15, 9, 38, -160, -52, 66, 87, 29, -16, 86, -188, -27, -173, -77, 135, 119, 164, -102, 158, 1, -106, -119, 200, -162, -192, 113, -147, 101, -107, -113, -18, 181, -156, 112, -77, -287, 124, -146, 142, -8, 271]
7545B71j67k9Q0j85K31q0o0j59J66l3J14k41J14K0j30N7R3k02j58N13k29p0nK17
7569A28J3j51j99qL09n1J29j19o5J41j44pJ53k59L09k48l4R8j39K31j20Q2n5k0
7593b6o5J09k30L71j71K7n6N0m9K8qR7%j4p5k5Pk78L11o4RO0l2L20n51K54R3q7
7621Ek3m0J70j22J74l4K22k85R1p8o9n9J26j31n9K17r0l4J4J33j08J58p7k41M31
7646B91j69l07N4K83l24K40j35J46J25l72J14J40l71J52J23N1q0j18J66l5Lj18
7668a41Q7J32O5jm29L88j15J59M2l80K58n49M99O5k8m8J57l0j34n1p3J30o9j3
7692g9J31j40J70j36j21Q1K24Jj63o7M19n09L2K21m6j37lJ26L81o31M74j48k08
7715a28m6K52j73K7J11p8rJ60j76K30j58J30nJ94k54l12K71l2J92k69k6q6M42
$$ y = [271, 104, 75, 155, -30, 201, 121, 61, -98, 68, 35, 149, -92, 22, 42, -88, -31, 62, -140, -298, 215, -14, -84, -89, 128, 141, -10, -209, -217, 92, 41, 170, 51, -14, 127, -17, -24, 129, -130, 179, -69, -103, -5, -144, 87, -33, 49, -6, -26, -91, 18, -212, 159, -12, 15, -41, 9, -40, -12, -20, 77, 77, 63, -12, -37, -30, -308, 3, -61, -52, 8, -24, 296, -255, -1, 92, 5, -18, -58, 112, -10, 164, 130, 352, 67, 158, 80, 11, -48, 78, -53, -112, 105, 15, -19, -5, 128, 20, 178, 101, -140, 291, 122, -185, -131, 152, -172, 68, -67, 79, 204, -168, -54, 86, -285, -133, -10, 41, -39, -157, 9, -26, -23, -141, -54, 78, 143, 142, -287, 101, -14, 145, 187, -193, 65, -484, 15, 80, 52, 4, 161, 131, -3, -54, -127, 3, -66, -79, 52, -88, 82, -54, -175, -94, 130, 131, -32, -99, 320, -189, -157, 64, 18, -119, -122, 4, 385, -246, 228, 80, -128, -174, 78, -95, -68, 43, -35, -44, 116, -60, 170, 12, 142, 137, 331, 77, -235, 36, 4, 196, -73, -99, -185, 257]
7738B57n43J54Q5J88k40L6J71l12J56R2M1l7n9j36J56o8R9l5P3m4j39J71L1P4
7762A71k55J10r8L23l81P5L1K10r1l6r5p2J28j79O3m5L83l70Q3K3r2J61j02K31
7786A76j17k8J22j64L65m54J58r2J3R1Nj67K03j65L26k96J87k73J49j83L6J05
7808cpJ16m2k5N5R6m7j76L5P0N8k52L28l35K68k57l9oJ60R6j30p6K09m2m8m3J20
7835H3l0j68K65j51M2q0P5m3P8o9K18j65j1p1L0KnL1k7Q0r5p9R2j45M76k86K71
7862C18l38J0J98o1%j48J48OK6Qk03j61J97K04l12K53k36J77j3O1r4j48P4J71
7886A37k49Q1j84J35J61j09J53Kq7o0l5q4Q2o1L04J04l00k5p1O2J52j64J22oj78
7911a18n2q8L50k54J04K38j19j92nL6K25j01k16K01j21J64J3J46j55j41m7K1J05
$$ y = [257, -286, -132, -47, 141, -99, -63, 108, -204, -48, 44, 85, 48, -11, -147, 9, -59, 40, 5, 78, 34, -105, 66, 97, 171, -84, 26, -72, 251, -130, -55, -24, 186, 95, 59, -36, -108, 20, -159, -96, -141, 242, -128, -45, -22, -114, 47, -55, 176, 59, 31, 153, -11, 354, -100, 58, -34, -21, 70, 75, -92, 111, -54, 272, -24, 163, -110, 39, -144, -108, -3, -10, 106, 64, 39, 94, 190, 143, -33, 2, 72, 130, -122, 206, -129, 139, -118, -157, -163, -3, 93, -37, -113, 96, 54, 6, -37, 83, 53, -115, 150, -1, 41, -39, 36, -7, 71, 2, 220, 55, 44, -27, 3, 5, 0, 31, 4, 84, -11, -90, 2, -143, 333, 47, 318, -20, -10, 188, 127, 127, -21, 127, 133, 159, 167, -36, -197, 0, 204, -108, 145, -91, 86, 73, 134, 40, -108, -34, 137, -112, -31, -215, -80, 81, -28, 125, 127, 40, -20, -55, -139, -57, -118, 186, 290, -10, -35, -106, -44, 108, -56, 66, 60, -118, -170, -258, 92, -162, -58, 180, 61, -131, -136, -100, 125, 24, -192, 9, -112, 52, 65, 211, 56, -85, -132, -111, -6]
7934fl4RJ5J9o4J87k23L40j88P0J52l44L0l1oJ82r4J17J37l80J4L23k58R0j24
7959f7M9n3K11j57j0q3MJ18j11k06K56O8J86k76PK85l28L17l29K85q7j0j16m7
7983i4K20J5L7j83o4K17k58L13k57J33J43j98mj35Q0m1J9r1M41j66j14Km3Q2J56
8008B10l04m9O6M4J21l7k9j52K04l5J29l04K26l6L7M0q4k8O0J1l7k77J86m1O4
8033a5k7J08k0N4j53J17j42J43k07j34L07O7n7j72K43K09k04k35K7K3P1k15J15
8056i7m2J25P7J23j35k43K40j40K9rK28k97J48j2k43RM01j35J62l27J45j6l4K60
8080B17n23K78N4J1l3j05O2J04j19K16k87k6K20j7R7m0l90K64r2Q5n5n4K72j9
8104A20j09j51K31P1j88m4j0r1J85R7l53R2N7R7R1j57J12j59J12J18n5J35k10
$$ y = [-6, -40, -31, -16, 3, -61, 126, -97, 243, 55, 125, 277, -67, -37, -68, -74, 108, 14, 131, 268, -112, -98, 225, -33, 57, -67, -18, -71, 140, -17, -27, -110, -106, 12, -99, -305, -49, 19, 205, -71, -64, 221, -107, 210, -119, 166, 79, 69, -47, -94, 126, 141, 178, -5, -69, 148, -110, 203, -54, 79, 222, 24, 20, -115, -35, -76, -57, -148, 293, 127, 13, 15, -28, 54, 210, -94, -143, -77, -33, 88, 51, 22, -130, 74, 39, 168, -136, 90, 54, 91, 131, 47, 19, 79, 90, 53, -224, -38, -79, -15, -42, 66, 46, 100, -53, 64, -78, 65, -142, -276, 31, 98, 41, -131, 112, 321, 117, -118, -91, -68, 3, -212, -97, -139, -14, 63, 186, 51, -192, 48, -92, -63, -72, 156, -141, 7, -5, -248, -239, 162, 27, 189, -138, 7, -9, -43, 217, -306, -28, 26, 37, 4, -101, -39, 65, -54, 162, -125, -151, 69, 52, 149, 109, -281, -17, -109, -24, -79, -133, 139, 120, 11, -140, 91, 162, -26, -70, -80, -171, 14, 111, -242, -150, -93, 4, 95, -62, 50, -109, 3, 121, 66, 201, -9]
8127iR7q8P3r4o1J57k0l7%K29j07l9J07k66J55j40pj8J17j33J81Q7j34R6k12J10
8153D4J10l12J56r1J87J25m4r1m6k04K49p1J14r2K9R6j64L1K21k29j75R4K5O7
8177B9mj31N2K69m59J39L24k57l0L2l1j95J91J39
$$ y = [-9, 88, 0, 73, -21, -82, 75, 55, 18, 18, 247, 140, 101, 208, -58, 97, -43, -50, -68, 49, -84, 97, 184, 50, 146, -66, 44, 154, -158, -2, -93, 94, 219, 175, 84, 38, -166, 83, 12, 126, 34, 63, 159, -5, 26, 247, 18, -157, -63, -38, 29, 25, -106, -54, 215, -244, -105, 219, -38, -68, -36, -67, -262, -71, 68]
8191F8
$$ Imaginary data points
##PAGE= N=2
##DATA TABLE= (X++(I..I)), XYDATA
0@%%%%%%%%%%%qJ6j6J6j6K0k8L2l7M5n6O4p2Q8j04J20j36J56j80K06k34K64k98
34a58L37l81M29m78N32n92O58p31Q08q94R88j092J205j326J462j610J773j954
52a024K155k379K631k917L243l621M062m587N223o011P017q348J0201j2954J7444
67A0135k5948M7269j92021l02707N77957R8876l11513J75385Q7776l61396R9765
78i6422L29761j89694j64542K16339p6079k02349K10010J44958k16651k2783J40746
89G3294j05935p6535J91990L9044j73650K1981J01694j14315j8659J91347k9097
100A01159j96048N0578J23938m3178J932L2848j10552j212J42501o4690r8080
111f0804J38316J5405j57872O1883R5032j15934L505J17931q7927o7261J19818
$$ y = [0, 0, 0, 0, 0, 0, 0, 0, 0, 0, 0, 0, -8, 8, -8, 8, -8, 12, -16, 16, -21, 24, -32, 32, -40, 48, -56, 64, -72, 84, -96, 110, -124, 140, -158, 179, -202, 227, -251, 281, -311, 347, -384, 424, -470, 518, -574, 631, -695, 767, -843, 930, -1024, 1131, -1248, 1383, -1534, 1709, -1912, 2150, -2437, 2786, -3225, 3792, -4556, 5645, -7309, 10135, -15813, 31456, -160565, -463272, 114685, 213561, -97952, 77433, 165209, -196187, -96422, 233339, 43645, -120897, 95442, 19363, -182986, 27024, 171982, -44669, -67452, 73294, -32641, -109176, 82814, 121858, -51792, -29811, 71883, -42432, -61091, 130256, 101159, -94889, -44311, 79627, 36449, 38381, 71229, -39323, -40535, 101966, 37276, -60804, 77512, 92917, -64955, -3072, 91960, -23974, -20469, 97462, 9535, -57726, 62092]
122F2092k1078j04313R6274M8445j22808J0477Q2414m5275O418O3540p9273n7339
134f0426R8674K1208q2374K6204N2146o2296k5184O0804l471l4649K8843M591
146B4070m3426J7053L9298l9113k3450N1862j9085p6593M2498P4064l9079k2822
158a4723L0517l8281j1498R2526k613r6555K9506N5080o8319o727P2849m4767
170c005n0019O1508p802n8368O5485N1685p3181j9407M7431k6513p784O7205j1183
183C6052o9324L901K2268J802L1393K68n9106j0204M7651J1555j1556J1609p578
196H731l3025R95K6941J3803L766p251k7258j8028K3617L7037J675k0952j6332
209f281j6317Q756M3557R185l5987j6976k650p965L1858M1804l1248m7048J5516
$$ y = [62092, 41014, -63299, 32975, 81420, -41388, -30911, 51503, 6228, 12646, 76186, -3087, -60426, 38248, 59456, -22918, 3286, 55432, -6864, -32048, 28756, 25285, -9364, 19479, 24070, -19356, -2303, 36995, -2118, -25568, 26294, 7209, -69384, -26886, 47178, 8099, -14723, 15794, -22487, -33985, 58541, 55928, -40627, -11121, 43959, -24360, -31087, 41762, -3005, -53024, 8484, 682, -57686, 7799, 59484, -13697, -33104, 14327, -12186, -19970, 47235, 36052, -33272, -29371, -7103, -5301, 26092, 26360, -32746, -42950, 4701, 16256, 4700, 16309, 8731, -24294, -23299, 3642, 17445, 21211, 13960, -13298, -31326, -7709, 29328, 31003, 10051, -6281, -22598, -13842, 29715, 38900, 2913, -14063, -16713, -24678, 7180, 48984, 17736, -29312, -13796]
222a3796J4654m544K8995N844m4371q157K0687k387J7648K2884l5332l1934K6334
235c475J6883m413J7759q049m1060N065K7010m857K332Q177k3695j4835J8245
248d913J3654N33r24j3809j4034J2525J5074m907j659L88j1854n281J1094J1672
262G559j014q349k242N72m249P385J0033q443o745L652m963k978J2479J340j3218
277i181J238K105j1254J0040J6639j4880n954J4561j2361r563K3731N642j7520
290f757J767L205j2134R117J9699j0621j1543O723p961k377K3386K225j9807k030
304g108J377n022J2445J6763j1393j9978J101O997M142J2636J498j8873j0065
317a5480P430J1179R494K925j1793j7234J961J8202Q048M84k706j8885j0482J9833
$$ y = [-13796, 858, -3686, 25309, 31153, -13218, -21375, -688, -3075, 14573, 37457, 2125, -29809, -3475, 13408, 8995, 26754, 18705, -22355, -17290, 9720, 4863, 7195, 15372, -8323, -23158, -4913, 8741, 9274, 8350, -5459, -19493, -6968, 8106, 3199, 1540, 1928, -9926, -15207, -4113, 7559, 6545, -1804, -4046, -3474, -7723, -338, 9695, 1252, -5493, -1841, -6804, -9782, 2697, 4037, -9181, -7943, -5838, -17092, -7052, 9587, -5293, -11247, 3314, -9047, -18610, 5121, 10763, -6757, -4990, -1785, -13919, -4802, 14897, 4276, -7267, -544, -8505, -10882, 12504, 14729, -5078, -7108, -5731, -10753, 1692, 18455, 7062, -12916, -11815, -4818, -676, 11960, 13458, -5415, -15480, -8050, 3129, 12623, 15548, 3755, -13479, -11518, 6684, 14732, 15216, 12510, -6375, -16857, 2976]
331B976J7903n000q080p583j3349K728K3816O887j5810r345p389j596K1541J5129
345B2828j2633j2689l788l753J0664K0948l557k3738o981O080L148J3724J0588
358B0841j6996j6236N970Q770O756P642o337j9336o345J1196P136L965O18j7272
372i628j2341J4335J3124j517K79l757j2872j74J6213N885q634k866n045o810
386a3808Q679J1372l113n138k394n623L195J1886K700q959m222p24k678N935P773
401D881o721q686L621L732k545R10N860k18m951j297L62P96P487K079p735k329
417d754L487J132L704M966n982p420N074J908p369M838P170q861l809N755k763
432b924J423J2182J231j0088l514K88L875J2646j678j9984m056J1821J609J539
$$ y = [2976, 20879, 15879, 7799, 216, -13133, -10405, 13411, 20298, 4488, -4857, -12246, -13842, 7699, 22828, 10195, -2494, -6282, -10035, 629, 21577, 18020, -5718, -12699, -6619, -3471, 10253, 20841, 3845, -12391, -6421, 2349, 9105, 16747, 10410, -8926, -15271, -4075, 3061, 7026, 7644, -9628, -21969, -7634, 5490, 3973, 4252, 495, -12377, -12551, 3662, 9547, 913, -1953, -6998, -13808, -5129, 6243, 3130, -2008, -4402, -10025, -6830, 5056, 7756, -1203, -5425, -6149, -8827, -2892, 4881, -1840, -10526, -6905, -3173, -5718, -4808, 1052, 834, -4117, -5414, -5052, -4256, 3231, 5310, -2425, -4754, -1267, -135, 3569, 8535, 2553, -4867, 207, 2115, -5254, -416, 6754, -2107, -5916, -161, -2924, -1501, 10681, 11912, 1824, -1690, -1402, 2473, 15119, 13441, -6543, -10599, 1222, 2831, 4370]
446D370N980p248p973N783N725K472M712k033j0056n069K709P270Q839k744j5730
461b993n342R071R090N247j458r608r087Q75J1289J1730p032j7415l751O594M354
476A564N293M395o646q150J098M750J0487R068j3027j5121N349M503P10R658n007
491H924j8589R31J1446j258J961P590r885j1631N144M789N870Q429j3904j6770
505a6953J1315J1169j685L515k281j4856p96J4204L756k909l951r619R72J2665
519D546j051n321N475p03n899Q22P92J082N549m064j1952l331O582Q283K301j0030
535f919q866Q707J0812k864j197J363l302L995K907q085K078O187o905k149N333
550A095p050l418J3247K153j0511j694q41m75J3798K61j9908J061J2601m714n38
$$ y = [4370, 10350, 3102, -4871, 912, 6637, 9109, 13821, 11788, 1732, -3337, -628, 6642, 15481, 12737, -2993, -8335, 736, 9826, 15073, 13615, 4007, -5080, -4205, 7084, 18814, 11782, -5633, -9384, -2790, 1564, 6857, 11252, 4606, -3544, -2446, 2304, 12791, 21859, 8832, -6289, -940, 3563, 4273, 13931, 8924, -9665, -8734, 2712, 1454, 3415, 11005, 1120, -10511, -5367, -578, 5292, 13721, -183, -16953, -5638, 5531, 3846, 7361, 5080, -9776, -10572, 3632, 7388, 4479, 528, -9091, -8119, 4546, 3495, -1826, 3649, 2946, -2953, -2131, -1339, -257, 5292, 1228, -10724, -14055, -7473, 810, 3111, -6919, -15785, -7078, 3734, 870, -327, 1036, -2266, 1729, 4636, -3449, -1371, 4816, -2089, -4238, 1095, -5955, -9373, 3874, 6027, -4484, -6178, -7019, -7494, 6304, 6565, -13343, -12282, 319, -4395, -4933]
565d933P077o614j522J0323l741o553J0559M508r802k255J18k414Q121K937j1589
580e780j022N352m046K017Q231j662n340m067j036Q331O084q182m638L610l277
595e425j645J0966K402q132k346k872Q24J2431J996r334k169k336j047J2149N749
610A1211j2185m008M675n526K149J4168l049j4253l428m8Q122J4330p375j7064
624a2281M587P496j788P239L876j1465m830P251J474P49M093n681o626K615N52
639b739L467O967n188p103K604R19M39P114R42r441m809K846N638N806m360j0174
655g072L727O196m335K577N180o357k511M206l460M68Q117k707o863K319Q41j282
671i56P594j62r532J968N282n219K702O093p876m837N445J067k182K587j251k953
$$ y = [-4933, 2144, -4470, -5992, 4331, 590, -5963, 4596, 9104, -698, -2953, -2835, -5249, 2872, 5809, -5780, -6802, -1450, -5496, -3479, 4752, 3090, -2250, -6317, -7353, 978, 7062, -1120, -5758, -2148, -5425, -7070, 3896, 6298, -1834, -4180, -7052, -6228, 6203, 8199, -1135, -3304, -5640, -6687, 5462, 11211, -974, -4982, -307, -5833, -3684, 10484, 7435, -6818, -10246, -10294, -2172, 12158, 4783, -12281, -7694, -198, -1986, 5253, 9129, -2336, -7166, 85, 1559, 2308, 6401, 720, -5906, -3291, -2739, 728, 7695, 2507, -4596, -1992, -1073, -634, 6480, 7422, -2019, -6828, -3982, 1656, 7462, 3102, -7072, -3345, 2851, -1484, 1093, 6273, -84, -2595, 1611, -1849, -1381, 6736, 4029, -2834, -515, 326, -956, 6638, 6476, -3056, -1088, 4194, -1025, 1677, 7770, -106, -4943, 502, 1569, -613, 1974, 723, -2230]
687b230K898p26k740M275K214m028Q36L98k918L334L549l287q99m18j741K683
703A200K291j872L8j30n246J044P305j636m975K582l137k896O190K404m130J001
719C3j983m476O135N250m597j306J537n860J168J0004r46o977J555j603k400P217
735B751K863n358j943j277j790N090M783m380l920j77j689J969O522l24n582j921
751d383o65L211N457m00l209k000l353K704P156j73m555j777k010L1O807K536
767E377n112j634r78k538O168N662o919k959K219m135J469Q539k198p068J141
782b966J002j221N417K775o538j143K757k681L421N685n236m063L283N0j86L903
798D259q60m360o07J179N32J669R6k770r93K01K11K756R09k642l54K59j08K430
$$ y = [-2230, 668, -58, -2798, 1477, 3691, -337, 499, 897, -2021, 1313, 4862, 1575, 676, 258, -1483, 1200, 3491, 1619, 1657, 1527, -3719, -2675, 4630, 2994, -1981, 601, -2536, -5432, 758, 3162, -968, 33, -1950, -6426, -291, 4959, 362, -944, 593, -5267, -4099, 5905, 4959, -2018, -463, -2066, -4466, 2751, 5614, 256, -1687, -2964, -4754, 336, 5119, 739, -3181, -3358, -5047, -3078, 3444, 3120, -2462, -4383, -5048, -1837, 3620, 3220, 11, -1989, -5342, -2638, 4518, 4345, -210, -1987, -3997, -3966, 2841, 5377, 265, -1369, -2347, -4885, 1283, 6945, 26, -2933, -714, -4849, -3380, 5159, 2961, -4107, -2966, -1964, -3185, 2232, 5007, -1531, -2674, 83, -2598, 823, 6508, 1272, -2791, 492, 542, 356, 4259, 3399, -961, -1568, -389, 143, 1812, 1908, -862, -1855, -1654, -1443, 1313, 2222, -420, -774, -515, -623, 1807]
816A807K50k219Q04l87k291K503K394k607j41K437k105j572M295m7k660J890j492
833H59l735L130J698l150J118N29l284J030L729j198j380K618j751l537L485K531
849B692k013j59r03k724K388L394k88j042r01j673P36L245Q16k191k036o65o18
866a942J306J686M54k000l513Q48K676J233R77k98m482j164L922K198J31p64l664
883b396j535L868K868j469q4m04l919N70M698j96j794J61k941k221M130L716j831
900A221k125j837j434L052M120j441l643n68l23O78L685M44l021j222J122O89
916f03O35K201k23l064j099O63J117J607N8k641k190O32L000J242l99j258k563
933b885Q63K868k12j086n2j400p42J109J677p04K85O55j501p25L000J216r94l69
$$ y = [1807, 2057, -162, 642, 255, -2036, 467, 2861, 254, 113, 2550, 445, -1127, 3168, 3121, 461, 2351, 859, -2876, 254, 1952, -1198, -80, 449, -2835, -1805, 1924, 726, -654, 1964, 213, -3324, 161, 2692, 679, 520, -383, -3107, -719, 2675, 2387, 1345, 444, -1229, -493, 2752, 3568, 1377, -659, -1324, -1942, -636, 1050, 1504, -496, -4009, -3161, -485, 748, 1725, 1427, -3055, -4219, -297, 1901, 2032, 1268, -2396, -3931, -63, 2805, 1336, 1252, 848, -3071, -2501, 2197, 2001, 207, 368, -2573, -4794, -664, 3052, 1221, -904, -2741, -4175, -1123, 2997, 1556, -2087, -2655, -2978, -2300, 1385, 1829, -1192, -2414, -1292, -603, 32, 2233, 2010, -1054, -2153, -1490, -373, 1234, 1292, -1349, -3539, -2907, 93, 1335, 936, -322, -2885, -2022, 846, 634, -452, -504, -1904, -2646, -1537, 140, -564, -279, 376, -1125, -1850, 1150, 2366, 1372, 1003]
951A003j610k58K072M01j478r02N60j44j068J981J45j743O48P22j379o8J764N80
969A226j799m29R08l08P24J142j166k94J328r20l34K045n93j269J334l20k989
986a714R83M176p59k994l81N5J048K328q84k801l82L30Q27J545J08j993o08J616
1004E00j32j86J998O19k035j556L18K210J781j529j540j477r5K538K412j707k750
1021f31j078J085K231J74j689j506J067k03r68J770J141j523j81J52j445J958
1037C54K753j043j983j440n9K718J981k081k710M14N52j20K595j6l440k27J100
1054f52J53J217J97k087l06L18m91J647J784j947k453J296J050M31J840j747k489
1071b239J541J016o30J527n42k331J420O64j135R14Q37j951q22J675m52n51J289
$$ y = [1003, -607, -865, 1207, 1608, 130, -772, -212, -356, -1424, 557, 702, -1041, -393, 329, -1050, -1118, 646, 1226, -573, -1002, -94, -402, 322, 1464, 298, 4, 1332, 412, 78, 2123, 1530, 261, 1595, 1275, -1714, -731, 3445, 2686, -308, -689, -634, 414, 2742, 1858, -943, -1325, -995, -168, 1377, 1485, -508, -1116, 500, 368, 182, 2180, 2799, 764, -792, -474, 1736, 3517, 1988, 448, -1029, -1124, 1414, 3826, 2119, -631, -1709, -624, 1607, 1781, 92, -1414, -347, -550, -1518, 252, 1393, -130, -311, -159, -1604, 354, 3107, 2064, 81, -1359, -1418, 1300, 3281, 1200, -1510, -1096, -544, -664, 1931, 1915, -1525, -1752, -652, -499, 718, 915, -1172, -1478, -1160, -1651, -4, 1780, -167, -2620, -1324, -274, 157, 1997, 250, -2239, -698, 318, -312, 1215, 673, -1658, -238, 426, -709, 205, 1042, -909, -1731, -56, -508, -1059, 230]
1088B30j256r84J790p0j479J715L80j175L55M55j094O56J468p35n59K62o37N14
1106a64J496l35j469J35n41J026J314j812o86J004n61J9R42j315mJ651r11j642
1124a853J464J054j243J163J87k760J593K641k255q7J618k083p82K903N9j647
1140b8O15j24k035K047J362k320P41N89k926M42L552p13j923N62j282J54K652
1157A365Q44k399n75L37n5J873P38j682o53L89o33J459J009j122r84n28J43J625
1175A151J75j015k02m54j055J582R07j037o02Q11j582R7K889o85j758J347q66
1192b97j163L022M26k571N45J116k130J144K779k052j990K237r53r07K455o01
1208A060k421J294o9j287J749Q69k107m70J460m31j97K009j211j499J417k1K06
$$ y = [230, -1026, -2010, -220, -290, -1769, -54, 326, -849, -494, -39, -1133, -477, 991, 256, -303, -41, -678, -164, 1332, 997, -472, -337, -878, 148, 1462, -350, -1036, -32, -593, -574, 368, -947, -951, 700, -211, -1853, -389, 665, -578, 585, 772, -1988, -395, 2246, -9, -96, 1522, -561, -1343, 1560, 1619, -28, 587, 463, -1572, 475, 1837, -483, 258, 847, -2079, -1637, 1915, 1202, -721, -159, -1441, -1287, 1365, 2209, -190, -765, -428, -483, 1390, 2128, 446, -207, 182, -451, 1008, 2017, 895, -89, -617, -474, 1151, 1326, 311, 109, -345, -1400, 182, 1089, 52, -550, 261, -1321, -1224, 1665, 980, -778, 569, -297, -1460, 1562, 1988, -583, -38, 1078, -1052, 92, 2871, 819, -1171, 1066, 113, -794, 1661, 1060, -1361, -67, -136, -1423, 326, 1195, -912, -1382, 78, -353, -550, 1459, 248, -1251, 166, 145, 351]
1225C51P42p79q08J016k87m6P69p26n66N58j03o02P45o5p28M25L2r95P66N84j475
1246a192O94J205j727L80J131q74l42J641j037r81J709J37j433J287n4j719J383
1263B08Q10j496N56Q67k220J13J829p24r39J099o49j256J602L00q77O63r6j517
1281a727J038J343j084M51M33j568N68J070Q4m72P6m80k84Q71j0k8K43j520l05
1300a301J757m5j217P52q23p34J545N50j025P29m89j258J215J164q14l07O09j019
1318g11j87K428l19j571O64m04p06J912J46j421L01j56m36Q12P96j244m82N46
1336c2o49m6J466n18q29K86n30O06J303l42j114M74j21J5J027Mj008L30K56l15
1356B63L27L59m34k64Q6p27M28R80j013m03N26l10k22J067n16o74L92J30l79Q34
$$ y = [351, 1093, 314, -494, 522, 235, 189, 958, 232, -334, 224, 121, -481, 264, 199, -529, -104, -72, -1067, -301, 283, -1192, -498, 707, -1020, -640, 491, -383, -725, 916, -121, -1102, 607, 744, -689, 598, 544, -1175, 208, 1018, -478, 78, 945, -1275, -1162, 667, -57, -996, 103, -546, -1802, -200, 100, -777, -114, -210, -1727, -689, 654, -430, 21, 454, -1114, -546, 524, 608, 136, 212, -268, -552, 319, 309, 281, 524, -996, -1301, 456, 411, -806, -54, -877, -1611, -66, 484, -541, 188, -301, -1559, -344, 820, 6, -301, 308, -711, -898, 1530, 1211, -360, 304, -100, -806, 1106, 1252, -169, 132, -24, -460, 352, 1148, -96, -578, -32, -681, -727, 739, 221, -608, -322, -852, -246, 1057, 715, -399, 75, -46, -31, 996, 1000, -8, 322, 578, 263, 590, 949, 515, 251, 337, -390, 38, 1018, 5, -398, 128, -182, -404, 663, 147, -527, -135, -5, -384, 450]
1376D50L16j395O77O43p90O6P94p28L47O54p41o33Q43j55l91K71r4k58L50K7r75
1397g22M32P11r63Q1K71k49K10K98k25m56N26J74K30J30o02k17N15M49l96K35
1417D32j81p53Q68j45m81K70j33j71J17P3m07P44j26j087j08J080K59l27J22o42
1437e96l5M27L65kk14l7k67N20J54j7J63k80o06kJ077m2k04l12q80K57Q55k65
1459E9K54o75m77L58O10P0m54k71R2Q3L44K11k8l6j5j39K12N43j15j10k20o83
1481c87N05K72M18o33m97J79J91J22K22n26k69J14J32q7K14j61M44o3n08K44K87
1502B13N69n0j062M32K32L21L82n20l53j51M04L99o55k55K53j28J70L33n52l64
1522c82J58J04K56j97j2J5O8L82m40j90M90j14r1K99K59m48K41L7j47j60L73N7
$$ y = [450, 766, -629, 48, 691, -99, -33, 761, 33, 380, 1034, 293, -340, 503, 348, -43, 228, 134, -124, 226, 253, -722, -290, 421, -542, -461, -190, -439, -229, 69, -156, -612, -86, 88, 318, 448, -154, -371, 144, 593, 197, 432, 251, -502, 366, 221, -260, 10, -123, -294, -177, -104, -511, 233, 107, -980, -1088, -8, 251, -76, 46, -596, -631, -204, 161, 159, -55, -92, -359, 161, 315, 298, 461, 181, -425, -427, 650, 608, 404, 92, -788, -531, 324, 59, 313, -362, -839, -481, 129, 199, -255, -526, -434, -351, -7, 204, 176, 140, 125, -14, 198, 741, 626, 516, 296, -387, 118, 390, 808, 175, -322, -143, 48, 170, 392, -134, -403, -289, -157, -244, -30, -191, 253, 190, -318, -74, 213, 782, 732, -330, 102, 334, 655, 1037, 517, 164, 13, 417, 816, 161, -94, 159, 31, 201, 534, -18, -382, -224, -120, 136, -61, -73, -58, 10, 392, -48, -238, 252, 138, 47, 346, 605, 157, 398, 435, 288, 128, 501, 558]
1544E58o25kO80n04R1j56o91L56O05m87k18L63m83K0M67L19o58j09P17l67j73
1565b97Q51n71k63N93l21k98Q50J82r62R2N77l53k71Q76n66n77N39k31m34M75
1585a09K29p79J06J04P1K13N16k16r05M56M31j77L45j92m00n6L68N01k86r9q1
1606D0m38O4P39j59k70j92k49r9Q81L21r44l97M36j62o2J086n34j157R31M25n76
1627c16O00K60r26p3Q51k89k26Q13m85q95J032J19q67L98N81r01n8P50n83l01
1647e16P04l05m52M78J87l72K94Q0m67l5L47K05J53l38J52k45R7M35K86o65K04
1668B27k63J27J04L55l26l74Q1Q8j77Q8K82p66M49N96o15m04P19m80NO35j67o29
1690d45M62L84n54N00J62p39K96Q18o44j88N73m39l27O43K78r68P0l2l23M90M05
$$ y = [558, -67, -69, 611, 107, 198, 42, -649, -293, 312, -175, -393, -30, -513, -493, -26, 293, -365, -474, 243, -124, -297, 554, -17, -280, 313, -8, -306, 544, 726, -236, -144, 433, 80, -191, 685, 119, -458, 81, -150, -584, -109, 120, -659, -553, -449, -378, -165, 351, 135, -770, -314, 117, -60, 285, 93, -307, -363, 5, 506, 220, 121, 40, -398, -334, 405, 246, -24, -216, -465, -564, 317, 638, -306, -703, -267, -429, -491, 595, 61, -1096, -165, 260, -316, 284, 544, -382, -455, 396, 107, -119, 694, 209, -686, 346, 465, -402, -4, 577, -324, -382, 368, -215, -516, 188, -117, -569, -91, 96, -276, 18, 98, -369, -404, -57, 148, 301, -37, 115, -130, -33, 402, 688, 23, 227, -36, 91, 195, 550, 224, -150, -69, 19, -158, -70, 212, -554, -105, 491, -124, -528, 191, -289, -284, 351, 184, -445, 17, 401, -153, 347, 509, -230, 66, 884, 240, 52, 625, 186, -141, 502, 780, -188, -118, -150, -473, 17, 422]
1711D22j97o39K94m0J5O34l54l35j72J71L12M97j98k41l8l20N27L39j54j31k06
1732A86l67K8P79j70n06Q3k33k74L90N23p68K08M1l92L28L71j84j62K31k39kR28
1754G99k03q28M59j3n63P93N38j191K54J73o51P19M8k04m33j5R8p0P06k36p74
1775e94K01R2j05L90Nn21L49J39n1K87j37O7Lm8j92L30M96o09m62K83j57M83J22
1798C71m69k25K57j22j52K41M21q74M2K26k58L77M51m48k61M93k83K04L04k49
1818D6j35K98l06l7K37O4k62M6Q4k05J30J15j49J0ll34J38N15m67k3J49l87M82
1841FL44m90l2K62k31RP0J36k5L91l71l69P16k4k82N5Q0o35K67R1O8j14p3j45
1865b96N8L06J84j58k94L34l69M29J2n40L58r7O6j55N61J71n74o1j93M88K29l9
$$ y = [422, 225, -414, -120, -160, -145, 489, 135, -200, -372, -201, 111, 608, 410, 169, 131, -189, 338, 677, 523, 392, 186, -181, -153, 626, 456, -50, 33, -200, -474, -84, 439, -329, -121, -80, -472, -144, 227, 43, -119, 112, -127, -129, 799, 596, -232, 227, 214, -349, 444, 982, -209, 45, 218, -433, 286, 334, 130, -303, -318, -220, -290, 416, 180, -594, -393, -301, -406, -16, -11, -532, -183, -44, -95, 192, 55, 122, 125, 77, -115, 215, 711, 102, -360, -77, -234, 249, 371, -98, -323, -66, -188, -340, -99, 322, -552, -510, -284, -542, -165, 286, -162, -423, 70, -213, -9, 295, 46, -89, 209, -97, -134, 103, 167, -95, -49, 35, -170, -40, 75, -74, -64, -67, -401, -263, 252, -215, -238, -89, -476, 6, 350, -140, -172, 90, -141, -132, -62, 74, 49, 440, 69, -300, 416, 392, 110, 165, 245, -390, -123, -32, 36, -78, -151, -296, -238, 68, 252, 94, -200, 134, -235, 194, 206, -334, 24, -73, -7, -162, 399, 570, -4, -65, -258, 230, 459, 420]
1887D20n52L80m42K51J15k1j41J18k49k21N91M5l54m8j49k48O05Q1p6m19M04m86
1909c96L67N19l33l47L93l77j2L83J42l33J58k31k01M18J10n29M8M8j81K46j64
1930b72K85m38L39J4k99K73J17p2K86n34K57j46M87l23J20M3o2J53o0m9J36j25
1952A30l20K35M1j72O6k9k43o4M53N2j90M5R1o06K54M36k23K52k9l22M62K7j24
1975B22j33k1Jl53K73K52j37J5r6k76Q3K98n5J63l91j97%L42P9q9k28J16ok7M68
2000C03K3l91k18M14k5J23j07l8l23N0L10j93N62k61l70j46J78K35j34N4P6l36
2022b14R0K92j34k69L24l81k15M71L5K20r5J12l65m1O44o1l14K69j42l13L13J90
2044D16m95J64j19j97L32J39l8k64j57o3K33K12Rl87L3J96j82KM80j96o2j67K49
$$ y = [420, -132, 248, -194, 57, 172, 151, 10, 128, -121, -342, 249, 294, -60, -108, -257, -505, 100, 181, 105, -314, 90, -396, -29, 490, 157, -190, 203, -174, -186, 197, 339, 6, 164, -67, -268, 150, 260, -269, -221, -173, -354, -108, -272, 13, -425, -86, -72, -371, -98, 19, -53, 233, -301, -44, -190, 297, -26, 94, 137, 75, 228, 168, 119, 255, 130, -190, 45, 86, -86, -20, -49, -292, -356, 97, 149, -41, 4, 95, -511, -257, 179, -44, 208, 179, -143, 319, 346, 222, 89, 68, 69, -284, -11, 241, 104, 119, 23, -253, -170, 128, 73, 236, -155, -352, -352, -10, 69, -20, -248, -132, -138, -165, 303, 326, -65, -283, 131, 106, 229, 122, 84, -239, -189, 121, -72, 490, 229, -141, -287, -109, 126, -8, 46, 122, -214, -124, 168, 34, -235, 89, -292, -507, -36, -1, 219, 124, 236, -129, -170, 474, 413, 99, 368, 226, -87, 226, 416, -79, 85, -34, -231, 101, 240, 202, -62, -219, -282, -49, 163, 172, -215, -182, 14, -168, -166, 314, 118, 56, -111, 138]
2067A38J30K0O2k31j11K84k05NJ29l8k84J36j90r0J74K67l5o78M01k8r6K74J36
2090A70n46L84j08J02J65n1j10n20L82L30j90J63R6n31K15K97m9j9l25P1l13J74
2112b13M88l24j58O5R8l39N32l3k16q4J72k4J86K3k17N4J79q4j37J31M09k90j32
2135H6j16m7Q6L11l39l57J54j09L03M63l32j07j08j26j12O28r7j28k78j94K04
2156b15M92j55J0k60k81P26k09j3j3Q3n8m23N17N1l62K94k51j64K40J77m34L32
2178H4j90M8j59K66N9m77J85R9k38M17J73j96K4j32l06O44m2k86K64k72k2P2J95
2201B10K29o11lJ89k28J15R1j60J39Jl6q6K66l04J59p6M3o7J05M01j12j75L5j19
2225FK65n4j68J49k65QJ74r0n4J80m56J17N3K46j72J70k22k23J90J44l9P8K6L1
$$ y = [138, 268, 288, 350, 119, 8, 292, 87, 92, 221, 183, -101, 35, -155, -245, -71, 196, 161, -517, -116, -144, -240, 34, 170, -376, 8, -100, 2, 167, 116, 6, -514, -132, 198, 8, 171, 267, -264, -49, 248, 199, 180, -145, -74, -387, -213, 275, -49, -207, -142, -44, -383, 149, 116, -100, -184, -12, -36, 150, 173, -44, 10, 189, 105, -32, 99, 508, 218, 86, -30, -77, 9, 320, -19, -376, -222, -331, -28, 435, 103, -4, -112, -238, -350, 278, 181, 53, -225, -419, -215, 277, 122, 132, -128, -409, 317, 108, 95, 82, 165, 107, -316, 201, 252, -110, 184, -67, -231, 9, 186, -248, 84, -106, -58, -217, 49, 108, -369, -184, -85, -323, 94, 267, 71, 95, -37, -343, 301, 259, -27, 237, -35, -57, 15, 210, 439, -172, -175, 14, -214, -99, -8, -168, -29, -28, -64, -150, 116, -188, -29, -105, -62, -129, -24, 377, 265, 90, 125, 6, 271, 217, 49, 198, -67, -59, 115, 25, -29, 151, -305, -188, -135, 111, -61, 109, -113, -336, -146, -2, -41, 37, 63, 94]
2249I4j81L69k02J54j53o0j40K43P6R1J42j92r2l41L72R4m21J53j18m0K67j67
2271e2J09m8l24J83M5J15j30J47k20p4J21K90K41j02k66L3l39N13j58J13j99l59
2293c61L10J59L11l74K9k13j34L13l8J4N9j77j76J94k9J01J54p8l65j03N22J16
2315B34r5O6m52L21l32N74k92J42k40q3L56j46n9K74k48k50J76K60l22j0J82Q9
2337A45j58J1J89j73J01n4k38K94L10j46k9l12J8j5L53q8q6rm5p0K02k74J77K4
2361A27l58j38K04m1L53n5k06p7J91l9J6L61l65j32K94kN4j40Kr1k94L57K67j52
2385A36J79m72m4k1K57K14k99K36l05l52N33p0jk2j72Q4K13j31J33P7m24j13L47
2408a7P2J63N5k57oM7M1r7K16j54k38j42N70j09K1j15j28o1L38j26r1K24l00N5
$$ y = [94, -87, 282, 80, 234, 81, 21, -119, 124, 200, 291, 433, 241, 149, -192, 180, 274, -147, 6, -112, -152, 115, -52, 57, 9, -315, -132, -87, 28, -102, 45, -175, -249, -128, 162, 403, 301, 35, 68, -271, 242, 84, 197, -2, -361, -51, 108, 419, 45, 74, -139, -273, 40, 2, 16, 75, -102, -278, -84, -113, -12, 142, 64, -301, -404, 118, 234, 139, 205, -247, 74, -258, 316, 24, 166, -74, -157, 199, 53, -6, 268, 20, -230, -54, 206, -116, -126, 56, 145, -13, -2, 187, 14, 115, 61, -177, 117, 427, 281, 252, -60, -42, -57, 296, 208, 122, 113, 68, -2, 200, -74, 103, 127, -231, -369, -165, -206, 147, 92, -114, -191, 0, -39, -23, 338, -27, -159, 135, 133, 187, 47, 49, -42, -336, 21, 288, 136, 315, -157, -201, -222, 35, 249, -50, 186, -119, -471, 62, -8, -9, -31, -203, -119, 94, -37, 96, 173, -251, -364, -17, 55, 218, 273, 16, 10, 57, 98, 1, 217, 63, -175, -317, 253, 144, 165, 50, -78, -139, 199, 73, -18, 206, -94, -39]
2432c9l16L94K9J91l59l4L63%np7N8l79K92j67O7L80k65n09K06K37P5l11M17l94
2456a46N1j2QR5R7k24k63K64K18J32j74m5j21o6k1M71j95K13q9m97J2O01k63J06
2480A52k06k40K50r0K79N5k82R4l95L34Q7k9J39k16m9J7L87O0r9j39k21K42l11
2503a81K16L0m7K3N5k69M85p8k60M1l4J30k8J36j25k85p0J60O9Q6p6j01J88k85
2527b20J31J86k96L12O4o06N16K07l2j53l58K18k09K02J70j75J13j49j61M89l20
2548g1P0J89k60o9P3J05Nj52Q6j20L27o9J61p6j45j36l7L94j12k00P9j99J11k3
2572f9K43lk42K5p4j03QM19j00k90p1Q1K11J4J25j33l21M3J89O0K69j93k63j16
2596b91N08M4j8J20m09k59K14J89j01M2l4l41K67m2k4K98j44kj04L1J36J21m65
$$ y = [-39, -355, 39, 68, 259, -100, -134, 229, 229, 224, 147, 205, -174, 118, -49, 18, 398, 133, -376, -170, 67, 142, -169, 248, -146, -95, -107, -99, -4, 93, -131, -394, -130, 88, 220, 46, 1, -120, -186, -207, 264, 69, 282, 193, -304, -292, 309, 46, 152, -54, -294, -44, -134, 145, 200, -82, 12, -383, -49, 38, 9, 148, -68, -117, -100, 287, 347, 248, 109, -112, 130, -181, 35, 65, 18, 41, 96, -173, 312, 234, -26, 15, -19, 111, 83, 219, 94, -191, -261, -101, -32, 54, -22, -123, 65, -220, -89, 97, -199, 113, 177, -429, 87, 294, 262, 109, -249, -31, -240, -38, 132, -43, 70, -79, -240, 249, -71, -1, 188, -72, -141, -68, 37, 42, -110, -24, -144, 183, 114, 275, 199, 54, -82, -119, 275, 163, -37, 42, -157, -46, -69, 174, 171, -71, -46, -120, -223, -215, 204, 104, -186, -257, -176, 35, 49, 174, 41, -280, -237, -48, 12, 281, 88, -175, -291, 217, 261, 243, 363, -46, -305, -91, 98, -3, 39, 5, -336, -69, -111, -135, 163, 19, 17, -87, -56, 80, 201, -264]
2619b64Q7k04O4K64L7J14J39j89k20M6K24Q6q2j88Q7l94M12M8l60J92J29k37J66
2642d3Q1L7j66j19JK57mM4j52j36k1J09J26K47R0m12P8%L30j60j62j30K5n7K37
2667A00R2r2j85K89l46J14j58J88j5K6m8J24l88L09K10m9l64k3L52L91l56L6m12
2690b05J72J06M1J20l7l13r9R1L19p8J13k23k07m9M86k41R5o3l20J03J57L62k04
2713A26j44k24J20K27mJ77j34m4l71L41K85q6j08j72j62K53j98jJ60j24L0p3K38
2736A12j1K45o01J42l4J54J60p7J7j75k08J08K55P8K30j83k44q0K84n6k88J32
2758d0k24L66j50o1M52k64k35P3N0K29l25K06o3r4oP1J04J67l43j66j9n4M47N7
2782A78k40j24J96J26k16K66j73k93J60k3P6jrJ4j0Oj78J97J94P0l04j95J78J61
$$ y = [-264, -177, -381, -317, -53, -16, 98, 237, 48, -172, -126, 98, 184, 102, -86, 1, -393, 19, 67, -293, -101, 28, -209, -43, 38, 75, -91, -210, -209, 48, 44, 88, -64, -200, -221, -112, 14, 261, 351, -61, 17, 17, 347, 187, 25, -105, -80, -137, 100, 192, 100, -85, 204, -142, -28, -186, 2, -13, 13, -35, 89, -299, 10, 220, 171, -193, -216, 136, 527, 171, 207, -205, -33, 73, 114, 234, 197, -116, -215, -124, 195, 117, 230, 7, -200, -249, 237, -4, 91, 28, -292, -189, -32, 330, 126, -18, -242, -122, 105, 101, 278, 144, 100, -271, 70, 355, 269, 161, -11, -173, 80, -118, -119, 41, -83, -53, -126, 112, 101, 346, -255, -113, -147, 7, 167, 90, 107, -68, -276, -168, 87, 165, 395, 212, -32, -112, 172, 116, -172, -40, -264, 102, -48, -109, 343, 79, -156, -83, -33, 196, -129, 77, 14, -80, -86, -15, 89, 256, -87, -253, -272, -326, 121, 178, -62, -186, 10, 136, -80, 186, 13, -280, -120, -143, -67, -68, -77, -63, -73, -67, -245, -48, 146, 216, -88, -283, -105, 56]
2806E6K57k85n5k91K44j00J50K57k53q8K49j30Q8j35Pjj93j27L99N7j58j17j62
2829c31L61k6P7q5J21j84j62K03M3J47K7l00J07N0O1K51j84j39j13J98l2M0J82
2852C12n26o2K21m3O3j9k2j42k1M64k45K67l29q4J41J6j7J27Q6m29J13J64K26
2875B61l05L82n01L8%J22N8J28k68J8k84K66M4Q8Rl04L6J2L08J23O6k79m6J18
2899I0k09N4J98k61J53m2r7J01J42M5p6j6q8J22j82R5q9o7J99m8j18J60j01r4
2923a29Q3q0K77j33j02m9j76N36l37L58k09l06J69n6J61j55K59k5l92o1K89j6
2945i4L18j03k47p6J03J51K05l19k53L04k13K48j9K1l2m81L71J54K30j24j40j73
2967a69L25k97K47R6k90J30j05J24Pk2N9o2l47L48j73O4L73j48m26P3k94M54L00
$$ y = [56, 313, 28, -27, -318, -74, -174, -24, 233, -20, -108, 141, 11, 99, -36, -29, -30, -223, -350, 49, 106, -52, -169, -331, 30, 4, 81, -4, 117, -67, -229, -26, 17, 164, 191, -109, -2, 48, 109, 360, 176, 37, -76, 122, 90, 130, 312, -214, -276, -55, -98, -35, -54, -76, -218, -239, 225, -20, 247, -82, -166, -25, -9, -26, 101, 187, -242, -129, 35, 261, -44, 338, -163, -125, -125, -3, 55, 183, -85, -67, -351, -85, -41, 47, 56, -248, -212, -200, 108, 231, 297, 18, -28, 90, -119, -65, 133, -128, 25, -17, -114, -13, 129, 174, 98, 82, -6, 116, -66, 29, -60, -127, 72, 24, -94, 66, -35, -129, -46, -126, 151, 18, -84, -133, -309, 227, -110, 248, 39, -267, -98, -154, 7, -148, 111, 86, -306, -367, -78, -94, 224, 121, -126, -202, -99, 52, 257, -62, -315, -11, -224, 24, 5, 26, -6, -487, -116, 38, 268, 144, 4, -169, 156, -141, 106, 202, -88, 42, -63, 61, 68, 46, 105, 43, -304, 44, -129, -65, 308, 160, -266, -193, -487, -33, 267]
2990B67m38R4q9K14m26M25Q6q1l12L39J12j2Ol10K24k8J8Q4j30j20J22l49K51
3013e3J8P4J63k26j35k31L99J67k34K08l24J33P8N4O6p7k91J10L3L82j84l8o4
3036B8k60mL74J0o8J86l88J47n7J73K1j44j49j70M04k21K32P3j19j51J91n2nQ3
3060A34j96Q6j21K02k16K25r8n2j38o5L20j28l8J42J8j25J10K10j74j71j14p5
3082b64K88J34K7l11o2L10r6N1lp8j05L20l45L06k16m2K35m9p3L4P0k9n6l62K50
3107f6J22n8j92J36Qn9K53l47K07R5k52K65l08M05k85K58j20j77J29p0L8kO1j24
3131h3r0K20m0K21m60J38j31K72J96n1k86J73o0j88M02K8k33m00M38k36K61O1
3153A52j84J35K7r8n9L1K36j67k0m2m8m3K47j5l66L06n0k57J86K51j71jk00L6
$$ y = [267, -171, -77, -166, 48, -378, 47, 133, 52, -260, 79, 191, 179, 185, -125, 99, 71, 89, 173, 43, -77, 45, -304, -53, -35, 39, 202, -24, -159, -390, 9, 176, -58, 150, -174, -41, 37, 91, 157, 80, -211, -101, -68, 314, 130, 92, 28, -232, -236, 138, 148, 80, 266, -122, 25, -32, 141, 162, 18, -131, -301, 103, -118, 114, 187, 68, -83, 108, 56, 51, 134, -62, 24, -97, 105, -111, 114, 16, -36, -174, -239, 81, -47, -85, 57, 75, -50, 60, 270, 96, -75, -189, -264, 24, 158, 185, -126, -188, 122, 26, 77, 74, -4, -109, 211, -134, 172, -44, -86, 149, 100, 27, 61, 131, 102, 46, -316, -66, 56, -2, -194, -58, -50, -109, 144, -203, 4, 99, -153, 112, -196, 209, -76, 182, 62, -115, 14, -56, -18, -20, 41, -83, -173, 47, 7, 228, -232, -94, -225, 47, 243, 192, -94, 79, 19, -169, 233, 261, 28, -372, 66, -170, 91, 152, -32, 103, 130, 32, -27, 4, 240, 73, 53, 11, -37, -80, 167, 152, -214, 92, 42, -215, -29, 222, 51, 50, -150, -114]
3177a14L94J0k89lj43O5K39l22n8L52l24J70J01N8J45k49l03J80P4K93l78m8J57
3200GM9k37K76pM6l50M4n1M34j35m8j81K4J92M3j75L72k64l0ql6J11P1l47M81
3225B81m45J30j72L12j5m54M69j50Q3N9j3k21j4k1K72j14L9k23K22j62J84p7n7
3248h7K49j37M4P8o8j36K72j68K7j59J19L6l55O25n58Q0L36qj17J01Mk55k29N25
3272B19r3J89k94J38k78J00K80j91Kj27j6N1L40M9l88J23j71l25N58q3k09j40
3294b66J41J10J86r4K8m4m90M57K3J83k08r2k14J57J24O5O1n8m8k93M10j06n9
3317b7j17O3qm9J21K89k7j92k85m7K60M3k93L70j00j96O8P2K06j93J62j79p3J19
3341a3J95n1k28J46q7Q7l0J46j25j5L0j20N5L71m75K04l64L01j90K42J80l53m4
$$ y = [-114, 280, 290, 1, -2, -145, -80, 159, -163, -221, 131, -193, -23, 78, 136, 281, 32, -271, -91, -17, 276, -102, -150, 7, 56, -181, 95, 88, 134, -216, -172, -223, 211, 76, 28, -153, -129, 63, 106, -69, 303, 39, 9, 1, -35, 76, 147, -200, 281, -164, -34, -206, 106, 91, -363, 106, -44, 39, 98, 85, -136, -150, -171, 101, -13, 26, -197, 25, -137, 47, -30, -87, 162, 25, 69, 147, 79, -57, 215, 47, 74, -85, 34, 70, -285, 340, -218, -138, 198, 190, 73, 174, 178, -77, -306, 219, 126, 315, 21, 159, -119, -19, 261, 70, 72, -55, -71, -20, 320, 369, -19, 104, -67, -392, 166, 83, -126, -266, -125, -15, 171, 77, 105, 61, -429, 28, 51, 234, 26, -66, -280, -123, 1, 66, 127, 69, 21, -272, 138, 32, -27, -144, -81, -89, -138, -17, 272, 245, 53, -232, -279, -19, 24, -269, 101, 1, -195, -127, -55, 151, -42, 120, -59, -132, -13, 182, 131, -97, 49, -38, 49, 19, 165, 40, 25, 55, -65, -10, 361, -114, 90, -274, 27, -163, 79, 259, -94, -138]
3364a38Q3J53L7K6k17R2j89K76P1q8o3j59L25j38j31J36l4j69K88l41J74K08m6
3387A56j12k69K16j52j31O47k94j85J27j16J18K06k65Pm5k4L26j46n1k68L88k89
3409a56K38l5J1k05n7K11O7kQJ53k75j50KJ92L45k27k39mL11q4J0pJ05p6j79J42
3435I9k61M62l92j16MM03k99L15l77Q7J84m66M43L0l16J2K44q7j36K12p6J39P8
3458A86j40k38lL05J7k72J06j31J24L68k57P1m5j87L58kj75j59J34k4O7l86J45
3481a38L4M2J00k54K12k9J43j09p3j1rJ75j82J07o5J42P4j92r8R1r8j42J97J77
3505I4pJ3n0l9K5j98K56J27k08l2q7K88j83K30j55k49J86J35j32O1M3j70j48J84
3529a6J63K64m92M2J21L4j44M7K53l04n6K00k30J4M8M6j4l2K50j56j98Q2k6M51
$$ y = [-138, -55, 98, 135, 161, -56, 36, -153, 123, 194, 106, 43, -116, 209, 71, -60, 76, 42, -127, 161, -180, -6, 202, 156, 44, -225, -9, -161, -292, 355, 61, -124, 3, -113, 5, 211, -54, -47, -92, -116, 210, 64, 13, -255, 133, -156, 82, 47, 58, -147, -204, 7, 74, 72, 80, 233, -42, -192, -190, 2, 347, 120, -119, -123, 188, 104, 114, 107, 212, 136, -43, 99, -162, 300, -92, -208, -204, 199, -100, 215, -162, -75, 109, -357, 86, 116, -200, -188, 56, -31, -167, 45, -31, 108, 186, 46, -192, -195, 110, 127, -145, -39, -170, -46, 322, 65, 136, 91, -96, 262, 260, 85, -74, 60, 36, 103, -283, -138, -104, -62, 38, -216, -4, -33, 110, 1, -72, -83, -92, 83, -99, 8, -57, 85, 159, -33, -131, -40, -138, -280, -83, 94, 87, 100, 50, 11, 36, -162, 94, 221, 13, -19, -106, 182, -1, 229, 74, -175, 11, 146, 14, 75, 118, -52, -200, -16, 147, 411, -81, -39, 82, 116, -28, 19, 272, -32, -88, 112, -118, -104, -56, -10, -24, -56, 194, 38, -160, -78, -104, 347]
3553C47m49L62k69K8P8j94R2K66k44k24j3K03J69l00K12Pj12j30K25p1K21j53
$$ y = [347, -102, 260, -9, 19, 97, -97, -5, 261, 17, -207, -220, -17, 152, -148, 64, 71, -41, -171, 54, -17, 204, 51]
$$ [...]
8191A03
##END NTUPLES=NMR FID
##END=
