##TITLE=1H_Ser 5-6-i
 CDCl3
 8 sc, 
 8.12.2021
##JCAMPDX= 6.0         $$ Bruker NMR JCAMP-DX V2.0
##DATA TYPE= NMR FID
##DATA CLASS= NTUPLES
##ORIGIN= UXNMR, Bruker Analytische Messtechnik GmbH
##OWNER= root
$$ XWIN-NMR		Version 3.5
$$ Wed Dec  8 13:42:41 2021 Russian Standard Time (UT+4h)  she@DPX200
##.OBSERVE FREQUENCY= 200.131346
##.OBSERVE NUCLEUS= ^1H
##.DELAY= (6, 6)
##.ACQUISITION MODE= SIMULTANEOUS
##.ACQUISITION SCHEME= undefined
##.AVERAGES= 8
##.DIGITISER RES= 18
##SPECTROMETER/DATA SYSTEM= spect
##.PULSE SEQUENCE= zg30
##.SOLVENT NAME= CDCl3
##.SHIFT REFERENCE= (INTERNAL, CDCl3, 0, 15.7039)
##AUDIT TRAIL= $$ (NUMBER, WHEN, WHO, WHERE, WHAT)
$$ ##TITLE= Audit trail, XWIN-NMR		Version 3.5
$$ ##JCAMPDX= 5.01
$$ ##ORIGIN= Bruker BioSpin GmbH
$$ ##OWNER= she
$$ F:/spectra/data/she/nmr/H-F/1/audita.txt
$$ ##AUDIT TRAIL=  $$ (NUMBER, WHEN, WHO, WHERE, WHAT)
(   1,<2021-12-08 13:41:32.35 +0400>,<she>,<DPX200>,
      <created by zg, POWCHK disabled, PULCHK disabled
       configuration hash MD5:
       00 E9 B6 7A A2 85 ED C7 34 08 36 98 17 FE 4E 26
       data hash MD5: 16K
       DE 8F 89 3E 17 C0 B5 D1 C6 82 19 5F 97 9A D5 74>)
$$ ##END=
$$ 
$$ hash MD5
$$ 8A A2 B7 EF 72 F9 99 68 76 AC 12 3F 72 2D C4 20
##$RELAX= 
##$RELAX= 
##$RELAX= 
##$RELAX= 
##$RELAX= 
##$RELAX= 
$$ Bruker specific parameters
$$ --------------------------
##$DU= <F:/spectra>
##$EXPNO= 1
##$NAME= <H-F>
##$PROCNO= 1
##$TYPE= <nmr>
##$USER= <she>
##$AMP= (0..31)
100 100 100 100 100 100 100 100 100 100 100 100 100 100 100 100 100 100 
100 100 100 100 100 100 100 100 100 100 100 100 100 100 
##$AQSEQ= 0
##$AQ_mod= 1
##$AUNM= <au_zg>
##$AUTOPOS= <>
##$BF1= 200.13
##$BF2= 200.13
##$BF3= 200.13
##$BF4= 200.13
##$BF5= 200.13
##$BF6= 200.13
##$BF7= 200.13
##$BF8= 200.13
##$BYTORDA= 1
##$CFDGTYP= 0
##$CFRGTYP= 5
##$CHEMSTR= <none>
##$CNST= (0..31)
1 1 145 1 1 1 1 1 1 1 1 1 1 1 1 1 1 1 1 1 1 1 1 1 1 1 1 1 1 1 1 1 
##$CPDPRG= <>
##$CPDPRG1= <>
##$CPDPRG2= <>
##$CPDPRG3= <>
##$CPDPRG4= <mlev>
##$CPDPRG5= <mlev>
##$CPDPRG6= <mlev>
##$CPDPRG7= <mlev>
##$CPDPRG8= <mlev>
##$CPDPRGB= <>
##$CPDPRGT= <>
##$D= (0..31)
0 1.2 0 0 0 0 0 0 0 0.06 0 0.03 0 0 0 0 0.0002 0 0 0 0 0 0 0 0 0 0 0 0 
0 0 0 
##$DATE= 1638956491
##$DBL= (0..7)
120 120 120 120 120 120 120 120 
##$DBP= (0..7)
150 150 150 150 150 150 150 150 
##$DBP07= 0
##$DBPNAM0= <>
##$DBPNAM1= <>
##$DBPNAM2= <>
##$DBPNAM3= <>
##$DBPNAM4= <>
##$DBPNAM5= <>
##$DBPNAM6= <>
##$DBPNAM7= <>
##$DBPOAL= (0..7)
0.5 0.5 0.5 0.5 0.5 0.5 0.5 0.5 
##$DBPOFFS= (0..7)
0 0 0 0 0 0 0 0 
##$DE= 6
##$DECBNUC= <off>
##$DECIM= 32
##$DECNUC= <off>
##$DECSTAT= 4
##$DIGMOD= 1
##$DIGTYP= 9
##$DL= (0..7)
0 120 120 120 120 120 120 120 
##$DP= (0..7)
150 150 150 150 150 150 150 150 
##$DP07= 0
##$DPNAME0= <>
##$DPNAME1= <>
##$DPNAME2= <>
##$DPNAME3= <>
##$DPNAME4= <>
##$DPNAME5= <>
##$DPNAME6= <>
##$DPNAME7= <>
##$DPOAL= (0..7)
0.5 0.5 0.5 0.5 0.5 0.5 0.5 0.5 
##$DPOFFS= (0..7)
0 0 0 0 0 0 0 0 
##$DQDMODE= 0
##$DR= 18
##$DS= 0
##$DSLIST= <SSSSSSSSSSSSSSS>
$$ [...]
##$SUBNAM2= <"">
##$SUBNAM3= <"">
##$SUBNAM4= <"">
##$SUBNAM5= <"">
##$SUBNAM6= <"">
##$SUBNAM7= <"">
##$SUBNAM8= <"">
##$SUBNAM9= <"">
##$SW= 18.0517287032376
##$SWIBOX= (0..15)
0 0 2 0 0 0 0 0 0 0 0 0 0 0 0 0 
##$SW_h= 3612.71676300578
##$TD= 16384
##$TD0= 1
##$TE= 0
##$TE2= 300
##$TE3= 300
##$TEG= 300
##$TL= (0..7)
0 120 120 120 120 120 120 120 
##$TP= (0..7)
150 150 150 150 150 150 150 150 
##$TP07= 0
##$TPNAME0= <>
##$TPNAME1= <>
##$TPNAME2= <>
##$TPNAME3= <>
##$TPNAME4= <>
##$TPNAME5= <>
##$TPNAME6= <>
##$TPNAME7= <>
##$TPOAL= (0..7)
0.5 0.5 0.5 0.5 0.5 0.5 0.5 0.5 
##$TPOFFS= (0..7)
0 0 0 0 0 0 0 0 
##$TUNHIN= 0
##$TUNHOUT= 0
##$TUNXOUT= 0
##$USERA1= <user>
##$USERA2= <user>
##$USERA3= <user>
##$USERA4= <user>
##$USERA5= <user>
##$V9= 5
##$VALIST= <valist>
##$VCLIST= <CCCCCCCCCCCCCCC>
##$VD= 0
##$VDLIST= <DDDDDDDDDDDDDDD>
##$VPLIST= <PPPPPPPPPPPPPPP>
##$VTLIST= <TTTTTTTTTTTTTTT>
##$WBST= 1024
##$WBSW= 4
##$XGAIN= (0..3)
0 0 0 0 
##$XL= 0
##$YL= 0
##$YMAX_a= 148334
##$YMIN_a= -208081
##$ZGOPTNS= <>
##$ZL1= 120
##$ZL2= 120
##$ZL3= 120
##$ZL4= 120
##$ABSF1= 10
##$ABSF2= 0
##$ABSG= 5
##$ABSL= 3
##$ALPHA= 0
##$AQORDER= 0
##$ASSFAC= 0
##$ASSFACI= 0
##$ASSFACX= 0
##$ASSWID= 0
##$AUNMP= <proc_1d>
##$AZFE= 0.1
##$AZFW= 0.1
##$BCFW= 1
##$BC_mod= 2
##$BYTORDP= 1
##$COROFFS= 0
##$CY= 11.3945322036743
##$DATMOD= 1
##$DC= 2
##$DFILT= <>
##$DTYPP= 0
##$F1P= 2.36226072786647
##$F2P= -0.459571619588291
##$FCOR= 0.5
##$FTSIZE= 0
##$FT_mod= 4
##$GAMMA= 1
##$GB= 0.15
##$INTBC= 1
##$INTSCL= 1
##$ISEN= 128
##$LB= 0.24
##$LEV0= 0
##$LPBIN= 0
##$MAXI= 10000
##$MC2= 0
##$MEAN= 0
##$ME_mod= 0
##$MI= 1.114404
##$NCOEF= 0
##$NC_proc= 0
##$NLEV= 6
##$NOISF1= 3.799351
##$NOISF2= 2.8
##$NSP= 1
##$NTH_PI= 0
##$NZP= 0
##$OFFSET= 15.70392
##$PC= 1
##$PHC0= -15513.32
##$PHC1= 12.4008
##$PH_mod= 1
##$PKNL= yes
##$PPARMOD= 0
##$PSCAL= 0
##$PSIGN= 0
##$REVERSE= no
##$SF= 200.130013532006
##$SI= 16384
##$SIGF1= 3
##$SIGF2= 2
##$SINO= 400
##$SIOLD= 16384
##$SREGLST= <1H.CDCl3>
##$SSB= 0
##$STSI= 0
##$STSR= 0
##$SW_p= 3612.71676300578
##$SYMM= 0
##$S_DEV= 0
##$TDeff= 0
##$TDoff= 0
##$TI= <>
##$TILT= no
##$TM1= 0
##$TM2= 0
##$TOPLEV= 0
##$USERP1= <user>
##$USERP2= <user>
##$USERP3= <user>
##$USERP4= <user>
##$USERP5= <user>
##$WDW= 1
##$XDIM= 8192
##$YMAX_p= 0
##$YMIN_p= 0
$$ End of Bruker specific parameters
$$ ---------------------------------
##NTUPLES= NMR FID
##VAR_NAME=  TIME,          FID/REAL,        FID/IMAG
##SYMBOL=    X,             R,               I
##VAR_TYPE=  INDEPENDENT,   DEPENDENT,       DEPENDENT
##VAR_FORM=  AFFN,          ASDF,            ASDF
##VAR_DIM=   8192,          8192,            8192
##UNITS=     SECONDS,       ARBITRARY UNITS, ARBITRARY UNITS
##FACTOR=    0.0002768,     1,               1
##FIRST=     0,             0,               0
##LAST=      2.2672688,     0,               0
##MIN=       0,             -208081,         0
##MAX=       2.2672688,     148334,          0
$$ Real data points
##PAGE= N=1
##DATA TABLE= (X++(R..R)), XYDATA
$$ [...]
1620C190k825l087L928J82m112K237L462m040k079M577n6l793K477K229m047j4
$$ 3190 365 -2722 1206 1388 -2724 -487 2975 -1065 -3144 1433 1377 -2416 61 2290 -1757 -1771
1636a771M695j254l985K679J981l461Q1L812k304l727L515J984l806r7L602k527
$$ -1771 2924 1670 -2315 364 2345 -1116 -1035 2777 473 -3254 261 2245 -1561 -1658 1944 -583
1652e83k589M552J120m867Q55L935k633j827M051o26m420K534L321l451j252L674
$$ -583 -3172 1380 2500 -2367 -1512 2423 -210 -2037 2014 1388 -3032 -498 2823 -628 -1880 1794
1668A794j250l060L332K254m297p70M061j176k562K703R84m275O23M186k031l279
$$ 1794 544 -2516 816 3070 -1227 -1997 2064 888 -1674 1029 2013 -2262 -1639 2547 516 -2763
1684b763L016J129l414J222L603l077k524M041Q02l682J369K606l529j084M421
$$ -2763 253 1382 -2032 -810 2793 -284 -2808 1233 2035 -1647 -278 2328 -1201 -2285 2136
1699B136n53l936K191K152l019pL443j691l137K816K034l192m34K857k042k156
$$ 2136 1583 -2353 -162 1990 -1029 -1036 2407 716 -2421 395 2429 -763 -1197 1660 -382 -2538
1715b538L281J158l513M0L088j547j846L139K51l752J586L261k616j659L132l49
$$ -2538 743 1901 -1612 -1572 1516 -31 -1877 1262 1513 -2239 -653 2608 -8 -1667 1465 1116
1731A116l218K342K193l531j012L404m43k468K113J081l123M06L170j270k587
$$ 1116 -2102 240 2433 -1098 -2110 1294 851 -1617 496 1577 -1546 -1140 2030 760 -1827
1746a827J986R50k507O62K650j998k417K686J397k704L35K442k200j224L339K75
$$ -1827 159 1109 -1398 -736 1914 -84 -2501 185 1582 -1122 -787 1655 -545 -1769 1570 1845
1762A845l324J111K234k312n43K868j137k880K106J676k110n86K108j099j506
$$ 1845 -1479 -368 1866 -446 -989 1879 742 -2138 -32 1644 -466 -1052 1056 -43 -1549
1777a549K318J000k815k88K315q57j418J760L60k515N77K481j055j557J687O15
$$ -1549 769 1769 -1046 -1334 981 124 -1294 466 826 -1689 -1112 1369 314 -1243 444 1059
1793A059k196J154J998k125j182K198Q1j986J284P90k066j68K207m88j901J060
$$ 1059 -1137 17 2015 -110 -1292 906 987 -999 285 1075 -991 -1159 1048 560 -1341 -281
1809b81J034j385R3J856j172j371J338R54j566j81J243p46r33J592P21k040K94
$$ -281 753 -632 -539 1317 145 -1226 112 1066 -500 -681 562 -184 -1117 475 1196 -844 -550
1826e50J537q62n82J422j74j702R17J310j251q09J186m40j050J024P96j503l74
$$ -550 987 125 -457 965 791 -911 6 1316 65 -744 442 2 -1048 -24 772 -731 -1105
1843a105J364j63n47O48J84j072K58J157l69j016M50O03n70J49P36o76r55J107
$$ -1105 259 96 -451 197 381 -691 -433 724 355 -661 -211 392 -178 -29 707 31 -924 183
1861A83P72j113MP06p94j31Q60q0q98J22N22m99P7M40k30o86N08P40k26l23J66
$$ 183 955 -158 -154 552 -242 -373 487 407 -491 -369 153 -346 -269 171 -59 -745 -237 503 277 -46 120
1882A20j19n0M57J19m91l41L89J60k11m5pl79K17P95k98n31J58K26j3k1J88m69
$$ 120 1 -49 408 527 36 -305 84 244 33 -12 -19 -398 -181 614 316 -215 -57 169 156 135 323 -146
1904a46l55M07Q2j38j99j17J93K30p6K36n7k93J48N79o7k80J87k56j77M30K07
$$ -146 -501 -94 -12 -150 -349 -466 -273 -43 -119 117 60 -233 -85 494 427 147 334 78 -99 331 538
1925E38o84m96N46J49r2M3P4o04K14Q55k86m99j02L84k70J56K87k60p90N98O93
$$ 538 -146 -642 -96 53 -39 4 78 -526 -312 543 257 -242 -344 40 -230 -74 213 -47 -837 -239 454
1946D54m42k68N82l68k31Q62L74r97l05Q50l54m48O50j32q69K26J090p43o65O47
$$ 454 12 -256 326 -42 -273 589 963 -34 -339 511 157 -291 359 227 -642 -416 674 -69 -734 -87
1966h7K99p58N98O77q86n69Q84K93o79J21L85p38k85J379l3j423M94R74q54J47
$$ -87 212 -546 52 729 -157 -726 158 451 -228 -107 278 -460 -745 634 601 -822 -328 646 -208 -61
1986f1J121p07j160J017R23j337j25Q81p14p78J236L67j504R8J296o08l94R20
$$ -61 1060 353 -807 210 1133 -204 -329 552 -162 -940 296 663 -841 -743 553 -55 -449 471
2004D71j77j179O11J448r38j000J068o0r80Q29J117j488q99J891n0j130P37N70
$$ 471 294 -885 -274 1174 236 -764 304 244 -736 93 1210 -278 -1177 714 664 -466 271 841
2022H41j480n4J890o76j677Q80Q68j441K21J624j087j163J480M65j261L10J087
$$ 841 -639 -693 1197 521 -1156 -276 592 -849 -628 996 -91 -1254 226 691 -570 -260 827
2039H27j053p83J956J01j897L67J418j141l81J452l20j939J149J534j427m57J451
$$ 827 -226 -1009 947 1048 -849 -482 936 -205 -586 866 546 -1393 -244 1290 -137 -594 857
2056H57p25j150J430Q45k168j36J654m85j062J197M56k066O43K035r74j363J405
$$ 857 132 -1018 412 1257 -911 -1047 607 122 -940 257 713 -1353 -710 1325 351 -1012 393
2073C93L35j473Q81J277j610r99J965J85j754Q99R06j819k47K220n11j840J243
$$ 393 728 -745 136 1413 -197 -1196 769 954 -800 99 1005 -814 -1061 1159 648 -1192 51
2090E1P98j459%J797j076j858J819J118j839j74J843j184j216K087N52k148J43
$$ 51 849 -610 -610 1187 111 -1747 72 1190 -649 -823 1020 -164 -1380 707 1259 -889 -746
2107g46J990j040r34J639M4k219J035J620j391j232J851l15j543J273J282j887
$$ -746 1244 204 -730 909 953 -1266 -231 1389 -2 -1234 617 302 -1241 32 1314 -573
2123e73q04K080k36j460J270P95k075K28J879n80j869J333P54j625N04J685j336
$$ -573 -1377 703 467 -993 277 1072 -1003 -775 1104 524 -1345 -12 742 -883 -379 1306 -30
2140c0j241J878O14j956O94J429j638q55K054P1k213P25J289j319m47J872n53
$$ -30 -1271 607 1221 -735 -41 1388 -250 -1105 949 1020 -1193 -468 821 -498 -945 927 374
2157C74j948J335J569j860j61J584o75j359J488R29j917k09K065r63j288J550
$$ 374 -1574 -239 1330 -530 -691 893 218 -1141 347 1276 -641 -850 1215 252 -1036 514
2173E14N05k142M47K083j310j188J650K82j929P99J599j829p36J777L3j800J095
$$ 514 1019 -1123 -676 1407 97 -1091 559 841 -1088 -289 1310 -519 -1255 522 555 -1245 -150
2190a50J031j623k55K027k13j802R53R87j428k4J627q95j506J414R21j656j08
$$ -150 881 -742 -997 1030 817 -985 -32 955 -473 -497 1130 235 -1271 143 1064 -592 -700
2207g00J614q24j112J660K65j768M93J557j197p91J546k38j860R93J380j485o42
$$ -700 914 90 -1022 638 903 -865 -372 1185 -12 -803 743 505 -1355 -362 1018 -467 -1109
2224a109J487j9j380J057J131j587q2J556m83j225R76N37j448j31J643n62j452
$$ -1109 378 359 -1021 36 1167 -420 -502 1054 571 -654 322 859 -589 -720 923 361 -1091
2241a091J204O53j338J74J473j201r68J617M03j551K37J149j030o40J774l82j406
$$ -1091 113 766 -572 -398 1075 -126 -1094 523 926 -625 -388 761 -269 -909 865 483 -923
2258i23O87J168j016n11J125j74j308J054R62j225m59J277j52j291J048N96j606
$$ -923 -236 932 -84 -595 530 356 -952 102 1064 -161 -620 657 505 -786 262 858 -748
2275g48R6J290m72r39J049J58j193M08J158q55q66J119L40j196N31O70j057k62
$$ -748 -652 638 166 -773 276 434 -759 -351 807 -48 -914 205 545 -651 -120 550 -507 -769
2293g69J229k0j004N63N06p21n4J087l11j097N66O37q50J8P50n20r31P77P81j108
$$ -769 460 440 -564 -1 505 -216 -270 817 506 -591 -25 612 -238 -220 530 10 -921 -144 637 -471
2313d71j51J001n42m01J212j14j118K20J076n25n91P31op91M66R07r25n45P59
$$ -471 -622 379 -163 -564 648 534 -584 -364 712 187 -404 327 321 -470 -4 903 -22 -567 192
2332A92K23n85L95M10r09j84Q78j2q12K77M11p81MJ114m26r21N34O07n71LP85
$$ 192 415 -170 225 635 -274 -458 420 408 -404 -127 284 -497 -493 621 195 -726 -192 415 -156 -153 632
2353F32p37l02P29J93o81j03M37k20j16N66l06l92K0O50p8m20L72j99n35N22L62
$$ 632 -105 -407 322 515 -166 -269 168 -52 -168 398 92 -300 -280 370 292 -128 244 45 -490 32 394
2374C94n50m02N62N4l59M64K02r26k8P26J52o30N54Q3o74L87N55k03p24K83K10
$$ 394 -156 -558 4 58 -301 163 365 -561 -589 137 289 -341 213 296 -378 9 564 361 -363 -80 130
2395A30j48R7R5k44m27N71K04l47j32L32k07o7L43J34o08O5L02M1k07J46j54l55
$$ 130 -18 79 174 -70 -497 74 278 -69 -201 131 -76 -143 200 334 -274 -209 93 134 -73 73 -81 -436
2417d36N05K32k25k30K94Ol5J61j55l65M0K62K20l08j14J3m2m5L34k6m01j02O51
$$ -436 69 301 76 -154 140 146 111 272 117 -248 -208 54 274 -34 -148 -135 -177 -222 112 86 -315 -417 234
2440B34r1j39J2K4k28K1N94m16j82J75q4r5M06M5l46r9K38K51l21L8J38k31m0
$$ 234 143 4 16 40 -188 -167 427 11 -171 4 -80 -175 231 276 -70 -169 69 320 -1 37 175 -56 -96
2463i6J53J38n39l2M20j37k10L36j52k17K68L83k42k11K77l3k95L58J87n54j03
$$ -96 57 195 -344 -376 44 -93 -303 33 -119 -336 -68 315 73 -138 139 106 -189 169 356 -198 -301
2484c01K43R8k44K37J25j15n1K91p6l97K44K67k92k38L50k44l83M26M05m64l87
$$ -301 -58 40 -204 33 158 43 -8 283 207 -190 54 321 29 -209 141 -103 -486 -60 345 -119 -506
2505e06P32l00l27O52J52n28j69P76n00j51L71J51o19J40M40k41m32N01J5n30
$$ -506 226 -74 -401 251 403 -125 -294 482 -18 -169 202 353 -266 -126 314 73 -359 142 157 -373
2525c73L73L75n40j07M79Q7o65K45K91l10j62N67j02n67M73K99n05P6O57m18n75
$$ -373 0 375 -165 -272 207 294 -371 -126 165 -145 -307 260 158 -409 64 363 -142 -66 591 173 -402
2546d02M49L62o67L37K13l80k81M63P7n99NO68k15m66O71K7o82L89O50r82j06
$$ -402 47 409 -258 79 292 -88 -369 94 171 -428 -423 245 30 -436 235 262 -420 -31 619 -363 -469
2567d69P91j53o26M75M26p43m0R53k04p79N29K12o75K34O83l45p03N76L68j001
$$ -469 322 169 -457 18 444 -299 -339 614 410 -369 160 372 -303 -69 614 269 -434 142 510 -491
2587d91L90M80m93k12M32K30p40J56O63o85n6P78k16q08L90P66o95k17N59j0p79
$$ -491 -101 379 -114 -326 106 336 -404 -248 415 -270 -326 452 236 -572 -182 584 -111 -328 231 221 -558
2608e58P15N37p84j64O47l16m24M81M55r00j94R19l12o45O99N8r61M02Q60o76
$$ -558 157 694 -90 -254 393 77 -347 134 589 -311 -505 414 102 -543 156 214 -747 -345 515 -161
2628a61n01Q79J31o88L21N17n97n45R21J74q54K88N79m66m36P74Kq01M35N18n26
$$ -161 -662 217 348 -340 -19 498 -99 -644 277 451 -403 -115 464 -2 -438 336 338 -463 -28 490 -36
2649c6j42N03k89n78P81K42p75j07N73j50n81O13K39p68L09O40l91l04M27Q7p30
$$ -36 -178 325 36 -542 239 481 -294 -401 172 22 -559 54 293 -475 -166 474 83 -221 206 293 -437
2670d37M38O82o88n85Q08K0o63M98M33q29j93Q08l2n78K42L84o82RP23j25q98
$$ -437 1 683 -5 -590 218 238 -425 73 506 -323 -516 292 260 -318 -76 308 -374 -365 358 233 -665
2691f65O02M45q54K86O73n70n21R80J16q42J92N68n16j32O39m6q23K45O72m89
$$ -665 -63 382 -472 -186 487 -83 -604 376 492 -350 -158 410 -106 -238 401 355 -468 -223 449 -40
2711d0k05N12q3o02M23O14o97m02P46Qo33M45K08o67j89R41j82p39O47R2m49L7
$$ -40 -245 267 184 -418 5 619 -78 -480 266 274 -359 86 294 -373 -562 379 197 -542 105 197 -252 -215
2733b15P66l78m51M09K58o43K24N89o15m50O79K05q27K56M36m46j01P21j85o17
$$ -215 551 173 -278 131 389 -254 -30 559 -56 -506 173 378 -449 -193 243 -203 -304 417 232 -385
2753c85J94N88l67k87N54k51o25O92M03o75j42N74k62l49N08K79o72R0N28k09
$$ -385 -191 397 30 -257 297 46 -579 113 516 -159 -301 273 11 -338 170 449 -223 -133 395 186
2773A86o56N67L8n66J42P15m41o16O66Q1n15L56L54n52rN80K0m39JL51m29l9N54
$$ 186 -470 97 135 -431 -289 426 -15 -631 35 116 -399 -43 311 -241 -250 330 350 -89 -88 263 -166 -205 349
2796C49j50n94K76M23o46J95M51l55j25M37j4m84J25M28n86K2M55M4o37J01M22
$$ 349 199 -395 -119 304 -342 -147 304 -51 -176 261 247 -237 -112 316 -270 -248 207 251 -386 -285 137
2817A37k12k65N05J40o70L10N31m53l71O60j30m12M59K33p91O5N03Jn62L63K80
$$ 137 -75 -340 165 305 -365 -55 476 23 -348 312 182 -230 229 462 -329 -264 239 240 -322 41 321
2838C21m30j31N88k34l02L56j4l41J09K23k43j68L29J90m54J03L08k08k54N58
$$ 321 -109 -240 348 114 -188 168 154 -187 -78 145 -98 -266 63 253 -201 -98 210 2 -252 306
2858C06J0m40J30K94k45k04L50r4l66K37K15k13k80O01k51k53K51J40l13r7M28
$$ 306 316 -124 6 300 55 -149 201 107 -259 -22 193 -20 -300 301 50 -203 48 188 -125 -222 206
2879B06l36j60K71Q5j63J2M81m40k40L71N0k62mN77m22j71K60L9k35J32K00l29
$$ 206 -130 -290 -19 66 -97 -85 396 -44 -284 87 137 -125 -129 448 26 -145 115 154 -81 51 251 -78
2901g8q0K63j31l28K47K31j38j75J41J5j07K10K74l15m16N01l4j88n0K60q9k41
$$ -78 -158 105 -26 -354 -107 124 -14 -189 -48 -33 -140 70 344 29 -387 114 80 -108 -158 102 13 -228
2923b28L01j5k68K32K12k40M1J28p8k72J60N7j17J54L1j05k75K45J70l37K25P8
$$ -228 73 58 -210 22 234 -6 35 163 85 -187 -27 30 -87 67 98 -7 -282 -37 133 -204 21 99
2945I9j79l0J62j27j3k8K49r0k60L08m5j11J84P9k09j47K65j0o4j88K24j64MK06
$$ 99 -80 -110 52 -75 -88 -116 133 43 -217 91 46 -65 119 198 -11 -158 107 97 33 -155 69 -95 -91 115
2969A15j18j25r8K28q8J01j09J0j14O5J46K6r7J47J16k62o2K89k62j46K81%j97
$$ 115 -3 -128 -226 2 -86 15 -94 -84 -198 -133 13 39 -58 89 205 -57 -119 170 -92 -238 43 43 -154
2992a54K10J41l37n4M00J7l09M3J22j55rJ82j07j17J81R8j84j54K59j10L5M5K75
$$ -154 56 197 -140 -194 206 223 -86 -43 79 -76 -85 97 -10 -127 54 152 -32 -186 73 -37 -2 43 318
3015C18m89q5M17N2j36R9q5k89K5J95j0j87J85J51m01J76L02k74p4K15r3j94L55
$$ 318 -171 -256 161 213 77 176 91 -198 -173 22 12 -175 10 161 -240 -64 238 -36 -110 105 12 -182 173
3038A73j81j76R8J10l1l0KR6p0j18M60j98k38Q2J17k18k0M40k79k04K82J29m54
$$ 173 -8 -184 -86 24 -7 -37 -35 61 -9 -127 333 135 -103 -21 96 -122 -142 298 19 -185 97 226 -228
3061b28O4L47j00l07K19Q4k89L3L24k37j16J69P2k75J44L68k74k21K17K20l27
$$ -228 -164 183 83 -224 -5 79 -210 -177 147 -90 -206 -37 35 -240 -96 272 -2 -223 -6 214 -113
3082a13K33Q7l25l0L24K1l32J92L6k41r5K91j45k10K45L36l79l6L83k90j28K67
$$ -113 120 207 -118 -148 176 197 -135 57 93 -148 -243 48 -97 -307 -62 274 -105 -141 242 -48 -176 91
3104I1J09j87K3J72j34j36K89l1m76M5N05k35k72K65J18l26K10L31l86k46L45
$$ 91 200 13 36 208 74 -62 227 196 -280 -235 270 35 -237 28 146 -180 30 361 -25 -271 74
3125G4O4l82J88K53k72j15M37r4n41N24k9l29N9N18j78l15L66j38k19j0N15m66
$$ 74 138 -244 -56 197 -75 -190 247 153 -388 136 107 -222 -163 355 177 -138 228 90 -129 -139 376 -90
3147i0j19L13J72k72k57M28k64j79K75K62n49O6N05l95o6L75k44j56L24J61k93
$$ -90 -209 104 276 4 -253 175 -89 -268 7 269 -280 -214 291 -104 -170 205 -39 -195 129 290 -3
3168cr6K90l1m15N21j07k07K8L78l43j54L97n4l77Q5K32j88j68L49K0l13R4K16
$$ -3 -99 191 160 -255 266 159 -48 -20 358 15 -139 258 204 -173 -88 144 -44 -212 137 157 -156 -62 154
3191A54k44n5L05J8m12J65L28l65q9L79r7l74M49K85m58j08N27l65k42K23K77
$$ 154 -90 -145 160 178 -234 -69 259 -106 -195 184 87 -287 162 447 -11 -119 408 43 -199 24 301
3212C01m72j6K74p8j86Q3J69k25Q3L10k78j20K20M8l90L25Q4k58n9K73Q8j68q1
$$ 301 -171 -187 87 9 -177 -94 75 -150 -67 243 -35 -155 65 113 -277 48 132 -126 -185 88 176 8 -73
3235g3K70l18k8M16j02l95M40K3j79j98M11j50m07K57K86k80k91L23K5m06N71
$$ -73 197 -121 -149 267 165 -230 210 233 54 -144 267 117 -290 -33 253 -27 -318 5 30 -376 195
3256A95Nm61J62L45j74j88K36l3j36J00J47j23j52R2J91m28J74L19k94q3L24j29
$$ 195 200 -261 -99 246 72 -116 120 87 -49 51 198 75 -77 15 206 -222 -48 271 -23 -106 218 89
3278H9r6J22qm11nL45M3l38K67L1j22n4K52j73k7Q4J70l66K21J39j71qJ00J47
$$ 89 -7 115 107 -304 -309 36 79 -259 8 39 -83 -137 115 -58 -85 -1 169 -197 24 163 -8 -16 84 231
3302B31n69K25J29l8o1J97o2q8J0K10l05k07L61P1l01K06K10k52k82N03j55j73
$$ 231 -338 -113 16 -22 -83 114 52 -36 -26 184 -121 -328 33 104 -197 9 219 -33 -315 188 33 -140
3324a40L19Q6m00K36J37j34n4n8J47j93J43K0k6k62J72J87l08n6L32k61r4K45
$$ -140 179 265 -135 101 238 104 50 -8 139 -54 89 109 83 -179 -7 180 -128 -184 148 -113 -207 38
3346C8N6l46J94J70j23q2N8J32l37L04K3k04j3J83P5k13J26M8j12QJ98Kk49J61
$$ 38 94 -252 -58 112 -11 -93 -35 97 -240 64 87 -117 -130 53 128 -85 41 89 -23 -15 183 185 -64 97
3370I7L2l85J31M54l00l82K65L16l28J06K19k96j42K13n5j7M3K04k74l7L67j03
$$ 97 129 -256 -125 329 29 -353 -88 228 -100 6 225 -71 -213 0 -55 -72 -29 175 -99 -136 231 128
3392A28k56NL50k49O8O0j10j68L0L70m89J57K32o0j55Q0J25j86j22K73k8k40J74
$$ 128 -128 -123 227 -22 46 106 -4 -172 -142 228 -261 -104 128 68 -87 -7 118 -68 -190 83 55 -185 -11
3415a1K49l00J8K50j13j14K6p7l6R0K33k64j10L41rj97J2J31j84p7J37K11l22
$$ -11 238 -62 -44 206 93 -21 5 -72 -108 -18 215 -49 -159 182 173 -24 -12 119 -65 -142 -5 206 -116
3438a16j18M08k46J7J29P1l06O5J18J32k36J14J10k58N7J64j18j88K65j54O2j1
$$ -116 -234 174 -72 -55 74 145 -161 -96 22 154 -82 32 142 -116 -59 105 -13 -201 64 -90 -28 -39
3460c9L9j78k4J96L6o3J54j08j30J40P3j27k45J78R4k7o7J87j89k55M47Q8k33
$$ -39 0 -178 -202 -6 30 -33 121 13 -117 23 96 -31 -276 -98 -4 -31 -98 89 -100 -355 92 180 -53
3483e3lP4l8m2J18K2j68J34J57k53j1M5J6n6J42L5k20j03J89RJ07j27%J41o4M8
$$ -53 -56 18 -20 -62 56 78 -90 44 201 -52 -63 -18 -2 -58 84 119 -101 -204 -15 -6 101 -26 -26 115 51 99
3509I9J9p8j03k4R0%Q6j3r3j00K56j38jR4J0m32L49R3k41P4O0jj45Q6J16l54J36
$$ 99 118 40 -63 -87 3 3 89 76 -17 -117 139 1 0 94 104 -328 21 114 -127 -53 7 6 -139 -53 63 -291 -155
3536a55K86j3j11K0P1j53j9K67k08n7J84q2j64J81L5l3oo3J43n1j18P2R6o3R6
$$ -155 131 118 7 27 98 -55 -74 193 -15 -72 112 30 -134 47 82 49 43 -20 123 72 -46 26 122 59 155
3561A55j27nj85K81j34k7R5K4j79K34O7k15m2J74j52J1J48J04l66m0L11j73j40
$$ 155 28 23 -162 119 -15 -42 53 77 -102 132 199 -16 -58 116 -36 -25 123 227 -139 -179 132 -41 -181
3584a81J75P0j02K7M8p5j71K29n0K7l5j8j15j5L13r9j38J29K7k5m2J65j26r4O7
$$ -181 -6 64 -38 -11 37 -38 -209 20 -30 -3 -38 -56 -171 -186 127 28 -110 19 46 21 -21 144 18 -76 -9
3609iJ28k54O6J36p4j95J99P6k19P1K23o2q2J54j31j95o7L68j24l2K9J5j16P3
$$ -9 119 -135 -69 67 -7 -202 -3 73 -146 -75 148 86 4 158 27 -168 -235 133 9 -23 6 21 -95 -22
3633b2P1k29L1K59q9j37J80P9j79N8O2M8l44L82k3j59k7J31j92L8K09L0k38O7
$$ -22 49 -180 -149 110 21 -116 64 143 -36 22 84 132 -212 170 147 -12 -39 92 -100 -62 147 177 -61 6
3657FJ53j99k8p0K81k94J36N1j88J41j2K22j28j71nK4J2M2J16j17J12Jo4r2J93
$$ 6 159 -40 -68 -138 143 -151 -15 36 -152 -11 -23 199 71 -100 -105 -81 -69 -27 89 -28 84 85 21 -71 122
3682A22j59j51J16K02k29j19M03j99n7j16K03n9O8L5rj95L43p6m90M04k4Pk21
$$ 122 -37 -188 -72 130 -99 -218 185 -14 -71 -187 16 -43 25 60 51 -144 199 123 -367 37 13 20 -201
3705b01K08n4r7P2L21k52o9J17M9k36J02K32j40k65J34J74j32J28L1j70k30M09
$$ -201 7 -47 -144 -72 249 -3 -72 45 94 -142 -40 192 52 -213 -79 95 -37 91 122 -48 -278 131
3727A31q7r6N3J0j39P7mJ06k71K87q1j7qJ37q3j87J54K31k61O7J86j32j09R7J46
$$ 131 44 -52 1 11 -128 -51 -55 51 -220 67 -14 -31 -39 98 15 -172 -18 213 -48 19 205 73 -36 61 207
3752B07l70K1K08k05m5J90j59L9O6J15j9j56J22J24l45L13J67m20J4J15lp5J22
$$ 207 -163 -142 66 -139 -184 6 -153 -114 -48 67 48 -108 14 138 -207 106 273 -147 -133 -18 -21 -96 26
3775B6L7j03%K23l1l07J84p0l0r4M8P1J8p4K53l14R3J32j19o8K96o1k44J41L9
$$ 26 63 -40 -40 183 152 -155 29 -41 -71 -165 -117 -46 -28 -102 151 -163 -70 62 -57 -125 171 110 -134 7 46
3800D6j23L3J03n0j47R7K15l39rR1j6k6K62n3j28j44J64n3q7L55n1l51N5L71j65
$$ 46 -77 -44 59 9 -138 -41 174 -165 -174 -83 -99 -125 137 84 -44 -188 -24 -77 -164 191 140 -211 -156 215 50
3825E0j25mJ68k21J32J74r0j91J70K7o3J41k8o5j43J41j9p6p0J85k16L3Q9L3j54
$$ 50 -75 -79 89 -132 0 174 84 -107 63 90 27 168 140 75 -68 73 54 -22 -92 93 -123 -90 -1 32 -122
3850a22K9K18j65r9K7K52j83J82k13j22J11l7K33mJ4L0j49n6K54o3j82O6P7k2
$$ -122 -93 125 -40 -139 -112 140 -43 139 -74 -196 -85 -122 111 107 121 151 2 -54 200 137 -45 21 98 76
3874G6j47K43j40k18J69m2j63J7Q9L5k36K20K57l64J58K04k34K5J19L0k16J32
$$ 76 -71 172 32 -186 -17 -59 -222 -205 -116 -81 -317 -97 160 -204 -46 158 -76 -51 68 98 -118 14
3896A4Q4j55O0J64l1j76K37q9j66n7K22r3j51O1Q5k47K74J55j98m5k6K03p0j5
$$ 14 98 -57 3 167 136 -40 197 108 -58 -115 107 14 -137 -76 9 -238 36 191 -7 -52 -78 125 55 40
3920D0N3j65lJ42N9k73R2%m6P0K47n7k90J76r2l3J20J18j65q2J27L7K5m5j39j1
$$ 40 93 -72 -75 67 126 -147 -55 -55 -101 -31 216 159 -131 45 -47 -80 40 158 -7 -89 38 75 100 55 -84 -95
3946i5mP6J07l09L3L19j29p7J12L8jk10K13j82o4J79l4Mj8K82m11J60L8m4nM0
$$ -95 -99 -23 84 -225 -192 127 -2 -79 33 71 70 -140 73 -109 -173 6 -28 -24 -42 240 -171 -11 27 -17 -22 18
3972A8K4p4k2L3m7j11K44J18j76m1J04k8j14J07L4L2j09M5Mm2L0J20j66L1n8J21
$$ 18 42 -32 -54 -21 -68 -179 65 183 7 -34 70 42 -72 35 69 101 -8 37 41 -1 29 149 -17 14 -44 77
3998G7j50l4m0K4K59j94r1K44k57J02N8J54j57Qj68J05J48o8L2J87j41l3M9j01
$$ 77 -73 -107 -147 -123 136 -58 -149 95 -162 -60 -2 152 -5 3 -165 -60 88 20 52 239 98 65 114 13
4022A3n7L4J10j51m7J86m5j05J6J16P9k88J22jq0N6P4j59n3K38o5j32J57L9j62
$$ 13 -44 -10 100 -51 -98 88 43 -62 -46 70 149 -139 -17 -18 -98 -42 32 -127 -180 58 -7 -139 18 57 -105
4047a05J81P3k95J06O2J10o7k09J63O3Jj94K03j13O1p6N7k02K60Q0l41J10J42
$$ -105 76 149 -146 -40 22 132 65 -144 19 82 83 -111 92 -21 40 -36 21 -181 79 159 -182 -72 70
4070G0j01Rj18J67j01J28K0j9pj04J41m9k29L27k27LQ8O2j04M0J06k58J50K2Q1
$$ 70 -31 -22 -140 27 -74 54 74 55 48 -56 85 36 -193 134 -93 -90 -2 60 -44 -4 102 -156 -6 16 97
4095I7k03K24k07P0k3r2L2N4J24J6J8k89K64k36K62j75K50j69K4rmO7n7j19Q9
$$ 97 -106 118 -89 -19 -42 -134 -102 -48 76 92 110 -179 85 -151 111 -64 186 17 41 32 28 95 38 -81 8
4120HJ63j66J63l17P8K02k18P0P4o4l7n7R3K9K5J04l34J38J06j3q2j3j5q0O3K34
$$ 8 171 5 168 -149 -71 131 -87 -17 57 -7 -44 -101 -8 21 46 150 -184 -46 60 47 -35 -48 -63 -143 -80 154
4146A54q5r2k6J13k1k4l9o3pJ69n5l15K78J32j80R2J25j25j91J02mQ2j03J16j57
$$ 154 69 -23 -49 64 43 19 -20 -83 -90 79 24 -291 -13 119 -61 31 156 31 -160 -58 -62 20 -83 33 -124
4171a24rlJ72n2R4k4q1j16J44l3l5p9K22M0j41j2J34o6o5om7J67j94K79o8j53
$$ -124 -133 -136 36 -16 78 54 -27 -143 1 -32 -67 -146 76 116 -25 -37 97 31 -34 -40 -87 80 -114 165 97 -56
4197e6J17n6j86L02j12j07J19J57k59K5J95p2n0K9J0n6N9M6lk66J17N6R8k18J70
$$ -56 61 5 -181 121 9 -98 21 178 -81 -56 139 67 17 46 56 0 59 105 102 -164 -47 9 107 -111 59
4222E9n9r0K07j12q0L2P0J3j9J38j43J11r2J07k27J52o2n7q7K61j2lj45J2J94
$$ 59 0 -90 117 5 -75 -43 27 40 21 159 16 127 35 142 -85 67 5 -52 -139 122 110 107 -38 -26 168
4247A68k32J40m1k8p2K11l8p5l7N7j13J6M1N8j13K10l01R8j01K97M9j32J47k74
$$ 168 -64 76 35 7 -65 146 108 33 -4 53 -60 -44 -3 55 -58 152 -149 -51 -152 145 194 62 209 -65
4271f5J38j77J37R7k66L48j98R5j59J04J3k44R8K77l26J47J26j92J47j63J00j07
$$ -65 73 -104 33 130 -136 212 14 109 -50 54 67 -177 -79 198 -128 19 145 -47 100 -63 37 -70
4293g0K3J45o0n8Q7J7q3k1J43j77r0J68Qp3J0RJ7j41L16k08n8J85O0j96j04J80
$$ -70 -47 98 38 -20 67 84 1 -20 123 -54 -144 24 32 -41 -31 -22 -5 -146 170 -38 -96 89 149 -47 -151 29
4319B9j03J52k7J20k55J28p7qk00K92J03k47J1K29k98J14J17m7q4K53j67m8k23
$$ 29 -74 78 51 171 -84 44 -33 -41 -241 51 154 -93 -82 147 -151 -37 80 33 -51 202 35 -13 -236
4342b36L95j68j48J00N2j76R0R5P8o0LP6j5r2P8M6j86J96j31p2m4J07K0mr9J47
$$ -236 159 -9 -157 -57 -5 -181 -91 4 82 22 25 101 86 -6 72 118 -68 128 -3 -75 -119 -12 8 4 -95 52
4368E2r4P1PM9r2p9K9l8J10n0P3j23J31K9j1n3K1p6J29R5n2k33K09j03j53J28
$$ 52 -42 29 36 85 -7 -86 -57 -95 15 -35 38 -85 46 75 64 11 32 -44 85 180 128 -105 104 1 -152 -24
4394b4N9m5Q3j43P5M5j79N2M1N9L1M0Qk00J49j85K98j0o2L5j49J32n2j82J43k3
$$ -24 35 -10 73 -70 5 50 -129 -77 -36 23 54 94 102 -98 51 -134 164 154 92 127 -22 110 58 -124 19 -4
4420dL4m2M4q9Q4J28j31j10Q3Pl1L1J5m4o6J51J4k63R6J80o7M3j25J38o0l2O9
$$ -4 30 -12 32 -57 27 155 24 -86 -3 4 -27 4 19 -25 -91 60 74 -189 -93 87 20 63 -62 76 16 -16 53
4447E3K0j91K96j19m8Rj71K32j0L6o5k70L49j65Q8j39NL02j79n1K4K9M5q7J04
$$ 53 73 -118 178 59 11 20 -151 81 71 107 42 -228 121 -44 44 -95 -90 212 33 -18 6 35 80 -7 97
4472I7p2j5K01k23M9q8O0j67K77Q2j18j51K39o1j28J33O4k14oQ8N0j53O0p4K03
$$ 97 25 10 211 -12 37 -51 9 -158 119 201 83 -68 171 110 -18 115 179 -35 -41 47 97 -56 4 -70 133
4497A33q8J6n2j87J67J6j16K47q9o6o3P5R0j73J29p9K0Qj3o0R8Njk10J45rN6K6
$$ 133 45 61 9 -178 -11 5 -111 136 47 -19 -82 -7 83 -90 39 -40 -20 -12 -25 -85 13 18 17 -193 -48 -57 -1 25
4525B5pQN2k23K81O8k16M3J12k34O1L5J6r2K81j92j98J38Q1O8j62J60n3ol2N2
$$ 25 18 26 78 -145 136 204 -12 31 143 -91 -30 5 21 -71 210 18 -180 -42 39 107 -55 105 52 46 14 66
4551F6k30j5L11J0k21J57l7j7r5J57rj25K0J87j42jk0J39j63J52%p5p7O7Nj85
$$ 66 -164 -179 132 142 -79 78 41 24 -71 86 77 -48 -28 159 17 16 -4 135 -28 124 124 49 -28 39 44 -141
4577a41J49K82j31j01oK7k3j7J16j74K9J12q2j40N4M2Lo5O8n3j0J10q5nJ26L2
$$ -141 8 290 159 58 52 79 56 39 155 -19 10 122 40 -100 -46 -4 -1 -66 2 -51 -61 49 -36 -41 85 117
4603A17j49L4N1m6Ok7j28Q3K9P7j3J68j23J43k89jK45o2k96J54L9QJ8N2n6OK8
$$ 117 -32 2 53 7 13 -14 -142 -59 -30 47 34 202 79 222 -67 -68 177 115 -181 -27 12 20 38 90 34 40 68
4630F8m5l3j5J1j15N5P6O1m3j01O6K00k44R8n5j36J99K6p4j76K87J48j72j58K0
$$ 68 23 -10 -25 -14 -129 -74 2 63 20 -81 -15 185 -59 39 -16 -152 47 73 -1 -177 110 258 86 -72 -52
4655e2O3j08oK61k10m0L7J6k9R7Jr6K26k62R7j3m6L9L2r9K05m2j58P7mM7P1j32
$$ -52 11 -97 -103 158 -52 -92 -55 -39 -68 29 30 -66 160 -102 -5 -18 -64 -25 7 -92 113 71 -87 -10 -14 33 104 -28
4683b8J04o8J03j18n8J35o6N9q1qj8r8J36J45j96l6J77l7m4Ro4J31j04K5o6q4
$$ -28 76 8 111 -7 -65 70 4 63 -18 -26 -44 -142 -6 139 -57 -93 84 47 3 12 -52 79 -25 0 -66 -150
4709a50J89r8l2J86j38J32j24J23N3k12KJ76l27L01L2l55K14K5J7j29K6R2rn8
$$ -150 39 -59 -91 95 -43 89 -35 88 141 -71 -69 107 -220 81 113 -242 -28 -3 14 -115 -89 3 -6 -64
4733f4K36q8k96JJ54K54q3o1j52l6J64p0J22l9p4pj17J09J5j88J67pm4j55K43
$$ -64 172 84 -212 -211 -57 197 114 53 -99 -135 29 -41 81 42 -32 -39 -156 -47 -32 -220 -53 -60 -104 -259 -16
4758a6Q4l3O4j63K17k90L74k95J50N7k16m9R4R2j33p3J64J1l6%P8k4j47J30j8
$$ -16 68 35 99 -64 153 -137 237 -58 92 149 -67 -116 -22 70 -63 -136 28 39 3 3 81 57 -90 40 22
4783B2J6KN0r5j35P1k3N1J57j71j01J30K6n1N9ON2j4k56L86J6j24o3K8Oj41Q2
$$ 22 38 40 90 -5 -140 -69 -92 -41 116 -55 -156 -26 0 -51 8 14 66 52 -204 182 198 74 11 39 45 -96 -14
4810a4n7J8L4k6Q5r7P3p4j22J19K04nj20k17L10p6m0Q0k01N5K24p0j78J30o9k5
$$ -14 -71 -53 -19 -45 40 -57 16 -58 -180 -61 143 138 18 -199 111 35 -5 75 -126 -71 153 83 -95 35 -34 -59
4836e9J32j57J11l9m0J39j59J22m5k4k2j29J57q4j6J11J9j21K02k07j3O6K9P7
$$ -59 73 -84 27 -12 -52 87 -72 50 5 -19 -41 -170 -13 -97 -113 -2 17 -104 98 -109 -122 -56 -27 50
4860E0j33K28n5O3q9J23k31R5L2j45K14k02J46n9k02J37n6R7j0p3J05j84R6N7
$$ 50 -83 145 90 153 64 187 -44 51 83 -62 152 -50 96 37 -165 -28 -84 13 3 -70 35 -149 -53 4
4884Dn8n2k8k2P9r7K36k17J04J33q6m7P4l4R6Kl6j55j0K20j27p0K03M8k65NJ27
$$ 4 -54 -106 -134 -156 -77 -174 62 -155 -51 82 -4 -51 23 -11 85 87 51 -104 -114 106 -21 -91 112 160 -105 -100 27
4911B7O3j43R1K6j15Q7N7o0M8N2o9j54Q2j35k4P9J26J62k77N4%j20k2K00k3q5
$$ 27 90 -53 38 64 -51 36 93 33 81 133 64 -90 -8 -143 -167 -88 38 200 -77 -23 -23 -143 -165 35 12 -73
4937g3J61K1j21Q7m1Lq6L4n1K10k08N1J05p2l4Q9J6j99L5O7p3J08r1N1O5J04j47
$$ -73 88 109 -12 75 34 37 -49 -15 -66 144 -64 -13 92 20 -14 75 91 -108 -73 -6 -79 29 -62 -11 54 158 11
4964A1LJ34j99P7j13J53k69J31J15p0m8J47Q3j44j80K93l01J80n6J59l12J55R7
$$ 11 14 148 -51 26 -87 66 -203 -72 43 -27 -75 72 155 11 -169 124 -177 3 -53 106 -206 -51 46
4987D6n2j2J4j97J27J31j94K61j2n0P6k01pJ44Kj31j6M5j9m0J55j7o4r2K36j55
$$ 46 -6 -18 -4 -201 -74 57 -137 124 112 62 138 -63 -70 74 76 -55 -71 -26 -45 -85 70 53 -11 -103 133 -22
5013b2n4o1P4J10RJ9j03M2J3n4j39K17K6j04J70k10J41l0j58J14j28J30k1n4P8
$$ -22 -76 -137 -63 47 56 75 -28 14 27 -27 -166 51 77 -27 143 -67 74 44 -114 0 -128 2 -19 -73 5
5038Ej53L8Q0q4n0J38q1j00K05j06K05q0J5M0j17JN7J8r8l3K00j65jQ7J36j28
$$ 5 -148 -110 -30 -114 -164 -26 -107 -207 -2 -108 97 17 32 72 -45 -44 13 31 -67 -100 100 -65 -66 21 157 29
5064B9j07J35j3j0nM3P8j24N7j86O6j21J95n3m9k8N9n5J44k6R8k06J76o5j27K06
$$ 29 -78 57 44 34 29 72 150 26 83 -103 -37 -158 37 -16 -65 -93 -34 -89 55 29 127 -79 97 32 -95 111
5090A11p3k8k3q4J74o4j23O2j31K07L5j01J6j26J71j39J45M3n8k08N3K30J4k49
$$ 111 38 10 -13 -97 77 13 -110 -48 -179 28 63 -38 -22 -148 23 -116 29 72 14 -194 -141 89 103 -146
5114a46K98j19M7j17n0J82r4K8m2J21j69K2MK7Q9j8j37J38j54K4J92j34n8o4K44
$$ -146 152 33 80 -37 -87 95 1 29 -13 108 -61 -39 -35 -8 81 63 -74 64 -90 -66 126 -8 -66 -130 114
5139A14q2j14J19L8j71J04J10J9j60P2K2k45K48q3J09j73P3M4k2m9oq3J40pj15
$$ 114 32 -82 37 75 -96 8 118 137 -23 49 71 -174 74 -9 100 -73 0 44 22 -27 -33 -116 24 17 -98
5164i8J23K0k7j19J3J48Q5j08n9n6P8J37r0R2j10r4J07J23j94J70k62N1K02j00
$$ -98 25 45 18 -101 -88 60 145 37 -22 -78 0 137 47 139 29 -65 42 165 -29 141 -121 -70 132 32
5188C2n1j09J42jM5l3q4k3J12p2J02j92J28N7p2O0J03Jk18J02O8j46K14q1j51
$$ 32 -19 -128 14 13 58 25 -59 -82 30 -42 60 -132 -4 53 -19 41 144 145 -73 29 97 -49 165 84 -67
5213f7K10K0n3j05j4Q5k0m0j09Q6n2N3J08n7p3J59j57j4j7J68k36J24O3p1j59
$$ -67 143 163 110 5 -9 76 56 16 -93 -7 -59 -6 102 45 -28 131 -26 -40 -57 111 -125 -1 62 -9 -168
5238a68K30M5k0j24K16k5l63J40K1k1P2O3o8m2M6N9M8k14J46N0o3K2j50OJ15L7
$$ -168 62 107 87 -37 179 154 -209 -69 -48 -69 3 66 -2 -44 2 61 109 -105 41 91 28 50 -100 -94 21 58
5264E8j21J31lj21J14l5Jp0J71p9k5l5q3Q7p3O6J65k26L4J57j93J0J60q2P6k17
$$ 58 -63 68 65 -56 58 23 24 -46 125 46 21 -14 -97 -10 -83 -17 148 -78 -44 113 -80 -70 90 8 84 -133
5290a33P6K31j53j52K9j2J12O4N2j52j45K27p0q3J84k12O4J86q4r6k8K40r6j82
$$ -133 -57 174 21 -131 -102 -114 -2 62 114 -38 -183 44 -26 -109 75 -137 -73 113 29 -67 -95 145 49 -133
5314a33K30m1M2j25Q9P3j48q3jM3o7K32j31p9K22j09j78jJ87r2Q5l2P4p2k5P1
$$ -133 97 56 98 -27 62 135 -13 -96 -97 -54 -121 111 -20 -99 123 14 -164 -165 22 -70 15 -17 57 -15 -40 31
5340C1r3J4J42l3m3o9j63K78k43J84J00k36RK8K08j90j26L80k64NJ24j18K32j57
$$ 31 -62 -48 94 61 18 -51 -214 64 -179 5 105 -131 -122 -94 114 -76 -202 178 -86 -81 43 -75 157 0
5364@L0j29J32k08P5K39j23L3j31J27j49M7p1l0J56r7J89l7p5Q6j55O0L6n9O7
$$ 0 30 -99 33 -175 -100 139 16 49 -82 45 -104 -57 -128 -158 -2 -99 90 53 -22 64 -91 -31 5 -54 13
5389A3k06K78M6o2R0j09n4k7J9J40j46p7J11M9o3j55K67r7L0j23J46j53j7J70
$$ 13 -193 85 131 69 159 50 -4 -31 -12 128 -18 -95 16 65 2 -153 114 17 47 -76 70 -83 -100 70
5413G0r4o3J77J22j48O1M6k89Q6R6j73k9K51j5q3p9N4p3pJ69K3o3k05K19K8p4
$$ 70 -24 -87 90 212 64 125 171 -118 -32 64 -109 -138 113 98 15 -64 -10 -83 -90 79 102 39 -166 53 81 7
5439GL6rMN3p6Op6P9j11J46l3p6P2j72J78J0Q6MJ4j51Q1o0m6o9R3J1J07r1o2Q
$$ 7 43 34 38 91 15 21 -55 24 -87 59 26 -50 22 -150 28 38 124 128 142 -9 72 12 -34 -103 -10 1 108 17 -45 -37
5469c7N2l9l2m1P0K02k90Q2k4O5l4O0j17J80k14R5J57k39J18j06L4J61J21j85
$$ -37 15 -24 -56 -97 -27 175 -115 -33 -57 8 -26 34 -83 97 -117 -22 135 -104 14 -92 -58 103 224 39
5493C9q5J09K9ro0%o5J35o9j7MJ13j88Q4K8j66R6m0R9m9n2J43j29K3P6j00J77
$$ 39 -46 63 92 83 23 23 -42 93 24 7 11 124 -64 20 48 -118 -22 -62 37 -12 -64 79 -50 -27 49 -51 126
5520A26j09j54K01J7l7j44Q5jl6J26p8j79K21j64P1j3O5J37q0Ok03P8J92j10K7
$$ 126 17 -137 64 81 44 -100 -15 -16 -52 74 -4 -183 38 -126 -55 -68 -3 134 54 60 -143 -65 127 17 44
5545D4M2l1n1j5K9P9q5M1p2J08k25J66M1r8O3k0M9oo1J37j46k45K28J00j04k7
$$ 44 86 55 4 -11 18 97 12 53 -19 89 -136 30 71 -27 36 16 65 59 -2 135 -11 -256 -28 72 -32 -59
5571e9k0J84j16P6Q1l07J08N8l4K5j54K60k85K55r7J55q2p8m0J6Q0n1P7p6jO1
$$ -59 -79 105 -11 65 146 -161 -53 5 -29 -4 -158 102 -183 72 -25 130 48 -30 -70 -54 26 -25 52 -24 -25 36
5597C6r3N7Nn4J37j82K6J05p4mM5M7qj50J26kq9N6O4K6j16R0p5O6j22J6KNK41
$$ 36 -57 0 5 -49 88 -94 -68 37 -37 -41 4 51 43 -107 19 17 -72 -16 48 74 -42 48 -27 39 -83 -67 -65 -60 181
5626A81j89j91J77J50j04N9o2q0P7n7K2o8M6O5J5j47nJJ16k18J93m6K27k14M7
$$ 181 -8 -199 -22 128 24 83 21 -59 18 -39 -17 -85 -39 26 41 -106 -111 -110 6 -212 -19 -65 162 -52 -5
5651eK3k41J00J25o3K06j82R4j67L3p7J50L1q1J14o3j09K35j18Q1l7j79J70j9
$$ -5 18 -223 -123 2 -61 145 -37 57 -110 -77 -154 -4 27 -54 60 -3 -112 123 5 86 49 -130 40 21
5675B1n6R7j04J53q3j29J71j7J28j40kj67J28K22k25L5p6N0pl3J65k54P8n4J62
$$ 21 -35 62 -42 111 28 -101 70 53 181 41 39 -128 0 222 -3 32 -44 6 -1 -34 131 -123 -45 -99 63
5700F3j73J20p5r9K18k74L09j39K8J36j70l4J52l4j73J12K6j90K04K2l1j4J36
$$ 63 -110 10 -65 -164 54 -220 89 -50 -22 114 -56 -90 62 28 -145 -33 -7 -197 7 29 -2 -16 120
5723A20j14m3J14j79J5K5n0J89n3j29J34k9Mo8J88j28o3J33j24O6R6k6J16k53
$$ 120 6 -37 77 -102 -87 -62 -112 77 24 -105 29 0 4 -64 124 -4 -67 66 -58 8 104 78 194 -59
5747e9K59k03j49K69j06J3R9k01P4R3r4j3R5N4k51L00p7j33R9j07K5K38j54m3
$$ -59 200 -3 -152 117 11 24 123 -78 -4 89 -5 -18 77 131 -120 180 103 -30 69 -38 -13 225 71 28
5771B8p0R7N2j77J6P1RR2k61K63j07J4l9J8K9q0K6R5K1j61k7O1P6k34K99j70K05
$$ 28 -42 55 107 -70 -54 17 26 118 -143 120 13 27 -12 6 35 -45 -19 76 97 -64 -91 -30 46 -188 111 -59 146
5798A46j62J32k48J04K82j88o1j5P5O6j13j55K53p2P7j34M1l3nM3r3KR8j65J41
$$ 146 -16 116 -132 -28 254 66 5 -10 65 131 18 -137 116 44 121 -13 28 -5 -10 33 -60 -58 40 -125 16
5823A6K11l85j6J88J68k05K2N4Pn4P1m5j69J20N0j91J94N8j07k9KJ05L6P3j47
$$ 16 227 -158 -174 14 182 -23 -1 53 60 6 77 32 -137 -17 33 -158 36 94 -13 -42 -40 65 101 174 27
5848B7M8k07j8J31J1QJ36j27KN7mQj01Q7l8n8L6Jr4L4J93r5o5k9K00k05O5L1M
$$ 27 75 -132 -150 -19 -8 0 136 9 11 68 64 72 -29 58 20 -38 -2 -1 -95 -61 132 37 -28 -57 143 -62 3 34 38
5877C8q4q5L08j16m9N5j72r3K77p1j48P2J11o3k1L9Q7j04j58Q8J89m7j7%r3l3
$$ 38 -46 -131 177 61 12 67 -105 -198 79 8 -140 -68 43 -20 -41 -2 85 -19 -177 -89 100 53 36 36 -57 -90
5903i0J17n3l9J15m1m5p2J37P8m1r6J22k0K0k13J64J8mj82M9J23j60J57Ko2j7
$$ -90 27 -26 -65 50 9 -36 -108 29 107 66 -30 92 72 92 -121 43 61 57 -125 -76 47 -113 44 46 -16 -33
5929c3k8j74K18pM9N6p5J26r0j69J18J14n8j39j0N6R3r7L3NJ6P4j0j13l4l0J87
$$ -33 -61 -235 -17 -24 25 81 6 132 42 -127 -9 105 47 -92 -102 -46 47 -50 -17 -12 4 78 68 -45 -79 -109 78
5956G8q0j06J5M6J58o3K2J09k04P6j04K1J2J0j02J01K37k47L4l5J87l33R9J07
$$ 78 -2 -108 -93 -47 111 48 70 179 -25 51 -53 -32 -20 -10 -112 -11 226 -21 13 -22 165 -168 -69 38
5980C8L4p8LO6mk3L9j27Lm2P4jM6j58l5K00O0j40J41K9j69J25k41J82l0n7j0L
$$ 38 72 -6 -3 63 59 36 75 -52 -49 -91 -17 -18 28 -130 -165 35 95 -45 96 125 -44 81 -160 22 -8 -65 -75 -72
6008g2LP4L7l7j26J50kk2K3r6M4kL8j6L2j18P1l8K5J40j7j16O1J15j94J32j08
$$ -72 -69 5 42 5 -121 29 27 5 28 -68 -24 -26 12 -4 28 -90 -19 -57 -32 108 91 -25 36 151 -43 89 -19
6035a9Q2o0Q0l8j06P5J03j19n2K02q1j22m2J65j47L1k4J01j07N4Q8j38J8l0J3
$$ -19 63 3 83 45 -61 14 117 -2 -54 148 67 -55 -97 68 -79 -48 -72 29 -78 -24 64 -74 -56 -86 -73
6060g3R5r6r3L26k06J72Q0k54J8J00p6N5j14J85Q5l07M9N5l4J54Mk16O9J58q4
$$ -73 22 -74 -167 159 -47 125 205 -49 -31 69 -7 48 -66 119 204 -103 -54 1 -33 121 125 -91 -22 136 52
6085E2Mj11L15l27Q7J51k06rM3j8M0j65J43j54Q9Q0M3N9r7J24J32l82R8j16O1
$$ 52 56 -55 260 -67 20 171 -35 -44 -1 -19 21 -144 -1 -155 -66 14 57 116 19 143 275 -107 -9 -125 -64
6110f4J12K8j32k2LK09j81J44q1J9p8M7J09k1M6j12j19O6M2j22P7mJ23j62Q6k0
$$ -64 48 76 -56 -78 -75 134 -47 97 16 35 -43 4 113 92 138 26 -93 -27 15 -107 -30 -34 89 -73 13 -7
6136gm6J56o7Pq5P7k4j26J71m0k9J7L0k0j8J3J8k5n1J58j11o6L41k23o6Q4j00
$$ -7 -53 103 36 43 -42 35 11 -115 56 16 -13 4 34 14 -4 9 27 2 -49 109 -2 -68 273 50 -16 68 -32
6163c2l4L5k4O9m2o3P8p0N3N5O1p1PL3L3l2J2r9J30r4P1j57%O4qJ5j19J05k6J26
$$ -32 -66 -31 -55 14 -28 -91 -13 -83 -30 25 86 15 22 55 88 56 68 -31 99 5 76 -81 -81 -17 -25 -10 -129 -24 -50 76
6193G6p9J30j9k67J07q8J05J40n8q9k7J21j24O1R8k9j23J96o4Jr8J22j78j05K56
$$ 76 -3 127 108 -159 -52 -140 -35 105 47 -42 -69 52 -72 -11 87 58 -65 131 67 68 -30 92 -86 -191 65
6218F5L5j70M3M3j40J49j44N1O4k3J22N5j41J68k39N5P8q7n6J55j01P7m5j14J38
$$ 65 100 -70 -27 16 -124 25 -119 -68 -4 -27 95 150 9 177 -62 -7 71 -16 -72 83 -18 59 14 -100 38
6243C8n3j81K90l7Km1pl5pR9n6j46J81R5l26J24R9j05j08J62K8j1%n3Q5j2k9o1
$$ 38 -15 -196 94 57 59 18 11 -24 -31 68 12 -134 47 142 -184 -60 39 -66 -174 -12 16 5 5 -48 37 25 -4 -65
6271f5K21j04M1p3LJ56k71O4l6K05j41J47k65R8J44k65K13MM6n3j63Q7L3M4J14
$$ -65 156 52 93 20 23 179 -92 -28 -64 141 0 147 -118 -20 124 -141 72 76 122 69 -94 -7 26 70 184
6296A84j40l2j51R0J6K4pl4J12rj81k2Q7J20j63J47m4P8N8j21l1N8r5l8J70o%
$$ 184 44 12 -139 -49 -33 -9 -16 -50 62 53 -128 -150 -63 57 -106 41 -3 75 133 12 -19 39 -56 -94 76 70 70
6323G0m0j19N2J9o2J08k1o7q3J01j91L70j26l9L9OJ13k10N1P3o5M9j76J95m7P1
$$ 70 30 -89 -37 -18 -80 28 7 -60 -143 -42 -233 137 11 -28 11 17 130 -80 -29 44 -21 28 -148 47 0 71
6349G1j45O5J44L0o8j44R1N6j47n8J39L0l2pj2P8J22k95K08k45%J08l7P0Q0l5
$$ 71 -74 -9 135 165 97 -47 44 100 -47 -105 34 64 32 25 13 91 213 -82 126 -119 -119 -11 -48 22 102 67
6375F7q0N9M7P6m6r2J2j55J40o4K5p5J05K0n2n7JJ32q7Q4j37NK16p9J6j62K18
$$ 67 -13 46 93 169 123 31 43 -112 28 -36 -11 -86 19 39 -13 -70 -69 63 -24 60 -77 -72 144 65 81 -81 137
6402A37o8m1J0Lj03L2q8J81Rj41M1J35q0j19q3J45o8m3M0J66kj25J61rj24j5n6
$$ 137 69 28 38 41 -62 -30 -118 63 72 -69 -28 107 27 -92 -175 -30 -98 -141 -101 65 63 -62 99 90 -34 -49 -105
6429a05J85n4p0m9J92r6j9J48j64N5P6Q5k84qK17j81K00q8M4j65L01k71j5K3L0
$$ -105 80 26 -44 -93 99 3 -16 132 -32 23 99 184 -100 -108 109 -72 128 40 84 -81 220 -51 -66 -43 -13
6454a3m4Q1k1k0n1J67p1l4r0J07L1J11j5r1rm5J02J22j67P3j76j9L5J40j38j40
$$ -13 -57 24 3 -17 -68 99 28 -6 -96 11 42 153 138 47 38 -7 95 217 50 123 -53 -72 -37 103 -35 -175
6480a75K97q9j08n5K06M1o3j89J56j3l8P0Ok1J16j9j50J38k8j72J94K1j48M8j62
$$ -175 122 33 -75 -130 76 117 54 -135 21 8 -30 40 46 25 141 122 -28 110 82 -90 104 125 -23 25 -137
6505a37R7RJ26q0r7j0P9n3M4Q9j98J41N4r3R8j39J64q0J1K2M2k29J99L3k59rJ31
$$ -137 -40 -31 95 15 -82 -92 -13 -66 -22 67 -131 10 64 -29 69 -70 94 14 25 47 89 -140 59 92 -167 -176 -45
6532d5L6k7K43n0j74J4J20k07J32o4p1K2kQ8l2Oj8J46j90J77p5j11O1K2r9J43
$$ -45 -9 -36 207 157 -17 -3 117 -90 42 -22 -93 -71 -73 15 -17 -11 -29 117 -73 104 29 -82 -21 1 -98 45
6558D5m3O5o8l0J32j75J06p1K05k25L2J6K2P1j35J7M4j0j23J67m4jmR8j59N3m2
$$ 45 2 67 -1 -31 101 -74 32 -39 166 -59 -27 -11 11 82 -53 -36 8 -2 -125 42 -2 -3 -7 91 -68 -15 -57
6585e7P4n6j8m6J50k8N2N4l89K91K01k70J10p5j21Q6N5j23OO3Q8L8j96K60j97
$$ -57 17 -39 -57 -103 47 19 71 125 -264 27 228 -42 68 -7 -128 -42 13 -110 -104 -41 47 85 -111 149 -48
6610d8p4J49p1j07J79j21J79m7L5n9R6q1l1k9%K13j38p1j01N2l5N8N9Q8o3j27
$$ -48 -122 27 -44 -151 28 -93 86 39 74 15 111 30 -1 -30 -30 183 45 -26 -127 -75 -110 -52 7 95 32 -95
6636i5%J32M1q3j15J74r4N7J11q2j25r4J02J15m3l9K17k26K2p4K01j08Qjj70J19
$$ -95 -95 37 78 -5 -120 54 -40 17 128 46 -79 -173 -71 44 1 -38 179 -47 -25 -99 102 -6 2 1 -169 -50
6662e0l7J4J56k44L49k09KN9J6p4p3j7L2M6K5n1P9k8r4o8L03r0L7l9N2O7j18j12
$$ -50 -87 -73 83 -161 188 -21 -19 40 56 -18 -91 -108 -76 -30 -5 -56 23 -5 -99 -167 136 46 83 44 96 163 45 -67
6690f7pJ07n0L3j74K92j31J0MpJ9j52K74j27r0J67j82O1Q1Mj31P3L1O0j08m6P1
$$ -67 -74 33 -17 16 -158 134 3 13 17 10 29 -123 151 24 -66 101 -81 -20 61 65 -66 7 38 98 -10 -56 15
6717A5p4J42l5M5p5K5k4j48K11q4j9k4p3J90j34j72J87q4rJ93K0rN1r5R4j84L3
$$ 15 -59 83 48 93 18 43 19 -129 82 -2 -21 -45 -118 72 -62 -234 -47 -131 -140 53 73 64 115 20 114 -70 -37
6744c7Q8j09P0k1J2L1k4r0K8J23j23lJ1J28j28Q0j12J40n3r7P1P4j81N4J12M4
$$ -37 51 -58 12 -9 3 34 10 -80 -52 71 -52 -55 -44 84 -44 36 -76 64 11 -86 -15 59 -122 -68 44 88
6770H8lj23j07J01k8J30l5J7m2O8k5L1k17K01k67J25Q6j91J83J9j41K08J1j77
$$ 88 85 -38 -145 -44 -72 58 23 40 -2 66 41 72 -145 56 -211 -86 0 -191 -8 11 -130 78 89 -88
6794h8J61o0L5r5J67q9j10J04n4K8q1K68p0j78j29J15R9j00J38j51j4J2L58l23
$$ -88 73 13 48 -47 120 31 -79 25 -29 -1 -82 186 116 -62 -191 -76 23 -77 61 -90 -104 -92 266 -57
6818e7J69j00j9j06M5O2l6m2K07q4o9M7q6N6K57l02l7J40k21J26M4J64k15J49
$$ -57 112 12 -7 -113 -68 -6 -42 -84 123 39 -30 17 -69 -13 244 -58 -95 45 -176 -50 -6 158 -57 92
6842I2j19J20j60J3J15r5N7p9L7r6R7J16n0q7RQJ00m7l5N6j59M7N0L0M7j41O6
$$ 92 -27 93 -67 -54 61 -34 23 -56 -19 -115 -18 98 48 -39 -30 -22 78 31 -4 52 -107 -60 -10 20 67 -74 -8
6869hJ9m4O6j4q3Q3J75j30k04K23j91RJ69r1Q0n0L1J1Q6j88Pj3P7j46J21l7P8
$$ -8 11 -33 33 19 -64 19 194 64 -140 83 -108 -99 70 -21 59 9 40 51 137 -51 -44 -57 20 -126 -5 -42 36
6896C6j06J31%j7l3k9j7L4m1q0J86j7L6L1j24N0j25J11Q0j13J5R1n4J02k73l3
$$ 36 -70 61 61 44 11 -18 -35 -1 -42 -122 64 47 83 114 -10 40 -85 26 106 -7 8 99 45 147 -126 -159
6922a59J58J20p4k3KO0l9O1l2j17j1j15J42K5j73K91l3j85N4k4Q2J2J50j03j11
$$ -159 -1 119 45 22 24 84 45 106 74 -43 -54 -169 -27 -2 -175 116 83 -102 -48 -72 10 22 172 69 -42
6947d2P3m7o1O8oK18j80q2J56j15K0M2m1k04O4J95o7Kn8J44p3J50j77oJ78j74
$$ -42 31 -16 -77 -9 -15 203 23 -59 97 -18 2 44 3 -201 -137 58 -9 -7 -65 79 6 156 -21 -27 151 -23
6973b3r1K10j86R6m8MQ9j3j53Q8L1p8J66l1r7KJ49l8j7q5pJ39j16r2L0n7J26L4
$$ -23 -114 96 -90 6 -42 -38 51 38 -115 -27 4 -74 92 61 -36 -34 115 77 60 -25 -32 107 -9 -101 -71 -128 -2 32
7001C2P3j38mK56l35J08N0j26J34kp6j8J44k15J97m9R6o2oJ45k65R6kKR8P2k37
$$ 32 105 -33 -37 219 -116 -8 42 -84 50 48 -28 -46 98 -117 80 31 127 65 59 204 -61 35 33 35 133 205 -32
7028c2J66j97%K1M7q0M7j00N5J72j45N5J29j84M5p2r1J06R2Q4r6j17L6J03q8J5
$$ -32 134 -63 -63 -42 5 -75 -28 -128 -73 99 -46 9 138 -46 -1 -73 -164 -58 34 118 22 -95 -59 44 -44 -29
7054b9N0J5J16l3j02j95J53JP0p7R3m4K0N8j53J04n2Mj20J94NN6n8q4Nqj8JJ67
$$ -29 21 36 152 119 17 -178 -25 -24 46 -31 62 18 38 96 -57 47 -5 -1 -121 73 78 134 76 -8 -3 -11 -29 -28 139
7083A39j20n3J05j25N3m6J12k5Q5l13K50j86N2R5m8m8M5j2Q7M5r9l5k0J09j23
$$ 139 19 -34 71 -54 -1 -47 65 40 125 -188 62 -124 -72 23 -25 -73 -28 -40 47 92 -7 -42 -62 47 -76
7108g6K1o1J79o6L5k8m9J31j0M6K1k88K52k2jp2n2m5Q9l3J08m7j00P0r2pL6J5
$$ -76 -55 -116 63 -3 32 4 -45 86 76 122 143 -145 107 85 84 12 -40 -85 4 -29 79 32 -68 2 -90 -97 -61 -46
7136d6K46j05j48J36q6QJ18j03j09K58k62O4n3J01K6N5q5mk4rJ32j19L2L6j8m9
$$ -46 200 95 -53 83 -3 5 123 20 -89 169 -93 -29 -82 19 45 100 15 11 -13 -22 110 -9 23 59 41 -8
7162hr3Q3j5Q6q2O3L3j48j54K83j28L5kJK48j26j12L1j18O1J52R4k21j3M9M2j02
$$ -8 -101 -18 -33 53 -29 34 67 -81 -235 48 -80 -45 -47 -46 202 76 -36 -5 -123 -62 90 184 -37 -50 -1 41 -61
7189f1P9L3r8r7L11j97M3J03j89Q5j3J44q2q0P9n7j8M1jQ2j18N2P7L0N4k37j2
$$ -61 18 51 -47 -144 167 -30 13 116 -73 12 -1 143 61 -19 60 3 -15 26 25 107 -11 41 118 148 202 -35 -47
7216d7r9J61j3m9kkJ77j08L5q7O3q1J51p2Q7lk52m9K09k6J07o9j20J08M9j9n9
$$ -47 -146 15 2 -47 -49 -51 126 18 53 -34 29 -52 99 27 114 111 -141 -190 19 -7 100 31 -89 19 68 49 -10
7243a0R3j06o2lm0R6J49k25NP1N5J26k44P1j25J80q3p1R4J44j08k6J2L2j65J20
$$ -10 83 -23 -85 -88 -128 -32 117 -108 -103 -32 23 149 -95 -24 -149 31 -52 -123 -29 115 7 -19 -7 25 -140 -20
7269b0J8j95P9K34j40j60N5J83RN6k71L9K01j36J71k42J32M8m0LJ9j21L9q7J12
$$ -20 -2 -197 -118 116 -24 -184 -129 54 63 119 -152 -113 88 -48 123 -119 13 61 21 24 43 -78 -39 -126 -14
7294a4R3m3J29j02q8L2j1p0J64q3q5K63j33j13M6P4j11m7L9j74J73n3N0J15oq4
$$ -14 79 36 165 63 -25 7 -4 -74 90 7 -78 185 52 -61 -15 59 -52 -99 -60 -234 -61 -114 -64 51 45 -39
7320c9J56p9oPL5k05K85j80o4R0r7k6J04K08k19M7m7j12K36j71J38M6J1j34Q4
$$ -39 117 38 32 39 74 -131 154 -26 -90 0 -97 -123 -19 189 -30 17 -30 -142 94 -77 61 107 118 -16 68
7345F8k9j31N2r0K39r0n4J56n4m3Q4P6k2j10m1oK05m16K05m2n4J71l3j15Kk2J48
$$ 68 39 -92 -40 -130 109 19 -35 121 67 24 108 184 162 52 11 5 210 -206 -1 -43 -97 74 41 -74 -72 -94 54
7372E4l1j45J9l8K24q9J40k83K85o8j15J44p7m2J6o4K97j90j56J50j01K1J9j45
$$ 54 23 -122 -103 -141 83 -6 134 -149 136 68 -47 97 20 -22 -6 -70 227 37 -119 31 -70 -49 -30 -175
7396a75K29o1J21j54N6l0QJ1j15L59j93j26P7K9N6j33L4q4o2J41j17J53j6J5N1
$$ -175 54 -7 114 -40 16 -14 -6 5 -110 249 56 -70 7 36 92 -41 -7 -91 -153 -12 -129 24 8 23 74
7421G4ok04J82j21J13j4j05k3K08k23K09L0j98P2k42L33j08qq2J84j83L21j91
$$ 74 68 -136 46 -75 38 24 -81 -104 104 -119 90 120 -78 -6 -248 85 -23 -31 -113 71 -112 209 18
7444A8j0K5J30j19j34J08Q2J8j0j61J2Q4k04K01j61J61NK1j19R2j07J77j24J03
$$ 18 8 33 163 44 -90 18 100 118 108 -53 -41 43 -161 40 -121 40 45 66 -53 39 -68 109 -15 88
7468H8p0pK1MQ2k9O1j99J32j31K81l87J19N9MJ9p2J05j83R8J4L7m7KK1Kj1R7j75
$$ 88 18 11 32 36 118 89 150 -49 83 -48 233 -154 -35 24 28 47 -25 80 -103 -5 9 46 -1 1 22 24 13 110 -65
7497f5k4J23m2O4p4r2J19J16j46N4L0J7r3J84j89j5m2J47o9rj8J30j31L4N3j02
$$ -65 -89 34 -8 56 -18 -110 9 125 -21 33 63 80 -13 171 -18 -33 -75 72 3 -6 -24 106 -25 9 62 -40
7523d0K8j3K4j04J57j01J17r6J94j58L6j1j28lJ87o1l1J56j86K2J24L4j96P2o2
$$ -40 -12 -25 -1 -105 52 -49 68 -28 166 8 44 33 -95 -98 89 28 -3 153 -33 -11 113 147 -49 23 -39
7548c9J33j50j6L1j3o9J18LK5q9K34k01J93j63j05J05Q6n6j11P4j27J14p5J62
$$ -39 94 -56 -72 -41 -54 -123 -5 -2 23 -66 168 -33 160 -3 -108 -3 83 27 -84 -10 -137 -23 -98 64
7572F4L2r1K6n2L1j53K22O4k9q0j1j11J07n0j32J68L2j81K32j63P4M1LM2j90J0
$$ 64 96 5 31 -21 10 -143 79 143 114 34 23 -88 19 -31 -163 5 37 -144 88 -75 -1 40 43 85 -105 -95
7598i5M7o4J59k33K33j13J92j21n8O4P7p9k1KO5j1r2R9q9n9Q6K02k1p6k1J4p5
$$ -95 -48 -112 47 -186 47 -66 126 5 -53 11 88 9 -12 -10 55 44 -48 51 -38 -97 -11 191 170 94 73 87 12
7625A2j68K97j89j05Q1j0J97o2j53K61j29j09P6j0o3j3J96j40J05j72K3K60k33
$$ 12 -156 141 -48 -153 -72 -82 115 53 -100 161 32 -77 -1 -11 -74 -87 109 -31 74 -98 -75 185 -48
7648d8p2K63j04Mk9p4J48J05k05k5K7n3J32o4j2j15L31j73J9N9j66J94k41R5q1
$$ -48 -120 143 39 43 14 -60 88 193 -12 -37 -10 -63 69 5 -7 -122 209 36 55 114 -52 142 -99 -4 -85
7673h5N0J02q3K5p2N0J58k83J93k1K1J7J8m9o9J59j15q9N4J1q9j7L7J46J06j38
$$ -85 -35 67 -16 9 -63 -13 145 -138 55 34 55 72 90 41 -28 131 16 -73 -19 -8 -97 -114 -77 69 175 37
7699C7km7j26K47j27N5K5j27J29j3j61L08j27n4o5J37r2J1J62l6j20J85k39L2
$$ 37 35 -12 -138 109 -18 37 62 -65 64 51 -110 198 71 17 -48 89 -3 8 170 134 14 199 -40 -8
7723hl4Q1J05l4j34R4j78J03j7o7L4m0J98j63o2lR3J2j5N9j8L6KlJ36k48j14J7
$$ -8 -42 39 144 110 -24 70 -108 -5 -22 -89 -55 -95 103 -60 -122 -125 -32 -20 -35 24 6 42 44 41 177 -71 -185 -168
7751a68j0K39r6j3J31j29k7K9P0k27J43O0qN9m2ko9J42Mj18P1l9n5K08l0j80%
$$ -168 -178 61 -35 -48 83 -46 -73 -44 26 -201 -58 2 -6 53 11 9 -60 82 86 -32 39 0 -55 153 123 -57 -57
7778e7J43k9j28M4O5p5J03ok4l3Mm5n0k0J39n4R2Q5Rj76N8j4l9oK9j02P9L4k7
$$ -57 86 57 -71 -27 38 -37 66 60 36 3 7 -38 -88 -108 31 -23 69 154 163 -13 45 31 -8 -14 15 -87 -8 26 -1
7807aP8p3J0L5j83MJ43r2j3O3p4J62j25M6K5j58J41j36J32O3Q1l09k1K95j03O8
$$ -1 77 4 14 49 -134 -130 13 -79 -92 -29 -103 59 -66 -20 5 -153 -12 -148 -16 47 128 -181 -202 93 -10 58
7833E8j12Rj7O5n5m9J43MK7o4r1J26r0K98l93J73j66J85r2mO6O7k80Q7Q4k4J14
$$ 58 -54 -45 -62 3 -52 -101 42 46 73 9 -82 44 -46 252 -141 32 -134 51 -41 -45 21 88 -192 -105 -21 -45 69
7860F9j91L1m2L88j95j58J47M2O4k42P7O6r1n5o4M0J91o9l5N6r5J06O5j71O4N5
$$ 69 -122 -91 -133 255 60 -98 49 91 155 -87 -10 56 -35 -90 -154 -114 77 8 -27 29 -66 40 105 -66 -2 53
7886E3o5J23j43R5j45K12j00j4PJ01l9o9l5J3L7J30n0j86n7J10P7N7j67P3p5J33
$$ 53 -12 111 -32 63 -82 130 30 16 23 124 85 16 -19 -6 31 161 111 -75 -132 -22 55 112 -55 18 -57 76
7912G6j24P0RQ6N8j81Q6q9k7O1J16j39o0jJ38J19j30o9M7p1rq2K05j11j3J21L8
$$ 76 -48 22 31 117 175 -6 80 -9 -36 25 141 2 -58 -59 79 198 68 -1 46 -25 -34 -116 89 -22 -35 86 124
7939A24j39jk9k7M3P3j7K0J9k47J06Q8J04k02j57K58oj38K27n0j41K25j45M4M8
$$ 124 -15 -16 -45 -72 -29 44 27 47 66 -181 -75 13 117 -85 -242 16 10 -128 99 49 -92 133 -12 32 80
7964H0K2j29Q9p3K1nn4O2J0P8q8j0R3j71o7R8J20l4k81J63Q0J70j94J8j65J71
$$ 80 102 -27 62 -11 10 5 -49 13 23 101 13 3 96 -75 -142 -44 76 42 -239 -76 4 174 -20 -2 -167 4
7990DP4n6k5o3J30o1N6L0o5P8j17J7P2q1J60j34J16p2j12m0J38j58M0J72k0m0
$$ 4 78 22 -3 -66 64 3 59 89 24 102 -15 2 74 -7 153 19 135 63 -49 -89 49 -109 -69 103 83 43
8016D3r3Q4j11J18k5j13J24j1J00k89J82l9j35K38j8pK7P1k5M9k53l2J9R9N0j17
$$ 43 -50 34 -77 41 16 -97 27 16 116 -173 9 -30 -165 73 55 48 75 146 121 170 -83 -115 -96 3 53 -64
8042f4k5O2K08j67O4k4P3k88R8O3J18j70LJ02O0m9k9j43J47r3O6P3j2o3l0j34
$$ -64 -89 -27 181 14 78 54 127 -161 -63 0 118 -52 -49 53 113 64 35 -108 39 -54 12 85 73 10 -20 -154
8068a54J32j5k5K01k66P5P5j57K45l0KJ04j05Lm6j4q6J38r2m7J41k30J53j33J9
$$ -154 -22 -37 -62 139 -127 -52 23 -134 111 81 83 187 82 85 39 25 -61 77 -15 -62 79 -151 2 -131 -112
8093a12K09k1p5L8N6q3mn6J08J0j3j18PL7O1O6l1P4j78M6J66j36j0l0r9Q9M5N6
$$ -112 97 76 1 39 95 12 8 -48 60 70 57 -61 -54 -17 44 110 79 153 -25 21 187 51 41 11 -88 1 46 102
8121A02k15J86q9J91l9j40j08J7J51k3J84r6j56J55P3r1k12J52k25J41M8LJ0k2
$$ 102 -113 73 -16 175 136 -4 -112 -95 56 33 217 121 -35 120 193 102 -110 42 -183 -42 6 9 19 -3
8145cq4K01r7M5p3j39K03n9KN9j71k1M4N3L9nQ2J01k29J32K8j5j2m7j16J33O8
$$ -3 -87 114 17 62 -11 -150 53 -6 -4 55 -116 -137 -93 -40 -1 -6 76 177 -52 80 108 93 81 34 -82 51 119
8172A19j65O1O0p9J33m9Mn2J9n8l7K1Q0J55r1L4j43N5L2
$$ 119 -46 15 75 -4 129 80 84 32 51 -7 -44 -23 57 212 121 155 12 67 99
8191I9
$$ Imaginary data points
##PAGE= N=2
##DATA TABLE= (X++(I..I)), XYDATA
0@%%%%%%%%%%%%%%%qJ6j6J6j6K4l2L2m0M8n6O4p2Q7r8J08j22J39j60J82k04K28
$$ 0 0 0 0 0 0 0 0 0 0 0 0 0 0 0 0 -8 8 -8 8 -8 16 -16 16 -24 24 -32 32 -40 47 -51 57 -65 74 -86 96 -108 120
37A20k55K85l17L54l93M34m80N32n87O46p12P85q65R53j049J156j278J413j564
$$ 120 -135 150 -167 187 -206 228 -252 280 -307 339 -373 412 -453 500 -549 607 -671 742 -822
56h22J740j943K178k459K796l212L744m448N421o856R182j3552K4373r6126j28097
$$ -822 918 -1025 1153 -1306 1490 -1722 2022 -2426 2995 -3861 5321 -8231 16142 -79984 -208081
71b08081L02848K1360j95441J05961J06102k00626J522K14689q3184j91175J12822
$$ -208081 94767 116127 -79314 26647 132749 -67877 -66355 148334 65150 -126025 -13203
82a3203Q5564j30320J3436J27853r6078r5137J40382M5873j48637K7386J25836
$$ -13203 72361 -57959 -44523 83330 -12748 -107885 32497 78370 -70267 -42881 82955
93H2955r8860q3239J51899K7167j51870M5756J15850j11274m8662J49044k2452
$$ 82955 -15905 -99144 52755 79922 -71948 -26192 89658 -21616 -70278 78766 56314
104E6314j45772P3108Q9339r9516r400R4825p0497p0117J15770L0388j15354K0361
$$ 56314 -89458 -16350 72989 -26527 -35927 58898 -11599 -81716 34054 64442 -50912 -30551
116c0551Q3262o4737l1675R9773j5971j11298N1997R3690p8330n1807R3517p031
$$ -30551 52711 -12026 -43701 56072 40101 -71197 -19200 74490 -3840 -55647 37870 30839
128C0839r8766N9986Q0486j01287m3555J12378j1941r2034P3944N5082j08605
$$ 30839 -67927 -7941 72545 -28742 -72297 40081 28140 -63894 10050 65132 -43473
139d3473J635J17290m9811q5677Q4459K9179r8655K8262Q5356p7224o0996R3195
$$ -43473 -41838 75452 25641 -60036 24423 53602 -45053 -16791 68565 -8659 -69655 23540
151B3540J7307r1202K1966O6755n6709l2263Q3596L893q2371L2580P0008n5814
$$ 23540 40847 -50355 -28389 38366 -18343 -50606 32990 36883 -45488 -12908 57100 1286
163A286l4475P2060r928p5481M6368N2763p6370j9562P8917k7132o3433O5192
$$ 1286 -33189 38871 28943 -46538 -170 52593 -23777 -43339 35578 8446 -54987 10205
175A0205L4029p9052O777P1250l9092l9033O2234j67o9388L0127N6129m7304k8243
$$ 10205 44234 -34818 -28041 43209 4117 -34916 27318 27151 -42237 -12110 44019 -3285 -31528
188c1528N0370n715m2782L9016L0938o0174j7341O1759m891n0637K8163K5447
$$ -31528 18842 13127 -29655 9361 40299 -19875 -37216 24543 19652 -30985 -2822 22625
200B2625n1174K864O4519k5933n4510M5831L0083n0464Q605M7962m1718l3676
$$ 22625 -28549 -25685 38834 12901 -41609 4222 34305 -16159 -7554 40408 -1310 -34986
212c4986N7266P918n6638J7824L5264m3874j1945N4080j1713n0210K8175L1492
$$ -34986 22280 30198 -26440 -8616 26648 -17226 -29171 24909 13196 -37014 -8839 22653
224B2653l7698l434M4505j8868m0233L7982L1700m2405r764L9051j7414l0772
$$ 22653 -15045 -18479 26026 7158 -33075 4907 36607 -5798 -15562 23489 6075 -24697
236b4697L9887J3912n3434K024M6258k2205k6000L7677k048m3720K7399L7801
$$ -24697 15190 29102 -24332 -22308 23950 1745 -24255 13422 11374 -32346 -4947 32854
248C2854l9312j7194M0577q200l0229L1863J5638m4248j750M0820j3266k6956
$$ 32854 -6458 -23652 16925 8725 -21504 10359 25997 -18251 -20001 20819 7553 -19403
260a9403K4010P420l2098J0387L3894k0532k5087K6150R579k5843J1345K1894
$$ -19403 4607 12027 -20071 -9684 24210 3678 -21409 4741 14320 -11523 -178 21716
272B1716k8444j4813L5357J903l0860J3434J6531k7478R23L4583j5786l0438K3462
$$ 21716 -6728 -21541 13816 15719 -15141 -1707 14824 -12654 -11731 22852 7066 -23372 90
285I0J3657k6524O168K2100k3449j5466L1508O651k5947O894J6874j6417k712
$$ 90 13747 -12777 -6609 15491 -7958 -23424 8084 14735 -11212 -4318 12556 -3861 -6573
298f573K5498o158k5813J1802J6587j6423m410J6122j2932j7739K1176J1816k4082
$$ -6573 18925 12767 -13046 -1244 15343 -1080 -5490 10632 -2300 -20039 1137 12953 -11129
311a1129k003J9443r960q525K3455Q47k6249R218K1687j4260q546J6532p736j8220
$$ -11129 -13132 6311 -3649 -12174 11281 12128 -14121 -4903 16784 2524 -6022 10510 2774 -15446
325a5446J7419J3117k1737n156J7539n740q923J7429J987k2137N284K0232j0179
$$ -15446 1973 15090 -6647 -11803 5736 -4 -8927 8502 10489 -11648 -6364 13868 3689
338C689j1184J3675k676j6867J3327J5416j9814r422J9573j453j4385J3736P267
$$ 3689 -7495 6180 3504 -13363 -36 15380 -4434 -13856 5717 4264 -10121 3615 10882
351A0882k2332M12K3155p855j5414J4168K918j7481J0520J8354j8093j1864J9954
$$ 10882 -11450 -11038 12117 4262 -11152 3016 5934 -11547 -1027 17327 -766 -12630 7324
364G324J542j6063J1219Q677k2113j710K4637o377k0074J2236P462j8413N459
$$ 7324 8866 -7197 4022 12699 -9414 -11124 13513 7136 -12938 -702 6760 -11653 -6194
377f194J9822j6316j6359K1095P816j8468O329J4689j6859n598K4392j386k2475
$$ -6194 13628 -2688 -19047 2048 9864 -8604 -2275 12414 -4445 -10043 14349 12963 -9512
390i512R203J2468j7425j851K0311j1363k0563J7387J2579j9479N82J9023j3641
$$ -9512 -309 12159 -5266 -7117 13194 1831 -18732 -1345 11234 -8245 -7663 11360 -2281
403b281j2723K5245O181k7263L538K0850j4698r945K2385m645k6155J5088K1169
$$ -2281 -15004 10241 16422 -10841 -7303 13547 -1151 -11096 11289 6644 -19511 -4423 16746
416A6746k0736q401K2085o399j7433K0080J1209k6546k192K4681r274j6500J9339
$$ 16746 -3990 -12391 9694 3295 -14138 5942 17151 -9395 -11587 13094 3820 -12680 6659
429F659M542k5610O858K5487j5170j6924K1467K943k4402J1790K2131k4661j5876
$$ 6659 11201 -14409 -7551 17936 2766 -14158 7309 10252 -14150 -2360 19771 -4890 -20766
442b0766K7575K412k4417J3190J4990k5695j382L2808q475k6774J8257J3493k2622
$$ -20766 6809 9221 -15196 -2006 12984 -12711 -14093 18715 10240 -16534 1723 15216 -7406
455g406M569K2196k1293j7915K8782P711k9399N061K1609j8843j0793K8095q96
$$ -7406 -2837 19359 -1934 -19849 8933 16644 -12755 -7694 13915 -4928 -15721 12374 11478
468A1478l0582J1881K4335k1422j1102K7967l988k7438J7960K0893k5786n669
$$ 11478 -19104 -7223 17112 -4310 -15412 12555 8567 -18871 -911 19982 -5804 -11473
480a1473K7068j2739k2571K6880J1793l3855J290K8977j5280j5001K7506k99l2347
$$ -11473 15595 2856 -19715 7165 18958 -14897 -13607 15370 90 -14911 12595 12296 -20051
493b0051J5201L0278k2787j9153K3925J583k3176J4092J7881k7982j1642L1442
$$ -20051 -4850 25428 2641 -16512 7413 8996 -14180 -88 17793 -10189 -21831 9611
505I611J610k6691J1948J6319k3446q98L1360j2256k8346K3390J6308k9108K692
$$ 9611 11221 -15470 -3522 12797 -10649 -11547 19813 7557 -20789 2601 18909 -10199 -7507
518g507K8726k0879k1651L1982Q609l3030P022K4585k2993j2656L0972j548l1786
$$ -7507 21219 340 -21311 10671 19280 -13750 -6728 17857 -5136 -17792 13180 11632 -20154
531b0154J1701K2192j9697o751K4943q223k4261K1200K0655k6159q096K6443q297
$$ -20154 -8453 13739 -5958 -12709 12234 4011 -20250 950 21605 -4554 -12650 13793 5496
544E496k1462K4359J2217l4846r47L3298j3430k2278K5159N342l2469J1366L0088
$$ 5496 -15966 8393 20610 -14236 -15183 18115 4685 -17593 7566 12908 -19561 -8195 21893
557B1893k2268j7771K6522l76k4632J8748J9077k9814r839L0687j993k3283J4559
$$ 21893 -375 -18146 8376 8000 -16632 2116 21193 -8621 -18460 12227 10234 -13049 1510
570A510J0974k6684J85L2761r447l0009J7104J8746k1539J01K5634j7035k2841
$$ 1510 12484 -14200 -14015 18746 9299 -20710 -3606 15140 -6399 -6298 19336 2301 -20540
583b0540K8674J3615l1888O86K3890j8680j3030K9504j467l1935J4372K3465k2383
$$ -20540 8134 21749 -10139 -9453 14437 -4243 -17273 12231 10764 -21171 -6799 16666 -5717
596e717p351K7406p329k5142J8906J7558k3568n544K2649q799j9288K0257J3255
$$ -5717 -13068 14338 7009 -18133 773 18331 -5237 -10781 11868 3069 -16219 4038 17293
609A7293k5940m256K4557o384j6523J8513M682k7298O734K7833j6929j9568K2292
$$ 17293 -8647 -12903 11654 5270 -11253 7260 11942 -15356 -8622 19211 2282 -17286 5006
622E006K777k3022J4894J9496k6947j0336L0475j001k4170J3460J2766k3364o30
$$ 5006 7783 -15239 -345 19151 -7796 -18132 12343 11342 -12828 632 13398 -9966 -10596
635a0596K5720r164k2214J5356J2085j9070Q07K0486j1996j7251K0318J0817k2494
$$ -10596 15124 5960 -16254 -898 11187 -7883 -7076 13410 1414 -15837 4481 15298 -7196
648g196J352J9969j4686j3439K3961L228k7697O880K1110j7292r503K3031m328
$$ -7196 -5844 14125 -561 -14000 9961 13189 -14508 -7628 13482 -3810 -13313 9718 5390
661E390k3257J6070J7390k0471n332K0230o255j4906J6415Q089k0844r31J9148
$$ 5390 -17867 -1797 15593 -4878 -10210 10020 3765 -11141 5274 13363 -7481 -8412 10736
674A0736p095j3586J3635M464j8309L979J8805j0921j4008J5967M982j7908O436
$$ 10736 3641 -9945 3690 8154 -10155 -6176 12629 1708 -12300 3667 8649 -9259 -2823
687b823J6361j6774j0993K1463J193j9782R201J2549j7732k300K1434o303j7884
$$ -2823 13538 -3236 -14229 7234 8427 -11355 -2154 10395 -7337 -9637 11797 5494 -12390
700a2390J3220R600j5527J225J4768j0453j1669J5175N600j5756R14J2668q298
$$ -12390 830 10430 -5097 -3872 10896 443 -11226 3949 9549 -6207 -5293 7375 -923
713i23p552J4388K176j6939M020J4866r883q335J3926p52j6101Q713J3273j4581
$$ -923 -8475 5913 8089 -8850 -4830 10036 153 -8182 5744 4992 -11109 -2396 10877 -3704
727c704o376J5546k543j2410J1990O981j5831M26J5600n627r977R778K073j2235
$$ -3704 -10080 5466 2923 -9487 2503 9484 -6347 -5921 9679 4052 -5925 3853 5926 -6309
741f309M437J1039r710q269J0495K353j0030M085P981r103n219J3223J472j2563
$$ -6309 -1872 9167 -543 -8812 1683 4036 -5994 -1909 6072 -3031 -8250 4973 6445 -6118
755f118M300Q443r344k624J2513l777j2677Q623Q002j0582j72R648o598o790J1699
$$ -6118 -1818 6625 -2719 -5343 7170 3393 -9284 -661 7341 -3241 -3413 6235 -363 -7153 4546
770D546K463j1385K007P201o039k346Q262k089r448M513P498n353l362N818j594
$$ 4546 7009 -4376 -2369 4832 -1207 -3553 4709 2620 -6828 -2315 5183 -170 -3532 2286 692
785F92o179O022N908q060m118P883Mn723N228K569r189P29R724l231o214N437
$$ 692 -5487 535 6443 -1617 -5735 2148 2152 -3571 1657 4226 -4963 -4234 5490 2259 -3955 1482
801A482P77o161N124N805p849l412O872k45m377L421J005p029M19O914j593n078
$$ 1482 2259 -3902 1222 7027 -822 -4234 2638 2393 -1984 1437 2442 -4587 -4168 2746 1153 -3925
817c925K340J948l057J985N053l587m549M594L232l632M10K251m763j478O370
$$ -3925 -1585 363 -2694 -709 4344 757 -3792 802 4034 402 812 3063 -1700 -3178 3192
832C192N9o550J253K934l088J858M802m761m214N261K704l714O09J183m262j71
$$ 3192 3251 -3299 -2046 888 -2200 -342 4460 -301 -4515 746 3450 -264 345 1528 -2734 -2905
848b905N306p31m704Q26K208j181J285K969k886l034L260K904k409l89Q00k972
$$ -2905 2401 1670 -3034 -2208 0 -1181 104 3073 187 -2847 413 3317 908 519 1319 -1653
864a653p94N110K88n219L16K934j686O91L893l676m796M577L612m181m81J803
$$ -1653 -2447 2663 2951 -2268 -1952 982 -704 -13 3880 204 -4592 -15 3597 -584 -1065 738
880G38l706l49N948n09n917J476L726j741M73L456l073l573M403L136m008j095
$$ 738 -2968 -3317 2631 2122 -3795 -2319 1407 -334 139 3595 522 -3051 1352 4488 480 -615
896f15K548k723j962N208O12o300o9M725j961j668M401j435n702L836N856m261
$$ -615 1933 -790 -2752 2456 3068 -3232 -3301 1424 -537 -2205 2196 761 -4941 -1105 4751 490
912D90k655L914j723l467N766K153p840q84O461j274l381M286K6o266L500O948
$$ 490 -2165 1749 26 -3441 2325 4478 -3362 -4246 2215 941 -2440 1846 1872 -4394 -894 6054
928F054m680m733N176N77n353L802L875p173k909P506L9n997L821K762o797N69
$$ 6054 1374 -3359 1817 2394 -2959 843 4718 -2455 -5364 2142 2181 -3816 5 2767 -4030 -3461
944c461Q605k714p092M671L097n925J769O464o416n516Q264L083p136J408M867
$$ -3461 5144 2430 -4662 9 3106 -2819 -1050 5414 -1002 -6518 1746 4829 -2307 -899 3968
959C968n309j928R097j152r698L732O215o591j901P186l810p409P337N385q632
$$ 3968 -1341 -3269 5828 4676 -5022 -1290 4925 -1666 -3567 3619 -191 -7600 -263 5122 -3510
974c510q21Q157l603n158P851K718r080Q89P746m634m197P478o29r182M116Q198
$$ -3510 -4331 3826 223 -4935 2916 5634 -3446 -2557 5189 555 -3642 3836 3207 -5975 -1859 6339
990F339o834m356P760r14p275O618N645j0339k847J0732j071q240N328L437q969
$$ 6339 -495 -4851 2909 1995 -5280 1338 6983 -3356 -6203 4529 3458 -4782 546 3983 -4986
1005d986J387R917n188q351P676L874p821J976O911o668m284R769Q86r455L218
$$ -4986 -3599 6318 1130 -7221 455 4329 -3492 -1516 5395 -1273 -5557 4212 5098 -4357 -1139
1020a139O980p465l203R647j233r985N127P351q239k370R586k812r347P503O111
$$ -1139 5841 -1624 -4827 4820 3587 -6398 -1271 6080 -2159 -4529 5057 2245 -7102 401 6512
1035F512r785j397R089m533o330R179K563j1081K254R714n604m992Q739l13r665
$$ 6512 -3273 -4670 4419 -114 -6444 2735 5298 -5783 -3529 6185 581 -4411 4328 4015 -5650
1050e650N658Q131q949n197R266j09q644N119N880r410k444J0961j228r250N826
$$ -5650 8 8139 -810 -6007 3259 3150 -5494 -375 5505 -3905 -6349 4612 3384 -5866 -40
1065d0N307q870R4J0476n208q874Q575L849r854K182Q302p539n568J0973J402
$$ -40 5267 -3603 -3509 6967 1759 -7115 1460 5309 -4545 -2363 5939 -1600 -7168 3805 5207
1080E207j0534L121P784o695k871R429j555j0088N321P421p628l395Q186k206
$$ 5207 -5327 -2206 5578 -1117 -3988 5441 3886 -6202 -881 6540 -1088 -4483 3703 1497
1094A497p884O826N699r894j534R826l155p346P931L518j0814J506J0258n416
$$ 1497 -6387 439 6138 -3756 -5290 4536 1381 -5965 1966 5484 -5330 -3824 6434 1018
1108A018o492Q477Q50r766M727Q766q185n262R103L87p968M941N405r328k275
$$ 1018 -5474 3003 3853 -5913 -1186 7580 -605 -5867 3236 3623 -4345 596 6001 -3327 -5602
1123e602J0127j184q871M375M903p364k57R475m031q809P448N819q556L8Q222
$$ -5602 4525 3341 -5530 -1155 3748 -3616 -3873 5602 1571 -7238 210 6029 -2527 -2489 5733
1138E733n906n860R769K140j0819K097Q187o610l563R291j469r394N334P406p359
$$ 5733 -173 -6033 3736 5876 -4943 -2846 5341 -1269 -4832 4459 2990 -6404 -1070 6336 -1023
1153a023k763P956k440p044O291M854q326k427Q055j920o204N868L031q559M39
$$ -1023 -3786 4170 1730 -5314 977 5831 -2495 -4922 3133 1213 -4991 877 3908 -4651 -4212
1168d212R295l273o649O713J909p835L422P495o923n536Q399J010p802L786N065
$$ -4212 5083 1810 -4839 1874 3783 -4052 -630 6865 -58 -5594 2805 3815 -3987 -201 4864
1183D864p931j692Q930j072p673L818M148n789j23O980l346o913N416M474o285
$$ 4864 -3067 -4759 4171 3099 -4574 -756 3392 -2397 -2520 4460 1114 -5799 -383 4091 -2194
1198b194m39N975l522m720P189L062q329O09O776m212l505P107l50q682L535O733
$$ -2194 -2633 3342 -180 -4900 2289 5351 -2978 -2369 4407 195 -3310 3797 3447 -5235 -1700 5033
1214E033o005k783O504j750o122N683M254o679j793O399j318m375M626J436o264
$$ 5033 -972 -3755 2749 999 -5123 560 4814 -1865 -3658 2741 1423 -2952 1674 3110 -3154
1229c154J02O677k212n201M126J752n014J683N893m393m491N925J897n619J843
$$ -3154 -3052 3625 1413 -3788 338 2090 -2924 -1241 4652 259 -4232 1693 3590 -2029 -186
1244a86M158n504k051O823m61o511K813L171m444JN381k944m652M369K954l942
$$ -186 3972 -1532 -3583 3240 2779 -3732 -919 2252 -2192 -2191 3190 246 -4406 -37 2917 -1025
1260a025k55L494k567k426M487J575m880l85M207j963k147L784M52n324J657N047
$$ -1025 -1280 2214 -353 -2779 1708 3283 -1597 -1982 2225 262 -1885 1899 2351 -2973 -1316 3731
1276C731l314k661L804n46m137L260L126m998j503M489n06l113L060J155m225
$$ 3731 417 -2244 1560 1014 -3123 137 3263 -1735 -3238 1251 745 -2368 692 1847 -2378
1291b378P86M196j306k778J991O03k228J033K671k660k469K763J340k455L49K119
$$ -2378 -1592 2604 1298 -1480 511 1114 -1114 -81 2590 -70 -2539 224 1564 -891 -542 1577
1307A577k394r65L818K85l890P89K515k615k77K915j665k929K386J924k488l2
$$ 1577 -817 -1782 2036 2321 -1569 -780 1735 -880 -1157 1758 93 -2836 -450 1474 -1014 -1046
1323a046J840j514q39K744N90k441K02J623p94l58J412o61k034P85K162j199j468
$$ -1046 794 -720 -1559 1185 1775 -666 -464 1159 365 7 1419 758 -1276 -491 1671 472 -996
1340i96J039J2j139J402J093k105r56K009J93j077P36q8j462P24J873j047j000
$$ -996 43 55 -1084 318 1411 -694 -1650 359 552 -525 211 123 -1339 -615 1258 211 -789
1357g89O82J67m97J143M76j412q1J036n8m73J89m11p14M27Q80l62o54k56K15L37
$$ -789 -107 60 -437 706 1182 -230 -311 725 667 194 383 -28 -742 -315 565 203 -451 -707 -492 -155
1377a55N06J65q34l75R20M81m25k60j48q36Q28Q59q45p86O01Q5J08J039j46j448
$$ -155 351 516 -318 -693 227 708 283 23 -125 -961 -133 726 -119 -905 -304 -219 -111 928 782 -666
1397f66N98J427p28m83O45r38o16J317J18j213l68Q08o50K7J298m55j346O56J289
$$ -666 -68 1359 631 148 793 -145 -761 556 674 -539 -907 -99 -749 -722 576 121 -1225 -569 720
1416G20n79j68Q01o93j150J562J226j936r45J481L3p60J232J66k344M54K748r79
$$ 720 141 -27 774 81 -1069 493 1719 -217 -1162 319 352 -408 824 990 -1354 -900 1848 869
1434H69j948J638j47j559J367J339k353j105K226n5j383J280P51k226P5K833n58
$$ 869 -1079 559 412 -1147 220 1559 -794 -1899 327 272 -1111 169 920 -1306 -1231 1602 1044
1451A044k104J103R76j915M57K518j805k429K132J510k174O9J986j872j213L391
$$ 1044 -1060 43 1019 -896 -439 2079 274 -2155 -23 1487 -687 -618 1368 -504 -1717 1674
1467A674M48l256K81K274j787p50K623j089l333K110K596k558q01K405r68j910
$$ 1674 2122 -1134 -853 1421 -366 -1116 1507 418 -2915 -805 1791 -767 -1568 837 -131 -2041
1483b041L011J527l385l89L208j132j887K504K88l691P59L458j881k364K521L90
$$ -2041 970 2497 -888 -1277 1931 799 -1088 1416 1704 -1987 -1228 2230 349 -2015 506 896
1499H96l078J914L061l363k148L724M15l007J790J471l540l80M334p25l731K001
$$ 896 -2182 -268 2793 -570 -2718 1006 1421 -1586 204 1675 -1865 -2245 2089 1364 -2367 -366
1515c66K181l112O75L424k294l169L448J970l791L42K856k606k109M143N35m297
$$ -366 1815 -1297 -622 2802 508 -2661 787 2757 -1034 -692 2164 -442 -2551 1592 2127 -2170
1531b170P60L379k571j196L786n75m209K075L370l098j380L363j302l021L377
$$ -2170 -1410 1969 -602 -1798 1988 1413 -2796 -721 2649 -449 -1829 1534 232 -2789 588
1546E88K398m525q66M087q74k630L369Q73m657R36M758k374l370L287N53l905
$$ 588 2986 -1539 -2405 1682 808 -1822 1547 2420 -2237 -1301 3457 1083 -2287 1000 1553 -2352
1562b352J710L393l636k391M261L85l506J799K556l576q63M636m99m263K171K626
$$ -2352 -642 2751 -885 -3276 985 1370 -2136 -337 2219 -1357 -2220 2416 1917 -2346 -175 2451
1578B451l612l58M330k194l972L714K481l882l23L831k598k685M557J472n380
$$ 2451 -1161 -1519 2811 617 -3355 359 2840 -1042 -1365 2466 -132 -2817 1740 3212 -2168
1593b168N93L890k457k150M088l33m751K072M066l399j918L930o48l563L358K434
$$ -2168 -1575 2315 -142 -2292 1796 1463 -3288 -1216 2850 -549 -2467 1463 815 -2748 610 3044
1609C044m153j243M318p74l423K850J836m549p2M921j592l837L237J297l835J313
$$ 3044 -1109 -2352 1966 1192 -2231 619 2455 -2094 -2166 2755 1163 -2674 563 1860 -1975 -662
1625f62L878l181l127M104R63m150J265L098l711j293M567q4m413K093L045l209
$$ -662 3216 35 -3092 1012 1975 -2175 -910 2188 -1523 -2816 1751 1667 -2746 -653 2392 -817
1641h17p13M118j299l872K843K653l638r73L693j482l357L605J930m712j5M185
$$ -817 -1530 2588 1289 -2583 260 2913 -725 -1698 1995 513 -2844 761 2691 -2021 -2036 2149
1657B149j862k667L623O48m386J415M179l084k638L749L2l751K512K697l845j386
$$ 2149 287 -2380 1243 1891 -2495 -1080 3099 15 -2623 1126 1158 -2593 -81 2616 -1229 -2615
1673b615M423l89l355K318K094l782l48M292j268l840K493J970l517J84L560k068
$$ -2615 1808 1419 -1936 382 2476 -1306 -1654 2638 1370 -2470 23 1993 -1524 -1340 2220 152
1689A52l093L451J801l806M03L351k714k020M131K71m283J367L066k801j159L436
$$ 152 -2941 510 2311 -1495 -1092 2259 -455 -2475 1656 1927 -2356 -989 2077 -724 -1883 1553
1705A553o04l320K351K616k897j221L137p20k670K556J639l538o77L418j131k611
$$ 1553 949 -2371 -20 2596 -301 -1522 1615 895 -1775 781 2420 -1118 -1795 1623 492 -2119
1721b119K440J047l537Q50L697k248k330K984Q88l196J145K750k950j566L629
$$ -2119 321 1368 -2169 -1319 2378 130 -2200 784 1672 -1524 -379 2371 -579 -2145 1484
1736A484m8l118J543J825k724l70L279p92l030J731K062k306m67K645j109k574
$$ 1484 1436 -1682 -139 1686 -1038 -1408 1871 1079 -1951 -220 1842 -464 -931 1714 605 -1969
1752a969K317J447k915m21K568j148j881K688Q21l269O87K803j587j423K490j68
$$ -1969 348 1795 -1120 -1541 1027 -121 -2002 686 1507 -1762 -1075 1728 141 -1282 1208 1040
1768A040k684J619K317k581j065K177r2k026J804J102k219p17K594k42k158J332
$$ 1040 -1644 -25 2292 -289 -1354 823 731 -1295 509 1611 -608 -1325 1269 1027 -1131 201
1784B01Q48k112l4K525j189k155J614J265k053M02K068j661j392K468Q19k369
$$ 201 1049 -1063 -1097 1428 239 -1916 -302 963 -1090 -688 1380 -281 -1673 795 1614 -755
1800g55N23J468j480m94K060l90k313J196J133j224l66J499q74j260J509J027
$$ -755 -232 1236 -244 -738 1322 932 -1381 -185 948 -276 -642 857 -17 -1277 232 1259
1816A259j516p06J338k07q69J154L35j743l69K018k25j269R38L38j457O75J843
$$ 1259 -257 -963 375 168 -701 453 788 -955 -1324 694 469 -800 138 476 -981 -306 1537
1833A537j201j267J231M31r38N83O40j527m35J512J22j220K54L56p00J47J133
$$ 1537 336 -931 300 731 -207 376 1016 -511 -946 566 688 -532 -278 78 -622 -475 658
1850F58k97j290M74R13l07m56P92n64q94J011R24j147m32P58j6l69R21J60j336
$$ 658 361 -929 -455 458 151 -305 487 -77 -971 40 964 -183 -615 143 127 -242 679 839 -497
1869d97J32J104m99m47N14m04p02O85O85m97n79N4J22k7M13K13n43k64P01M38
$$ -497 -365 739 240 -207 307 -97 -799 -114 571 74 -505 -451 -329 -356 57 270 -273 -537 164 602
1889F02l43n26J08j00J72N61j64r13J36O78Q4J3j0k91j60L14N41n21l07k24R8
$$ 602 259 -267 -159 -259 -87 474 310 -603 -467 211 295 308 298 7 -153 161 702 181 -126 -350 -252
1910b52L40O5k39q2n33K96N25J35m96l1J86l4L51M51o72n43N28L62j76O1k24m81
$$ -252 88 153 -86 -168 -701 -405 120 255 -241 -272 -86 -120 231 682 10 -533 -5 357 181 242 18 -463
1932d63K79N87M9o95LL19J14n8J76k11q37M47O57k93m97K42Ol87N43P15q91m13
$$ -463 -184 403 452 -243 -240 79 193 135 311 100 -737 -290 367 74 -423 -181 -175 -562 -19 696 -195 -608
1954f08J020R8o92O04J64q10r1J311o77o89K43K41n93M41N54o03q30J032M51p12
$$ -608 412 510 -182 422 586 -224 -315 996 319 -370 -127 114 -479 -38 516 -87 -917 115 566 -146
1974a46J24M53p33m50J292M4j471L39Q67n65m57J290m16j098R18J078r81m35J156
$$ -146 -22 431 -302 -752 540 584 -887 -548 319 -246 -703 587 171 -927 -9 1069 88 -347 809
1993H09m55j067J296N36j597k81J332n44p90R82J93j414L49J491p78r84J002M53
$$ 809 354 -713 583 1119 -478 -759 573 29 -761 221 414 -1000 -651 840 62 -922 80 533
2011E33j247M91J291j342q25J581K43j266O20R11j303o14J929j43j712R03J081
$$ 533 -714 -223 1068 -274 -1099 482 725 -541 79 990 -313 -927 1002 859 -853 50 1131
2028A131j456j80J506p45j396J237P49j358j88J212m80j083J503N33j972L94J583
$$ 1131 -325 -505 1001 256 -1140 97 846 -512 -700 512 32 -1051 452 985 -987 -593 990
2045I90q25j000J428K72j894O80J573j258r50J513Q3j374Q81J156j606o12J921
$$ 990 165 -835 593 865 -1029 -349 1224 -34 -984 529 612 -762 119 1275 -331 -943 978
2062I78k33j789J152P87j610r6J921r73j732J570Q76j698K34J717j049j339J928
$$ 978 745 -1044 108 895 -715 -811 1110 137 -1595 -25 851 -847 -613 1104 55 -1284 644
2079F44O33j941K38J458j254q65K087p4k149Q49J563j332p55J853n46j705J428
$$ 644 1277 -664 -426 1032 -222 -1087 1000 926 -1223 -374 1189 -143 -898 955 409 -1296 132
2096A32J150j677p40J892m76j501J441Q31k234p6K054m49j491J520N37j897P14
$$ 132 1282 -395 -1135 757 281 -1220 221 1052 -1182 -1258 796 347 -1144 376 913 -984 -270
2113b70J882j303j519J844L02j660P36J306j739j014K176J39j965Q31J336j837
$$ -270 1612 309 -1210 634 936 -724 12 1318 -421 -1435 741 880 -1085 -254 1082 -755
2129g55k41K176n37k009J228J385j920j07J711q98j593J723Q82j934K59J796j092
$$ -755 -996 1180 643 -1366 -138 1247 -673 -780 931 33 -1560 163 1045 -889 -630 1166 74
2146G4j072J902L64k275O97J699j077j253J631j52j814R35J606j434j121J821
$$ 74 -998 904 1268 -1007 -310 1389 312 -941 690 538 -1276 -341 1265 -169 -1290 531
2162E31l4j501J092J050j958m33K138k64j682J147Q89j800K53K003j111j610J334
$$ 531 497 -1004 88 1138 -820 -1253 885 621 -1061 86 975 -825 -572 1431 320 -1290 44
2179D4J069j647L99J369j420j022J981L14j998N93J283j334o72J849j18j902O94
$$ 44 1113 -534 -135 1234 -186 -1208 773 1087 -911 -318 965 -369 -1041 808 690 -1212 -518
2196e18J526j279l38J416l26j686J299J305j840m28J543m82j046J139J042k319
$$ -518 1008 -271 -609 807 481 -1205 94 1399 -441 -869 674 192 -854 285 1327 -992
2212i92M6K027o29j444J507K48j710O58J575j301j081J505N2j317N75J148j465
$$ -992 -946 1081 452 -992 515 763 -947 -289 1286 -15 -1096 409 461 -856 -281 867 -598
2229e98o57J761P9j421Q17O13r05j94J491m74j522P93J242j451P7J250r36j226
$$ -598 -1255 506 585 -836 -19 594 -311 -505 986 512 -1010 -217 1025 -426 -349 901 -35 -1261
2247a261J553O97j441j15J305p72o97J307J07j386P1J370p51p45J036p8j252Q41
$$ -1261 292 989 -452 -567 738 -34 -731 576 683 -703 -632 738 -13 -758 278 200 -1052 -211
2265b11J236j044q20J212K8r50P07R33j584l02J458j2j186O92N21j198P0J237
$$ -211 1025 -19 -839 373 401 -549 158 1091 -493 -795 663 651 -535 157 678 -520 -450 787
2283G87n79j294J119N76j172M17R30j015p55J466K18j293J94P71o36l55J216m
$$ 787 208 -1086 33 609 -563 -146 784 -231 -986 480 698 -595 -401 370 -266 -621 595 591
2301E91j256K94J069n99m20R13k13j097Q66Q85j365k70R03l03o46J008P8j203
$$ 591 -665 -371 698 99 -321 592 379 -718 148 1033 -332 -602 301 -2 -648 360 438 -765
2319g65J23J267n79n08O10K64r94N00O70m82p77N37N29q24L94M77l63n62P86K33
$$ -765 -642 625 46 -462 148 412 -582 -82 588 106 -671 -134 395 -429 -35 442 79 -483 303 536
2339E36p17K14M57o20j75P27r8j112M72O91p34j44Q52m26n61O76N09p29j0M23
$$ 536 -181 33 490 -130 -305 422 324 -788 -316 375 -359 -503 349 -77 -638 38 547 -182 -192 231
2359B31j04l23M55J60r28J59P46k22n57M64J52n52K95M58j81n84M44K71n26j9
$$ 231 127 -196 259 419 -509 -350 396 174 -383 81 233 -319 -24 434 253 -331 113 384 -142 -161
2379a61L23n92k39J061j80p39L86L69n26K64L33m2o96M33L77k53j01J66r9l97
$$ -161 162 -430 -669 392 212 -527 -141 228 -298 -34 299 257 -439 -6 371 118 17 183 84 -313
2399c13N32J71m40k39M47Jl25J02L75n76J16L55P7l86Q4M2l00J74K40k94k31J57
$$ -313 219 390 -50 -289 158 159 -166 -64 311 -265 -149 206 283 -103 -19 23 -277 -103 137 -157 -388 -231
2421b31K77j83Q2K23j84L7R3M69o22J40Nr5K3J25J2m43M1L09j3l51K63J02j17
$$ -231 46 -137 -55 168 -16 21 114 583 -39 101 106 11 34 159 171 -272 -231 78 65 -286 -23 79 -38
2444c8J63M2r6o12M88L08l53L0L50m76j33L67J49j23j23L11j23n6J44j2m10P1
$$ -38 125 167 71 -541 -53 255 -98 -68 282 -194 -327 40 189 66 -57 254 131 75 219 207 -203 -132
2466a32L66l1m74K88J10l80K07K79l41j69L19R0k64R2J84l48m9M37J07m55K73
$$ -132 234 203 -271 17 127 -253 -46 233 -108 -277 42 132 -132 -40 144 -204 -253 184 291 -164 109
2487A09o5r0JM41k01n82K17N42j96j84K64l12k33J86O04n15m00N07m7k31K74L14
$$ 109 44 -46 -45 396 195 -387 -170 372 176 -8 256 -56 -289 -103 501 -14 -414 93 46 -185 89 403
2509D03q37J0Q60l90k12K30J4m07K31N23m32m87N42K06l52R1L95l53l64N58K40
$$ 403 -434 -424 436 46 -166 64 78 -329 -98 425 -7 -494 48 254 -98 -7 388 35 -329 229 469
2530D69n73l1M80m30p2M88j11o50K4Q26n82k50N30l59l35N83O51p68j95N26r4
$$ 469 -104 -135 345 -85 -157 331 220 -430 -406 420 -162 -412 118 -241 -576 7 658 -110 -305 221 127
2551A27k28M07J72p93q4O69N8o37M81K8o02J20R09o13m60M42L93q09L92N14q61
$$ 127 -101 306 478 -315 -399 270 328 -309 172 200 -402 -282 627 14 -446 -4 389 -420 -28 486 -375
2572c75l07R73m0p27K90M71m92j05R18k92o87L39O71p38q2O69n32n67P84L30q17
$$ -375 -682 291 251 -476 -186 285 -207 -312 606 314 -373 -34 637 -101 -183 486 -46 -613 171 501 -316
2593c16j92P07k01l86P05K18j007K12Q02n66m74O94Lq60N13N24n07l83P07L3o24
$$ -316 -508 199 -2 -388 317 535 -472 -260 542 -24 -498 196 199 -661 -148 376 -131 -514 193 226 -398
2614c98M33N16p64j70R19j95o90M89L59p34Q1N96m99p34P68L07o10R1O68n25n16
$$ -398 35 551 -213 -383 536 341 -349 140 499 -235 -154 442 -57 -791 -23 284 -326 -235 433 -92 -608
2635f08Q84M37j064K18N31m15n15R42m9r70L58P03n53n9N93k74n44M38O27o98
$$ -608 276 713 -351 -133 398 -17 -532 410 361 -609 -251 452 -101 -160 433 159 -385 53 680 -18
2655a8l83Q68k23o03M94K68p52j94R40l57p06O42K28n90J01Q78m04o16M65M79
$$ -18 -401 467 244 -359 135 403 -349 -543 397 40 -666 -24 204 -386 -285 593 189 -427 38 517
2675E17o51J60M22n20k95P05j9p17K17N23m84k15Q59k06p47L99N74n78l01Q22
$$ 517 -134 26 448 -72 -367 338 319 -398 -181 342 -142 -357 502 296 -451 -52 522 -56 -357 465
2695D65n29n91O68M22r09M2Q61l95m82O62K84j018J32Q81l62l82N01j13m53N5
$$ 465 -64 -655 13 435 -474 -432 429 34 -448 214 498 -520 -388 493 131 -251 250 137 -316 -261
2715b61P49p36k08P77l2n07K98L77n33l15Q14j51q04N18N43q10k07R40l54o27
$$ -261 488 -248 -456 321 289 -218 80 457 -76 -391 423 272 -532 -14 529 -281 -488 452 98 -529
2735e29N28L94p22K41N65m32l37O34R2o72m2M30j16m11N59K9o57J99O39n48k79
$$ -529 -1 393 -329 -88 477 45 -292 342 434 -238 -280 150 34 -377 182 211 -446 -247 392 -156 -435
2756d35O56R6o71L25M26m85k16N30j73n26N08K11m54m2O48k24n87N23L65o63L1
$$ -435 221 317 -354 -29 397 -88 -304 226 53 -473 35 246 -208 -250 398 174 -413 110 475 -188 -157
2777a57O46n62l66M64K51m45m2L70j28l24N01R3p97K86M39j48l13N42j96o68O49
$$ -157 489 -73 -439 25 276 -169 -211 159 31 -293 208 301 -496 -210 229 81 -232 310 114 -554 95
2798I5M92p71j42M09j03l25M28L48o11p8N56r6n22M04J72o11R2O51l89l40L71
$$ 95 587 -184 -326 83 -20 -345 83 431 -180 -258 298 202 -320 84 256 -355 -263 388 -1 -341 30
2819C0p9l36K18L99l46k82M63K41m80J60L92n65O1L36O5n26K20K75l05j2K78M0
$$ 30 -49 -385 -167 232 -114 -396 67 308 -172 -12 380 -185 -124 212 277 -249 -29 246 -59 -71 207 247
2841B47o66M56L41m80m8K71k25l09N55M2l76r0L73j32j35J93P9l10J02K77j85
$$ 247 -419 37 378 -102 -150 121 -104 -413 142 184 -192 -282 91 -41 -176 17 96 -214 -112 165 -20
2862b0l83N70j47k75K81K71k67k95M33J72m40J32J78m75J94L21l9l40lL28j85
$$ -20 -403 167 20 -255 26 297 30 -265 168 340 -100 32 210 -265 -71 250 211 -129 -132 196 11
2883A1k77M10j23m30M22K28l50o4K32j63j35K80N6k17k4L52l08J14K02M6n86J62
$$ 11 -266 144 21 -409 13 241 -109 -173 59 -104 -239 41 97 -120 -144 208 -100 14 216 262 -324 -162
2905a62M32k52l31M16Ml57K60J70j78j83L29J17l81N7Q9j31j18L99j55j55L5J97
$$ -162 270 18 -313 103 107 -250 10 180 2 -181 148 265 -116 -59 30 -101 -219 180 25 -130 -95 102
2927A02o7nK78j86k14J71J99p0j82P0j94R4Q1l4k04J10LmOJ25J0j47j17M87j25
$$ 102 35 30 308 122 -92 79 278 208 26 96 -98 -4 77 43 -161 -51 -48 -52 -46 79 89 -58 -175 312 187
2952A87k51K2%N9k45M77m28j12L21L2q4l9K32k72J31K74k58k04J93Q9k93o8K77
$$ 187 -64 -42 -42 17 -228 249 -179 -291 30 62 -22 -61 171 -101 30 304 46 -158 35 124 -169 -237 40
2975D0n4j43o0J63J4j16K10K5k30K62J86m79m0L34Q3k30K00M6k61j19L05P7k66
$$ 40 -14 -157 -217 -54 -40 -156 54 79 -151 111 297 -182 -222 112 195 -35 165 211 -50 -169 136 213 -53
2998e3P1k8J28j52K77r3l77J41K82j22k02J86j49n3Q5J51k79J16K0o8J7J14K15
$$ -53 18 -10 118 -34 243 150 -227 -86 196 74 -128 58 -91 -144 -59 92 -187 -71 -51 -119 -102 12 227
3021B27k80M2K65k31j37J60k4o2qK19p1k83L29mj08o4J80k61o4K44q4l56K84K83
$$ 227 -53 -11 254 23 -114 46 22 -40 -48 171 100 -183 146 142 34 -30 150 -111 -175 69 -15 -371 -87 196
3045A96k82M6K02j40q5j59L67j79K2L24k01j71J72k0k01j22M23R6l10Q4J6l10
$$ 196 -86 -40 162 22 -63 -222 145 -34 -12 312 111 -60 112 92 -109 -231 192 288 -22 62 78 -232
3067b32K2M99k15r3M3K27m34K6L13j17k08J84K06k45m8L13l47l4L23R7l97J23
$$ -232 -210 289 74 -19 24 251 -183 -157 156 39 -169 15 221 -24 -72 241 -106 -140 183 280 -117 6
3089FK49j76j45L64j55l31J81K68m04nK00j63j31K17L48m78k0K82p8l71L88Mk24
$$ 6 255 79 -66 298 143 -188 -7 261 -143 -148 52 -111 -242 -25 323 -155 -175 107 29 -342 46 50 -174
3112a74L8L27l04r0J17K41k13NK35l17j01L38J23k13j55K69k26r2O11l29m22R1
$$ -174 -136 191 -113 -203 -86 155 -58 -53 182 -135 -236 102 225 12 -143 126 -100 -192 419 90 -332 -241
3134b41M01k87j61M69j28l88J73M66l71j28L36Kl02K58J67m72R6K22j08j63K51
$$ -241 160 -127 -288 181 53 -335 -162 304 -67 -195 141 143 -159 99 266 -206 -110 112 4 -159 92
3155I2L4l93K19L44k83j95K75J04l18j1M38m95j19N64j52l99L01P0j75k11O95
$$ 92 126 -267 -48 296 13 -182 93 197 -121 -132 306 -189 -308 256 104 -295 6 76 -99 -310 385
3176C85k93k24J69O9j36j64M61k20m07L27K70m58J47J32j8k45J72K24l42j22M45
$$ 385 92 -132 37 106 -30 -194 267 47 -360 -33 237 -221 -74 58 40 -205 -33 191 -151 -273 172
3197A72j05k46K91Rm15J07L46k32q2J80Jl07L35K64m76K6L93L2m56J48K00l79
$$ 172 67 -179 112 121 -294 -187 159 -73 -155 25 26 -281 54 318 -158 -132 261 293 -163 -15 185 -194
3219a94J31M46k94m03M17M8l21k1M36l87j60L66J67l76Q1J76k09j78L94o3k21
$$ -194 -63 383 89 -314 103 151 -170 -191 245 -142 -302 64 231 -145 -64 112 -97 -275 119 56 -165
3240a65l1L03r2j35L22j27l47K85L22k70m2O5N2n20L32M08m94M8L70j13l12J90
$$ -165 -196 107 15 -120 202 75 -272 13 335 65 23 88 140 -380 -48 360 -134 -86 284 171 -141 49
3262D9Lk30J48L43k44j08L7J38k19J26J29k72k29M38Q5m18J50K78k62n4K61j04
$$ 49 52 -178 -30 313 69 -39 -2 136 -83 43 172 -100 -329 109 194 -224 -74 204 -58 -112 149 45
3284D5j79nL40l16j42M22k08j53J77P2J9k08L61k36k90L83M3l05p5L86p9j68K08
$$ 45 -134 -139 201 -115 -257 165 -43 -196 -19 53 72 -136 225 -11 -301 82 125 -180 -255 131 52 -116 92
3307I2J8l29J94K27J2k87K36l7l16J88K41l79j85N43r0m9j62K11k41q0K78j57
$$ 92 110 -219 -25 202 214 -73 163 126 -190 -2 239 -140 -325 218 128 79 -83 128 -113 -193 85 -72
3329g2k63K93Q8j02K7K24K1m29M07R5l17j22O2J93l23L18J87n08J72L36l07M5
$$ -72 -335 -42 46 -56 -29 195 216 -213 194 289 -28 -150 -88 105 -218 100 287 -221 -49 287 -20 25
3351B5k0P5l47J66K02j61j23K87m2k93J14L06l97m7K98L8k35J33Q2K2j63K25J
$$ 25 5 80 -267 -101 101 -60 -183 104 62 -231 -117 189 -208 -255 43 81 -154 -21 61 83 -80 145 146
3374A46l59J43J36k18K57kk20N7J76J8j80m2J35j4p7Q8J18k65j91M59k87O2N9
$$ 146 -213 -70 66 -152 105 103 -117 -60 116 134 -46 -88 47 33 -44 44 162 -103 -294 165 -122 -60 -1
3397aN0j55J57K13k80o9Q8K02l05J82J70l56o4K28l2j78J41o1j84J20J41Q3l46
$$ -1 49 -106 51 264 -16 -85 3 205 -100 82 252 -104 -168 60 28 -150 -9 -70 -254 -134 7 90 -256
3420b56L66m0j37J2J34L0j77R7M7j32K3P3o7l3j26M25l15O8Q6K9j55J28J05m31
$$ -256 110 70 -67 -55 79 109 -68 29 76 -56 -33 40 -27 -60 -186 239 -76 -8 78 107 -48 80 185 -246
3444b46K76R7k69k27K93K9j54J05J92j01j96K52J42j44%m3O2o2LQ5k15O1P7n1
$$ -246 30 127 -142 -369 -76 -47 -201 -96 96 -5 -201 51 193 49 49 6 68 6 9 94 -121 -60 17 -34
3468c4oJ36J3j78K31q6o4PP1l2j77J6K46k17J7J41j04j1R5p7j34Q4J28p5p0J42
$$ -34 -40 96 109 -69 162 76 12 19 90 58 -119 -103 143 -74 -57 84 -20 -31 64 -13 -147 -63 65 -10 -80 62
3494F2o1M6q8J54j15n6Q5M5j98N3J35l7PLk9j78J26J45m6m9R4Oj55k6K53k25M9
$$ 62 1 47 -41 113 -2 -58 27 72 -126 -73 62 25 32 35 6 -172 -46 99 53 4 98 104 -51 -77 176 -49 0
3521@L4R5j40K7N8K5k56J30J14j58Q5j25k8J73L1J2j53J89l00J84o2J65Jk30P5
$$ 0 34 129 -11 16 74 99 -157 -27 87 -71 14 -111 -139 34 65 77 -76 113 -187 -3 -65 100 101 -129 -54
3546e4K61k44k5R6j89J15N1N6j14J0L5R6k08K74k7j14K8L4j56o8K42j70k9J53
$$ -54 207 -37 -62 34 -155 -40 11 67 -47 -37 -2 94 -114 160 133 19 47 81 -75 -143 99 -71 -100 53
3570E3R4k70m7K49j60L9K5qo4n8J89j27J14j47K12j14J3K03j03l40L60ol04K36
$$ 53 147 -123 -170 79 -81 -42 -17 -25 -89 -147 42 -85 29 -118 94 -20 -7 196 93 -247 113 107 -197 39
3594C9Rq3n1J54J37l94L2J99r7j77K24O3j34j54K46j00QN8J52k07J11N7q3j15
$$ 39 48 -35 -86 68 205 -189 -157 42 -55 -232 -8 55 -79 -233 13 -87 -79 -21 131 -76 35 92 9 -106
3618a06K28O5k95J84j46J11n2J43K1k83J67P6l34J93O0l3l9L0L6No6J9j4r3Q1
$$ -106 122 187 -108 76 -70 41 -11 132 153 -130 37 113 -221 -28 32 -1 -40 -10 26 31 -35 -16 -30 -123 -42
3643d2K35k67l6K73l58N3L78k41q8K5J87j67n1N5J80k09L9J60l98J49J34m9m7
$$ -42 193 -74 -110 163 -195 -142 236 -5 -93 -68 119 -48 -99 -44 136 -73 -34 126 -272 -123 11 -38 -85
3666h5J22J03k43O2K73k21j44K26Q0k19j4J87k43j17L96l1l22K36J47k59k2J30
$$ -85 37 140 -103 -41 232 11 -133 93 173 -46 -60 127 -116 -233 163 132 -190 46 193 -66 -88 42
3688D2j14J0J04J73l11k4J07J1r9j5M11l68M1J21N4j61N1R6k26N3J00j15j43N3
$$ 42 -72 -62 42 215 -96 -120 -13 -2 -101 -116 295 -73 -32 89 143 -18 33 129 -97 -44 56 -59 -202 -149
3712a49K32k45n0K85N8j87J92k16j18R5L15l43K0L40o7j97n2J23j89R3J49L6l06
$$ -149 83 -162 -212 73 131 -56 136 -80 -198 -103 212 -131 -111 229 162 -35 -87 36 -153 -60 89 125 -181
3735a81J64J10j41j86L17kj64O8P9k35N5K61k3k02J93P5j70k5J31j04o9J76k1
$$ -181 -17 93 -48 -234 83 81 -83 -15 64 -171 -116 145 122 -80 113 188 18 -7 124 20 -49 127 106
3758A06k72Q4K93j91k37K06j0p8J16J21j86R3l2L13l60m8K33Lp6kr6k52K30K04
$$ 106 -166 -82 211 20 -217 -11 -21 -99 17 138 -48 45 13 326 -34 -82 151 154 78 76 -20 -272 -42 162
3782A62k48l4J98l7j68K02L8k53k39M11L8j13N4K1k3j32J96k06J04J37J22k20
$$ 162 -86 -120 78 41 -127 75 113 -140 -379 32 70 -43 11 32 9 -123 73 -133 -29 108 230 10
3804A0n4J30j80NJ36n6M6mL3j48rK13j24Mj03O6R3j29K06q6k7l8j0q3J72j08m1
$$ 10 -44 86 -94 -89 47 -9 37 33 66 -82 -91 122 -2 2 -101 -35 58 -71 135 49 22 -16 -26 -109 63 -45 -86
3831h6K7m2K68k85K5K52j27j82L23j88Nj46L54k38n6J40j05kj5J56k9j79K35k6
$$ -86 -59 -101 167 -118 -93 159 32 -150 173 -15 -10 -156 198 -40 -96 44 -61 -63 -78 78 49 -130 105 79
3855G9k62J16J91j87j13L04j23j06J01k6m1P9K10j88k38J17J12j07K70qj70k52
$$ 79 -183 -67 124 -63 -176 128 5 -101 0 -26 -67 12 222 34 -204 -87 25 -82 188 180 10 -242
3877b42J09L40l10K4J02O8k43J64j92l8J97J83j21J71k03Q8k19p1L58n8k02K76
$$ -242 -133 207 -103 -79 23 91 -152 12 -180 -218 -21 162 41 212 9 97 -122 -193 165 107 -95 181
3899A81j49N4J05j66m8N1Oj34k9N6J86l00K45Jj50Q7mm5l3M0P8o1j20K50o3mk4
$$ 181 32 86 191 25 -23 28 34 -100 -129 -73 113 -187 58 59 -91 -4 -8 -53 -86 -46 32 -29 -149 101 38 34 10
3926A0J9M9q2Q2k4k21K6K67p3J0K9r2j14J28K51q3l27J11P5j0j06M0K2j23J61
$$ 10 29 78 -4 78 54 -167 -141 126 53 63 92 0 -114 14 265 182 -145 -34 41 31 -75 -35 -13 -136 25
3951B5n3L1j39K07k41j8J42K0M7M5j70L3K04qJ8k12j6jK0J7n1Q5K52k70J08o4
$$ 25 -28 3 -136 71 -170 -188 -46 -26 21 66 -104 -71 133 125 143 -69 -85 -86 -66 -49 -100 -15 237 -33 75 11
3977A1p3J25l6k52P3J52k2lJ1j62J03J14L0j73R6J08j25rJ18K4j62oJ01L8j30
$$ 11 -62 63 27 -225 -152 0 -22 -25 -14 -176 -73 41 71 -102 -6 102 -23 -32 86 110 -52 -58 43 81 -49
4002d9L0J01j57r9K03k39J58o6ORK7K68k27j34J70k73L30M8j40p4K22Jk2k0j32
$$ -49 -19 82 -75 -174 29 -210 -52 -118 -112 -103 -76 192 -35 -169 1 -272 58 106 -34 -108 114 115 93 73 -59
4027e9K06k30J57K0o4k47K59R3k37P3K04k55L0m4K20j18k7J7P1o3K24k93n1J42
$$ -59 147 -83 74 94 30 -217 42 135 -102 -29 175 -80 -50 -94 126 8 -19 -2 69 6 230 -63 -114 28
4051B8l5J7MKj93L7J56l3p1p2J04J34j92O9J91p4K2j11j22O5J19o4l4l4J03j67
$$ 28 -7 10 14 16 -177 -140 16 -17 -88 -160 -56 78 -114 -45 146 72 94 -17 -139 -74 45 -19 -53 -87 16 -151
4077a51p5J67N9m3nJ32l8O9j7j02j86J89j51J6P1K9K0k4k7J72j77L6J51m0q6o
$$ -151 -226 -59 0 -43 -48 84 46 115 98 -4 -190 -1 -152 -136 -65 -36 -16 -40 -67 105 -72 -36 115 75 -11 -17
4103a7Q8k00J26J10k8j21J9pl2l7O4Q7k03J53r6P7j71J74J8OJ83p1j80J09j17
$$ -17 71 -129 -3 107 79 -42 -23 -30 -62 -99 -35 52 -151 2 -94 -17 -188 -14 4 10 193 122 -58 51 -66
4128f6o8J79M1pp4j8M1o7L2k7N0j05q1K59k4p8KJ49k29J85O7j85K19n1qk50L35
$$ -66 -134 45 86 79 5 -13 28 -39 -7 -34 16 -89 -170 89 65 -13 -11 138 -91 94 161 -24 195 144 136 -114 221
4155B21j14j77j5O5J4P4P1j41j20J10k7M1k2l3P4l7J5Q2k1j6M9N3j91K0QJ0M2
$$ 221 107 -70 -85 -20 -6 68 139 -2 -122 -12 -39 2 -20 -53 21 -16 -1 81 60 44 93 146 -45 -25 -17 -7 35
4182C5L2j5r5m3P0Qj36J67M5q3KJ1J2k43K79J05l97K43N3Jo4J65j0k08q8L56k01
$$ 35 67 52 -43 -86 -16 -8 -144 23 68 -15 -13 -2 10 -233 46 151 -246 -3 50 51 -13 152 142 -66 -154 202 1
4209AJ8J6k8L3r9J19q9J90j23m6n0J52K2m5r6J41m6Oj13K78l80J25j9J2J18q8
$$ 1 19 35 7 40 -59 60 -29 161 38 -8 -58 94 116 71 -25 116 70 76 -37 241 -139 -14 -33 -21 97 9
4235Ik0P4N9p7j53k7J83N3j83J86j10j29r1J34K04k07J46L3j61%J70r1l8J04r1
$$ 9 -11 63 122 45 -108 -135 48 101 -82 104 -6 -135 -226 -92 112 -95 51 84 -77 -77 93 2 -36 68 -23
4260b3Ko1J29j06O2J68j43j47J26o1n1M0K24j01l8l0j04LJ96l2p5o7J80k27K15
$$ -23 -21 -82 47 -59 3 171 28 -119 7 -54 -105 -65 159 58 20 -10 -114 -111 85 53 -22 -89 91 -136 79
4285G9q1j6j80N5J60jj66K17k3n1Qj02R3o1M5m9J25m3oJ11k60J12J55r5p6O1q
$$ 79 -2 -18 -198 -143 17 16 -150 67 44 -7 1 -101 -8 -69 -24 -73 52 9 3 114 -146 -34 121 26 -50 11 3
4312CO4j32L17j54k44K02j1rR4J2j45O6R8k5k26K39Lj98N5Q6j64j2K02o5k15J31
$$ 3 67 -65 252 98 -146 56 45 36 130 142 -3 63 161 136 -90 149 152 -46 9 95 -69 -81 121 56 -159 -28
4338b8K13k77l7P9J8q7J21P0j05p3K10p3P9j06j1P4j26Q7Q0l44k5M63l08J24M1
$$ -28 185 -92 -129 -50 -32 -119 2 72 -33 -106 104 31 110 4 -7 67 -59 28 108 -236 -261 202 -106 18 59
4363E9Pj02J25k8j76P5J83q7j09J15r9o4r3K54p4Rl1J14j34j00K71j06p4J15j48
$$ 59 66 -36 89 61 -115 -40 143 56 -53 62 -37 -101 -194 60 -14 -5 -36 78 -56 -156 115 9 -65 50 -98
4388i8j34K74k2K19l65K48k04QJ68J09q9j89J27Rq2J60j5j47n0J79j13o3J24q1
$$ -98 -232 42 20 239 -126 122 -82 -74 94 203 114 -75 52 61 -21 139 124 -23 -73 106 -7 -70 54 -27
4412b7j6k1K4l2m5K11j13j08J94N6r5j89K39j90K80j56Q0J01k67J52j8p0o6K43
$$ -27 -43 -64 -40 -72 -117 94 -19 -127 67 123 28 -161 78 -112 168 12 92 193 -74 78 60 -10 -76 167
4436A67j49OK7J1L8j07Q6k34K34L6p0o4OQj22K06j95Q7J31j59J09j94j4J45j2
$$ 167 18 24 51 62 100 -7 79 -155 79 115 45 -19 -13 -5 -127 79 -116 -29 102 -57 52 -142 -156 -11 -23
4461b3L1k4k1J17j18O7j09J19j15J02q0J38k15P7Q0J43j04j32P8O2j76O1R7o8
$$ -23 8 -16 -37 80 -38 29 -80 39 -76 26 -54 84 -131 -54 26 169 65 -67 11 73 -103 -42 55 -13
4485a3k04K47nk3J82j48L5j31R1L8Mj93M4O3m7J84j59k2j09J48o4j25K04M1m7
$$ -13 -217 30 25 2 184 36 71 -60 31 69 73 -120 -76 -13 -60 124 -35 -57 -166 -18 -82 -207 -3 38 -9
4510iQ0J5j10J7QP2j25Q6N3j27n4M6P3j41J43J69l6k07J63o6j54L8R9l5J2O8J9
$$ -9 71 86 -24 -7 1 73 -52 34 87 -40 -94 -48 25 -116 27 196 160 -47 116 50 -104 -66 33 -2 10 78 97
4537I7k54J10P1j06j6P5n6K00l00J00J75q4J54k26k5J15R1r9j13J72L3L5k03o4
$$ 97 -157 -47 24 -82 -98 -23 -79 121 -179 -79 96 12 166 -60 -85 30 121 22 -91 81 114 149 -54 -118
4561a18MM2K34k57J48m5L3qO6O6m2k97J57O2j1r6q2P7j4J36j05J54j24nj27M7
$$ -118 -114 -72 162 -95 53 8 41 33 99 165 123 -174 -17 45 34 -62 -144 -67 -81 55 -50 104 -20 -25 -152 -105
4587a05QJ40M1pp2j42K29L4m5j36P3rj05k3J55N5k13Q3L9p6J08L9j00nRL9r4K11
$$ -105 -97 43 84 77 5 -137 92 126 81 -55 18 9 -96 -119 36 91 -122 -39 0 -76 32 71 -29 -34 -25 14 -80 131
4615A31N1l14M6R8MO3L0m5K1q7M7k8j07Q6j5l9l0O7N5j43P8Q1k5j4O4Kj51J19
$$ 131 182 -132 -86 12 16 79 109 64 85 -2 45 17 -90 -4 -19 -58 -88 -21 34 -109 -31 50 25 11 75 77 -74 45
4643D5k2p8n9J85l3j41R9J06k01J55J49k06n9R4J15l14K31k0r2k7J59r3j83J02
$$ 45 23 -55 -114 71 38 -103 -4 102 -99 56 205 -1 -60 34 149 -165 66 46 -46 -73 86 -7 -190 -88
4667h8K31k23l9P0P5j02m8J51j14K12j42N5j79j36J94R9p6r3K13r1Q4j55q1K25
$$ -88 143 -80 -119 -49 26 -76 -124 27 -87 125 -17 38 -141 -277 -83 16 -60 -153 60 -31 53 -102 -183 42
4691D2p0J68k67J74o0q7J7J23jj58j9J53k6l7N1J57k17Q3Q8k57J54k7j67R6K17
$$ 42 -28 140 -127 47 -13 -100 -83 40 39 -119 -138 15 -11 -48 3 160 -57 26 114 -143 11 -16 -183 -87 130
4716A30l3k13J27j5R5q7J7m5k5M5R2q5p6J34n1p0K43j43j92L5K97k23N2n3K0J07
$$ 130 97 -116 11 -4 91 4 21 -24 -49 -4 88 3 -73 61 10 -60 183 40 -152 -117 180 -43 9 -44 -24 83
4742H3q8M2n3J7L4O3l64J87k9J28o8J72j00J1Ll1pnj79K26Q4j83P7q1r5J51n5
$$ 83 -5 37 -16 1 35 98 -266 -79 -108 20 -48 124 24 35 38 7 0 -5 -184 42 126 -57 20 -61 -156 -5 -60
4769f0n5J03No1P2J67j15j49R7K5q2j32K24R4r7Nj35J34l0M7j42P4L7k9%j67J21
$$ -60 -115 -12 -7 -68 4 171 56 -93 4 29 -53 -185 39 133 36 41 -94 40 10 57 -85 -11 26 -3 -3 -170 -49
4796d9q2J07J1r4L1J77q6n4L9r2K16k45M8L27l82J5J14k4j28K56r8j1p3L4J35
$$ -49 -131 -24 -13 -107 -76 101 15 -39 0 -92 124 -121 -73 254 -128 -113 1 -23 -151 105 7 -4 -77 -43 92
4821I2k01P7L6L7Pk0j11M2J10k03P4M7R9J00j36J43j36k8o5j7J2P5r9M2j3q3J13
$$ 92 -109 -32 4 41 48 28 -83 -41 69 -134 -60 -13 86 186 50 193 57 29 -36 -53 -41 34 -65 -23 -36 -119 -6
4848fop8J11M5k26J78jrj41J68N4r8Mp0l2J70Q2j62m3LK3J51J6n5rq4R7n9j29
$$ -6 -12 -90 21 66 -160 18 17 8 -133 35 89 -9 -5 -75 -107 63 145 -17 -60 -57 -34 117 133 78 69 -15 82 23 -106
4877a06J91m0n4j08J33J10k70J17P8m5j04L9P4j09P6J1q9P9L0K03k77Q2j37L8
$$ -106 85 45 -9 -117 16 126 -144 -27 51 6 -98 -59 15 -94 -18 -7 -96 -17 13 216 -61 21 -116 -78
4901g8M5J82j24M1R1k03j9J80n0k7k0p3J81k20J90N2j62rN9rl3p5l1J84j20j02
$$ -78 -33 149 25 66 157 -46 -65 115 65 38 18 -55 126 -94 96 148 -14 -23 36 27 -6 -81 -112 72 -48 -150
4927a50J61l3L8J11j56N8O2j12J19p3M9m3p9M6k5M1j19J76j04p5J33M9j99J57
$$ -150 11 -22 16 127 -29 29 91 -21 98 25 74 31 -48 -2 -27 14 -105 71 -33 -108 25 74 -125 32
4951C2L5N6k25K18j16J17r4K2j27j1L4J08k20K49q3lj20O6L9k4Q2l9J86l97J73
$$ 32 67 123 -102 116 0 117 23 45 -82 -93 -59 49 -171 78 -5 -8 -128 -62 -23 -47 35 -4 182 -215 -42
4976d2p8J18J9l8kk68L25j23P1J22k24k1P2J65q8k1J9n0l7k8J18n8j6K17k34J01
$$ -42 -120 -2 17 -21 -23 -291 34 -89 -18 104 -120 -141 -69 96 8 -13 6 -44 -81 -109 9 -49 -65 152 -82 19
5002A9J07j7r0j67K58o8j25J77j52M2l7j6L6J27j2j31o9O9J87k96J81n2j45K57
$$ 19 126 109 19 -148 110 42 -83 94 -58 -16 -53 -69 -33 94 82 -49 -118 -49 138 -158 23 -29 -174 83
5026H3j21nQ2k12J32J69J3j55J85j50pO0p6p5j4J09k6j71K45n3j02J98k5q9j9
$$ 83 -38 -43 39 -173 -41 128 141 -14 171 21 14 74 -2 -77 -91 18 -8 -179 66 13 -89 109 84 -5 -24
5051b4j6R1j19M3k9J93j72n2J28o7Q6N4M6j05J16l22OJ33R5q0Ql5L7l8m7K18l3
$$ -24 -40 51 -68 -25 -54 139 -33 -85 43 -24 62 116 162 57 173 -149 -143 -10 85 5 13 -22 15 -23 -70 148 115
5078A15J8k32Q5j90K35j28p1J75Q4k2N1k19J94l6r5M1o4l4K90j85j74K88k23O2
$$ 115 133 -99 -14 -204 31 -97 -168 7 91 69 120 -99 95 59 -36 5 -59 -93 197 12 -162 126 -97 -35
5102c5O7o5M4r6P9q0m1J54o4K9j53K06n3J5k9J02m7O5l9o3K2J71j16r5P3m0r9
$$ -35 32 -33 11 -85 -6 -86 -127 27 -37 -8 -161 45 -8 7 -22 80 33 98 59 -4 18 189 73 -22 51 11 -88
5129h8J0j38Q9P7k3J37j18Nk1J09Qn0J03O4j40j30J14j18k4R0J19j42K13j38q7
$$ -88 -78 -216 -127 -50 -73 64 -54 -49 -70 39 47 -3 100 164 24 -106 8 -110 -134 -44 75 -67 146 8 -79
5154g9M8N1L9j15J54o6O1r8k1J3J39l6q5J10j68J76j50J5J95k07P6j08J14p7l9
$$ -79 -31 20 59 -56 98 32 93 -5 -26 -13 126 90 5 115 -53 123 -27 -12 183 -24 52 -56 58 -19 -58
5179e8n0J68l05L10l5j83J87j09oJ46L0J0L7j71O3k50J40o5K60j78K8J75j28J06
$$ -58 -108 60 -245 65 30 -153 34 -75 -81 65 95 105 142 -29 34 -216 -76 -141 119 -59 -31 144 16 122
5203A22j03m2P8m0L8q8m7O1P1j92J68K7J07j56q0N9m2j7O6lN9k5Q5j86J89j95
$$ 122 19 -23 55 15 53 -35 -82 -21 50 -142 26 53 160 4 -76 -17 -59 -76 -10 -13 46 21 106 -80 109 -86
5229h6R4j88K17m9N5o1j50K25j07n4K1J60p9J47k45Q7j8jOj5N4k3N1J4O6p7J24
$$ -86 8 -180 37 -12 43 -18 -168 57 -50 -104 -83 77 -2 145 -100 -13 -31 -32 -26 -41 13 -10 41 55 121 44 168
5256A68p4j23P6J1M2j69J57q5P6L7j52J54k17K3J67l2j77r4J83k2K1r3m9L8J31
$$ 168 94 -29 47 58 100 -69 88 3 79 116 -36 118 -99 -76 91 59 -118 -212 -29 -51 -30 -123 -172 -134 -3
5281cO6j47M7L1q9K55k85J40q5J49k0J33j03k84J40J07j43K19m5j04R8j34J08
$$ -3 63 -84 -37 -6 -95 160 -125 15 -70 79 59 192 89 -195 -55 52 -91 128 83 -21 77 -57 51
5304E1j33j49R7J93o2J1j71K33j63J24j94J80k7j07R7j11P6N2P7m3j22J83j45
$$ 51 -82 -231 -134 59 -3 8 -163 70 -93 31 -163 17 -10 -117 -20 -131 -55 -3 74 31 -91 92 -53
5327e3l9J42j57J06LK8rj09J24o9Q0R0k02j7J22j13J84k17J30o3J48k99K14j77
$$ -53 -92 50 -107 -1 2 30 21 -88 36 -33 47 137 -65 -82 40 -73 111 -106 24 -39 109 -190 24 -153
5351a53L0J32m5k1M1L4m4j2q5L8l7k3N4K2K8R3j51J59j03J51k16J49j1R5j0N7
$$ -153 -123 9 -36 -57 -16 18 -26 -38 -123 -85 -122 -145 -91 -69 -41 52 -99 60 -43 108 -108 41 30 125 115 172
5377A72l5k90P9P2Q3j34M8M9P0j05j39J32O4j14P8r2J27j05r9K52j55o4jJ10q7
$$ 172 137 -153 -74 -2 81 -53 -5 44 114 9 -130 2 66 -48 30 -62 65 -40 -139 113 -42 -106 -107 3 -84
5402h4PP7K4j25J56o2M1o8r3R9j2j09NJ59o4j00R9J5o4P0j25J34J33j40o2J69
$$ -84 -77 0 24 -101 55 -7 34 -34 -127 -28 -40 -149 -144 15 -49 -149 -50 -35 -99 -29 -154 -20 113 -27 -89 80
5428H0J40j89nL9J9j59RJ15p3k27J25J01Kk5J96j00j22P6J9j29M2J30l5j33J24
$$ 80 220 31 26 65 84 -75 -66 49 -24 -251 -126 -25 -23 -48 148 48 -74 2 21 -108 -66 64 29 -104 20
5453B0R9j80J04r3n5J39J7n4m3R3k10K52j12K1oj12O9r7K3J55P6p2%J5k9n0J05
$$ 20 119 -61 43 -50 -105 34 51 -3 -46 47 -163 89 -23 -2 -8 -120 -51 -148 -125 30 106 34 34 49 20 -30 75
5480G5jK9k92K70r9k9O0L4q5k2o3M7q5K80j49l1K5J14r5k1o8L1J77n2M6k13J74
$$ 75 74 103 -189 81 -18 -47 13 47 -38 -60 -123 -76 -161 119 -30 -61 -36 78 -17 -38 -106 -75 102 50 96 -117 57
5507E7j39Q4o7J11Ol9j03J29j12J3K4p1J60j35J50J1k71N0N9j8pJ58r1l9J04j67
$$ 57 -82 2 -65 46 52 13 -90 39 -73 -60 -36 -107 53 -82 68 79 -192 -142 -83 -101 -108 50 -41 -80 24 -143
5533a43K82p5qj48k2N7k2q7K29K17k95L0p3k8J63n4j41J45rp9J82k9o2j4J22k67
$$ -143 139 64 56 -92 -114 -57 -79 -166 63 280 -15 15 -58 -86 77 23 -118 27 18 -61 121 92 30 16 138 -129
5559a29P8j56M8J28J00j99L1J23Mj7m2L2Lk5L9q0N5J00l6L1K4J7j81Q4P0K6k38
$$ -129 -51 -207 -159 -31 69 -130 -99 24 28 11 -31 1 4 -21 18 -62 -7 93 57 88 112 129 -52 32 102 128 -110
$$ [...]
8191B0
##END NTUPLES=NMR FID
##END=
