##TITLE=1H_Ser 5-6-i-2
 CDCl3
 8 sc, 
 14.12.2021
##JCAMPDX= 6.0         $$ Bruker NMR JCAMP-DX V2.0
##DATA TYPE= NMR FID
##DATA CLASS= NTUPLES
##ORIGIN= UXNMR, Bruker Analytische Messtechnik GmbH
##OWNER= root
$$ XWIN-NMR		Version 3.5
$$ Tue Dec 14 11:53:23 2021 Russian Standard Time (UT+4h)  she@DPX200
##.OBSERVE FREQUENCY= 200.131346
##.OBSERVE NUCLEUS= ^1H
##.DELAY= (6, 6)
##.ACQUISITION MODE= SIMULTANEOUS
##.ACQUISITION SCHEME= undefined
##.AVERAGES= 8
##.DIGITISER RES= 18
##SPECTROMETER/DATA SYSTEM= spect
##.PULSE SEQUENCE= zg30
##.SOLVENT NAME= CDCl3
##.SHIFT REFERENCE= (INTERNAL, CDCl3, 0, 15.7039)
##AUDIT TRAIL= $$ (NUMBER, WHEN, WHO, WHERE, WHAT)
$$ ##TITLE= Audit trail, XWIN-NMR		Version 3.5
$$ ##JCAMPDX= 5.01
$$ ##ORIGIN= Bruker BioSpin GmbH
$$ ##OWNER= she
$$ F:/spectra/data/she/nmr/H-F/1/audita.txt
$$ ##AUDIT TRAIL=  $$ (NUMBER, WHEN, WHO, WHERE, WHAT)
(   1,<2021-12-14 11:52:07.45 +0400>,<she>,<DPX200>,
      <created by zg, POWCHK disabled, PULCHK disabled
       configuration hash MD5:
       00 E9 B6 7A A2 85 ED C7 34 08 36 98 17 FE 4E 26
       data hash MD5: 16K
       37 89 59 65 BB F1 03 F9 37 60 11 97 50 82 46 29>)
$$ ##END=
$$ 
$$ hash MD5
$$ 7D E0 19 D5 F7 32 BD 93 B6 7F A2 98 9B 56 34 7D
##$RELAX= 
##$RELAX= 
##$RELAX= 
##$RELAX= 
##$RELAX= 
##$RELAX= 
$$ Bruker specific parameters
$$ --------------------------
##$DU= <F:/spectra>
##$EXPNO= 1
##$NAME= <H-F>
##$PROCNO= 1
##$TYPE= <nmr>
##$USER= <she>
##$AMP= (0..31)
100 100 100 100 100 100 100 100 100 100 100 100 100 100 100 100 100 100 
100 100 100 100 100 100 100 100 100 100 100 100 100 100 
##$AQSEQ= 0
##$AQ_mod= 1
##$AUNM= <au_zg>
##$AUTOPOS= <>
##$BF1= 200.13
##$BF2= 200.13
##$BF3= 200.13
##$BF4= 200.13
##$BF5= 200.13
##$BF6= 200.13
##$BF7= 200.13
##$BF8= 200.13
##$BYTORDA= 1
##$CFDGTYP= 0
##$CFRGTYP= 5
##$CHEMSTR= <none>
##$CNST= (0..31)
1 1 145 1 1 1 1 1 1 1 1 1 1 1 1 1 1 1 1 1 1 1 1 1 1 1 1 1 1 1 1 1 
##$CPDPRG= <>
##$CPDPRG1= <>
##$CPDPRG2= <>
##$CPDPRG3= <>
##$CPDPRG4= <mlev>
##$CPDPRG5= <mlev>
##$CPDPRG6= <mlev>
##$CPDPRG7= <mlev>
##$CPDPRG8= <mlev>
##$CPDPRGB= <>
##$CPDPRGT= <>
##$D= (0..31)
0 1.2 0 0 0 0 0 0 0 0.06 0 0.03 0 0 0 0 0.0002 0 0 0 0 0 0 0 0 0 0 0 0 
0 0 0 
##$DATE= 1639468326
##$DBL= (0..7)
120 120 120 120 120 120 120 120 
##$DBP= (0..7)
150 150 150 150 150 150 150 150 
##$DBP07= 0
##$DBPNAM0= <>
##$DBPNAM1= <>
##$DBPNAM2= <>
##$DBPNAM3= <>
##$DBPNAM4= <>
##$DBPNAM5= <>
##$DBPNAM6= <>
##$DBPNAM7= <>
##$DBPOAL= (0..7)
0.5 0.5 0.5 0.5 0.5 0.5 0.5 0.5 
##$DBPOFFS= (0..7)
0 0 0 0 0 0 0 0 
##$DE= 6
##$DECBNUC= <off>
##$DECIM= 32
##$DECNUC= <off>
##$DECSTAT= 4
##$DIGMOD= 1
##$DIGTYP= 9
##$DL= (0..7)
0 120 120 120 120 120 120 120 
##$DP= (0..7)
150 150 150 150 150 150 150 150 
##$DP07= 0
##$DPNAME0= <>
##$DPNAME1= <>
##$DPNAME2= <>
##$DPNAME3= <>
##$DPNAME4= <>
##$DPNAME5= <>
##$DPNAME6= <>
##$DPNAME7= <>
##$DPOAL= (0..7)
0.5 0.5 0.5 0.5 0.5 0.5 0.5 0.5 
##$DPOFFS= (0..7)
0 0 0 0 0 0 0 0 
##$DQDMODE= 0
##$DR= 18
##$DS= 0
##$DSLIST= <SSSSSSSSSSSSSSS>
$$ [...]
##$SUBNAM2= <"">
##$SUBNAM3= <"">
##$SUBNAM4= <"">
##$SUBNAM5= <"">
##$SUBNAM6= <"">
##$SUBNAM7= <"">
##$SUBNAM8= <"">
##$SUBNAM9= <"">
##$SW= 18.0517287032376
##$SWIBOX= (0..15)
0 0 2 0 0 0 0 0 0 0 0 0 0 0 0 0 
##$SW_h= 3612.71676300578
##$TD= 16384
##$TD0= 1
##$TE= 0
##$TE2= 300
##$TE3= 300
##$TEG= 300
##$TL= (0..7)
0 120 120 120 120 120 120 120 
##$TP= (0..7)
150 150 150 150 150 150 150 150 
##$TP07= 0
##$TPNAME0= <>
##$TPNAME1= <>
##$TPNAME2= <>
##$TPNAME3= <>
##$TPNAME4= <>
##$TPNAME5= <>
##$TPNAME6= <>
##$TPNAME7= <>
##$TPOAL= (0..7)
0.5 0.5 0.5 0.5 0.5 0.5 0.5 0.5 
##$TPOFFS= (0..7)
0 0 0 0 0 0 0 0 
##$TUNHIN= 0
##$TUNHOUT= 0
##$TUNXOUT= 0
##$USERA1= <user>
##$USERA2= <user>
##$USERA3= <user>
##$USERA4= <user>
##$USERA5= <user>
##$V9= 5
##$VALIST= <valist>
##$VCLIST= <CCCCCCCCCCCCCCC>
##$VD= 0
##$VDLIST= <DDDDDDDDDDDDDDD>
##$VPLIST= <PPPPPPPPPPPPPPP>
##$VTLIST= <TTTTTTTTTTTTTTT>
##$WBST= 1024
##$WBSW= 4
##$XGAIN= (0..3)
0 0 0 0 
##$XL= 0
##$YL= 0
##$YMAX_a= 49565
##$YMIN_a= -80851
##$ZGOPTNS= <>
##$ZL1= 120
##$ZL2= 120
##$ZL3= 120
##$ZL4= 120
##$ABSF1= 10
##$ABSF2= 0
##$ABSG= 5
##$ABSL= 3
##$ALPHA= 0
##$AQORDER= 0
##$ASSFAC= 0
##$ASSFACI= 0
##$ASSFACX= 0
##$ASSWID= 0
##$AUNMP= <proc_1d>
##$AZFE= 0.1
##$AZFW= 0.1
##$BCFW= 1
##$BC_mod= 2
##$BYTORDP= 1
##$COROFFS= 0
##$CY= 11.3945322036743
##$DATMOD= 1
##$DC= 2
##$DFILT= <>
##$DTYPP= 0
##$F1P= 2.36226072786647
##$F2P= -0.459571619588291
##$FCOR= 0.5
##$FTSIZE= 0
##$FT_mod= 4
##$GAMMA= 1
##$GB= 0.15
##$INTBC= 1
##$INTSCL= 1
##$ISEN= 128
##$LB= 0.24
##$LEV0= 0
##$LPBIN= 0
##$MAXI= 10000
##$MC2= 0
##$MEAN= 0
##$ME_mod= 0
##$MI= 1.114404
##$NCOEF= 0
##$NC_proc= 0
##$NLEV= 6
##$NOISF1= 3.799351
##$NOISF2= 2.8
##$NSP= 1
##$NTH_PI= 0
##$NZP= 0
##$OFFSET= 15.70392
##$PC= 1
##$PHC0= -15873.41
##$PHC1= 14.2008
##$PH_mod= 1
##$PKNL= yes
##$PPARMOD= 0
##$PSCAL= 0
##$PSIGN= 0
##$REVERSE= no
##$SF= 200.130013532006
##$SI= 16384
##$SIGF1= 3
##$SIGF2= 2
##$SINO= 400
##$SIOLD= 16384
##$SREGLST= <1H.CDCl3>
##$SSB= 0
##$STSI= 0
##$STSR= 0
##$SW_p= 3612.71676300578
##$SYMM= 0
##$S_DEV= 0
##$TDeff= 0
##$TDoff= 0
##$TI= <>
##$TILT= no
##$TM1= 0
##$TM2= 0
##$TOPLEV= 0
##$USERP1= <user>
##$USERP2= <user>
##$USERP3= <user>
##$USERP4= <user>
##$USERP5= <user>
##$WDW= 1
##$XDIM= 8192
##$YMAX_p= 0
##$YMIN_p= 0
$$ End of Bruker specific parameters
$$ ---------------------------------
##NTUPLES= NMR FID
##VAR_NAME=  TIME,          FID/REAL,        FID/IMAG
##SYMBOL=    X,             R,               I
##VAR_TYPE=  INDEPENDENT,   DEPENDENT,       DEPENDENT
##VAR_FORM=  AFFN,          ASDF,            ASDF
##VAR_DIM=   8192,          8192,            8192
##UNITS=     SECONDS,       ARBITRARY UNITS, ARBITRARY UNITS
##FACTOR=    0.0002768,     1,               1
##FIRST=     0,             0,               0
##LAST=      2.2672688,     0,               0
##MIN=       0,             -80851,          0
##MAX=       2.2672688,     49565,           0
$$ Real data points
##PAGE= N=1
##DATA TABLE= (X++(R..R)), XYDATA
0@%%%%%%%%%%%%%%%Qj6J6j6J6k4L2l2M0m8N6o4P2q7J00j13J29j46J64j86K10k36
$$ 0 0 0 0 0 0 0 0 0 0 0 0 0 0 0 0 8 -8 8 -8 8 -16 16 -16 24 -24 32 -32 40 -47 53 -60 69 -77 87 -99 111 -125
37a25K66k98L30l68M10m54N04n58O17o83P53q29R13j006J109j222J348j488J645
$$ -125 141 -157 173 -195 215 -239 265 -293 324 -359 394 -435 478 -528 581 -641 707 -781 864
56H64j822K026k260K532k857L250l736M356n178O329q070J1037j7463O0557n3261
$$ 864 -958 1068 -1192 1340 -1517 1733 -2003 2353 -2825 3504 -4566 6471 -10992 49565 -3696
71c696m6671R7007k8830l1702K4531P904n1939Q333N5431k3651m4298M5746m275
$$ -3696 -50367 46640 17810 -13892 10639 18543 -33396 -25063 30368 6717 -37581 8165 3890
84C890k8654L3185O617l0736L750J8118K557k6383J3648K9517l5045p200L7773
$$ 3890 -24764 8421 15038 -15698 -11948 6170 8727 -17656 -4008 25509 -9536 -16736 21037
97B1037j6339j1290J6702j706j4408m595K3407M469l0295J0334Q250j4792J8959
$$ 21037 4698 -6592 10110 8404 -6004 -10599 12808 17277 -13018 -2684 5566 -9226 9733
110I733k200k0895J0289L324J693R3p822P872p598m001K1275j1480j3661J1820
$$ 9733 7533 -13362 -3073 251 1944 2037 -5785 2087 -5511 -9512 11763 283 -13378 -1558
124a558K829j68p284N652J3608k3317N407K8082k4223o396K1622j1703p881R436
$$ -1558 1271 1103 -6181 -529 13079 -10238 -4831 23251 -972 -7368 14254 2551 -5330 4106
138D106M824j1962r179K2119n272k2129K5281j149k5864J9518Q624j7271j381
$$ 4106 8930 -3032 -12211 9908 4636 -17493 7788 6639 -19225 293 8917 -8354 -9735
151i735R839O382j4941J443K1645j7457n529K3583j1510j0438J2007Q10n437p819
$$ -9735 104 6486 -8455 -7012 14633 -2824 -8353 15230 3720 -6718 5289 6099 662 -7157
165g157R231M612j7514J2596Q059k1663J1735J1874j4814L83M914J000m479m265
$$ -7157 2074 6686 -10828 1768 9827 -11836 -101 11773 -3041 -2658 2256 3256 -1223 -5488
179e488J1516q573q777J8079p123r600J2039k755l74J381l038O871o762Q46J2122
$$ -5488 6028 -2545 -11322 6757 -366 -9966 2073 -682 -1056 325 -2713 4158 -2604 -1758 10364
194A0364j3739r78J2160o336n6N73q89K314p113Q244K016j7287J1282O291j5045
$$ 10364 -3375 -4353 7807 1471 1415 1988 1099 3413 -3700 4544 6560 -10727 555 6846 -8199
209h199P144L369p234J649P85N649o469m444J4166p961o401J5464n851n397P473
$$ -8199 -1055 2314 -4920 -3271 -2486 3163 -3306 -7750 6416 -1545 -7946 7518 1667 -3730 3743
224C743j549N87l734L066O546j3928L669J1221j3784K284P758q394M14J936K765
$$ 3743 2194 2781 -953 2113 8659 -5269 -1600 9621 -4163 -1879 5879 -2515 -2101 -165 2600
239B600k759q022J1548j893j1667J3714j415j0849J0012J57l045N98J98N479p469
$$ 2600 -159 -8181 3367 1474 -10193 3521 2106 -8743 1269 1426 -1619 -1021 -823 4656 -2813
254b813m45J2062j1045j332J0990q034K75M039k145J859n453L967L373j2014P427
$$ -2813 -3258 8804 -2241 -3573 7417 -617 -342 3697 1552 3411 -2042 1925 5298 -6716 711
269G11M376j2933O463K912n603K240q38L892k397m536J0333m896o434J2006n094
$$ 711 5087 -7846 -1383 1529 -4074 -1834 -2672 1220 -1177 -5713 4620 -276 -6710 5296 202
284B02m201P497k665N20k36l31M871p386J578P014j0215K485N196p342K656K34
$$ 202 -3999 3498 833 1353 1117 786 5657 -1729 -151 6863 -3352 -867 4329 -3013 -357 -123
300a23o09K025o602N798K030j0074Q609K18p221O431q20r05J873k819N818l281
$$ -123 -732 1293 -5309 489 2519 -7555 1054 1272 -5949 482 -338 -1243 630 -2189 3629 348
316C48l877J0317o544l612Q746n664l32L352k608K212l670J510N592r847L825
$$ 348 -3529 6788 244 -3368 5378 -286 -618 2734 126 2338 -1332 178 5770 -4077 -252
331b52N258r961L254L048m551J693j771K913N38n704Q564j732p148R631k409m658
$$ -252 5006 -4955 -1701 1347 -3204 -1511 -3282 -369 169 -5535 3029 1297 -5851 3780 1371 -3287
347c287O091j919m38k6o03N448o389J18Q337r215Q15O375p134P52J830j858J547
$$ -3287 2804 885 447 421 -182 5266 -1123 -1005 7332 -1883 -1068 5307 -1827 -1075 755 -1103 444
364D44m915M492K014q293O938R76p423P112q44l218L194j944L158j326k911P523
$$ 444 -4471 21 2035 -6258 680 1656 -5767 1345 501 -2717 477 -1467 1691 365 -2546 4977
380D977m838k749Q437n836p46M393l579J452j395p08M280n967J780M164p717L671
$$ 4977 139 -2610 5827 -9 -755 3638 59 1511 116 -592 3688 -2279 -499 3665 -4052 -381
396c81K109m866K866j846J28K820m650M225N84n311P037j555l668N116k358k7
$$ -381 1728 -3138 -272 -2118 -1990 830 -3820 405 989 -4322 2715 1160 -2508 2608 250 223
412B23J035k740N421l199k533P080n689j151O252m573m50jj276L394m812J890
$$ 223 1258 -1482 3939 740 -1793 5287 -402 -1553 4699 126 -324 -325 -1601 1793 -3019 -1129
428a129L377p977M816M302p246L453J034k568J873r90K474k093l372Q658l983
$$ -1129 2248 -5729 -913 3389 -3857 -404 630 -1938 -65 -1055 1419 -674 -4046 4612 629
443F29m650R663l477l796N191j837m10r45J34K298o589K523N280p908K472L259
$$ 629 -4021 5642 2165 -1631 3560 1723 1313 368 502 2800 -3789 -1266 4014 -3894 -1422 1837
459A837n763L827J042k717N15j442L844q50m252N863k111l779P484k234k521K958
$$ 1837 -3926 -99 943 -1774 -1259 -2701 1143 293 -3959 1904 -207 -3986 3498 1264 -1257 1701
475A701j824K906j371k388M334m006N46L923n210J690J128l735M100k671j592
$$ 1701 -123 2783 1412 -976 3358 -648 -102 3821 -1389 301 1429 -2306 1794 -877 -2469
490b469L989m912J518L092m346K776K0j848K704k269L573j96o050O649O65n893
$$ -2469 1520 -3392 -1874 1218 -3128 -352 -332 -2180 524 -1745 1828 1632 -4418 2231 2896 -2997
506b997O385o12m375L107M07O95k944p50M614o182J033O520q485K9O688n189r9
$$ -2997 3388 2776 -1599 1508 1915 2610 -334 -1084 3530 -2652 -1619 4901 -3584 -3555 3133 -2056 -2155
523b155K398n24p99k638N542q51o206P252O7o836O815J051m044J848j84J247j306
$$ -2155 243 -281 -1080 -3718 1824 973 -5233 2019 2086 -4750 2065 3116 -928 920 736 1983 677
540F77q45M124o317m5P314o332m23M303m090J631R85j272L93l615L590J753n319
$$ 677 -168 3956 -2361 -2406 4908 -1424 -1847 2456 -1634 -3 982 -290 103 -3512 78 1831 -3488
557c488L176n49k852N310j817j191K413k964L501J613m233K937j122j592L182
$$ -3488 -312 -861 -3713 1597 -220 -1411 1002 -1962 1539 3152 -1081 1856 734 -858 2324
572B324j815J201j006k560N085l304k216O642n370k778N071j846k50j59q1R05
$$ 2324 509 1710 704 -1856 3229 -75 -2291 4351 -1019 -3797 1274 -572 -822 -981 -1062 -157
588a57l477M705K556q320L762L481n689M280J873m390J31J176L647k733k680N704
$$ -157 -3634 1071 3627 -4693 -931 2550 -3139 1141 3014 -1376 -1245 -69 3578 845 -1835 3869
604C869m349k509Q211m235l990M351j107m40k52P70Q04m933L317L508o925L034
$$ 3869 -480 -2989 5222 987 -3003 1348 241 -199 -451 319 1123 -3810 -493 3015 -3910 -876
620h76K236n235L124J837j434L43j823L346J84l298M643k326k828M741j684k05
$$ -876 1360 -3875 -751 1086 -348 -5 -1828 1518 1702 -1596 3047 721 -2107 2634 950 745
636G45P80k781K762k73k056L765l992j272L838k199j1l1j594K350k716J898L297
$$ 745 1525 -1256 1506 1233 -823 2942 -1050 -2322 1516 -683 -694 -725 -2319 31 -2685 -787 2510
653B510n869K180L846m614K146J536j862j23o96L308o03l874M905j617l726O418
$$ 2510 -3359 -1179 2667 -1947 199 1735 -127 -250 -946 2362 1759 -2115 2790 1173 -2553 3865
669C865j587l967K231l68j15q33j74K843n093J050N679o009L79L639l538R00J251
$$ 3865 2278 -1689 542 174 59 -774 -948 1895 -3198 -2148 3531 -2478 -2099 1540 -1998 -1098 153
686A53l62J88k307L184J255m721M828J12m294M203n72j743J082j138J674j729
$$ 153 -209 -21 -2328 856 2111 -2610 2218 2330 -1964 2239 1667 -76 1006 -132 1542 -187
702a87j293M268l360j692M206k733j13J102j866J675j446RL127m322J143L621
$$ -187 -1480 2788 -572 -2264 1942 -791 -904 198 -1668 7 -1439 -1430 1697 -2625 -1482 2139
718B139l768J488J605j891J206j131K079q0l847M180o4m164M564n15l294K333
$$ 2139 -1629 -141 1464 -427 779 -352 1727 1647 -2200 1980 1916 -2248 2316 1801 -1493 840
734H40k05m3j027p24K969l912n32M962m059o86L658k583P03O62m80J287l080K551
$$ 840 635 592 -435 -1159 1810 -2102 -2634 2328 -1731 -2417 1241 -1342 -639 23 -457 830 -2250 301
752C01J869m414K934J713m150K883P68j641Q07j176J839j144k381M085k180k746
$$ 301 2170 -2244 690 2403 -1747 1136 1904 263 1070 -106 1733 589 -1792 2293 113 -2633
768b633M158j877q89J451j536J268j073m60L167l342J47L689m078J336J900j679
$$ -2633 1525 -352 -1241 210 -1326 -58 -1131 -1591 1576 -1766 -1619 2070 -2008 -672 1228 -451
784d51J209j137J302J244l592K865Q50m331L434K60k892K156k16M1p15j628L501
$$ -451 758 -379 923 2167 -1425 1440 2290 -2041 1393 1653 -1239 917 701 742 27 -1601 1900
801A900k704j827M303k873j572L767k134J85R00n00J410k402J087L054m410J730
$$ 1900 -804 -2631 1672 -1201 -2773 994 -1140 -955 -55 -555 855 -1547 -460 2594 -1816 -86
817h6K473l847K217O30j090Q54j256J625l56l165L981j239l317L554j016j436
$$ -86 2387 -1460 757 1387 297 1151 -105 1520 1164 -2001 1980 741 -2576 978 -38 -1474
833a474J729j283J124q59r12L081k915k90L668l567Q78J901j977J210n15L92J840
$$ -1474 255 -1028 96 -763 -1675 1406 -1509 -1799 1869 -1698 -820 1081 -896 314 -201 191 2031
850B031k749J692J520l833K519M45k411J860r97R7J47j854K767r54k658L547j710
$$ 2031 -718 974 2494 -1339 1180 1625 -786 1074 77 174 321 -1533 1234 280 -2378 1169 -541
867e41j390K560j723J72Q15r99J913j782K34K965l613J167K536l071J313P47j112
$$ -541 -1931 629 -1094 -922 -107 -1106 807 -975 -741 2224 -1389 -222 2314 -757 556 1303 191
884A91J035j568J165J150l526K789J68l453K922l53k019J510j375J116k55j101
$$ 191 1226 -342 823 1973 -1553 1236 1404 -2049 873 520 -1499 11 -1364 -248 -503 -1604
900a604K811k254p64L611l074K33K371k381J093n3l00J753k262J221J704l231
$$ -1604 1207 -1047 -1811 1800 -1274 -1041 1330 -1051 42 -11 -311 1442 -820 401 2105 -1126
916a126K338O59k789J742p19n10J328k273K012o50j851L008j517j061K196k199
$$ -1126 1212 1871 -918 824 105 -405 923 -1350 662 12 -1839 1169 -348 -1409 787 -1412
932a412K85J348j871J915q61p78K807k201J95K471j909O93L14j248J531j492M77
$$ -1412 -1127 221 -1650 265 -596 -1374 1433 -768 -573 1898 -11 682 996 -252 1279 -213 264
949B64J247l325J992J625l073J849p8j410J309j084J034p56j650K921j242j678
$$ 264 1511 -1814 178 1803 -1270 579 501 -909 400 -684 350 -406 -2056 865 -377 -2055
965b055L610k337n76K044j134Q76j96l44J427k062R55J943l274J785J274l245
$$ -2055 1555 -782 -1358 686 -448 428 232 -112 1315 -747 208 2151 -1123 662 1936 -1309
981a309K293P3j456R56j330J089l4j991K505j230j285L077k216l54J762j816J302
$$ -1309 984 1057 -399 557 -773 316 282 -1709 796 -434 -1719 1358 -858 -1212 550 -1266 36
998C6M3j418J982j423O10J889k657J593O43j998K415j221q76J733k192O56J605
$$ 36 79 -1339 643 -780 -170 1719 -938 655 1298 -700 1715 494 -382 1351 -841 -185 1420
1015A420k127J184l10r83J520j537P99M27k540K096Rj537K582j548j247K318m15
$$ 1420 -707 477 167 -816 704 -833 -34 393 -2147 -51 -42 -1579 1003 -545 -1792 526 111
1032A11N28n91p58K165j786M74K254l679Q52K349k126R04L62j158O04r87J033
$$ 111 639 48 -710 1455 -331 143 2397 -1282 -430 1919 -207 697 1059 -99 505 -482 551
1049E51Q8k383K510j178j923L367j552j121K291j300L71J75n00J501j833L37K260
$$ 551 639 -1744 766 -412 -2335 1032 -520 -1641 650 -650 -279 -104 -604 897 -936 -599 1661
1066A661k804J215J074k468K595K82j837J147r81O15O75j623J080r58j098K699
$$ 1661 -1143 72 1146 -1322 1273 1555 -282 865 -116 499 1174 -449 631 -327 -1425 1274
1082A274j794m73J490j936J058J016k050J474p75o96J928r18R60m84j405K919
$$ 1274 -520 -993 497 -1439 -381 635 -1415 59 -716 -1412 516 -402 558 74 -1331 1588
1098A588j104n93K034k371n3K096j702Q60l7r62O54p73R62O10l014J836M55k390
$$ 1588 484 -109 1925 -446 -499 1597 -105 755 718 -244 410 -363 599 1209 -1805 31 486 -1904
1116a904K435j79k181J391j51N72j82o20J778j643k73L010k689j05K359k328R64
$$ -1904 531 352 -1829 -438 -589 -17 -199 -819 959 -684 -957 2053 -636 -741 1618 -710 254
1133B54J121j082K80j067J216P73k661J943k9k651K668n09j454J587j307L92N12
$$ 254 1375 293 573 -494 722 1495 -1166 777 748 -1903 765 256 -1198 389 -918 -526 -14
1150a4q32J380j371l78K075j594L63J180k097J583M90j291J852j520J33J589j951
$$ -14 -846 534 -837 -1215 860 -734 -371 809 -1288 295 785 -506 1346 -174 -41 1548 -403
1167d03J086m3j162J287j073M04J253k615J410P51k078K024o11j691J685j005
$$ -403 683 640 -522 765 -308 96 1349 -1266 144 895 -1183 841 230 -1461 224 -781
1183g81P19o7j283K003p34j186K880j502p62J950j263M39M23q64J059j711J043
$$ -781 -62 -129 -1412 591 -143 -1329 1551 49 -713 1237 -26 413 836 -28 1031 -680 363
1200C63J622l130J738O32k596J582N44j697Q58o99P46l6j228K264j459r54K760
$$ 363 1985 -1145 593 1225 -1371 211 755 -942 -84 -783 -37 -73 -1301 963 -496 -1450 1310
1217A310j631m45J710j659R21qn45J273j262L34J579k118J066N85j812J591q02
$$ 1310 -321 -766 944 -715 206 198 -347 926 -336 -2 1577 -541 525 1110 -702 889 87
1234H7n65J106j756R27Q10j971J613k31j260J667r77P2P61j546J518l06j091K214
$$ 87 -478 628 -1128 -201 609 -1362 251 20 -1240 427 -550 -478 283 -1263 255 -51 -1142 1072
1252A072j252k82J896j300J80M57o00Q93j396N30J202k034Q15J124k205J175M6
$$ 1072 -180 -462 1434 134 314 771 171 1064 -332 198 1400 -634 181 1305 -900 275 321
1269C21q75O07j027J051l01j472K078l72j645K310q25p68J604p10PL63p71J543
$$ 321 -554 53 -974 77 -224 -1696 382 10 -1635 675 -150 -918 686 -24 -17 346 -425 1118
1287A118j645K44J921j933L96J163j568R91n19m33J060j407N91N21j856J498K53
$$ 1118 -527 -283 1638 -295 101 1264 -304 687 168 -265 795 -612 -21 500 -1356 142 395
1304C95j812J811m44m57M35r72J203l8j508K286j231l32J792j142K8Q92j028J037
$$ 395 -1417 394 -50 -507 -72 -1044 159 121 -1387 899 -332 -664 1128 -14 14 906 -122 915
1322I15p07j18J303k194M70J365j885Q98N68j075L76m70N06M30j611J319K25j898
$$ 915 208 90 1393 -801 -331 1034 -851 47 615 -460 -84 -554 -48 382 -1229 90 315 -1583
1340a583J946j29j475J532o92N66Q8q49J506r53o38K368j990K0J414j149N85p8
$$ -1583 363 234 -1241 291 -401 165 253 -596 910 -43 -681 1687 -303 -283 1131 -18 567 489
1358D89n37Q35j506N73R67k103J201L61j280R68K2k65K81p89J089l58j171J995
$$ 489 -48 787 -719 -146 821 -1282 -81 280 -1000 -32 -10 -275 6 -783 306 -52 -1223 772
1376G72q24p26J678j050J2O56o82J392r08l62J471j519M8J387j798M07M89p90
$$ 772 -52 -778 900 -150 -138 518 -164 1228 320 -42 1429 -90 -42 1345 -453 -46 443 -347
1394c47N93o59M6Q07j749J304L88j597J388Q3j078R95n86M11L90j031J758q50
$$ -347 246 -413 -367 440 -1309 -5 383 -1214 174 257 -821 174 -412 -1 389 -642 1116 266
1412B66r39J790j029l31J209r57K34k8j56P42j205K80J273j904O55R26j970P91
$$ 266 -673 1117 88 -243 966 9 243 215 59 801 -404 -124 1149 -755 -100 826 -1144 -353
1430c53J99o19P93j086J103M13j709J688k10j396J977p69o28J161l02K50l98o13
$$ -353 -154 -773 20 -1066 37 450 -1259 429 219 -1177 800 31 -597 564 262 512 114 -499
1448d99J661j307M7J117j414M66N42r08N88m46m32J067j461Q04P22j491P43o4
$$ -499 1162 -145 -98 1019 -395 71 613 -295 293 -153 -585 482 -979 -175 547 -944 -201 -265
1466b65l89P98o71L43L93j077J679j56j444J649o75j49P14o97N44l82p66J492
$$ -265 -654 144 -527 -184 209 -868 811 655 -789 860 185 36 750 53 597 215 -551 941
1484I41j147p7J248j697K77J231j384M51L37p45M22p51P43M56j628J407K72j286
$$ 941 -206 -283 965 -732 -455 776 -608 -157 180 -565 -143 -894 -151 305 -1323 84 356 -930
1502i30J371q3r89R64k96L88l06m04J434j108j07J494j693L19P99j283Q37j22
$$ -930 441 358 -631 333 37 425 119 -285 1149 41 -66 1428 -265 54 853 -430 407 285
1520B85j082Q90p34J93R53j494R35N6r08J314p79k26P12r79J151M79j468J301
$$ 285 -797 93 -641 -448 505 -989 -54 2 -906 408 -371 -597 115 -864 287 766 -702 599
1538E99l39p33J198m45N74m92j099J544o06o20J443j594j54J201n72J80n19J24
$$ 599 260 -473 725 280 854 362 -737 807 201 -419 1024 -570 -724 477 -95 85 -434 -310
1556c10M20j094P53Q30j937J108Q06j518J556k25r04Q05k07N41n11l45J110o79
$$ -310 110 -984 -231 599 -1338 -230 576 -942 614 389 -515 290 83 624 113 -232 878 199
1574A99n96J691j325m12J289j159M12N0l79L32o43N56L61j359J162j87q08J181
$$ 199 -397 1294 -31 -443 846 -313 99 149 -230 102 -541 15 376 -983 179 -8 -816 365
1592C65k26j045J284p68N73Q0m87O65o65Q3J240j096L93J60j162J434N4j266R54
$$ 365 139 -906 378 -390 183 263 -224 441 -224 -141 1099 3 396 556 -606 828 882 -384 570
1611E70j048M6O84p05O56n62n16J475j078j45J333j841N86J143j230P93r1n60
$$ 570 -478 -432 252 -453 203 -359 -875 600 -478 -623 710 -1131 -545 598 -632 161 70 -490
1629d90Q57n44J147o01j184J626j45j101J669j202o93J015k42m5m6l0K25j106
$$ -490 367 -177 970 369 -815 811 666 -435 1234 32 -661 354 112 67 21 -9 216 -890
1647h90O84J131j744M90L76j110Q89L38o00M23l10M91L9m89Q38n86n14J412j044
$$ -890 -206 925 -819 -329 47 -1063 -174 164 -436 -13 -323 168 207 -282 556 -30 -544 868 -176
1666a76J33R00j116Q34L44r12M09q00K13N70q84M28J67j085J292k89r50J223q82
$$ -176 -43 857 -259 575 919 7 416 -384 -171 399 -485 -57 110 -975 317 28 -922 301 -581
1685e81K49N58o05N45k84n33J215q00N88L27j358J163L54r78Q00n00m80N27l50
$$ -581 -332 226 -379 166 -118 -651 564 -236 352 679 -679 484 838 -140 660 160 -320 207 -143
1704a43M87k15o05O90n93l09J258r04l89J174j324N77L95l21J10l34P49K02j152
$$ -143 344 129 -476 214 -379 -688 570 -334 -723 451 -873 -296 99 -222 -112 -446 303 505 -647
1723f47J168k17p92J245l65o04P60o19K88K56k31M17p31p7R58j203N4Q10j211
$$ -647 521 304 -488 757 392 -212 548 -71 217 473 242 659 -72 -149 809 -394 -340 470 -741
1742g41O64J81r00P52n62L00N83r07P44R1r34J375q96l5J232j154L07N20r65R89
$$ -741 -77 104 -796 -44 -606 -306 277 -630 114 205 -729 646 -250 -285 947 -207 100 620 -345 644
1762F44n96r8P35p73K36J41r41Q25k52l99Q30p71j26P63n80K51J98q61P19k00
$$ 644 48 -50 685 -88 148 289 -652 173 -79 -478 352 -419 -545 218 -362 -111 87 -774 -55 -255
1782b55K2O85j200R81K53j035J050k06n34Q91n48Q7L05p47J018n48o59J099r99
$$ -255 -233 452 -748 233 486 -549 501 295 -239 652 104 191 496 -251 767 219 -440 659 -340
1801c40L5Q43q51J15J4n49Q38n41j21J001j180P89L48q89Q26k23l88P48o00L11
$$ -340 -305 538 -313 -198 -184 -733 105 -436 -557 444 -736 53 401 -488 338 115 -273 475 -125 186
1821A86L84o92N60k71m19Q33m49l12O87o42J43j00m88R26p91J5P58j034O41J49
$$ 186 570 -122 438 167 -252 581 132 -180 507 -135 8 -92 -580 346 -445 -430 328 -706 -65 84
1841H4p62Q99m01k20P51r15P89K57j146J153j60n08J104r67L25O22j170O97k12
$$ 84 -678 221 -180 -400 351 -564 225 482 -664 489 329 -179 925 -42 283 905 -265 432 220
1860B20o62R50p96j34R72r77K33L13o70M91j26k89P21p24L17O20j294P37L91n59
$$ 220 -442 508 -288 -422 550 -427 -194 119 -551 -60 -186 -475 246 -478 -161 459 -835 -98 293 -266
1880b66P28o94K28K50q18J228m04n51J007m75l36P21q58N71j96o40Q71o60r1Q50
$$ -266 462 -232 -4 246 -572 656 252 -299 708 233 -103 618 -240 331 135 -505 366 -294 -385 465
1900D65j260M72M31n99O22j96k69N58o94P99L34j232R72k00p76J130n67L46K72
$$ 465 -795 -323 108 -491 131 -65 -334 224 -470 329 663 -569 403 203 -573 557 -10 336 608
1919F08r48P26j76o15R93o16n18Q91m91P2K02q86R43o06n5J026j294N39O67j011
$$ 608 -340 386 210 -405 588 -28 -546 345 -146 -74 128 -758 185 -421 -476 550 -744 -205 462 -549
1939e49O79j99j52P89p08M48K38r38Q04J52j127J133r2m80L50n48N36k95m10Q09
$$ -549 130 -69 -221 568 -140 308 546 -392 412 564 -563 570 478 -2 348 -200 336 41 -369 440
1959D40k63p38Q18m81%L56p01M78J16m13N24m00P2Q40j272J137k04n54Q93m91
$$ 440 177 -561 257 -224 -224 132 -569 -91 25 -388 136 -264 -192 648 -624 513 309 -245 648 157
1979A57j89N49q03O18K60r75P28m09k19O19m45JK21n92P63k84n70R76p13q9Q73
$$ 157 -32 517 -286 332 592 -383 345 -64 -283 336 -109 -108 113 -479 284 0 -570 406 -307 -396 477
2000D77q60K11J64m71P18n88N74M40j092O55N15j081O92K19p86P00m86K85j28
$$ 477 -383 -172 -8 -479 239 -349 225 665 -427 228 743 -338 354 573 -213 487 1 286 158
2019A58o24R91o73m01J026q36l99J218p56R4J43n59P50p18P18J40r87J121J66
$$ 158 -466 525 -148 -549 477 -359 -758 460 -296 -202 -59 -618 132 -586 132 272 -715 406 572
2038E72q88P05Kn41N77o31N75J98q88Q28n11l86J038j266K30N96r69P43K69q50
$$ 572 -316 389 391 -150 427 -204 371 569 -319 509 -2 -388 650 -616 -386 210 -759 -16 253 -597
2058e97P35m75j84J059j038J17J08q7O70k73k75R43j128J21R81p79M93p6k76L60
$$ -597 138 -337 -521 538 -500 -383 -275 -362 308 35 -240 703 -425 -304 677 -102 391 315 39 399
2078C99m08K77p6r35R72p1p94J361j059k16O79j27j88J75m49P13o55L01R04j452
$$ 399 -9 268 192 -743 229 158 -636 725 -334 -550 129 2 -186 -11 -460 253 -402 -101 803 -649
2098f49L46R16p47M71L7m25M28p83R99n8r53R32l29p10J330p35l27M34p88N59
$$ -649 -303 613 -134 337 374 -51 377 -406 593 535 -418 514 185 -525 805 70 -257 177 -611 -52
2118e2R1o67N65m00K10N73p83J86K63m88R94m14l19O80p36L48O73r48O06k59j51
$$ -52 39 -628 -63 -463 -253 320 -463 -277 -14 -502 492 78 -241 439 -297 51 724 -224 382 123 -28
2139b8O59q05L80M06r66J42Q27r90M46k63j86N75l00N12n24m57O80n10k13J210
$$ -28 631 -174 206 612 -354 -212 615 -375 71 -192 -378 197 -103 409 -115 -572 108 -402 -615 595
2159E95r33m25R18qJ29j3l59M18m50L89N43j392Q88K68r47R87m93l19M91k99j6
$$ 595 -338 -763 155 147 276 263 -96 322 -128 261 804 -588 300 568 -379 608 115 -204 287 -12 -28
2180b8n7l75P31n40j77J175r94k50P11l12J98R8j55K44l71J80M18p84O46Mo76
$$ -28 -85 -460 271 -269 -446 729 -265 -515 196 -116 82 180 25 269 -102 78 496 -288 358 362 -314
2201c14P67o0l25N14q26J80M05p81O49l86j43L68l09J93K11p52Q34l59k17O59
$$ -314 453 393 68 582 -244 -64 341 -440 209 -177 -320 48 -261 -68 143 -609 225 -134 -351 308
2221C08o11k88O07MK16k29l76J027q82L08N81q99O30J39j119Q33r0k45K89n89
$$ 308 -303 -591 16 20 236 7 -369 658 -224 84 665 -234 396 535 -584 249 159 -86 203 -386
2241c86M73K23j185J074l37n04J077r06Q5N51k06q0J11k4O38o63R2J69k71K02
$$ -386 87 310 -875 199 -138 -642 435 -471 -386 165 -41 -121 -10 -34 604 -59 33 202 -69 133
2261A33L07q02O64j03l99N56n62M02L16q48P06n48j45N91n02k54P39q52N10M2
$$ 133 440 -362 302 199 -200 356 -206 196 512 -336 370 -178 -323 268 -234 -488 251 -601 -91 -49
2281d9j03L15l02J5M82p66P40j03o48Q72k98k48M95m61M2L68n88O44k32n26M88
$$ -49 -152 163 -139 -124 358 -408 332 229 -419 453 155 -93 402 -59 -17 351 -237 407 175 -351 137
2302A37m75L09J74o43N48j0n68Q39l61j56M01n60L12K70m76O77m42L9N00o21K81
$$ 137 -338 -29 145 -498 50 40 -528 311 -50 -206 195 -365 -53 217 -259 418 -24 15 515 -106 175
2323A75J92o28L83j36j07O41p37Q2J92k81M82po53N30m29P0M47n92K95J19n58
$$ 175 367 -261 122 -14 -121 520 -217 -135 57 -224 258 251 -402 128 -301 -231 216 -376 -81 38 -520
2344e20P74l75j65Q10r84O08L72r15N61j89L8N96n76N7K15m10M77k34l27L60k14
$$ -520 254 -121 -286 524 -460 148 520 -395 166 -23 15 611 35 92 307 -103 374 140 -187 173 -41
2365d1m1L01p14J68N13q15O92k24m76O59m16L33K45l38K67J17m46O78o73N24J7
$$ -41 -82 219 -495 -327 186 -629 63 -161 -637 22 -394 -61 184 -154 113 230 -216 462 -211 313 330
2386C30n29O63l40k51K52k39N0M23n56J94N2l99P85n33l23R23q15l9L45n11N10
$$ 330 -199 464 124 -127 125 -114 -64 359 -197 -3 49 -350 435 -98 -421 502 -313 -352 -7 -518 -8
2407hJ81k54L67o17L28O20j054O91L2k55M74n71J8N42q02O89q2o22N44k87j50
$$ -8 173 -81 286 -331 -3 617 -437 254 286 31 505 -66 -48 494 -308 381 299 -323 221 -66 -216
2428b16L93o35L16L52o43M90k38l67Q50l97n5L09l38J66K29m05K15j19N3L83n24
$$ -216 177 -458 -142 210 -433 57 -181 -548 302 -95 -150 159 -179 -13 216 -189 26 -93 -40 343 -181
2449a81N06M3m70L90l28j70M99n85M02Q2o85P88m13l13O66n21K79J10k33J58k32
$$ -181 325 368 -102 288 -40 -210 289 -296 106 188 -497 291 -122 -435 231 -290 -11 99 -134 24 -208
2470b08j14P72o89j09N48m68K84K33l87P17l75m46P01o49K83N25o68K39q5l69
$$ -208 -322 450 -239 -348 200 -268 16 249 -138 579 204 -242 459 -190 93 618 -50 189 104 -265
2490b65M85m37K64J06n14L96q0j79N11m48M6K49l10N80l05l07M21k26j49P08j031
$$ -265 220 -217 47 153 -361 35 -45 -224 287 -161 -115 134 -176 404 99 -208 213 -13 -162 546 -485
2511d85P45J6l82N47l19k60O41p40J97K42k73Pm0l48O57j44l73L17m40K15K42
$$ -485 260 276 -106 441 122 -138 503 -237 -40 202 -71 -64 -104 -452 205 61 -312 5 -435 -220 22
2532B2k47M94n29j5O07n57J96M45n70N19ll48N37p09J09Q10p92K1K89m25K05J3
$$ 22 -225 269 -260 -275 332 -225 -29 416 -154 365 362 14 551 -158 -49 761 -31 -10 279 -146 59 72
2554G2j01K54p95Q57j49o45R92o82J6M02j78J5K22l92M39n07J92N16m87j74O21
$$ 72 -29 225 -570 287 138 -507 485 -197 -181 221 43 58 280 -112 327 -180 12 528 41 -133 488
2575D88p41M27R4m23L79l04J79L29p13L55r1j88N53n64o5N77p06L93K2k57L12
$$ 488 -253 174 268 -155 224 -80 99 428 -285 70 -21 -209 344 -220 -285 292 -414 -21 1 -256 56
2596E6n87K33O08m53K74O6m67O70j07j72O27o60P3R8k06j63J23j57J54l55M28
$$ 56 -531 -298 310 -143 131 197 -270 400 293 121 748 88 161 259 53 -110 13 -144 10 -345 83
2617H3L44r88M61O33q82L31J08m80K34J89K2j10l00Q09n41j62P11n67k42Q95n63
$$ 83 427 -561 -100 533 -349 -18 90 -390 -156 33 55 -55 -355 454 -87 -249 462 -105 -347 548 -15
2638a5K72J12o00L57k06K61J69p45M93Ll10N31j11p09N09l7l2j4l21M06l29p3
$$ -15 257 369 -231 126 -80 181 350 -395 98 101 -209 322 211 -498 11 -26 -58 -72 -393 13 -316 -389
2660c89O78k04J02J37m71L52K00o08N64n48J08M01j03L9j57m37M12k85N7N84r26
$$ -389 289 85 187 324 -147 205 405 -203 361 -187 -79 322 219 258 101 -336 76 -209 -152 432 -494
2681d94L51K02m27J08L25l65K39j04K35R2m85N94o3n46N76j60l20M33k85K26J13
$$ -494 -143 59 -368 -260 65 -300 -61 -165 70 162 -323 271 208 -338 238 78 -242 191 -94 132 245
2702B45k39J30l09L6N87n92K34R6k85J07K8l04N9j84Q3L30m33O51l97j54O37l40
$$ 245 6 136 -173 -137 450 -142 92 188 -97 10 38 -266 -207 -391 -308 22 -411 240 -157 -311 326 -14
2724a4l24O58k99q0K61j76m6j16J02L58n53L17K26o98L61m7P4J49l65j37N82o56
$$ -14 -338 320 21 -59 202 26 -20 -136 -34 324 -229 88 314 -384 -23 -70 4 153 -212 -349 233 -423
2746d23L37j59J2L27k69r5L00k52M64j97j48N42j95l80L23j32J58J57l17L90n93
$$ -423 -86 -245 -233 94 -175 -270 30 -222 242 45 -103 439 244 -136 187 55 213 370 53 443 -150
2767a50L12mj81k61L33l07K54q7j15J57m66M08K05m56L76j54JK84k62j09L42j55
$$ -150 162 158 -23 -284 49 -258 -4 -91 -206 -49 -515 -107 98 -358 18 -136 -135 149 -113 -222 120 -35
2789c5J43K4j90M86k44l30M78j85j72K43l47K09M0k08J39m48mO12o14L15L9l94
$$ -35 108 132 -58 428 184 -146 332 147 -25 218 -129 80 120 -88 51 -397 -401 211 -403 -88 -49 -443
2811d43M95l8k09L27m73J83L30k56K65m3l70L10q7J11L36m47L69j06l03L53j99
$$ -443 52 14 -195 132 -341 -158 172 -84 181 138 -232 78 -9 102 438 -9 360 254 -49 304 105
2832A05l10L68n58L52R1l57J63K2j7K6r3N1J87j89K58l77R5L74k91K10k9j04M73
$$ 105 -205 163 -395 -43 48 -309 -146 -124 -141 -115 -208 -157 30 -159 99 -278 -183 191 -100 110 81 -23 450
2855D50o5m33K61p7k60L41l41J42J06l49J55j40J12L20m99K43L61n13K34j01j50
$$ 450 385 -48 213 136 -124 217 -124 18 124 -225 -70 -210 -98 222 -277 -34 327 -186 48 -53 -203
2876b03L84m94K91M33o76M23m6j80L21k60J43K49n97O65m09n7M47l89k01N51n31
$$ -203 181 -313 -22 411 -265 158 112 -68 253 -7 136 385 -212 453 44 -13 434 45 -156 395 -136
2897a36O5J19m91M87k44M2J32k31rL65l06K12J79l53M34m73J6J65L2K72O3l40
$$ -136 -71 48 -443 44 -200 -158 -26 -257 -266 99 -207 5 184 -169 265 -208 -192 -27 5 277 340 0
2919@L43j13m20L96l21L86j57l36N13k81k23M12l97k6L37l81K93K6l47N03j33
$$ 0 343 230 -190 206 -115 271 114 -222 291 10 -213 199 -198 -224 113 -268 25 51 -296 207 74
2940G4k67L24k97P3J77m5J58k03J17K30n02K24J15k06K76k80j21L78l32M5K9k48
$$ 74 -193 131 -166 -93 84 39 197 -6 111 341 -161 63 178 -28 248 -32 -153 225 -107 -62 -33 -281
2962b81M46K1m89N01n90K22J34Nj98J28r7K99J11l58M84l34K24p4m31O10k88j8
$$ -281 165 186 -303 198 -392 -170 -36 -31 -229 -101 -198 101 212 -146 338 4 228 154 -277 333 45 27
2984B7K34l30K39p8k85M84j08l10L40l55J53O0l53J31O5J8k4l4N8K03l38L99J46
$$ 27 261 -69 170 92 -193 291 183 -127 213 -142 11 71 -282 -151 -86 -68 -92 -126 -68 135 -203 196 342
3007C42m87M01m76J62K51j80R2j24j2J19L3m26N43k96q5K80l18K53K1m55M59j10
$$ 342 -145 256 -220 -58 193 13 105 -19 -31 88 121 -305 238 -58 -143 137 -181 72 93 -362 97 -13
3029a3j94J99j93J27M5r5M29l85J01J75k75m8M64m28J55Q4j16L67o37N7M60l24
$$ -13 -207 -8 -201 -74 -29 -124 305 -80 21 196 -79 -127 337 -91 64 148 32 399 -238 -181 279 -45
3051d5M25k58k35L78l62K50j94n4m6l2j62M66j55j95N17o06K52M97l25K1j06k00
$$ -45 380 122 -113 265 -97 153 -41 -95 -141 -173 -335 131 -24 -219 298 -308 -56 441 116 137 31 -169
3073a69L70k37j8M90n62K10pq9L83n97j87O92m83J50K19n60N16j30j20N01j032
$$ -169 201 -36 -54 436 -126 84 77 -12 371 -226 -413 279 -204 -54 165 -395 121 -9 -129 372 -660
3094f60P13p5l71L01J62k90J52J05L1K20m31J95j08M1M37l81l09M28k61L73k26
$$ -660 53 -22 -393 -92 70 -220 -68 37 68 288 -143 52 -56 -15 422 41 -268 160 -101 272 46
3115D6l55O33n84j25M43k70J11K9l01L49M8k12L22k44O8O9q3M7l8j27M93k49K03
$$ 46 -309 324 -260 -385 58 -212 -101 -72 -373 -24 24 -188 134 -110 -42 27 -56 -9 -47 -174 319 70 273
3138B73j11l46L57O1n14N67j93k55L36l03J19l3q3r0K71k52N77o29J03K97m96
$$ 273 162 -184 173 234 -280 287 94 -161 175 -128 -9 -42 -125 -215 56 -196 381 -248 -145 152 -344
3159c44L29L00n66L57r0O9K08m52L32Q5l31N14k21n43P50l28q6K8j98K88j1J1
$$ -344 -15 285 -281 76 -14 55 263 -189 143 228 -103 411 190 -353 397 69 -17 11 -187 101 90 101
3181A01K69n74L3L90o77M14k7k36N12m08q0N83k16q3P6k23L39o7k84N64o19P1
$$ 101 370 -204 -171 219 -458 -44 -71 -307 205 -203 -283 300 84 1 77 -146 193 126 -158 406 -213 -142
3203a42L31m20L44j44J36ok75J3J48l50N25m2l97M91l03l37K52L8L31j42r9J42
$$ -142 189 -231 113 -31 105 99 -176 -163 -15 -365 160 118 -279 212 -91 -428 -176 -138 193 51 -48 94
3225I4l21M5M48n28L62J6l78O34l54m04O07k71r7K30k05J21K6l22K78J10m63K32
$$ 94 -227 -182 266 -262 100 116 -262 372 18 -386 221 -50 -147 83 -122 -1 25 -297 -19 91 -372 -140
3247a40k01L91N4m94K69k10N31p9k53K48K86p00M69r5l5L19m54N0R4l73L85k5
$$ -140 -341 50 104 -390 -121 -331 200 121 -132 116 402 -298 171 76 41 360 -94 -44 50 -323 62 37
3269C7k17J99K0J66j3n53L56j63J24N8n2kK7j11RJ11j81K88m6o0L13m15J79J70
$$ 37 -180 19 39 205 192 -361 -5 -168 -44 14 -38 -40 -13 -124 -115 -4 -185 103 57 -3 310 -105 74 244
3293B44m70L14K64o27L76l81M11J4l87L78k78k04M38j76j2M19l24r7k3pJ09J16
$$ 244 -226 88 352 -275 101 -280 131 145 -242 136 -142 -346 92 -84 -96 323 -1 -98 -121 -128 -19 97
3315I7q2K61l36o4M35n21K87j34M7K59k00j52N70m70K04l85q3O30l09O5j50j63
$$ 97 15 276 -60 -124 311 -210 77 -57 -10 249 49 -103 467 -3 201 -184 -267 363 54 119 -31 -194
3337a94J90o2j45M22l75j63M22l27K42k5l76N02k98K29K42k79K8K47j68j66J50
$$ -194 -4 -66 -211 211 -164 -327 95 -232 10 -15 -391 111 -187 42 284 5 33 280 112 -54 96
3358I6j78L74m26M0K39k22J58J69m24J82P9k96J42L1l27L96m31L93j60m4K88j27
$$ 96 -82 292 -134 -94 145 -77 81 250 -174 8 87 -209 -67 -36 -363 33 -398 -5 -165 -209 79 -48
3380d8j14M20l92J72K37l78M24r1l03O29o24K49K9j90J11O3l97J43N3j64J68l85
$$ -48 -162 258 -134 38 275 -103 321 230 -73 556 -68 181 210 20 131 194 -203 -60 -7 -171 -3 -388
3402c88L22K76m63L47j55L9O0l99K85K08l78M07m08R0M19n13K98K12j78J52k74
$$ -388 -66 210 -253 94 -61 -22 38 -361 -76 132 -246 161 -247 -157 262 -251 47 259 81 233 -41
3423d1N0J66m26K39k13M4K55j17n9K14j43J34N2l40K6K95l82K69j31J78O1l41
$$ -41 9 175 -251 -12 -225 -181 74 -43 -102 112 -31 103 155 -185 -159 136 -246 23 -108 70 131 -210
3445b10L84k18k9K81m8k19J37k09K62K37m45J79n7j88L80m01P0K91k96M9l9j46
$$ -210 174 -44 -73 208 160 -59 78 -131 131 368 -77 102 45 -143 237 -164 -94 197 -99 -50 -89 -235
3467b35J28J12k04L04j12o5K61l81M43j32j58M52m10QM2j67L09o4k20L53m29R0
$$ -235 -107 5 -199 105 -7 -72 189 -192 251 119 -39 413 3 11 53 -114 195 131 -89 264 -165 -75
3489g5L47m21J86L5k44J71j42j00J01P8J06O8k70K79J35k96J83l15K78M2k40M1
$$ -75 272 -149 37 72 -172 -1 -143 -243 -142 -64 42 110 -160 119 254 -42 141 -174 104 146 -94 -53
3511e3K9j78M93k70J40P6k69J01k13J09J39o5k66J67k34K69P6k81M37m30j55N76
$$ -53 -24 -202 291 21 161 237 -32 69 -144 -35 104 39 -227 -60 -294 -25 51 -230 207 -223 -378 198
3533A98j80jJ21pn3n2q9L71l80J59J09k64L85k25j38J05Q8l10L24k79j45K86k56
$$ 198 18 17 138 131 78 26 -63 308 -72 87 196 -68 317 92 -46 59 147 -163 161 -118 -263 23 -233
3556b33M43m07J39L39l87OJ83k57K50J10m24K71J05j83J41j23K00R7k82L22L2
$$ -233 210 -197 -58 281 -106 -100 83 -174 76 186 -238 33 138 -45 96 -27 173 270 -12 310 342
3577C42m69L14m99K82J97n24N90j38k40N51o25k0J55qK7j55K6J82m9r4L54l70
$$ 342 -127 187 -312 -30 167 -357 233 95 -145 406 -219 -239 -84 -92 -65 -220 -194 -12 -61 -155 199 -171
3599a71L72K6m38N24k18n6K19k77K09q2j46K13j85J84K99m51q7N3k07J83K7n24
$$ -171 201 227 -211 313 95 39 258 -19 190 108 -38 175 -10 174 473 22 -65 -12 -219 -36 -9 -533
3621e33N91j99q6K86k79r2Q2m4M18j24n0J84m69L60K23l59K48k02O3N03k25p3
$$ -533 58 -141 -227 59 -220 -312 -230 -274 144 20 -30 154 -315 45 268 -91 157 -45 18 521 296 223
3643B23m3l60M24l51N9J45r5j02M71m87J0K09j19J77l15K89m1k87K75J27n65L65
$$ 223 180 -180 244 -107 -48 97 2 -100 371 -116 -106 103 -16 161 -154 135 94 -193 82 209 -356 9
3665IJ27j31J92j50O2l8q7R6q8P9L55n94lL41k75K53n9n96O43p5j9k67J62M5K67
$$ 9 136 5 197 47 109 71 -16 80 -8 71 426 -168 -171 170 -105 148 89 -507 136 61 42 -225 -63 -18 249
3690B49l55K89k69J6K66k81J10J40k02J87j42oO2q3K44Lk59K34m4j08l0J77n66
$$ 249 -106 183 -86 -70 196 -85 25 165 -37 150 8 2 64 -19 225 228 -31 203 159 51 21 198 -368
3713c68N93l81J63j97J67J00k87J40L82n31mM22k92lP6q5L28J22r3j89m35N89
$$ -368 225 -156 7 -190 -23 77 -210 -70 312 -219 -223 199 -93 -96 -20 -105 223 345 252 63 -372 217
3735B17j32K6p7R0j69J96k39P4j5j64J10Ro9J70k13K70j53r9N9J11L01j37j56
$$ 217 85 111 34 124 -45 151 -88 -14 -29 -193 -83 -74 -143 27 -186 84 -69 -168 -109 2 303 166 10
3758A0j36K06j24J17k6j41J88j32L1m9l38M89K8k61J93k67J92J61m63N29j05k93
$$ 10 -126 80 -44 73 47 -94 94 -38 -7 -56 -394 95 123 -138 55 -212 -20 141 -322 207 102 -191
3780a91K72J3j80J14j65M9J12j76O0j55kN05j86j15K91Mk33l8j37J60l67L79Q9
$$ -191 81 94 -86 28 -137 -88 24 -152 -92 -247 -249 256 70 -45 246 250 17 -21 -158 2 -365 14 103
3803A03J51j97o1L6k2j1j39j69J67J03p7j03L05r5l1K51r0j18R0j65K23K20l56
$$ 103 254 57 -4 32 10 -1 -140 -309 -142 -39 -116 -219 86 -9 -40 211 121 3 93 -72 151 371 15
3826A5M6l04N1M61m16R5k45K28J23j1j73J23k44K17P8j73J20p6P9m7j22K58k0
$$ 15 61 -243 -192 269 -147 -52 -297 -69 54 43 -130 -7 -251 -34 44 -129 -9 -85 -6 -53 -175 83 63
3849F3j45q9L03l4J1r5R8J44l72L61j11k9J9j05J17L2j4oj0m45M7O6j21J96j60
$$ 63 -82 -171 132 98 109 14 112 256 -116 245 134 105 124 19 136 168 154 148 138 -307 -260 -194 -315 -119 -279
3874b79J8O58m17M7J14m36L75k13J17K45j05j74K74l71K57l8m4P3j71R3J86k98
$$ -279 -261 397 -20 27 141 -295 80 -133 -16 229 124 -50 224 -147 110 72 28 101 -70 23 209 -89
3896h9R9K1j47J26J09j24K14n29J58K00l73L60l69K85O6k57J81qk27N37l16NJ71
$$ -89 10 31 -116 10 119 -5 209 -320 -162 38 -335 25 -344 -59 7 -250 -69 -77 -304 233 -83 -78 93
3919I3j85oP1l82O56k84l25M18J82j49J80m13p7L63k33j34K66M1j39k74L4L66
$$ 93 -92 -98 -27 -409 247 -37 -362 56 238 89 269 -144 -221 142 -91 -225 41 82 -57 -331 -297 69
3941F9k22J65O1p0L6o9J77L8k30K73k59J0K30j03M8k42n8K82j80k12J39j6m1L51
$$ 69 -153 12 73 3 39 -30 147 185 -45 228 -31 -21 209 106 154 -88 -146 136 -44 -256 -117 -133 -174 177
3965A77j15q1L4Q9n3JR4j06k40J67j4k2K9L3P9J3l12J19kK7L7M5K3P3k03R7J64
$$ 177 62 -19 15 104 51 52 146 40 -200 -33 -47 -69 -40 -7 72 85 -227 -108 -110 -83 -46 -1 22 95 -108 -11 153
3992A53k07P8RM5o6j27m9K29j59J4k5R4K34r6l42L92l14K59J18m35L26j7k24L68
$$ 153 -54 24 33 78 12 -115 -164 65 -94 -80 -105 -11 223 127 -215 177 -137 122 240 -195 131 114 -110 258
4016B58k25J48l6l23M36j23k03J94l39j4N09m38L51k16o4j06O5j2J78j83mJ83
$$ 258 33 181 145 -178 258 135 -68 126 -213 -227 282 -156 195 -21 -85 -191 -126 -138 40 -143 -147 36
4038C6k74M61o2j78M6j17J32l6j41L49j50k05J55M4k08L0N8k05K72k58L40j15
$$ 36 -238 223 161 -17 29 -88 44 8 -133 216 66 -139 16 60 -148 -118 -60 -265 7 -251 89 -26
4060b6l5K0k32J53K58j56j28J79k25N25l57rK61m65K82J12k77K99k68J23O8k21
$$ -26 -61 -41 -273 -120 138 -18 -146 33 -192 333 -24 -33 228 -237 45 157 -120 179 -89 34 102 -119
4082a19lJ79l5j98J57J7J16l13j19J76j40M07j56l31M73Q9m79L34j40J56j50k3
$$ -119 -122 57 22 -176 -19 -2 114 -199 -318 -142 -282 125 -31 -362 111 200 -279 55 -85 71 -79 -102
4104a02M8K8K2K84k28K34j3l49j3R1j18K68o6j38P4M2Lk62J11K34k12j34K37k17
$$ -102 -54 -26 -4 280 52 286 273 -76 -89 2 -116 152 86 -52 22 64 67 -195 -84 150 -62 -196 41 -176
4128a76j3J57m0J96k02p4L6l7O5P2j31L40k83L11q9j65J74j18nl2J63j35R6k07
$$ -176 -189 -32 -72 124 -78 -152 -116 -153 -88 -16 -147 193 -90 221 132 -33 141 23 18 -14 149 14 110 -97
4152i7k02L01j27K03P4m31O5K01O6J30n04J46K02k58L18k66LM00l57N6K06k18
$$ -97 -299 2 -125 78 152 -279 -214 -13 53 183 -321 -175 27 -231 87 -179 -176 224 -133 -77 129 -89
4174h9Q6J15k67L25k83Q6J1m04O35j49j49J58N4m36P28m39J70r2j66K08m8j13
$$ -89 -3 112 -155 170 -113 -27 -16 -420 215 66 -83 75 129 -307 421 -18 152 60 -106 102 54 -59
4196e9L92j99r6j4m6J52J86l55K78l34P1L82n17K37l8k5Q2l8k46K78m01R6N3K15
$$ -59 333 134 38 24 -22 130 316 -39 239 -95 -24 358 -159 78 40 15 97 59 -187 91 -310 -214 -161 54
4220E4l22P6K6M2j69K03K67k34J49L01m04P9j27j38L01K3k65K24l0j22j28K78
$$ 54 -268 -192 -166 -124 -293 -90 177 -57 92 393 -11 68 -59 -197 104 127 -138 86 56 -66 -194 84
4242H4J32k99K72j09k10K05l9j3Pj2N1j14OKL1m8N0M3j16J19J47k70K80j71nM4
$$ 84 216 -83 189 80 -130 75 36 23 30 18 69 -45 -39 -37 -6 -54 -4 39 -77 42 189 -81 199 28 23 67
4268F7J49j18j55J61M6m33L06j25j2J70k9j81J68P3l25Q0P4J20k09m2J99o5K2
$$ 67 216 98 -57 104 150 -283 23 -102 -114 56 27 -154 14 87 -238 -158 -84 36 -173 -215 -16 -81 -59
4291e9K54J84m93K29k77K76n9Q6l1k94K39O5j42J06k39J93J34l03P0j22o8L28
$$ -59 195 379 -114 115 -162 114 55 141 110 -184 55 120 -22 84 -155 38 172 -131 -61 -183 -251 77
4313G7r0n8J18l53K25J58j53J01J06m21J49j16L22k9j9K21q5k49R9k24k3M69m69
$$ 77 -13 -71 47 -306 -81 77 -76 25 131 -290 -141 -257 65 36 17 238 153 -96 3 -221 -244 225 -244
4336b44J11K72k59r0J88j32J17o0K26l6k86K05k0j02J68o2JJ60J07j92j10j02
$$ -244 -133 139 -120 -210 -22 -154 -37 -97 129 93 -193 12 -8 -110 58 -4 -3 157 264 72 -38 -140
4358a40K07o0r8J62j79L60k83j42J65k7J04l9J9q2r6L3Q3J6K7J49j40r5J25j45
$$ -140 67 7 -91 71 -108 252 -31 -173 -8 -35 69 30 49 -33 -129 -96 -13 3 30 179 39 -56 69 -76
4382g6P6K2k64L35p2J11k10r1L84m6j67L78l46OO3j35l6R5K0k1J89l46K43k04
$$ -76 0 22 -242 93 21 132 -78 -169 215 169 2 380 34 40 103 -32 -68 27 47 26 215 -131 112 -92
4406i2O7J50m63J13J69m4L30l19Q4j25n5K61J10j79J12KJ07rk18l7Q3l9k02L86
$$ -92 -25 125 -338 -225 -56 -100 230 -89 -5 -130 -185 76 186 7 119 121 228 219 1 -36 47 8 -194 192
4430A92l15J19j43L7O4j58J97O6n2P1k59J65K4J27n2N5k08O4J64p2L1q2n9O9Q1
$$ 192 -123 -4 -147 -110 -46 -204 -7 59 7 78 -181 -16 8 135 83 138 -70 -6 158 86 117 35 -24 45 126
4455A26Mm9o8O9o0P6j34j77L40p0R7k87J56N1j06j69J17MQ4J66j92mK64m71K26
$$ 126 130 81 13 82 22 98 -36 -213 127 57 154 -133 23 74 -32 -201 -84 -80 4 170 -22 -26 238 -233 -7
4480gR0J4k66N8O0L25k48j82L11l46K48J70l43J48j45J94m1n1k6J19j12r5n5P
$$ -7 83 97 -169 -111 -51 274 26 -156 155 -191 57 227 -116 32 -113 81 40 -11 -37 82 -30 -125 -180 -173
4504a73K02n9j6j73Q5K98k72K16J07j68n4L3q4J88nj80J18j8j67J04j92K31J34
$$ -173 29 -30 -46 -219 -134 164 -108 108 215 47 -7 26 -58 130 125 -55 63 45 -122 -18 -210 21 155
4527A55k81P17n66j87J95k18J26Jo4J96j9p6L27l07J96k07jR4j03R7J50l55J74
$$ 155 -126 591 25 -162 33 -185 -59 -58 -122 74 55 -21 306 -1 195 -12 -13 81 -22 75 225 -130 44
4550D4nPl4J62k58J16n9k0M9j32j39L50k21K99j82j37J26L5K9j47r9M99l10Q1
$$ 44 39 46 12 174 -84 32 -27 -47 2 -130 -269 81 -140 159 -23 -160 -34 1 30 -117 -216 283 -27 54
4574E4J59J37k41j96L9M6J38k22K15l02L66pl63L77q2r8J37j06l6m9j50J45J02
$$ 54 213 350 109 -87 -48 -2 136 -86 129 -173 193 186 -177 200 118 20 157 51 15 -34 -184 -39 63
4597F3j7o0J25k98M17k04p0K47k93M1n8J66J15J4j84J27n3q4j09k04L08j26o4
$$ 63 46 -14 111 -187 230 26 -44 203 -90 -49 -107 59 174 188 4 131 78 -6 -115 -319 -11 -137 -201
4620b01M20j22K0k56J50j30j9j2J38P8J20l7k44P1r7j09M78l29QJ38L1Q3m8l30
$$ -201 219 97 117 -139 11 -119 -138 -150 -12 66 186 149 -95 -24 -121 -230 248 -81 -73 65 96 179 131 -199
4644a99L41k11m6L57r9k77j0pM8J22j02L17k72P7J58l14L9j46K65j62K38k2j68
$$ -199 142 -69 -115 242 143 -134 -144 -151 -103 19 -83 234 -38 39 197 -117 -78 -224 41 -121 117 95 -73
4667g3R7J37l31K96Q2l41M54m07l8K09P9O7J6l63K11J4k48L74l5m93L89o5j71
$$ -73 24 161 -170 126 208 -133 321 -86 -124 85 164 231 247 -116 95 109 -139 235 200 -293 96 31 -140
4690a40L15l17P4K22j43J3o4j3J32m9l3J52l2K0kk88J33O4j22n7J23mO1p9l3J8
$$ -140 175 -142 -68 154 11 24 -40 -53 79 30 -3 149 117 137 135 -153 -20 44 -78 -135 -12 -16 45 -34 -67 -49
4716d9l4J03mJ89j47k71K51K37k36j87J20k41M69k17J40N0k16M58k12k16L84n32
$$ -49 -83 20 16 205 58 -213 38 275 39 -148 -28 -269 200 -17 123 173 -43 415 203 -13 371 -161
4738a61K09N7l17K53j14O5Ol41L07J07l6M3p2k07L84l00j08K90j15K45r9j81l1
$$ -161 48 105 -212 41 -73 -8 -2 -343 -36 71 35 78 6 -201 183 -117 -225 65 -50 195 96 -85 -116
4761a16lJ45M9RR8k80q2J37L05l03J38k48J60j27j52N40k92J19O9k55L0RO0j6
$$ -116 -119 26 75 84 182 -98 -180 -43 262 -41 97 -151 9 -118 -270 270 -22 97 166 -89 -59 -50 10 -6
4785fj4j57J25jJ67k48J04N2J98k12J7L0j30J02j36j43K38k5O1j12j6L22k04j40
$$ -6 -20 -177 -52 -53 114 -134 -30 22 220 8 25 55 -75 27 -109 -252 -14 -39 22 -90 -106 216 12 -128
4809a28K55j74M1J45k77J08r2K20n9p4J78q3k77J29O6q0K92j19Q7r8N1N1j52k58
$$ -128 127 -47 -6 139 -138 -30 -122 98 39 -35 143 60 -217 -88 -22 -102 190 71 158 60 111 162 10 -248
4833b48J93P7J35p3k45o9k2j5K65m2J34n6N8M1k01L3R8n7q5J36j04L34Mj96o6
$$ -248 -55 22 157 84 -161 -230 -252 -267 -2 -44 90 34 92 133 -68 -35 63 6 -79 57 -47 287 291 95 29
4858B9K96m34J97k78oN04l42q1L53m35K00n6J69j51j1M5J84k50J72j01m6K01j97
$$ 29 325 -109 88 -190 -196 308 -34 -115 238 -197 3 -53 116 -35 -46 -1 183 -67 105 4 -42 159 -38
4881c8k53M02j60j12N1N5J16r3K48o2J8k09K24k28J90k61K49l12J0lj8J15J01
$$ -38 -291 111 -49 -161 -110 -55 61 -32 216 154 172 -37 187 -41 149 -112 137 -175 -165 -168 -186 -71 30
4904C0p4k42L87k17J70K02k55O8k63K32j17j04Q0K77J82k98J02k38R6Q2j20J90
$$ 30 -44 -286 101 -116 54 256 1 69 -194 38 -79 -183 -103 174 356 58 160 -78 18 100 -20 170
4926A70l79R6K87m33M12k14J2J66j86k6J81j92K45j94k60K04q6m5L40r4J70l01
$$ 170 -209 -113 174 -259 153 -61 -49 117 -69 -95 86 -106 139 -55 -315 -111 -197 -242 98 4 174 -127
4948a27K60J79l41J47J27l81J13L3P3j32J04j5n6l9J5P6L8N5j95N3j85K78j82
$$ -127 133 312 -29 118 245 -136 -23 10 83 -49 55 40 -16 -55 -40 36 74 129 -66 -13 -198 80 -102
4971a02K03k46P6J58nk45K17j10J74pN1j03K3k1r1pn3K97n3L6l83N39l96J27j84
$$ -102 101 -145 -69 89 84 -161 56 -54 120 113 164 61 84 63 -28 -35 -88 209 156 192 -191 348 -48 79 -105
4996a05M5J92o6k91J76p4jJ67k7k52M22k56J9J13R0nk22o9J21m6K59K4l82K30
$$ -105 -60 132 66 -225 -49 -123 -124 43 16 -236 186 -70 -51 62 152 147 -75 -144 -23 -69 190 214 -168 62
5020F2O2k95J25m7J70P5k33m5K1K38l06J35J57m3k71J20J51k38OM0O2J98k95K1
$$ 62 124 -171 -46 -93 77 152 -81 -126 -105 133 -173 -38 119 76 -195 -75 76 -162 -156 -116 -54 144 -151 -130
5044a30K91o7r5J63j23J03o3j43O6j14J27K13k66j18N9m9J63j35R4m5j50K80k16
$$ -130 161 94 -1 162 39 142 79 -64 2 -112 15 228 -38 -156 -97 -146 17 -118 -24 -69 -219 61 -155
5067a55M3J36J69j62O1k42M57l13PJ02l0j12K04j25N6J50m28K06l9P4J66k21K3
$$ -155 -112 24 193 31 92 -150 307 -6 1 103 73 -39 165 40 96 246 -182 24 -15 59 225 4 27
5090B7j71Q9J32j07k2J74j55J52k2m15M84l53k1M44m46P3K42K5m5O0r0RJ8l08
$$ 27 -144 -55 77 -30 -52 122 -33 119 97 -318 166 -187 -208 236 -210 -137 105 130 85 145 55 64 82 -226
5114b26P4j28M85k35k7J50j36o4K90%j86J9j68L65j88p9j34J11J68J71l27K87
$$ -226 -152 -280 205 -30 -57 93 -43 -107 183 183 -3 16 -152 213 25 -54 -188 -77 91 262 -65 222
5136B22j22l84M69l54K83k16K7m3l3L13j93J9k15K61J5%k23K06P0n9o4K1q2J29
$$ 222 100 -284 185 -169 114 -102 -75 -118 -151 162 -31 -12 -227 34 49 49 -174 32 102 43 -21 0 -82 47
5160D7n9m6J11K4p9j02QL30j62pr6N5j37J71j02J22q7nK54l13K03k9k78N5J47
$$ 47 -12 -58 53 77 -2 -104 -96 234 72 65 -31 24 -113 58 -44 78 -9 -14 240 -73 130 101 -177 -122 25
5185B5j66l9L85k76M5L41r2l00J2p7K34l8k0p9o0K85j35m9j54l9K49J43k31K87
$$ 25 -141 -180 205 -71 -26 315 223 -77 -65 -142 92 54 34 -45 -105 180 45 -4 -158 -197 52 195 -36 251
5209B51l43J71m9j33j14L78m55L09l1l70K70J4k6p0L53N3q1l52L88k64K4M33k29
$$ 251 -92 79 30 -103 -217 161 -294 15 -16 -386 -116 -102 -128 -198 155 208 127 -225 163 -101 -77 356 127
5232A27r0K9J09R5j58L9l8n6j60K85j62K4J68l92L15j23K63l12Q5p4L2j56k0M6
$$ 127 37 66 175 270 112 151 113 57 -103 182 20 44 212 -180 135 12 275 -37 48 -26 6 -150 -170 -124
5256a24K8J3p6K28J64l76K53l10N8M15l21K87j98rJ50j34m0j46K13K8j65j38K33
$$ -124 -96 -83 -159 69 233 -143 110 -200 -142 273 -48 239 41 32 182 48 8 -138 75 103 -62 -200 33
5279C3l23M58p6J8P0P4m46K13J29l34M36j12p1k7k61L77l7m50M42k43q3K94q2
$$ 33 -290 168 92 110 180 254 -192 21 150 -184 252 140 69 42 -219 158 121 -329 113 -130 -213 81 -1
5302aJ19j25k4j36J55J66k82K02n6J01l09J28Q6k39L98k33m0O4L17k01O5j78q
$$ -1 118 -7 -31 -167 -12 154 -128 74 18 119 -190 -62 24 -215 183 -50 -90 -26 291 90 155 -23 -31
5325c1m8J82r6N5j06Pk78L33l4j44M7q7L7K54k26M74n27J46Q8j05j59K46r7K20
$$ -31 -79 103 7 62 -44 -37 -315 18 -16 -160 -113 -200 -163 91 -135 339 -188 -42 46 -59 -218 28 -69 151
5349A51q7j44M7j6L82k48o7O9K40k50J28J58k10k24o0N0K28l13K60m5j20Q1Q1
$$ 151 64 -80 -33 -49 333 85 18 87 327 77 205 363 153 -71 -131 -81 147 -166 94 49 -71 10 91
5372I1r1K12j06m3j37j03K39n2o5K6K21l03Q7J27j00o6J04J65k38K46l00J92k80
$$ 91 0 212 106 63 -74 -177 62 10 -55 -29 192 -111 -24 103 3 -63 41 206 -32 214 -86 106 -174
5395a74L60k97K4j01K3J40j15J37Q2j51K22k38R5K15k59J52q2J29J7q2k47J67
$$ -174 186 -111 -87 -188 -165 -25 -140 -3 79 -72 150 -88 7 222 -37 115 33 162 179 97 -150 17
5417A7N2Q8j09k83L29K3p3J02l48oJ87m7J09j2k27K97p6k91p6K38L12m65K47J06
$$ 17 69 157 48 -235 94 117 44 146 -202 -208 -21 -68 41 29 -198 99 23 -268 -344 -106 206 -259 -12 94
5441I4p7l15N23j59j23J8R3r9P1m3M8r8J82k05J51Ll0n4j11j80K44J48j24k40
$$ 94 17 -298 225 66 -57 -39 54 -45 26 -17 31 -67 115 -90 61 64 34 -20 -131 -311 -67 81 -43 -283
5465b83N20m35L73j49k06O9l9P1L4k2J62N8q5N9j49%J74O6j86j25N1q0K07r5M4
$$ -283 237 -198 175 26 -180 -111 -150 -79 -45 -67 95 153 68 127 -22 -22 152 218 32 -93 -42 -122 85 -10 34
5490C4J74j66p6l0j13K21j08K93l34j17J16r0J27J01j98r4L60k32J69R6k02J11
$$ 34 208 42 -34 -64 -177 44 -64 229 -105 -222 -106 -196 -69 32 -166 -260 100 -132 37 133 -69 42
5512D2n2M7K3OJ16l36J56O8l5j80j9J65J74j92j07L40k84O3J17j04o5L34k53R
$$ 42 -10 37 60 66 182 -154 2 70 35 -145 -164 1 175 -17 -124 216 -68 -5 112 8 -57 277 24 33
5536C3j7o3J48j07J37Kk60J05J19o1J45k29r7L65m46K44j22J65q7q4J27J29n6
$$ 33 16 -47 101 -6 131 133 -127 -22 97 36 181 -48 -145 220 -226 18 -104 61 -26 -110 17 146 90
5559I0o3m3j13K28l01O2K55k3L6J27l90L55k78L6K87l11l8J11j58J67O7k66M2
$$ 90 27 -16 -129 99 -202 -140 115 92 128 255 -135 220 -58 -22 265 -46 -84 27 -131 36 103 -163 -121
5582a21L34j22k11j71J00M62n13K31J3j87J69m4J38j81P7N9rj13M6l0k6J10r7
$$ -121 213 91 -120 -291 -191 271 -242 -11 2 -185 -16 -60 78 -103 -26 33 24 -89 -43 -73 -99 11 -86
5605h6K05j32K48k38L3l0J34j68%L0K21l7j21k26J49j71N4K8O9Q5l47K37p3R0
$$ -86 119 -13 235 -3 30 0 134 -34 -34 -4 217 180 59 -167 -18 -189 -135 -107 -38 47 -300 -63 -136 -46
5629d6Mj07K16n1j78K85j14m8J03P2k03K05k57L6L33l25J10J72k45K41j71J84
$$ -46 -42 -149 67 16 -162 123 9 -39 64 136 -67 138 -119 -83 250 -75 35 207 -38 203 32 216
5651B16l01j0L7ON9r3J93l54L12j3n7L22m94L29l00j05L20j86J78K35l50J28j08
$$ 216 -85 -95 -58 -52 7 -86 107 -247 65 52 -5 317 -177 152 -148 -253 67 -119 59 294 -56 72 -36
5674c6n2K08o2j92j5J53j6J28j34R0j08q2N6r4J58r7k8r8L48k87J93M6L3l1l52
$$ -36 -88 120 58 -134 -149 4 -12 116 -18 72 -36 -118 -62 -156 2 -95 -123 -221 127 -160 33 79 112 81 -271
5699b71K52J69j40R4j80L49q9j13K9j50J58k7n8q2n3K4P4L1j63R7l0p3K31q1O4
$$ -271 -19 150 10 104 -76 273 184 71 100 -50 108 81 23 -59 -112 -88 -14 17 -146 -49 -79 -152 79 -2 62
5724F2j09k2J34p9j6J60j67J3Q5j41L36k39J27k77J67J23j16J05j32j20K31j14
$$ 62 -47 -69 65 -14 -30 130 -37 -24 61 -80 256 17 144 -133 34 157 41 146 14 -106 125 11
5746A1o6J03l4M2l25M92k32R1j90j69R4J89J73j27k95L35q1m6K17kl31K01m06
$$ 11 -55 48 14 56 -269 223 -9 82 -108 -277 -183 6 179 52 -243 92 11 -35 182 180 -151 50 -356
5769c56L40k8J03N1k11k9J05Rm6o0K7K48k5m4j75J06k77M11j71K0n7m9J74J98
$$ -356 -16 -44 59 110 -101 -130 -25 -16 -62 -122 -95 153 128 84 -91 15 -262 149 -22 -2 -59 -108 66 264
5793B64j56m8k21M01nj30j90J73n9Q7k05K37K02n28L63r8k05L14j14k17p9K0L72
$$ 264 108 60 -161 240 235 105 -85 88 29 116 -89 148 350 -178 185 87 -118 196 82 -135 -214 -194 178
5816A78j16k18L76q2o0jqnr3m0P0N5j00R7J11l68L89l6k02k7q4J26K6j02L44k14
$$ 178 62 -156 220 138 78 77 69 64 -29 -69 1 56 -44 53 164 -204 185 149 -53 -80 -164 -38 -12 -114 230 16
5842A6j74O3J65n9N5L6J6l63J48R9J01Jj83J44K20j74r6R3j22k14K27q6J66q8
$$ 16 -158 -95 70 11 66 102 118 -245 -97 2 103 104 -79 65 285 111 15 108 -14 -228 -1 -87 79 -9
5866ij58L53j30j57J24k37K24j20J9Q8j45N8O3j02J27Q1J34l8j11K5k7n7j30O8
$$ -9 -167 186 56 -101 23 -214 10 -110 -91 -3 -148 -90 -27 -129 -2 79 213 175 64 89 62 5 -125 -57
5890e7L6Q5j79K33j17J39l56L65k34n8K38o1j54J67Q4nk81j96L52M8q7j58L05
$$ -57 -21 64 -115 118 1 140 -216 149 -85 -143 95 34 -120 47 131 126 -155 -351 1 49 -38 -196 109
5913A09k6l7j64J21l14N74n5j63j55J10O8J14k53N0l7J7L9l9J71rl74L3K41l12
$$ 109 83 46 -118 3 -311 263 208 45 -110 0 68 182 -71 -21 -58 -41 -2 -41 130 121 -253 -220 21 -291
5937b91L72j51oJ86j61J04l4o0K27j95P9j00NJ58k76J83r7p3n6Q0j5j74J49j62
$$ -291 81 -70 -76 110 -51 53 19 -41 186 -9 70 -30 -25 133 -143 40 -57 -130 -186 -106 -121 -295 -146 -308
5961c08K11j53J71oK84l10J48o1j21N5J1j00L2J23J82j83j71J41j22J3K14J3R1
$$ -308 -97 -250 -79 -85 199 -111 37 -24 -145 -90 -79 -179 -147 -24 158 -25 -196 -55 -177 -164 50 63 154
5984A54k3J11k36r3R0J70j74K7k37K66M6l47M13k87NK45k37n2J40j7l7r9m2N13
$$ 154 131 242 6 -87 3 173 -1 26 -211 55 101 -246 167 -120 -115 130 -107 -159 -19 -36 -73 -172 -214 299
6008B99k76j55J13L2l4j76K36Q7j58j15P6Q5q9L53k88J08j59j45J7R3Ll0J14j20
$$ 299 23 -132 -19 13 -21 -197 39 126 -32 -147 -71 14 -75 278 -10 98 -61 -206 -189 -96 -93 -123 -9 -129
6032a29R6J14J23k15r3J63N5j58O8O0pJ94j25k38J09N5J5Pj18r6P9m0O4nj8j07
$$ -129 -33 81 204 -11 -104 59 114 -44 24 84 77 271 146 -92 17 72 87 94 -24 -120 -41 -81 -17 -22 -40 -147
6058a47Q4J55j30Q1NQk0m0j27n1M2M72k16o9J65j45j50k5K07R9k9k39J84R0k10
$$ -147 -63 92 -38 43 48 56 36 -4 -131 -182 -140 332 116 47 212 67 -83 -108 99 198 169 -70 114 204 -6
6083fK29k12r9K03l8O2l37K67n6N4j03q2J43o1P8q1j05K02j30K73o7J5k73R5K09
$$ -6 223 11 -88 115 77 139 -198 69 13 67 -36 -118 25 -36 42 -39 -144 58 -72 201 134 149 -124 -29 180
6108A80j41LKk25J66L34m55J21K8K35k69RJ21L5l18J4K14j87J85k59J71R2M1j33
$$ 180 39 42 44 -181 -15 319 -136 -15 13 248 -21 -12 109 144 -174 -160 54 -133 52 -207 -36 56 97 -36
6132c6J41j80O0R2k81J93rJ77p9J76j78k23J71K26j35k54j2J6J36kj89J70k07
$$ -36 105 -75 -15 77 -204 -11 -20 157 78 254 76 -147 24 250 115 -139 -151 -135 1 -1 -190 -20 -227
6155b27K46j78N9J20K41l94J96ll8K19j15r2MQ2j08J12j06K10k96K65j45J15k29
$$ -227 19 -159 -100 20 261 -133 63 60 22 241 126 34 38 120 12 124 18 228 -68 197 52 167 -62
6178f2n2J3j4N9n5L20q6l01K88j80J6j98J08J62J54N1j31k18kn7J93R9P1j36j49
$$ -62 -114 -101 -115 -56 -111 209 123 -178 110 -70 -54 -252 -144 18 172 223 92 -126 -128 -185 8 107 178 42 -107
6203a07Q3R4jk26J70M3l9M7q7j10K9J09Kj15k14K46N4j6N7k15j7J16j4Q6p6J77
$$ -107 -24 70 69 -157 13 56 17 64 -23 -133 -104 5 7 -108 -322 -76 -22 -38 19 -196 -213 -97 -111 -25 -101 76
6229G6o8k00L09R6l37K55J8j95K05m13K13J85k91j6m2K95j75J33l06L69r0l70
$$ 76 8 -192 117 213 -124 131 149 -46 159 -254 -41 144 -147 -163 -205 90 -85 48 -258 111 21 -349
6251c49J61K06J21j84K39j85k2N2M9k02k7J37k82K11J16k90J83J57K8K5l28P9
$$ -349 -188 18 139 -45 194 9 -13 39 88 -114 -141 -4 -286 -75 41 -249 -66 91 119 144 -184 -105
6273a05nR4J8l7M8j70jK12J45k75j45J9J12J15K4q7o2l9P3K6r5J07K45j97q4K4
$$ -105 -110 -16 2 -35 13 -157 -158 54 199 -76 -221 -202 -90 25 49 -38 -100 -139 -66 -40 -135 -28 217 20 -64 -40
6299d0J95m16K30r6p1L55k16ql9J81j91kR7N3P1J02j79LJ09j64l0L08q2m3p5p1
$$ -40 155 -261 -31 -127 -198 157 -59 -67 -106 75 -116 -118 -21 32 103 205 26 29 138 -26 -56 252 170 127 52 -19
6325a9K08k45j66J78N8nJ53j93J4K60j12j25K26k82J54q5k28J33J5J50k89QL95
$$ -19 189 -56 -222 -44 14 9 162 -31 -17 243 131 6 232 -50 104 19 -209 -76 -61 89 -200 -192 203
6348B03k85J16j6j38j23K02p4L27m1l78K49j78M84j86j1j21j7l45M41q6qj34o
$$ 203 -82 34 18 -120 -243 -41 -115 212 171 -207 42 -136 348 162 151 30 13 -332 109 23 15 -119 -125
6371a25R2j36kl9J86j00N1j82K78P2j56J66k43l1K34j07N7J59j40j77K92k00J73
$$ -125 -33 -169 -171 -210 -24 -124 -73 -255 23 95 -61 105 -138 -169 65 -42 15 174 34 -143 149 -51 122
6394A22r3r7J36l2j42o6J06J89j29j25P9K78l96L6L6J15j45J40M8J62j06K04l32
$$ 122 29 -68 68 36 -106 -172 -66 123 -6 -131 -52 226 -170 -134 -98 17 -128 12 60 222 116 320 -12
6417a2NK08m28R7L99l88P7J99Lj77K1m1n1P6J39l20J37J93k61J37O3l75N34k40
$$ -12 -7 201 -227 -130 269 -119 -42 157 160 -17 4 -37 -88 -12 127 -193 -56 137 -124 13 76 -299 235 -5
6441ek5j27J95l0j20P4J12M7k15L50l06J07L1K7P7k24q3N7J23j33N7N3k13J95
$$ -5 -30 -157 38 8 -112 -38 74 121 -94 256 -50 57 88 115 192 -32 -115 -58 65 -68 -11 42 -171 24
6465B4k82J97K0K83r2R3j15l27K97j40K6r1L56l06K21Pj7q0j60L7K00l48J68l0
$$ 24 -258 -61 -41 242 150 243 128 -199 98 -42 -16 -107 249 -57 164 171 154 74 -86 -49 151 -197 -29 -59
6489e9o3p5K65j95Q0J69l63K7K14J25j89r4K11j60J71J61k62j7P8j19J97m8k25
$$ -59 -122 -197 68 -127 -47 122 -241 -214 0 125 -64 -158 53 -107 64 225 -37 -54 24 -95 102 54 -171
6512a71P5j45O72k6l03j96K30r0j74L72k30M6j67R5M9j43jJ69R9j71J29P8p1j39
$$ -171 -96 -241 431 405 102 -94 136 46 -128 244 14 60 -107 -12 37 -106 -107 62 161 -10 119 197 126 -13
6536a3r9o4N0K29k52L02k57K90j33n0Q3j76O5l0M6Q0O1j39J61l26M5L52n70L37
$$ -13 -112 -176 -126 103 -149 153 -104 186 53 3 86 -90 -25 -55 -9 71 132 -7 154 -172 -127 225 -345 -8
6560hK95n05K37j45KJ27J6l4Kr3J60j10J42k65K12j17m5J21k7K4P0J08k62K59
$$ -8 287 -218 19 -126 -124 3 19 -15 -13 -106 54 -56 86 -179 33 -84 -129 -8 -35 -11 59 167 -95 164
6584A64q3j98l9J5J72k34M49k95j31J88L0k92J09j50K56K99l73oJ64J25j62k6
$$ 164 81 -117 -156 -141 31 -203 246 -49 -180 8 38 -254 -145 -295 -39 260 -113 -119 45 170 8 -18
6606a8n1J70j79P4L12m47J9j33L32l6l6J95k87J09J43j7k27j3J47K8m66n3L62
$$ -18 -69 101 -78 -4 308 -139 -120 -253 79 43 7 202 -85 24 167 150 -77 -90 57 85 -381 -434 -72
6629g2j8J5K48k90m1K29j17J54l03K28K09l40qL62l41R8j0N1J39j69q3K18rj38
$$ -72 -90 -75 173 -117 -158 71 -46 108 -195 33 242 -98 -106 256 -85 13 3 54 193 24 -59 159 150 12
6653A2J36k90pl0J77j0R7Q8j77j51K03n3j13J27K8O3j76l3K66q6j88L73j83k93
$$ 12 148 -142 -149 -179 -2 -12 85 173 -4 -155 48 -5 -118 9 37 100 -76 -109 157 71 -117 256 73 -220
6677b20L85j99p4J85o1N7j04L6k02L5L8J30O6j84K42lm5k33K30j65m3N4J25M8
$$ -220 165 -34 -108 77 16 73 -31 5 -197 -162 -124 6 72 -112 130 127 82 -151 79 -86 -129 -75 50 98
6701I8j34M4L1j14o2M71m53Q3K36l20j52M01j92K16j17n0J04j14P0J0j71j1K80
$$ 98 -36 8 39 -75 -137 334 -119 -36 200 -120 -272 129 -63 153 36 -14 90 -24 46 56 -115 -126 154
6724A54j95j14L9J97j15J21L01k94k10K48o7j08K08p4q2M1J1o1l3j47J30J38j19
$$ 154 -41 -155 -116 81 -34 87 388 94 -116 132 65 -43 165 91 9 50 61 0 -33 -180 -50 88 -31
6747c1j02O2J05l9L55o41K96K7O9J04j94n4k03J89J71j35n6P3k01J26N4J33j6
$$ -31 -133 -71 34 -5 350 -291 5 32 101 205 11 -43 -246 -57 114 -21 -77 -4 -205 -79 -25 108 92
6770I2r8%J40k92M48N1m05J67J52k62J02j39K53l04L68l93l4k8J59j66J79J9J86
$$ 92 -6 -6 134 -158 290 341 -64 103 255 -7 95 -44 209 -95 273 -120 -154 -182 -23 -189 -10 9 195
6793A95j40j32j4O7j66J85J9P0j13J72k87J9J94J4j68mJ8J41J34k84L1P7j27K04
$$ 195 55 -77 -91 -24 -190 -5 14 84 -29 143 -144 -125 69 83 -85 -89 -71 70 204 -80 -49 28 -99 105
6817A05j56M5j29N8J5J39J68n54M92r9k18K29R9m72L58p0Q5k83J12j67J80K02
$$ 105 -51 -6 -135 -77 -62 77 245 -309 183 84 -134 95 194 -278 80 10 95 -188 -76 -243 -63 139
6839A39l92L75j13K58n65J78r1K16N4o0r4J96l0j15q3L41j80R4l16L00k89j21
$$ 139 -253 122 9 267 -298 -120 -211 5 59 -1 -95 101 71 -44 -127 214 34 128 -188 112 -177 -298
6861b98K93J4o0K25k63n4J23k1r3J35J87l50j3K41j50n9K93k37N3j78J22p1J71
$$ -298 -5 9 -51 174 -89 -143 -20 -41 -134 1 188 -162 -175 66 -84 -143 150 -87 -34 -212 -90 -161 10
6884A0p9O9O0j07P1K03k8m84R0K93k32K92p7j23P0j80K83k67P0K8O3j27j46Q6
$$ 10 -69 0 60 -47 24 227 199 -285 -195 98 -134 158 81 -42 28 -152 131 -136 -66 -38 25 -102 -248 -162
6908a62J30q1K9J13j37K75r3L3k59k4K10R1jk99K69k81Q3R2kK07j24k61J15K08
$$ -162 -32 -113 -84 29 -108 167 74 107 -152 -176 34 125 124 -175 94 -187 -104 -12 -14 193 69 -192 -77 131
6932A31m18L76j54l3L0LK26k28j06L42p4m60M35k3k01K57p9J48k08P5J38j89p6
$$ 131 -287 89 -65 -98 -68 -65 161 -67 -173 169 95 -365 70 47 -154 103 24 172 -36 39 177 -12 -88
6955h8J05j13J55k20J23J96k20j01K49p3p3j37J30N6R5k3j48O0J19O4l17n9J09
$$ -88 17 -96 59 -161 -38 158 -62 -163 86 13 -60 -197 -67 -11 84 61 -87 -27 92 156 -161 -220 -111
6978a11K5J22L2nJ11l73L22ON9l16K54J1m0J36l82J45n5O3q8K11j25j15j68K91
$$ -111 -86 36 68 63 174 -199 123 129 188 -128 126 137 97 233 -149 -4 -59 4 -84 127 2 -113 -281 10
7002A0L5j32J56j1j09j49N18m19j0M4L09r1L4k6K15m42J25k32L36q0j56KOJ61
$$ 10 45 -87 69 58 -51 -200 318 -101 -111 -67 242 151 185 159 374 -68 57 -175 161 81 -75 -73 -67 94
7026I4j06P3r1p6J36K06k64j95J01p5J62k26L09j2m6P7j55j26J67o1Qj2L0L12
$$ 94 -12 61 -30 -106 30 236 -28 -223 -122 -197 -35 -261 48 36 -10 67 -88 -214 -47 -108 -100 -112 -82 230
7050B30p5p8j13L2j27J19K3r0K6p7P6Q0j14pJ13m7r4Q2J2J60L9j15J6J87m18J58
$$ 230 155 77 -36 -4 -131 -12 11 -79 -53 -130 -54 26 -88 -95 18 -29 -123 -41 -29 131 170 55 71 258 -160 -2
7076bJ9r1K77n5k27K8K51l38J51n3J27l35L55l35J76K28k19j59K01o5j40J6k5
$$ -2 17 -74 203 148 -79 -51 200 -138 13 -40 87 -248 107 -228 -52 176 -43 -202 -1 -66 -206 -190 -215
7099b15K0L32j13p3L22m16P6oL1k22K84lQ6j2k48O8L23k38J65k13N4O1j22L3j34
$$ -215 -195 137 24 -49 273 -143 -67 -73 -42 -264 20 17 103 91 -157 -89 234 -4 161 -52 2 63 -59 -26 -160
7124a60J12J7NP5j19Q3j73L5L52l85J10M9n2lj29L10l07J98r4P0Q6j28oO7Nq7
$$ -160 -48 -31 -26 49 -70 13 -160 -125 227 -158 -48 1 -51 -54 -183 127 -180 18 -76 -6 80 -48 -54 13 18 -69
7150f9j31J60L69l36J50j20j98J20K36l50L03l72K89J25ql7p9j5K5q3rO7r8R4
$$ -69 -200 -40 329 -7 143 23 -175 -55 181 -169 134 -238 51 176 168 131 52 37 62 -21 -30 37 -61 33
7174C3q8J47l9P8k43N0j34J0L37k82K64j99P5K2J08k04J8K36k30m7M4K25j28q4
$$ 33 -55 92 53 131 -112 -62 -196 -186 151 -131 133 -66 9 31 139 -65 -47 189 -41 -88 -44 181 53 -31
7198c1L1N3K3L7p7j27J22j10K61k06q4K38n1J7J69k99j38L0J45k25J97j13J24
$$ -31 0 53 76 113 36 -91 31 -79 182 -24 -108 130 79 96 265 -34 -172 -142 3 -222 -25 -138 -14
7221a4J4N5k57O1L46m15L00J33k13j86J57l3K06m64M46j96o0J41O6k09K13k23
$$ -14 0 55 -202 -141 205 -210 90 223 10 -176 -19 -52 154 -310 136 -60 -120 21 87 -122 91 -132
7243a32N3J35P0k30O6r2M5M9N0k80Q6J48k79L94l19K22K4n8j97L40k03j98L35
$$ -132 -79 56 126 -104 -38 -130 -85 -36 14 -266 -180 -32 -311 83 -236 -14 10 -48 -245 95 -108 -306 29
7266B9L5rK07l60K5o2L79r0l77M16k67k4P6j15J36P1j89j95M29M5k61J98j57k3
$$ 29 64 55 262 -98 -73 -135 244 154 -223 193 -74 -98 -22 -137 -1 70 -119 -314 115 160 -101 97 -60 -83
7290h3nj08L14L8k82K96j13j03k11J31L27j22k78J50j11K84m0r4R3Qj88r1J07
$$ -83 -88 -196 118 156 -126 170 57 -46 -257 -126 201 79 -199 -49 -160 124 84 -10 83 91 -97 -188 -81
7313h1j85M04j35O0j7l63M28r3j13O2J32j02p8j1K11j87L7o1J54r1O6R1l22J47
$$ -81 -266 138 3 63 46 -317 111 18 -95 -33 99 -3 -81 -92 119 -68 -31 -92 62 -29 37 128 -194 -47
7337d7l80M49j5j67M02m75J18J9K06n4O0j46R9n6l6J60j43j04N2J06o0K8qj15
$$ -47 -427 22 7 -160 242 -233 -115 -96 110 56 116 -30 69 13 -23 137 -6 -110 -58 48 -12 16 8 -107
7361a07J47j6K41n27L32j30pN1l3K72j54j61J27O9Q8p7l81J76J07n5o9J48l01
$$ -107 40 24 265 -262 70 -60 -67 -16 -49 223 69 -92 35 104 192 115 -266 -90 17 -38 -107 41 -260
7384b60K34j49J82Q2p4n8J66NK1q9J2O6j62K1M7n9l16J15L30J36o72O03r9r3L7
$$ -260 -26 -175 7 89 15 -43 123 128 149 60 72 138 -24 -3 44 -15 -331 -216 114 250 -422 181 82 -11 26
7409B6J42k97K40n0j00O5n9p7K82O8j44k65N10j16l19K32L9j69M5M5k44L86k69
$$ 26 168 -129 111 61 -39 26 -33 -110 172 240 96 -169 341 225 -94 138 177 8 53 98 -146 240 -29
7432b9j63K04k25J86k09J86K6j11n6K08Q2n7ko3L0k8R0Rl03L10n7j75J70O7k03
$$ -29 -192 12 -213 -27 -236 -50 -24 -135 -191 17 99 42 40 -23 7 -21 69 78 -225 85 28 -147 23 90 -113
7457a13J46j63L7K7j09J46q7J63J74l42N9mm1Q7p3L30%k65j63K51M8J15k17J8
$$ -113 33 -130 -93 -66 -175 -29 -116 47 221 -121 -62 -66 -107 -20 -93 237 237 -28 -191 60 108 223 6 24
7481B4j1L7Q6k16Q1K9Q1K08k67l49L54o2Q5j71N6Q0j02J6p5j71J97j5R5j5J39
$$ 24 13 50 136 -80 1 30 111 319 52 -297 57 -5 80 -91 -35 45 -57 -41 -116 -287 -90 -105 -10 -25 114
7506A14p7j21qK09j04O8j79J21J81o0M2j24j0O9j77K1J92j1k7j57n8l2J26J21
$$ 114 37 -84 -92 117 13 81 -98 23 204 144 186 62 52 121 -56 -35 157 146 119 -38 -96 -128 -2 119
7530A19j69p9J28K13j97m1L2j33K52j78K81k64L07j96J8k17J29N8k23L91l42m1
$$ 119 -50 -129 -1 212 15 -26 6 -127 125 -53 228 -36 271 75 93 -124 5 63 -160 231 -111 -152
7552a52J36k9j07n2J75l0j01P2J10J43o9m5p6P7l40K70p6L76k05K0k71K05k23
$$ -152 -16 -45 -152 -204 -29 -59 -160 -88 22 165 96 51 -25 52 -288 -18 -94 282 77 97 -174 31 -192
7575a92L35j54P3j26J6J21j74K28J35j02k64Q8J87l45K64L1j69r5k27M85n7o5
$$ -192 143 -11 62 -64 -48 73 -101 127 262 160 -104 -16 171 -174 90 121 -48 -143 -370 115 58 -7
7597gN6k17K06k28K39J27j9j82J46q7k42J7L63R3k88q9rK44p5J53k81k01Q7r5
$$ -7 49 -168 38 -190 49 176 157 -25 121 34 -208 -191 172 265 -23 -112 -121 123 48 201 -80 -281 -194 -289
7621b89L34p4J46j65P5n2j55L23k41J38k77P4J24R3l1Nr2J79j30J48k64q1J64
$$ -289 45 -29 117 -48 27 -25 -180 143 -98 40 -237 -163 -39 54 23 28 -64 115 -15 133 -131 -212 -48
7644d8J87j90M11n26R3J71j39J18k07j61L78p9j05L1l0L80k46q9j26J57L5Q5J4
$$ -48 139 -51 360 -166 -73 98 -41 77 -130 -291 87 8 -97 -66 -96 284 38 -51 -177 -20 15 100 114
7667A14J0m4N9J66m36K88J09l57R6p4J70Nl98L13j5k7J78r7j87R8L4j96K27k50
$$ 114 124 80 139 305 -131 157 266 -91 5 -69 101 106 -292 21 6 -21 157 60 -127 -29 5 -191 36 -214
7691b14K15rk5J29M3k07qR8k9J30l24L83N2j06n5j16J97j60l5K09q5j8j04o8J72
$$ -214 1 -8 -33 96 139 -68 -76 22 -7 123 -201 182 234 128 73 -43 154 -6 -41 168 83 65 -39 -107 65
7716F5J52j79k31J37n9J33O3k26L38l54K61j50K3O6l8j38L20jj10j4p1k66N44
$$ 65 217 38 -193 -56 -115 18 81 -145 193 -161 100 -50 -27 39 1 -137 183 182 72 58 -13 -279 265
7739B65q4q4P9m4l85M18k82R7p3r6K20n2k80L90n6r9m7J66L2k50J77J08l10K97
$$ 265 181 97 176 132 -253 165 -117 -20 -93 -189 31 -21 -301 89 33 -66 -113 53 85 -165 12 120 -190 107
7763A07j02m9rK7K40l30j06K73k70M12l79Q9n2O9K08j82J03k98L16j6n9l6OJ59
$$ 107 5 -44 -53 -26 214 -116 -222 51 -219 193 -186 -97 -149 -80 128 -54 49 -249 67 51 -8 -44 -38 121
7787A21q0J2o7NO5k84J6N08j81r6P9k37J70km8j2J79o6j38kJ55l0RO2k85j5L2
$$ 121 41 53 -14 -9 56 -228 -212 296 115 19 98 -139 31 29 -19 -31 148 82 -56 -58 97 67 76 138 -147 -162 -130
7814a30J30L4Mj29J76L6j46k01J35Q9o3MO4q5J29Q1l17N4M06l78L07k56J15l34
$$ -130 0 34 38 -91 85 121 -25 -226 -91 -2 -65 -61 3 -82 47 128 -189 -135 271 -107 200 -56 59 -275
7838b75K80k50J30J95k82J03K9K16K61l56J09k87K03j10j11J88o2j2P5O3k1j73
$$ -275 5 -245 -115 80 -202 -99 -70 146 407 51 160 -127 76 -34 -145 43 -19 -31 44 107 86 -87
7860h7L0k8K99m54K92K17m61K86k07J18K40j66j42K63j74o0j32N0J53r8q0R0Q0
$$ -87 -57 -85 214 -240 52 269 -192 94 -113 5 245 79 -63 200 26 -34 -166 -116 37 -61 -141 -51 29
7883B9l38L18j30K44l48K38J99j44k72Q9J75l6k50L41J01m14M66l94K48j82J42
$$ 29 -309 9 -121 123 -225 13 212 68 -204 -115 60 24 -226 115 216 -198 268 -126 122 -60 82
7904H2j43j87M8J7K25n8J08K14m59J7K26j02k22L55q4L3q2R8j65J35J90j63j43
$$ 82 -61 -248 -200 -183 42 -16 92 306 -153 -136 90 -12 -234 121 37 70 -12 86 -79 56 246 83 -60
7927f0j4k03K12J95j09p1j64J1J28P5j75L22m24M92m16J37J01n6J16K06m87J10
$$ -60 -74 -277 -65 130 21 -50 -214 -203 -75 0 -175 147 -277 215 -201 -64 37 -19 97 303 -184 -74
7949g4L16p3n5K7m2P5k13o2K49j42q1K78l44P0R3j46N4Q7J24l00M1p1j26J90J67
$$ -74 242 169 114 141 99 174 -39 -101 148 6 -75 203 -141 -71 22 -124 -70 17 141 -159 -118 -189 -315 -125 42
7974D2j02J38q4J17k79L51R1n79K86k6J34l3N0P6m35K32J35k9p2k8LO9k41M47
$$ 42 -60 78 -6 111 -168 183 274 -305 -19 -45 89 56 106 182 -253 -21 114 85 13 -15 -12 57 -184 263
7998B63n72J10K12j16J77K39k44j14m3QK40k94NK97n3k67QJ31J54k77J98l14J52
$$ 263 -309 -199 13 -103 74 313 69 -45 -88 -80 160 -134 -129 168 115 -152 -144 -13 141 -136 62 -252 -100
8021a00n7J49p4J38M0n2M5j06N7N4M0%j51K0J5j26L16j13j05p1J78j24J31m0%
$$ -100 -157 -8 -82 56 96 44 89 -17 40 94 134 134 -17 3 18 -108 208 95 -10 -81 97 -27 104 64 64
8046F4L1j3L9Q4m04N14k75j75K41j19k03K59j00K10j40J8L2l57K76L0J1J6k2k12
$$ 64 95 82 121 205 -199 315 40 -135 106 -13 -216 43 -57 153 13 31 63 -294 -18 12 23 39 17 -195
8070a95K42j81K60k52J61j10j27J41n6R8p1o9J2L71j11k47K07k32K76M7Q8k72
$$ -195 47 -134 126 -126 35 -75 -202 -61 -117 -19 -90 -159 -147 224 113 -134 73 -159 117 164 252 -20
8092b0j82O6N1L3J4J70k57L2JJ08lL7j09K23k93K5L88l92K07N6l61J99k17K65
$$ -20 -202 -136 -85 -52 -38 132 -125 -93 -92 16 13 50 -59 164 -129 -104 284 -108 99 155 -206 -7 -224 41
8116D1J3O5Pj71j26J82j02m7J52n3k33K12R8o0j44J5J18Q7l3j18k39K01J35j6
$$ 41 54 119 126 -45 -171 11 -91 -138 14 -39 -272 -60 38 -22 -166 -151 -33 54 21 -97 -336 -135 0 -16
8140a6J04k31K40k97J60K6j66L0J02J24J12k22k2K38l40J53M3j9k8J92k94N9j14
$$ -16 88 -143 97 -200 -40 -14 -180 -150 -48 76 188 -34 -56 182 -158 -5 38 19 -9 183 -111 -52 -166
8163a66L22o7j91K85k82J33j59L75k65J6j7k21o6L15k24M0J30J91q2j3q3J7l0
$$ -166 156 89 -102 183 -99 34 -125 250 -15 1 -16 -237 -303 12 -212 -172 -42 149 67 54 -29 -12 -42
8186d2L6Q8K71l60J33
$$ -42 -6 82 353 -7 126
8191A26
$$ Imaginary data points
##PAGE= N=2
##DATA TABLE= (X++(I..I)), XYDATA
0@%%%%%%%%%%%%%%%%%%Lj1J6j6J6j6J6k2L0l2L5m3M8n4O2p0P8q6R9j12J24j36
$$ 0 0 0 0 0 0 0 0 0 0 0 0 0 0 0 0 0 0 0 3 -8 8 -8 8 -8 8 -14 16 -16 19 -24 24 -30 32 -38 40 -46 53 -59 65 -71
40g1J50j68J86k06K30k53K79l08L40l76M13m54N00n53O12o76P51q40R43j062J207
$$ -71 79 -89 97 -109 121 -132 147 -161 179 -197 216 -238 262 -291 321 -355 396 -444 499 -563 644
61F44j389J618j920K338k953L945n796J0335m0311m7362J15941J748n4627K7656
$$ 644 -745 873 -1047 1291 -1662 2283 -3513 6822 -33489 -80851 35090 36838 -17789 9867
75I867J9505m0219J93N0880j6185n8440L5749J9295m1338K1962J7111l5507K371
$$ 9867 29372 -10847 -10654 40226 24041 -34399 1350 20645 -20693 1269 18380 -17127 -14756
88a4756K2228P13k1965K814L0048k4937k1134M0933o641k4450J9671K870j3676
$$ -14756 7472 8185 -13780 -10966 19082 -5855 -26989 13944 7303 -17147 2524 5394 -8282
101h282O77J8086P611k9161K972K2261j5993O575P242k4428Q421J1987n493J097
$$ -8282 -7605 10481 18092 -11069 -8097 14164 -1829 4746 11988 -12440 -4019 7968 2475 3572
115C572p624M734K413q953J6792m964k0322J3688N312o701m275o83J2664j3773
$$ 3572 -4052 682 3095 -5858 10934 5970 -14352 -664 4648 -2053 -6328 -7011 5653 -8120
129h120o199K9985j5338j7530K7031m233j3561J2365M376q624p701J6636M276
$$ -8120 -14319 15666 328 -17202 9829 5596 -7965 4400 8776 152 -7549 9087 13363
142A3363k5334J6306J1974k9316J2212J6660k1962l569J1424K923j1475n262K0182
$$ 13363 -11971 4335 16309 -13007 -795 15865 -6097 -9666 1758 4681 -6794 -12056 8126
155H126q962j5250K4427l566j7097J5142M103p636l532N351Q321j4975K598J4997
$$ 8126 -836 -16086 8341 4775 -12322 2820 6923 -713 -4245 1106 9427 -5548 -2950 12047
169A2047j9893J867J8986j5671l806J0272r56k086m030Q676m22j2922J4628M99
$$ 12047 -7846 -5979 13007 -2664 -6470 3802 2846 760 -3270 5406 4984 -7938 6690 7189
183G189j6899J1309J506p396L155l669L909o63m780J1733p576p149J6115m220
$$ 7189 -9710 1599 3105 -4291 -1136 -4805 -896 -1559 -6339 5394 -2182 -9331 6784 2564
197B564n605M527k392L050l235K143P304j4692M911J4183j5089J434Q902r285
$$ 2564 -3041 1486 -906 2144 -1091 1052 8356 -6336 -1425 12758 -2331 -897 8005 -1280
211a280n3K313J179k852p708J0935j293j2411J4112k85j1393R245K28k514O24
$$ -1280 -1333 980 2159 -693 -8401 2534 1241 -11170 2942 2657 -8736 509 737 -1777 -1153
226a153p40O982q376k104J4968r907l903J2184p341j992N395n86j134o978O689
$$ -1153 -1893 5089 -3287 -5391 9577 -330 -4233 7951 610 -1382 4013 3427 2293 -4685 2004
241B004M296j3955Q327O006j4574P066N294p716J626j73K623k824m888J1838n691
$$ 2004 6300 -7655 672 6678 -7896 -830 4464 -3252 -1626 -1799 824 -2000 -6888 4950 -741
256g41p591J2900m305m925Q232k844K16q90L6O458r116J617R754j1724J708Q216
$$ -741 -8332 4568 263 -4662 3570 726 942 52 88 6546 -2570 -953 8801 -2923 -1215 7001
272G001q168O78J522n35J47n990O568M8j0189J0668j01r283Q618l05l496K881
$$ 7001 -1167 -489 1033 498 645 -5345 1223 1271 -8918 1750 1649 -7634 984 679 -2817 64
288F4j502L709l098k640R702o999k309R583o370p64M864l280K023l677Q73N504
$$ 64 -1438 2271 -827 -3467 6235 -764 -3073 6510 140 -624 4240 960 2983 -694 179 5683
304E683r770L116N457r890M260K983n032K767k081K097P15o057Q246j151q191
$$ 5683 -4087 -971 4486 -5404 -1144 1839 -3193 -426 -2507 -410 305 -5752 2494 1343 -6848
319f848R329j527m672O172k112N82q4j277N958n759j896R258q375o76P514o391
$$ -6848 2481 954 -3718 2454 342 924 840 -437 5521 -238 -2134 7124 -1251 -1927 5587 -804
335h04M63R51p73K351o028L777K814r741O732K322q394N768J118l199J915p92
$$ -804 -341 610 -163 2188 -3840 -63 2751 -6990 -258 2064 -6330 -562 556 -2643 -728 -1520
351a520M024k428m304R362m950m057R743n375k492N702k621P51j581J26M388p666
$$ -1520 2504 76 -4228 5134 184 -3873 5870 495 -1997 3705 1084 1835 254 380 4768 -2898
367b898K037N234q993L643L207o483L358l2m96J697l872N146p75o077P948j981
$$ -2898 -861 4373 -4620 -977 2230 -4253 -895 -927 -1423 274 -3598 1548 773 -5304 2644 663
383F63m876O571k303p89K280k524M522k678j767O552o052m28N503n708Q01J055
$$ 663 -4213 2358 55 -734 1546 -978 3544 866 -901 5651 -401 -829 4674 -1034 -233 822
399H22k701L655l448N57L084o023L929K220o703M544K15l217L055k416K959O14
$$ 822 -1879 1776 -1672 -1115 1969 -4054 -125 2095 -4608 -64 151 -3066 -11 -2427 532 1146
415A146m858O627j328m339P225k724l288L308j388K122j934j728N063n829J25
$$ 1146 -3712 2915 1587 -2752 4473 1749 -1539 1769 381 2503 569 -1159 3904 -1925 -1800
430a800P511p798R1M393m452J580J12m27J93m122N924L23q092Q128N92p320O307
$$ -1800 5711 -2087 -1996 2397 -2055 -475 -363 -790 -597 -4719 1205 1528 -6564 1564 2156 -5164 1143
447A143M25k506J705k90K605l417m19P141o507j772O746o018M65L832m987N46
$$ 1143 1568 -938 767 477 3082 -335 -754 6387 -120 -1892 4854 -1164 -699 3133 -1854 -1308
463a308J85J173J817n715L959J363o155N924M05o285L896q3L70J016l590M229
$$ -1308 -1123 50 1867 -3848 111 1474 -4681 1243 1648 -4637 -741 -824 -454 562 -3028 1201
479A201j30k609N708l586j358M236l848K000O98m063M063k268j739M961m158l21
$$ 1201 1071 -1538 4170 584 -774 3462 -386 1614 2312 -1751 2312 44 -1695 3266 -892 -1213
495a213L046m057J612q2m78J948o126L691M475p195L580L092n948L640K482j290
$$ -1213 1833 -2224 -612 -694 -1172 776 -5350 -1659 2816 -4379 -799 2293 -3655 -15 2467 1177
511A177q60j355M289k543k465P320n364l945Q807l753l306M256j630j034j616
$$ 1177 317 -1038 3251 708 -1757 5563 199 -3746 5061 1308 -1998 2258 628 -406 -2022
526b022K382J956p338M092L877q543M779L824n954J539J498J25J44j728L516k553
$$ -2022 360 2316 -5022 -930 2947 -5596 -817 3007 -2947 -1408 90 215 359 -1369 2147 -406
542d06k514P894m040m168O348k381j169K982k353M49j483P76L966n730O75L185
$$ -406 -2920 4974 934 -3234 3114 733 -436 2546 193 642 -841 -65 3901 -1829 -1154 2031
558B031m232L091L19m426K898j782N75L021m500J340K152k789L405k41r95J425
$$ 2031 -2201 890 1209 -3217 -319 -2101 -1526 1495 -3005 -1665 487 -2302 1103 862 -133 1292
574A292k817L719k3m599N708j883n365O554j6k873Q62m87Q46k304J600L651p812
$$ 1292 -1525 2194 2171 -2428 3280 1397 -3968 2586 2570 -303 559 72 918 -1386 214 3865 -3947
591c947K98O649n697R20M118n021J2K513K094j019m205M832n72n013P464p85o753
$$ -3947 -3649 3000 -2697 -1777 2341 -2680 -2668 -155 1939 920 -3285 1547 975 -4038 3426 2641 -4112
608d112N373R26k052J232j15Q51k952L66M894n699p17M730n331Q30L892l289K48
$$ -4112 1261 2187 135 1367 1252 2103 -849 -483 4411 -1288 -2005 2725 -2606 -1776 2116 -1173 -925
625i25p69R56J763l711K381Q52m437M402R65l076K483j559J361K004l343L076
$$ -925 -1694 -738 1025 -2686 -305 547 -3890 512 1477 -1599 884 -675 686 2690 -653 2423
641B423r92l617N093j309k298J783k010J689o33j304L586m584r58N635m130o03
$$ 2423 1431 -2186 2907 1598 -700 1083 -927 762 129 -1175 2411 -2173 -3131 2504 -1626 -2229
657b229L396k782j38N07J452J238m306L409J834n505M953J317n698K803J195q62
$$ -2229 1167 -1615 -1753 -1246 206 1444 -2862 547 2381 -3124 1829 3146 -2552 251 1446 584
673E84K28o68K153k268j657O109l802l531N364k964j548K819j403k42j289J298
$$ 584 812 144 2297 29 -1628 4481 679 -2852 2512 -452 -2000 819 -584 -826 -2115 -817
689h17K564m909K250L188n331K852J890l335J978o3K07N77k302L727o27l863M801
$$ -817 1747 -3162 -912 2276 -3055 -203 1687 -1648 330 267 474 1051 -1251 2476 1849 -2014 2787
706B787j151k719K560j719N29K22j595L011k975j312M605l284j072L183k531L33
$$ 2787 1636 -1083 1477 -242 287 509 -1086 1925 -1050 -2362 2243 -1041 -2113 1070 -1461 -1128
722a128M04K1J566l143J965K626m748L219K186m781K435J042j120O0j016K268
$$ -1128 -724 -703 863 -2280 -315 2311 -2437 782 2968 -1813 622 1664 544 604 -412 1856
738A856j125k610M670j936l351M345j857j249J576j183N11j304R7L495m089M09
$$ 1856 731 -1879 2791 855 -2496 1849 -8 -1257 319 -864 -353 -1657 -1560 1935 -2154 -1745
754a745L986m343J414K359k762J127r4L73Q52k748L248N36m227M167p8k924K440
$$ -1745 2241 -2102 -688 1671 -1091 36 -58 315 1167 -1581 1667 2203 -2024 2143 2065 -859 1581
771A581r90l82L98j961K705j914j790M000k834j040L297k226K49N72o18J800k527
$$ 1581 591 209 607 -1354 1351 -563 -2353 1647 -1187 -2227 1070 -1156 -907 -335 -953 847 -1680
788a680P42L184m349J587L020l517J361J407q98P5j340K007Q3l497L946q04l567
$$ -1680 -938 2246 -2103 -516 2504 -1013 348 1755 857 932 -408 1599 1682 -1815 2131 1327 -2240
805b240L880j319j570J820j387Q81q36q97L022l361n04M132l317N15K845k461
$$ -2240 1640 321 -1249 571 -816 65 -771 -1668 1354 -2007 -2511 1621 -1696 -1181 1664 -797
821g97Q50k3L60J410l229K320J609m399L117J032l173K050o58k17O76j736J886
$$ -797 53 30 390 1800 -1429 891 2500 -1899 1218 2250 -923 1127 469 252 928 -808 1078
838A078j140k313L677j986j599L495k214m1J317j327J890j780k02K697l061R88
$$ 1078 -62 -2375 1302 -684 -2283 1212 -1002 -1043 274 -1053 837 -943 -1145 1552 -1509 -521
854e21K533l028J450Q19j040J415j823J158R81l325K510K57l568L215o57k015
$$ -521 2012 -1016 434 1253 213 1628 -195 963 1944 -1381 1129 1386 -2182 1033 376 -1639
870a639K042j198J110m74j643L066k340j269L671k227p36K539j904Q12J2J43J988
$$ -1639 403 -795 315 -159 -1802 1264 -1076 -2345 1326 -901 -1637 902 -1002 -190 -178 -35 1953
887A953k875J286K243l980J937J499l019J586j9p00J306k045J684l82k480L458
$$ 1953 -922 364 2607 -1373 564 2063 -956 630 611 -89 1217 -828 856 474 -2006 1452
903A452j787k011L165j549p72J634j172J384r64m66K792k781O01K576l182J295
$$ 1452 -335 -2346 819 -730 -1502 132 -1040 344 -620 -1086 1706 -1075 -474 2102 -1080 215
919B15Q52j458J405q44R7J346k409J834L17k659K398q33j546K124j668N99M35
$$ 215 1067 -391 1014 170 267 1613 -796 1038 1355 -1304 1094 261 -1285 839 -829 -230 205
936B05j868K398j100j802L271j544r44J796j671J449J03j197K460k234L73L053
$$ 205 -1663 735 -365 -2167 1104 -440 -1384 412 -1259 190 293 -904 1556 -678 -305 2748
952B748l325N91J599j912R21J19o62N62j606J744L52l185L085m92k815K910j066
$$ 2748 -577 14 1613 -299 622 741 79 641 -965 779 1131 -2054 1031 539 -2276 634 -432
969d32q52J157q42J166j050k70K735k440J11K722k841P48J843k028Q55k26O5R85
$$ -432 -1284 -127 -969 197 -853 -1123 1612 -828 -717 2005 -836 -88 1755 -273 582 356 421 1406
987A406k109J340O13k545K880o99k480K607j151n32Q43j488R64J29r67J914j357
$$ 1406 -703 637 1250 -1295 1585 886 -1594 1013 -138 -670 173 -1315 -351 -222 -1189 725 -632
1004f32m08J828j965J280M96j784K202q66q96K711j806j31J299j492J539o24j018
$$ -632 -1040 788 -1177 103 599 -1185 1017 151 -745 1966 160 29 1328 -164 1375 751 -267
1021b67J863k782Q94J980k981J373M74k597K449N9j248L22j251J662j52j130K896
$$ -267 1596 -1186 -292 1688 -1293 80 554 -2043 406 465 -783 -461 -1712 -50 -202 -1332 1564
1038A564k628o23L728k101l61J818j654O09o8N4J186k708J844Q73k909K318L34
$$ 1564 -1064 -1687 2041 -60 -421 1397 -257 352 284 338 1524 -1184 660 1533 -1376 942 1276
1055A276k958K025O1r63R37j215L03n0j220L057j978q02K551k007M38K057k581
$$ 1276 -1682 343 404 -559 378 -837 -534 -584 -1804 1253 -725 -1527 1024 -983 -545 1512 -1069
1072a069J062J95k28J401j557M10Q81j617K234l66k200K030j298l18K076k386
$$ -1069 -7 188 -40 1361 -196 214 1095 -522 1712 1346 -854 1176 -122 -440 1636 -750
1088g50K00N97j503J800l77m78P78k110J741Q26k536K375q85j660L100p57p95
$$ -750 -550 47 -1456 344 -33 -511 267 -1843 -102 724 -1812 563 -322 -1982 1118 361 -434
1105d34J336j457J185O0l50J277k619O84K209k620J213R47k779J274O29n75K53
$$ -434 902 -555 630 690 340 1617 -1002 -318 1891 -729 484 1431 -1348 -74 555 -20 233
1122B33r83R32n70j492K935j401j785K880j519k49K212j332p4k18J61J715k227
$$ 233 -750 182 -388 -1880 1055 -346 -2131 749 -770 -1019 1193 -139 -213 -431 -270 1445 -782
1139g82R75J379k740J808J263k888J493J15p43J140j260N09j00j224J677p94j365
$$ -782 193 1572 -1168 640 1903 -985 508 623 -120 1020 -240 269 169 -1055 622 -172 -1537
1156a537K089j768N71J291j875J040r7q47K000r71m02J470j806J480J20r73J757
$$ -1537 552 -1216 -645 646 -1229 -189 -286 -1133 867 -104 -506 964 -842 638 758 -215 1542
1173A542j427n09J998k155N75J198k270J223J23p24R96j648J040N31k069K297
$$ 1542 115 -394 1604 -551 24 1222 -1048 175 298 -426 570 -1078 -38 493 -1576 721
1189G21p47j961K181l99r80J638q09J94k71L0K146k158j59K524k641P17J614k023
$$ 721 -26 -1987 194 -205 -1185 453 -356 -162 -433 -403 1743 -415 -574 1950 -691 26 1640 -383
1207c83O28K98l59M55j315J148q6j897K497m18k258K179j086m26J253j062P73
$$ -383 245 543 184 639 -676 472 386 -1511 986 568 -1690 489 -597 -1023 230 -832 -59
1224e9j70q38K221j631j35J756j650M54J189j483J285q21l21J925j923N08R12
$$ -59 -229 -1067 1154 -477 -612 1144 -506 -52 1137 -346 939 118 -203 1722 -201 307 1219
1241A219k057J466k73p79R06j102J21J102j923J407J02j587J929o29r15J372o86
$$ 1219 -838 628 355 -424 482 -620 -499 603 -1320 87 189 -1398 531 -98 -1013 359 -327
1258c27L92p1o16J925j334p16K195j512p9J665j656K58K25m68R39j631J233N31
$$ -327 65 -6 -622 1303 -31 -747 1448 -64 -143 1522 -134 124 349 -119 820 -811 422 953
1276I53k345J782N96k522J539k40o16P58q55J103l14j131K151j008q61K063j282
$$ 953 -1392 390 986 -1536 3 -237 -853 -95 -950 153 -161 -1292 859 -149 -1010 1053 -229
1293b29J03R93j244J006m33l58J549j847O34J211k132Q85Q53j596J019p19J11
$$ -229 -126 867 -377 629 196 -162 1387 -460 174 1385 -747 138 991 -605 414 -305 -194
1310a94N65j799J409J29j468J593k58j028J498r76L74P9p71J661q58o46K333j590
$$ -194 371 -1428 -19 110 -1358 235 -23 -1051 447 -529 -155 -76 -847 814 -44 -690 1643 53
1328E3j70J319j396N39K68o05Q22j550Q87P91k025R38P90j391R55j73o90L83o25
$$ 53 -117 1202 -194 345 613 8 830 -720 167 958 -1067 -129 661 -730 225 52 -638 -255 -880
1347h80R03K24j671J859l85j179K002q48j79Q26j089J123n11l17J370j535P6J767
$$ -880 23 247 -1424 435 50 -1129 873 25 -154 672 -417 706 195 -122 1248 -287 -211 1556
1365A556k133K90J125j424R35n46k6N91j600J324L61j686J611j36j349J219l21
$$ 1556 -577 -287 838 -586 349 -197 -223 368 -1232 92 453 -1233 378 242 -1107 112 -209
1382b09L77N5r29J372o89p64K016j055n60J376j135M61K53p89J116j220l3J448
$$ -209 168 223 -706 666 -23 -787 1229 174 -386 990 -145 316 569 -220 896 -324 -357 1091
1400A091k063O97R07j468P62J30n58O86j104P42M40j493J798l89j564J898k44
$$ 1091 -972 -275 632 -836 -74 56 -502 184 -920 -178 262 -1231 567 178 -1386 512 268
1417B68m60R86r19Q34l84n54J697j381p52K114j669j14J127j062N69m50q7N29
$$ 268 -192 794 -125 709 325 -229 1468 87 -665 1449 -220 -334 793 -269 300 -150 -237 292
1435B92j145P65N39j549J219k3j434J373j18k63O15q29J010j8j151J697q23p26
$$ 292 -853 -88 451 -1098 121 98 -1336 37 -81 -344 271 -558 452 434 -717 980 157 -569
1453e69J349p51J73O91j115R21n85j52J439j943L7J146j333Q03k75n07O67o55
$$ -569 780 29 202 893 -222 699 114 -38 1401 -542 -505 641 -692 111 -164 -671 -4 -659
1471f59L64J101j710J092q5j187J155J32l22L74n39J017k13q45J743j116q26J858
$$ -659 -295 806 -904 188 103 -1084 71 203 -119 255 -284 733 520 -325 1418 302 -524 1334
1489A334j197o05Q65n35J12J19j24P08j420M06J113j839J055J64j393R94J42j59
$$ 1334 137 -468 397 -138 -26 93 -31 677 -743 -337 776 -1063 -8 156 -1237 -243 -101 -260
1507b60N91j091J243k04o85J371q15o08J482j225L01N73j260J265m9n19J021j235
$$ -260 331 -760 483 279 -406 965 150 -458 1024 -201 100 673 -587 678 629 110 1131 -104
1525a04j30R79j389R65n55q21J300n73l29J389j625P08L16r00R98Q8p04P21q64
$$ -104 -234 745 -644 321 -234 -1055 245 -328 -657 732 -893 -185 131 -769 229 317 -387 334 -530
1544e30J147K87j514J426l62j006J686m64p27K56l72O63p76j41J262j717K91J391
$$ -530 617 904 -610 816 454 -552 1134 670 -57 199 -173 490 -286 -427 835 -882 -591 800
1562H00j761O58O85j351N86M78j96M7j097J290K06j320K115p37r70J455m50n19
$$ 800 -961 -303 382 -969 -383 95 -101 -54 -1151 139 345 -975 1140 403 -567 888 438 -81
1580h1N80m45L58j50m17R82j336K74J181j735Q76P10j858J118k12m05O72m57M0
$$ -81 499 54 412 262 -155 827 -509 -235 946 -789 87 797 -1061 57 -155 -560 112 -345 -305
1599c05%j63J008p06k98Q84r35P29P44j469P85J91o53Q15m52k8J67n31J059o07
$$ -305 -305 -468 540 -166 -464 420 -515 214 958 -511 274 465 -188 627 175 147 314 -217 842 235
1619B35j019J339j139n60J412o17j32L95o22O66j78M3P27j519R25P52j688J350
$$ 235 -784 555 -584 -1144 268 -349 -481 -86 -708 -42 -220 -177 550 -969 -44 708 -980 370
1637C70P6j134J081P8k69K71n71O72m55n98J636j338n72J664j178K64P09j147
$$ 370 446 -688 393 471 202 473 -98 574 119 -479 1157 -181 -753 911 -267 -3 706 -441
1655d41M67j75lM32q64J92L24j056J455j22j149J414o63J37R81j118K19J48l55
$$ -441 26 -149 -152 280 -584 -392 -68 -1124 331 209 -940 474 -189 -52 929 -189 30 178 -177
1674a77Q54p12L1O01r46O88L79j098O59k42p86J157n05l75L36p56J120m83k06
$$ -177 677 -35 -4 597 -349 339 718 -380 279 37 -749 408 -97 -472 -136 -892 228 -255 -461
1693d61N82p68J39J320j533P50L31o06M43k9J68J13o83M44K50p18J260r51o48
$$ -461 121 -647 -508 812 -721 29 360 -246 197 168 336 449 -234 210 460 -258 1002 51 -597
1712e97J328p40k08M86o66M04k38J3P02j299N23Q66j700J205K47q53N20J06l10
$$ -597 731 -9 -217 269 -397 7 -231 -218 484 -815 -292 574 -1126 79 326 -527 -7 99 -211
1731b11P65p38O26m4q79J447p63m94J118j081%R33q11J67J34m21N78p62L17L36
$$ -211 554 -184 442 398 -481 966 203 -291 827 -254 -254 679 -132 35 169 -252 326 -436 -119 217
1751B17j006O17J86p22J004n82J8Q84j271Q05j06n97J125o43k90J136j028L48
$$ 217 -789 -172 14 -708 296 -286 -268 616 -655 150 44 -553 572 -71 -361 775 -253 95
1769I5N59q10O46k17n80R31p39k14P22p80L52J95p31R71q09jQ37q97O6O73q96
$$ 95 654 -156 490 273 -307 624 -115 -329 393 -387 -35 160 -571 400 -409 -410 427 -470 -404 269 -627
1790f27N07J22m59J104p09L08J23p64J182n76o50J137p16j14M60o49P37k74n97
$$ -627 -120 2 -457 647 -62 246 369 -395 787 211 -439 698 -18 -132 328 -321 416 142 -455
1809d55Q75o89Q3O16j066M07L48p83M28k4k29O02o74O45M61r01J048m73q27J242
$$ -455 420 -269 -186 430 -636 -229 119 -664 -236 -260 -489 113 -561 84 545 -356 692 219 -608 634
1829F34n46j34N48m77L61k72n79J290p28j98N12q95M63K55p39O54n55j75P72p45
$$ 634 88 -46 502 25 386 114 -465 825 97 -101 411 -484 -21 234 -505 149 -406 -581 191 -554
1849e54K93N73j054Q35N1n91O80m74M51L20j096J242j83n97R27o98j11L76m12
$$ -554 -261 312 -742 93 144 -447 233 -241 210 530 -566 676 493 -104 823 125 14 390 -22
1868b2N08n10n56P67l24k88R35q91N5M74o57O39k00l76N33m61J82N89j242Q58
$$ -22 486 -24 -580 187 -137 -425 510 -381 -326 148 -509 130 -70 -446 87 -374 -192 397 -845 13
1888A3N82p80P21l14m26O92q03N08K11p42R32p68k22R78o39k52P03r57M27k57
$$ 13 595 -185 536 222 -204 488 -315 193 404 -338 594 -174 -396 582 -57 -309 394 -563 -136 -393
1908c93j02Q45j024K31Q37r77P27J48q61O49k89L45K05n52Q05o1r37J067m04k08
$$ -393 -495 350 -674 -443 394 -583 144 292 -569 80 -209 136 341 -211 594 533 -404 663 259 51
1928E1O56p43K21J05o70R48p67n44J225q56n5O21p61N17p0l17Q17q97K33P59j162
$$ 51 707 -36 185 290 -380 568 -199 -743 482 -374 -429 192 -569 -52 -122 -439 378 -519 -286 473 -689
1949f89Q79L92q73Q85m25o2M77n96M78l0j068J078j97p76J196p42j55O78q00M17
$$ -689 190 582 -291 594 169 107 584 -12 466 436 -632 446 249 -527 669 -73 -228 450 -350 67
1969F7k07l07O42r38M09N54o33L40M53q33O83j61k89R17j192O98K22m72M49m2
$$ 67 -140 -447 195 -743 -334 220 -413 -73 380 -453 230 69 -220 697 -495 203 425 -47 402 360
1989C60o03P83m71N4M03q07N22l60l00Q44n23l67M20m62M11q6n2N39p31m2J084
$$ 360 -243 540 69 123 526 -281 241 -119 -419 425 -98 -465 -45 -507 -96 -182 -234 305 -426 -468 616
2010F16j068L72N35q83O17J8k45N66o78O04K34j013J077n06o53J112n33n38O92
$$ 616 -452 -80 455 -428 189 207 -38 528 -150 454 688 -325 752 246 -407 705 172 -366 326
2029C26n54M48l79O7K85o28J93P10j053M88N16j048N86M85n56L32m84O17K48q97
$$ 326 -228 220 -159 -92 193 -435 -242 468 -585 -97 419 -629 -43 442 -114 218 -266 351 599 -298
2049b98R28k17p69J001m12LN85j136M86J37q62R58l51o12P56r52P31M3p44Q41
$$ -298 630 413 -356 645 233 236 821 -315 171 308 -554 404 53 -559 197 -755 -24 19 -725 116
2069A16n79o5J044n14k32N82q23L11O89n03K92p09Q82K51j133Q52j13o95P82M1
$$ 116 -463 -528 516 2 -230 352 -471 -160 529 26 318 -391 491 742 -391 461 348 -347 435 476
2089D76q14K87k84M50k99n19J240q34n97J200q14l0Q07p92L79J45L8L95p88L28
$$ 476 -338 -51 -335 115 -184 -703 537 -297 -894 306 -508 -538 269 -523 -144 1 39 434 -354 -26
2109b6O53j201J212l50q14R41j19k64M16l89k11K53l72O97o03n68J158q09K87
$$ -26 627 -574 638 288 -526 415 296 32 448 59 -152 101 -271 426 -177 -745 413 -396 -109
2128a09L89j194R98p2n55Q71l81l3L68p11P29n1n16P91q53J19R35r89N59L89p35
$$ -109 280 -914 84 12 -543 328 -53 -86 282 -429 300 249 -267 524 -329 -210 725 -264 295 684 -51
2149e1L40k74K59k03m29L14K76r57J114l96p39P30j8l47P26n81J61j17q5Q32r72
$$ -51 289 15 274 71 -358 -44 232 -725 389 -7 -746 -16 -34 -381 345 -236 -75 -192 -277 555 -417
2170d17K05Q43q16O20L42j157O13J61k1k23l81L39L2n96J150p45o60J269q48J73
$$ -417 -212 631 -185 435 777 -380 233 394 373 150 -231 108 140 -456 694 -51 -711 558 -290 -117
2190a17L88o94Q8K4J23L29m69O5P04r29P83K5r05J025l09l79Q53o55J81J82m61
$$ -117 271 -423 -335 -311 -188 141 -328 -263 441 -488 295 320 -585 440 131 -248 605 -50 131 313 -148
2211a48M38j68l06N93o94J31N79j104P95j24m87O37l20MK20n02Q43n39r9Q95p97
$$ -148 290 122 -184 409 -285 -154 425 -679 116 -8 -495 142 -178 -174 46 -456 387 -152 -251 644 -153
2232a53j50Q54m49QL20l68K73j50k62K66l89N11J13p59M68L67r57O67l09q2K57
$$ -153 -303 551 102 110 430 62 335 185 -77 189 -200 311 424 -335 133 500 -457 210 -99 -181 76
2253G6n73O10n7o15R10n74j42O57m80k8O08q90O37k0k82O36m73J89M49q46N36
$$ 76 -497 113 56 -559 351 -223 -365 292 -188 -216 392 -498 139 119 -163 473 0 189 638 -208 328
2274C28k61l94Q36o29j88K71k80K84n8n75P91m43k21M30n83M64K34l78O73r8p03
$$ 328 67 -327 509 -120 -308 -37 -317 -33 -91 -666 125 -318 -539 -109 -692 -228 6 -372 301 203 -500
2295e00J192j044L84J19m59M64j05j69O95o96J97M99q59L09J14l05L62j22l26
$$ -500 692 -352 32 151 -308 156 51 -118 577 -119 78 577 -282 27 141 -164 198 76 -250
2314b50N04j052P90J45o66N85k15l33P80m21k12N88n02N21l29o7L77m9j6K99q04
$$ -250 254 -798 -8 137 -529 56 -159 -492 288 -133 -345 243 -259 262 -67 -134 243 194 178 477 -327
2335c27N00n3m95O94l06k15N15o14L92n1m95P58n72o4P61n77j00M12n38O14l79
$$ -327 173 120 -375 319 13 -202 313 -301 91 40 -455 303 -269 -333 428 -149 -249 163 -375 239 -140
2356a40L01J04n16K24M12m10M65j01p18O66m98J53J89M7j07K80r03Q24n27j33
$$ -140 161 265 -251 -27 385 -25 440 339 -379 287 -211 -58 131 178 71 351 -552 272 -255 -388
2376c88L89m57K31L98p19O60n8n62P79m41K6L02l12Q4N32p04O35l67j92P44o67
$$ -388 1 -456 -225 173 -546 114 56 -506 273 -168 -142 160 -152 -68 464 -240 395 28 -164 580 -87
2397h7J79K75p66P94l32k42K17k01p2M07n91M61Mn36O97l90k21N78n38M77j25
$$ -87 92 367 -399 395 63 -179 38 -163 -235 172 -419 42 46 -490 207 -183 -404 174 -364 113 -12
2418a2l06P87o31J01M52o31K70L92o72O73l62n2K79k96m0J77l96N90m31l75Q28
$$ -12 -318 469 -162 -61 391 -240 30 422 -250 423 61 9 288 -8 -48 129 -267 323 -108 -483 345
2439C45q40K83L63r86J061l60l00O67n93M12K85n37K08K34p38Q99k97j28O54q53
$$ 345 -495 -212 151 -835 226 -134 -434 233 -360 52 337 -200 8 242 -496 403 106 -22 632 -221
2459b21J9N67l84L85k11m1J16m52Q5M13p46N77l44l25N69j66r1L87l06M58j17
$$ -221 -202 365 -19 366 155 114 230 -222 -137 276 -470 107 -237 -562 7 -159 -250 137 -169 289 172
2480A72l56Q3m5n3P51p04L21L09o63M09k1k12P8j67K43J02o06R07n39o45J030
$$ 172 -184 -101 -146 -199 552 -152 169 478 -185 224 203 -9 69 -98 145 247 -359 548 9 -636 394
2501C94m39l18O20o63N14p6l79M42k30n2O40n32N4K65n47M87J5k07K75m34J00
$$ 394 -45 -363 257 -406 108 32 -347 95 -135 -187 453 -79 -25 240 -307 180 195 -12 263 -171 -71
2522g1J65l83N59Ll68L67n34R5K75m18J86O9n35O69q6l86L47K4QJ12k26L63l86
$$ -71 94 -289 270 273 -95 272 -262 -167 108 -310 -124 -55 -590 79 -7 -393 -46 -22 -14 98 -128 235 -151
2545a51o8Q37n57l11M40j62K64R1m14L89n34K99K48o24J95L04p56M33L9k92M58
$$ -151 -219 618 61 -250 190 28 292 383 -31 358 -176 123 371 -253 -58 246 -510 -77 -38 -330 128
2566A28l90Q8K29m17M56l98j9N73m76L32K64m60J44J26k31M64k67j62K23k68L3
$$ 128 -262 -174 55 -362 94 -304 -323 250 -226 106 370 -90 54 180 -51 413 146 -16 207 -61 -28
2587b8M01n30L70l68j37O15p35L58r8N8L2m9l10L79k33L1L97n20O65r6m94O50
$$ -28 373 -157 213 -155 -292 323 -412 -54 -152 -94 -62 -111 -421 -42 -275 -244 153 -367 298 202 -292 358
2609C58k97j26QK24J0J12j62L17n64J96K10m90K48M0n13M75K9j90K9j62K22Rl19
$$ 358 61 -65 -57 167 177 289 127 444 -120 76 286 -204 44 84 -429 46 75 -115 -86 -248 -26 -17 -336
2632c36N30k34n01R15j79k55K6j12K92q7k09P22p35M4L23m45N44L28j086N51o1
$$ -336 194 -40 -541 374 195 -60 -34 -146 146 59 -150 572 -163 -119 204 -241 303 631 -455 96 35
2653C5j76L99m60J75m9m68M56j77j37M44j61q2L92m93R3N37m67M20k3q0j26k64
$$ 35 -141 258 -202 -27 -76 -544 -88 -265 -402 42 -119 -201 191 -302 -209 328 -139 281 258 178 52 -212
2675b12M29J42o17P14j80m30N66n09k40N73m29J96k09oO52p12K75L67p03J91M02
$$ -212 217 359 -258 456 276 -154 412 -97 -337 236 -193 3 -206 -212 440 -272 3 370 -333 -142 260
2696B60n27L53j32No4R7J18j28j36O52m47k27P46p18J56L73n63J39j34J62K55
$$ 260 -267 86 -46 -41 -105 -8 110 -18 -154 498 51 -176 570 -148 8 381 -182 -43 -177 -15 240
2717B40m54R8K57n43L91J62n80N36j04k37J68j39K84K7m62N96Qm27O40n71J42
$$ 240 -214 -116 141 -402 -11 151 -429 107 3 -234 -66 -205 79 106 -356 240 248 -179 461 -110 32
2738C2M34n14L26k09k17L00q4l2R3j49N1K72n42M45m25o2N73o45L24L29n89M17
$$ 32 466 -48 278 69 -148 152 68 36 129 -20 31 303 -239 206 -219 -281 292 -353 -29 300 -289 128
2760A28o0m51L43l82O55j89l47K84K34l54M97j46j28J40l28K51M0n11N80m07J2
$$ 128 68 -383 -40 -422 233 44 -303 -19 215 -139 358 212 84 224 -104 147 187 -324 256 -151 -139
2781a39K54o37M26Q2n5q4J63j87M69q36M89J60m26M74j49k39L63n6LL99k12k07
$$ -139 115 -522 -96 -14 -69 -153 10 -177 292 -544 -55 105 -321 153 4 -235 128 72 75 474 262 55
2803E5K14n71N59j96j99M25m59K62J27n52O09l53r1N05o07J87K27m52K91o3J10
$$ 55 269 -302 257 61 -138 287 -172 90 217 -335 274 -79 -170 335 -272 -85 142 -310 -19 -82 28
2824B8Q9j87J23J45m97M08K5l35O46j54k87J06k58K83k74j00N62j63m98N09l32
$$ 28 117 -70 53 198 -299 109 134 -201 445 291 4 110 -148 135 -139 -239 323 160 -338 171 -161
2845a61O6K38k47K7NL0J93l56J19k8j48J86J90j83K16j79K48q3m51N18Nk57M04
$$ -161 -95 143 -104 -77 -72 -42 151 -205 -86 -114 -262 -76 114 -69 147 -32 216 133 -318 200 205 -52 352
2868C52m11k41M40k43J72K1k30k8l6J98%j15j19L59l83J55L35k56N6j19J61J34
$$ 352 -59 -300 140 -103 69 90 -140 -168 -204 -6 -6 -121 -240 119 -264 -109 226 -30 26 -93 68 202
2890B02m72M33j8m42P90m24N6O4l28J70P2l84N02r1l19J66k12j27K43j58K67J41
$$ 202 -270 163 145 -297 493 69 125 189 -139 31 103 -281 221 130 -189 -23 -235 -362 -119 -277 -10 131
2912A31m06O29n12j29O34n76O05k13j92m4P0n3M45m31J08J48m66L78L8k82M22
$$ 131 -275 354 -158 -287 347 -229 376 163 -29 -73 -3 -56 389 -42 66 214 -252 126 164 -118 304
2933C04n28L12J03l96L43j7n77P09m73K0J68l77N40q7o54P32j39k35K58j64J89
$$ 304 -224 88 191 -205 138 121 -456 253 -220 -200 -32 -409 131 44 -610 122 -17 -252 6 -158 31
2954C1J57n25P04Pm48M95m51L24j83m23M83P2m88J81q9J08K16j56m1L1l07L11
$$ 31 188 -337 367 374 -74 421 -30 294 111 -312 171 243 -245 -64 -153 -45 171 15 -26 5 -302 9
2976Ik39k15O06l70K03L44m43M20k38j41K54k10K56r1m96O86j36j95K69k30k7
$$ 9 -230 -445 161 -209 -6 338 -105 315 77 -64 190 -20 236 145 -351 335 199 4 273 43 16
2997A6Kj57L04j53l22L96k62J0K90n49M80K7m36M96p7k65M44l04n1L82m21K06
$$ 16 18 -139 165 12 -310 86 -176 -166 124 -425 55 82 -354 142 65 -200 244 -60 -111 271 -150 56
3019E6K09k50L91k83q3K94n89L94j3l22K14k77J32K07m51L05J01l24L77p8l60
$$ 56 265 15 406 123 40 334 -255 139 126 -196 18 -259 -127 80 -371 -66 35 -289 88 10 -350
3040c50J75n3J2M92l37J16R7l39N10n62K12M27p44M64P5k67K53J04l69J66k48
$$ -350 -175 -228 -216 276 -61 55 152 -187 323 -239 -27 400 -344 120 195 -72 181 285 -84 82 -166
3061a66K76j54l27O36o32j0Q63n97q0J53j23j32L31j30J59p4m6L33l81K04k28
$$ -166 110 -44 -371 265 -367 -377 486 -111 -191 -38 -161 -293 38 -92 67 -7 -53 280 -101 103 -125
3082a25j37M81q0j78M30k33J17j36M3j46k08Q2L9j27K8K67m91M01O0k14K08l04
$$ -125 -262 219 139 -39 391 158 275 139 182 36 -172 -90 -51 -178 -150 117 -374 27 87 -127 81 -223
3104b23o6M40n09N64p3l75M66k62j31M10j51m6N0k43K00j66J23J73m86K00ok77
$$ -223 -289 151 -358 206 133 -242 224 -38 -169 241 90 44 94 -149 51 -115 8 181 -305 -105 -111 -388
3126c88N22l9k85O25l78m33J33m9L87J54l00K12k93K96K6j52M61j04p43M65l8
$$ -388 134 95 -190 435 57 -376 -243 -292 95 249 -51 161 -132 164 190 38 499 395 -348 117 79
3147G9l20K00J66P1k00k46K73J63m11N64m62Q2L05p33L95J85q3J69o24M29J61
$$ 79 -241 -41 125 196 -4 -250 23 186 -225 339 -123 -41 264 -469 -74 111 28 197 -427 2 163
3168A63k76M08l17j76K44K25k99K87p9L5K08n64O67n22j01J12j95OK87j37O0M1
$$ 163 -113 295 -22 -198 46 271 -28 259 180 215 423 -141 526 4 -97 15 -180 -174 113 -24 36 77
3190G7m56L45M2j89J77l97L99kk75N05k82J34K75m15R0P3j22K77j57p0K43k57
$$ 77 -379 -34 8 -181 -4 -401 -2 -4 -279 226 -56 78 353 -62 28 101 -21 256 99 29 272 15
3212A5NL12n41L92j61k16K09n4L2L1k36J85l4n2J03k03K9L92m06J62J26k32L6
$$ 15 20 332 -209 183 22 -194 15 -39 -7 24 -212 -27 -61 -113 -10 -213 -184 208 -198 -36 90 -142 -106
3235a06J53k49M86n23M77K74o81L67j2m55N43l18l9J36k10j17J2L0J70k56N0Q0
$$ -106 47 -202 284 -239 238 512 -169 198 186 -269 274 -44 -83 53 -157 -274 -262 -232 -62 -318 -268 -188
3257a88P0j46L22k85M33l52p9L25k21mK04k21J34n3j37M17k17r6J74J21r4N6l32
$$ -188 -118 -264 58 -227 206 -146 -225 100 -121 -125 79 -142 -8 -61 -198 219 2 -94 80 201 107 163 -169
3280a69J43L7l01K56JLR3l81K43J82m32M08l71L89K76m07O5J41k36J0j26N13L
$$ -169 -26 11 -290 -34 -33 -30 63 -318 -75 107 -325 83 -288 101 377 -30 35 176 -60 -50 -176 337 340
3303C40l89K63l1l76L81q4l14N76o46K42j07j20M47k36j68K59J00m70M50k07K61
$$ 340 -49 214 183 -193 188 104 -210 366 -280 -38 -145 -265 182 -54 -222 37 137 -333 117 -90 171
3324A71r6q2K38n22J40K19q7M8J30m42N68m83J70L32o01K25j9l50N48J24m23Q3
$$ 171 75 -7 231 -291 -151 68 -19 29 159 -283 285 -198 -28 304 -297 -72 -91 -441 107 231 -192 -109
3346a09k29K80O5k30L34j08l13N21l82j93N08j15k36J88k47N46q6l44K10m47O12
$$ -109 -338 -58 7 -223 111 3 -310 211 -171 -364 144 29 -207 -19 -266 280 194 -150 60 -387 225
3367B25q2l22K63O3k93M50l66K85J0l72J82j42k39M44l51J92K90k97J27m2j18
$$ 225 143 -179 84 147 -146 304 -62 223 233 -139 43 -99 -338 106 -245 -53 237 -60 67 25 -93
3388i3J98Q4l13J94l8o7L16j67n5p3j07M21m32rO30q77L80j03k01L06j61j00K74
$$ -93 105 189 -124 70 32 -35 281 114 59 -14 -121 300 -132 -141 489 -388 -8 -111 -312 -6 -167 -267 7
3411Gl35M78l26o9M85n89K94K17J7k27K36k63M13m37K27L7J05j61J20m50K00L1
$$ 7 -328 150 -176 -245 240 -349 -55 162 179 -48 188 -75 338 -99 128 165 270 109 229 -221 -21 10
$$ [...]
8191a30
##END NTUPLES=NMR FID
##END=
