##TITLE=1H_Ser 5-6-V
 CDCl3
 8 sc, 
 8.02.2022
##JCAMPDX= 6.0         $$ Bruker NMR JCAMP-DX V2.0
##DATA TYPE= NMR FID
##DATA CLASS= NTUPLES
##ORIGIN= UXNMR, Bruker Analytische Messtechnik GmbH
##OWNER= root
$$ XWIN-NMR		Version 3.5
$$ Tue Feb  8 14:04:09 2022 Russian Standard Time (UT+4h)  she@DPX200
##.OBSERVE FREQUENCY= 200.131346
##.OBSERVE NUCLEUS= ^1H
##.DELAY= (6, 6)
##.ACQUISITION MODE= SIMULTANEOUS
##.ACQUISITION SCHEME= undefined
##.AVERAGES= 8
##.DIGITISER RES= 18
##SPECTROMETER/DATA SYSTEM= spect
##.PULSE SEQUENCE= zg30
##.SOLVENT NAME= CDCl3
##.SHIFT REFERENCE= (INTERNAL, CDCl3, 0, 15.7039)
##AUDIT TRAIL= $$ (NUMBER, WHEN, WHO, WHERE, WHAT)
$$ ##TITLE= Audit trail, XWIN-NMR		Version 3.5
$$ ##JCAMPDX= 5.01
$$ ##ORIGIN= Bruker BioSpin GmbH
$$ ##OWNER= she
$$ F:/spectra/data/she/nmr/H-F/1/audita.txt
$$ ##AUDIT TRAIL=  $$ (NUMBER, WHEN, WHO, WHERE, WHAT)
(   1,<2022-02-08 14:02:44.62 +0400>,<she>,<DPX200>,
      <created by zg, POWCHK disabled, PULCHK disabled
       configuration hash MD5:
       00 E9 B6 7A A2 85 ED C7 34 08 36 98 17 FE 4E 26
       data hash MD5: 16K
       D0 F9 E5 01 63 E9 C5 63 6A BF 85 52 75 05 64 78>)
$$ ##END=
$$ 
$$ hash MD5
$$ ED D4 A9 8A 7B 23 E5 87 81 82 C7 1D F3 BB F2 2C
##$RELAX= 
##$RELAX= 
##$RELAX= 
##$RELAX= 
##$RELAX= 
##$RELAX= 
$$ Bruker specific parameters
$$ --------------------------
##$DU= <F:/spectra>
##$EXPNO= 1
##$NAME= <H-F>
##$PROCNO= 1
##$TYPE= <nmr>
##$USER= <she>
##$AMP= (0..31)
100 100 100 100 100 100 100 100 100 100 100 100 100 100 100 100 100 100 
100 100 100 100 100 100 100 100 100 100 100 100 100 100 
##$AQSEQ= 0
##$AQ_mod= 1
##$AUNM= <au_zg>
##$AUTOPOS= <>
##$BF1= 200.13
##$BF2= 200.13
##$BF3= 200.13
##$BF4= 200.13
##$BF5= 200.13
##$BF6= 200.13
##$BF7= 200.13
##$BF8= 200.13
##$BYTORDA= 1
##$CFDGTYP= 0
##$CFRGTYP= 5
##$CHEMSTR= <none>
##$CNST= (0..31)
1 1 145 1 1 1 1 1 1 1 1 1 1 1 1 1 1 1 1 1 1 1 1 1 1 1 1 1 1 1 1 1 
##$CPDPRG= <>
##$CPDPRG1= <>
##$CPDPRG2= <>
##$CPDPRG3= <>
##$CPDPRG4= <mlev>
##$CPDPRG5= <mlev>
##$CPDPRG6= <mlev>
##$CPDPRG7= <mlev>
##$CPDPRG8= <mlev>
##$CPDPRGB= <>
##$CPDPRGT= <>
##$D= (0..31)
0 1.2 0 0 0 0 0 0 0 0.06 0 0.03 0 0 0 0 0.0002 0 0 0 0 0 0 0 0 0 0 0 0 
0 0 0 
##$DATE= 1644314564
##$DBL= (0..7)
120 120 120 120 120 120 120 120 
##$DBP= (0..7)
150 150 150 150 150 150 150 150 
##$DBP07= 0
##$DBPNAM0= <>
##$DBPNAM1= <>
##$DBPNAM2= <>
##$DBPNAM3= <>
##$DBPNAM4= <>
##$DBPNAM5= <>
##$DBPNAM6= <>
##$DBPNAM7= <>
##$DBPOAL= (0..7)
0.5 0.5 0.5 0.5 0.5 0.5 0.5 0.5 
##$DBPOFFS= (0..7)
0 0 0 0 0 0 0 0 
##$DE= 6
##$DECBNUC= <off>
##$DECIM= 32
##$DECNUC= <off>
##$DECSTAT= 4
##$DIGMOD= 1
##$DIGTYP= 9
##$DL= (0..7)
0 120 120 120 120 120 120 120 
##$DP= (0..7)
150 150 150 150 150 150 150 150 
##$DP07= 0
##$DPNAME0= <>
##$DPNAME1= <>
##$DPNAME2= <>
##$DPNAME3= <>
##$DPNAME4= <>
##$DPNAME5= <>
##$DPNAME6= <>
##$DPNAME7= <>
##$DPOAL= (0..7)
0.5 0.5 0.5 0.5 0.5 0.5 0.5 0.5 
##$DPOFFS= (0..7)
0 0 0 0 0 0 0 0 
##$DQDMODE= 0
##$DR= 18
##$DS= 0
##$DSLIST= <SSSSSSSSSSSSSSS>
$$ [...]
##$SUBNAM2= <"">
##$SUBNAM3= <"">
##$SUBNAM4= <"">
##$SUBNAM5= <"">
##$SUBNAM6= <"">
##$SUBNAM7= <"">
##$SUBNAM8= <"">
##$SUBNAM9= <"">
##$SW= 18.0517287032376
##$SWIBOX= (0..15)
0 0 2 0 0 0 0 0 0 0 0 0 0 0 0 0 
##$SW_h= 3612.71676300578
##$TD= 16384
##$TD0= 1
##$TE= 0
##$TE2= 300
##$TE3= 300
##$TEG= 300
##$TL= (0..7)
0 120 120 120 120 120 120 120 
##$TP= (0..7)
150 150 150 150 150 150 150 150 
##$TP07= 0
##$TPNAME0= <>
##$TPNAME1= <>
##$TPNAME2= <>
##$TPNAME3= <>
##$TPNAME4= <>
##$TPNAME5= <>
##$TPNAME6= <>
##$TPNAME7= <>
##$TPOAL= (0..7)
0.5 0.5 0.5 0.5 0.5 0.5 0.5 0.5 
##$TPOFFS= (0..7)
0 0 0 0 0 0 0 0 
##$TUNHIN= 0
##$TUNHOUT= 0
##$TUNXOUT= 0
##$USERA1= <user>
##$USERA2= <user>
##$USERA3= <user>
##$USERA4= <user>
##$USERA5= <user>
##$V9= 5
##$VALIST= <valist>
##$VCLIST= <CCCCCCCCCCCCCCC>
##$VD= 0
##$VDLIST= <DDDDDDDDDDDDDDD>
##$VPLIST= <PPPPPPPPPPPPPPP>
##$VTLIST= <TTTTTTTTTTTTTTT>
##$WBST= 1024
##$WBSW= 4
##$XGAIN= (0..3)
0 0 0 0 
##$XL= 0
##$YL= 0
##$YMAX_a= 42791
##$YMIN_a= -72781
##$ZGOPTNS= <>
##$ZL1= 120
##$ZL2= 120
##$ZL3= 120
##$ZL4= 120
##$ABSF1= 10
##$ABSF2= 0
##$ABSG= 5
##$ABSL= 3
##$ALPHA= 0
##$AQORDER= 0
##$ASSFAC= 0
##$ASSFACI= 0
##$ASSFACX= 0
##$ASSWID= 0
##$AUNMP= <proc_1d>
##$AZFE= 0.1
##$AZFW= 0.1
##$BCFW= 1
##$BC_mod= 2
##$BYTORDP= 1
##$COROFFS= 0
##$CY= 11.3945322036743
##$DATMOD= 1
##$DC= 2
##$DFILT= <>
##$DTYPP= 0
##$F1P= 2.36226072786647
##$F2P= -0.459571619588291
##$FCOR= 0.5
##$FTSIZE= 0
##$FT_mod= 4
##$GAMMA= 1
##$GB= 0.15
##$INTBC= 1
##$INTSCL= 1
##$ISEN= 128
##$LB= 0.24
##$LEV0= 0
##$LPBIN= 0
##$MAXI= 10000
##$MC2= 0
##$MEAN= 0
##$ME_mod= 0
##$MI= 1.114404
##$NCOEF= 0
##$NC_proc= 0
##$NLEV= 6
##$NOISF1= 3.799351
##$NOISF2= 2.8
##$NSP= 1
##$NTH_PI= 0
##$NZP= 0
##$OFFSET= 15.70392
##$PC= 1
##$PHC0= -15872.86
##$PHC1= 22.00078
##$PH_mod= 1
##$PKNL= yes
##$PPARMOD= 0
##$PSCAL= 0
##$PSIGN= 0
##$REVERSE= no
##$SF= 200.130013532006
##$SI= 16384
##$SIGF1= 3
##$SIGF2= 2
##$SINO= 400
##$SIOLD= 16384
##$SREGLST= <1H.CDCl3>
##$SSB= 0
##$STSI= 0
##$STSR= 0
##$SW_p= 3612.71676300578
##$SYMM= 0
##$S_DEV= 0
##$TDeff= 0
##$TDoff= 0
##$TI= <>
##$TILT= no
##$TM1= 0
##$TM2= 0
##$TOPLEV= 0
##$USERP1= <user>
##$USERP2= <user>
##$USERP3= <user>
##$USERP4= <user>
##$USERP5= <user>
##$WDW= 1
##$XDIM= 8192
##$YMAX_p= 0
##$YMIN_p= 0
$$ End of Bruker specific parameters
$$ ---------------------------------
##NTUPLES= NMR FID
##VAR_NAME=  TIME,          FID/REAL,        FID/IMAG
##SYMBOL=    X,             R,               I
##VAR_TYPE=  INDEPENDENT,   DEPENDENT,       DEPENDENT
##VAR_FORM=  AFFN,          ASDF,            ASDF
##VAR_DIM=   8192,          8192,            8192
##UNITS=     SECONDS,       ARBITRARY UNITS, ARBITRARY UNITS
##FACTOR=    0.0002768,     1,               1
##FIRST=     0,             0,               0
##LAST=      2.2672688,     0,               0
##MIN=       0,             -72781,          0
##MAX=       2.2672688,     42791,           0
$$ Real data points
##PAGE= N=1
##DATA TABLE= (X++(R..R)), XYDATA
0@%%%%%%%%%%%%%%%%qJ6j6J6j6K4l2L2l9M7m9N7p2Q1q9J04j20J36j53J70j92K16
38A13k42K73l04L37l73M12m56N05n58O16o79P49q26R10j002J104j220J350j495
57g86J661j854K080k348K671l075L592m279N248o730R293j4967N2095k5257o2950
72d5606O4777M852k2473J1728K177m7052R629L9152n855k7034R537M802m815O095
86h6O195j1655l01J0254k144j2554O573J1827o305p741J1251K506j0578M013R138
101A0393j1208p223J1831N425j0530o769J152P306P678p518j2612M414P254m70
115h77M440J610j2628l715J3282N977p293m186J548P88j222J885P238L62j0214
130c005j222R850q57m245M551l516q490O383M649q208K080P216p699m083J0069
$$ y = [0, 0, 0, 0, 0, 0, 0, 0, 0, 0, 0, 0, 0, 0, 0, 0, 0, -8, 8, -8, 8, -8, 16, -16, 16, -23, 24, -25, 32, -40, 41, -48, 56, -64, 72, -81, 89, -103, 113, -129, 144, -160, 177, -196, 216, -240, 265, -293, 323, -356, 393, -433, 477, -525, 579, -641, 709, -786, 875, -979, 1101, -1247, 1424, -1651, 1941, -2338, 2910, -3820, 5473, -9494, 42601, 17344, -45606, 19171, 24023, 1550, 13278, 15455, -31597, -21968, 17184, 11329, -15705, -6168, -1366, -6181, -86, 6109, -5546, -5847, 4407, 2263, -10291, -3718, 8109, 1804, -5937, 5314, 7820, -2758, 1255, 10393, -815, -8038, 3793, 9218, -1312, -8081, -6929, 377, 8055, 537, -12075, -7661, -407, -877, 3563, 5173, -7455, -11170, 2112, 8089, 796, -3390, -1842, -1054, -2276, -391, 6847, 7209, -3005, -4227, 5623, 4766, 521, 5072, 1556, -6934, -551, 4098, -4110, -2030, 5186, -2513, -6596, 3473]
145C473j404p941O473L301j0289M33Q903j749m169M096K710k237q42J839K60k241
161F16n76J703j477m319L91M170K037J27j478l301J766N969M90m067k142j700
177a791K27L123q85l439J098o9k785J378K516p04J560J19m748O43O722J041k955
194A051o33j578j75M390P81l665m92L72r24K411N80l370J81K185k300j643J148
211a681j211q8L263j098l539K289K940j79J356L33k442J11J982J41m75N07j88
228B021j469m80P77J875R24k278k405n15J41J530P99k553j850J021L85P15K115
245G53o21j967O04O04l23J308J206j770l18J352n13L79K007m89j647K96o79r75
263g93J507L60j281p04k14j40Q21N97m49n93l11j043P16J611j19j84L04q59J82
$$ y = [3473, 2069, -5872, 601, 3902, -6387, -5954, 2949, 1200, -2969, 1127, 3837, 1600, 758, 2597, 2857, 616, 40, 1743, 266, -4053, -3662, 508, 2545, 2672, 1194, -2107, -341, 5628, 6118, 2051, -91, -1791, -1564, 1559, 674, -2765, -1667, -1736, -4521, -3143, -627, -1331, 229, 348, -4400, -3757, 2965, 4006, 1051, 418, -1160, -1335, 3055, 3836, 171, -321, 51, -873, 1538, 2118, -1252, -1071, 1114, -1186, -2829, -1681, -2892, -2980, 283, -815, -4354, -2065, 875, 696, 2052, 2385, -57, 54, 2036, 2177, 1702, 2209, 2021, 552, 72, 849, 2724, 3648, 1370, -1035, -1550, -1409, 121, 920, -1633, -3483, -2462, -2077, -1362, 753, 132, -1835, -1231, -627, -950, 358, 1564, -206, -524, 828, 315, 694, 2701, 2212, 565, 861, 182, -793, 714, 1074, -207, -911, -1125, -1265, -444, 153, -296, -889, -1200, -2243, -1527, 84, -35, -219, 85, -774, -592]
282e92J595K96j60O4j185o44J186R19n14L51j4j418P0J533Qq98p4j289n83P07
302f42j75K62N56j278n32M47P06K26J65j87q65j75J005Q45P29k08m76K8K87J87
322I05O07N42j424p74J9J53M87K61l96q04m48k72K2Q21l37q39m94M10L7J143R28
343E47o7o68%M36N73L56j87m1m72MN08P88L83o11p03l09l99k38K50l25j181q07
365b163o1Q07M41L38N2j78j39K46O24P19k19o66K33J3K90M74Q80O1j073k04L68
386H43M01L18n83r89o07K2K45p5l0o65o18L82J25j76N32R68m19p38L70J000J80
407D86l1N0p19k91L36N13P0J01J14m70P5N43j3O8N85j302j616P59J376n45o52
428e63M63r46N0J660L92j528K2J94n58M05L50p49J114Q13j105L8K089K80r42K37
$$ y = [-592, 1003, 1299, 1139, 1203, 18, -626, 560, 1479, 965, 1316, 1302, -116, -46, 1487, 1495, 597, 523, -766, -1349, -642, -817, -555, 1, -1277, -1809, -1362, -656, -430, -265, -452, -1317, -1492, -487, 358, 1087, 879, 403, 431, 718, 905, 1512, 2054, 630, -144, -125, 28, 515, 776, 380, -424, -872, -1144, -1122, -301, -638, -1477, -1971, -1561, -1524, -381, 547, 480, -188, -188, 248, 821, 1177, 990, 949, 477, 481, 989, 1777, 2160, 1549, 846, 537, 138, -100, 150, -175, -1356, -2163, -2224, -1417, -976, -638, -586, -764, -903, -657, -33, 686, 467, -199, 34, 47, 337, 811, 1691, 1752, 679, 475, 843, 1244, 1562, 979, -10, -617, -595, -350, -425, -455, -1120, -1738, -1356, -1231, -1407, -875, 93, -326, -1064, -694, 306, 486, 455, 505, -214, -505, -169, 344, 414, 515, 629, 159, 234, 777, 764, 832, 1417, 115, -1501, -742, 634, 89, -563, -100, -1046, -996, 664, 1056, -472, -450, -256, -814, -409, -59, -808, 306, 1119, 14, 52, 2141, 2421, 1479, 1716]
448A716j87j133M41P47j526r54P66N3l04l55n82L65J305k95k402R1J363M38o5
467e18r1r07n23J793J995p46j363J7J206N29j28m82m14M21P2j367O5J152o30o45
487e64O63j137j038K308J344k380j360K024j61m62P70j037n93J973M24j649J175
504C00J469o58M95Q92k034k49K595l12k702j93L75m42J087nj785j39J291p50M0
523g25O04j264n21J640K46j702Q86K178m98p20R32m2m12Q22M71j118q54J36n8
542Am45J175P7j495n5N33k53J044R16k094j622J445J020n76J14n69j716J142J980
561F22j119l31J003q55o8K361m29k126J757N98k084P17J707k025p93K186m98j217
579e94J372l60j764J406J133j541m84j41j013J157K409j072k168K01J268J179
$$ y = [1716, 1529, 396, 837, 1584, 58, -896, -130, -77, -381, -736, -1318, -953, 352, 57, -2345, -2254, -891, -453, -518, -609, -1516, -2039, -246, 1749, 1003, -360, -343, 863, 1392, 1264, 782, 368, 789, 861, -506, -441, 711, 81, -564, 99, -1038, -2076, 232, 1576, -804, -2164, -140, -301, -763, 7, -1030, -1623, 350, 774, -875, 300, 1769, 1111, 1606, 2498, 464, 215, 2810, 2498, -204, -397, -22, -464, 623, 618, -1167, -1306, -15, -765, -725, -121, -1385, -1906, -266, -20, -1722, -836, 1342, 844, 124, 1056, 1014, 602, 1424, 1895, 777, -77, 59, 1, -444, 731, 808, -687, -742, -209, -462, 582, 1498, -596, -2218, -773, 247, -329, -215, -784, -2500, -1358, 622, -497, -828, 175, -680, -748, 1613, 1184, -942, 815, 1413, -671, 46, 1753, -272, -1065, 1121, 623, -594, 778, 418, -1346, 60, 1193, -348, -832, -973, -1986, -829, 1580, 508, -1660, -1459, -191, 988]
595I88J342p47k743J51J988Q03p00m36j028k99J401J031j033n09M49n34p19R55
613C60K53j163n25O92n42l23J055r9j171P21P56q00J05M15n66N99J490j159q44
632g46J161L61O8J160n83k628J096J777r47p23O45k119l61K125j62j513P10l3
650g12j324R36J579r16m7J045q83l94J227O57p38JR3m61L19O33l66J25J47o35
670B86k80M12K03m04m35k72n54o6P52L32m68n17L79k72J71J167l1r21K50L47l27
691b48P39O74o67n4P51q55m85J228p0j021L73k75r09P37P48q45l00R7q61J94J254
712B05k98r24L92k55n14J690Q42j338j50L51l12N59R47m54o23J73j66K74M96K05
732A100o66k94j31j98L2K69k10l57j34k16J13qM17N01o15m06M65K80o8L57J08
$$ y = [988, 2330, 1583, -1160, -1009, 979, 1782, 1082, 646, -382, -681, 720, 1751, 718, 209, 658, 124, -595, 360, 613, -550, -1075, -383, -925, -1248, -193, -292, -1463, -742, 14, -786, -681, -266, -832, -233, 1257, 98, -746, 415, 776, 844, 2004, 1421, -1207, -111, 1666, 719, -4, 641, -1478, -1839, 286, 124, -1389, -679, -712, -2036, -1100, 479, -437, -484, 561, -322, -716, 511, 1168, 430, 431, 524, 63, 382, 1015, 649, 774, 921, 286, 6, 418, 621, 217, -218, -490, -1044, -1110, -358, -26, -494, -1011, -632, -904, -733, 434, 403, -518, -268, 79, -248, 491, 1165, 498, 444, 1195, 340, -145, 1083, 1013, -8, 365, 90, -819, -82, 666, -179, -479, -382, -1243, -1049, 205, -93, -1017, -625, -880, -1394, 296, 1138, -200, -350, 1, -311, 248, 1195, 741, 118, 291, 125, 399, 895, 1100, 434, 140, 9, -189, -157, 112, -98, -455, -589, -805, -692, -700, -283, 218, -397, -803, -338, -58, -126, 231, 339]
753C39m35q3M14m0P78L24p26o90M16J10J55M43n91r71K73K26k48L61p3o90k10
774i18R7l3O46M26o60l83L96K11J85O58P7o76J4K2K21O04q8j18k47o8j62L59O09
797A172n12n94l89O2k00L75j23k71l20k91K87O65K20k76K19l66q4N30O18j65k21
818C36K5j80J81N35J26k19j0r75j25O60rm09J03n39m47L28L80R4J4n38j65N3J73
841f08M02L2Q3l55k51N00Q28N6p2l79mJ42K66K00l3l21o24M2j12K29R5K41o62
864c05m61K8L34L60Q4l42m08K12j40M63L93l4o34J19L71M4N14K76J2k58l17J43
886D54K67J13l33l07m57k77M16M04l28m19R3r9j3K59J33k45j5j35k64N25L06M1
908A19n8q1j81R2Q09K33m67k04l0j36L10P4o5k15j99k59j09L65j1j34k42k15l65
$$ y = [339, -96, -179, 235, 195, 973, 1297, 571, -119, 297, 407, 562, 1005, 414, -557, -284, -58, -306, 55, -18, -708, -918, -821, -854, -208, 218, -442, -825, -429, -218, -33, 625, 702, 26, 40, 62, 283, 887, 799, 681, 434, 366, 204, 563, 1172, 660, 66, -323, -261, -461, -86, -209, -480, -800, -1091, -804, -139, 81, -195, 24, -342, -426, 104, 722, 557, 336, 361, 181, 362, 897, 1023, 804, 794, -181, -306, 354, 345, -64, 39, -500, -947, -619, -239, -145, -131, -669, -834, -781, -608, -206, -174, -91, -446, -697, -197, 631, 687, 615, 236, 232, 374, 640, 840, 807, 486, -138, -96, -208, 21, 116, 357, -305, -766, -738, -404, -44, 40, -302, -710, -498, -638, -175, 218, 184, -450, -331, 40, 84, 598, 874, 886, 628, 311, 454, 721, 834, 501, 194, -263, -540, -124, 280, -48, -467, -374, -473, -486, -227, -94, -339, -354, -489, -753, -228, 78, 119, 61, -20, -201, -109, 700, 933, 466, 262, 232, 96, 406, 480, 415, 200, 1, -258, -367, -2, -13, -147, -389, -604, -969]
931i69K73N21Q2l72p7M3J9N20K43J5l0k04p5J84P04k47j36O0l50m06O99M19n04
954D12n14j33J03n6M76l87l94k36J57j02N15o3j99J48L28m80K77P65K28m38j8
975C89O9l21%O61j28o23J17r8k36N11J57n53l32J72m25j2J102m05r97M9L52o4
997f15J89O51m17o93O54L42J9M53j48o76M62O00o42J59N80m65p03N05K34p88L99
1018A00N41q29j93J57l77J53L34j00n25J46o5k9J065L78r80n31P96K69q3P00n56
1039C71l34M1M75m3m1R4m29j72N72l92n12N21K3r01K93O35m27m55O83r2o44M79
1061b55J17j96K53M32p56J1P37m64j7J299l66j272M91O48m03L27J70j196l94J132
1081B98K33q00J88k81o32Q18M83q35j73M77k05k20J012j36p27O39M21n24q8M42
$$ y = [-969, -696, -175, -93, -465, -542, -499, -480, 40, 283, 298, 268, 64, -11, 173, 877, 630, 494, 554, 204, -202, 497, 916, 412, -102, -235, -132, -188, 288, -99, -493, -729, -572, -674, -159, -222, -421, -273, 55, -425, -148, 617, 845, 407, 389, 458, 137, 137, 798, 670, 47, 164, 66, -170, 341, 498, -55, -387, -215, -640, -652, 450, 45, -952, -903, -551, -615, -426, 225, -192, -885, -231, 111, 130, 583, 435, -241, 221, 821, 179, 338, 918, 453, -250, 255, 489, -299, 100, 641, -188, -381, -224, -601, -448, -114, -214, -739, -593, -658, -687, 378, 756, -224, -755, 41, 310, 227, 927, 371, 37, 78, 553, 510, 469, 563, 134, -38, 534, 142, -370, 151, 174, -727, -434, 201, -226, -681, 2, -90, -734, -255, -138, -334, -81, 351, -405, -394, 343, -121, -138, 1161, 795, -477, 14, 662, 259, 586, 756, -440, -834, 298, 531, -269, -81, -362, -994, -176, 307, -528, -701, -224, -429, -649, 363, 227, -500, 139, 560, 36, -52, 390]
1101C90k84K99M82l29o27L81J50l98L54O7o86l46M42K25l43L25m23o42Q5J079
1121B01k72j65Jm81N7R71L43q19J69K86l41K78P81o73l19O68k60m08N64j93p30
1142c42M22M93q46l88N98j56j66M77n69n40M48P22l43j35L28n79J47J044j49n87
1162a21M03j22l67O92L93n02j16m2p2q1M02j13n12OJ21m47K27J71l17j91K88J27
1184a73m52L24M44l91j17L93j83n7M78M11m48M6J77m06M78K30m47l37L29n90J21
1205a70M84j95m82J03N9l25L98K36n99l45O12K1j14L77N2m26L80J19k74J15M61
1226D87j92j31K09k1l51K76K03l63j62J68l13J58J77j54l25p2p8J24O8R9k92n1
1248e36K67K89P3j08K33k94j9L97j54K89M2k07r3J29K1n6L1J31l83k37J81l5k08
$$ y = [390, 106, 405, 887, 558, -69, 312, 462, 64, 418, 485, -201, -547, -105, 120, -223, 102, -321, -963, -878, 201, -71, -236, -235, -716, -659, 312, 655, -164, 5, 291, -50, 228, 1009, 336, 17, 685, 425, 17, 581, 388, -342, 80, 573, -273, -661, -63, -219, -385, 92, -477, -1017, -569, 153, -190, -325, 3, -576, -429, 615, 466, -121, 282, 160, -207, 485, 878, 376, 260, 218, 146, 65, 467, 354, -158, -152, -31, -478, -251, -80, -397, -588, -300, -173, -625, -301, 143, -248, -365, 28, -155, -212, 266, 677, 229, 275, 452, 46, 524, 754, 307, -30, 299, -291, -170, 314, 119, -363, -260, -201, -526, -128, 108, -491, -836, -224, -203, -317, 60, 112, -314, 66, 185, -89, 26, 487, 295, 164, 373, 352, 1, 277, 480, 117, -45, 123, -190, -32, 145, -9, -334, -406, -484, -360, -292, -193, -485, -536, -269, 20, 93, -15, 218, -76, -95, 302, 148, 437, 479, 272, 179, 308, 329, 273, 304, 435, 52, -185, -4, -39, -247]
1271b47K08k8m96K88J11j90J15K18k06k7J5J19R2K36o5m54K80K79j64M85k78j66
1293A25K1J80j12K0k6j60j96j3J44j89J94k12l9j94qJ69R1M4o6j85L15l3J15J53
1317A38M3j4l0J49m8Q4j4J95l65J4j3n3K4j29j1j51j29K54K04k22k01j84k1K33
1341b47J02j88J4Q6l2J82J16L16j31N3q6j68K19J1Q7J24k91j26p7J98j20Kq6k38
1365b80N9j2J00K4k67O5p5J07M5J30Q5o8j85J30Q0J63J91m1L1j64mJ24J51k95
1389I4jj0ML6n3n6k01j27J04k00K20mk4k32J48P4M2L14J19k87j0K54k60J36K88
1414C68j40p6Q5M7k72M56j4k17j82L4l5k7M2k5m52P3oQ0J52Pk82L9J75j15K53
1439c2m1Q8o6o1K7K30K24P8j69j73j6R1P0Q7J10m87M4K72l32l6J54k03k02N7q2
$$ y = [-247, -39, -67, -563, -275, -164, -354, -239, -21, -227, -254, -239, -120, -28, 208, 143, -311, -31, 248, 84, 569, 291, 125, 146, 326, 214, 234, 208, 48, -148, -161, -17, -206, -12, -224, -263, -457, -465, -296, -205, -161, -227, -412, -97, -130, -15, 138, 181, 167, 137, 286, 238, 322, 308, 503, 138, 152, 139, 86, 110, -19, -30, -181, -310, -56, 148, -74, -275, -459, -480, -247, -145, -333, -319, -233, -265, -83, 33, 349, 218, 271, 185, 17, 236, 247, 334, 458, 167, 41, -36, 162, 42, 44, -42, -280, -221, -233, -133, -109, -376, -311, -386, -279, -234, -104, -19, -87, -272, -142, -62, 101, 292, 251, 282, 118, 114, 238, 389, 94, 93, 83, 87, 123, 70, 14, -187, -314, -210, -410, -190, -194, -218, -450, -302, -228, -186, 128, 247, -40, -50, 204, -56, 80, 368, 228, 152, 237, 284, 12, 468, 454, 237, 55, 89, 54, 27, 69, 44, -408, -335, -341, -261, -109, -102, -384, -345, -170, -285, -32, -73, 15, -51, -112, -85, 145, 369, 447, 278, 105, 89, 180, 250, 337, 447, -40, 4, 276, -56, -92, 62, -141, -343, -286, -368]
1464c68K9K55K49m63J12j3j25M09L61l19j83R5K03L6J37J03l14j82K29K9l08L44
1486C16j91k55Q3J40m08M3L14l93k31M62m7j80K70%j28J35Q3j60K67K12r7j74
1508F1J97Q1l1K03l5m50q3K03j68J45R2k68m35J49K78n8j13J24m03k35P28q2J
1531i9n6J22k90L74K40k3k44K00j3k76K03J31m37L93J37m86L4K51j96N9J31k44
1553h9m08K35L44k42j31J51l96M9N65n0j56Q2j2l31L91M22k69J5K74m71L2O57
1575F62l19m53K43Q6k98K01M9l14j87M44j58l39J14J23j83K47J32n47J18M33N
1596E9l47M51l74q8M43L41l13j64J84k38k4N35r5m35K67k08q4K63L0k75n40N92
1618b0j6l41L18j87k06K26K33k09k8K97J76l95K65K28l99K24L54l02q4K41m62
$$ y = [-368, -339, -84, 165, -298, -186, -199, -324, 85, 446, 127, -56, 39, 242, 278, 415, 518, 204, 22, 251, 280, -28, 316, 125, -130, -47, 93, -315, -272, 42, -351, -582, -120, -167, -347, -77, -77, -205, -70, 13, -147, 120, 332, 235, 61, 258, 339, 308, 511, 476, 26, -57, 146, -22, 123, 215, -53, -488, -339, -61, -119, -232, -108, -511, -746, -18, -100, -99, -155, -33, -323, 51, 291, 268, 24, 224, 211, -65, 138, 269, -168, 225, 362, -124, -90, 161, -35, 24, 155, -89, -497, -262, 82, -160, -291, -140, -536, -487, 78, 28, -128, -46, -58, -389, 2, 424, 155, 170, 444, -27, 5, 662, 343, -110, 133, 219, -79, 122, 171, -143, -330, 114, -44, -383, -269, -146, -329, -82, 50, -497, -379, 54, 59, -288, 163, -211, -299, 144, 485, 172, 8, 192, -46, -70, 465, 370, -65, 202, -6, -90, 173, 203, -72, -612, -20, -36, -377, -59, -246, -452, -226, 7, -202, -230, 67, 243, -152, 113, 341, -58, 166, 520, 218, 134, 375, -87]
1639h7k7N65j57m38J95r1j56L07K26n03k39K14j2J19J84l78l43L45L10l34L88
1660H8J11k66M6L50r0k83J93K03l42K77Pl01j3K28j57j33R1q9k05K99J90l96l60
1683e52K77j99J78L40j05j09j22J92n4L38K14k87l25N23k80R9K48j44m65L71J88
1704C26k93k6J22m6l34K26j05k44J84J68m04R6J48j95K38K24j67j21R4J18q3M17
1726C43K5l30j48M69n9J2k1M0l21j58L55k58J93j64k71j95K70J81j46N5M3l87
1748d72K81o9L43j32J65j46j20J58J99j70L14j65n1o1J04K66l31J75j44l43Q7
1769a12K02k24J5O7k33lK87k83J70kP4j51J15J0Q5JJ0r2j24L33J91j31Q7M1k55
1794G8J55L8p3j9J08l45l5J26j8K3j76p1L7r5J36R9r6p1Q7m6r3K58o4j9O0j0O6
$$ y = [-87, -114, 451, 294, -144, 51, -40, -196, 111, 337, -166, -405, -191, -203, -84, 100, -278, -621, -276, 34, -300, 88, 199, -67, -21, 329, 239, -44, 149, 352, 10, 287, 294, -7, -20, 208, 51, -82, 9, -80, -285, 14, 204, -192, -552, -275, -474, -296, 44, -61, -170, -292, -100, -154, 184, 398, 111, -214, 309, 29, 128, 376, 232, -233, 138, 326, 33, 7, 129, 83, -251, -25, -130, -374, -190, -22, -426, -330, -182, -377, -139, 85, -82, -203, -109, 9, -74, 343, 368, 38, -110, 359, 300, 312, 291, 331, 10, -148, 207, -51, 142, -22, -293, -488, -218, -37, -183, -128, -85, -472, -191, -260, 83, -49, 116, -30, -150, 8, 207, 37, 351, 186, 135, 74, 178, 444, 113, 288, 144, -199, -112, 90, -134, -119, -52, -285, -288, -1, -284, -114, -116, -42, -193, -78, -68, 17, 18, 28, -64, -188, 145, 336, 205, 292, 333, 78, 233, 271, 198, 179, 287, -58, -93, 33, 15, 38, -138, -209, -172, -267, -131, -32, -128, -199, -112, -158, -251, 7, -57, -76, -16, -26, 40]
1821D0r1L25r0l8j18r5J15O0J0J23j86j82p1O0k3P3j47P1j38PJ36J42j10k24K14
1846a37L17n2L4N6j04j62K6J28J94r0O8k3q8%q4K6Q6j20k96R1L0oJ27k0l60J59
1872b00Q2q0L8M6J17l8j14N0K78J12j43m6N7n2J69Qr7q1K8j37J76j41j5j82K3
1897a42J37n2l1J4j79k8J3j82P2J45J08P6m5k4J1Q9J85L2mo6j55J59j77K23o4
1922A15m1j21J34m7M2o7l3J5k63J45j67L15j37k43J41Q8R1l1J51m1q7%O4J81q3
1947A21M3lQ5j17Q4J00k5k45j22K23k29qP7J86l76m9J10o8J40n8J88k75R6N0o7
1972a39J88j20K6J7J1K81k31J38m2r5J45o3l6J2Q4j00j52o7J79O0r5j9k03m6L6
1997b31R3k7K66j74j6k49L24j3k2M3O1r1K53J09k39K03j26j88J32k2o3OJ65k17
$$ y = [40, -51, 274, 184, 146, 28, -67, 48, 108, 118, 241, 55, -127, -198, -138, -161, -88, -235, -164, -302, -295, -159, -17, -127, -351, -137, 180, 128, 162, 218, 114, -48, -22, 106, 300, 210, 278, 255, 167, 167, 83, 109, 195, 75, -221, -130, -100, -106, 21, 1, -359, -200, -118, -198, -160, -114, 3, -35, -149, -99, 179, 291, 148, 102, 159, 107, 276, 284, 187, 106, 134, -3, 173, 32, 17, -165, -142, -5, -57, -88, -74, -253, -281, -268, -450, -378, -233, -125, -49, -94, -118, -107, -18, 167, 199, 195, 129, -26, 133, -44, 179, 115, 74, -47, 87, 40, 82, 15, -18, -3, -266, -121, -288, 27, -110, -353, -212, -124, -33, -64, 87, 46, -41, -41, 23, 204, 121, 164, 161, 246, 129, 213, 313, 288, 43, -79, 144, -85, -93, -16, 170, -206, -255, -145, -213, -73, -131, 57, -218, -122, -72, -139, 49, -71, -45, -28, -17, 264, 33, 171, 129, 34, 179, 116, 80, 92, 176, 76, -76, -143, 36, 96, 1, -18, -221, -267, -231, -138, -165, 101, -73, -89, -338, -14, -27, -49, -6, 55, -36, 217, 326, 87, 290, 164, -24, 108, 86, 23, 29, 194, -23]
2021b3o1J59nl69R8J28k07J23J90j05j18J67j45PJ75J28qk0K1j76M8K60rj28J20
2046B50M1m15K21J13k03j16K92l73O5M06m63nn3M9M8O6nJ16k35K76j12j83J81
2069c9K13k28J55J76l30J53R5o4J08n2j18k50L34J49m86N3J95k81O9J44N8l38
2091b84O9J37k67K37K84m57J38J87R8j78J60O4j81J08J94k77L3J50j18j10K00
2112A87j6m03K37m5j12j91J81n2n1L95k41j35K22P0k98K49J25k38J40M2k7M7K86
2135C72k09r7J40K2q0j34J74j51n1J69k23j18K22L5l42J79L5j4j46K22j05j35
2157b35K70O7l19M32l2j78o6J54j1J0K25j35m8L0Mk44J67R0k31j76K72R7l65j8
2181b40L7j00J04R7j04j00K57O1j35J46o7k47K86J41r0M6J19m76K68L04j28l06
$$ y = [-23, -84, 75, 70, -299, -201, -73, -280, -157, 33, -72, -190, -23, -168, -161, 14, 142, 134, 114, 135, -41, 7, 267, 258, 130, 250, 291, -124, 97, 210, 7, -109, 183, -190, -125, 281, -182, -187, -240, -191, -143, -77, -82, 34, -201, 75, -37, -220, -39, 174, -54, 101, 277, -53, 100, 195, 131, 239, 187, 69, -181, 153, 302, -184, -131, 64, -217, -148, -4, 54, -284, -215, -78, -345, -108, 176, -281, -143, 44, 142, -36, 124, 188, 7, 115, 309, 32, 65, 215, 97, -13, 187, 171, -232, 5, -40, -152, -343, -162, -214, -265, 130, -111, -246, -24, 46, -252, -3, 122, -116, 24, 66, 39, 86, 372, 163, 66, 206, 228, 148, 14, 188, 37, -14, 155, -68, -186, 36, 71, -271, -92, -57, -71, -217, 5, -100, -235, 35, 102, -217, 215, 183, 5, -61, 93, 82, 92, 317, 182, 134, 164, 168, -76, 91, 181, -50, -226, 46, 143, -222, -240, -203, -303, -199, -102, -206, -306, -49, 12, -123, 23, -44, -291, -5, 136, 46, 92, 211, -265, 3, 307, 179, -127]
2203a27J68K95l25J09L0l16N4J74q4j35K96j58l00jK66j16K12k8l26K72J64J16
2225B40k28K1J45J68j75J07k19K8K30j85m3j27J09j11N3K1p7o1J00j4j96Q7k1
2248a48j41K08J74k16K9J18p3lJ53j61N5N9R0j02m2K45l42N0J77q7j4j0l7j01
2272a19j03J76J1j98J10J11j20j07L14l17N0J89j56j23J65j7L8M02n2j21M1K2
2294A96Pj75j0O4on3K8q2J05j20K2M2n7M5q9O3j38O5N2J33m9n2mo8J7r9K17j20
2322f6K30R3j36L0k10N1K08k4j05n8n4p9J54mo8k14K48j46M8PL3l7j3j88J02J77
2348b1OR6q9j12K46k52L91r8j90J09j9o8J89j41L2m5n8p9j54L23m8j57l9o1J58
2373h1j61J64j32K59k9o3m8J10o9J14M9J04k15J90j33RK18k35m7k9K9M7p0K8Q9
$$ y = [-127, 41, 336, 11, 120, 150, -166, -112, 62, -22, -157, 139, -19, -319, -320, -54, -170, 42, 14, -312, -40, 124, 240, 12, 33, 178, 346, 171, 278, 59, 87, 317, 132, 89, -38, 71, -40, 13, 34, -43, -104, -4, -18, -214, -127, -148, -289, -81, 93, -123, -94, 24, -49, -52, 101, -60, -5, 54, 144, 42, 0, 245, -97, -47, 130, 43, 29, 19, -18, -119, -222, -46, -35, -233, -123, -12, -132, -239, 75, -242, -192, -3, -159, -282, -117, -134, -96, 306, 254, 133, 174, 196, 203, 28, 18, 82, 76, 23, 51, -31, 74, -46, -24, 18, -39, 6, -83, -20, -158, -93, -41, 92, 43, -9, -13, -81, -64, -163, 54, -66, 164, 257, 121, 151, -59, -8, 200, 176, 71, 13, -41, -120, 34, 30, -38, -252, -4, -150, -102, -95, -62, -99, -112, -300, -198, -21, -15, 81, -8, -120, 126, -126, 265, 167, -23, 86, 67, -1, 188, 47, 79, 34, -24, -103, -257, 66, 18, -139, -178, -239, -81, -242, -78, -210, 49, 20, -43, -91, 19, -50, 64, 113, 217, 2, 192, 59, 68, 286, 51, 4, -25, 4, 51, -19, 9, 98]
2398I8j79M3O7J8l1l17J74J3R9j31M6K1J39l5j97L84n3n6N3k0j11N8j1l3k9Nl7
2425b2K9q4P8k2j8j49J72j20J12nk14J64j61L20j75p2J67l4J3K33k42J05jj09
2449c5m6J00P6n7J17q2k59J34K18j24j53J5n0M8L5l1K10k22j48O3K53p4Q4q5O1
2474D8m0j35J20n2J56l5J1kl9Q0R2j31J86j56j14n2J79Ko3j21J13k40O8k2K7j26
2500b46J55O7rK55j63n7j32K75j47J14J50j42j81J62l7n7K05j19J6m3k2j49q1
2523a86J63r9L6l9J1j10L7K10P0j80J09j45o1L08q4k8L9O1j21j2M06l56K0O0j82
2548g3J10J56m5k23J26o1j37O4O3K0j25m5M7j50K84L5r0m1Or6J91J62p8j44P3
2573B9Q6J23k13lP0j03QO9j27N5L0j15O3Rm1j04P8q3k5K24n7k74L37r8J21L4P2
$$ y = [98, -81, -38, 29, 47, 16, -301, -127, -114, -15, -146, -100, -79, 60, 25, -172, 212, 159, 103, 156, 136, 25, 83, 72, 39, 10, 15, -22, 7, -77, 1, -21, -39, -188, -16, -136, -24, -29, -243, -79, -240, 80, -95, -167, 0, -34, -21, 212, -30, 75, 74, -35, -81, 19, 95, 38, 155, 73, -186, -52, 166, 42, -111, -96, -146, -98, -63, -94, 116, -106, -254, -191, 62, -12, 72, -13, 48, 8, -127, -7, -59, 97, 62, 73, 71, 32, 112, 204, 73, 259, 103, -11, -63, 116, 118, 55, -66, 47, -193, -125, -147, -120, -246, -91, -24, -33, 222, 59, 2, -130, 145, -2, 112, 262, 120, -61, 101, 64, 7, 212, 93, 109, 66, 44, -105, -186, -23, -122, -86, -125, -114, -224, -187, 23, 93, -87, 22, -123, -184, 124, 40, 12, 51, 112, -9, -21, 385, 29, 49, 109, -73, 37, 193, 148, -75, 51, -10, -147, -83, -20, 0, -125, -170, -123, -273, 11, 46, -44, -85, -79, -175, 16, 178, 100, -44, 29, 115, 238, 25, 22, 92, -11, -3, 66, -61, -6, 24, -91, -28, -19, -60, -164, -86, -169, -194, 30, -27, -301, 36, -62, 59, 93, 165]
2600A65p0j99L83j73k6l2k0J39m2K87l62j83J98k0j82K08o1j14N0n8J5J24L7j92
2624a28q1J51o7m4K28p3M4R4J4l0j93L00p8j35J99j11J13Q6k0k67m3R5p5Pj16
2649a30J78j36lJ45j86J5J70r1j02R9J2O7o9L7r0K30n4M4m6J28k1m18K22J61j81
2674a9R6J23j17o2j78J28J35%j55j82K27j15N9kJ17j78jJ15K3p4J32l5k05J60
2698hJ71j8j96K54j40kJ25p4j40O9K5j10l8K43k49k5J89l8k00J64j00qN1J83k91
2723a63N3J25j27J74k8o2n8K47J32j66O7k27J19q3L7P6j03j50Q7j04L4K42j00
2746B2rj68J34r1K21k39M0nJ6L9k2Q7J4nm7qR0J3L2M6j30P1n2o4o9PJ54q2M0k3
2776A2j5r0k8m8K98j25j51N6OJ16L8J61k05m3J89p3J35j57j08R7J33j17j32M8
$$ y = [165, 95, -104, 279, 106, 80, 48, 28, 167, 125, 412, 50, -133, 65, 45, -137, 71, 10, -104, -54, -112, -97, 27, 64, -128, -209, -58, -125, -169, 59, -14, 30, 124, 138, 108, -85, 215, 137, 2, 201, 90, 203, 289, 269, 2, -41, 54, -21, -14, -130, 48, -88, -91, 54, -132, -117, 53, -38, -140, -41, -29, 38, -31, 6, -84, 146, 92, 136, 90, 218, 197, -221, 1, 162, -19, 77, 200, 83, 21, -157, -29, 106, 106, -49, -231, -4, -119, -60, -62, 55, -123, -124, -9, 14, -60, 72, 37, -168, -8, 163, 145, -51, 203, 63, 61, 186, 112, -28, 41, 66, -44, -82, 161, -88, -113, 76, 38, -162, 2, -98, -106, -55, 128, -163, -110, 15, -112, 62, 34, -28, -86, 161, 293, 127, 194, -33, 86, 3, 40, 116, 13, -137, -50, -154, -120, 122, 22, 13, -155, -21, -112, 109, -130, -90, -95, -79, -40, -62, 25, 39, 34, -13, -21, 69, 82, 114, 160, 30, 101, 49, -15, -84, -77, 77, -5, 35, 12, -3, -93, -121, -169, 129, 4, -147, -91, -85, 31, 69, 230, 25, -18, 171, 98, 233, 76, -32, 65, 198, 81, -51, -3]
2800cR2o5Op9J8j11J9K00o6k27J47mL8L0j11O9M5KP8j16J08O6n2r0N9n1J77j30
2828D9k2p6J96k19J39j46K04q2q2l7J43j37o3N0P4j4J3M5j38J02j38NP3m8J13
2853DJ6qj1O1P5N9j84P4J2j42L22j78k83R9L3J79j60P8j39RK6OR2j7J14j26M9
2880F0j22J54o0J5P4j42J22j19J22j6r5L3J38k52J47J09k05P3k6j35j04J45MN
2904g5o9J21j06J5J73l47J76J38K7P5j44J07n8q0OK31j08N8j56m7J99p7k8j49
2928a18N3j7p1N7k5J11r3P9jq4J34l3P2q9J43j02j35J19R9r7k2R1K1j55oR1j76
2955a54K7K43k93L52j07n7L9L5j56r6Q4l4J81k24L3Q6r2l3J02J33J67k48R3j52
2979g1M0J77l1l3j79L58j71j28J09k08J2J76r6P9j10Q1r6O1k1K1q7J2Q6L3M0J26
$$ y = [-3, 89, 24, 30, -49, -31, -142, -123, 77, 11, -216, -69, -73, -35, -5, -116, -47, -2, 0, 78, -38, 70, 136, 84, -6, 53, 2, 179, 49, 27, -49, 147, -72, 67, -79, 125, 43, -39, -76, 67, -70, -133, -83, -9, -23, -10, 35, -103, -1, -139, -134, -61, -109, 4, 20, 12, 1, 62, 137, 196, 12, 86, 98, -44, 278, 100, -183, -84, -51, 128, -32, 46, -93, -84, -58, -52, 40, 23, 137, 11, 60, -62, 92, 32, 47, 121, -21, 101, -18, 104, 88, -7, 26, 164, -88, 59, 168, -37, 36, 10, -125, -229, -84, -80, -75, -144, -23, -129, -114, 59, -288, -112, 26, 53, 128, -16, 91, 33, -47, -41, 190, 82, 140, -16, -63, 136, 59, 31, -118, -65, -82, -153, -96, -121, -10, -103, -24, -25, -109, 25, -8, 64, -25, 118, 16, -119, 0, 99, 2, -20, 71, 92, -63, -69, 22, -154, -127, 116, -177, 175, 68, 11, 50, 85, -71, -167, -83, -117, 64, -160, -127, -41, -133, -166, -64, 69, 236, -12, 81, -71, -31, 146, 115, 82, -97, 261, 90, -38, 71, -137, -125, 51, -45, 34, -76, 5, -91, -30, -51, -30, -117, -105, -19, 14, 54, 180]
3005A80j42J1j33J85j89J34J4N8j4j45M8O3J2Mm6m6K79j86j55p3Q8m2J69j95p4
3030a95K02q3J44o7j00N6N2L3q2J15j07J21o1L4l3nQ3j03J9J63J9j95j38R7j5
3055d6Q7n1l7j90J34j80J44k0L50j44J00k8n1k03J89P5k77K38N0jj26K01k04O4
3079G4j45K2om6J90j65n3jrQ2j2N6j27j14K43p3j59L35o2j07RK42j56Q3L2mj25
3106DJ16K1j30n4R4k38J91R7k07N9%o1J28j04o3kl9J89N0q3j45J17l0R4M2j53
3132a07LN9KM7M7LN2N1L0k88K56j39r8M3J91q2rK7k18N1J18o8m67K93K29r8q2
3159a54K73j64l2J63q5n8K2P7J9R0j31N6k40L32j36J6P5r9k30K07m3N4m8J08j03
3184c1L5n4P4k31J32Rp4J74o3J2k1J72j20q7N8J28l9J5J08j97j16K95o7k68J93
$$ y = [180, 38, 49, -84, 101, -88, 46, 60, 118, 104, -41, 7, 70, 82, 86, 40, -6, 273, 87, -68, -141, -53, -95, 74, -121, -195, 7, -76, 68, 1, -99, -43, 9, 42, -40, 75, -32, 89, 28, 62, 29, 24, 107, 4, 23, 186, 205, 10, -128, -31, -46, 41, -10, -47, -237, -103, -283, -139, -159, 191, 47, 147, 119, 68, -135, 54, 129, -148, 90, 140, 139, 13, 214, 10, 74, -71, -49, -55, -101, 89, -76, -129, -130, -139, -57, -69, -13, -140, -254, -11, -84, -243, 92, 30, -77, -68, 174, 18, 101, 133, 129, 4, 120, 141, 11, -43, 51, -187, 4, 101, -106, -47, -47, -108, 20, -84, -147, -149, -188, 1, 51, -32, -177, -60, -90, 4, 46, -107, -104, -45, -43, 4, 51, 54, 106, 157, 187, -101, 155, 16, -82, -39, 152, 70, 61, 88, -130, -79, 39, -29, -496, -203, 26, -72, -154, 119, -45, -77, 86, 1, -57, -35, 42, 61, 151, 20, 76, -164, 168, 32, 48, 123, 24, -206, 1, -42, 12, -36, 72, -31, 4, -50, 24, -207, -75, -66, -140, 34, -29, -17, -38, 134, 14, -73, -15, 113, 74, 89, 197, 0, -116, 179, 112, -156, 37]
3209C7L7j29kL1j7M2o7j03p8K00o5J19k9L2j33J08J05r6J11j48K42j74K5j51J39
3234C6J55j40l0j8M8j69K01k4q7l6O8l8j15J17l5P1j24J55j14K3L4R2j12K9J46
3259A33j18P7J14k30L0J02N9n9q7m7Q5n0J49k50p9J44Q2L9k93R3J19q6K1j1O3
3284@j04J93j8L4l2j9j20M2J66j16O8j69J93O5j87p8M4P1K9o6K3o6Q9r8N2j33
3310a37J13j09N2r8J1K59o2o4j1J01ql5K4o7J19J5kl0K1K3j7q1k5m8J63p9o4Q
3338b8j15PJ26J53k55Q6l1J88j80J50j59J02M8r2PM5J23q7J35j42j1O1j2j74M7
3363hJ45j48NJ17o3q9j9M6j53J66l0j40K5J10o2ln0J15K8L2L7j73K32j08M3J1
3389F6j24K36m2j72R6K7l3J06l00p6K04o1J11q0nNkmN8j53J43K3m9M6N9o4J71
$$ y = [37, 74, -55, -57, -26, -43, -1, -68, -171, -249, -49, -114, 5, -24, 8, -125, -17, 88, -8, 103, -45, 197, 23, 48, -103, 36, 191, 51, 21, 3, 51, -118, 83, 59, -28, -64, 4, -34, -149, -32, -67, 4, -120, 35, -79, -56, -22, 70, -42, -13, 133, 15, 92, 206, -24, 6, 108, 167, 108, 21, -26, 59, 9, 158, -92, -171, -27, 55, 94, -199, -106, 13, -73, -52, -63, 0, -104, 89, 71, 105, 73, 54, -66, -24, 142, 26, 94, -75, 118, 183, -4, -82, -38, 33, 62, -4, 19, -47, 42, -56, -4, -137, -24, -133, -81, -179, -168, 91, 29, -35, -46, 55, 47, 12, 36, -31, 88, 103, 101, 71, 92, 115, 98, 17, -8, -56, 107, 28, -36, -28, -143, -136, -10, 143, -112, -26, -57, 131, -49, 101, -58, 44, 92, 0, 7, 52, 175, 88, 223, 81, 70, 131, 119, -55, -8, 137, -11, -6, 111, 48, -41, -60, -14, -167, -1, -31, -171, -146, -36, -98, -101, -151, -36, -8, 24, 61, -112, 120, 12, 55, 66, -58, 178, 136, -36, 60, 87, 54, 160, -140, -216, -12, -73, 38, -42, -47, -42, -44, -48, 10, -143, 0, 23, -26, 20, 79, 15, 186]
3416A86k82K22j65O9K36j36j83K8M8K4j93K88j01N2j52J9Q0p1p0J33n5m8p5J62
3440A6n5L2J24k99L31k97LK23P7j39J04r2J32k41Q6J75j21j45J96J7j42j02K44
3463A27q3j9r8O9m6n8J60j26M6J51k15J91j5qj23Q4M4j74J87o4O9lq3k5k3J03
3489F8l7j05K05j62j8j28K68j36Mj22J93J9k26J03J4J88j00j59M9N7J68j40L8
3512D1N2n1L9o1J06J8j42Q5j35qO6j19PK62j23J7p8r0Q9j17J36J3M9j8l9L5j7
3539A7Q4k39L30r6k29J80J05j26P0N0j17j68L18j42j11K10j50J0j14K57k44j34
3561b39J71L4J47l8l3Jj6j2l0J6M9m9N9K6J4o8L7n7J38j7lJ13j21j40j02J36j88
3588a72J04O1QO6k09K26M6k16R1j74K02k00N5K55q1j60R5RO2J68l79K46q4l8o2
$$ y = [186, -96, 126, -39, 30, 266, 130, -53, -25, 23, 47, -146, 142, 41, 93, -59, -40, 40, -31, -101, 32, -23, -71, -146, 16, -39, -7, 117, -182, 149, -148, -145, 78, 155, 16, 120, 28, 160, -81, 5, 180, 59, -86, 110, 127, -15, -117, 127, 44, 25, -73, -4, -50, -108, 52, -74, -28, 123, -92, 99, 84, 76, -47, 37, 81, -93, 94, 30, 99, 96, 13, -12, -35, 68, 31, -74, 131, -31, -49, -177, 91, -45, -41, -163, 30, 49, -177, -74, -60, 128, 28, -131, -82, -25, 143, 3, 41, 93, 42, 81, 20, 126, 144, 2, 87, -48, -56, 10, -109, -102, 160, 37, 54, -24, -114, -25, -142, -6, 7, 56, 38, -1, 34, 17, 101, -138, 192, 96, -133, 47, 152, 26, 96, 146, 29, -139, 179, 37, -74, 136, -14, -4, -118, 139, -105, -239, -68, -34, 113, 75, 42, 43, 27, 15, -15, 1, 50, 1, 60, 86, 100, 32, 69, 12, 150, 133, 130, 243, 122, -18, -120, 16, -172, -68, -7, 1, 67, -142, 84, 130, -86, 5, -169, 33, -167, -112, 143, 62, -98, -3, 6, 68, 236, -143, 103, 19, -19, -81]
3613h1J9m6j9J28Rj5jj6l1O0m9p5N5N5p6L7K16j60j32J02M9J71q8k19K73j62K1
3640B5O1o3Q9j37Q9q0L1m9%P4n7M0P1k06M4L8j35J30J66j16J40K8l31J62J14l7
3666I1j30j2M8N8L6p7M4J26k07q0J60p9lP0j23L1O9j13j18K03Kl1j48J52P1p8
3692c8J6n3Q6q9J44j67R8Ok9j19J12R5j32J41J74l63P7J17j67m5K43o6m2k4R8
3717G3j40j4r9K00P9o0r3R1Q1j92J39j07J41n0o8J53j09Ln1JJ0K00j29Rk2j9m2
3744a5j6j1J6M6q5J28j82Q8J24k85J21J73M9k01L2J04j70K24K0l9j89J9J08M1
3768A00k53J79o1Q3K4R8k69J03o6N3o0p9P5J49p2p5J72j46n2J46o4J27j36j7K55
3793B14k73J72N5k83J79O0j73L3o3J00r3J50ko1K5k04K62k64J67k0k76K33Q4L8
$$ y = [-81, -62, -108, -127, 1, 10, -5, -6, -22, -53, 7, -42, -117, -62, -7, -83, -46, 170, 10, -122, -20, 29, 200, 112, -107, 166, 4, 25, 86, 23, 112, -25, 64, -16, 15, -34, -34, 40, -17, 23, 94, -112, -68, -30, -165, -35, 131, 15, 155, 183, -148, 14, 128, 91, -39, -51, -3, 55, 91, 14, 58, 184, -23, -103, 57, -22, -25, 45, -78, -47, 22, -91, -209, -6, -4, -35, -183, -31, 40, -38, -22, -75, 11, -78, 66, -101, -3, 3, -26, -145, -33, 62, -70, 71, 245, -118, -41, 76, -91, -136, 107, 41, -1, -25, 73, -67, -81, -180, 20, 99, 39, -54, 37, 118, -74, 65, -42, 99, 49, -19, 134, 25, 28, -23, -22, -12, 188, 59, 68, 46, 27, -15, -31, -42, -26, 20, -65, 63, -119, -31, 93, -192, -71, 102, 151, -50, -18, 86, -84, 140, 160, 121, -68, -49, 59, 100, -153, 26, -35, 48, 72, 170, -99, 4, -62, -9, -69, -148, -73, 76, 4, -71, 101, -45, -97, 49, -15, 112, -24, -41, 214, -59, 113, 168, -115, 64, 124, -49, -16, -79, 21, -72, 78, 76, 15, 40, -164, 98, -166, 1, -19, -295, -62, 22, 60]
3817F0j57R5n9K7J4J63j35j9K39j57r4N0J05l37J69M8j21J67m8n7j47K68j57R
3841g4r7J05m3O1J06k84J86l9R0P4k22J00N4K1O5r7j25K21KP0j07Nj43P0m6j7
3867f4J38k43J70j26K05q8J23k94J09l4Q3J29k65J27n4J42qj0n5JqR9j02M1J86
3892B02k09o7n7J59o7J17o2lK3j05L4J54k89J1K40j43R2j14p7J77P5k00Q5KJ0
3917a2j4J8L7j72K70j40J1l0j54J22P3J01j88Pj4L8k6Q8J37p8j62J37o3J5J6m9
3943c2R9m4j9%qj47J25k4M3J53Qj5j55Ol4k4P3r2k1R7J29k1k22j8K72q3J04k47
3971i7j5K68q9q4j32O8P4J09l3k5j18K31j87Q6p5m6l7J92j99J07J00j59J47j31
3995d5P1m6J42k62J50M7p7R2j36J04j36J87j03JM0Or7R9r8J24p5J43j37L9l4l6
$$ y = [60, -97, -2, -61, -34, -20, 143, 8, -11, 228, 71, -23, 27, 132, -205, -36, 12, -109, 58, 10, -47, -194, 74, -83, -74, -171, -66, -109, -48, 58, -226, -40, -79, 11, 85, -137, -37, 17, 38, 103, 6, -119, 102, 104, 174, 67, 72, -71, -1, -47, -64, 74, -169, 1, -125, 80, -8, 115, -179, -70, -104, -21, 108, -157, -30, -84, 58, 50, 40, -15, -14, -22, 77, -25, 16, 202, -7, -74, -131, 28, -39, 78, 16, 13, 36, -69, -35, 119, -170, -159, 81, -62, 30, -84, -161, 16, 91, -109, -24, -22, -12, -26, -8, 29, -143, 127, -13, -2, -32, -186, -64, 9, 110, -78, -71, -85, -47, -73, 15, 152, 74, -88, 49, -14, 1, 17, -32, 67, 23, 4, 4, -4, -151, -26, -50, -7, 146, 154, 139, -16, -10, -44, -68, 5, -87, -108, -11, 118, 97, -125, -143, 129, 46, 150, -97, -112, 156, 67, -17, -149, -81, -7, 102, 69, 44, -74, 157, -30, 56, -19, -65, -102, 90, -109, -2, 98, -61, 86, -45, 26, -20, 122, -140, 10, 57, -20, 72, -64, 40, -96, 91, -12, -11, 29, 35, -62, 37, -61, 63, -12, 131, -6, 33, -1, -37]
4021c7K8Q4j25M3m3m8j08O7J67m5Q2j54K9R8J04q0j55J06J62j05j19J13n4o5J18
4046F3j36J87j0j16J84j5j52L2no9J40l5j68J03jj58J43L3K2k47J48j7J77L3k35
4071i9J1K62l11J11nn0r7O7J10J39p0j20J47j58N6j61J52j70J89nJ87l00J62l5
4095A2k1j1k7J87n0Lk00J39o2L5q8PK05m6j1m3j17J13k1J54l7j2k27J63jr1O3
4122A6qk5r2j1J87j1J09p8l7m0J4j8L2Q9j87K43k13M7J62k08p7J44j89L36j30
4147E5JJ1j11r5J75K42l57L9n4K49l9r3r9O4P1k16l4L98k76K36m4p3l5rr0J45
4173F1p2OO1o0K4J79p8j65J3K10j85j82K08M2j32j01J65ql7N7P4r2l8K67l02N3
4199c2N0n0k7K0mP2m5j71K86k72J34p5J3R4O9o8n6J0J68j61q8NQ1j00J13J30k01
$$ y = [-37, -9, 75, -50, -7, -50, -98, -206, -139, 28, -17, 65, -89, -60, 38, 142, 62, -93, 13, 175, 70, -49, 64, 10, -55, 63, -73, 114, 104, -12, 172, 157, 5, 37, 32, -37, 103, 68, -100, 3, 2, -156, -13, 20, 42, -205, -57, -74, 103, 136, -99, -88, 174, -137, -26, -31, -81, -178, -111, -1, 138, 68, -52, 95, -63, -7, -168, -16, -186, 3, -2, 185, -115, 47, 12, -9, -20, -47, 140, 90, 93, -107, 32, -30, 5, -83, -76, 129, 83, 72, 29, -88, 25, 4, 158, 121, 109, -118, 45, 44, -47, 16, 8, -17, -109, -120, 67, 56, 165, 87, 50, 10, 24, 6, 38, 127, -60, 183, -30, 17, 179, -29, -106, 38, -151, 185, 55, 56, 67, -44, -139, 36, 278, -79, -40, -94, 155, 116, 23, -76, -12, 59, -157, -191, 207, -69, 167, 123, 50, 15, 6, -84, 61, -11, -5, 56, -4, 20, 199, 121, -44, -31, 179, -6, -188, 20, 62, -70, -171, -6, -14, -51, 6, 80, -12, -50, 217, -85, -32, 18, -32, -59, -39, -43, 29, -16, -187, 99, -173, -39, -114, -101, -7, 62, -6, -62, -52, 116, -45, -133, -128, -47, -147, -34, 96, -105]
4226a05o5K60j37j1J05Ro9N1j6J42j33j1j18P9l7o9M1M2N3R5j13P2N5j35j8j32
4252a65J11R7j47Q1L7M7j37J86k76J40J11j58R2l4J02k68K36P5j25j8q7R2l1L8
4276aK2j15j45K82j43J14k01R1M6J1k9K01k05J45k59L17l2j48K6j3K64j99K8J93
4300B50j56k13J68j37R5N8J5q7j10O9J0R8l0j18j8m6J81l3m4k1J32q0n5J15o0
4325a7j50L6J83j2L8k34mJ01R9j56N2M0J17r5L7k13J37N4J26j01p1P8r1p4M3Q7
4351A0r0J01P2j66Ql8p2K41r9j02N7J02j63R3j4j03K22r4N4j77K70j50J3M6k67
4376b46K64QP2k25R0K7j88K42nL8j31J2lr8J63r0k4J62J24q1o2jLP3k60K7Q2K03
4404A76M4k43J10j16l3Q3K5j04j2n5Q4k2J8M5J13r5Q2R9j19q3K02n4j01J12j16
$$ y = [-105, -170, 90, -47, -58, 47, 56, -13, 38, 22, 164, 31, 20, -98, -19, -56, -125, -84, -42, 11, 106, -7, 65, 120, -15, -33, -165, -54, 43, -104, -23, 14, 61, -76, 110, -166, -26, 85, -73, 19, -15, 87, -181, 55, 130, 5, -13, -100, -8, -39, -1, 21, -94, -239, 43, -100, 14, -187, -96, -50, -39, -68, 133, -72, 73, -186, 131, 99, -49, -23, -36, 228, 29, 57, 250, 94, -119, 49, -88, 7, 65, 80, -7, -117, -48, -38, 60, 30, -88, -106, -152, 29, -4, -48, -69, 63, -17, -72, 43, -17, -167, -131, 52, 40, 78, -156, -160, -59, 40, -116, -64, -24, 93, -2, 35, -178, -41, 13, 139, 38, -33, 45, -46, -120, -77, 10, -80, 21, 93, -73, -65, -103, -175, 66, -33, -135, -78, 24, -139, -46, -60, -163, 59, -35, 19, -158, 112, -38, -25, 21, -246, 18, 26, 98, -127, -37, -10, -198, 44, 39, 77, -54, -42, -45, -143, 20, -70, -94, 68, 192, 111, 49, 48, 51, 124, -136, -109, -27, 176, 220, -23, 87, -29, -62, 21, 46, -58, -70, -125, -41, -63, -45, 0, 113, 18, 100, 199, 80, -3, 199, 145, 44, 156, 40]
4429D0K5l8J52k38N3j84L12nj93p8M8J86p7Q5j87R8J36j05n8lN0o5P3o4J07n2
4455A8q2N8l5p5M0m7J48LJ0J14p9pK8l3l5L7R0j20P3rl5n0lP2o4R1j04J02j49
4484d3j02J64J31j17j16mL6J00k9l7N0p5J25p6r4J41m6j16J13k27J21K18n2Ok58
4509a87J86n3j1R9M0q0J73j33J11j32q6J89j01Pj74o7K07R0j12R2K4q2Q8pm0o7
4535b6%J51K3o3n4L9j77J36K4J35k23lk4p9O2J96l3m3RM2m6K7r9O8m0mp5J60Q
4564I1o9Q2k55J81l3k1j8K30k67mN0R1k00O7j38J90J75j11k13L15k51J32k11J96
4588Iq9K5pj30L61j08j47J94Q1k72P0m8J30j40J21o0Q9m3n9j7Mq3K07j8j2m0m4
4615b6O8L6j63Q1l6N9j37K14o4L4j23j0R8q7L5m5J62p1o8P2L6o1O8N8j74j8j0
$$ y = [40, 65, 27, 179, -59, -6, -190, 122, 117, -76, -154, -106, 80, 3, 88, -99, -1, 135, 30, -28, -31, 19, -46, 27, -37, 70, 18, -64, -6, -41, -116, -76, -123, 25, 28, 38, 152, 73, 66, 94, 61, 26, 63, 153, 33, 106, 97, 62, 12, 9, 81, 17, 108, 4, 106, -43, -145, 19, 150, 33, -83, -87, -51, 49, 20, -17, 33, -42, 83, 7, -87, 54, 8, -108, 5, -222, -101, 117, 65, 71, -187, -1, -54, -65, 34, 74, -6, 167, 34, 145, 13, -73, 116, 15, 22, -152, -219, -12, 78, -34, 58, 82, 0, 88, 81, 41, -26, -26, 125, 148, 85, 31, 70, -107, 29, 53, 188, -35, -38, -62, -141, -79, 117, 84, 41, 50, 92, 46, 73, -26, 42, 2, -2, -77, 83, 91, 22, 104, -151, 30, -3, -24, -42, 188, -79, -83, -33, 58, -142, -75, -213, -23, 152, 41, -172, 143, -108, 24, -187, 9, -80, -55, -62, -192, 169, 61, -86, 108, 189, -83, -13, -61, 69, -71, 50, -10, 79, 36, -23, -40, -36, -119, 88, 70, 58, 18, -26, 42, 78, -85, -4, -40, 19, -118, 96, 32, 66, -57, -67, 31, -56, -21, -66, 96, 25, -43, 29, 65, 4, 72, 130, -44, -62, -72]
4642g2K30o5J13j70J24k07J14n7q5M0q0R8n5J1O5o9m4J45L2m3m1o3K61j58o0O7
4668C1p7J38o6l8M4m8J27k39k2R7oJ19j60Q8o8J05j00Q0o7J1J4O6j14Q8m4j35
4694a76K67n3%Kj5o8J9j01J67q1M1j1LjJ3kR8j52j89J83J46k7K4K0J4j33K3j75
4722a64K92o1p4m0L5J42k79M1KJ49n8M0N9O6k03J67N1j52j8q0J17j23P1L6j6k
4748bj14Q8K7J18k07j9J22K7k4lq8J8J09k8n5Q1L9j22J8J17j38P8j03R1oj7r2
4775h5O5n9J53r6j7L2J08j81P1j7J3q6P7R4k5j5k1J5n4M5K9J4l0Q2r4j58M9J54
4803F3l7K6o4M4p6L7O3p5J43k85J15L32l47J10J7Q6j23j74J57j38K26j29M4R9
4827A14j07j26J62k3K6j2q8L03l03p2J63J17k93J77j06q3K64Rr5n9J2Q1j51P9
$$ y = [-72, 158, 93, 206, 36, 160, -47, 67, 10, -75, -35, -115, -17, -72, -61, 4, -65, -109, 36, 68, 25, -16, -79, 182, 24, -36, 31, -46, 92, 26, -12, 32, -16, 111, -128, -150, -53, -59, 60, -100, -12, -80, 25, -75, 5, -62, -51, -37, 29, -85, 3, -41, -176, 91, 38, 38, 40, 25, -43, -24, -125, 42, -39, 2, -9, -6, -7, 6, 4, 102, -50, -239, -56, 90, 63, 87, 107, 121, -12, 11, -164, 128, 67, -7, -47, -12, 130, -149, -108, -106, 43, -15, 25, 84, 150, -53, 114, 165, 13, -5, -85, 32, -91, -20, 16, 0, -2, -116, -28, -1, 117, -90, -109, 13, 40, 16, 13, -75, -57, 52, 24, -31, 50, 89, -33, -15, 102, -36, 42, -61, 30, 24, 7, -85, -20, -79, 74, -22, -39, -7, 101, -80, -9, -26, -13, -99, -22, 72, 47, 32, 11, 26, -28, 17, 46, 60, 30, 112, 18, -140, -91, 63, 26, 52, -12, 32, -44, -7, 56, -19, 124, -161, -46, 286, -61, 49, 66, 152, 29, -145, 12, -126, 100, -29, 15, 114, 7, -119, 43, 20, 46, 34, -54, 249, -54, -126, 37, 154, -139, 38, -68, -151, 113, 122, 27, -32, -20, 61, -90, -11]
4851a1K3R6j16o4j54J87p0Q6PM2o9j9J23o4N9R7j0j09O2P3k10N3nRM7J30k13L
4879a7M9J3N3j16L7J12j5k4n4q5JL0N4o3L5r3J02P7K0j3j40J45j16J40r0n2O1
4906E1k78J01L4K12j07L7N5j31R9j0j20K1m5J93n4j75K14o1Nj45o2K31o2RR4o3
4932D3j49J08p1p7K18m7rJ0J0j02m7J58j57J39j43J65k27K10j2J68n8j27n0J43
4956I6l9n1P8o1q6K48q7k55K47J1k5j81P5P9k31L00j32M9N4q9Oj83L00k33L07
4981A97r5M9q3p3j19J44RM1k82K34k8lk5o4r9J95J02r4m6nL0q0N2R0p9p2K28j02
5009B2n5J22N4k74j8K54j5k0K2L6k74K34j74M4Q7j28J23j53P4K27j73p2K3oKj7
5035e5LQ4j56J12l0Q7n6j1M9q5K28l71K57O1j88K78j54l2Q7j04J3J60j73NK8q9
$$ y = [-11, 12, 108, -8, -72, -226, -39, -109, -23, -16, 26, -43, -62, 61, -3, 56, 153, 143, 34, 96, 169, -41, 12, 7, 16, 63, 193, -20, -17, 32, 45, 98, -18, 19, 131, 116, 92, 38, -47, -46, -16, 38, -25, 10, -83, 19, 96, 116, 103, -37, 108, -8, 132, 42, -10, 51, -227, -126, -92, 120, 13, 50, 105, -26, 73, 63, -57, -36, -81, 112, 58, -117, 97, 36, 41, -104, -166, 65, 3, 12, 106, 43, -106, 2, -69, -146, 72, 25, 16, 26, 36, -66, -113, 45, -112, 27, -116, 49, -178, 32, 20, 188, 130, 3, -47, 96, 57, 6, 84, 23, -63, 185, 98, -157, 90, 101, 76, -105, -30, 49, -182, 118, -14, 35, 89, 0, 6, -177, 123, -110, 197, 102, 151, 68, -5, -124, 20, 29, 70, -212, 22, -6, -9, -34, -98, -197, -2, 100, 6, -40, -45, -15, -95, -43, 47, -32, -104, 124, 22, -33, 89, 143, -131, -149, 105, 90, 70, 92, 128, -146, 88, -86, -42, 45, -83, 40, -113, -39, 188, 15, -57, -34, -40, -38, -55, -52, 32, -124, -12, -42, 45, -11, -22, 27, -58, 170, -201, 56, 117, -71, 207, 53, 21, 108, 4, 17, 177, 4, 9, 37, -52]
5061e2O3j0J31j83J43L4p5j1rQ6j67n3N1L5O5N4j19O8j19J24R9l91J62o6M0J50
5087E0j8O8j58j1J49j47K04m3k01lJ96j20p1J36J5j36J09r7Q5J21K6o1p5r2K6
5112d8J2Q6Oj03m0P7n3o6K55j07j77J08J62j55P1j41J05oj21J06N1J8P8p9j77
5137a38j4J85J32j18J28j62j74K31kO2j33J73j57l9J76j32j71K39J00k63L6P4
5159C3M2j44J04m3o2J70k84K67k04J59m6R7o4M4j21j6J6J88k06K09q1k3m3m2J07
5184E7k6m5L9j9P8j74J0J61q3j06j9L4J73j79J63l1l4n5R9P5l22J90K13j19n3
5209B7L2j20J48r3M3P1l5j04NL1N9j3P1j47j1P9m1R4j17K2J84j73k6L3K9j08p8
5236a38m3J36J50Or1O3N1n2k45J57l7J07q2m0J53k11J22k1l2Pn5K10l2N4k10R5
$$ y = [-52, 11, 1, 132, -51, 92, 126, 51, 40, 31, 117, -50, -103, -52, -17, 48, 102, -17, 51, -68, 56, 155, -236, -74, -140, -100, 50, 32, 100, -58, -69, 80, -67, 137, 94, -107, -110, 86, -34, -105, 31, 46, -90, 19, -78, 7, 128, 154, 93, 18, -74, -48, -36, 50, 56, -47, -87, -10, -63, -129, 126, 19, -158, -50, 112, -43, 28, -113, -8, -14, -135, -29, 22, 40, 118, 39, -138, -152, 33, 165, 47, 175, 13, -161, 70, 68, 130, -3, 170, 13, -26, 150, 18, -153, 86, 186, -77, -41, 33, 75, -69, 35, -8, -70, 100, -184, 83, -121, 38, -8, 89, 25, 69, -52, -68, -52, 136, -70, 139, 58, 35, -8, -50, 57, 31, -14, 25, 6, 84, -90, -80, 81, -2, -108, -127, -93, 80, -99, 64, 33, -1, -56, 43, 118, -204, -14, 199, 80, 27, 59, -61, 87, -6, 37, 108, 73, -31, -26, 5, 64, 51, 122, -25, -36, 43, 2, 96, -21, 1, 185, 12, -14, 19, 48, -60, -138, -181, -45, 105, 111, 20, 83, 134, 82, -163, -6, -43, 64, -18, -58, 95, -116, 6, -15, -47, -40, -95, 115, 83, 137, -73, 22]
5262B2o2n3J75j93p0K89k19L2R4P3n1n5N5p8J6M6N9k33J29k2p7K11l0k04J00R4
5288D8l1m5K4m2J54J3m4r4l6J11j22P5K3o9l1J51j03R1q2j36J44K2j77J39M6k6
5314CLR8j55J48o1n4lq8J79j12K0O0l3J2r7NR5l4m9J42k8k9j03J21J17o7j5m3
5342C2o1M5J5J17m9q1JRn0J46r9n1J73j28KQ6j50R9j78J04j8j6Pj1J04rn6l3J29
5371G9m9rn6J6J4j06n2p9K41N1p4R9j79N6J42j40K27j77r8J47J4q7O3q0r4J43
5397A2J40k24j7k4n2L05k66J32oJ19r4j45J61j73J55Oq0j00K3J04L3r0J24K6P2
5422A41l37J11k2J23Nk31J05J09j3K26m10K38j12r3J38J52j70o7l4L7J32L9Kj28
5446e9p9J04M4n2R4j53J81j16j18m6J89J65l33J0O2Q2pN4j48J77m5J18k62J66
$$ y = [22, -40, -93, 82, -111, -181, 108, -111, -79, 15, 88, 37, -18, 37, -41, -25, 21, 80, -153, -24, -46, -123, 88, 58, -146, -46, 48, 17, -28, -4, -46, 108, 121, 77, -17, -53, 58, -64, 11, 34, -35, -66, 85, -18, 73, -9, -145, -1, 21, -156, -17, 29, 3, 6, 104, -51, 97, 36, -18, -21, -109, 70, -42, -22, 38, 5, 17, -80, -75, 20, -14, -63, 79, 51, 22, -81, 40, 157, 90, 75, 32, -29, 16, 31, 148, 99, 18, 19, 28, -22, 124, 25, -26, 147, 19, 21, 107, -43, 56, -122, -18, -36, -52, -45, -56, 48, 39, -17, -50, 79, 30, 21, -35, -19, -5, -111, -163, -242, -1, 50, -24, 75, -104, -48, 94, -46, 181, 4, -94, 53, 67, -20, 43, -37, -131, 12, 152, -72, -89, -113, -165, 140, -126, 6, 0, 119, 25, -120, 41, -132, 23, 29, -51, -151, -128, -24, 9, -81, 43, 69, 141, -196, -85, -107, 16, 21, -210, -105, 4, -9, 217, -193, 45, -67, -160, -22, 130, -40, -107, -141, -104, 28, 67, 69, -59, -138, -34, 10, -42, 52, -101, 80, -36, -154, -200, -11, 154, -179, -169, -107, -25, -32, 22, -126, 51, 6, 124, -138, 28]
5470B8k12K67N3q5n5J48j11l8k2q1K37l6L1r7rq9Q6j0p6K04p9k62L32j06k0n4
5496e6J54j90J01r1K27k14K3O1l2M0j55R8q1oJ47L1J0n0P4o7r1J05R9n5R3j02
5522G3Jj37N6j50M2K02k8L5j2k86K39pj71J48O7k23K57j72kl0J54l22K81O9j35
5547e1L9j33R6J2J85oj53j6J30j90K49q6n8L6q0N0Jp1M5j82L02j41j09Q7Q5qj51
5574a18K01k57K88j71j4J81j35l4k3M8J10J6r0J2m5lp7J84j4Jr6J61j78K0PO8
5600D2J28l75L19o7Q5n3J84k28J24j53Q0p0J32k9k25J92k46R7J67r0o0K39k52
5623e9j5J05L7n1o7Q3n8m8n2O7j8J23K0j3j46K21q3O4k6l3n2j55J49K0m4J61M4
5650A74j49j17M2l2J38k59J34m7N4q6J20J93j11o8lrQ8o3j66j2J93n7O3j48K29
$$ y = [28, -184, 83, 136, 51, -4, 144, 33, -5, -27, -108, 129, 93, 124, 27, 18, -71, 15, 5, -71, 133, 54, -208, 124, 18, -2, -56, 98, -92, 9, -82, 145, -69, -46, 15, -17, 23, -132, -34, -115, -121, 26, 57, 67, 17, 91, 24, -67, 38, 137, 82, 175, 73, 74, -63, -7, -157, -115, 87, 59, 94, 82, -204, 35, 28, -143, 5, 72, -151, 106, -66, -68, -98, 56, -266, 15, 84, -51, -12, -145, -49, -37, 148, 142, -11, -27, 103, -87, 162, 76, 18, 54, -26, 24, 25, -46, -1, -183, 119, -22, -131, -44, 41, 33, -118, 83, -174, 114, -57, -71, 110, -25, -59, -82, -34, 76, 92, 2, 14, -31, -34, -111, 73, 59, 60, -36, 125, -53, -33, -26, 42, 170, -205, 114, 47, 132, 79, 263, 35, 159, 6, 86, 16, 148, 119, -106, 86, -160, -63, 104, 14, -46, 193, -59, -74, 31, 68, 17, -50, 33, -25, -73, -125, -58, -76, 47, 67, 54, -92, 129, 46, 110, 84, 51, -1, -156, -7, 13, -31, 130, 174, 25, -92, -50, -82, 56, -203, -69, -116, -62, -148, -28, 165, 54, -14, -17, -26, 62, -1, -167, -179, 14, -43, 20, -128, 101]
5675A01l0k54L08j78J33j27l5q8J91mj6J6M8j14M2P9r6O5j51J25l3K4j6R7j47
5700f0J35q7n0J29j46K00r8L5j21L1J11k4k0j28J4N6K9PJ43n1q5k0j08J22q3J1
5726e8L7J36k10Q5Q4j28l2J56j68R6p1j98K98Q5j15Nk7R0j65m1J58Qnj00j3R5
5752BN3m6jLq4R9M1R3j65R6J0q0o9R2q0J4n9J95p2q1J27j38J52k10P2N4P1j64
5780g5N2%P2j0l9J73q2j58P4j47K39j59pN0j83K36k7m8j26P1K19j01N9j59p5K58
5806A07j45Q9P6j29J25j06j72Q7K44o5mp1r8P3mJ10l4n7q0O7L2j75K58k45J73
5831E6Q1j13n8K2M7j24K0N8Pj14m0J65J7j17J10J9n4Ll5J44l53L11o2O9j90J81
5857E0n7r7J72N2j18O1k4j39L4k4q7R2K1l4J29k2j50L3J77j93K32j79K1J10o4
$$ y = [101, 71, -183, 125, -53, 80, -47, -82, -170, 21, 17, 1, 17, 65, -49, -7, 72, -24, 41, -110, 15, -18, 6, -10, 87, -60, 75, -12, -62, 67, -79, 121, 23, 58, -63, -32, 79, 55, 35, -93, -79, -23, 6, 13, 156, 105, 20, 0, -108, 14, -69, -58, -21, 115, -95, -10, 74, -54, -86, 70, -98, -2, -73, -271, 27, 112, -3, 2, -25, 65, -100, -141, 17, 25, 20, -80, -93, 2, 55, 9, 8, 11, -73, 26, 67, 160, -5, 91, 101, 21, -48, 44, -36, -22, -81, 114, 42, -39, 88, -50, 102, -108, -36, 18, 89, -75, -23, -23, 49, 39, 0, 173, 91, -67, 7, -140, 99, -60, -67, -17, -200, 36, 9, -39, -165, -94, 125, 24, 83, -76, -151, 107, -38, 51, 127, -2, 123, 17, -155, -68, 176, 111, 107, 36, -62, 11, 7, 117, 83, 26, -54, 13, 45, -130, 128, -117, 56, 137, 24, -34, -12, 35, -89, -69, -11, -4, -118, -158, 7, 24, -93, 17, 36, -18, -15, -50, 94, -259, 52, -10, 59, -131, 50, -7, -104, 68, 120, 2, 63, 39, -100, -66, -90, -177, -85, -64, -98, 31, 9, -141, -108, 69, -124, 108, -71, -50, 60, -4]
5882dl6Q2m1J8k4J36k25R4q2J01l5Q9m6p5P4k3p0J5l4J55j03J8%O7p5J24l0Nm9
5911B6J01j02p6NNn3J17j53K59j60J40j82n2L03k20P8j6m2p5J08k06Q4J11l4k8
5936f2j8o2J82j31J38j31N4K04j64J02j89R5k8j09L07j78j4J36j17L6M7qj47J42
5960H5n7j46J02%j3j12K49p9QP4j06m5J34j17l6j0J74j45J46j57k3M2o6R8ln3
5986e6N0N2l2J8j63J55Q8j00l4j06J47l9K0k3r2K20j64K23j85j09J77M7r5J13
6010A12j57k7J68q6k4k5q5K95k61J73l5j45j6J03Po5K00j17M2K0N0k4n3q5k7l9
6036a01J69L7O9j6j86J03k36L11j70N6J3j33P1L9j70K24k9p6K69l31K01o0lL8
6060H9O0k45J58j3k03Q1L6oR6p7Q5j0k3n7l8K54j36j77R9j18N4K21j53J0j24M5
$$ y = [-4, -40, 42, 1, 19, -5, 131, -94, 0, -82, 19, -16, 73, 27, -48, 26, 3, -67, -52, -86, 69, -34, -16, -16, 51, -24, 100, 70, 75, 26, 127, 25, -51, -46, -41, -94, 23, -130, 129, -31, 109, -73, -125, 178, -42, 36, 20, -22, -97, 11, -195, -111, 0, -34, -62, -80, -142, 40, -91, 47, -84, -30, 174, 10, 112, -77, 18, -10, -119, 188, 10, -4, 132, 15, 51, 98, 90, -57, 85, 28, -118, -16, -16, -29, -141, 108, 29, 37, 111, 5, -40, 94, -23, -59, -69, 105, -40, 106, -51, -74, -32, -98, 0, -3, -56, -6, 46, 14, 32, -131, 24, 112, 12, -22, -128, 19, -20, 0, -23, -115, 105, -59, 164, -21, -130, 47, 94, -1, 112, -45, -72, 96, 10, -14, -39, -124, 171, -90, 83, 48, -97, -113, -10, -3, -68, 132, 15, 57, 77, 127, 103, 50, -35, -62, -101, 68, 105, 174, 158, -28, 75, -161, 150, -20, 36, 49, -84, -13, 26, -144, 80, 51, -25, 244, -87, 114, 54, 51, 89, 149, -96, 62, 49, -154, -73, -37, -43, 53, -24, 61, 51, 28, -29, -67, 187, 51, -126, -27, -145, -91, 130, -23, -13, -137, -92]
6086i2j7J21Kj15R0j16L1J25O1m2k06J36l0N3M1J47j69J56K1j09j94O0J08rm0
6111A3j19J44o8o8K04j3j73K21k33Q7o7MJ0J03J11j39J29j57m5R4lL3q0P1j82
6136a23J05l8J79p6r0J01j69J03Nk6P8J06l50K68jm3k0J68j09j76K66j41P4J5
6160A06j36J54k84l0K51j84J71j78J50m1k10L13m1K5O2q9j16J74j82J00q4J27
6182E8p0J38m6Kj88K27Nj64P5o6Q9Pj45L1K0J6J92k86K68j09J4J4k8%jj62J57
6209D8kQ0j10L9J1j64J89j49j9J30j49k3Q8nR7j70J00p2K37Oj04q8jJ71q5o6M2
6236C1J53j96J70j05j53L7l2J11j56Q0mK5rO0M3n1p5J43j3j31J75j03O4M3q8p3
6262e4K0O5J26j31j09N5N1K51r2k84J02p8J65q1j04J25p8J13J35k30K1p4J4o2
$$ y = [-92, -109, 12, 14, -101, -11, -127, -96, 29, 90, 48, -158, -22, -52, 1, 42, 189, 20, 176, 197, 88, -106, -46, 62, 53, 13, -106, 38, -30, -98, 106, 93, -80, 141, -92, -5, -72, -68, -58, 45, 156, 17, 146, -11, -56, 38, 35, 68, -12, 59, -123, -18, -56, 123, 47, -43, 58, -111, -8, -3, -29, 49, 155, -195, 73, 72, 29, 9, 177, 68, -108, 158, 17, 91, 106, -30, 124, -160, -190, 61, -123, 48, -130, 20, -21, -231, 82, 41, 66, 128, 39, -77, 97, -85, 15, -69, 58, -12, 126, 80, 82, -106, 121, 126, -38, 37, -29, 60, 67, -78, -47, -27, -11, 181, -105, 163, 54, 68, 82, 54, 54, 53, -109, 48, 46, 126, 16, 55, 66, -98, 91, -58, -77, 53, -96, -119, -31, -36, 61, -109, -9, -81, 156, 162, 58, -30, -31, 140, 55, -11, 31, 184, -12, 158, 53, -100, -63, -95, 16, -140, -60, -64, -39, -48, 12, 55, 4, -71, 72, 59, -72, 103, 0, 64, 107, 19, -54, -34, 31, 157, 26, -83, -28, 23, 274, 182, -102, 0, -78, 87, 6, -98, 27, -51, 62, 197, -33, -12, -86, -72, -134]
6286a34J19J2p5R1J05L8j75JO8L6j35p0Q6N2pN0o7k5k0J76p4j03L5L8r2P1K8j84
6314a55M3N6l3J96j9j02R8m19L22j39L8J36o7Q4J8mr8j03R7p5Q4J25j97R7K5j85
6340a77J80K06k35JJ13l1r6J22oj30j10J34J14j68K14j53J67o7O5j32J3J0M8p9
6364Cj47J71P1j53j54J21n7K81m5r0j2k3P5j2K1J9j95J50j18K89r5j10o8J88j54
6389d4K02N9k67K2k16J73N1k5K06j20j28M9l8J52R5j18J5l2r2Rj30K48r1J18k5
6414G3k0L1j10O4P5p2P9j87N0k3n2KJ09K1n5O5n9J01k48J80n2J08J70j13k8m6
6440F3j29ML7r2l0J21rJ6J6l0r9K14j81J02P4j02J66j65k7m5q9J60m2j05P1Q9
6466a2Q6j45oJ23j6n2j3J78k24Q8O2Q5o6r9N5o0N2O3k22K00l6q7R3j22k7J89q8
$$ y = [-134, -15, -3, -78, 13, 118, 156, -19, -18, 50, 86, -49, -119, -33, 19, 12, 62, -5, -30, -50, 126, 52, -51, -16, 22, -70, 1, 29, -155, -112, -56, -89, 107, 88, -14, 84, -335, -13, -152, -114, 22, -45, 39, 57, 53, -45, -148, -51, -126, -42, 83, -114, -17, 8, -177, 3, 209, -26, -25, 88, 57, -39, 83, 77, -53, -163, -29, 85, -83, 131, -22, 145, 78, 143, 11, 24, 34, 82, 3, -144, 27, 98, -55, -209, -88, -145, 136, 91, 1, -11, -34, 41, 29, 50, 69, -126, 24, -94, 195, 100, -10, -78, 110, -44, 158, 217, -50, -28, -244, -71, -20, -45, 161, 41, -87, -38, -76, 76, 171, 53, 68, 36, -56, -47, -177, 71, -20, 98, 73, 53, 84, -26, 38, 113, 41, 120, -67, -17, -40, -92, -90, 19, 40, -15, 50, -9, 92, -156, 24, -28, 80, 250, 137, 109, 63, -66, -62, -25, -117, -147, -26, -35, -19, -3, -33, -132, 82, -99, 3, 77, -25, 141, -24, -51, -96, -185, -25, -67, -172, -101, -12, 74, -71, -77, 46, 30, -22, -35, 143, -81, 7, 69, 154, 88, -11, 44, -16, 36, 99, -123, 77, 41, -46, 47, -75, -102, 87, -1]
6493aJ82k46M3m4qN7P2j32K28j89L1Q7j10J15j40J59j33J3J85j48K1j97J57N0
6517E2j01J98k01K08j77j1R6j03J20L7K4j39q8K3m2q7L64k82Q3o1J40k26K21r2
6541d4J13j42N2m7R9P6k41M3K46j95N2J13j09QPn1k3j13J87K5r1J59o1j41oK1
6567f3J39m7L1o2o6p1k6K77j2j3j73K9k2J3M5k3J84j55j17J20R2K4r0n2PP2kj11
6595g2Q9M8j4l6NP9m5k6J18j17R3m3k4j18J85l3o8nQ9j71n8K68o8o6kj22J72j53
6623i5K10j81L20j30q5N8o6M0j88J25N5r6J20j31N0L6K0l8M4k4k0j08J19q1R1
6648D5p7kK30k37J49k80K72m4j0j64J05K1m6R4j24Q3r5m6J95j23j1O8m6P3J23
6673A53l61K94k8P7o0q3L7j30J71p1J23q9j0q9P7O0j8N9%k40Q3LP0m8p1M4J10
$$ y = [-1, 181, -65, -22, -66, -74, -17, 55, -77, 151, -38, -7, 80, -30, 85, -55, 104, -29, -16, 169, 21, 42, -155, 2, 52, -49, 149, -52, 156, -21, -32, 64, -39, 81, 118, 142, 3, -85, -62, -104, -191, 173, -109, -26, -87, 53, -173, 48, -44, 69, -73, -21, -68, 31, 107, -134, -91, 155, -40, 12, 125, 16, 24, 31, -20, -43, -156, 31, 56, -35, 124, 63, -78, -84, -63, 76, 29, 60, -2, -68, -139, -165, 112, 100, 87, -86, -57, -79, -66, -21, -44, 140, -15, -132, -12, 80, 104, 14, -38, -31, 41, 39, -72, 17, 65, 51, 15, 20, 99, 54, 28, 146, 29, 122, 79, 55, -63, 122, 89, 21, 16, 105, -66, -124, 144, 76, 10, 8, -114, 58, -95, 115, -66, 254, 124, 39, 97, 31, 71, -117, 8, 63, -33, 87, -44, 6, 42, 62, 24, 68, 44, 24, -84, 35, -46, 45, -32, -34, 196, -41, 108, -172, 100, 56, 46, -118, -13, 8, -38, 56, -68, 15, -80, -126, 69, -54, -65, 3, -43, 30, 153, -208, 86, 58, 135, 75, -8, 29, -101, 70, -1, 122, 33, 23, -66, 11, 71, 53, 112, 112, -128, -45, -42, 28, -20, -91, -47, 63]
6700F3np7l8j85J49J07P0j29j25J26J84q9j80k7O5J19Q4n7j69J10M4j29K1K49
6724A81k60N5Q0j4L1J8j89J25l5P7j49K90k86K06j45n2P7N8J1j32J21o6J52j12
6748D2P7j20J24k17J44j98J28n4jM6l7J65j39J30q2l8N2R7o5j62K03l5j04M7n9
6773e6J4L9p2J63k9q8O3J14k26J43p0n1J3J1K7j16P6J32P0j44k8Q9j8p4Q6j56
6799h8j30L47n4m2R8j63N5nk2J16l2j33PK1K55l45K02p6R0j54L2MJ80Lk61J5K15
6826A35r1j98J82j02j14L78j26q0J6j5J1j39J30m4j3N4J00rl7l3l8Q1rJ10j61
6851a2L3J5k2NN5q6P5o7J06o5o8N6K4O0p0r7j42K41lM2j66J30j94J46J63j14k7
6878A8O2J41l39J23r3R2J1r3J54q8n3K4p2P0M8O8Mj34K2N3kJ59k61N0J95l8j54
$$ y = [63, 58, -19, -57, -242, -93, 14, 84, -45, -170, -44, 140, 51, -129, -156, -91, 28, 112, 55, -114, -4, 40, -89, -68, 181, -79, -24, 56, 42, 73, 91, -98, 27, -8, 69, -80, 210, -76, 130, -15, -67, 10, 68, 79, -53, 68, 2, 154, 42, 119, -1, 123, -94, 50, -148, -20, -74, -75, -29, -66, 99, -40, 90, 8, -30, 22, 119, 54, -108, 95, 60, -44, 3, -56, -42, -3, -75, 88, 59, -29, 34, 148, -78, 65, -5, -56, -43, -32, -5, -121, -45, 87, 157, 13, -15, 74, 56, -18, 68, -88, -218, 129, 75, 33, 131, -32, 23, 18, -4, 112, 80, -53, -46, -25, 230, -115, 87, 11, 101, -53, -21, -17, 163, 166, -95, -80, 135, 44, -154, 28, -74, -188, 190, 64, -16, 0, -15, -4, -143, -13, -57, -70, -16, 84, 75, 38, 5, -33, 48, 39, 149, -12, 21, 36, 14, 19, 74, -12, 63, -4, 102, 37, -31, 25, 49, 109, 39, -58, -200, 41, 38, 80, -86, 44, -150, -4, 159, 45, 18, 80, 221, -118, 5, -88, 4, 15, -78, 76, -12, -65, -41, -113, -43, 5, 73, 77, -57, -35, 18, 16, 175, -86, -36, 159, 121, -33]
6905c3j5n1k1K3J01J19j39J2j5%nQ8m6mj47J16K2j09K03o2l5k08L56k03j14J30
6931c7Q1q0J60j65Q4J4J0j90K04r6J94j95j63J74l4J11j10J84j82rN6N5j46J68
6955H8j10o6J3J14r3J07J4m0P5j46l9N4J93k35Q2M0r4N2j3J9q7j33J53Q3j01Q4
6981A4n7j15J93M4q6o2R1K8L9k26J49Kl3LQqm4K08j94J1PK5Q8k61K48j19J29l0
7009E2q6OJ41j17J64k44J85q3Ol0M3J12j31J6J34k91R7R5p2p3J95Rl25K71j39
7034f5nJ07J9r9K02j7j73J2mR0Ll8k09J64k3O0l1j4%Q2l2j14J58k9K6j49J15j28
7062i2J46j41K26k61K69l15N5J85p6R4j11M6j7p1J21r4r4K38j85p0J00J74o1j03
7086c7J0j2r1J15%j25J02J93j47q5J93n7n7j0J49l6k30J15J07j21l4Q8Q7q8j61
$$ y = [-33, -48, -99, -120, -97, 4, 123, -16, -4, -19, -19, -24, 64, 18, 14, -133, -17, 5, -104, 99, 37, 2, -206, 150, -53, -167, -37, 44, -36, 124, -41, 43, 57, 67, -123, 81, -15, 179, -16, -179, -5, -39, 72, -38, 146, -36, -45, 11, 66, -80, 88, -22, -88, -75, 39, -54, 53, 67, 27, 102, -44, -83, -29, 164, -71, 11, 51, -43, 9, -4, 15, -72, -205, -52, 31, -70, 14, -43, -158, 35, 79, -7, -69, 22, 50, 89, -137, 12, 14, -19, -16, -8, -16, -60, 148, -46, -35, -28, -3, 85, -176, 72, -47, 82, 52, -34, -28, 113, -4, 160, -84, 101, 18, 24, -6, 37, 149, 18, 34, 168, -123, -26, 69, -3, -76, 119, 128, -197, 74, -65, -70, 37, 56, -43, 159, 142, -31, -19, -23, 67, 70, 32, -177, -13, -36, 24, -7, -21, -21, 61, 29, -85, 73, 44, 70, -79, 36, -92, 54, -87, 139, -122, 147, -168, -113, 72, -4, 90, -21, 25, 8, -63, 58, -36, -130, 108, -77, -147, -47, 127, 66, -37, -27, -39, -130, -15, -15, -140, -38, 155, 8, -77, 116, 59, 2, -8, 141, 105, -125, -10, 97, -24, -58, 30, 117, 29, -132]
7111a32J77k6j43L97l43J37Pq0k8j28J43K2l3Lo7N3J69j95j26R0j30K84j1n0K37
7136B27m6j76J5L0k3m0J09oj35J27j47J04L0j02J8NJ5j5q8q0M6J09j2N3P2n9K0
7163E1J02j00j52Q8l9Q6J11j13j9j51j23L17q2m3P0o9J72j25j66P1L3J16j20K08
7187A23p4N1j32QJ2o8K40j6o4j35Nj7M1P4Q3j47O3j4k1N0L2qj47J31J0k7q5k5
7215e7J8o2m2J84j3L6j43k0J05J24n8KK9j66JM9O3N7q1M8j69J73l8j32L1O6j6
7242a1m0P7j21R0j26J28J35o5j52J26r7l9nj5R5l2J0M8m3o5J91j75k1J68j4k8
7268A9Q8j81J9mK09j41j5J1n3j6J64p6K0JJ01j94lR8J6O2L5k49J11j9l7M5r6P3
7296a2j43J01J94j99Jm1o1K87o5r1O6k5L3l0L6J69l28P5N2LL2k42J44jJ32j2k44
$$ y = [-132, 45, 19, -124, 273, -70, 67, 74, -6, -34, -162, -19, 3, -30, -27, -94, -41, 128, -67, -193, -103, -233, 51, 40, -10, 227, 181, 5, 20, 50, 27, -13, 96, 90, -45, 82, -65, 39, 69, -33, -15, -10, 5, -10, -98, -178, -132, -23, -35, 18, 90, 31, 51, 153, 53, -99, -11, -50, 36, 147, 34, 15, -136, -259, 58, -24, -67, 3, -66, 106, -19, -185, -114, -81, 35, -85, 123, 49, 100, -32, -24, -12, -80, 160, 144, 80, -55, -50, -67, -26, 48, 131, -16, 47, 33, 12, 62, 94, 86, -61, 70, 80, 53, -32, -57, -39, -101, -143, 41, 28, 64, -79, -99, 6, 130, 72, 74, 103, -63, -62, -13, 50, 107, 26, 74, -95, 78, 40, -92, -61, 5, -11, -51, 26, -95, -5, -131, -3, 132, 67, -85, 41, -56, -95, -100, -115, -20, -52, -42, 6, -37, -102, 89, -86, -107, 61, 47, 19, 107, -74, -55, -59, 150, 9, -6, 5, -48, -64, 100, 24, 44, 45, 146, -48, -51, 47, 63, 125, 160, -89, 22, 3, -34, 11, -85, -12, -155, -54, 140, -59, -58, -99, -160, 127, 62, -29, 37, 12, 45, 15, 51, 220, -108, -33, 19, 22, 54, -188, -44, -45, 87, 75, -169]
7323a69J34J6J9mP5j70K30j12j81J51m7K2k7l7M5l1J58q1J8n4nJ42M8j52J27k59
7349a44K41j49L4J03m3J8L6j44j5Q3r8N1L9O1n3j20%P8Q3j69K10l00K60J28q1
7374A09k22J29o0n7J22k1k9J18j12j5j61J04J40q1J60m7q2j7J67j14O2L4k85K96
7398A38j35P5k38J23k00J45P7O7J18j75N2n4j84J91J69j15M8n8J3p3N4j23k3K54
7422A46k46j1O3nM1J12Nkj94k5K05j42M2l9J4J9j19L42l00J15n0K07j92J26o8
7447D4P8q4j76K31k18J95n0j08J09o4K39l43J72l5l8J4O7m7nM2m4p6Q1Jo4k9K01
7474I3j88J29j57M0n0K04j75k6R2K1j7J80j71p6J67m8LJ2n3J09k13Q6o3J93n8
7499C4j31J01L7rQ5j02p7J03n1n4O1R2mj61O2O8j48oj44M78k25m2j02R7k07L22
$$ y = [-169, -35, -19, 0, -4, 71, -99, 131, 19, -162, -11, -58, -36, -63, -100, -55, -86, 72, -9, 9, -45, -50, 92, 140, -12, 115, -144, 97, -52, -18, 85, 42, 60, 96, -48, -63, 20, -78, -27, 12, 73, 20, -100, -100, -22, 61, -108, 102, -198, 62, 190, 109, -113, 16, -44, -101, 21, 0, -29, 89, -23, -38, -199, -95, 45, -36, 124, 77, -5, -22, 145, 31, 93, 127, -158, 138, 3, 78, -160, -37, -237, -92, -15, 52, 170, -5, 47, -7, -191, 0, 169, 54, 102, 44, 57, -16, 38, -85, -108, 146, -100, -111, -48, -53, -12, 100, 105, 103, -91, -116, 89, -53, -11, -50, -36, -17, -136, 206, -94, 21, -29, 178, -14, 112, 44, 122, 38, -138, 93, -125, 70, 20, -88, 21, -43, 196, -147, 25, -10, -48, -34, 33, -14, -19, 23, -21, -97, -16, -15, -79, -108, 93, -95, 34, -123, -83, -133, 71, -104, -130, -38, -17, -34, 146, -25, -101, 66, 18, 21, 33, -20, 89, -124, -38, -101, 92, 34, -97, 4, 41, 32, 117, 15, -62, 41, -10, -64, -3, 89, 85, -76, -14, 54, -94, -100, -244, 234, 9, -33, -135, -38, -245, 77]
7525G7K2O7p6p3Ok50N4K92r3kK7Kl13K71p3J67j33K3j45Q9L6L9O5k18L09k33K19
7552A56j73QOJ22k22J75k21Q6l1K17r3q2K31k0l9j79Q2j24J55l5j85J74j24R2
7576b4n3J19j61J09j28J47j84K10K6l9o3o4L9J68j41K73j53k92J90p6R0k9p2P6
7600c2K67j08k48O4Q7qRo1Q7j5r3j16K8Q4L4nP6Q3j48J61k38P7q8J20j50J80j00
7627e3J65r4J03k21J40m1K5j54JL3Q1%m6J78j31O0o2m1J37j12J39r6j8R5k48L28
7653A68j46Oj66R0K2j7P6o8J48Qq7J8q3m9J05k4o0L9l7nJ0m7J24j13O1L6J41j71
7681b1m8R6N5j37Q1Qj38J84k6M7j29Q7K8m6j40N2q7Q4J01k4j60J76n5nl4l6O7
7708b0j46J13q5K09j87M7P7o3O3l3r2J89j72K07r9k1OlJ17j8j90J61n4kJ4L9J
$$ y = [77, 99, 166, 90, 17, 23, -227, -173, 119, 26, 24, 51, 53, -260, 11, -62, 105, -28, -5, -150, -61, -25, 14, 79, -139, 170, -63, 156, -17, -9, -3, 119, -103, 72, -149, -63, -94, 123, 30, -52, 179, 159, 120, -59, 23, -101, 54, 19, -166, 8, -116, -24, -77, 42, -119, -10, -138, 9, -175, 35, 61, 22, -41, -105, -66, 102, -39, 234, 81, -211, -21, -97, -7, -36, -108, -32, 235, 127, -121, -57, 30, 22, 31, -30, 57, 42, -51, -167, -139, -55, -21, -26, 50, 133, -15, 146, -92, -15, -103, 17, -133, 47, -53, 112, 18, 121, -100, 40, -1, 24, -130, -129, -96, -15, -15, -61, 117, -14, 46, -16, -57, 80, -32, 107, 11, -7, 88, -160, 168, 22, 28, -138, -48, -26, -43, 33, -35, 113, 121, 34, 52, -31, -80, 25, 1, -59, -20, -57, -62, -52, -99, 25, -88, -27, 9, 150, -21, -69, 27, 82, -55, 26, 34, -104, 80, 54, 101, -28, 59, 87, 41, -99, -47, -134, -50, 51, 27, -133, 43, -12, -17, -51, -87, -20, -166, -53, -138, 71, -116, -69, 8, -55, 8, -25, -117, 72, -100, 107, 8, -13, -7, -10, 107, 89, -101, 60, 6, 4, 18, 57, 58]
7735E8j20J44k38J84q2J1k5o2R9P3o6k8m0O5q6J82k05K08L6L0r1M6J30k40Q1j15
7761e1K37j96J23O6j92N6m9N0jJ10j44l0R0P5n4l29L58P7l14K62j37KO8q7o6k7
7787a03M4qJ40j18O1j6J49j40k8O6q4Q5N1j99M1J6M3QlN7n4J03o9L1N3l3j70p
7815h4K6j2K10p6Q7j31Q7Nqr6j14K11r0l3J71j74P9k68J83o1L4q5M9K8p4j9O9
7842h6J4R8Pk7qN9k07O2J28P3q2O5j33O6n6J07j15j29jJ25j6J16k1j67J97n9R5
7869A05j35N4j8m7P8j1L2Pk64J91j13J96L4o7M8j67o3J07p3N0K6J59lj64q1J94
7895G5lM7j35M9j26J0R3J16j15K9K5Mn1j23J00m4J9O4l6k4J17j15J91l74K70k50
7921a87L27j94J02K0J36j87q2P4J1Oj1l4N9N9k9j13o9O8J68j19j35K32p6l8J07
$$ y = [58, -62, 82, -156, 28, -54, -43, -68, -130, -31, 42, -24, -52, -92, -27, -113, 69, -136, 72, 108, 138, 47, 93, 223, -17, 64, -51, 186, -10, 113, 179, -13, 43, -6, 44, 43, 153, 9, -21, 69, 144, 90, -239, 119, 196, -118, 144, 7, 9, 77, -10, -76, -103, -59, -67, 73, -45, 16, 0, 149, 9, -19, 47, -37, 48, 99, -100, -59, -43, 0, 8, 5, 62, 8, 111, 42, 73, 126, 93, -77, -84, -58, -70, 140, 64, 151, 20, 107, 112, 104, 8, -106, 105, 15, -18, 153, -21, 58, -210, -27, -88, -54, -139, -90, -62, -136, -155, -86, -72, 26, 33, 6, -2, 57, -150, -88, 40, 113, 31, 96, -37, 29, -27, 80, -35, -164, -165, -40, -56, 60, 39, -128, 69, 10, 105, -30, 24, 6, -41, 37, 26, 58, 65, -199, -8, -121, 75, 109, 42, 90, -77, -140, -33, -106, -56, -30, 129, 126, -38, -119, 75, 72, 119, -16, 33, -93, -83, 10, 126, 11, 40, 65, 69, 18, -105, -5, -49, -30, 34, -2, -26, 91, -24, 167, -207, 63, -187, 140, -54, 48, 68, 204, 17, -65, 9, 20, 26, 15, -19, 40, 99, 70, -43, -112, -44, 124, 5, -130, 102, 26, -12, 95]
7946I5j30p0N4q5K05j88J61j7P9j3Op5n5J37j42J01o0j80J75J44j24j37K06l6
7970E1j21J17o1q4L04l84Q5J20j3j90J23R8NK1j79J57j02LP5j20N9L7n7P4L0p4
7996b6j52J65k7K2N2j7j4j09k1J24m5R4m8Q6k04P2K1O3K9j40MJ84r8j2K12k60
8022d5J36j77K84J6q1p3r1Q1O9j75J1j74L24n1J9p9P0j56J42o0J27k91J99O3j60
8047g2Q3j58J98L2o1p7j96L69m6o1k03J74mj31K42K7j06j11K00k8N6r2J19k40
8071h6j31J05R9N9o1J18k5m8J00k3r8j6K30k97J23J19j63Q0k24J06M7j3P2j48
8095g5R1n3P5o4L3K6j53J21l3N0km4R6K2j01J34k54P7J06r1L4o4O1N9j3r5q6m0
8123a83L80j99n6o5O3M3j3N6n5K1J63j88j33J24r2J01j06K29%j77Q9N8l9Q7L6
$$ y = [95, -35, -105, -51, -136, 69, -119, 42, 25, 104, 91, 97, 22, -33, 104, -38, 63, 3, -177, -2, 142, 18, -119, 87, 51, -70, 47, -14, -98, 206, -178, -93, 27, 14, -176, -53, 45, 50, 71, -108, 49, -53, -50, 25, -95, -36, 1, -56, 18, 48, -26, -178, -13, -40, -18, 34, 17, 3, -106, -127, -3, -48, 46, -2, 84, -120, -48, -27, 36, 65, -75, -71, 113, 15, 3, 215, -45, 91, -86, 198, 214, 133, 60, -31, 50, 119, -56, -45, -219, 105, 54, 73, -6, 64, -92, 50, -10, 117, -174, 25, 88, -72, 11, -147, 51, 83, 22, -55, -251, 118, 72, 11, -192, -18, -22, -153, 89, 116, 10, -101, 99, 71, 127, 35, 154, -86, -217, -112, -13, 46, -15, 103, 78, 30, 130, 107, 9, -7, 223, -74, 49, 168, 5, 85, -139, -33, 14, 1, 73, -75, 16, -37, 38, -26, 7, 33, -120, 1, -32, 18, 16, -28, 68, 90, -11, 123, -131, -54, 52, -39, -5, -69, -8, 51, 38, -57, -143, -183, 197, -2, -58, -123, -60, -17, -30, 26, -29, -8, 155, -33, -166, -42, -134, -33, -139, 90, 90, -87, 2, 60, 21, 108, 144]
8148A44P6l55Q1J37N6q3k02J11M9N7l3K5Pl4P8j18O6l0j74K77j91N9j06j31K30
8173dJ2rK6Q4q4M2lr2J90o5q5kL0M4n2K10j10k63
$$ y = [144, 220, -135, -54, 83, 139, 56, -146, -35, 14, 71, 38, 63, 70, 36, 114, -4, 62, 32, -142, 135, -56, 3, -103, -234, -4, 8, -1, 25, 109, 25, 67, 64, -28, 162, 97, 12, 10, 40, 84, 32, 242, 132, -131]
8191a31
$$ Imaginary data points
##PAGE= N=2
##DATA TABLE= (X++(I..I)), XYDATA
0@%%%%%%%%%%%%%%%%%%%%JrJ6j6J6j6J6j7K4l1L2l4M2m8N2o0O6p4Q4r3J03j14
42f0J26j39J54j70J88k08K29k52K79l08L38l72M12m58N09n67O37p19Q15r37J092
63E89j296J579j996K674l952P149k8134m9394Q1400L4172l5613L009J2120l4793
77a2486M017M1460j0549l7695O889J3900o665J484O590r868l097J0397j322j2580
91i525M043J2171o696j0049R706N857j0364J317J1061o970p519J2493O425j1848
105A02n486N872O842L044q633j1672N666J0139k996k095L02r657k131J4205N442
120H944j0479n380L826K080j000N17L711j205q844m15J1636J754o461L578R35
135C197p064N064O729q159k161P695n669o149R678J747r030M171N425r303k056
$$ y = [0, 0, 0, 0, 0, 0, 0, 0, 0, 0, 0, 0, 0, 0, 0, 0, 0, 0, 0, 0, 0, 1, -8, 8, -8, 8, -8, 8, -9, 15, -16, 16, -18, 24, -24, 28, -32, 34, -40, 44, -49, 54, -60, 66, -73, 81, -89, 99, -109, 120, -132, 147, -161, 177, -195, 217, -241, 268, -299, 338, -381, 434, -503, 589, -707, 872, -1124, 1550, -2402, 4747, -23387, -72781, 8619, 42791, 7178, 10187, 22307, -12486, -8469, 32991, 22442, -15253, -8364, 5536, -1129, 355, 6945, -2923, -6020, 4377, 3055, -9525, -5482, 6689, -7, -10056, -350, 5507, -4857, -3540, 7521, 551, -6968, 5525, 11950, 102, -5384, 488, 7330, 10374, 1741, -9931, -4265, 5874, 2878, 783, 1085, -8572, -10703, 3502, 8944, -1535, -6915, -3089, -1009, -2009, -1492, 2219, 1014, -7830, -8245, 3391, 5145, -1316, 2262, 3197, -3867, 1197, 7926, -233, -2394, 5301, -368, -6517, 3161, 4908, -4122, 49, 5474, -3829, -5885]
150e885R054j646p374K630L332k864n74L454J434q52R2J828o51l741M7L349J76
167A809k884k164j546K476O182K59m437p27J682J763K774n24l947J89R04k327
183e18L90K341j773j427m6l699O2O586L59m971n54J130M71M086P79m159p49J941
201B49k43J264J278k814K04K962j104j780J573j47j523J392j590m534J241L049
217e23j224o49N64j464N28K813O06j205N00K5j064M4J726J689L87j655j370J306
235A034J671J128l4k662k586J376Q10m98O99j039k384Q99J195l33M37O25j851
252a513j038J597O7l88J957k03j634J098Q44l02J417M78j769q02M96L08K08P30
270A551q68q11j65n33M47J197p90j398j10n73K12J690K21r20L94m66j16J123Q46
$$ y = [-5885, 3169, 1523, -5851, -3221, 111, -2753, -3327, 127, 1561, 709, 801, 2629, 1978, -1763, -1716, 1633, 1809, -1075, -3239, -4785, -2309, 3873, 4132, -305, -1032, 650, 2413, 5187, 4663, 716, 905, 1809, -518, -128, 2213, 440, -987, -1033, -4732, -4670, 1916, 2275, -2696, -3250, -2120, -1649, 2437, 3216, -943, -1692, 249, 6, 1270, 2548, -266, -62, 2900, 1796, 16, 1589, 1442, -81, 1311, -279, -4813, -3572, -523, -1747, -2396, -1832, -3296, -2768, 45, 651, -554, -54, -29, -1093, -1049, 677, 2366, 2753, 1098, -272, 1034, 2705, 3833, 3799, 1137, -1449, -73, 737, 239, 938, -101, -2485, -1586, -391, -724, -287, 338, -1513, -2551, -954, -887, -1275, 682, 479, -1155, -57, 787, 485, 1902, 2380, 611, -191, 305, 613, 821, 1551, 683, -128, -293, -826, -379, 818, 28, -1370, -1480, -2053, -1841, -151, 70, -850, -456, -922, -1038, 85, 931]
289I31q77m80l4m54N08J793M30q77N4l83o5R55L25q45k54r20o54O56Q00n2r39
310c82l46n28j56O06M44j61n51o45K82R08M73N21L73p72m06N84P04L98l8m61m81
331C66J87M06K25M11m54j278p79L75k85N6L72q79q71K20Q42Q42Pk61k57o6R2N38
353a91O02J09k54l09O90O32O06O15l91r69o05j85M01n7p68q74l80L3M19N47J48
374a81m58n18nL53J15K40L90l24o72K46J109Q06K45n3o11P6P29K38l69P7q12n20
396A01J94J02m81k38M41p91j076M27J182p0l00P4j89k95M67N48k71l47r1k48N3
417h08Q96L24JL35m09r75J104J364r14j259Q2k35l91J532J93j572j40R74l45R2
437a51Q2p57j93N06j279m23J811P04j220M58J203j50P58R58q67r53R72J40l03
$$ y = [931, 54, -426, -460, -914, -406, 1387, 1817, 940, 994, 611, 546, 1501, 1826, 981, 727, -193, -847, -191, 609, 557, -382, -728, -1256, -1412, -806, -362, -523, -1074, -1719, -1437, -529, -56, 465, 838, 66, -340, 244, 948, 1346, 1308, 847, 366, 553, 959, 1184, 1595, 1141, -137, -916, -541, -826, -770, -398, -1277, -2148, -1928, -1086, -244, -237, -498, -755, -821, -729, -191, 411, 520, 266, -43, 647, 1279, 1885, 2500, 2109, 1140, 535, 350, 751, 694, -74, -948, -1328, -1295, -876, -329, -181, -639, -1157, -1162, -809, -694, -454, -64, -388, -1060, -814, 295, 1101, 1346, 1293, 682, 758, 1487, 1725, 1356, 1433, 621, 101, 295, 397, -84, -322, 119, -672, -1748, -1321, -139, -209, -509, -435, -624, -919, -452, 96, -175, -522, -613, -861, -808, 88, 412, 413, 748, 339, -636, 468, 1832, 918, -341, -259, -494, -885, 647, 840, -732, -872, 102, -243, -151, -69, -826, -1019, -513, -1792, -2215, -404, 300, -920, -462, 741, 591, 1349, 2307, 1440, 487, 1459, 1599, 1296]
456A296n69l08J75J238p75k030K97J664P7j085p98p34m52J606J027j469j716N86
474a970J724M09j26n01J31Q97M61r35J59J301k35j304M87k13j055J502J292k598
492e74j356K352O47j093o3m29j120J218J40k206N33J528j029L2J096o11l2K946
510A979M01k504J87J564k47K56M8j836r4J552m64p20R31j082o92R53Q7k333L95
529a619J476o38j368Q16Q78j70J116O15r70k69Q45K63l58P01k55j637J78Q93J57
548F54K22N22j422j354J744J738j229r64l9j055P06J779j425j491J032n44n78
565a704J804O0k150J066J784j662o6K058r97j221J917Q1j826R82N31j504J118
582B71J678j523j098P86k70L74J161j594k407N16J901K49M19r74j890Q09K910
$$ y = [1296, 727, 419, 594, 1832, 1057, -973, -676, 988, 1065, -20, -818, -1552, -2004, -398, 629, -840, -2556, -1970, -246, 163, 37, -464, -333, 564, 1025, 90, 249, 1550, 1315, 11, 498, 285, -770, 732, 2024, -574, -1930, 422, 1069, -24, -87, -516, -1636, -418, -278, -2484, -1951, -423, -1452, -1420, -324, -935, -967, 1979, 2380, -124, 63, 1627, 1380, 1636, 1684, -152, -246, 1306, 842, 122, 1053, -29, -721, 232, 319, -2014, -1619, -143, -781, -2149, -1333, -455, -625, 491, 1106, 136, -133, 712, 975, 617, 1318, 1063, -574, -396, 497, 654, 876, 1398, -24, -1378, 366, 2104, 875, -89, -128, -1183, -477, 1302, -123, -1614, -582, -1126, -1704, 100, 160, -1990, -924, 860, -802, -868, 1190, 193, -1028, 889, 970, -856, 126, 657, -847, 271, 1949, 426, -672, 114, -156, 218, 1379, -215, -2622, -2106, -205, 44, 463, -511, -2401, -1592, 1318]
599A318M13j452q02j06m4J307Q65j108r45J007M36m39Q20M16j060n61Q57p2r71
618a21Q91k36j464N84R34r18o74R87q81J19J049j158j203J383J095p85O59j84
636G7j640J141K586p69j109N89o02n87K095l3j941K0O22j435K95J236j154q82
654a491R76m48n42J242N05j125O9L55K9J98O92l99k11K11j0j42O27Q62m64n08
674D26P6j00o6L56J93p04q82L54O7o9N49j17j229J19N92l73L85M29p10m3Q77l63
696b33k87J277K44j069K97N18n82M56R42j082n41K81j92J20R09m53j265J88M7
715d25l67O79O89j481o06R21O7qP04l30n78K09K58J78N47Q5m84j32K68K87J33
736F14M14l32l29k79Q5Q7j07K4j22m83o14N20N37m12K50k05l01k60M58K77K88
$$ y = [1318, 1731, 279, -523, -629, -673, 634, 1499, 391, -554, 453, 889, 450, 1270, 1686, 626, 65, 922, 850, -121, 770, 534, -930, -346, 588, -330, -1004, -17, -898, -779, 270, -888, -2091, -708, 387, -398, 261, 77, -1563, -422, 2164, 1395, 286, 875, 273, -314, 1781, 1748, -193, -173, 449, -986, -691, 545, -609, -1491, -515, -963, -1505, -263, 242, -883, -814, -459, -430, -232, 460, 61, -150, 61, 51, -91, 536, 1398, 934, 426, 502, 402, 336, 692, 885, 181, -701, -347, -280, -349, 200, 83, -1146, -1027, -435, -808, -423, 6, -704, -747, 130, -233, -520, 757, 1001, -68, 229, 747, 165, 621, 1563, 481, -60, 221, 29, 149, 1058, 605, -660, -472, -425, -792, -113, 576, -905, -1511, -590, -523, -531, 173, -157, -735, -526, -268, -90, 457, 542, 58, -74, 194, 481, 614, 1028, 696, 367, 88, 173, 260, 153, 177, 55, -428, -1042, -522, 15, -397, -147, -352, -653, -913, -455, -178, 110]
757A10Qp05j02P76L97J63J95k05q40O20O40k19R6k28q34n1N85k51K6N2p63n04
779a034N24K55k44K69J63q37m2M65L38J49L02p04J6L13Q3L70N13k32n19N5M33
800F36l9K70J10q31l72p4P5N57k39p07m7j76J35L07L95k62l82N4N7J66M59L66
822D58q5p8j94J4Q68J76o05Nj86k99O66l0j45m39j83l29J73L07j80j14N2q02j96
845a146O12K09J87k95k89j05L56O91J19l4k97%M01J80Q1l0J83o60l52K85K66n2
867C10j1m26k03j26M95J8J05l37o10p8K90K59k49K91l3k50J37N14M43J78m3k67
889D07j67K7L23N25o21l06k93J80J93J0J34l96j00j58j34K03M30n55j09k18j09
910g34R4P94K49p24k36K91J76K86M38j95k65K9Q6M9J49J61k05k16%l69L34K20
$$ y = [110, 118, -587, -689, 87, 484, 647, 842, 637, -203, 417, 1057, 838, 934, 706, -128, -179, 406, 155, 181, 233, -530, -1034, -510, -255, -499, -230, -67, -904, -946, -481, -143, 6, 308, -396, -380, -67, 16, 386, 899, 667, 148, 203, 636, 597, 867, 977, 146, -226, -300, -225, 332, 93, -614, -661, -837, -702, -395, 0, -262, -644, -590, -533, -367, 92, 458, 373, 295, 101, 115, 983, 1159, 554, 559, 373, 74, 740, 710, 565, 126, -57, -386, -213, 94, -86, -200, -148, -950, -1146, -534, -325, -138, -433, -722, -827, -471, 220, 339, 305, 8, 8, 409, 589, 670, 640, 823, 163, -189, 96, 362, 310, 299, -127, -330, -456, 39, 57, 162, -175, -785, -863, -573, -314, -563, -272, -305, -555, -418, 96, 539, 717, 674, 407, 240, 267, 590, 1115, 494, 188, -105, 75, 268, 278, 412, 16, -84, -242, -376, -173, 257, -298, -407, -625, -734, -640, 154, 403, -321, -557, -266, -90, 196, 634, 439, 174, 203, 289, 338, 487, 648, 443, 227, 227, -142, 192, 412]
932D12k13n71k60M9K14R6Q6m05q9P2r6K78O28j51k98O9l8KN43O70p00m92K79J92
956B77L52jJ06o90j32L20L0q0m1o26j58m2l3j72P23K78o96R5N24o1m0O20k13l99
980e9M9J29J29M23K73o73MR3Q8j54Q80n06j167P6M62o2n0L10o44p26O26M19k35
1003c15K42k09o95M66Q03n38K6P61l30o65Q76K95n41P3M12l36l63K30m8q6M88
1024E46k36o50J34j08j86N41L84j353m03R91L83k64J44M9o36L15O61j2q1J22n86
1045b45K23O99P9m79J04L71r21k0Q71l91n05L30J27o89J04N55m43P2J81n78k72
1066h27O93j62p2Q17l29j169O60J073k77j35L33n62m84J218L90r40j09K65n83
1085b00N27M62q06m66N05j32n30L58K58p60M42M70n99q5L97j44N2M76k90n38O08
$$ y = [412, 199, -372, -632, -583, -369, -273, -187, -592, -681, -609, -705, -427, 201, 50, -248, -179, -217, -215, 328, 998, 298, -194, 85, 277, 629, 628, 734, 44, -88, 232, 262, 182, 141, -485, -643, -685, -718, -890, -167, 111, -585, -490, 34, -27, -67, 553, 340, -59, -10, 119, 248, 671, 944, 271, 275, 368, 456, 302, 1182, 676, -491, -415, 47, -15, -65, 245, -399, -1125, -499, -80, -315, -73, -282, -977, -511, 292, -246, -220, 541, 211, -454, 422, 717, 176, 249, 661, 325, -38, 192, 144, 58, 546, 310, -340, -206, -314, -500, 41, 425, -928, -1331, -340, 43, -221, -77, -28, -664, -349, 312, 300, 219, 341, -245, -22, 677, 756, 277, 381, 752, -169, -189, 682, 291, -214, 116, 243, -446, -342, 213, -230, -158, 23, -555, -827, -134, -296, -368, 449, 120, -1049, -389, 684, 407, 272, 605, 43, -441, 777, 1167, 227, 118, 383, -200, 327, 789, -17, -483, 22, -110, -640, -282, -24, -784, -342, 128, -471, -556, -159, -303, -251, 225, -65, -603, 5]
1106EM87k82K00J62n12k84Q30L35o76O0k40o47L13R78m05r32K44q9j45P02J32
1127B36j028J16L25j8O2P22n80n54Q58L01n37L35L89n26J65O71p45l55O31J66
1147F34n15K37k91n37M57N37n04m79L24m58r4R08k08o51m9L64k27M33O09n57k86
1168c53K88L55lM09p5n16M3L34k00K4M15m09n89K87L9l57N8J54l13l2J94k84L0
1191e01L59J01l12j38L28j60M07O47o59k33M82J60j94L91J07q69KM05j36J06M00
1212F93o93l40N00j13n42K28J31m93K29K07k18L2L32j10m08L04K34j09M57q3j00
1233A38r6J35R9m6L30k22l06J18L6N9p4O9l87k18O7J61n4Q9k55k69M7K74J54q7
1257b38J83K8m7K6L20j24J63L6j19k79M24j14OJ18j20k00PJ84j20j14R6l87k9
$$ y = [5, 492, 210, 410, 572, 60, -224, 606, 941, 265, 325, 85, -562, -249, 729, 324, -608, -364, -453, -598, 104, 236, -792, -676, -351, -369, -307, 415, -165, -719, 139, 440, -97, 238, 627, 101, 266, 937, 192, -163, 468, 634, 119, 356, 65, -472, -15, 522, 18, -461, -137, -595, -689, 219, 11, -640, -689, -325, -552, -119, 490, -67, -353, -65, 290, 287, 696, 621, 105, 148, 482, 282, 306, 721, 312, -277, 10, 49, -308, -250, -96, -409, -441, -247, -531, -501, -142, -41, -353, -491, -163, -323, 84, 731, 72, -161, 321, 481, 287, 678, 785, -84, -82, 323, 187, 293, 693, 0, -340, 160, 47, -495, -267, -136, -629, -400, -193, -411, -379, -47, -157, -565, -261, -27, -136, 321, 238, 138, 42, 177, 276, 230, 560, 338, 32, 150, 186, 245, 171, 240, -147, -365, -298, -137, -191, -102, -357, -626, -579, -305, -151, -238, -55, -27, -74, -48, 272, 148, 311, 347, 228, -51, 373, 259, 265, 383, 263, 63, 70, 254, 134, 20, 116, -271, -300]
1280c00K01r0m0N1J32o03K38J93J05j31K09k03J43n2L63J96j79j71L6p0L29j08
1302B49K24k10l17q1J23R8j41k1j8m66J82k9J51N5k59N3M8Q6J84J05K4j34M6n1
1326i9M01J05o1j58Jk6K8K60k62L0j03j88pN7Q7j44r4j81K3M6J1L4j09Q5j78L14
1352a28P4J31Q0k1n2J23M3J88j26Q0j70k4m0L24j82j1r9l14J34j79J41r1j39j43
1376d01Oj5L2J36K16L2l28J39J81J52j65K8J16J4N8N0J30j07r7n4R9j29N3Mj54
1401dk09o3L8O4lR0k52M1J0O1J46M3j70l0J58N9J9J17K15j70p7j29Q3L26N3j59
1427B57l20J32J76p0nR1j60l03J16J39k95J02om1l32K82J40N4r5l9j34J00L22
1450A11N7J9k41J29M5L87j47j53p5K34j66p8l2L6k11J75m63O1J05j50J0K83j97
$$ y = [-300, -99, -189, -229, -178, -46, -649, -411, -218, -113, -244, -35, -238, -95, -147, 216, 412, 233, 62, 98, 28, 357, 249, 473, 263, -54, -135, -12, 86, -55, -76, -94, -560, -378, -407, -256, -201, -460, -407, -359, -273, -89, 16, 40, -94, -48, -99, 302, 407, 346, 188, 189, 163, 191, 451, 189, 219, 116, -72, -79, -22, 65, -79, -173, -354, -331, -285, -274, -240, -349, -264, -442, -128, -54, 77, 157, 136, 84, 207, 250, 438, 312, 392, 222, 198, 158, 482, 300, 289, 190, -124, 10, -169, -28, -119, -258, -401, -395, -410, -378, -242, -26, 6, -322, -183, -2, 150, -15, 13, 129, 143, 201, 251, 381, 274, 177, 123, 222, 93, 146, 150, -4, -213, -276, -238, -174, -177, -87, -339, -298, -288, -227, -81, -38, -208, -238, -80, -21, -2, 115, 330, 160, 83, -46, 37, 363, 416, 257, -63, 69, 245, 175, 170, 261, 101, -202, -86, 53, -242, -140, -146, -187, -519, -237, -97, -43, -138, -177, -311, -211, 111, 168, 187, -54, 75, 120, 507, 360, 207, 132, 366, 200, 122, 90, 126, -85, 90, -373, -312, -207, -357, -347, -64, -261]
1473b61m21K73L52lj12K35k42J44J39K19j6l9l7k14J86J84k44J87rk56l02L73
1495A36k4l67k1L59k47j56Q2J36k54J26k2k05L36J16J09J12n0l10l3L73K41k03
1517B34L83m17j52K16K97l45j51J09j61k67M57j27m94J66K42l90K77L41m53k32
1537d67K99J63j87L04K7k87K65R2k68j11M81j2j33J90j78l34M12K23k80j06j15
1558b2j62j80O11j07m78%K40l91M14J41k46k16K64N9j32M17P3l78J45K63k19N6
1580A52K72k56k09M95n7m83J74K12k08%O5m23p7N47j29l16J34j23m89N61M07o03
1602c54m9K52M1MN55j75l70J08M43j58l1L14m04k80L93q1k48J21ll33Q5K90l31
1625b11j94M83k89j13J68j48j8J96L47j36l65K19J8LM85j3n20J35J24r9J91K96
$$ y = [-261, -682, -409, -57, -60, -172, 63, -179, -35, 104, 323, 307, 268, 231, 17, 203, 387, 143, 330, 321, 65, -237, 136, 112, -255, -276, 83, -164, -320, -238, -102, -356, -230, -252, -457, -121, -5, 104, 216, 166, -144, -177, 196, 437, 234, 617, 200, 48, 264, 561, 216, 65, 174, 13, -254, 203, 76, -418, -252, -10, -400, -123, 218, -235, -467, -168, -5, -192, 112, 139, -148, 117, 209, -59, -170, 311, 299, 166, 356, 178, -156, 256, 479, 199, 93, -22, -184, -364, 247, 140, -338, -338, -98, -489, -75, 66, -180, -396, -132, -73, -205, 212, 285, -93, 52, 315, 96, 152, 424, 168, -41, 454, 397, -86, 88, 300, 92, 92, 157, -266, -343, 204, 75, -241, -107, -230, -719, -158, 249, -354, -403, -151, -110, -106, 449, 274, -96, 12, 455, 297, 266, 580, 176, -104, 289, 208, -40, 81, 78, -255, -170, 120, -211, -405, 78, -211, -324, -156, -304, -322, -126, 221, 85, -280, -61, -43, -40, 445, 432, -88, 47, 171, 72, 263, 559]
1647E59l17n66K51K80j30J58j62m75K35M38m39p1J48j96p0L30n5k16K08M20m07
1668g7p3L22k05N8M16j84k62O7J45j85L34m5k64l35K54J72l30K67j80l40K07L73
1690A35j66j50K01k35k09L91J44k24K9P5j01n9M42j01j24K19rk58L92J5k79l5
1712I3K63l91o8L46k08j64L00l02k95J16M08j03j58J09m63J8N09J2j4j6J12k54
1734a50l2O22k78J92r2j85j10K13K34k96l0Ml73LL52r5j66O4J6m20J99K00j18
1757b46J84k2k47Q5L47L06m43O3O6j47Q0N07j56j38j74P9k38J00K72l85l2m6k77
1780d62J93K50k32J46j56J89k90K23J97l2j09n3K98j06K10j56J76o4n0k34K72
1801B10Q5J1j47Mk97K11R2r9k3p5j57M6J30m8%j74R2J3J26p0L6j7j55K90j43J4
$$ y = [559, 242, -324, -73, 207, 77, 235, 73, -402, -167, 271, -168, -239, -91, -287, -357, -27, -82, -298, -90, 330, -77, -150, 172, -33, 25, 441, 257, -5, 62, 207, 22, 356, 311, 47, -288, -34, 138, -192, 75, -105, -445, -238, 135, -31, -181, 20, -215, -424, -33, 111, -113, -84, -9, -110, -169, 273, 172, 48, 267, 258, 0, 392, 407, 128, 93, 356, -35, -103, 243, 35, -129, 171, -131, -426, -310, 98, -5, -163, -54, -517, -499, 10, 22, 8, -8, 104, -150, -182, 440, 162, 354, 262, 77, -33, 180, 414, 118, 88, 92, -281, -278, 74, -21, -187, -123, -107, -527, -328, -128, -246, -62, -84, -331, -246, 101, 407, -36, 27, 93, -54, 26, 533, 377, 239, 65, 144, -94, 6, 278, -107, -139, -185, -462, -269, -19, -251, -105, -261, -72, -362, -139, 58, 26, -83, -136, 162, 56, 266, 110, 286, 222, 172, -62, 210, 295, 306, 159, 163, -134, 77, 169, 70, 47, -28, -185, -139, -9, -57, -57, -231, -139, -126, 0, -70, -34, -51, -206, 84, -59, -45]
1827d5K20Q4k17M2j02K31j50J06j21J3k26Q4J8L6J10j90o8j25J34M5N5k03N3J2
1851b04L9l3L32j21l9J02o0lL21q2M1p6j26L6J86j65N8j09p2K8J51j37Oj88n7
1876a72l7l4J16M7L9J5j98j34K38J28J86o3J7j96P4J10J00K3o7q9m6J49om1K01
1901C60k43j49p8J86j74K56m27J90j79o4J71j00J50n3l8J68J06k20K96N9k36N7
1923C8P9RR8r2o0j16M7J17j40N1Q8j39o8j25J07n2R1j26J23k07J13L15l01L0M4
1948g6k13L03O4j27K94j81j62L19J83l7k83LJ90k06o4J18j02K0p3j88J79j23Q9
1971g3l3rp5j42L35j17O3M3m6m1l3K85j75J42K9M6l85L81J07k49N7J36j97J6J42
1996B07j09j61M3p2j05K6Q1k5r0L9k4l5K64j6k12m5L55j73K04J18j30r9K14q3
$$ y = [-45, 175, 259, 42, 84, -18, 213, 63, 169, 48, 61, -165, -81, -63, -27, 83, -107, -175, -300, -166, -121, -66, -269, -216, -204, -165, -198, 134, 13, -26, 76, 16, 13, 334, 252, 293, 217, 91, 127, 313, 148, 206, 97, 25, 53, 204, 67, 73, -115, -172, -209, -243, -127, -80, -41, -26, -224, -358, -120, 8, 194, 131, 148, -48, 26, 136, 236, 259, 192, 103, 57, 206, 200, 159, 360, 117, -32, -110, 76, -98, 158, -269, -79, -258, -322, -151, -251, -101, -154, -192, -24, 82, -138, 158, 217, -19, 38, 117, 126, 224, 132, 72, -44, 3, 120, -20, 31, 119, -20, -88, -213, -106, -158, -67, -193, -70, -277, -164, 151, -150, -120, -76, -289, 14, 78, -49, 245, 64, -98, 221, 404, 367, 84, 87, 277, 71, 7, 125, 23, 43, -30, -218, -39, -162, -73, -106, -115, -190, -332, 3, -114, -51, -8, -54, -95, -128, 157, -18, 124, 153, 199, -186, 195, 302, 53, 110, 246, 49, 65, 207, 98, -63, -20, -92, -197, -171, -90, -115, -205, -166, -190, -225, 39, 23, -189, -234, 121, -52, 152, 270, 140, 41, 255, 172]
2020A72j92J94M3m8k3l0n7k05K81q1K9o1j72j45J37J21j28KK22l49J66L04j83
2043cj65J08J50p2J6K84j03l18M55q2k22J66m5k25J25J39j16k99K44j18k75K83
2065g3K9k71J70J32j33J46L7j33n0K42J56j87l9J60j62O5K55q7k11K20k9j04J71
2088C04j54k63M5M9N2o8o2L7l54M27J6k04K35j04j91K84K7j93j90N43k01j30L15
2111B20n6j65K53l9p8K0l7J30j86J88J6m68J43J14j19M0K1k66j74M13K9r1N6j61
2135a97J41N4J93k49J9K62r1j12K44qk26n8K05j58L9pr2k92M61n1j79l4Jj67N
2160b97K41m3j58J68q3K16K1j73k08L01K12L5o0J6j21n0K81j59j25Q3M2k63K10
2183H6J90k33k12K27q0j04N8r4j09J28J41k34P5J25m7P1o8P1q5J1K07j04J30O3
$$ y = [172, -20, 174, 217, 169, 146, 116, 59, -146, 135, 54, 83, 22, -150, -295, -158, -37, -165, -163, 59, -290, -124, 180, -3, -168, -60, 90, 18, 34, 318, 215, -103, 352, 270, 48, 214, 169, -56, 69, 208, 92, -207, 37, -81, -356, -73, -44, -315, -145, -13, -146, 0, 37, -96, -146, 96, 252, 65, 26, 186, 24, 89, 344, 257, 46, 266, 237, 133, 304, 150, -113, -68, -19, 33, -35, -97, -60, -414, 13, 29, -175, 60, -44, -235, 49, 76, -117, -307, 236, 35, -95, 220, 164, -1, 252, 213, 135, 155, 118, 248, 62, 250, 266, -202, -59, 55, -64, -24, -3, -269, -443, -30, -1, -92, -36, -197, -56, -2, 191, -58, -39, 223, 132, 20, 264, 256, 30, -28, 177, 19, 58, 51, -41, -333, 128, 77, -102, -136, -135, -302, -297, -56, -99, -257, -89, -172, 44, 65, -108, -316, -15, 197, 232, 172, 188, 67, 17, 298, 139, 14, 97, 139, -124, 86, 276, 43, -169, 58, -22, -126, -68, -162, -271, -143, -2, -236, -161, -36, -83, -12, -80, -9, -94, -83, 124, 20, 150, 213]
2207B13k74J00J98J4j44K2P1k44L7K7J43k03p7k2qK55m5m56J11K06k23K31L7o4
2231i5N3l0J43j80L57k1r3N1p0O4j12J89L8k83n3J18j00r3J81j72J20o1k8j40
2255b17j2R1O0j37J15M7J32J67k05l3O4O6nj19K38p8j21J83j22R2l5k28l0K04
2279A17j21m1q2l9R8j49j36Q3J46K07l51O9N5J57j93J97L2o6JN6J78j16L7om7
2304H6P9k65J10J34j2j56M5m6n1P4j61J83j07J68o6j78L8J56qk21K31j62L81j64
2328H8kL5l2L1R0j1j8m4j15M4O6R6j73j5r7j98J92m0J1N8Oj70J87j80M7J55j95
2355a84J93R4j41K5K9R9jj70J50k1J43J53l36J07r9KL9K4L3k43m3O6J13j37j13
2380b18PJ16M7J1J0JP2J02j62l4p6K16Q3n8J11k19J84Q6j49M3j05q2R4j49O0j23
$$ y = [213, -61, 39, 237, 251, 107, 129, 200, -44, -7, 20, 163, -40, -117, -139, -147, 108, 63, -393, -282, -76, -299, -68, -31, -95, -42, -72, 71, -109, 248, 227, 134, 185, 115, 179, 67, 256, 294, 11, -42, 76, -24, -117, 64, -108, 12, -49, -77, -217, -229, -138, -78, -215, -100, -53, 79, 246, 41, 8, 72, 138, 133, 14, 252, 174, 53, 236, 114, 206, 171, -57, -87, 117, -4, -45, -127, -166, -68, -217, -353, -270, -124, 83, -268, -199, -144, 13, -180, 17, 49, -17, -16, 40, 218, 102, 139, 133, 86, 165, -100, 10, 144, 132, -24, 21, -25, -76, -2, -163, 20, -87, 81, 15, -163, -125, 31, 23, -198, 33, -129, 252, 88, 86, 121, 89, 120, 210, 199, 181, 137, 22, 66, 132, 228, 55, 40, -57, -255, -63, -103, -92, -34, -28, -198, -11, -191, -144, 11, -184, 9, 103, -38, -13, 16, 115, 114, -56, 94, 73, 216, 369, 33, 140, 41, 43, 82, 106, 139, -104, -147, -81, 32, -105, -218, -211, -95, -48, -37, -27, -26, 46, 148, -14, -48, -124, 92, 175, 117, 228, 9, 193, 279, 130, 173, 68, -14, 80, -69, -9, -132]
2406a32J36O9k43J54j16J07j8m3j0K08j23q4J55L4J40k25o4K23j73J55RJ10k50
2429A9Nn1K30l05k7R3Q1k50J11J15j20L3j31J34J9rJ16o1P1j95J70r3P0m3J64
2454A46k00Q7M7P4n1j22M2J9n8J83r4Rj37j56Q1J01n7Q3j03rL5m2k4J56J4q2l5
2481i3m0J50j0j8N4J16r0j8J04J37l24J75k0j87M7J00o4m6k03K31L0m7p3K23n1
2506H3r8j11j2K23m6j43J61p6oK6Q8o3N1J68k17O7r0J24j4j23J2Kj45K18j92r2
2532b05O6J40k3j7L6j55k0L19k02K9R8j52N3J54j32N6K3K94k77L1r7j74R5K04
2556A44j04NP1j21j6l0P1r2k3L9j3l0L4oj60l2J94L7J3j08m1J04K18j4j63J9J00
2583I6m8j1N9k35K4R2J49n6p7K9j55J37J16j02j60J57j64qJ60K6j54J61J33k49
$$ y = [-132, 4, 73, -170, -16, -132, -25, -43, -86, -96, 112, -11, -95, 60, 94, 234, 9, -55, 168, -5, 150, 159, 269, 19, 24, -27, 203, -102, -129, -36, 45, -205, -94, 21, -99, -66, -197, -63, -44, -53, 63, 2, 73, -122, 48, -45, 25, -18, 146, -54, 33, 80, 154, 103, -19, 23, 42, -16, 167, 73, 82, -55, -211, -130, -29, -86, -3, -106, -115, -80, -122, -146, 10, 24, -58, -93, -133, 17, 7, -11, 43, 159, 69, 51, 155, 292, -32, 143, 123, -64, -17, 83, 19, -27, -230, 1, 31, -16, -89, 134, 83, -15, -126, -138, 85, 39, -104, 57, -19, -25, 1, 89, 26, 77, 245, 28, 95, 5, 129, 115, -8, 4, 6, -139, 79, -113, -205, -139, 1, -22, -39, -3, -158, -178, 141, -61, -32, 66, -86, -33, 121, -11, 45, 68, 362, 85, 116, 19, -155, -60, 144, 40, 45, 116, -5, -21, -51, 20, -72, -95, -56, -69, -99, -65, -71, -231, -263, -69, -32, -19, -127, -168, -64, 154, 140, -23, -4, 96, 48, 37, 96, -139, -115, -23, 126, 70, -7, 22, -133, 4, 120, 18, -142, 15, -149, -157, 3, 29, -125, 36, 169, -80]
2607h0lL46k41l1L0J70r5Q8j93P2j28J48o7J7p3j98J14K41j19j2p0J25j80K1J89
2632G1j49Q0O2k3j74K98l07J01J63j87J47j45J54PNPQ8l01N4m8J09N1k3j6o6m3
2658h5J01j43o2j2K2M8K1O0j83K55K1k85K67J4J13k26L15m4j49J46o9p7R8q2j59
2683i5J5K02k43J26J31k37j87J90Q0q6M1n8K1Q6j10Q9R1j42P6j06K16l2%J2j00
2708b0K43k13J40m7k50L32p5l67K91J34l45O8J23l1k56J20J10J31l09J78j47J98
2730HM6j39N0M9n7J08M6Nj46J68m5J07j53K1L8j53P4L9j57K50k64P4J4K6p9r0
2756a60J46p9J6MJ40q3l1R3M0NL7j50jJ68j18O6m0J1l8m0J27r9M0j25J49n5j61
2783a38K90k71J24j51K71j77l3Q1J17j27q5O4J07L2j81Q1Q6r4J21J8j08l2P0O3
$$ y = [-80, -83, 263, 22, -9, 21, 191, 96, 184, -9, 63, -65, 83, 16, 33, -40, -238, -124, 117, -2, -14, -84, 41, -139, -118, 71, -78, 2, 64, 41, -133, 165, -142, -41, 122, -65, 82, -63, 91, 98, 103, 110, 198, -103, -49, -97, 12, 63, 40, 24, -42, -85, 16, -127, -189, -201, -179, -131, -110, -50, -233, 22, 43, -242, 25, 39, 152, -74, 241, 197, 48, 194, 125, 48, 146, 64, -95, -80, 122, -121, 5, 136, -101, -288, -98, -18, -104, -63, -121, -100, -14, -124, -35, 56, -86, -10, -116, 100, 68, 68, 80, -20, 223, 10, 150, 103, -147, 185, 110, -257, 34, 168, -177, -109, 14, -17, -273, -153, -43, 88, -221, -43, -190, 8, 54, -85, -35, 14, -43, 65, 111, 116, -30, 138, 93, 200, 47, 68, 106, -47, 27, 66, -91, 159, -105, -31, -17, 9, -70, -160, -14, -93, -77, -73, 67, -16, -47, 46, 86, 91, 128, -22, -23, 145, 27, 93, 53, 64, 26, -14, 113, 14, 54, -71, 78, 23, -138, 152, -119, 5, -146, 125, -52, -85, -4, 113, -14, -99, -35, 72, 104, -77, 4, 90, -4, 117, 135, 27, -5, 65, 128]
2807A28p4l29L67p7mk03O0l6O1J50j66J33M2o4qN3j0j57l9K13j23O8O5j43P5k8
2833d6L76k53J22k17k7O6n8j27K15o3L3n0m5L1p4J34j61N5j0N2J8K28k85N6k09
2858b39K91O8p0l7J78n3l6m0J7jj2k03J58Jr5Mn8K16qk09L1L2J9J2p3k6R0Q7j72
2887a28K50j31j0M2O3M7j40Q3q2l8J49j32J14l1J06L2j03K8jj60r7P3L6q6O8r3
2913a41K07O9k06J24N5q1KK2l7Q0j04Q8J10q4n2J01J2j71NJ84K8k24j53J6K24
2938G4N9k00J79j77Q6mm7N3M5j83J02N5k12J53Pm9Q8l4J29O2j17J96k55L0j0M9
2964G9J3L8O9o2n1j00j5n7K1Q7j18l9K68j66J91n4q2j13J85j45n5Q3Q8j7M6o4
2990C0J14n3j48J90Pm9KM9k16p7J25m4m0K18j30R9j34j73K00M9q1O8j9L2R4mj35
$$ y = [128, 54, -275, 92, 15, 11, -192, -132, -168, -107, 43, -123, 10, 52, -12, -20, 33, 23, -134, -173, 40, -83, -15, 50, -93, -18, -46, 330, 77, 199, -18, -45, 21, -37, -164, 51, -12, 21, -29, -74, -43, -117, 17, -144, -89, -99, -47, -29, 199, -86, -30, -239, 52, 120, 50, 13, 191, 138, 102, 62, 79, 78, 66, -137, 21, 22, -73, -69, -127, 89, 81, -128, -97, -65, -46, -34, -107, -133, -43, 44, -128, 122, -9, -19, 23, 86, 133, -7, 76, -6, -44, 105, -27, 87, 56, 162, 194, 91, 119, 118, -42, -139, -66, -30, -116, -48, -141, 66, 135, -71, 53, 108, 27, 29, 51, 14, 94, -10, 78, 188, 104, 52, 153, 165, -6, -1, 183, 211, -13, -166, -150, 74, 133, -67, 112, -65, 21, 17, -30, 23, 68, -115, -13, 42, -170, -17, -10, -59, 29, -5, 124, 186, 69, 265, 10, 40, 30, 79, 92, 130, 199, 137, 86, -14, -29, -86, -65, 22, -96, -135, 133, -33, 158, 104, 22, -91, 94, -51, -106, -23, 65, 48, 94, 30, 144, 91, -57, 133, 140, 91, 93, 142, -74, -151, -26, -70, -110, 108, -22, 77, -57, -230, -30, 19, -62, 6, -13, 19, 113, 109, -26]
3017b6J69q2j24K05j17KL02k68K2j6L3j68L8o7NM2Q4j76J20q4K78k43J00p7J1
3042c7OK57l49L9k7P2L8J52j16L6j75J68R0j10J20j82k7J72p6O4k0J6o7Q5j45
3067a6j72J22j73K73k68K11j85K20j33N1J22j7P4Rj00J31L2r3K1m1o2o2p5J36
3091Ej61J59j19N5R5J11j81l3r0J96k15L65j77j22J38l6o7J57j10PJ0K78j96j07
3115c8J84j8q0j2m9j34J89o5k59K42J5Q7j14o9R8j15L1J47L5k51J93p1j91L30
3139H5l2j97K06J55k38J03q9J00l1K5k45K09l3J02j32J5J7j03l7J1Q1n5J29j2
3163C4n7Q1M6j60J09j00J77k65K05N4k5p7L6m9j57K44mr3P6q8rk2j5R0p5Q0r6
3190f0J08j53K2p8K54j66m3Q3j30O4M5j7j3L7m2O8J55N9j96JJ10qN6j20m2R7j56
$$ y = [-26, 143, 61, -63, 142, 25, 27, 329, 61, 83, 67, 100, -68, -30, -97, -92, -50, 34, -142, -22, -106, 172, -71, 29, -48, -37, -31, 226, -123, -84, -111, -39, -1, 151, 35, 71, -104, 64, 154, 44, 164, -18, -45, 127, 51, 115, 95, 111, 44, 129, -16, -188, -66, -239, 34, -234, -23, -208, 12, -121, -70, 52, 35, 109, 118, 18, 149, 181, 88, 109, 68, 6, -56, -131, 5, -156, 3, -116, -61, 34, 145, -36, -69, -159, 37, -178, 187, 10, -112, 26, -10, -77, 80, -30, -23, -13, 265, 69, -38, 146, 128, 48, 36, -13, -147, 42, -23, -282, -40, -25, 62, -52, -121, -23, -138, -107, 40, 75, -176, 17, -54, -245, 85, 53, -144, 62, 217, -21, 82, -7, 93, 62, 87, -158, 51, 18, 120, -12, 3, 20, -83, -120, -109, -28, -83, 46, 34, -23, 58, 104, -56, 53, -47, 130, -135, 70, 124, 99, 22, 58, 9, -148, 96, 92, -1, 75, -13, -22, -44, -59, 31, -44, 36, -60, 48, -105, -83, -161, 93, -73, -116, -33, -163, -99, -54, -71, -84, -47, -89, -21, 134, 193, -3, -2, 108, 100, 156, 36, -6, 91, -65]
3217f5k7q8Q7J51p1J06k0j49JL0p1J2l8L59k40j28oK37p3K07l7Mj19J14j04j09
3243c7J29m4Pm0r5PM5J21k48N5j38L14j40J8n2Q6j30J75n0N2Q7k37m0J71o4J25
3269G7j13J15P9q8M5K7l11K21l8j24K60o2n6J6j40J49j53O1K3K9j67J90o8L4o7
3294f1P4Q8j80P4J4j2J72Q2n6j31J32l50J64j88J58k7P1r6P1R5j40R4j21l9M3
3319f9J2M9J1m1R2K2k5k22J93J03p8J65j03m5l7l5J37o5l7N6r6k3M1N2j60R9j44
3346a48J17PJ09j88m2J38n2J76m5n4l9J9J8J40k22n0J47k12K86m5j20L0p9L1N3
3371b5k3M9pP8l22P1K08J7m3j8j38J10k6K61k96O7n9nJ36o0n6J83j6j06NJ18o7
3398C6J07j18k1J00N3m1k78K22j57L2k7K8J76m4k94K5R2K6J6l1o8J80L5l2L9J54
$$ y = [-65, -92, -180, -93, 58, -13, 93, 73, -76, -75, -45, -116, -104, -142, 217, -23, -151, -157, 80, 7, 214, 177, 181, 62, 176, 72, -37, 92, 48, 55, 15, -80, -73, -28, 93, -155, -100, -238, 76, -64, -46, -98, -12, -142, 33, -17, 35, 122, -115, -155, 16, -48, 77, -36, 79, 158, 70, 115, 142, -169, 52, 14, -110, 150, 88, 32, 48, -92, 57, -96, -35, -12, 17, -150, 40, -28, 6, -61, 13, 101, -79, -5, 9, -3, 169, 251, 195, 64, 196, -154, 10, -178, -20, -47, 24, -72, -1, 94, -46, 48, -73, -112, -69, -57, -8, 3, -38, 54, 76, 51, -171, 22, 125, 47, 212, 109, 64, 27, -8, 129, 64, 27, 83, -13, -36, 5, 57, -103, -4, -148, -31, -24, 85, -103, -145, -7, -59, 117, 72, 18, -21, -2, 16, 156, -66, -116, 31, -181, 105, 60, -60, -30, -109, -78, -25, -48, 1, -6, 72, -250, -179, 29, 46, 3, -15, -153, -43, -69, 192, -104, -37, -96, -101, 35, -25, -81, 102, 86, -20, -15, 103, 36, 143, 25, 4, 104, 157, 116, -162, 60, -97, -65, -92, -64, 112, 68, -226, -201, -109, -83, -67, -98, -166, 14, 49, 17, 56, 210]
3424B10k01L8J19j59J38j84O8k4r3J42j5Kk10O2Q2q0P0r3J06j08K18j48K8N8j9
3449GmJ2M9kjk9l4K25k26J6o7J43r5P5N0q9pn3R6ml9j81J49M4o1j05O3P0o3K5
3479c6Q6p1Q4Kr6J26r4j88K27M1k5p0M8o3o9J65o0J10J01j57p9j46J3R7Q3J64
3505A93j14k8j55J58k21J33p5J65k0p1j03Q5K21j54J64j60J38q5j22P8J09j24
3527A2j27J07k2K34m28J10Q5O7O4O4k54p3J91mq2j8J61k53K22p2J08j41N0k8Q
3552a9J21r0M3r5J57N2k66J13n5o8J17j1O8j53jR3nj10K46k11n6K5J16k6LK7J58
3579A73k16M4K00j41m6j28Q1Q4l0OkO2j0n9L6j85N7J81r0j26l3n4J45qJ24o7j04
3606a06J34l1RQ8j0m8j6J59j87o1J96p3j28J14l7K7K1j33O5p7L9Q4j42J35j54
$$ y = [210, 9, 47, 166, 7, 145, -39, 29, 5, -88, 54, 39, 41, -169, -107, -25, -105, -35, -128, -22, -130, 88, -60, -32, 26, 7, 3, 15, 64, 62, 61, 32, -2, 223, -3, 13, -54, 89, -6, 69, 119, 30, 23, -30, 66, 62, 23, -158, -9, 35, -26, -131, -68, 2, -61, -36, 50, -21, 63, 65, -31, 95, 1, -187, 40, 81, 56, -14, 34, -29, -98, 67, 7, 117, 218, 61, -18, -164, -151, -54, 29, 193, 79, 51, -104, 54, -167, -34, -109, 56, 36, -35, -138, -53, 168, 14, 178, 18, 156, 71, -51, 27, 136, 12, -115, -8, -30, 204, -224, -114, -29, 38, 102, 166, -88, -161, 30, 26, -56, -74, 87, -166, 56, -16, 92, -49, 1, -27, -19, 102, 12, 55, -40, 117, 169, -97, 16, -39, -107, 10, -1, 67, -86, -87, 6, 1, -109, 137, -74, -130, -105, 11, -15, -12, 15, 173, -43, 1, 201, 60, 14, -114, -33, 51, 21, 27, 25, 87, 77, 18, 54, -131, -74, 107, 17, -109, -142, -196, -51, -59, 65, -2, -106, 28, -3, 6, 94, 84, 36, 20, 179, -8, -69, 127, 54, -74, 40, 3, 30, 51, -82, -17, -94, -55, 29, -113, 22, -132]
3631a32K05N6k12K16k73J02L2pN9J88j28k46J60k1qPNN6r9K22q8j23J62m5j06
3656a8J5k13J34R2p2K4K1M4J40q6p1n1K25k20L8M1J39j40PJ8j6j14P2J74k58J11
3682C6J57q2k59K59r3M4p4l9j45J49O8J15m07L37m4j97J05k3J21N3jJ3k3q7J56
3707A39j58J06j14M5K6K2p7O7m6JK9J8o3j05J63J6j19p1K29j87R5o5J05p2n8K59
3733A85k19J22j39J55j62J98K1p8k00J56L9N0j34j05J18j01J62j15k7J63j19p7
3755a07P9Q7j06mN5L3M8p1j55J59M7j20P1J43r9j44K03j31rJ07j25K9J4m5J02
3780F1r0Q8k6q9J01j25jJ15j56j17L75j16J06j30R9k10M6m1K04J07j46J92j48
3803I9l3K1j57mQ5l7J18P4j22j3J06k09m8J10k4N7j84K62r4J21j36kL7j38J75
$$ y = [-132, 73, 129, -83, 133, -140, -38, -6, -13, 46, 234, 106, -140, 20, -1, -9, -2, 3, 59, -40, 182, 94, -29, 133, 88, -18, -3, -216, -82, 10, -62, -38, -17, 27, 167, 81, 10, -41, 184, -36, 2, 43, 182, 42, 49, 67, 51, -63, 9, 183, -75, 36, 193, 111, -148, 111, 18, 62, -12, -51, -196, -47, 21, 136, -271, 66, 22, -175, -70, -93, 28, 81, 80, 93, 70, -17, 139, -19, 87, -27, 18, 44, 66, -11, 56, 10, 11, 40, 58, -5, -110, 53, 69, -50, -121, 108, -79, 16, -49, 56, -16, -74, 185, -34, 88, -51, 104, -58, 140, 161, 83, -117, 39, 78, 128, -6, -111, 7, -94, 68, -47, -74, 89, -30, -107, -28, 59, -47, -51, 4, 37, 85, 14, -141, 18, 65, -55, 16, 159, 60, -84, 119, -12, -21, 86, -39, -10, 4, -41, 61, -29, 59, 33, -56, 45, -80, -81, 34, -122, -239, 136, 20, 126, -4, 95, -115, -69, -110, 94, 201, 55, 247, 99, 66, 87, -70, -74, 11, -26, 92, 166, 44, 31, 137, -72, -120, -10, -34, 23, -161, 101, 7, 128, -8, -10, 27, -111, 64]
3828F4j4J95k40q0J66r4M3j7N9j05O2k32K92r3M4M7j31M7J1O8l5j08j00Q5n8K62
3854A38p2j00n6L20k29L7j61M0L1J37r7k3K45k79l0O0O9j30J62p2m3K19j52m0
3878b6O7K0jj4K4j53J8N7o6O9l0R8j83K41j05P6n5r9M3O7p1J1pj28J64QrO4j22
3907d2J36j99K79j93j83K65P7j52J32j42J06p0k3J03q9J12j0K8m7rj44L39j15
3930A59j28L7r2L7K6N1j69J71J5k67J51j2J0Or8J54j44N5J03l7P4j36L2O5p1N1
3956D3L0k8k5J08q6j08k9J29j29J83n3KP3j71R8m4n0jKJ87k62N9J26o1K7j03J96
3983A13j66O9j9Q1Po3O8r9J35j43k0J29k6k5N1j95J79lj99P4J19o9q6J36qq6J3
4010c3K8N7j3N6k22L8j1K43k59J58J7j00J27j53m9K14r4Ko0n7K77j18Q8q6R6j17
$$ y = [64, 50, 245, 5, -75, 91, -3, 40, 23, 82, -23, 39, -193, 99, 6, 50, 97, -34, 13, 24, 92, 57, -51, -151, -66, -124, 138, 66, -34, -90, 230, 1, 38, -123, -83, -52, 85, -12, -35, 210, -69, -99, -39, 30, -100, 62, -10, -53, 166, 14, -26, 41, 61, 60, 46, 70, -83, -65, -8, -74, -5, -35, 63, -120, 121, 16, 92, 37, -62, -19, 48, -23, -12, -19, -147, 17, 25, 16, 80, -42, 94, -105, 174, -19, -202, 63, 140, -12, 120, -22, 84, 14, -9, 94, 5, 117, 107, 135, 88, 79, -65, 274, 159, 31, 68, -24, 13, 39, 90, -79, 92, 107, -160, -9, -21, -11, -5, -103, 51, -93, -38, 65, 28, 102, -34, -2, 63, -8, 43, 73, 45, 20, 128, 42, -66, -95, 34, -95, 88, 35, 37, 110, -61, 37, -7, -57, -58, -56, 131, -131, -72, 54, -7, 20, -83, 113, -53, 16, -3, 78, 85, 22, 90, -9, 126, -17, -37, 92, 66, 41, 92, -103, 76, 73, -126, -52, 67, -2, -88, 48, 40, -46, -33, -5, 52, 39, 95, -127, -89, -100, 143, -116, 42, 59, -41, 86, -67, -116, 98, 4, 6, -54, -111, 166, 48, 136, 50, 146, 29]
4036B9QJ4m8j11K62k13j6L2oK5lj03J33L8l2J76Jk20N9J60j79k2K1O7j77m4R2
4063e7m7r8J15L0L15k79J03m0k08K07j67J51k36L12J25r3r2n4J06r9J41m2k9k9
4087C5j5m8M2J60j7j14j21K5J67k3o5q0l4P1R5j76K4Q4J26j73j30L51j13L3n6
4112D8j38P4J82j66%Ko0L3q2K19mLJ0k09J4M4J38r0o9J38j31Q7r9J82r4J5j4j51
4140a18K75k33M6Q2K4J0m9Q6j12J23j89K14r8p8M6r5p7J90o7R6j66P9j33J52j48
4165a40J33J94l42j4K91j76mm0J32L3m0nL0OQ8j41M8J88j21j39qKq4N9J27m3j62
4192a28M1J39n3M0L3k09P8J27q0J12j35O6P9j63p6L10j71l4J20l4n4P6j18J39
4216A05n1m9k9r2J21J5qj33J09j22P5q9Q9J17j54R8j28J40q0J06L8j55P3n4m5
$$ y = [29, 37, 51, 3, -108, 154, -59, -75, -43, -49, -24, -27, -130, 3, 41, 9, 185, 186, -34, 25, 185, 6, -16, 5, 72, -105, -149, -57, -104, -202, -87, -57, 258, -21, 82, 42, -166, 41, -126, 25, -211, 101, 226, 133, 41, -13, 93, -6, 135, 93, 64, 35, 20, -28, 14, 174, 157, 43, -78, -53, 114, 91, 26, -54, -88, -17, 78, -98, -74, 10, 136, -37, -167, 184, 71, 104, 48, -90, -16, 166, 0, 0, 2, -58, -25, -107, 112, 108, 111, 121, -88, -74, -30, 108, 18, -51, 87, -44, 43, -56, 126, 32, 47, 33, -118, 157, -76, -30, 52, 76, 86, 37, 123, 11, 134, -55, 159, 61, -17, 29, -66, -143, 47, -20, 76, -90, -11, -144, 8, -140, -7, 187, -155, -169, 122, -54, -58, -98, 34, 67, 27, 22, 52, 58, 146, 5, 53, 241, 120, -19, -27, -25, -109, -50, 77, 34, -128, -87, 52, -1, 39, 72, -137, -59, 68, -12, 100, -35, 31, 110, -53, -129, 181, 10, -24, 96, 62, 8, 84, -34, 105, 54, 5, -24, -116, 5, 20, 12, -121, -12, -134, -59, -148, -59, 58, -96, 2, -126, 14, -66, 40, 78, -77, -4, -58, -103]
4241a03K4J62j68J13pj39r3J61k3j17K31J04k11J19o7O8m1k7j06J19O3Qr5K13
4265A88r4l9p5l9K7J53p6p2P7r6O0j1N7o1j4j23J68l6Q0j1j39K3J15Q2k22K06
4291A28k27K9qL0l3O8m1l1J24L2J16l54J09M4R7j65R3l6o4O6j81K19j17J24m1
4316a9r8Q6J29k31J15m8L7k3J21J6j14J00m2p1j2K48o6M4j82M0N6m1o1M9j15J20
4342C8k62P2J32P2J00j17j42j6J14r2J54q0J13j63M5J2%N3j16K20k42M9r1R1J18
4367F2p9J6o1P1M2j61J05Q6j27N6Np0J7k7K20q0k24O8J54o3K3o8o0J89j9p3m4
4394d2M9L7k8l5R5j13K37r5r5R8q7L2o6K7J2J7k7l2j9p3K06j39o5J79l5J25j41
4421B2nK50k45N0Oo1j74K92p4l6o3J45m7P5kj43On0J24j35J77j42R6k79K30j37
$$ y = [-103, -79, 83, -85, 28, 21, -118, -211, -50, -73, -190, 41, 145, -66, 53, -14, 54, 13, -14, -120, -1, 62, 70, -25, 188, 94, 55, -20, -59, -32, 121, 45, -27, 50, -46, 14, 3, 60, -1, -15, -138, 30, -6, 74, 63, -76, -53, 62, 144, -78, 128, -99, -70, -78, -48, -81, -13, -54, -85, 39, 71, 187, -167, -58, -14, 83, -82, 11, -25, -89, -23, -204, 15, -102, 22, -19, -117, -31, 98, -133, -18, -66, -29, -52, 69, 85, -29, 71, 29, -42, -54, 194, 128, 172, -10, 30, 86, 45, -16, 33, -82, 38, -224, -152, -20, 52, 152, 35, -107, -123, -9, -101, 53, -27, 86, -77, -32, -20, -20, 33, -83, 137, -105, -56, -147, -56, 62, -17, -1, -62, 9, 51, -110, -5, 81, -46, 10, 15, -55, -38, -65, 155, 75, -149, -81, 73, 10, 33, -35, -95, 94, 75, 2, -42, 7, 44, 16, -19, 76, -37, 200, 105, 10, 108, 21, 53, -13, 14, 26, 43, 16, -16, -35, -108, 98, -41, -106, 73, 38, 163, 22, 17, 267, 22, 72, 78, 17, -157, 135, 61, 25, -38, 107, 60, 135, 133, -10, -4, -54, 70, -65, 112, -30, 66, -213, 17, -120]
4447a20J79l2j8Q0k27K9K12k17K12M2l7n1q5R3q8m5L4l4P0M1k5L8n0J00p9m1J17
4474I8j89J14o2J11k6p9o9L02k57l8J86j30L3k2r7M9K09k1l8j03J31j60J11j38
4498h5J08j37R0L3m5K71k10j02L5n7J28j1m6om9J73j36n6qK6O6Q5q3J10j0r9j10
4525a25O1J44K2j37J7%Q8J2P5k96M7Q7j01K24p7j0p0J21j07J20k3l3k8j76K67
4550A02j65J9Q5J18r3P2j46j47K9M9J66p4j8k51K45l1Q4kn2K7J50k08r6Q5K4n0
4576g8m7J70n8J77k31N3N3J0Rk70K40l2q8J94l5m2n6m3P8k5j22J93j27jL4nQ3
4603C4J15j42j13J09L1J10n5k51L31j98m6J11M7n6j4J51j50Nn4k7kK10l10nK7
4628a42jJ85k07J72O6k2j33L0J15r2J03%j42O0m1O1n5K6M1o2l9K08J01k06QJ37
$$ y = [-120, 59, 27, 9, 89, -138, -109, 103, -114, 98, 140, 103, 52, -33, 60, -28, -73, -39, -73, -3, 38, 13, 51, 1, 101, 22, -19, 98, -91, 23, -39, 72, 46, -33, -102, 200, -57, -95, 91, -39, -6, -28, -125, -76, 133, 112, 74, -29, 102, -58, 53, -85, 23, -114, -24, 9, -36, 235, 25, -77, -42, -99, 29, 18, -28, -34, -83, 90, -46, -102, -110, -84, -18, 67, -16, 94, 84, -15, -125, -64, 80, 102, -35, -18, -18, 70, 82, 157, -139, -92, -5, -106, 118, 41, 31, -39, 82, -25, 95, 72, 39, 11, -165, 102, -63, -44, 41, 159, 66, 138, -8, -155, -126, -77, 89, 15, -3, -254, -9, -40, 44, 42, -10, 17, 167, -41, -137, -52, -28, -78, -125, 45, -13, 164, -67, -14, 39, 49, 58, -212, 28, -4, -92, 102, 67, 25, -31, -74, 4, -21, -143, 50, -77, -78, -44, -49, 34, 149, 7, -106, 3, 34, 144, 89, -162, 169, -29, -75, 36, 83, 27, 13, 164, 14, 19, -35, -62, -64, 146, -164, -169, -142, -143, 42, -165, 7, 73, 51, -82, -52, 63, -29, 74, 74, -68, -8, -49, 12, -43, -17, 24, -38, -77, 131, 232, 26, 34, 171]
4654A71j41j79J25M6M8q0L5m9Q3m1qo7Q1L4jm5J23j77l5Q9J69q2J2k38K47j31
4680a1j2m5J97j61j98J41M2R7q3J14l5j08nn9j4J04k4L4n8K9J49J3j45J88n7j04
4706a1J1j6J49L4k42K52n0o4r9J63k34J09j9MJ78k12J81j52j09L8O7J07j52N6
4730a1r5J89j70j42K10r4p3J39O6J7M9j36L6j02K33q4k3P9j57RJ24K2k73J99l2
4755b0Q3n4j36J78j33O5J17k67J11n4j8n1J57J0J2J8j39L66k95m8J59Nj87R3Q7
4780E9j50J28k19JK36J00j38K5Kro5L1N4N2j16J36p6L8o2K3j71J81n5o6O9j92
4806a84L86r6m9k59L38l13J70j7j40J17j5P9qol3r2K53j57MK8Nj47J85J20j75
4831fR3j29J6J0K7RN9j07J55j07k6O5j90L5Q5j00Q8J16j26l0L6q2K42k74J64l
$$ y = [171, 30, -149, -24, 22, 70, -10, 25, -24, 59, 18, 10, -57, 24, 58, 57, 12, 135, -42, -77, 12, 181, 99, 111, -127, 120, -11, -23, -68, 129, -32, -230, -89, -47, 50, -33, 81, 46, -62, -67, -126, -140, -36, -60, -26, -84, -55, 94, 107, -38, 150, 93, -11, 0, -16, 133, 167, -75, 177, 127, 63, -36, 127, -107, 2, -17, -13, 165, -47, 134, -18, -127, -89, -22, 85, -67, -11, -106, 83, -87, -229, -19, -113, -186, -47, 19, 36, 85, -51, -15, -117, 116, 32, 9, 88, -69, -60, 64, 86, -187, 12, -20, 63, 9, -127, 51, -82, -17, 100, -167, -56, -110, -128, -179, -22, -12, 0, 18, -121, 245, -50, -98, 61, 66, -121, -28, 59, -91, 37, -182, -181, 55, 155, 17, 42, 44, 35, -30, 1, 55, 107, -9, 127, 51, 89, 27, 50, -121, 60, 5, -61, 8, -184, 202, 106, 57, -202, 136, -177, -7, -24, -164, -47, -62, 17, 9, 3, -30, -122, 131, -26, -22, 6, 11, -136, 49, 169, -6, 87, -42, -26, -16, 11, 20, 79, -28, 127, 20, -6, 59, -131, -96, -11, -111, -23, 93, -33, -63, -27, -109, 133, -141, 23, 20]
4857B0k6j42L7Mm7M2K27k22L6J08q6J66j81j03m2J52M4J25o2k52K61K9k09K54
4881A33o1r9R4k2r6j8J48j52q6J66j14J21P0k0j94K04k38J01MJ02j9R6j21jj32
4906a34J68l2j6Q0k8R8k82J16MK0K4j8r8J20k8k0l7J98p9p7l2Q3j9R9m6l8j36
4933a10J28k2l6M5q5L6j03J10P6j51j4O9L6j2K1n6jj73L19m7N4q0J58k25J19j12
4959e6j3J39p9J53r7N3j39q5M4J56j02J04j32J35k4r6qJ16j09J60j08k6Rm6k63
$$ y = [20, -6, -148, -111, -107, -154, -112, 115, -107, -71, 37, -49, 117, -64, -167, -209, -57, -13, 112, 50, -202, 59, 88, -121, 133, 72, -27, 67, 45, -51, -69, 79, -73, -159, 7, -107, 14, 84, 64, -130, 74, -164, -63, -59, 43, 24, 120, -1, -2, -134, 34, 2, -14, 66, 38, 136, -146, -30, -26, -6, 18, 0, -98, 22, -6, -26, -63, 135, 56, -21, -53, 30, 11, 110, 64, 26, -110, 18, -4, -40, 5, -80, -44, -147, -37, 39, -112, -126, -57, -21, -33, -12, -68, -69, -242, 77, 30, 84, 4, 162, -63, 56, -56, -69, 70, -9, 144, 47, 100, -39, -124, -80, 76, -26, 78, -54, 81, 57, -39, -47, 69, -40, 120, 12, -14, -5, -51, -314]
$$ [...]
8191C7
##END NTUPLES=NMR FID
##END=
