##TITLE=1H_Ser 5-6-V-5
 CDCl3
 8 sc, 
 31.05.2022
##JCAMPDX= 6.0         $$ Bruker NMR JCAMP-DX V2.0
##DATA TYPE= NMR FID
##DATA CLASS= NTUPLES
##ORIGIN= UXNMR, Bruker Analytische Messtechnik GmbH
##OWNER= root
$$ XWIN-NMR		Version 3.5
$$ Wed Jun  1 14:59:13 2022 Russian Standard Time (UT+4h)  she@DPX200
##.OBSERVE FREQUENCY= 200.13135
##.OBSERVE NUCLEUS= ^1H
##.DELAY= (6, 6)
##.ACQUISITION MODE= SIMULTANEOUS
##.ACQUISITION SCHEME= undefined
##.AVERAGES= 8
##.DIGITISER RES= 18
##SPECTROMETER/DATA SYSTEM= spect
##.PULSE SEQUENCE= zg30
##.SOLVENT NAME= CDCl3
##.SHIFT REFERENCE= (INTERNAL, CDCl3, 0, 15.7039)
##AUDIT TRAIL= $$ (NUMBER, WHEN, WHO, WHERE, WHAT)
$$ ##TITLE= Audit trail, XWIN-NMR		Version 3.5
$$ ##JCAMPDX= 5.01
$$ ##ORIGIN= Bruker BioSpin GmbH
$$ ##OWNER= she
$$ F:/spectra/data/she/nmr/H-F/1/audita.txt
$$ ##AUDIT TRAIL=  $$ (NUMBER, WHEN, WHO, WHERE, WHAT)
(   1,<2022-06-01 14:58:08.64 +0400>,<she>,<DPX200>,
      <created by zg, POWCHK disabled, PULCHK disabled
       configuration hash MD5:
       00 E9 B6 7A A2 85 ED C7 34 08 36 98 17 FE 4E 26
       data hash MD5: 16K
       2B 04 0E 44 73 75 48 87 4D 00 60 13 F9 5C D8 5F>)
$$ ##END=
$$ 
$$ hash MD5
$$ 8F 49 46 62 31 D2 FF BB 9C 26 AA E8 1A 18 93 5F
##$RELAX= 
##$RELAX= 
##$RELAX= 
##$RELAX= 
##$RELAX= 
##$RELAX= 
$$ Bruker specific parameters
$$ --------------------------
##$DU= <F:/spectra>
##$EXPNO= 1
##$NAME= <H-F>
##$PROCNO= 1
##$TYPE= <nmr>
##$USER= <she>
##$AMP= (0..31)
100 100 100 100 100 100 100 100 100 100 100 100 100 100 100 100 100 100 
100 100 100 100 100 100 100 100 100 100 100 100 100 100 
##$AQSEQ= 0
##$AQ_mod= 1
##$AUNM= <au_zg>
##$AUTOPOS= <>
##$BF1= 200.13
##$BF2= 200.13
##$BF3= 200.13
##$BF4= 200.13
##$BF5= 200.13
##$BF6= 200.13
##$BF7= 200.13
##$BF8= 200.13
##$BYTORDA= 1
##$CFDGTYP= 0
##$CFRGTYP= 5
##$CHEMSTR= <none>
##$CNST= (0..31)
1 1 145 1 1 1 1 1 1 1 1 1 1 1 1 1 1 1 1 1 1 1 1 1 1 1 1 1 1 1 1 1 
##$CPDPRG= <>
##$CPDPRG1= <>
##$CPDPRG2= <>
##$CPDPRG3= <>
##$CPDPRG4= <mlev>
##$CPDPRG5= <mlev>
##$CPDPRG6= <mlev>
##$CPDPRG7= <mlev>
##$CPDPRG8= <mlev>
##$CPDPRGB= <>
##$CPDPRGT= <>
##$D= (0..31)
0 1.2 0 0 0 0 0 0 0 0.06 0 0.03 0 0 0 0 0.0002 0 0 0 0 0 0 0 0 0 0 0 0 
0 0 0 
##$DATE= 1654081088
##$DBL= (0..7)
120 120 120 120 120 120 120 120 
##$DBP= (0..7)
150 150 150 150 150 150 150 150 
##$DBP07= 0
##$DBPNAM0= <>
##$DBPNAM1= <>
##$DBPNAM2= <>
##$DBPNAM3= <>
##$DBPNAM4= <>
##$DBPNAM5= <>
##$DBPNAM6= <>
##$DBPNAM7= <>
##$DBPOAL= (0..7)
0.5 0.5 0.5 0.5 0.5 0.5 0.5 0.5 
##$DBPOFFS= (0..7)
0 0 0 0 0 0 0 0 
##$DE= 6
##$DECBNUC= <off>
##$DECIM= 32
##$DECNUC= <off>
##$DECSTAT= 4
##$DIGMOD= 1
##$DIGTYP= 9
##$DL= (0..7)
0 120 120 120 120 120 120 120 
##$DP= (0..7)
150 150 150 150 150 150 150 150 
##$DP07= 0
##$DPNAME0= <>
##$DPNAME1= <>
##$DPNAME2= <>
##$DPNAME3= <>
##$DPNAME4= <>
##$DPNAME5= <>
##$DPNAME6= <>
##$DPNAME7= <>
##$DPOAL= (0..7)
0.5 0.5 0.5 0.5 0.5 0.5 0.5 0.5 
##$DPOFFS= (0..7)
0 0 0 0 0 0 0 0 
##$DQDMODE= 0
##$DR= 18
##$DS= 0
##$DSLIST= <SSSSSSSSSSSSSSS>
$$ [...]
##$SUBNAM2= <"">
##$SUBNAM3= <"">
##$SUBNAM4= <"">
##$SUBNAM5= <"">
##$SUBNAM6= <"">
##$SUBNAM7= <"">
##$SUBNAM8= <"">
##$SUBNAM9= <"">
##$SW= 18.05172834244
##$SWIBOX= (0..15)
0 0 2 0 0 0 0 0 0 0 0 0 0 0 0 0 
##$SW_h= 3612.71676300578
##$TD= 16384
##$TD0= 1
##$TE= 0
##$TE2= 300
##$TE3= 300
##$TEG= 300
##$TL= (0..7)
0 120 120 120 120 120 120 120 
##$TP= (0..7)
150 150 150 150 150 150 150 150 
##$TP07= 0
##$TPNAME0= <>
##$TPNAME1= <>
##$TPNAME2= <>
##$TPNAME3= <>
##$TPNAME4= <>
##$TPNAME5= <>
##$TPNAME6= <>
##$TPNAME7= <>
##$TPOAL= (0..7)
0.5 0.5 0.5 0.5 0.5 0.5 0.5 0.5 
##$TPOFFS= (0..7)
0 0 0 0 0 0 0 0 
##$TUNHIN= 0
##$TUNHOUT= 0
##$TUNXOUT= 0
##$USERA1= <user>
##$USERA2= <user>
##$USERA3= <user>
##$USERA4= <user>
##$USERA5= <user>
##$V9= 5
##$VALIST= <valist>
##$VCLIST= <CCCCCCCCCCCCCCC>
##$VD= 0
##$VDLIST= <DDDDDDDDDDDDDDD>
##$VPLIST= <PPPPPPPPPPPPPPP>
##$VTLIST= <TTTTTTTTTTTTTTT>
##$WBST= 1024
##$WBSW= 4
##$XGAIN= (0..3)
0 0 0 0 
##$XL= 0
##$YL= 0
##$YMAX_a= 98067
##$YMIN_a= -172826
##$ZGOPTNS= <>
##$ZL1= 120
##$ZL2= 120
##$ZL3= 120
##$ZL4= 120
##$ABSF1= 10
##$ABSF2= 0
##$ABSG= 5
##$ABSL= 3
##$ALPHA= 0
##$AQORDER= 0
##$ASSFAC= 0
##$ASSFACI= 0
##$ASSFACX= 0
##$ASSWID= 0
##$AUNMP= <proc_1d>
##$AZFE= 0.1
##$AZFW= 0.1
##$BCFW= 1
##$BC_mod= 2
##$BYTORDP= 1
##$COROFFS= 0
##$CY= 11.3945322036743
##$DATMOD= 1
##$DC= 2
##$DFILT= <>
##$DTYPP= 0
##$F1P= 2.36226072786647
##$F2P= -0.459571619588291
##$FCOR= 0.5
##$FTSIZE= 0
##$FT_mod= 4
##$GAMMA= 1
##$GB= 0.15
##$INTBC= 1
##$INTSCL= 1
##$ISEN= 128
##$LB= 0.24
##$LEV0= 0
##$LPBIN= 0
##$MAXI= 10000
##$MC2= 0
##$MEAN= 0
##$ME_mod= 0
##$MI= 1.114404
##$NCOEF= 0
##$NC_proc= 0
##$NLEV= 6
##$NOISF1= 3.799351
##$NOISF2= 2.8
##$NSP= 1
##$NTH_PI= 0
##$NZP= 0
##$OFFSET= 15.70392
##$PC= 1
##$PHC0= -18026.83
##$PHC1= -6.199261
##$PH_mod= 1
##$PKNL= yes
##$PPARMOD= 0
##$PSCAL= 0
##$PSIGN= 0
##$REVERSE= no
##$SF= 200.130013532006
##$SI= 16384
##$SIGF1= 3
##$SIGF2= 2
##$SINO= 400
##$SIOLD= 16384
##$SREGLST= <1H.CDCl3>
##$SSB= 0
##$STSI= 0
##$STSR= 0
##$SW_p= 3612.71676300578
##$SYMM= 0
##$S_DEV= 0
##$TDeff= 0
##$TDoff= 0
##$TI= <>
##$TILT= no
##$TM1= 0
##$TM2= 0
##$TOPLEV= 0
##$USERP1= <user>
##$USERP2= <user>
##$USERP3= <user>
##$USERP4= <user>
##$USERP5= <user>
##$WDW= 1
##$XDIM= 8192
##$YMAX_p= 0
##$YMIN_p= 0
$$ End of Bruker specific parameters
$$ ---------------------------------
##NTUPLES= NMR FID
##VAR_NAME=  TIME,          FID/REAL,        FID/IMAG
##SYMBOL=    X,             R,               I
##VAR_TYPE=  INDEPENDENT,   DEPENDENT,       DEPENDENT
##VAR_FORM=  AFFN,          ASDF,            ASDF
##VAR_DIM=   8192,          8192,            8192
##UNITS=     SECONDS,       ARBITRARY UNITS, ARBITRARY UNITS
##FACTOR=    0.0002768,     1,               1
##FIRST=     0,             0,               0
##LAST=      2.2672688,     0,               0
##MIN=       0,             -172826,         0
##MAX=       2.2672688,     98067,           0
$$ Real data points
##PAGE= N=1
##DATA TABLE= (X++(R..R)), XYDATA
$$ [...]
$$ plain form
1790 -60 -39 -220 -202 31 68 193 -348 -242 -85 80 -100 41 -214 -497 -254 228 403 109 -154 -212 29 239
1812 239 311 215 184 93 190 75 154 300 146 79 302 -163 83 163 118 -208 -83 -424 -623 47 29 -90 -329
1835 -329 -415 -534 25 154 353 -115 -54 -114 170 780 333 255 129 -54 238 365 230 344 -63 -73 23 -87
1857 -87 -31 -41 -9 -42 -255 -246 -186 -402 -179 173 -288 -533 40 -144 108 -11 -107 34 69 65 467 278 -41 -50 39
1882 39 335 495 362 281 -435 107 -65 139 181 -170 -477 -527 97 23 4 -298 -224 -370 -99 39 -104 130
1904 130 174 -166 -18 -11 353 333 246 65 31 19 133 243 -64 -14 30 106 -26 216 -107 275 -4 50 -221 -323
1928 -323 -4 169 -134 -213 -255 -108 243 -52 -13 -12 -208 -226 181 474 201 72 203 -159 58 -37 97 335
1950 335 -349 -201 309 -176 251 35 -38 -134 -438 -256 56 -231 208 -159 -406 -383 -316 43 78 -400 -462 -12
$$ packed form
1790f0K1j81J8K33L7J25n41J06J57J65j80J41k55k83K43M82J75k94k63n8K41K10
1812B39P2r6l1r1R7j15P9J46j54o7K23m65K46Q0m5l26J25l41j99O70j8j19k39
1835c29q6j19N59J29J99m68O1o0K84O10m47p8j26j83K92J27j35J14m07j0R6j10
1857h7N6j0L2l3k13RO0k16K23L52m61k45N73j84K52j19r6J41L5mM02j89l19rQ9
1882C9K96J60j33q1p16N42j72K04M2l51l07n0O24p4j9l02P4j46K71J38j43K34
1904A30M4l40J48PL64k0q7j81l4j2J14J10l07N0M4P6j32K42l23L82k79N4k71j02
1928c23L19J73l03p9m2J47L51k95L9Jj96j8M07K93k73j29J31l62K17r5J34K38
1950C35o84J48N10m85M27k16p3r6l04J82L12k87M39l67k47K3O7L59L5m78o2M50
$$ plain form
1972 -12 218 251 259 -42 -172 319 306 547 182 144 24 -29 1 -76 -159 -27 -45 -78 -191 -307 -113 -166 -345 -329 -313
1997 -313 -308 -55 -116 50 31 -294 22 -176 88 458 246 -138 1 -27 179 324 76 66 -208 -8 42 184
2019 184 -23 51 -316 -159 -181 138 53 -104 -198 -95 -124 -102 84 -20 -180 -160 -259 -146 157 131 139 129 -256 -4
2043 -4 244 21 87 226 3 -239 12 208 157 -16 -151 -261 -179 -57 99 -186 -310 -314 -106 89 275 6
2065 6 41 -42 -52 65 305 155 232 52 104 109 -4 126 91 62 -58 22 -27 44 -77 89 -46 -33 -469 -202 42
2090 42 71 -206 -88 -397 -143 -7 170 -66 -136 -288 -274 231 335 159 -200 5 105 504 283 369 54 159
2112 159 -158 366 -33 2 -73 -231 -20 34 -179 -299 -230 -56 -229 17 -45 -62 -92 -130 -136 -270 -20 101 165 281
2136 281 368 308 197 50 239 74 559 132 -88 16 187 242 74 -72 -141 -88 -78 -110 115 -246 -377 -210
$$ packed form
1972a2K30L3Ql01j30M91j3K41l65l8j20n3L0p7q3J32j8l3j13j16J94n3j79J6J6
1997c13NK53o1J66j9l25L16j98K64L70k12l84J39k8K06J45k48j0k74K00N0J42
2019A84k07P4l67J57k2L19q5j57r4J03k9K2J86j04j60K0r9J13L03k6Qj0l85K52
2043dK48k23O6J39k23k42K51J96n1j73j35j10Q2J22J56k85j24mK08J95J86k69
2065FL5q3j0J17K40j50P7j80N2Nj13J30l5k9j20Q0m9P1j21J66j35J3m36K67K44
2090D2K9k77J18l09K54J36J77k36p0j52J4N05J04j76l59K05J00L99k21Q6l15J05
2112A59l17N24l99L5p5j58K11N4k13j20O9J74j73K46o2j7l0l8oj34K50J21O4J16
2136B81Q7o0j11j47J89j65M85m27k20J04J71N5j68j46o9N3J0l2K25l61j31J67
$$ plain form
2158 -210 -120 -121 -11 -116 -208 -24 -149 -163 337 303 -81 83 410 -22 56 228 62 123 84 -70 -184 113 141
2181 141 -121 11 -170 -223 -85 5 -142 -74 -95 -320 -101 346 -377 -178 -215 187 -184 101 228 -85 76 -103
2203 -103 235 -12 47 -131 223 -166 -117 -8 -83 -60 43 45 39 -366 -179 67 -66 74 136 -386 -77 8 -25 -108
2227 -108 -42 24 -33 151 437 216 53 -51 98 153 106 101 238 8 28 -86 105 -51 -158 23 119 23 -346
2250 -346 -142 38 4 -146 -207 -348 -127 -194 232 81 42 -141 180 75 317 488 22 22 -94 108 186 282 164
2273 164 -37 82 242 131 24 -102 33 -276 203 22 -53 -397 -348 -317 -86 -119 -133 -295 -348 -246 -6 179
2295 179 52 -6 208 223 144 -2 -114 121 285 159 -7 -172 83 251 196 -55 242 -221 -170 223 -11 -241
2317 -241 -284 -315 -108 -490 57 -10 -50 -226 36 252 -125 -98 110 26 199 121 120 -150 -101 302 3 237 -32
$$ packed form
2158b10R0jJ10j05r2J84j25j4N00l4l84J64L27m32P8J72j66O1l9j54j14K97K8
2181A41k62J32j81n3J38R0j47O8k1k25K19M47p23J99l7M02l71K85J27l13J61j79
2203a03L38k47N9j78L54l89M9J09p5K3J03Kom05J87K46j33J40O2n22L09Q5l3q3
2227a08O6O6n7J84K86k21j63j04J49N5m7nJ37k30K0j14J91j56j07J81R6r6l69
2250c46K04J80l4j50o1j41K21o7M26j51l9j83L21j05K42J71m66%j16K02P8R6j18
2273A64k01J19J60j11j07j26J35l09M79j81p5l44M9L1K31l3j4j62n3J02K40J85
2295A79j27n8K14J5p9j46j12K35J64j26j66j65K55J68n5k51K97m63N1L93k34k30
2317b41m3l1K07l82N47o7m0j76K62K16l77K7K08q4J73p8jk70M9M03k99K34k69
$$ plain form
2340 -32 109 -309 -37 12 164 -113 -4 104 27 -110 -79 -152 12 -211 22 -34 47 -67 33 244 77 280
2362 280 106 122 -22 84 41 59 -9 86 194 89 71 316 -79 -53 -31 -94 -46 -7 -31 31 -154 -138 -233 -300 -108
2387 -108 -180 -315 78 110 203 174 246 119 7 -26 -50 311 143 -101 56 191 55 -186 55 174 -178 27
2409 27 -104 112 -74 140 -205 -127 -120 -128 -77 -209 -60 -347 -135 51 -23 -117 -150 1 -78 60 42 -134 129 155
2433 155 178 125 -47 200 -12 -90 -39 -39 -238 163 60 -267 -97 -139 69 -123 60 -123 -107 -259 -191 119 193
2456 193 -72 -6 -96 -228 289 288 195 -79 7 188 193 250 -2 45 -77 125 58 -15 -12 -233 -172 -139 -4 71 -133 -15
2482 -15 99 -276 -53 152 34 -7 107 46 22 -102 -61 72 148 196 129 -138 111 40 95 36 -71 -193 -175 13
2506 13 56 -76 -78 -144 -206 -25 355 -146 -113 58 -181 -15 213 -116 11 50 -50 121 -110 2 19 200 85
$$ packed form
2340c2J41m18K72M9J52k77J09J08p7j37L1p3J64k23K33n6Q1j14J00K11j67K03
2362B80j74J6j44J06m3J8o8R5J08j05j8K45l95K6K2o3M8L9k4O2j85J6r5o7J92
2387a08p2j35L93L2R3k9P2j27j12l3k4L61j68k44J57J35j36k41K41J19l52K05
2409B7j31K16j86K14l45P8PqN1j32J49k87K12J86p4r4l3J51p9J38j8j76K63K6
2433A55K3n3j72K47k12p8N1%j99M01j03l27J70m2K08j92J83j83J6j52O8L10P4
2456A93k65O6r0j32N17jr3k74Q6J81NN7k52M7j22K02o7p3Lk21O1L3J35P5k04J18
2482a5J14l75K23K05j18m1J14o1k4j24M1J33P6M8o7k67K49p1N5n9j07j22J8J88
2506A3M3j32ko6o2J81L80n01L3J71k39J66K28l29J27L9j00J71k31J12J7J81j15
$$ plain form
2529 85 -28 100 -261 224 39 78 72 134 -202 76 95 246 -180 -22 -222 -104 -96 -252 -108 -45 89 -173 21
2552 21 29 98 -66 91 -89 -99 120 192 128 173 -1 164 185 49 74 -146 91 120 29 -226 50 -148 -122 -242
2576 -242 -105 -144 -13 -99 -369 -205 -145 -2 10 132 267 122 -121 215 288 247 196 7 -122 -52 288 299 -84
2599 -84 -75 -42 -11 59 9 -76 -193 -10 -301 -308 -127 -166 -107 -191 153 -144 4 10 179 140 8 -50 218 275 318 60
2625 60 185 -306 -83 255 33 -83 131 43 -58 -33 210 -50 52 -185 38 -234 -64 -239 -99 -149 -35
2646 -35 -141 -175 -186 -2 177 56 26 125 161 160 44 62 43 227 112 177 478 -80 -13 72 -40 -34 -90 -360 -249
2671 -249 -34 -140 9 23 33 107 108 -344 -179 -19 97 43 36 80 133 -140 -16 48 -122 219 76 -170 193 -33
2695 -33 -55 10 50 177 234 -117 -26 -137 -83 -9 -108 -40 -144 -180 -302 -127 31 -59 138 23 125 -66 -309 31
$$ packed form
2529H5j13J28l61M85j85L9oO2l36K78J9J51m26J58k00J18Qj56J44O3J34k62J94
2552B1QO9j64J57j80j0K19P2o4M5j74J65K1j36K5k20K37K9r1k55K76j98K6j20
2576b42J37l9J31q6k70J64O0J43J2J22J35j45k43L36P3m1n1j89j29P0L40J1l83
2599h4RL3L1P0n0q5j17J83k91pJ81l9N9q4L44k97J48OJ69l9j32n8K68N7M3k58
2625F0J25m91K23L38k22j16K14q8j01K5K43k60J02k37K23k72J70j75J40n0J14
2646c5j06l4j1J84J79j21l0R9L6jj16J8j9J84j15O5L01n58O7Q5j12On6k70J11
2671b49K15j06J49J4J0P4Jm52J65J60J16n4pM4N3k73J24O4j70L41j43k46L63k26
2695c3k2O5M0J27N7l51R1j11N4P4r9O8j04l6j22J75J58r0J97j15J02j91k43L40
$$ plain form
2719 31 3 82 91 55 22 -58 46 242 128 138 -155 0 -199 5 -147 13 55 -62 -40 -69 -138 -106 1 -4 -45 -207
2745 -207 160 84 202 5 -7 54 392 236 99 254 83 159 255 248 116 -156 104 -23 -60 -26 -215 -222 -197 -402
2769 -402 214 202 -159 -166 149 11 -130 -104 116 -54 0 -57 -128 313 -127 202 -96 -48 38 226 284 121 200 44
2793 44 -164 -202 42 -49 204 -352 -169 -22 -168 16 68 50 -130 -249 -9 183 16 50 -275 -62 36 171
2815 171 135 258 48 172 212 45 181 195 -125 97 -258 -131 -54 -26 122 -116 -4 -81 -389 53 71 -79
2837 -79 -127 5 -407 -89 -127 296 -46 -22 -66 55 80 -3 -96 166 206 191 -57 71 398 50 10 -80 -62 91
2861 91 290 -158 -31 18 -132 -50 -77 191 13 83 -13 -1 -144 49 -51 -9 35 -78 -94 217 136 -100 -45 44
2885 44 61 95 141 -6 68 -10 243 95 38 -285 -211 -365 -218 154 -31 -17 -249 -208 -307 -293 87 -13 110 -22
$$ packed form
2719C1k8P9Rl6l3q0J04J96j14J0k93J55j99K04j52J60M2j17K2k9o9L2J07nm1j62
2745b07L67p6J18j97j2O1L38j56j37J55j71P6R6pj32k72K60j27l7L4j89pK5k05
2769d02O16j2l61pL15j38j41K6K20j70N4n7p1M41m40L29k98M8Q6J88N8j63P9j56
2793D4k08l8K44r1K53n56J83J47j46J84N2j8j80j19K40J92j67L4l25K13R8J35
2815A71l6J23k10J24M0j67J36J4l20K22l55J27P7K8J48k38J12p7l08M42J8j50
2837g9m8J32m12L18l8M23l42K4m4J21K5q3r3K62M0j5k48J28L27l48m0r0J8J53
2861I1J99m48J27M9j50Q2k7K68j78P0r6J2j43J93j00M2M4j13j6L11q1k36N5Q9
2885D4J7L4M6j47P4p8K53j48n7l23P4j54J47L72j85J4k32M1r9J4L80j00J23j32
$$ plain form
2909 -22 -13 -114 -142 -208 254 76 -65 36 94 -18 235 -60 -169 38 -56 -162 76 12 58 11 -47 -166 148 44
2933 44 -281 -41 173 -193 -119 141 40 -351 111 -66 -297 -180 60 -143 35 118 -31 99 267 133 202
2954 202 115 93 154 229 -100 -62 56 -124 -164 207 140 -42 -35 -338 -229 -36 316 -41 -23 50 15 -153 -160 -51 59
2979 59 66 56 -173 72 -111 -7 80 65 -99 -184 -61 73 -120 322 -286 -142 131 -2 -42 34 10 -76 4 -90
3003 -90 41 -61 27 11 -96 5 221 110 -70 37 -137 80 222 3 -42 -56 -53 87 5 -123 13 -34 -166
3026 -166 115 57 -166 163 -37 83 65 -24 -48 221 -173 -76 -130 45 226 -18 52 -108 236 244 160 214 -15 313
3050 313 102 -13 50 -42 -66 -240 -53 215 -22 -50 -134 98 -136 -188 33 -98 -122 14 33 -150 -154 29 167
3073 167 -35 110 -10 325 226 145 -39 36 138 -57 16 82 -115 131 29 -46 122 -159 -160 14 52 -14 -86 -48
$$ packed form
2909b2Rj01k8o6M62j78j41J01N8j12K53k95j09K07r4j06K38o4M6m7n8j19L14j04
2933D4l25K40K14l66P4K60j01l91M62j77k31J17K40k03J78Q3j49J30J68j34O9
2954B02q7k2O1P5l29L8J18j80m0L71o7j82Pl03J09J93L52l57J8P3l5j68pJ09J10
2979E9Pj0k29K45j83J04Q7j5j64q5J23J34j93M42o08J44K73j33m0P6k4q6Q0r4
3003i0J31j02Q8j6j07J01K16j11j80J07j74K17J42k19m5j4LJ40q2j28J36m7j32
3026a66K81n8k23L29k00J20j8q9k4K69l94R7n4J75J81k44P0j60L44Qq4N4k29L28
3050C13k11j15O3r2k4j74J87K68k37k8q4K32k34n2K21j31k4J36J9j83mJ83J38
3073A67k02J45j20L35r9q1j84P5J02j95P3O6j97K46j02p5J68k81jJ74L8o6p2L8
$$ plain form
3097 -48 -140 181 24 -61 -397 -37 100 200 7 -91 88 244 -121 -44 80 108 -4 48 -80 -15 58 -41 97
3120 97 -175 220 109 -102 104 -268 -97 -7 -37 53 -21 175 -51 49 -197 139 -54 203 279 -7 -120 -106
3142 -106 -97 158 154 93 198 -15 -146 160 40 -36 -3 171 125 124 131 -9 -253 -83 106 -25 -238 -66 -1 -112
3166 -112 -124 -68 -24 9 144 124 70 -151 264 59 101 126 88 -89 58 -122 -39 83 -185 73 -110 -132 -216 113
3190 113 -372 68 79 9 39 -68 197 -112 2 -71 63 117 -119 -147 -3 -223 77 134 27 289 211 74 161
3213 161 184 7 313 -14 -110 -128 -124 -133 132 -143 -145 -183 -88 88 -28 58 -56 35 -100 58 -107 18 49 -133 -17
3238 -17 -120 102 -156 -44 -139 11 116 61 -119 63 37 175 224 -257 -225 -50 -85 -69 -312 -186 -180 67 -126
3261 -126 -155 23 -186 3 -6 119 251 29 -22 -134 68 278 33 198 67 -9 173 373 117 307 -131 23
$$ packed form
3097d8r2L21j57q5l36L60J37J00j93r8J79J56l65P7J24K8j12N2j28O5P3r9J38
3120I7k72L95j11k11K06l72J71R0l0R0p4J96k26J00k46L36j93K57P6k86j13J4
3142a06RK55mo1J05k13j31L06j20p6L3J74m6jPj40k44J70J89j31k13J72O5j11
3166a12j2N6M4L3J35k0n4k21M15k05M2K5l8j77J47j80Q3J22k68K58j83k2q4L29
3190A13m85M40J1p0L0j07K65l09J14p3J34N4k36k8J44k20L00N7j07K62p8j37Q7
3213A61K3j77L06l27r6j8MrK65k75kl8R5J76j16Q6j14R1j35J58j65J25L1j82J16
3238a7j03K22k58J12r5J50J05n5j80J82k6J38M9m81L2J75l5J6k43J26OK47j93
3261a26k9J78k09J89rJ25J32k22n1j12K02K10k45J65j31p6J82K00k56J90m38J54
$$ plain form
3283 23 219 -46 -40 -245 -166 -187 53 100 -167 -44 -291 -133 173 109 163 64 -158 156 -117 -2 335 163 216
3306 216 -116 39 10 7 -139 78 386 268 -22 -138 22 -26 -256 -182 -196 3 -12 -43 -17 -14 -113 -138 -234 -38 -172
3331 -172 -166 -20 58 160 35 2 114 26 -10 154 124 -243 -64 109 -104 -89 -117 102 103 -296 -87 -42 -71 -45 -36
3356 -36 -90 -41 69 -306 -179 -40 -59 -18 123 -178 6 32 141 194 198 -48 -18 11 -82 33 -117 107 -87 -37
3380 -37 174 164 -224 -122 -237 -15 -288 168 -9 47 103 63 -126 -13 107 -210 -113 -46 96 -31 249 43
3402 43 191 211 -111 0 13 -65 146 53 -83 162 70 -162 -77 61 -95 -505 139 -23 -68 -169 -375 -229 -29
3425 -29 -29 -23 -80 -248 -12 7 -60 291 320 -217 241 -16 -163 -205 -63 43 -66 113 77 126 36 -54 83 20 90
3450 90 272 -279 -57 -171 -197 -123 26 -289 -49 15 -24 -280 61 231 -23 -119 -20 63 43 87 -216 91 114 -134
$$ packed form
3283B3J96k65Ok05P9k1K40M7k67J23k47J58L06o4N4r9k22L14k73J15L37j72N3
3306B16l32J55k9lj46K17L08j18k90j16J60m8k30P4j4J99j5l1K6Lr9k5r6J96j34
3331a72OJ46P8J02j25l3J12q8l6J64l0l67J79J73k13J5k8K19Jl99K09M5k9K6R
3356c6n4M9J10l75J27J39j9M1J41l01J84K6J09N3Mk46L0K9r3J15j50K24j94N0
3380c7K11j0l88J02j15K22k73M56j77N6N6m0j89J13J20l17R7O7J42j27K80k06
3402D3J48K0l22J11J3p8K11r3j36K45r2k32Q5J38j56m10O44j62m5j01k06J46K00
3425b9%On7j68K36J9o7L51K9n37M58k57j47m2J42J06j09J79l6M9r0r0J37o3P0
3450I0J82n51K22j14k6P4J49l15K40O4l9k56L41J70k54r6R9Q3k0M4l03L07K3k48
$$ plain form
3474 -134 93 240 -51 -11 -56 -212 43 -235 -114 -1 0 -30 -97 -12 -317 -59 69 -99 59 106 -25 -70 -167
3497 -167 -24 -105 31 32 -19 -3 102 -49 62 -38 156 -48 21 6 -194 93 -141 186 44 -326 -165 -213 42
3520 42 -162 105 -45 50 277 35 3 -146 -167 147 42 300 -205 228 108 23 230 -135 -8 -55 -111 191
3542 191 -71 -126 57 8 -86 30 -52 -44 -6 182 -140 -161 78 -288 -38 -65 -192 -200 175 -37 -34 -1 -24 -101 -65 -182
3568 -182 302 0 -99 54 68 -78 190 -129 -148 16 7 -65 -3 153 -149 -14 -12 -139 -118 49 58 223 34 -102
3592 -102 66 227 -299 -27 238 -109 12 70 7 17 91 89 128 -60 -130 -155 86 31 -81 142 -284 -222 -33 -315
3616 -315 -75 -30 108 160 -37 -128 -157 -96 -29 135 -52 20 221 -85 82 342 -241 -98 41 61 3 201 -47
3639 -47 -95 -123 -227 45 -313 -13 -205 -27 -59 -30 86 81 94 157 181 157 21 140 261 177 38 -35 -12 -216 -7
$$ packed form
3474a34K27J47k91M0m5j56K55k78J21J13Jl0o7Q5l05K58J28j68J58M7j31m5r7
3497a67J43q1J36Jn1J6J05j51J11j00J94k04O9j5k00K87k34L27j42l70J61m8K55
3520D2k04K67j50R5K27k42l2j49k1L14j05K58n05M33j20q5K07l65J27m7n6L02
3542A91k62n5J83m9r4J16q2QL8J88l22k1K39l66K50k7j27qL75k12LL3k3p7L6j17
3568a82M84l02r9J53J4j46K68l19j9J64rp2O2J56l02J35Kj27K1J67RJ65j89j36
3592a02J68J61n26K72K65l47J21N8o3J0P4kL9j88p0k5K41n5j12K23m26O2J89k82
3616c15K40M5J38N2j97r1k9O1O7J64j87P2K01l06J67K60n83J43J39K0n8J98k48
3639d7m8k8j04K72l58L00j92J78l2K9J16nJ3O3K4k4j36J19J21q4j39p3K3k04K09
$$ plain form
3664 -7 337 59 -115 99 62 109 2 96 91 -50 -132 -300 -126 -164 -271 -168 21 -107 -129 -143 32 128 -63 -210
3688 -210 132 219 65 191 350 -1 227 -131 63 331 41 -42 3 45 75 185 -74 -128 -171 -189 118 146 133
3711 133 -51 -156 -2 -10 113 -165 -163 65 101 162 -61 -129 27 -108 -47 137 11 211 246 -27 52 -76 128
3734 128 243 57 -7 89 0 171 67 10 166 68 -192 -143 -113 -118 -142 26 -74 -47 179 -1 91 57 389 -103
3758 -103 44 42 -69 -54 219 -122 48 151 -38 123 -77 24 108 223 -187 -18 -57 69 67 -43 143 -15
3780 -15 7 -50 -23 107 63 -5 66 299 -302 151 23 -306 -110 25 -123 -228 -104 -71 36 183 -73 -17 34
3803 34 -116 -149 -155 326 97 -166 -115 -53 -93 34 -152 -189 50 -22 -120 81 107 2 -102 164 82 31 9 2 220
3828 220 34 -185 254 244 -149 299 -72 -59 -46 -122 231 -11 149 -262 -2 46 -45 -161 -180 -277 120 -302 191
$$ packed form
3664gL44k78j74K14l7M7j07R4nj41q2j68J74l8j07J03J89j28k2j4J75R6j91j47
3688b10L42Q7j54J26J59l51K28l58J94K68k90q3M5M2L0J10k59n4m3j8L07K8j3
3711A33j84j05J54qJ23k78KK28L6O1k23o8J56j35O1J84j26K00L5k73P9j28K04
3734A28J15j86o4R6q9J71j04n7J56r8k60M9L0nk4J68j00K7K26j80R2l4L32m92
3758a03J47kj11J5K73l41J70J03j89J61k00J01Q4J15m10J69l9J26kj10J86j58
3780a5K2n7K7J30m4o8P1K33o01M53j28l29J96J35j48j05J24L3J07J47k56N6N1
3803C4j50l3oM81k29k63N1O2m0J27j86l7K39p2r8K01K6j05j04K66q2n1k2pK18
3828B20j86k19M39j0l93M48l71J3J3p6L53k42J60m11K60M8r1j16j9r7L97m22M93
$$ plain form
3851 191 44 -60 220 316 19 194 170 -64 138 -45 -81 -55 -48 -26 -171 -192 -115 -182 -194 170 18 51 36 -76
3875 -76 -81 9 -34 56 -34 -358 41 34 61 298 177 -34 152 -82 53 213 -10 -65 140 -223 -74 47 -16 150
3899 150 27 15 5 -172 -27 236 -30 -143 -71 -121 -176 -107 -111 -161 205 -20 -205 87 -78 59 -158 -44 50
3922 50 162 144 89 305 40 -57 -185 -24 85 16 -143 165 21 -76 -149 -178 -45 168 -24 -133 141 -15 -163
3945 -163 93 -57 -217 -200 6 -7 331 97 -133 -28 -74 258 248 8 -211 180 61 229 126 -94 38
3966 38 44 131 -34 -120 -110 -37 63 179 -178 27 127 -63 -84 108 262 84 67 -26 70 5 157 63 17 -72 -334
3991 -334 38 55 47 -29 30 194 18 59 134 -37 -35 -271 208 237 -66 -169 -178 227 -100 153 184 94 88 138 125 -195
4017 -195 60 -104 201 147 140 -19 140 103 -195 -21 73 -215 133 -201 -192 271 -117 294 -37 11 -140 -225 -224 51
$$ packed form
3851A91j47j04K80R6k97J75k4k34K02j83l6K6PK2j45k1P7o7j2L64j52L3j5j12
3875g6nR0m3R0r0l24L99pK7K37j21k11J86k34J35J60k23n5K05l63J49J21o3J66
3899A50j23j2j0j77J45K63k66j13P2n0n5O9mn0L66k25j85K92j65J37k17J14R4
3922E0J12j8n5K16k65r7j28J61J09o9j59L08j44r7p3k9J33K13j92j09K74j56j48
3945a63K56j50j60J7K06j3L38k34k30J05m6L32j0k40k19L91j19J68j03k20J32
3966C8OQ7j65q6J0P3J00J16l57K05J00j90k1J92J54j78j7r3R6o5J52r4m6q9k62
3991c34L72J7qp6N9J64j76M1P5j71Kk36M79K9l03j03rM05l27K53L1r0oN0j3l20
4017a95K55j64L05n4pj59J59l7k98J74R4k88L48l34RM63l88M11l31M8j51q5JK75
$$ plain form
4041 51 -169 13 -72 -82 29 347 -90 36 91 72 -60 78 69 -50 -101 76 -82 -64 -200 76 -151 23 39
4064 39 -309 -208 -98 92 -191 17 -237 -231 0 -13 -18 169 53 20 -411 196 -71 208 -69 233 -56 153
4086 153 49 -58 20 -8 -28 -123 -33 -3 37 -35 -77 -123 -87 -36 -95 161 -49 -176 -53 -23 18 35 -92 75 87 -46
4112 -46 26 48 87 39 224 -139 -15 -150 -35 191 52 -41 -116 105 92 -33 20 17 78 -134 -254 -84 101 -167
4136 -167 109 -71 155 -301 -34 -3 6 2 -71 -118 -199 -75 89 28 21 75 72 141 120 -84 236 -187 -259 -296 -19 -109
4162 -109 -352 73 -80 98 44 -17 -109 126 109 110 -25 -44 7 215 -107 -63 -75 -41 87 -39 175 -36 -2 213
4186 213 175 -112 92 -48 -110 -31 -125 -65 -194 -167 38 -103 -134 -169 -96 -70 -79 208 306 -132 8 41 111 -82 -6
4211 -6 99 -55 -219 -139 4 -196 188 145 88 -66 176 -90 29 -306 -46 -194 -157 -47 22 -108 88 -66
$$ packed form
4041E1k20J82q5j0J11L18m37J26N5j9j32J38rj19n1J77j58J8j36K76k27J74J6
4064C9l48J01J10J90k83K08k54OK31j3nJ87j16l3m31O07k67K79k77L02k89K09
4086A53j04j07P8k8k0r5R0L0M0p2m2m6L6N1n9K56k10j27J23L0M1J7j27J67J2j33
4112d6P2K2L9m8J85l63J24j35J15K26j39r3p5K21j3j25N3lO1k12j20J70J85k68
4136a67K76j80K26m56K67L1Rmp3m7q1J24J64o1pN4lO9k1k04L20m23p2l7K77r0
4162a09k43M25j53J78n4o1r2K35j7Jj35j9N1K08l22M4j2L4J28j26K14k11L4K15
4186B13l8k87K04j40o2P9r4O0j29K7K05j41l1l5P3K6rK87R8m38J40L3P0j93P6
4211fJ05j54j64Q0J43k00L84m3n7j54K42k66J19l35K60j48L7J10O9j30J96j54
$$ plain form
4233 -66 -123 31 -171 213 -71 -10 -103 264 -133 62 -165 183 -274 130 186 142 71 149 161 -154 -271 20 -21
4256 -21 -13 0 3 -73 93 -55 -113 -3 -185 -72 73 14 -11 89 99 -46 -122 -101 -89 17 -64 -73 -118 -15 -84 -102 -66
4283 -66 -113 -2 -196 149 30 -321 -214 101 -74 -66 256 65 -65 -273 -5 127 -207 92 42 14 301 -86
4305 -86 127 129 -166 351 144 -40 81 269 -146 -151 52 44 -106 14 -65 58 -4 29 47 398 133 -44 -285 -135
4329 -135 -60 -119 -174 -27 11 85 -104 141 -152 72 8 -142 -171 241 -11 -276 337 33 -92 7 -191 43 254
4352 254 53 136 -72 89 -145 -251 -176 -109 -205 128 -130 5 -114 125 183 -267 310 66 131 61 32 51 283
4375 283 197 127 -59 88 -136 223 58 21 257 297 48 -125 64 1 -64 -250 -140 17 -70 -187 14 261
4397 261 88 219 126 201 -18 -3 168 -21 37 -56 -57 151 136 -135 57 -38 -42 71 -46 26 397 -158 -37 -131
$$ packed form
4233f6n7J54k02L84k84O1r3L67l97J95k27L48m57M04N6m4p1P8J2l15j17K91m1
4256b1QJ3Lp6J66j48n8J10j82J13J45n9k5J00J0j45p6K1J2J06q1rm5J03o9j8L6
4283f6m7J11j94L45j19l51J07L15j75QL22j91j30k08K68J32l34K99n0k8K87l87
4305h6K13Kk95N17k07j84J21J88m15nK03qj50J20p9J23o2L3J8L51k65j77k41J50
4329a35P5n9n5J47L8P4j89K45k93K24o4j50k9M12k52k65O13l04j25R9j98K34K11
4352B54k01Q3k08J61k34j06P5O7r6L33k58J35j19K39N8m50N77k44O5p0k9J9K32
4375B83q6p0j86J47k24L59j65l7K36M0k49j73J89o3o5j86J10J57q7j17K01K47
4397B61j73J31r3P5k19J5J71j89N8r3jK08j5k71J92r5mJ13j17P2L71n55J21r4
$$ plain form
4421 -131 -291 91 -45 -138 -6 136 -90 26 -301 -257 62 -259 -33 253 -118 -71 43 91 13 -65 -134 112
4443 112 70 311 -28 -231 -46 -40 326 -88 -229 -128 194 -53 -29 -19 -139 -159 -30 178 -30 -58 -167 -121 234
4466 234 128 -60 337 218 -83 -38 143 124 -167 163 -30 188 -13 20 -2 59 -130 -145 -23 -122 -167 -73 -118
4489 -118 75 -38 -400 -3 108 174 9 185 46 -31 173 144 -31 217 230 -18 -27 126 7 288 141 -162
4511 -162 -196 253 -8 -43 67 -170 -152 -221 -113 74 -144 -29 -130 -210 -143 -120 -6 -34 -31 208 43 50 34 70 -29
4536 -29 94 -80 -201 -32 -212 143 180 1 -140 91 314 -22 -202 -157 -86 -79 -122 -141 -263 -5 -115 128 76
4559 76 -77 127 101 33 -2 -44 -117 185 -229 73 -55 76 308 124 -49 -269 235 -132 23 50 -117 -52 -29
4582 -29 -166 134 -84 -171 -132 -316 33 37 78 -11 -165 -40 -25 -106 -141 -40 -24 -78 232 -41 330 133 -139 101
$$ packed form
4421a31j60L82j36r3J32J42k26J16l27M4L19l21K26K86l71M7J14M8p8p8o9K46
4443A12m2K41l39k03J85OL66m14j41J01L22k47K4J0j20k0J29K08k08k8j09M6L55
4466B34j06j88L97j19l01M5J81j9k91L30j93K18k01L3k2O1j89j5J22r9m5R4m5
4489a18J93j13l62L97J11O6j65J76j39p7K04k9j75K48J3k48rJ53j19K81j47l03
4511a62l4M49k61l5J10k37J8o9J08J87k18J15j01q0O7K3J14k8LK39j65Pj6L6r9
4536b9J23j74j21J69j80L55L7j79j41K31K23l36j80M5P1Pm3j9j22K58j10K43n2
4559G6j53K04k6o8l5m2p3L02m14L02j28J31K32j84j73k20N04l67J55K7j67O5K3
4582b9j37L00k18q7L9j84L49MM1q9j54J25J5q1l5J01J6n4L10k73L71j97k72K40
$$ plain form
4606 101 -185 135 -266 -240 -55 59 -208 12 18 78 -113 -38 18 85 125 -66 -36 5 -12 -162 145 187 206 -7
4630 -7 120 -32 20 -30 -29 -242 42 -28 88 -207 -30 -87 181 -14 -86 197 197 -170 -280 88 214 26 83 52
4654 52 -96 53 38 -31 -100 132 34 83 254 -108 54 -80 -75 125 71 122 260 -145 -89 -103 -372 -197 -271 246
4678 246 -53 -229 -70 202 -50 -68 184 -96 65 214 73 68 3 2 3 -170 13 202 -108 129 72 176 446
4701 446 -236 -240 -336 -101 -104 147 216 -109 201 -31 -71 160 49 -39 146 -51 167 8 -146 95 76 -243 240
4724 240 156 52 -23 86 74 36 183 33 -69 59 -162 86 55 137 -72 45 -67 -131 -180 48 28 -108 24
4747 24 -2 -144 -55 34 48 163 -181 117 4 130 54 -137 -90 -49 -51 -128 -170 64 -96 207 126 -27 111 251
4771 251 40 -208 -17 150 -24 -75 -169 74 -121 152 93 172 -292 133 -46 -83 115 -66 -15 -354 -96 -50
$$ packed form
4606A01k86L20m01K6J85J14k67K20OO0j91P5N6O7M0j91L0M1j7j50L07M2J9k13
4630gJ27j52N2n0Jk13K84p0J16k95J77n7K68j95p2K83%l67j10L68J26j88N7l1
4654E2j48J49j5o9o9K32r8M9J71l62J62j34NK00n4N1J38m05N6j4k69J75p4N17
4678B46k99j76J59K72k52j8K52k80J61J49j41no5jJj73J83J89l10K37n7J04K70
4701D46o82mr6K35lK51O9l25L10k32m0K31j11q8J85j97K18j59j54K41j9l19M83
4724B40q4j04p5J09j2l8J47j50j02J28k21K48l1Q2k09J17j12o4m9K28k0j36J32
4747B4k6j42Q9Q9J4J15l44K98j13J26p6j91M7M1kp7m2K34j60L03q1j53J38J40
4771B51k11k48J91J67j74n1r4K43j95K73n9P9m64M25j79l7J98j81N1l39K58M6
$$ plain form
4793 -50 -1 -325 81 35 326 -16 -158 8 -68 161 -8 20 38 -104 -208 -168 -187 -116 10 -24 -233 37 -103
4816 -103 -61 219 -209 129 109 78 232 -200 140 151 179 134 259 -113 -127 -27 -369 49 -58 19 43 257 -104
4839 -104 -135 124 20 -15 -149 -96 144 -1 -70 -45 81 4 -9 34 153 92 -39 -119 14 135 -42 60 140 291
4863 291 94 75 36 12 118 -123 -19 -198 43 -101 134 -72 -40 52 179 -154 19 87 12 225 252 -76 145
4886 145 13 -200 -77 -66 128 51 127 233 -7 -88 200 87 99 150 312 65 113 161 -117 -154 35 -19 3 -202
4910 -202 94 -139 -124 -18 111 -70 -136 72 -78 128 -140 112 -64 -2 2 -120 19 -35 107 39 150 -259
4932 -259 10 -145 -10 -32 -134 140 -176 70 -6 6 95 103 -353 -70 108 189 -18 -13 -159 -59 20 82 -233 -121
4956 -121 172 -36 -151 107 -159 141 166 -99 -93 -161 -85 -256 -33 -46 23 -250 -237 -93 -91 -46 170 -86 22 -220
$$ packed form
4793e0M9l24M06m6K91l42j42J66p6K29j69K8J8j42j04M0j9P1J26l4k09K70j40
4816a03M2K80m28L38k0l1J54m32L40J1K8m5J25l72j4J00l42M18j07P7K4K14l61
4839a04l1K59j04l5j34N3K40j45o9K5J26p7j3M3J19o1j31q0J33J21j77J02Q0J51
4863B91j97j9l9k4J06k41J04j79K41j44K35k06L2R2J27l33J73O8p5K13K7l28K21
4886A45j32k13J23J1J94p7P6J06k40q1K88j13J2N1J62k47M8M8k78l7J89n4K2k05
4910b02K96k33J5J06J29j81o6K08j50K06k68K52j76O2Mj22J39n4J42o8J11m09
4932b59K69j55J35k2j02K74l16K46p6J2Q9Qm56K83J78Q1k07Nj46J00P9O2l15J12
4956a21K93k08j15K58k66L00K5k65Oo8P6j71K23j3O9k73J3J44KM5K16k56J08k42
$$ plain form
4980 -220 -221 149 212 -144 -16 375 -149 230 19 47 -125 1 13 25 -178 -28 -102 -10 -140 -109 31 -153 116
5003 116 -35 -245 -93 -240 -2 32 -298 7 52 -3 -52 -5 102 101 -131 -26 258 141 18 -58 139 -257 62
5026 62 50 18 -110 -105 -10 -296 -21 -26 82 128 359 74 -42 -207 50 179 -104 -106 -165 -113 -43 -53 64 46 -52 194
5052 194 -50 210 151 185 -204 109 -44 -142 -3 -59 -181 -80 -98 -183 -80 -38 -2 -136 -10 -213 16 8 59 -174
5076 -174 74 -75 14 21 -71 -1 283 -12 -76 168 189 90 -17 168 6 54 -164 -56 153 -6 73 26 49 -125
5100 -125 161 108 -190 41 -139 -73 -16 -150 -193 -104 -111 253 -113 105 108 15 -10 -4 72 -102 14 41 128 285 30
5125 30 33 -172 108 -94 -31 -125 -239 -37 -45 172 -142 29 -83 -102 -73 220 -57 17 -97 265 -55 -115 -52 -84
5149 -84 -124 246 122 94 -68 -191 -45 -58 83 95 57 -32 34 -148 -68 -40 54 -148 191 -125 171 98 -101 -34
$$ packed form
4980b20jL70O3l56J28L91n24L79k11K8j72J26J2J2k03J50p4R2j30L1J40j84K69
5003A16j51k10J52j47K38L4l30L05M5n5m9M7J07jk32J05K84j17j23p6J97l96L19
5026F2j2l2j28NR5k86K75nJ08M6K31k85j16j65K57J29k83kn9N2P0j0J17j8r8K46
5052A94k44K60n9L4l89L13j53r8J39n6j22J01j8q5J03M2L6j34J26k03K29qN1k33
5076a74K48j49Q9Pr2P0K84k95o4K44K1r9j07J85j62M8k18J08K09j59P9m7K3j74
5100a25K86n3k98K31j80O6N7j34m3Q9pL64l66K18Lr3k5OP6j74J16K7Q7J57k55
5125C0Lk05K80k02O3r4j14K02qK17l14J71j12j9K9K93k77P4j14L62l20o0O3l2
5149h4m0L70j24k8j62j23J46j3J41J2l8q9O6j82Q0K8R4k02L39l16K96p3j99O7
$$ plain form
5173 -34 59 15 -70 -179 74 -229 62 -97 -75 24 -285 183 88 -188 135 -157 22 1 59 80 -82 320 -303
5196 -303 92 -141 -88 -42 -133 -25 -173 -163 136 231 -29 84 -77 139 153 97 239 -72 -44 -313 99 105 211
5219 211 -68 39 59 36 -31 -138 -230 -178 109 -100 -47 140 -377 -29 -139 -291 -36 70 196 211 -134 48
5241 48 357 -32 44 -29 134 -5 74 -365 34 263 -103 80 -13 -33 -58 171 5 72 -53 -56 -76 -103 -63 -183
5265 -183 41 113 116 154 -42 151 43 -40 -99 253 49 -8 120 257 -119 22 -51 26 48 -39 356 59 10 -92
5289 -92 129 -133 71 -59 -184 -113 68 -174 -36 -80 34 -122 -4 -233 -353 -110 146 65 -4 197 55 -123
5311 -123 2 244 62 181 -313 -16 193 -68 121 -294 -268 31 241 113 -76 218 -84 -67 189 -226 -122
5332 -122 -112 52 -102 -42 209 39 4 71 154 65 -17 358 -130 254 -238 -91 -10 -125 -52 -68 93 89 -209 254
$$ packed form
5173c4R3m4q5j09K53l03K91j59K2R9l09M68r5k76L23k92J79k1N8K1j62M02o23
5196c03L95k33N3M6r1J08j48J0K99R5k60J13j61K16J4n6J42l11K8k69M12OJ06
5219B11k79J07K0k3o7j07r2N2K87k09N3J87n17L48j10j52K55J06J26J5l45J82
5241D8L09l89P6p3J63j39P9m39L99K29l66J83r3k0k5K29j66O7j25lk0k7M0j20
5265a83K24P2LL8j96J93j08q3n9L52k04n7J28J37l76J41p3P7K2q7L95k97m9j02
5289i2K21k62K04j30j25P1J81k42J38m4J14j56J18k29j20K43K56q1o9K01j42j78
5311a23J25K42j82J19m94K97K09k61J89m15K6K99K10j28j89K94l02J7K56m15J04
5332a22J0J64j54O0K51j70l5O7Q3q9q2L75m88L84m92J47Q1j15P3j6J61mk98M63
$$ plain form
5356 254 228 -173 -170 -173 -54 68 20 2 97 48 13 -205 -82 -49 -47 207 131 26 -27 -41 56 93 -28 43 2 210 0
5383 0 173 117 -280 157 156 131 -153 1 92 -46 -36 -164 -62 -45 -118 49 -209 -49 -10 122 31 57 -30 -166 23
5408 23 -178 193 15 51 -17 5 -19 202 -111 -49 -26 2 -105 -221 130 -169 -149 -212 -113 17 38 -43 222 -55
5432 -55 -7 17 115 -40 67 -80 -3 60 133 42 -214 -164 -96 -212 206 -70 97 263 188 187 -69 -14 -83 174 -130
5457 -130 194 108 -42 -111 -160 33 42 17 40 19 -34 147 -144 56 96 58 106 2 135 27 -198 114 164 -149
5481 -149 170 42 -194 44 183 42 -237 -172 -74 159 45 -131 -98 21 56 45 126 -13 -119 -63 357 -271
5503 -271 268 39 -77 -3 -46 59 376 244 59 -101 321 30 62 166 -108 6 -243 -63 148 35 -380
5524 -380 -64 23 197 -184 -90 -108 169 98 36 -40 -84 0 45 -24 -28 -112 36 72 -139 -105 -148 -89 55 -146 -157 85
$$ packed form
5356B54k6m01LlJ19J22m8j8R5m9l5k18J23L3KK54p6j05n3j4R7L7j21P1m1K08k10
5383@J73n6l97M37jk5k84J54R1j38J0j28J02J7p3J67k58J60L9J32r1K6q7j36J89
5408B3k01L71j78L6o8K2k4K21l13O2K3K8j07j16L51k99K0o3R9J30K1q1K65k77
5432e5M8K4R8j55J07j47P7O3P3r1k56N0O8j16M18k76J67J66p5jk56N5o9K57l04
5457a30L24q6j50o9m9J93Rk5K3k1n3J81k91K00M0l8M8j04J33j08k25L12N0l13
5481a49L19j28k36K38J39j41k79O5R8K33j14j76L3J19L5j1Q1j39j06N6M20o28
5503b71N39k29j16P4m3J05L17j32j85j60M22k91L2J04k74J14k49J80K11j13m15
5524c80L16Q7J74l81R4j8K77p1o2p6m4Q4M5o9mq4J48L6k11L4m3N9J44k01j1K42
$$ plain form
5550 85 -142 57 -117 -173 105 -54 -19 -19 68 -117 -161 -97 -130 12 161 146 -133 59 -30 -31 92 -102 137 -24
5574 -24 -24 31 -20 143 -176 28 -50 -190 -75 -313 357 -156 -133 -113 -332 -152 -15 -31 -32 -157 176 -199 -56 -18
5598 -18 -22 -93 -38 89 -68 12 142 124 85 229 -177 130 107 -41 92 68 198 -119 -152 -19 -89 162 262 -19
5622 -19 9 159 34 39 107 31 54 -52 -58 156 -194 -194 -24 124 -20 74 63 42 74 2 -84 -15 102 14 3 -155 -230
5649 -230 133 35 -141 -150 -218 -315 237 171 -67 -30 65 26 39 48 37 49 -306 91 54 -168 83 8 55 33 1 21 128
5676 128 135 145 -108 20 155 24 -285 -15 17 -123 204 -139 -268 221 -24 95 16 -84 118 -56 -21 192
5698 192 -93 -60 170 230 99 -129 105 71 51 35 122 251 217 100 185 -35 103 109 139 254 35 13 -82 -42 148
5723 148 203 64 -279 93 193 77 119 84 65 226 120 -29 -169 96 -104 146 139 -92 42 40 -13 -42 -23 72
$$ packed form
5550H5k27J99j74n6K78j59L5%Q7j85m4O4l3J42J49j5k79J92q9jJ23j94K39j61
5574b4%N5n1J63l19K04p8j40J15k38O70n13K3K0k19J80J37j6jj25L33l75J43L8
5598a8mp1N5J27j57Q0J30j8l9J44m06L07k3j48J33k4J30l17l3J33p0K51J00k81
5622a9K8J50j25NO8p6K3j06oK14l50%J70J48j44R4j1k1L2p2q6O9J17q8j1j58p5
5649b30L63r8j76ro8r7N52o6k38L7R5l9J3Rj1J2l55L97l7k22K51p5M7k2l2K0J07
5676A28PJ0k53J28J35j31l09K70L2j40L27l43j29M89k45J19p9j00K02j74L5K13
5698A92k85L3K30O0j31k28K34l4k0j6Q7J29l4j17Q5k20J38OL0J15k19k2r5M0J90
5723A48N5j39l43L72J00j16M2l5j9J61j06j49j40K65k00K50pk31J34kn3k9J9R5
$$ plain form
5747 72 -178 -59 38 -207 45 -10 -55 79 122 229 -157 4 121 19 192 171 -111 88 102 67 -105 105 12
5770 12 -102 60 60 56 -207 -410 26 -118 195 -116 130 34 206 -77 90 -119 149 -80 196 -92 10 -70
5792 -70 -111 -49 -26 136 -148 24 -133 17 -214 190 -121 -146 56 16 -202 78 -83 -54 -28 14 201 -109 14
5815 14 -58 100 -148 141 119 -29 -121 -239 3 -5 96 -132 242 24 195 -31 82 111 -157 53 225 106
5837 106 -36 -43 54 -95 131 82 -15 -89 -231 -260 -35 -146 -286 87 139 216 -73 -8 82 -93 -157 -82 161 -34
5861 -34 -126 -83 -127 -17 15 -106 8 -69 -164 95 5 -54 -163 3 117 1 -79 -38 -2 -102 -257 25 -101 141
5885 141 -106 35 127 -358 115 280 -94 -65 302 25 -132 63 -193 -111 -84 -28 -18 159 78 -144 -287 -307 -197
5908 -197 -69 107 216 -148 -128 218 3 -52 -54 126 296 110 -29 -73 -10 -180 -246 164 155 3 -56 -144 178 161
$$ packed form
5747G2k50J19R7k45K52n5m5J34M3J07l86J61J17j02J73k1k82J99J4l5j72K10r3
5770A2j14J62%mk63k03M36j44L13l11K46r6J72k83J67k09K68k29K76k88J02q0
5792g0m1O2K3J62k84J72j57J50k31M04l11k5K02m0k18K80j61K9K6M2J87l10J23
5815A4p2J58k48K89k2j48r2j18K42qJ01k28L74k18J71k26J13K9k68K10J72j19
5837A06j42pR7j49K26m9r7p4j42k9K25j11j40L73N2P7k89O5R0j75o4P5K43j95
5861c4r2M3m4J10L2j21J14p7r5K59r0n9j09J66J14j16q0M1L6j00j55K82j26K42
5885A41k47J41R2m85M73J65l74K9L67k77j57J95k56Q2K7N6J0J77q1k22j43k0J10
5908a97J28J76J09l64K0L46k15n5kJ80J70j86j39m4O3j70o6M10rj52n9q8L22j7
$$ plain form
5932 161 -259 113 143 55 194 -135 -124 -48 -22 247 124 146 -6 6 29 -152 49 -133 3 99 -120 51 59 -38
5956 -38 107 -281 105 155 175 -90 57 -129 -36 210 138 75 26 -116 119 -22 40 155 -53 81 1 30 82 216
5980 216 67 -16 120 -112 87 45 -10 -112 210 273 -172 8 133 231 -47 106 52 -142 -41 91 -137 50
6002 50 -174 -159 -89 -17 51 155 37 14 190 -151 -95 -163 91 -135 1 231 -64 171 -36 6 205 -133 -158
6025 -158 -90 60 132 60 -67 53 32 -124 106 117 67 -81 128 124 -67 77 -135 -70 -167 -34 -57 221 88 87
6049 87 56 168 -6 -134 -184 -53 62 -91 100 75 288 149 -30 -150 -163 -226 -167 67 -224 195 194 -35 53
6072 53 -63 -31 32 111 72 46 -152 76 -95 255 -135 -161 16 6 53 160 -43 -250 -22 -6 -24 -74 155 -54
6096 -54 -116 29 -171 71 40 -4 -120 73 -46 40 -54 138 -53 -67 68 118 -10 70 145 114 169 134 -76 67
$$ packed form
5932A61m20L72L0q8J39l29J1P6K6K69j23K2j52J2K3j81K01j82J36R6k19J71Qr7
5956c8J45l88L86N0K0k65J47j86R3K46p2o3m9j42K35j41O2J15k08J34q0K9N2J34
5980B16j49q3J36k32J99m2n5j02L22O3m45J80J25R8k78J53n4j94J01J32k28J87
6002E0k24J5P0P2O8J04j18k3J76l41N6o8K54k26J36K30k95K35k07M2J99l38k5
6025a58O8J50P2p2j27J20k1j56K30J1n0j48K09mj91J44k12O5r7J33k3K78j33j
6049H7l1J12j74j28n0J31J15j53J91k5K13j39j79j20j3o3N9K34k91M19jk29Q8
6072E3j16L2O3P9l9k6j98K28j71L50l90k6J77j0M7J07k03k07K28J6j8n0K29k09
6096e4o2J45k00K42l1m4j16J93j19Q6r4J92j91j4J35N0j28Q0P5l1N5l5k10J43
$$ plain form
6120 67 -185 1 136 105 140 -277 -6 117 -342 -110 312 -240 -105 107 34 153 76 153 -191 138 -56 -58 -39
6143 -39 63 161 -96 343 52 106 94 39 16 31 131 -101 172 5 76 -15 -30 -28 186 4 -35 -76 -15 -154 -120
6168 -120 66 76 305 -175 116 -108 -5 45 106 -146 -264 -122 -52 35 -220 -6 -23 -98 -25 72 -119 69 -168
6191 -168 2 40 -186 -75 -244 9 -147 -108 -198 -74 181 149 48 -97 3 -74 -158 -81 -75 -15 -43 115 133 59
6215 59 1 90 41 -77 -65 -132 26 120 -349 -47 21 -153 -203 48 103 165 34 -210 126 -43 -98 -99 194 36 30
6240 30 46 -2 50 44 -190 150 261 126 92 -225 164 170 34 21 -204 414 53 -171 22 -11 72 -116 -160 -11
6264 -11 -194 -63 230 -67 -131 -122 94 -41 112 43 102 20 -219 -55 3 201 222 -41 5 104 68 -105 93 -240
6288 -240 178 212 -33 102 -161 155 -137 34 223 154 -149 68 216 -87 -111 435 -51 -33 -69 -132 -55 21 -153
$$ packed form
6120F7k52J86J35l1L5m17K71J23m59K32M22n52J35K12p3J19p7P7l44L29j94kJ9
6143c9J02R8k57M39k91N4j2n5k3J5J00k32K73j67P1r1j5KK14j82l9m1O1j39L4
6168a20J86J0K29m80K91k24J03N0O1k52j18J42P0Q7k55K14j7p5P3R7j91J88k37
6191a68J70L8k26J11j69K53j56L9r0J24K55l2j01j45J00p7q4P7OO0k8J58J8p4
6215E9n8Q9m9j18J2o7J58R4m69L02O8j74n0K51N5O2j31k44L36j69n5jK93j58o
6240C0J6m8N2ok34L40J11j35l4l17L89Oj36j3k25O18l61k24J93l3Q3j88m4J49
6264a1j83J31K93k97o4RK16j35J53o9N9q2k39J64N8J98K1k63M6R9l6j73J98l33
6288b40M18L4k45J35k63L16k92J71J89o9l03K17J48l03k4N46m86J8l6o3P7P6j74
$$ plain form
6311 -153 -245 -157 -158 22 129 260 148 -3 37 -47 -149 -141 117 -52 -134 17 45 -262 -105 3 -120 -81 -27 190
6335 190 -83 145 88 219 30 69 135 361 155 47 186 -9 7 -143 -40 -9 27 -107 -73 -95 -102 -43 157 -334
6359 -334 -69 -241 233 25 -73 43 -2 -114 23 22 -231 5 -142 -88 -67 97 -67 118 -4 91 84 -109 123
6382 123 11 56 -52 160 48 -56 104 27 260 -234 -268 -130 146 108 174 -106 21 133 78 50 171 -93
6404 -93 75 -9 -138 -31 -32 -101 117 -97 -37 169 -127 -86 -27 -101 140 145 -97 232 233 -59 -15 -84 60 -140 23
6429 23 21 54 226 94 17 -108 95 -294 4 -45 -162 -152 -68 105 191 122 101 154 348 -276 -89 240 -65 -207
6453 -207 132 -89 34 -18 -130 59 107 -64 -102 31 21 -8 -222 -260 -152 -41 -112 -9 -156 125 -49 -131 26
6476 26 -67 -90 79 -16 -82 194 69 -160 -206 -6 -153 31 -111 -185 167 39 -2 164 -186 -2 -37 -60 -67 -27
$$ packed form
6311a53r2Q8jJ80J07J31j12j51M0q4j02QK58j69q2J51K8l07J57J08j23L9N4K17
6335A90k73K28n7J31j89L9O6K26k06j08J39j95J6j50J03L1L6j34L4k2pN9K00m91
6359c34K65j72M74k08r8J16m5j12J37jk53K36j47N4K1J64j64J85j22R5pj93K32
6382A23j12M5j08K12j12j04J60p7K33m94l4J38K76l8O6k80J27J12n5k8J21k64
6404i3J68q4j29J07jo9K18k14O0K06k96M1N9p4K41Nk42L29Jk92M4o9J44k00J63
6429B3kL3J72j32p7j25K03l89K98m9j17J0Q4J73Q6o9k1N3J94o24J87L29l05j42
6453b07L39k21J23n2j12J89M8j71l8J33j0k9k14l8J08J11p1J03j47K81j74q2J57
6476B6r3k3J69r5o6K76j25k29m6K00j47J84j42p4L52j28m1J66l50J84l5k3pM0
$$ plain form
6500 -27 117 -6 -35 234 -55 12 -37 -101 369 169 421 -16 -112 62 -73 19 -153 -43 75 133 -121 -240 -169
6523 -169 -64 -124 -86 121 -47 232 108 83 -129 -148 249 59 -85 195 96 -127 43 -34 66 -121 13 -108
6545 -108 -55 62 140 -102 173 21 -105 -73 -73 -43 91 -118 45 9 -127 -25 56 186 -295 -53 -80 124 -110
6568 -110 -115 86 -66 157 -64 3 99 46 -26 -283 195 107 37 -179 88 -144 -73 -82 -121 -167 -138 -40 43 33 -146 -204
6594 -204 -77 190 1 63 94 -120 174 340 -162 113 207 -96 -69 108 -62 -10 -2 173 9 -84 -61 201 134
6617 134 70 -91 -262 109 56 -159 -40 -96 11 -54 -59 220 -311 71 216 -91 195 -163 143 -27 76 -137
6639 -137 41 -54 142 -34 -246 181 -146 -18 -70 -36 144 106 -198 113 65 -72 94 -167 -59 222 -7 40
6661 40 7 129 232 -8 -179 301 100 -113 -108 8 -28 -29 -125 56 -138 168 47 229 -92 30 204 271 -31
$$ packed form
6500b7J44j23k9K69k89O7m9o4M70k00K52m37r6J74j35R2j72J10J18N8k54j19P1
6523a69J05o0L8K07j68K79j24k5k12j9L97j90j44K80r9k23J70p7J00j87J34j21
6545a08N3J17P8k42K75j52j26L2%L0J34k09J63l6j36J02Q1J30m81K42k7K04k34
6568a10nK01j52K23k21O7R6n3p2k57M78q8p0k16K67k32P1rl9m6K9R8Q3j0j79n8
6594b04J27K67j89O2L1k14K94J66n02K75R4l03K7J77j70N2QJ75j64r3K3K62o7
6617A34o4j61j71L71n3k15J19n6J07o5nK79n31L82J45l07K86l58L06j70J03k13
6639a37J78r5J96j76k12M27l27J28n2L4J80l8l04L11m8j37J66k61J08K81k29M7
6661D0l3J22J03k40j71M80k01k13NJ16l6jr6J81j94L06j21J82l21J22J74O7l02
$$ plain form
6684 -31 -177 -2 -74 -231 141 37 127 -134 21 -113 -100 42 179 -135 -183 -147 -7 -102 -125 -57 71 20 -46 -102
6708 -102 -6 -257 294 157 171 -282 222 -177 -118 -112 -49 159 -54 50 101 281 -150 33 17 0 129 68 95 -23
6732 -23 82 107 -36 46 -89 88 252 132 137 63 -72 -62 101 -92 -120 -78 -44 2 -90 122 92 -99 -209 212
6756 212 -27 219 188 277 -12 -234 270 98 -3 94 -245 -159 142 -173 -302 -37 -142 -130 -11 98 32 -79
6778 -79 10 9 -386 244 -170 197 2 -151 59 -49 -249 -79 -67 -73 105 190 -27 5 -48 31 67 -2 10 -54 -79
6803 -79 -83 -146 62 -49 63 -67 27 -72 -188 -150 -201 -109 383 -59 -283 134 -55 -10 93 91 -124 -291 184 119
6827 119 131 114 1 -99 -54 128 44 -215 20 380 -25 50 123 -289 -19 -114 -131 126 -47 75 -76 214 -134
6850 -134 -256 8 -41 185 6 27 41 -379 11 4 42 -76 56 16 -117 85 -396 15 -131 -77 42 42 30 -143
$$ packed form
6684c1j46J75p2j57L72j04R0k61J55j34J3J42J37l14m8L6J40r5k3O8J28n1o6n6
6708a02R6k51N51j37J4m53N04l99N9OO3K08k13J04N1J80m31J83j6j7J29o1K7j18
6732b3J05K5j43Q2j35J77J64j20Np4j35J0J63j93k8M2L4M6r2K12l0j91j10M21
6756B12k39K46l1Q9k89k22N04j72j01R7l39Q6L01l15j29K65j05J2J19J09o6j11
6778g9Q9jl95O30m14L67j95j53K10j08k00J70J2oJ78Q5k17L2n3P9L6o9J2o4k5
6803g9mo3K08j11J12j30R4r9j16L8n1R2M92m42k24M17j89M5J03kk15j67M75o5
6827A19J2j7j13j00M5J82q4k59K35L60m05P5P3m12K70r5j7K57j73J22j51K90l48
6850a34j22K64m9K26j79K1J4m20L90pL8j18J32m0j33K02m81M11j46N4J19%j2j73
$$ plain form
6874 -143 76 53 -189 -82 53 -17 140 -233 -155 271 -42 -63 48 29 233 -66 302 124 63 40 -89 1 -38
6897 -38 21 -243 100 254 -54 -27 -64 91 9 11 343 184 104 144 -175 139 -88 211 -159 -156 111 -268 75 59
6921 59 54 -127 -136 72 23 56 -98 195 -30 -338 61 -81 -123 -9 212 156 -31 -169 -259 -123 144 15 48 14
6945 14 -75 -49 20 197 159 112 237 98 -13 -61 195 100 -155 -64 -60 -43 -41 55 -50 -53 103 -71 -154 -186 -271 -13 -26
6972 -26 45 -4 -265 -262 -130 34 24 224 -143 -58 -56 -105 176 -185 37 0 24 165 91 51 -149 -93 267 -238 210
6997 210 -115 113 -114 -216 91 32 89 36 -91 91 80 -107 -202 154 236 -82 -198 61 17 -78 -203 -253 127
7020 127 246 197 30 -56 -54 -70 11 187 185 -49 141 139 -82 71 129 66 9 -116 26 -27 -190 109 -34 -83 11
7045 11 -46 -56 -101 -52 218 139 61 -178 -150 -97 -77 -231 -156 -86 -34 62 4 41 -17 85 -2 -5 76 -188 80 -29 87
$$ packed form
6874a43K19k3k42J07J35p0J57l73P8M26l13k1J11j9K04k99L68j78o1k3j29R0l9
6897c8N9k64L43J54l08K7l7J55q2KL32j59q0M0l19L14k27K99l70LK67l79L43j6
6921E9nj81rK08m9L3j54K93k25l08L99j42m2J14K21n6j87j38r0J36K67j29L3l4
6945A4q9K6O9J77l8m7J25j39j11m8K56r5k55R1MJ7KR6j05lJ56j74q3l2q5K58j3
6972b6P1m9k61LJ32J64j0K00l67Q5Km9K81l61K22l7K4J41p4m0k00N6L60n05M48
6997B10l25K28k27j02L07n9N7n3j27J82j1j87r5L56Q2l18j16K59m4r5j25n0L80
7020A27J19m9j67q6Kj6Q1J76kk34J90kk21J53N8o3n7j25J42n3j63K99j43m9R4
7045A1n7j0m5M9K70p9p8k39K8N3K0j54P5P0N2R6n8L7n8J02q7lQ1k64K68j09J16
$$ plain form
7072 87 -59 16 -114 -122 -32 -25 -127 -47 72 57 -263 -63 174 -35 109 -53 -38 154 -13 -62 30 29 22 -6 -10 59 244
7099 244 82 -57 -57 76 -196 -83 -106 -64 -121 4 186 -200 -91 -219 89 11 150 166 -42 -81 201 -54 -74
7122 -74 -35 30 -113 -29 -51 53 -98 181 -133 -48 23 -6 -32 -229 -19 -101 -71 -49 184 -24 -65 95 -2 -198 272
7147 272 -49 -131 -40 98 131 -132 -81 -14 64 -282 60 -285 -61 -30 98 129 -48 -126 29 -163 -138 99 57 78
7171 78 -2 -149 -16 -153 -179 144 -138 -194 -144 -71 -37 196 272 -9 101 -13 334 -175 -41 402 -119 34 -147
7194 -147 -30 12 -67 -119 62 2 2 91 -47 -32 -40 -48 -122 49 43 162 -81 -7 -240 -134 80 -123 -266 95 -68
7219 -68 -133 -114 -105 42 -24 -39 -63 -75 -5 124 41 -82 -159 40 40 -62 -253 -52 -202 153 298 138 -25 46 -206
7244 -206 58 72 -16 26 94 29 -30 -178 52 -73 -246 -4 -243 -44 -191 -39 150 1 -34 -77 -38 10 -3 -62
$$ packed form
7072H7j46P5j30qR0Pj02Q0J19j5l20K00K37k09J44j62J5J92j67m9R2jpk8mO9J85
7099B44j62j39%J33k72J13k3M2n7J25J82l86J09j28L08p8J39J6k08l9K82k55k0
7122g4L9O5j43Q4k2J04j51K79l14Q5P1k9k6j97K10q2L0K2K33k08m1J60r7j96M70
7147B72l21q2R1J38L3k63N1O7P8l46L42l45K24L1J28L1j77p8J55j92K5K37m2K1
7171G8q0j47J33j37k6L23k82n6N0P3L4K33P6k81J10j14L47n09J34M43n21J53j81
7194a47J17M2p9n2J81o0%Q9j38J5qqp4J71oJ19k43P4k33J06K14k03j43L61j63
7219f8o5J9RJ47o6j5k4j2P0J29q3j23p7J99%j02j91K01j50L55J45j60j63P1k52
7244b06K64J4q8M2O8o5n9j48K30j25j73K42k39J99j47J52J89j49l5m3L9M8j3n9
$$ plain form
7268 -62 99 -125 -42 55 396 -186 29 -249 -39 -27 -41 -61 -180 -142 -243 41 52 67 -150 248 -17 -347 -321
7291 -321 -96 146 -85 -16 -42 -101 -34 34 146 -30 -17 -9 -181 -48 -223 142 -72 -205 -150 0 92 123 -48 -72
7315 -72 -128 17 61 77 -138 99 39 -4 -69 -160 -170 -189 -258 -375 58 -82 77 110 145 -83 -111 29 8 -54 -30 63
7341 63 82 -151 60 -92 44 -105 227 103 -169 176 -5 110 181 -210 -222 238 -7 4 111 -112 29 116
7363 116 -36 -100 -211 -65 66 -32 -166 -183 16 240 -16 86 -216 140 -37 160 -34 -136 157 -43 120
7384 120 48 42 144 195 -134 -313 125 25 113 189 25 -265 134 -1 -58 -261 100 -53 121 -82 45 69 -223
7407 -223 108 -132 133 111 143 86 53 40 -292 39 -138 90 -81 -197 -81 62 -146 -45 41 -260 280 72
7429 72 1 -56 109 -91 -250 58 166 113 -37 25 96 -86 -279 40 -196 -50 -153 15 -395 47 25 -60 129
$$ packed form
7268f2J61k24Q3R7L41n82K15k78K10J2j4k0j19L8j01K84J1J5k17L98k65l30K6
7291c21K25K42k31O9k6n9O7O8J12j76J3Qj72J33j75L65k14j33N5J50R2L1j71k4
7315g2n6J45M4J6k15K37o0m3o5r1j0j9o9j17M33j40J59L3L5k28k8J40k1o2K4R3
7341F3J9k33K11j52J36j49L32j24k72L45j81J15P1l91j2M60k45J1J07k23J41Q7
7363A16j52o4j11J46J31r8j34j7J99K24k56J02l02L56j77J97j94j02K93k00J63
7384A20p2oJ02N1l29j79M38j00Q8P6j64k90L99j35n7k03L61j53J74k03J27K4k92
7407b23L31k40K65k2L2n7l3j3l32L31j77K28j71j16J16J43k08J01Q6l01N40k08
7429G2p1n7J65k00j59L08J08n3j50O2P1j82j93L19k36J46j03J68m10M42k2q5J89
$$ plain form
7452 129 -28 -99 -38 -22 19 -4 -72 -27 -181 -45 11 -34 -157 96 -51 -234 309 214 -4 72 114 -1 -20 -126
7476 -126 56 7 -308 -164 -118 103 -57 -26 33 -19 289 -2 -131 -20 24 96 201 49 72 -121 -240 129 158
7499 158 -262 -65 156 -40 294 -169 98 -33 75 65 -36 -26 -114 -159 58 179 -60 -73 -162 121 -177 23
7521 23 201 64 -334 -75 88 48 -181 -188 -159 52 218 -142 97 -126 -78 191 207 -224 -57 -157 -213 -68 117
7544 117 206 -67 12 108 -145 68 33 -267 -34 -130 133 123 22 -141 18 9 -82 -100 -149 -46 -85 -123 124 -195
7568 -195 -39 165 99 -365 -108 54 -308 -83 -69 48 71 190 127 167 8 -131 71 175 2 250 -27 42
7590 42 29 -122 114 -11 153 35 -245 -88 120 -146 -69 62 25 138 -117 12 -80 57 80 -80 180 74
7612 74 -73 -212 -106 75 30 -308 266 3 -88 -55 129 27 -15 123 -152 -32 37 -206 126 23 226 -76
$$ packed form
7452A29j57p1O1J6M1k3o8M5j54J36N6m5j23K53j47j83N43r5k18P6M2j15j9j06
7476a26J82m9l15J44M6K21j60L1N9n2L08k91j29J11M4P2J05j52K3j93j19L69K9
7499A58m20J97K21j96L34m63K67j31J08j0j01J0q8m5K17J21k39j3q9K83k98K00
7521B3J78j37l98K59J63m0k29pK9K11J66l60K39k23M8K69J6m31J67j00n6J45J85
7544A17Q9k73P9R6k53K13l5l00K33r6K63j0j01j63J59rr1j8m9J03l9l8K47l19
7568a95J56K04o6m64K57J62l62K25J4J17K3J19o3M0j59j39K02J04j73K48k77O9
7590D2j3j51K36j25J64j18k80J57K08k66P7J31l7J13k55J29r2J37K3j60K60j06
7612G4j47j39J06J81m5l38N74k63r1L3J84j02m2J38k75J20O9k43L32j03K03l02
$$ plain form
7634 -76 -98 233 -205 159 99 -79 -91 172 -173 -51 -262 172 281 29 -129 67 37 -60 -190 128 271 51
7656 51 59 -100 27 -12 264 -117 -58 -70 188 146 -33 -141 -87 191 362 187 -242 -330 54 -103 246 -124 -120 91
7680 91 -56 101 73 124 26 -247 -59 -308 -49 110 -171 124 249 -34 -42 114 147 133 -88 -38 -251 198 169
7703 169 -82 270 7 36 -17 -74 138 -145 159 -110 137 162 -86 -104 74 -52 196 31 -1 -3 -78 -94 -17 100
7727 100 123 -217 106 128 -80 105 159 34 59 59 132 127 -60 -168 -134 105 280 -178 -47 -35 -68 38 60 -135
7751 -135 174 -63 61 -95 -61 -4 -149 -3 181 246 -180 87 194 9 84 160 -170 -30 21 -91 -37 67
7773 67 135 10 -150 -37 -185 134 -99 -1 29 -101 -142 49 190 -149 69 34 33 -114 -76 -143 -134 -45 -92 -171 -48
7798 -48 -11 29 -209 19 -60 291 -56 -53 -63 161 -11 115 -42 -80 -7 -142 27 -116 -36 163 98 107 -30 19 100
$$ packed form
7634g6k2L31m38L64o0j78j2K63l45J22k11M34J09k52j58J96l0r7j30L18J43k20
7656E1Qj59J27l9K76l81N9j2K58m2j79j08N4K78J71j75m29q8L84j57L49l70MK11
7680I1j47J57k8N1r8k73J88k49K59J59k81K95J25k83qJ56L3j4k21N0k13M49k9
7703A69k51L52k63K9n3n7K12k83L04k69K47K5k48j8J78j26K48j65l2kp5j6P7J17
7727A00K3l40L23K2k08J85N4j25K5%P3nj87j08L4K39J75m58J31J2l3J06K2j95
7751a35L09k37J24j56L4N7j45J46J84O5m26K67J07j85P5P6l30J40N1j12N4J04
7773F7O8j25j60J13j48L19k33R8L0j30m1J91J41l39K18l5jj47L8o7RQ9m7p9J23
7798d8L7M0k38K28p9L51l47Lj0K24j72J26j57l8P3j35J69j43Q0J99o5Rj37M9Q1
$$ plain form
7823 100 -283 96 6 106 -42 162 -48 -75 240 -46 145 -58 -146 -56 -245 40 99 -51 127 70 19 -73 -4
7846 -4 69 -188 89 -43 181 -90 327 109 -220 185 84 -132 5 42 -231 162 136 10 -7 229 179 -245
7868 -245 -65 -9 94 212 -130 97 32 -238 -39 -174 17 4 -168 112 -29 285 108 56 6 73 173 -234
7890 -234 -221 -29 80 -71 228 26 345 3 -15 52 164 57 49 6 -188 -238 -202 18 -143 -40 82 139 54
7913 54 -94 -127 -80 14 -177 159 -74 -131 36 136 -133 -57 234 -39 -105 -22 -54 140 91 -73 147 -23 -194
7936 -194 -11 -6 -136 -89 48 -42 151 -10 83 -67 -64 -74 -109 98 141 49 -117 170 -115 154 121 -108 120 214
7960 214 -186 63 70 -159 -68 -74 -291 40 -209 -68 27 29 20 154 -213 -50 -47 -105 221 -60 -33 150 48 -101 161
7985 161 -128 -42 -157 -150 179 26 -2 -70 90 -86 310 136 -163 23 19 -64 214 -205 -68 2 118 -19 31
$$ packed form
7823A00l83L79r0J00j48K04k10k7L15k86J91k03q8R0j89K85N9j50J78n7n1r2O9
7846dP3k57K77j32K24k71M17k18l29M05j01k16J37L7k73L93k6j26j7K36n0m24
7868b45J80N6J03J18l42K27o5k70J99j35J91j3j72K80j41L14j77n2n0O7J00m07
7890b34J3J92J09j51K99k02L19l42j8O7J12j07qm3j94n0L6K20j61J03J22N7q5
7913E4j48l3M7R4j91L36k33n7J67J00k69P6K91k73o6Q3l2J94m9j64K20j70j71
7936a94J83Nj30M7J37r0J93j61R3j50Lj0l5K07M3r2j66K87k85K69l3k29K28R4
7960B14m00K49Pk29R1ok17L31k49J41R5KrJ34l67J63Ln8L26k81K7J83j02j49K62
7985A61k89Q6j15PL29j53k8o8J60j76L96j74k99J86mq3K78m19J37P0J16j37N0
$$ plain form
8008 31 -95 -119 95 -241 143 61 70 -267 -146 131 3 -131 -94 62 213 48 -171 364 226 28 45 -62
8030 -62 -171 -273 163 231 -50 -144 -42 -110 129 127 -110 41 -220 -99 -210 146 111 -46 72 24 47 -97 117
8053 117 12 -13 90 -376 -64 -193 162 -85 -79 184 3 -278 -85 26 193 2 -271 188 -94 35 223
8074 223 121 -16 -132 -171 4 83 -127 -47 -75 166 -174 -162 91 -8 -85 60 -5 86 -22 304 -31 -222 -97
8097 -97 -46 -33 35 -20 19 94 11 -87 157 145 -149 47 -126 -199 136 192 -252 -269 -270 -70 46 -158 -67 125 -14
8122 -14 -140 -114 -138 -25 -40 -134 -54 191 -48 109 6 -128 -184 -23 243 -2 30 -116 3 -54 -71 108 61 -47
8146 -47 -3 31 79 -21 208 -77 -245 -299 291 93 5 89 32 -116 136 -10 -72 -34 -134 64 17 16 -245 84
8170 84 38 16 -130 -294 -45 -121 266 66 42 -55 161 -122 9 -39 252 8 256 -204 99 148 -68
$$ packed form
8008C1j26k4K14l36L84q2Rl37J21K77j28j34L7J56J51j65k19N35j38j98J7j07
8030f2j09j02M36O8k81r4J02o8K39kk37J51k61J21j11L56l5j57J18m8K3j44K14
8053A17j05k5J03m66L12j29L55k47OK63j81k81J93J11J67j91k73M59k82J29J88
8074B23j02j37j16l9J75P9k10Q0k8K41l40J2K53r9p7J45o5R1j08L26l35j91J25
8097i7N1J3O8n5L9P5q3r8K44j2k94J96j73p3L35N6m44j7jK00J16k04R1J92j39
8122a4j26K6k4J13j5r4Q0K45k39J57j03j34n6J61K66k45L2j46J19n7j7J79m7j08
8146d7M4L4M8j00K29k85j68n4N90j98q8Q4n7j48K52j46o2L8j00J98m7jk61L29
8170H4m6k2j46j64K49p6L87k00k4r7K16k83J31m8K91k44K48m60L03M9k16
8191f8
$$ Imaginary data points
##PAGE= N=2
##DATA TABLE= (X++(I..I)), XYDATA
$$ plain form
0 0 0 0 0 0 0 0 0 0 0 0 0 0 0 0 8 -8 8 -8 8 -16 16 -16 24 -24 32 -32 40 -48 56 -64 72 -80 91 -103 116 -131
36 -131 147 -163 180 -203 227 -251 278 -309 341 -375 414 -457 503 -554 610 -672 740 -817 903
55 903 -1003 1115 -1244 1395 -1573 1791 -2059 2402 -2856 3485 -4427 5974 -8964 16838 -81445
70 -81445 -172826 44921 73163 -515 27923 42391 -38211 -4580 71858 37086 -28380 -9381
82 -9381 7782 988 4703 11244 -800 -2161 5990 2362 -20196 -11553 19279 6346 -23491 315
96 315 12928 -14049 -3402 24416 -4827 -19766 20462 24259 -11257 -6022 11284 10273 16453
109 16453 1865 -24037 -2263 21133 3959 1104 2783 -27006 -25908 18043 19394 -13441 -14528
122 -14528 -3690 -6262 893 10796 5430 -9131 -22341 -10903 12681 7398 -3408 3966 -3825
$$ packed form
0@%%%%%%%%%%%%%%Qj6J6j6J6k4L2l2M0m8N6o4P2q8J04j20J36j52J71j94K19k47
36a31K78l10L43l83M30m78N29n87O50p16P89q71R60j057J164j282J412j557J720
55I03j906K118k359K639k968L364l850M461n258O341p912J0401j4938K5802r8283
70h1445r1381K17747K8242p3678K8438J4468q0602L3631P6438l4772o5466J8999
82i381J7163o794L715O541j2044j361Q151l628k2558Q643L0832j2933k9837K3806
96C15J2613k6977J0647K7818k9243j4939M0228L797l5516N235J7306j011O180
109A6453j4588k5902K1774K3396j7174k855J679k9789J098M3951J351l2835j087
122a4528J0838k572P155R903n366j4561j3210J1438K3584n283j0806P374p791
$$ plain form
135 -3825 -11524 10836 16730 -4694 -766 8589 -9750 -8231 13392 1439 -10246 6927 3388
148 3388 -11731 1433 10784 -238 -4645 -4791 -7852 -6161 -4973 -3386 3482 1924 -3541 4476 5663
163 5663 -5284 3659 13583 -3580 -12296 -4685 -8277 -3082 9968 -1446 -16315 -5825 5853
176 5853 7017 10756 7017 -1792 2123 6890 3474 9313 9820 -1662 -30 3419 -4512 1908 12602
191 12602 -112 -12449 -6642 -2720 500 6500 788 -9005 -3913 1261 314 5016 2762 -5912 -67
206 -67 5234 266 2035 6871 4331 3503 2685 -2982 -1071 5063 1033 -4038 -4498 -9066 -9569 137 1078
223 1078 -4529 -3413 -4727 -5999 -909 145 -1055 1252 -4126 -9258 -431 7325 3649 4380 5513
238 5513 -3259 -1358 9455 6809 1029 1621 -3635 -5372 3031 3577 -513 1850 -596 -5538 -521
$$ packed form
135c825p699K2360N894k1424L928R355j8339J519K1623j1953j1685J7173l539
148C388j5119J3164R351j1022m407j46l061J691J188J587O868j558n465Q017J187
163E663j0947Q943R924j7163q716P611l592N195J3050j1414j4869J0490J1678
176E853J164L739l739q809L915M767l416N839N07j1482J632L449p931O420J0694
191A2602j2714j2337N807L922L220O000n712r793N092N174r47M702k254q674N845
206f7N301m968J769M836k540q28q18n667J911O134m030n071m60m568n03R706R41
223A078n607J116j314j272N090J054j200K307n378n132Q827P756l676P31J133
238E513q772J901J0813k646n780N92n256j737Q403N46m090K363k446m942N017
$$ plain form
253 -521 4666 -346 -1955 105 -4366 -5148 703 1361 1252 2213 -1042 -1218 1851 1342 1890 4063 667
270 667 -2784 -877 955 1705 4535 3113 -2294 -2211 -797 -188 3910 2833 -4803 -4669 -906 -1327 1907
287 1907 4482 -1114 -4989 -1870 -277 -92 1374 -1507 -5358 -2850 -983 -1140 2327 2317 -1373 166
303 166 1705 -24 1851 3885 2221 142 67 53 1574 4325 3576 559 -400 -1618 -2065 1726 1375
320 1375 -2390 -3938 -4154 -3484 -629 895 114 -2009 -3191 -1865 876 2256 1409 312 195 -135 1476
337 1476 4368 3798 2453 1646 157 0 1473 1014 661 102 -2368 -2544 -679 537 -575 -1052 -1524
354 -1524 -4023 -3749 -1940 -1339 -1224 -996 -1984 -1388 724 3083 4797 3771 1668 179 769 3198 2503
371 2503 113 -806 -1836 -1956 779 2350 948 -586 -1330 -1263 -1238 -518 -622 -2443 -3076 -3388 -3441 -453
$$ packed form
253e21N187n012j609K060m471p82N851O58j09R61l255j76L069n09N48K173l396
270F67l451J907J832P50K830j422n407Q3J414O09M098j077p636J34L763m21L234
287A907K575n596l875L119J593J85J466k881l851K508J867j57L467j0l690J539
303A66J539j729J875K034j664k079p5j4J521K751p49l017r59j218m47L791l51
320A375l765j548k16O70K855J524p81k123j182J326K741J380q47j097j17l30J611
337A476K892n70j345q07j489j57J473m59l53n59k470j76J865J216j112m77m72
354a524k499K74J809O01J15K28r88N96K112K359J714j026k103j489N90K429o95
371B503k390r19j030j20K735J571j402j534p44O7K5P20j04j821o33l12n3K988
$$ plain form
389 -453 381 -1205 -478 433 -17 498 1575 1771 946 1064 1151 -376 482 2428 2145 1684 -337 -1812 463
408 463 2112 1973 789 -658 -967 502 2150 2248 930 -660 -390 -119 747 258 725 497 -1541 -1554
426 -1554 1070 750 -289 416 -1169 -2139 6 302 -200 293 1052 490 1444 1661 427 1857 3227 -962
444 -962 -3353 -1781 -2119 -1518 -824 -3603 -5137 -2692 -349 461 -332 -2721 -3729 -873 323 -2816 -2005
461 -2005 336 -700 -63 1713 936 3119 5149 3358 2135 1895 1497 2760 3266 -885 -3732 -265
477 -265 1335 -1173 -1077 -1366 -1591 1004 530 -2143 -1148 216 474 1451 -546 -3814 -649 4355 1976
494 1976 -1538 -450 -363 1236 4843 2977 -589 988 2082 1595 3743 1459 -1978 -495 519 -2450
510 -2450 -2083 117 -1147 -2331 -1804 -2253 -1019 1651 -1221 -2612 -608 -1148 -1173 2050 280 -1411 1967
$$ packed form
389d53Q34j586P27R11m50N15J077J96q25J18Q7j527Q58J946k83m61k021j475K275
408D63J649j39j184j447l09J469J648R8j318j590K70K71Q66m89M67k28k038j3
426a554K624l20j039P05j585r70K145K96n02M93P59n62R54K17j234J430J370m189
444i62k391J572l38O01O94k779j534K445K343Q10p93k389j008K856J196l139Q11
461b005K341j036O37J776p77K183K030j791j223k40l98J263N06m151k847L467
477b65J600k508R6k89k25K595m74k673R95J364K58R77j997l268L165N004k379
494A976l514J088Q7J599L607j866l566J577J094m87K148k284l437J483J014k969
510b450L67K200j264j184N27m49J234K670k872j391K004n40k5L223j770j691L378
$$ plain form
527 1967 3306 1869 1710 1859 1341 1608 517 -2471 -2138 -821 -1949 -1090 -308 -3577 -2305 1341 56
544 56 -240 530 -2460 -3173 91 -56 -1775 -88 -1129 -3314 391 2889 633 437 718 -1584 836
561 836 2710 -351 -293 1059 -566 345 2494 436 -125 3441 2561 -1037 582 2216 935 2100 788
578 788 -2360 -649 890 -222 -84 -783 -2563 -656 1014 -1008 -220 2105 952 728 1746 -422
594 -422 297 3937 1517 -2355 -490 90 -137 2814 1305 -2551 -1558 695 800 468 -945 -3217 -1558
611 -1558 520 -2395 -2590 387 -1144 -1716 739 -1382 -2333 1314 1600 -1393 -1235 -1280 -914 1545 2232
628 2232 -396 19 1146 712 2494 3283 587 -112 291 -1531 -595 1105 -1015 -1969 -597 -2111 -2195
645 -2195 1051 411 -2246 -962 57 -1477 380 1176 -180 933 889 -376 1314 2179 317 1868
$$ packed form
527A967J339j437j59J49n18K67j091k988L33J317j128Q59P82l269J272L646j285
544E6k96P70k990p13L264j47j719J687j041k185L705K498k256j96K81k302K420
561H36J874l061N8J352j625R11K149k058n61L566q80l598J619J634j281J165j312
578G88l148J711J539j112J38o99j780J907J670k022P88K325j153k24J018k168
594d22P19L640k420l872J865N80k27K951j509l856R93K253J05l32j413k272J659
611a558K078k915j95K977j531n72K455k121r51L647K86k993J58m5L66K459O87
628B232k628M15J127m34J782P89k696o99M03j822R36J700k120r54J372j514q4
645b195L246o40k657J284J019j534J857P96j356J113m4j265J690Q65j862J551
$$ plain form
661 1868 2418 -847 -389 2487 1271 417 1399 -307 -1961 729 970 -1236 -255 -1031 -3325 -833 801
678 801 -934 -120 521 -1903 -1352 1324 838 -64 482 -880 -1176 1217 1375 278 1626 460 -700
695 -700 1284 1428 75 807 305 -1336 -856 -121 -662 156 30 -1528 -1367 -548 -1298 -558 1106 -1311
713 -1311 -2112 -547 -927 -335 2010 777 -880 -346 365 695 2439 1843 -826 -660 828 644 1844
730 1844 2155 -530 -795 898 91 356 963 -815 -1436 -373 -820 -1385 551 188 -1350 -369 -108 -1479
748 -1479 -90 1262 -247 -479 185 -598 501 2272 1397 908 581 -512 316 2285 1568 -276 -167
765 -167 -1346 -1360 719 642 -751 -1141 -1563 -1870 -15 446 -1090 -868 -900 -1826 -709 701 127 -337 392
784 392 -554 -648 1212 1315 680 1594 479 -382 1175 1503 713 1320 433 -955 -909 303 419 43 253
$$ packed form
661A868N50l265M58K876j216q54R82j706j654K690K41k206R81p76k294K492J634
678H01j735Q14O41k424N51K676m86r02N46j362k96K393J58j097J348j166j160
695g00J984J44j353P32n02j641M80P35n41Q18j26j558J61Q19p50P40J664k417
713a311q01J565l80N92K345j233j657N34P11L30J744n96k669J66J488j84J200
730A844L11k685k65J693q07K65O07j778o21J063m47n65J936l63j538R81K61j371
748a479J389J352j509k32O64p83J099J771q75m89l27j093Q28J969p17j844J09
765a67j179j4K079p7j393l90m22l07J855M61j536K22l2r26J117J410n74m64P29
784C92r46r4J860J03o35R14j115q61J557L28p90O07q87j388M6J212J16l76K10
$$ plain form
803 253 -1707 -1542 -163 79 452 434 -1332 -1970 -73 457 687 1179 -42 -756 298 1267 1569 1516 1125
822 1125 -112 202 972 471 565 437 -1054 -634 -36 -466 96 517 -450 -1292 -1226 -1451 -1001 39 -101 -1228
842 -1228 -1801 -1375 -1059 727 1485 -118 -544 -570 -498 1238 2217 690 -736 -689 -289 1093 1352 618 -699
861 -699 -777 -5 -35 1009 444 -540 -776 -804 -885 -418 -241 -262 -243 -1228 -1120 -282 597 1297 477 189 -421 -294
883 -294 1372 1800 1210 703 -149 83 1050 1340 1313 821 -392 -836 309 1132 973 146 -617 -1544 -1294 164
903 164 33 -362 -614 -1399 -1110 86 619 535 534 -84 -525 -78 728 1020 777 548 -142 -187 533 1070 1084 795
925 795 -248 -667 -542 -397 -14 -279 -836 -1650 -2106 -1043 131 363 -341 -1539 -1547 -392 393 530 208
944 208 -826 -956 -420 607 1324 982 221 -140 -50 928 1026 1006 941 62 -476 45 327 229 301 -271 -790 -1247
$$ packed form
803B53j960J65J379K42L73j8j766o38J897N30K30M92j221p14J054R69L02n3l91
822A125j237L14P70n01R4j28j491M20N98m30N62M21r67q42O6k25M50J040j40j127
842a228n73M26L16J786P58j603m26k6P2J736R79j527j426M7M00J382K59p34j317
861f99p8P72l0J044n65r84k36k8q1M67J77k1J9r85J08Q38Q79P00q20k88o10J27
883b94J666M28n90n07q52K32R67K90k7m92j213m44J145Q23j59q27p63r27K50J458
903A64j31l95k52p85K89J196N33q4jo18m41M47Q06K92k43k29o90m5P20N37J4k89
925G95j043m19J25J45L83k65n57q14m56J063J174K32p04j198qJ155P85J37l22
944B08j034j30N36J027P17l42p61l61R0R78R8k0o5q79n38N21K82r8P2n72n19m57
$$ plain form
966 -1247 -835 -222 361 530 -183 -1134 -502 478 1112 1710 429 -831 -539 745 1634 1694 790 41 46 713
986 713 1142 1397 817 31 -620 -163 -393 -56 797 -243 -1285 -1144 -762 -30 188 -40 -815 -1171 -809 -263
1006 -263 150 423 -585 -710 -334 -52 359 770 660 320 -712 -864 318 969 907 -308 -751 -790 -451
1025 -451 607 975 -354 -925 -977 -641 -192 -105 -493 -539 -1017 -1374 -584 666 309 101 227 -57 -218 765
1045 765 1489 1215 729 -54 -152 714 762 679 736 249 -818 -510 422 1186 406 -124 -1042 -1223 -213 237 533
1066 533 81 -1300 -1749 31 924 154 300 23 -564 -151 811 1132 342 -35 -236 101 590 699 563
1085 563 893 -52 -227 172 -480 17 433 45 -940 -1113 -1344 -694 416 52 -1261 -1556 -647 -270 661
1104 661 950 -228 -1035 -291 366 1225 1124 295 -105 90 144 997 1015 701 -245 -465 -390 -325 502 369 -717
$$ packed form
966a247M12O13N83J69p13r51O32R80O34N98j281j260K92J284Q89O0r04p49NO67
986G13M29K55n80p86o51M57k30L37Q53j040j042J41L82P32K18k28p75l56L62N46
1006b63M13K73j008j25L76K82M11M11j10l40j032j52J182O51o2j215m43l9L39
1025d51J058L68j329n71n2L36M49Q7l88m6m78l57P90J250l57k08J26k84j61R83
1045G65P24k74m86p83r8Q66M8q3N7m87j067L08R32P64p80n30r18j81J010M50K96
1066E33m52j381m49J780Q93p70J46k77n87M13R62L21p90l77k01L37M89J09j36
1085E63L30r45j75L99o52M97M16l88r85j73k31O50J110l64j313k95R09L77R31
1104F61K89j178q07P44O57Q59j01q29m00J95N4Q53J8l14r46k20P5O5Q27j33j086
$$ plain form
1125 -717 -497 -834 -597 159 15 -761 -329 -302 -987 -318 26 19 398 423 -306 -234 781 1199 1015 765 37
1146 37 -331 854 1469 870 517 -257 -850 -249 738 508 -209 -601 -1024 -1032 -49 300 -215 -587 -1033 -960 345
1167 345 274 156 246 -212 -365 226 167 517 706 681 -18 -76 529 326 842 700 -154 -555 -335 -143 309 375
1189 375 -217 -1116 -669 -274 48 273 -31 -1112 -698 -343 232 409 373 -485 -72 335 244 916 717 219
1209 219 208 773 428 412 711 1006 72 -93 -239 -447 433 364 -457 -678 -543 -779 4 188 -13 -546 -512
1230 -512 -625 192 408 264 15 -177 -303 -71 823 890 243 333 106 66 660 851 427 254 -359 -330 51
1251 51 50 -428 -333 -411 -679 -491 -337 -62 -380 31 -513 -796 -9 -229 -37 383 -78 -567 50 481 871 689
1273 689 568 -12 130 885 834 478 327 -104 -244 449 254 242 -86 -633 -524 -292 189 -90 -147 -366 -473
$$ packed form
1125g17K20l37K37P56j44p76M32K7o85O69L44pL79K5p29P2J015M18j84k50p28
1146C7l68J185O15n99l53p74n93O01R87k30p17l92m23qR83L49n15l72m46P3J305
1167C45p1j18R0m58j53N91n9L50J89k5o99n8O05k03N16j42q54m01K20J92M52O6
1189C75n92q99M47L95L22K25l04j081M14L55N75J77l6q58M13M07r1O72j99m98
1209B19j1N65l45j6K99K95r34j65j46k08Q80o9q21k21J35k36P83J84k01n33L4
1230e12j13Q17K16j44k49j92j26K32Q94O7o47R0k27m0N94J91m24j73o13K9L81
1251E1jm78R5p8k68J88J54K75l18M11n44k83P87k20J92M20m61m89O17M31L90j82
1273F89j21n80J42P55n1l56j51m31j40O93j95j2l28n47J09K32M81k79n7k19j07
$$ plain form
1294 -473 -391 195 49 185 106 233 174 81 -167 518 468 393 190 279 105 376 579 347 -458 -608 -279 -168
1316 -168 404 -58 -666 -609 -624 -487 -78 -303 -569 -602 -314 -396 -8 119 107 -150 -25 -50 216 938 409 -21
1338 -21 358 344 88 540 119 -145 -289 213 -189 -65 -144 -7 -362 -256 -456 -556 -98 -186 -88 -262 -513 -445
1360 -445 117 121 187 6 -160 -45 373 427 571 360 260 8 417 552 472 264 100 53 351 147 161 -69
1382 -69 -255 28 104 291 -425 -437 -374 -87 -490 -688 -165 -131 88 153 64 -102 -261 293 536 279 -3 -10 109
1405 109 193 354 195 -36 -314 -258 296 -147 -93 -206 -746 -583 -530 -351 -376 -649 -773 -391 -293 27 -109 -264
1427 -264 -225 54 222 72 33 250 457 384 541 188 164 758 571 284 45 -32 138 314 174 11 -644 -463
1449 -463 -115 -161 -99 -398 -108 -28 -437 -203 -47 -130 102 20 328 453 367 326 431 32 395 379 428 297 191
$$ packed form
1294d73Q2N86j46J36p9J27n9r3k48O85n0p5k03Q9j74K71K03k32q05j50L29J11
1316a68N72m62o08N7j5J37M09k25k66l3K88q2L88J27j2k57J25k5K66P22n29m30
1338b1L79j4k56M52m21k64j44N02m02J24p9J37l55J06k00j00M58q8R8j74k51O8
1360d45N62MO6j81j66J15M18N4J44k11j00k52M09J35q0k08j64m7K98k04J4k30
1382f9j86K83P6J87p16j2O3K87m03j98N23L4K19O5q9j66j59N54K43k57k82pJ19
1405A09Q4J61j59k31k78N6N54m43N4j13n40J63N3J79k5k73j24L82R8L20j36j55
1427b64L9K79J68j50l9K17K07p3J57l53k4N94j87k87k39p7J70J76j40j63o55J81
1449d63L48m6O2k99K90Q0m09K34J56q3K32q2L08J25q6m1J05l99L63j6M9j31j06
$$ plain form
1472 191 -93 235 234 -57 120 17 60 -132 -293 -67 -228 -313 -248 -359 -232 -45 -333 -74 -80 179 130 -80 -61
1495 -61 77 688 279 -229 -70 192 328 446 -29 -205 -68 125 265 307 -174 -506 -363 -131 -12 -118 -527
1516 -527 -748 -111 -288 -164 -393 -150 -29 25 -66 -430 -112 383 213 39 109 72 165 349 708 337 -66 105
1538 105 179 364 85 372 60 -149 -294 2 309 -36 -183 -374 -396 49 -78 17 -135 -385 -389 26 241 76
1560 76 -30 18 312 249 397 401 341 357 42 86 -69 -4 7 -95 195 -75 -418 -348 27 -93 -415 -417 -363 -486 -365
1585 -365 32 -91 16 -264 -197 87 385 524 204 -132 -21 170 408 514 390 302 -305 54 231 195 88
1606 88 -179 -62 -194 -286 -240 -67 8 -178 -294 -246 -53 -18 188 160 81 -298 60 219 704 510 90 -184 -184
1629 -184 474 654 410 93 -379 -60 112 335 122 -359 -276 -272 -267 -224 -150 -400 -220 -44 -317 -37 91 69 -86
$$ packed form
1472A91k84L28jk91J77j03M3j92j61K26j61q5O5j11J27J87k88K59oK59m9k10J9
1495f1J38O11m09n08J59K62J36J18m75j76J37J93J40M2m81l32J43K32J19j06m09
1516e27k21O37j77J24k29K43J21N4r1l64L18M95j70j74P0l7R3J84L59l71m03J71
1538A05P4J85k79K87l12k09j45K96L07l45j47j91k2M45j27R5j52k50mM15K15j65
1560G6j06M8K94o3J48Mo0J6l15M4j55O5J1j02K90k70l43P0L75j20l22kN4j23J21
1585c65L97j23J07k80O7K84K98J39l20l36J11J91K38J06j24q8o07L59J77l6j07
1606H8k67J17j32r2M6J73P5j86j16M8J93L5K06k8p9l79L58J59M85j94m20k74%
1629a84O58J80k44l17m72L19J72K23k13m81Q3MNM3P4k50J80J76k73K80J28k2j55
$$ plain form
1652 -86 -228 90 63 260 174 55 319 112 -92 238 406 301 603 173 -195 -97 501 429 177 -102 -465 -284
1674 -284 195 155 40 -193 -327 -708 -75 30 -224 96 -360 -269 -143 112 24 86 -93 -47 61 269 187 341
1696 341 332 168 -243 245 134 271 348 -38 -284 -103 -174 -29 -103 -29 -631 -499 -181 -301 103 168 -205 -644
1718 -644 -147 -28 483 460 107 3 -62 141 557 391 352 -320 9 -79 107 222 136 -151 -59 -177 -139 -226 -267
1741 -267 -82 -451 -452 -500 -494 -309 32 -278 36 -322 -154 235 551 273 154 -58 228 654 495 417 193 -80
1763 -80 -52 45 182 399 154 -51 -300 108 172 -61 172 -32 -279 -294 -187 -195 -31 194 -88 -69 104 325 -36
1786 -36 287 201 -192 -172 48 381 143 384 -20 -313 110 22 317 91 -249 -329 -91 -272 -117 3 -213 -621
1808 -621 -423 -25 132 52 -250 -346 -426 97 -39 428 171 -99 -171 18 129 91 490 392 294 12 146 -48
$$ packed form
1652h6j42L18k7J97q6j19K64k07k04L30J68j05L02m30l68R8N98p2k52k79l63J81
1674b84M79m0j15k33j34l81O33J05k54L20m56R1J26K55q8O2j79M6J08K08q2J54
1696C41rj64m11M88j11J37P7l86k46J81p1J45p4P4o02J32L18j20M04O5l73m39
1718f44M97J19N11k3l53j04o5K03M16j66l9o72L29q8J86J15q6k87R2j18L8q7m1
1741b67J85l69jm8OJ85L41l10L14l58J68L89L16k78j19k12K86M26j59p8k24k73
1763h0K8R7J37K17k45k05k49M08O4k33K33k04k47j5J07qJ64K25k82J9J73K21l61
1786c6L23q6l93K0K20L33k38K41m04k93M23q8K95k26l40q0K38j81J55J20k16m08
1808f21J98L98J57q0l02r6q0N23j36M67k57k70p2J89J11l8L99r8r8k82J34j94
$$ plain form
1830 -48 202 195 28 -11 -221 -260 -45 -46 -89 -280 -504 -279 -9 77 142 -368 -167 -487 -22 295 215 -265 -164 -141
1854 -141 280 564 418 169 164 28 137 157 287 234 -243 -12 -162 -159 -226 -235 -102 -205 -332 -359 -78 -137 77 -27
1878 -27 -309 -236 -199 136 285 62 42 -160 -19 400 365 274 24 -192 3 202 -45 84 -182 -71 -18 -85 -145
1901 -145 -115 -13 -171 -436 -564 -213 -138 142 -149 -161 -422 -68 30 320 173 260 157 14 185 -25 557 212
1923 212 146 20 26 129 382 427 -303 139 7 291 264 97 -388 -324 -334 20 121 166 -104 -114 -487 67 195
1946 195 120 172 2 -127 25 141 179 205 -53 179 132 -50 -61 191 174 44 151 -283 -52 126 45 -41 -164
1969 -164 -680 -316 129 -55 -113 -228 -403 -291 256 219 -169 -19 -29 227 195 249 313 71 103 -179 89 415
1991 415 331 22 289 -146 74 -158 2 -183 -134 -191 -397 -108 -33 35 188 -36 -141 -222 -99 -20 351 219
$$ packed form
1830d8K50pj67l9k10l9K15jm3j91k24K25K70Q6O5n10K01l20M65L17q0m80J01K3
1854a41M21K84j46k49nj36J09K0J30n3m77K31j50Lo7rJ33j03j27k7K81n9K14j04
1878b7k82P3L7L35J49k23k0k02J41M19l5r1k50k16J95J99k47J29k66J11N3o7o0
1901a45L0J02j58k65j28L51P5K80k91j2k61L54R8K90j47Q7j03j43J71k10N82l45
1923B12o6j26OJ03K53M5p30M42j32K84k7j67m85O4j0L54J01M5k70j0l73N54J28
1946A95p5N2j70j29J52J16L8K6k58K32m7j82j1K52j7j30J07m34K31J78q1q6j23
1969a64n16L64M45j84n8j15j75J12N47l7l88J50j0K56l2N4O4k42L2k82K68L26
1991D15q4l09K67m35K20k32J60j85M9n7k06K89P5O8J53k24j05q1J23P9L71j32
$$ plain form
2013 219 289 -139 61 334 185 645 66 -128 155 123 263 272 3 37 -60 -80 51 73 -94 -241 -144 -181 -222 1
2037 1 160 -241 -6 -94 90 -196 180 106 -10 -39 -350 52 301 298 239 -109 -206 140 149 398 77 -254 -47 -33
2061 -33 142 -15 -12 -204 -304 86 5 133 -205 -170 -332 -148 18 98 115 -71 15 201 133 68 119 -128 105 197
2085 197 104 131 204 148 151 233 -64 -185 -129 169 236 -180 -223 -199 -109 -40 112 4 -453 -256 117 -132 242 -138
2109 -138 121 -142 156 100 245 199 -53 186 57 215 91 -26 296 -38 -208 -123 -359 1 29 -111 -206 -246
2131 -246 -268 5 -222 -114 -63 -372 -241 12 158 -140 173 59 30 203 105 276 5 235 -138 22 127
2152 127 207 168 144 -257 46 1 152 -27 4 -324 -130 224 152 50 -45 53 -265 -116 -62 -21 106 42 83 78 -86
2177 -86 181 195 343 65 147 39 345 238 323 -73 -337 -399 129 179 282 -106 -240 -30 -131 28 389 -1
$$ packed form
2013B19P0m28K00K73j49M60n79j94K83l2J40Rk69L4r7k0J31K2j67j47R7l7m1K23
2037AJ59m01K35q8J84k86L76p4j16k9l11M02K49ln9l48r7L46RK49l21l31K07J4
2061c3J75j57Lj92j00L90q1J28l38L5j62J84J66Q0J7j86Q6J86o8o5N1k47K33R2
2085A97r3K7P3n6LQ2k97j21N6K98O7m16m3K4R0O9J52j08m57J97L73k49L74l80
2109a38K59k63K98n6J45m6k52K39j29J58j24j17L22l34j70Q5k36L60K8j40r5m0
2131b46k2K73k27J08N1l09J31K53J46k98L13j14k9J73r8J71k71K30l73J60J05
2152A27Q0l9k4m01L03m5J51j79L1l28J94L54p2j02r5R8l18J49N4M1J27o4M1nj64
2177h6K67J4J48k78Q2j08L06j07Q5l96k64o2N28N0J03l88j34K10j01J59L61l90
$$ plain form
2199 -1 -284 -165 226 50 -33 56 19 -29 47 269 381 262 94 185 -58 -89 35 -17 -122 264 284 -218 23 -175
2223 -175 156 28 105 -4 -528 -57 98 -29 -284 -225 -16 -164 111 13 -22 -155 25 109 125 -58 224 160
2245 160 135 18 100 287 79 -143 105 -64 -72 18 -8 -108 -41 -209 -238 -95 -320 -74 -81 -195 -227 -389 -224 163
2269 163 166 126 83 -115 18 101 75 226 -66 -30 181 112 72 199 -106 -174 76 79 -118 134 -260 -91 121 -133
2293 -133 -90 -145 -123 -116 -202 54 -457 -21 -88 -127 -38 -283 -164 352 227 48 -131 -81 16 305 424 267 10 -87
2317 -87 -16 -418 71 -25 -217 -360 -30 -218 13 -3 -97 -133 -12 -34 114 89 18 -83 207 180 -83 16 222 86
2341 86 265 266 45 220 -139 84 277 104 -266 113 -35 206 -120 -2 -195 -69 224 138 -38 -98 245 -322
2363 -322 170 -38 109 80 116 -113 321 -53 62 59 211 112 174 381 94 -32 209 207 -159 -30 93 34 -199
$$ packed form
2199ak83J19L91j76q3Q9l7m8P6K22J12j19j68R1k43l1J24n2j05L86K0n02K41j98
2223a75L31j28P7j09n24M71J55j27k55N9K09j48K75r8l5j33J80Q4J6j83K82o4
2245A60k5j17Q2J87k08k22K48j69qR0k6j00O7j68k9J43k25K46pj14l2j62J65L87
2269A63Lm0m3j98J33Q3k6J51k92L6K11o9m0J27l05o8K50Lj97K52l94J69K12k54
2293a33M3n5K2Pq6K56n11M36o7l9Q9k45J19N16j25j79j79N0R7K89J19j57k57r7
2317h7P1m02M89r6j92j43L30j88K31j6r4l6J21k2J48k5p1j01K90k7k63R9K06j36
2341H6J79Jk21J75l59K23J93j73l70L79j48K41l26J18j93J26K93q6j76o0L43n67
2363c22M92k08J47k9L6k29M34l74J15lJ52r9O2K07k87j26K41kl66J29J23n9k33
$$ plain form
2386 -199 -168 -18 161 -184 -197 139 147 -99 -315 -118 -254 -27 -36 -94 70 185 -22 260 -111 268 126 -2
2408 -2 433 108 -1 65 91 -306 61 116 -237 -242 -120 -31 201 -123 -271 -403 -145 -215 246 -36 53 75 -172 -330
2432 -330 -102 62 -274 229 4 -126 231 75 163 265 265 120 -121 -31 141 5 56 -60 -243 25 -95 332
2454 332 228 12 -198 -4 203 156 24 15 -52 -102 167 -28 96 16 136 -307 126 323 207 229 220 175 21
2477 21 -212 -63 3 -116 -299 161 0 -37 83 -25 -140 71 43 -122 -262 -128 75 114 -53 -8 -54 131
2499 131 100 15 -18 93 -11 270 15 14 148 -67 -118 -32 -155 0 -89 -53 -221 45 -1 -184 0 -106 -47 53
2523 53 -218 -74 -224 156 147 -102 -77 -27 86 206 -77 -183 231 4 180 206 265 -111 -120 62 74 -10 -73 83
2547 83 30 -84 28 2 -113 -201 32 -30 -140 62 -34 -223 348 100 -181 25 82 110 158 38 213 -94 364
$$ packed form
2386a99L1J50J79l45j3L36Qk46k16J97j36K27rn8J64J15k07K82l71L79j42j28
2408bM35l25j09O6K6l97L67N5l53nJ22Q9K32l24j48j32K58p0M61k82Q9K2k47j58
2432c30K28J64l36N03k25j30L57j56Q8J02%j45k41R0J72j36N1j16j83K68j20M27
2454C32j04k16k10J94K07m7j32ro7n0K69j95J24q0J20m43M33J97j16K2rm5j54
2477B1k33J49O6j19j83M60j61l7J20j08j15K11k8j65j40J34K03L9j67M5m6J85
2499A31l1q5l3J11j04K81k55jJ34k15n1Q6j23J55q9L6j68K66m6j83J84j06N9J00
2523E3k71J44j50L80rk49K5N0J13J20k83j06M14k27J76K6N9l76rJ82J2q4o3J56
2547H3n3j14J12k6j15q8K33o2j10K02r6j89N71k48k81K06N7K8M8j20J75l07M58
$$ plain form
2570 364 322 36 250 65 -86 -86 143 276 294 -154 -289 -139 -149 -68 -164 32 -96 -176 22 138 -122 -165 81
2593 81 -177 1 171 77 171 -38 47 50 291 60 188 83 131 -122 199 -119 -13 -20 -37 -116 1 26 -290 -157
2617 -157 -145 -19 -129 12 193 107 131 30 -33 -44 -45 244 -39 -27 101 -34 -128 231 28 -202 -37 226 64
2640 64 183 -239 34 -99 -37 -203 -12 -169 -73 3 -270 70 103 68 -72 -189 -148 -125 -118 8 -67 178 41 -157
2664 -157 96 201 -79 252 -213 26 -124 220 160 37 66 -321 -90 -73 284 6 155 -76 -189 -53 112
2685 112 -178 -54 -134 -31 294 -18 174 -8 -149 7 30 -36 -77 257 134 -47 -8 -61 -27 183 103 -180 114
2708 114 53 -253 20 70 -168 -262 -191 54 -70 46 -49 15 -360 -149 195 12 13 -484 17 69 70 32 -176 91
2732 91 -35 153 73 286 110 -109 -129 155 -173 -120 118 48 -80 -81 -73 -62 -73 -58 79 -19 -12 -159 -70 -58 22 198
$$ packed form
2570C64m2k86K14j85j51%K29J33J8m48j35J50j0Q1r6J96j28q0J98J16k60m3K46
2593H1k58J78J70r4R4k09Q5LK41k31J28j05M8k53L21l18J06pj7p9J17K5l16J33
2617a57J2J26j10J41J81q6K4j01o3j1jK89k83J2J28j35r4L59k03k30J65K63j62
2640F4J19m22K73j33O2j66J91j57R6P6k73L40L3l5j40j17M1K3PJ26p5K45j37j98
2664a57K53J05k80L31m65K39j50L44o0j23K9l87K31J7L57k78J49k31j13J36J65
2685A12k90J24q0J03L25l12J92j82j41J56K3o6m1L34j23j81L9n3L4K10q0k83K94
2708A14o1l06K73N0k38r4P1K45j24J16r5O4l75K11L44j83Jm97N01N2Jl8k08K67
2732I1j26J88q0K13j76k19k0K84l28N3K38p0j28jQJ1j1J5J37r8Pj47Q9J2Q0J76
$$ plain form
2758 198 -2 -206 80 0 70 84 -340 138 98 46 259 34 38 -18 -188 -168 23 -24 -153 -2 -176 -126 -245 -6
2782 -6 -70 205 96 54 -264 -39 73 52 63 -50 -170 166 -19 503 42 127 180 -161 73 36 -83 -31 1 -143
2806 -143 -114 -43 -8 -118 23 -451 -373 -203 -139 -68 9 -152 34 -109 -98 28 231 76 15 -53 15 -23 -15 -54 173
2831 173 105 64 178 257 -47 -57 98 -23 -57 -116 75 -166 -333 -297 -296 4 -18 139 -361 149 215 119 -18 -148
2855 -148 165 337 113 8 189 16 79 231 202 86 202 19 112 41 -36 22 110 -238 -37 -50 -96 -118 -52 131
2879 131 58 -24 37 -53 -107 -89 -126 -124 -61 -136 -11 188 187 383 29 86 -34 201 208 319 9 96 59 94 41 178 72
2906 72 -100 34 -216 17 -258 -53 105 -48 -148 -179 232 -146 148 -189 362 116 43 75 321 -22 168
2927 168 18 222 81 210 210 46 -55 -178 219 130 -36 173 -172 -234 -131 -270 -318 -197 -330 -11 76 -42
$$ packed form
2758A98k00k04K86q0P0J4m24M78m0n2K13k25Mn6j70K0J91m7j29J51j74N0j19K39
2782fo4K75j09m2l18K25J12k1J1j13j20L36j85N22m61Q5N3l41K34l7j19N2L2j44
2806a43K9P1L5j10J41m74P8J70O4P1P7j61J86j43J1J26K03j55o1o8O8l8Ql9K27
2831A73o8m1J14P9l04j0J55j21l4n9J91k41j67L6JL00k2J57n00N10O6r6j37j30
2855a48L13J72k24j05J81j73O3J52k9j16J16j83R3p1p7N8Q8l48K01j3m6k2O6J83
2879A31p3q2O1r0n4J8l7KO3p5J25J99jJ96l54N7j20K35PJ11l10Q7l7L5n3J37j06
2906G2j72J34k50K33k75K05J58j53j00l1M11l78K94l37N51k46p3L2K46l43J90
2927A68j50K04j41J29%j64j01j23L97q9j66K09l45o2J03j39m8J21j33L19Q7j18
$$ plain form
2949 -42 43 -58 120 16 89 -158 -53 -30 117 78 -191 282 251 160 280 -114 -14 -31 23 -95 36 -161 -175
2972 -175 -30 46 -304 68 -112 -172 -68 -149 -52 146 53 165 110 44 -14 411 -148 178 146 156 171 8 94 21
2996 21 52 163 116 84 50 -54 -182 -171 -299 -81 24 105 -202 83 85 -107 -93 151 33 -18 12 152 46 -33
3020 -33 19 -67 11 68 -82 -83 32 -227 -211 54 158 163 45 -31 -121 -108 27 -402 -28 -35 -205 -135 38 -169 -57
3045 -57 19 100 119 90 -300 -98 -82 121 -9 28 65 -86 107 111 195 -34 116 45 29 -13 -25 33 -149 -46 -115 -4
3071 -4 -70 -49 -46 -118 -210 173 -92 0 -39 -96 -14 -190 -10 46 365 -16 -69 -17 132 138 250 200 126 -61 -77 313 -48
3098 -48 99 -16 28 -166 -56 -120 -19 -16 -315 33 -68 102 -16 105 -201 -137 36 -130 211 100 -34 57
3120 57 65 -6 -84 -71 119 48 -57 -166 -168 -163 20 54 -142 -17 25 -11 -228 -79 98 -72 166 -79 -48 -22 -2 235
$$ packed form
2949d2Q5j01J78j04P3k47J05K3J47l9k69M73l1r1J20l94J00j7N4j18J31j97j4
2972a75J45P6l50L72j80o0J04q1R7J98r3J12n5o6n8M25n59L26l2J0J5j63Q6p3
2996B1L1J11m7l2l4j04j28J1j28K18J05Q1l07K85Kj92J4K44j18n1L0J40j06p9
3020c3N2q6P8N7j50jJ15k59J6K65J04Nj18p6r0J3J35m29L74pj70P0J73k07J12
3045e7P6Q1J9k9l90K02J6K03j30L7L7j51J93MQ4k29J50p1j6m2j2N8j82J03o9J11
3071do6K1Lp2r2L83k65R2l9n7Q2j76J80N6L19l81n3N2J49OJ12n0p4j87j6L90l61
3098d8J47j15M4j94J10o4J01Lk99L48j01J70j18J21l06O4J73j66L41j11j34R1
3120E7Qp1p8J3J90p1j05j09kNJ83L4j96J25M2l6k17J49J77j70K38k45L1K6K0K37
$$ plain form
3146 235 -90 188 -17 74 -8 -210 -95 116 -18 126 173 -48 23 -125 -152 -112 61 -77 -2 -224 6 -33 254
3169 254 93 -42 -155 -119 -22 7 -240 144 -36 -265 89 89 -187 72 148 43 -204 -50 -21 -263 -123 7
3191 7 106 47 -167 -22 135 -34 -175 43 -237 30 141 55 -51 -204 -258 -52 110 -53 26 7 -120 -13 140
3214 140 150 115 -63 -29 168 -18 -47 -200 -135 30 -62 -206 197 0 37 -314 -216 203 -297 144 -18 -76 191
3237 191 -34 214 96 174 -65 -75 -51 257 157 -124 216 -137 28 174 10 191 9 -87 193 82 76 45
3259 45 53 -147 36 28 -257 19 34 -74 -44 -244 -104 120 8 37 109 37 -31 -203 -40 -95 -27 137 -108 179
3283 179 118 -102 -26 113 1 311 -39 48 10 -61 -193 29 -327 -215 -6 -93 -174 91 -360 -14 -40 -86 27
3306 27 105 130 -138 267 74 91 48 41 131 38 122 -62 24 123 -192 91 245 0 87 -260 -104 -270 -114 -241
$$ packed form
3146B35l25K78k05R1q2k02J15K11j34J44M7k21P1j48k7M0J73j38P5k22K30l9K87
3169B54j61j35j13L6R7K9k47L84j80k29L54%k76K59P6j05k47J54K9k42J40J30
3191GR9n9k14J45J57j69j41K18k80K67J11q6j06j53n4K06J62j63P9j9j27J07J53
3214A40J0l5j78L4J97j86k9j53O5J65r2j44M03j97L7l51R8M19n00M41j62n8K67
3237A91k25K48j18P8k39j0K4L08j00k81L40l53J65J46j64J81j82r6K80j11ol1
3259D5Qk00J83qk85K76J5j08L0k00J40K24j12K9P2p2o8j72J63n5O8J64k45K87
3283A79o1k20P6J39j12L10l50Q7l8p1j32K22l56J12K09q7q1K65m51L46k6m6J13
3306B7P8K5k68M05j93J7m3pR0r3Q4j84Q6R9l15K83J54k45Q7l47J56j66J56j27
$$ plain form
3330 -241 -128 -169 67 -79 -120 -67 40 136 -27 -161 -28 -11 102 288 286 -86 -185 210 94 255 -24 -164 -67
3353 -67 -134 -52 42 26 -121 -202 10 -279 -9 -300 -20 112 37 45 18 128 -82 -6 -34 -128 149 225 -9 18 -90
3378 -90 246 276 20 53 83 -94 -20 170 98 -183 -148 79 23 -40 -194 90 -137 61 -196 -381 16 -214 102
3401 102 -288 298 -66 21 144 -62 27 8 -31 142 -41 85 3 -14 -11 123 86 22 159 170 -190 28 -101 -74
3425 -74 -89 135 -99 -76 239 45 -233 -110 104 -60 32 201 143 75 117 115 332 119 10 186 238 -168 -31
3448 -31 -126 416 194 281 35 -222 -173 -99 -91 -107 -158 -46 -68 -202 -65 27 102 -213 -154 42 209 81 236 50
3472 50 8 166 -77 207 -63 28 -186 44 104 -99 189 122 162 118 -211 -170 -203 -52 -289 -207 -65 -251 -81
3495 -81 -139 -92 17 -25 -120 3 -165 173 -97 -99 22 -104 -151 -64 -14 202 -148 237 153 -95 392 276 223 308
$$ packed form
3330b41J13m1K36j46m1N3J07R6j63j34J33J7J13J86kl72r9L95j16J61k79j40R7
3353f7o7Q2R4j6j47q1K12k89K70k91K80J32p5Qk7J10k10P6k8r4K77P6k34K7j08
3378i0L36L0k56L3L0j77P4J90p2k81L5K27n6o3j54K84k27J98k57j85L97k30L16
3401A02l90N86l64Q7J23k06Q9j9l9J73j83J26q2j7LJ34l7o4J37J1l60K18j29K7
3425g4j5K24k34K3L15j94k78J23K14j64R2J69n8o8M2kK17k13j09J76N2m06J37
3448c1r5N42k22Q7k46k57M9P4Qj6n1J12k2j34J37R2P5l15N9J96J67j28J55j86
3472E0m2J58k43K84k70R1k14K30O0k03K88o7M0m4l29M1l3J51k37Q2J42j86J70
3495h1n8M7J09m2r5J23j68L38k70kJ21j26m7Q7N0K16l50L85q4k48M87j16n3Q5
$$ plain form
3519 308 -301 99 -77 -95 -22 169 -267 -352 -56 27 9 154 -113 131 22 -45 7 -15 -195 -41 -28 -38 122
3542 122 26 -106 123 209 -235 -40 -245 -197 -40 -112 -116 117 -143 -51 -307 -80 -192 -407 26 141 -142 -10
3564 -10 -86 231 -84 102 -16 -46 -30 -88 219 102 -9 -75 158 -92 -41 -73 309 -76 43 86 -36 111 -30
3587 -30 -32 -96 38 -85 -18 53 3 -208 -148 -67 -75 131 165 12 168 -141 86 77 70 210 -43 -197 13 -43 113 105
3613 105 121 124 -339 0 -216 117 -204 121 -25 154 -42 -130 -134 -7 -116 -29 134 -11 124 109 48 86 152 52
3637 52 158 48 149 254 9 -27 121 32 -110 -44 170 -87 251 -95 73 210 -1 -46 -129 152 -42 -196
3659 -196 -4 37 106 -76 217 100 -138 58 113 169 184 5 -57 -81 45 223 223 105 49 -111 70 -61 96
3682 96 13 66 -283 -180 -240 -183 -273 12 -53 207 94 70 146 -119 -178 197 108 -28 -165 110 60 -79 -48 73
$$ packed form
3519C08o09M00j76j8P3J91m36q5K96Q3j8J45k67K44j09o7N2k2j80J54J3j0J60
3542A22r6j32K29Q6m44J95k05M8J57p2mK33k60R2k56K27j12k15M33J15k83J32
3564a0p6L17l15J86j18l0J6n8L07j17j11o6K33k50N1l2L82l85J19M3j22J47j41
3587c0ko4J34j23O7P1n0k11O0Q1qK06L4j53J56l09K27rpJ40k53j54K10n6J56q
3613A05J6Lm63L39k16L33l21L25j46J79j96q8mJ27j09Q7J63j45J35j5o1L8O6j00
3637E2J06j10J01J05k45l6J48q9j42O6K14k57L38l46J68J37k11m5q3K81j94j54
3659a96J92M1O9j82K93j17k38J96N5N6J5j79o2k4J26J78%j18n6j60J81j31J57
3682I6q3N3l49J03o0N7r0K85o5K60j13k4P6k65n9L75q9j36j37K75n0j39L1J21
$$ plain form
3706 73 196 -10 -68 77 193 -48 18 171 -8 -187 -133 -244 -57 193 -118 145 -142 -192 -150 -81 50 106 16
3729 16 55 4 206 -79 129 212 38 -43 -361 23 243 -17 75 -148 -150 16 5 -51 -78 -110 -69 -98 -264 117 -142
3754 -142 -182 156 -115 169 -23 143 21 -183 -84 312 160 163 -65 217 121 -51 -64 134 -36 -30 40 -107 -131
3777 -131 68 -70 -77 -104 -205 62 38 -15 -142 57 -144 54 -195 -10 -337 129 31 81 -35 242 180 56 -61
3800 -61 -105 -77 -25 -10 -116 73 137 -34 148 -112 -109 109 -47 -229 194 -242 240 -5 -110 -47 25 -243 -4
3823 -4 94 -32 -144 91 113 74 194 -98 128 -370 137 69 -230 137 105 -10 -6 124 164 93 100 -67 -162 -191 -90
3848 -90 2 -247 17 82 -87 -57 -28 -115 200 209 56 -89 -96 75 244 -175 301 -95 185 -1 -147 110 -30
3871 -30 23 -256 -143 -229 -29 -28 -192 -71 34 -140 -53 -238 -31 -73 -209 168 46 -79 123 -225 63 -52
$$ packed form
3706G3J23k06n8J45J16k41O6J53j79j79N4j11J87K50l11K63k87n0M2O9J31N6r0
3729A6L9n1K02k85K08Q3j74q1l18L84K20k60R2k23kJ66j1n6k7l2M1k9j66L81k59
3754a42m0L38k71K84j92J66j22k04R9L96j52Lk28K82r6j72j3J98j70OP0j47k4
3777a31J99j38pk7j01K67k4n3j27J99k01J98k49J85l27M66r8N0j16K77o2j24j17
3800f1m4K8N2J5j06J89O4j71J82k60LK18j56j82M23m36M82k45j05O3P2k68K39
3823dR8j26j12K35K2l9J20k92K26m98N07o8k99L67l2j15MJ30M0p1Pj67r5k9J01
3848i0R2k49K64O5j69L0K9q7L15Rj53j45pJ71J69m19M76l96K80j86j46K57j40
3871c0N3k79J13q6K00Jj64J21J05j74Q7j85K07m2j36L77j22j25K02l48K88j15
$$ plain form
3893 -52 -117 9 43 -152 100 29 129 86 162 -90 32 -106 56 -114 186 1 235 -11 -41 -34 27 79 -46 -10
3917 -10 -158 -258 -96 164 -9 -112 -49 44 11 178 167 260 86 6 -9 102 80 -51 -49 32 158 -102 -128 59
3941 59 84 33 -238 -126 -129 -9 -119 -5 130 -79 -69 -59 236 31 -89 -21 -19 27 -232 102 -74 -88 28 1
3965 1 -109 148 54 -139 -193 35 -115 -174 -20 -80 -206 -88 -122 178 158 -39 38 -70 -41 -55 -9 -50 228 130 315
3990 315 -105 144 273 98 -53 12 -6 12 193 -199 -44 -67 163 -163 -268 -237 -53 -87 93 -45 -204 -105
4012 -105 -133 87 108 -245 190 124 -119 -10 -236 -74 17 216 35 38 -123 124 -164 157 173 71 22 -31 -150
4035 -150 165 -12 -49 -63 -119 -337 -154 229 80 6 -95 -45 -177 95 -91 -98 18 -266 17 164 -139 78
4057 78 -26 137 -46 220 267 -41 -171 262 116 -53 -182 22 84 79 -15 203 80 -10 -40 56 -111 159 -150
$$ packed form
3893e2o5J26L4j95K52p1J00m3P6k52J22j38J62j70L00j85K34k46l0PO1N2j25L6
3917a0j48j00J62K60j73j03O3R3l3J67j1R3j74q0j5J11k2j31KQ1J26k60k6J87
3941E9K5n1k71J12lJ20j10J14J35k09J0J0K95k05j20O8KM6k59L34j76j4J16k7
3965Aj10K57r4j93n4K28j50n9J54o0j26J18l4L00k0j97P7j08K9j4M6m1K78r8J85
3990C15m20K49J29j75j51O5j8J8J81l92J55k3K30l26j05L1J84l4J80j38j59R9
4012a05k8K20K1l53M35o6k43J09k26J62R1J99j81Lj61K47k88L21J6j02m9n3j19
4035a50L15j77l7j4n6k18J83L83j49p4j01N0j32K72j86pJ16k84K83J47l03K17
4057G8j04J63j83K66M7l08j30M33j46j69j29K04O2nr4K18j23r0l0R6j67K70l09
$$ plain form
4080 -150 127 -281 204 157 30 223 -206 94 163 97 38 -129 -101 137 229 72 -89 -79 -3 -248 -306 59 -109
4103 -109 -200 27 91 -51 -258 -131 172 85 -107 -98 -48 -90 -68 -16 -23 -99 -153 -154 72 -74 -169 109 8 236 94
4128 94 60 160 -82 -227 1 -114 -188 -190 25 -138 -149 -109 -190 -62 -41 -359 -101 143 -65 -73 -164 130 81 37 -69
4153 -69 115 250 273 206 114 136 134 90 169 142 201 1 -252 6 -69 -215 -333 64 88 92 -3 -68 -243 39 -131 -109
4179 -109 48 -402 -96 -214 -16 427 -70 -58 62 -153 255 89 -38 4 -52 97 97 74 42 80 -73 -122 32
4202 32 24 -230 78 55 64 -109 26 97 86 -4 -175 -126 77 9 182 -55 -70 102 15 -183 168 3 -118 58
4226 58 228 281 36 254 -172 -53 -53 -36 53 17 -248 53 -37 37 -112 160 -125 -135 112 -201 98 264 -4
4249 -4 50 -260 -114 1 37 -211 143 -34 -185 22 -30 -101 93 157 -118 -15 -358 -328 -51 179 -134 17 -52
$$ packed form
4080a50K77m08M85m7j27J93m29L00O9o6n9j67K8K38R2j57j61J0P6k45n8L65j68
4103a09r1K27O4j42k07J27L03q7j92RN0m2K2N2pp6n4jK26j46r5K78j01K28j42
4128I4l4J00k42j45K28j15p4kK15j63j1M0q1J28K1l18K58K44k08qr1K94m9m4j06
4153f9J84J35K3o7r2K2km4P9k7N9k00k53K58p5j46j18L97K4Mr5o5j75K82j70K2
4179a09J57m50L06j18J98M43m97J2J20k15M08j66j27M2n6J49%k3l2L8j53m9J54
4202C2qk54L08k3Rj73J35P1j1r0j71M9K03o8J73k37j5J72q7j98L51j65j21J76
4226E8J70N3k45K18m26J19%J7Q9l6k65L01r0P4j49K72k85j0K47l13K99J66k68
4249dN4l10J46J15L6k48L54j77j51K07n2p1J94O4k75J03l43L0K77K30l13J51o9
$$ plain form
4272 -52 -66 -7 101 -116 73 -158 -3 -35 -121 262 78 132 80 61 142 72 31 129 -92 121 204 -4 5 34 -46 -8
4298 -8 -234 -13 71 -144 180 2 -184 171 -77 -204 -101 48 87 204 221 355 240 39 50 0 -50 -102 137
4321 137 -191 -93 -17 214 -321 -25 197 45 -91 48 -129 -26 150 95 -329 100 -79 40 142 -91 34
4342 34 -98 36 37 -182 69 93 -115 -60 52 217 243 -103 20 -94 -39 123 116 -88 61 -199 -108 -199 -72 293
4366 293 25 20 12 8 78 50 -7 124 -37 -299 -157 65 76 -5 130 9 68 37 -45 10 95 110 -247 107 -193 244
4392 244 38 -197 205 89 39 -71 120 -88 14 19 -81 138 154 -23 -89 247 137 112 -265 28 -185 -42
4414 -42 59 33 -81 -181 -36 -49 -94 -120 -250 135 100 -39 -82 -230 84 110 -103 -36 -22 -236 -246 -283 113 -218
4438 -218 -23 -226 290 179 -77 289 126 -78 53 108 -46 129 116 32 140 250 -87 3 -2 8 -75 -85 19
$$ packed form
4272e2j4N9J08k17J89k31J55l2q6L83j84N4n2j9Q1p0m1R8k21K13Q3k08RK9q0L8
4298hk26K21Q4k15L24j78j86L55k48j27J03J49L9J17J7J34j15k01J1n0n0n2K39
4321A37l28R8P6K31n35K96K22j52j36J39j77J03J76n5m24M29j79J19J02k33J25
4342C4j32J34Jk19K51K4k08N5J12J65K6l46J23j14N5J62pk04J49k60R1r1J27L65
4366B93k68nqmP0k8n7J31j61k62J42K22J1q1J35j21N9l1q2N5Q5J5l57L54l00M37
4392B44k06k35M02j16n0j10J91k08J02Nj00K19J6j77o6L36j10k5l77K93k13J43
4414d2J01k6j14j00J45j3m5k6j30L85l5j39m3j48L14K6k13O7J4k14j0l7L96l31
4438b18J95k03N16j11k56L66j63k04J31N5j54J75j3q4J08J10l37R0nJ0q3j0J04
$$ plain form
4461 19 -121 -161 -36 -148 117 -131 19 105 -94 49 195 105 -23 131 22 -138 -127 -177 -50 79 20 140
4483 140 -44 175 -110 58 384 -242 -81 82 106 246 34 152 -16 -208 -50 95 116 140 113 -185 -20
4504 -20 -14 -52 125 -12 186 -132 26 45 28 -191 -21 34 -375 -18 70 -46 56 127 -186 -264 176 -85 -29 253
4528 253 -46 47 198 127 300 56 22 -162 -13 -45 -277 -67 97 307 281 -192 38 72 0 -220 -89 -159 -266
4551 -266 -37 -32 -89 -98 -129 151 12 -142 -284 -204 100 -374 -84 -80 230 -50 -265 -292 -102 -19 80 -39 222 -102
4575 -102 -107 12 63 134 -156 -93 -83 -217 -79 303 -121 40 -60 -137 74 122 -309 311 61 85 -109 -41 -30 192
4599 192 -45 33 -2 34 -183 -102 67 -46 95 -118 15 11 -66 -162 182 224 128 142 31 263 -252 -217 11 10 -170
4624 -170 100 -105 -125 -93 -41 -103 231 -8 -32 -59 130 -16 26 -44 -195 46 30 103 -62 45 -78 -83 -126 42
$$ packed form
4461A9j40m0J25j12K65k48J50Q6j99J43J46r0j28J54j09j60J1n0J27J29n9J20
4483A40j84K19k85J68L26o26J61J63K4J40k12J18j68j92J58J45K1K4k7k98J65
4504b0Ol8J77j37J98l18J58J9j7k19J70N5m09L57Q8j16J02P1l13p8M40k61N6K82
4528B53k99R3J51p1J73k44l4j84J49l2k32K10J64K10k6m73K30L4p2k20J31p0j07
4551b66K29Nn7rl1K80j39j54j42Q0L04m74K90ML10k80k15k7J90Q3R9j19K61l24
4575a02nJ19N1P1k90O3J0j34J38L82m24J61j00p7K11M8m31O20k50K4j94O8J1K22
4599A92k37P8l5L6k17Q1J69j13J41k13J33mp7r6L44M2r6J4j11K32n15L5K28jj80
4624a70K70k05k0L2N2o2L34k39k4k7J89j46M2p0j51K41j6P3j65J07j23nm3J68
$$ plain form
4648 42 36 258 -248 60 -31 -142 -7 23 176 6 181 162 -4 16 -108 -150 -29 66 252 29 -50 -2 -191 209
4672 209 -26 33 -15 -150 160 133 9 23 -6 -178 58 205 19 80 -85 35 -94 -222 -229 -43 125 40 196
4695 196 149 40 59 102 123 253 -104 212 -101 334 103 -33 68 71 246 176 83 93 118 -276 -72 -208 -277 -180
4719 -180 -136 35 -174 156 10 -368 -84 -7 59 349 -296 108 49 46 41 152 -72 33 105 99 213 -186 -110 -302
4743 -302 354 36 62 -46 95 -274 -70 -28 171 -113 -70 -183 -130 83 37 283 74 -16 186 79 39 -8 4
4766 4 -95 -34 60 -211 -62 -82 49 -72 218 -41 198 -18 -60 155 -168 86 10 55 -228 -145 -530 -164 -88 228
4790 228 -254 203 -88 -12 134 52 -66 130 73 30 141 -135 -77 -45 51 74 36 50 21 -28 -106 19 209 -109
4814 -109 -174 -69 12 -157 -17 -23 156 22 -51 -19 175 -117 -327 217 59 130 111 8 129 6 157 211 127
$$ packed form
4648D2oK22n06L08r1j11J35L0J53j70J75j9j66K0j24m2J21R5J86k23p9M8j89M00
4672B09k35N9m8j35L10k7j24J4k9j72K36J47j86O1j65J20j29j28pJ86J68q5J56
4695A96m7j09J9M3K1J30l57L16l13M35k31j36J01LJ75p0r3J0K5l94K04j36o9R7
4719a80M4J71k09L30j46l78K84P7O6K90o45M04n9lnJ11k24J05P2oJ14l99P6j92
4743c02O56l18K6j08J41l69K04M2J99k84M3j13N3K13m6K46k09r0K02j07m0m7J2
4766Dr9O1R4k71J49k0J31j21K90k59K39k16m2K15l23K54p6M5k83Q3l85L66P6L16
4790B28m82M57k91P6J46q2j18J96n7m3J11k76N8L2R6K3l8J4k9m9p8J25J90l18
4814a09o5J05Q1j69J40oJ79j34p3L2J94k92k10N44j58P1j9j03J21j23J51N4q4
$$ plain form
4837 127 -184 284 278 -130 105 -150 166 -64 12 144 -259 -274 -89 108 -81 -18 -243 79 92 -72 61 95
4859 95 -264 -149 -31 99 -21 24 36 39 306 233 191 1 95 -1 32 -176 29 -6 -273 265 -82 153 -87 90
4883 90 31 -93 48 -183 -180 127 26 90 88 -29 -328 -197 -190 -50 -40 120 -130 46 195 -181 228 -117 174
4906 174 -196 -155 13 100 123 142 83 62 -3 -84 -40 204 222 -146 -45 55 112 -7 -28 134 5 114 309 449
4930 449 154 18 104 31 214 -100 22 -117 58 121 -15 -302 -30 -78 -97 -153 197 -106 -77 -20 182 147 30
4953 30 -1 -80 36 53 149 14 27 -21 194 101 -5 -90 2 -86 -88 -44 -196 -5 -123 240 15 -10 166 59 -46
4978 -46 45 1 -103 29 -57 75 65 -140 -102 251 18 -9 -60 100 -209 -227 -77 -26 -94 38 -45 -2 63 181 -92
5003 -92 145 -231 2 108 -38 -4 -177 110 -21 -64 -76 -103 -20 -80 14 22 210 -51 20 -186 87 -154 -63 -137
$$ packed form
4837A27l11M68om08K35k55L16k30P6J32m03j5J85J97j89O3k25L22J3j64J33L4
4859I5l59J15J18J30j20M5J2LK67p3m2j90R4r6L3k08K05l5k67N38l47K35k40J77
4883I0n9j24J41k31LL07j01O4kj17k99J31PJ40J0J60k50J76J49l76M09l45K91
4906A74l70M1J68Q7K3J9n9k1o5q1M4K44J8l68J01J00N7j19k1J62j29J09J95J40
4930D49k95j36Q6p3J83l14J22j39J75O3j36k87K72m8j9n6L50l03K9N7K02l5j17
4953C0l1p9J16J7R6j35J3m8K15r3j06q5R2q8kM4j52J91j18L63k25k5J76j07j05
4978d6R1m4j04J32q6J32j0k05L8L53k33k7n1J60l09j8J50N1o8J32q3M3O5J18k73
5003i2K37l76K33J06j46L4j73K87j31m3j2k7Q3o0R4QJ88k61P1k06K73k41R1p4
$$ plain form
5027 -137 -93 110 35 199 -162 47 -100 137 6 -76 29 67 -23 65 77 -27 154 80 27 132 30 85 -110
5050 -110 61 -185 103 14 -15 -137 39 67 -40 109 167 255 -81 -179 -149 -46 -91 114 -111 -81 -102 -345 -140
5073 -140 207 145 -16 22 124 23 -40 69 -88 -28 -212 82 70 29 136 110 -104 -15 181 -10 98 -61 96
5096 96 124 -96 18 95 302 -108 -145 108 -230 63 289 5 -81 -2 -67 10 -172 -51 -139 185 69 -37 6
5119 6 33 96 -34 218 -54 160 -246 197 -70 52 -130 -150 157 123 21 -22 -121 39 -4 -87 86 -52 -144 -209
5143 -209 39 -117 -51 53 -46 43 -80 71 49 73 -157 -173 -329 -34 113 37 275 14 110 218 -75 92 34
5166 34 -13 -13 -177 -111 -83 -46 166 -68 64 -68 -11 -168 -422 96 -140 39 306 -283 58 76 -51 137 319
5189 319 65 109 287 -146 325 -45 132 239 164 166 -37 -33 107 64 -8 42 -170 206 -88 -139 -61 -123 218 42
$$ packed form
5027a37M4K03p5J64l61K09j47K37j31q2J05L8r0Q8J2j04J81p4n3J05j02N5j95
5050a10J71k46K88q9k9j22J76K8j07J49N8Q8l36r8L0J03m5K05k25L0k1k43K05
5073a40L47o2j61L8J02j01o3J09j57O0j84K94j2m1J07k6k14Q9J96j91J08j59J57
5096I6K8k20J14P7K07m10l7K53l38K93K26k84q6P9o5P7j82J21q8L24j16j06M3
5119FK7O3j30K52k72K14m06M43k67J22j82k0L07l4j02m3r9J60m3q3J73j38r2o5
5143b09K48j56O6J04r9Q9j23J51k2K4k30j6j56K95J47p6K38k61R6J08k93J67n8
5166C4m7%j64O6K8L7K12k34J32j32N7j57k54N18k36J79K67n89L41J8j27J88J82
5189C19k54M4J78m33M71l70J77J07p5Kk03MJ40m3p2N0k12L76k94n1P8o2L41j76
$$ plain form
5213 42 34 62 72 -241 9 11 -166 14 83 31 -197 90 -255 120 8 84 -104 -251 118 -86 175 -295 -173
5236 -173 -46 -58 22 -130 0 356 -118 89 5 64 -50 -25 -213 342 -98 211 -8 12 -153 183 132 -42
5258 -42 1 52 189 201 99 -141 118 54 -107 -75 -149 -38 5 142 61 -98 83 -418 124 -35 -221 33 26 164
5282 164 12 234 -251 -107 -115 -51 60 201 -113 -82 -4 36 124 -152 12 -8 -92 4 30 -243 120 -36 -56 -391
5306 -391 -26 -133 47 224 240 -282 -28 37 -251 -83 -53 66 225 83 33 130 67 66 102 -120 -38 -184 98
5329 98 -93 -150 -53 -214 -250 62 -154 -46 -101 -238 -20 -163 -288 -109 -99 58 54 65 -43 -82 118 64 157 101
5353 101 31 7 117 -62 -230 -262 7 297 -102 -118 -100 139 135 49 -108 61 106 112 14 35 -89 -150 117 170 -113
5378 -113 -85 54 -3 -90 -134 42 198 89 -97 216 -123 -184 95 -257 -98 -4 -91 -2 -324 -113 26 -255 -20
$$ packed form
5213D2qK8J0l13K50Kj77J80O9n2k28K87l45L75j12P6j88j47L69k04K61m70J22
5236a73J27j2Q0j52J30L56m74K07q4N9j14K5j88N55m40L09k19K0j65L36n1j74
5258d2M3N1J37J2j02k40K59o4j61L2p4J11M3J37q1j59J81n01N42j59j86K54pJ38
5282A64j52K22m85J44qO4J11J41l14L1P8M0Q8k76J64k0q4R6K6k73L63j56k0l35
5306c91L65j07J80J77J6n22K54O5k88J68L0J19J59j42n0R7o3jL6k22Q2j46K82
5329I8j91n7R7j61l6L12k16J08n5j37K18j43j25J79J0J57mJ1j08l9K00n4R3n6
5353A01p0k4J10j79j68l2K69K90l99j6J8K39mq6j57J69M5Or8K1j24o1K67N3k83
5378a13K8J39n7q7m4J76J56j09j86L13l39o1K79l52J59R4q7Q9l22K11J39k81K35
$$ plain form
5401 -20 -12 -65 165 -174 -37 -173 -54 -7 -211 -68 75 48 -98 -48 166 -185 71 80 38 -5 -101 60 -13 45 -97
5426 -97 -171 -63 -281 -4 -67 88 25 52 204 -187 248 62 65 -83 -135 45 50 -121 52 41 225 -101 34 358
5450 358 -186 159 -78 -118 -162 -123 185 274 6 -160 122 262 34 -257 50 -217 -9 162 306 -72 72
5471 72 48 -46 -299 -47 83 28 -112 220 89 -164 -110 146 -111 59 202 76 -412 9 287 -321 40 299
5493 299 17 63 -45 -16 -129 84 -77 -286 -9 -28 232 -148 47 179 34 119 -44 13 39 371 99 -13
5515 -13 158 17 -27 -125 -117 80 85 246 -17 -72 91 95 -120 -2 -70 -162 -44 18 60 38 -9 41 223 -15 -98 180
5541 180 -88 54 -49 20 180 116 146 -122 232 67 -90 -133 -196 -10 -117 -195 -76 44 -84 -25 162 -237
5563 -237 18 24 -59 -71 -104 -24 -55 83 -116 43 98 222 86 89 -87 -223 58 -51 -48 19 -155 167 -146 97
$$ packed form
5401b0Qn3K30l39J37j36J19M7k04J43J43k7j46N0K14l51K56Rm2m3r6J61p3N8j42
5426i7p4J08k18K77o3J55o3K7J52l91M35j86Lj48n2J80Nj71J73j1J84l26J35L24
5450C58n44L45k37m0m4L9L08Q9k68j66K82J40k28k91L07k67K08J71J44l78J44
5471G2k4r4k53K52J30n5j40L32j31k53N4K56k57J70J43j26m88M21K78o08L61K59
5493B99k82M6j08K9j13K13j61k09K77j9K60l80J95J32j45Q5j63N7K6L32k72j12
5515a3J71j41m4r8QJ97NJ61k63n5J63Mk15J18o8r2J18O2M2k2m7N0J82k38q3K78
5541A80k68J42j03O9J60o4L0k68L54j65j57m3o3J86j07p8J19J20j28N9J87l99
5563b37K55Oq3j2l3Q0l1J38j99J59N5J24j36Lj76j36K81j09LO7j74L22l13K43
$$ plain form
5587 97 -90 -77 -14 14 79 -70 -213 -253 -60 -52 -87 4 60 187 -67 20 62 -59 111 -98 176 275 -201 128 -22
5612 -22 -105 206 120 71 -159 -37 -71 -137 -281 91 288 -26 -95 8 -204 -59 110 -34 3 72 17 -149 42
5635 42 59 -48 26 22 212 41 54 -96 -90 17 113 48 32 98 8 6 228 -10 232 -161 -141 -122 -273 154 -152 72
5661 72 -210 116 -210 -154 118 22 -178 29 -70 -3 190 -20 290 -16 249 -101 -17 157 89 112 154 -230 43
5684 43 -29 -111 2 152 209 187 85 -190 69 -74 -220 143 -169 50 -23 -173 13 -56 83 -142 30 27 17
5707 17 -30 -153 50 7 -171 -189 42 93 -20 -137 -97 -99 -17 240 153 -54 30 277 -215 -182 -43 -116 191 48
5731 48 -107 22 -44 -210 43 150 40 -129 -58 -83 162 -137 -134 -37 182 -17 -75 -80 14 34 58 -282 16 -17 121
5756 121 88 -246 -8 -179 20 163 62 0 -92 198 106 75 -177 2 246 62 15 -135 -330 174 24 -55
$$ packed form
5587I7j87J3O3K8O5j49j43m0J93Ql5R1N6J27k54Q7M2j21J70k09K74R9m76L29j50
5612b2q3L11q6m9k30J22l4o6j44L72J97l14o9J03k12J45J69j44L7O9n5j66J91
5635D2J7j07P4mJ90j71J3j50OJ07R6o5j6O6r0kK22k38K42l93K0J9j51M27l06K24
5661G2k82L26l26N6K72r6k00K07r9O7J93k10L10l06K65l50Q4J74o8K3M2l84K73
5684D3p2q2J13J50N7k2j02k75K59j43j46L63l12K19p3j50J86o9J39k25J72lj0
5707A7m7j23K03m3j78j8K31N1j13j17M0kQ2K57q7k07Q4K47m92L3J39p3L07j43
5731D8j55J29o6j66K53J07j10j69P1k5K45k99LR7K19j99n8nR4K0K4l40K98l3J38
5756A21l3l34K38j71J99J43j01o2r2K90r2l1k52J79K44j84m7j50j95N04j50p9
$$ plain form
5778 -55 132 -272 33 71 -303 -227 -121 -164 -282 225 -19 -26 156 -86 -13 -122 -7 99 -131 -244 181 136 -38
5801 -38 -36 -94 112 73 1 199 225 120 -177 -13 188 -144 -207 57 18 173 -102 85 -49 -206 167 -181 -238
5824 -238 -136 104 105 200 -55 143 254 -99 -43 306 -18 -132 -46 -78 2 308 58 171 -81 -184 -171 108 22
5847 22 -17 -192 -49 159 -129 -12 -35 9 304 -257 -215 -146 -204 19 72 -83 106 5 74 61 -100 14 -228
5870 -228 -116 -78 -81 -1 -230 -23 156 34 -156 -161 -17 -145 9 93 -187 217 -146 22 -94 -17 75 61 48 -79
5894 -79 109 262 -50 131 -5 -115 1 6 297 -33 -11 118 -92 -208 190 67 4 86 169 28 -82 -233
5916 -233 22 -92 98 31 -43 -202 165 15 29 178 -15 10 -196 48 -105 -75 22 -7 127 4 -160 -19
5938 -19 -87 1 -110 239 29 24 12 36 29 -125 -204 -136 57 -111 -345 85 -180 -225 175 98 -223 -190 55 -162 -54
$$ packed form
5778e5J87m04L05L8l74P6J06m3j18N07k44pJ82k42P3j09J15J06k30j13M25m5j74
5801c8Kn8K06l9p2J98K6j05k97J64K01l32o3K64l9J55k75J87j34j57L73l48n7
5824b38J02K40JR5k55J98J11l53N6L49l24j14Q6l2Q0L06k50J13k52j03J3K79q6
5847B2l9j75J43K08k88J17k3M4K95n61M2O9n8K23N3j55J89j01O9j3j61J14k42
5870b28J12L8lQ0k29K07J79j22j90nJ44j28J54Q4k80M04l63J68j16P7R2j4j3j27
5894g9J88J53l12J81j36j10J16NK91l30K2J29k10j16L98j23o3Q2Q3j41j10j51
5916b33K55j14J90o7p4j59L67j50J4J49j93K5k06K44j53L0R7k9J34j23j64J41
5938a9o8Q8j11L49k10nj2K4pj54p9O8J93j68k34M30k65m5M00p7l21L3K45k17J08
$$ plain form
5963 -54 148 -47 38 206 46 -58 154 -163 -232 -221 -59 126 -162 94 147 53 -134 -5 100 -48 140 -117
5985 -117 -25 -29 93 184 -109 199 19 33 108 2 191 102 63 151 148 38 -47 -113 98 -139 2 -91 -117 -64 53
6010 53 43 333 -99 -203 -99 -12 -29 -85 205 89 124 -3 29 -221 9 69 -8 62 145 -79 150 -97 -109 142
6034 142 -34 142 -94 29 -182 -138 67 -141 -110 -158 -124 98 -23 -162 -79 108 -164 -18 -292 -170 32 77
6056 77 24 91 10 -167 -67 -144 -303 -111 23 -18 9 -128 -40 41 -112 -31 73 96 155 -117 -16 130 9 189
6080 189 -89 -164 -132 -147 -155 -166 135 -109 42 -90 -155 -81 67 232 50 124 241 -111 -72 46 -229 10 -26 359
6104 359 -39 70 -189 106 224 -260 92 187 87 -99 -43 -185 105 36 -85 64 -84 72 304 249 -52
6125 -52 200 18 -175 -128 67 123 40 -112 75 5 -190 -271 252 -4 -293 -45 93 52 169 63 64 47 47 -159
$$ packed form
5963e4K02j95Q5J68j60j04K12l17o9J1J62J85k88K56N3r4j87J29J05j48J88k57
5985a17R2mJ22R1k93L08j80J4P5j06J89q9l9Q8lj10q5o6K11k37J41r3k6N3J17
6010E3j0K90m32j04J04Q7j7n6K90j16L5j27L2k50K30O0p7P0Q3k24K29k47j2K51
6034A42j76J76k36J23k11M4K05k08L1m8L4K22j21j39Q3J87k72J46k74J22K02M5
6056G7n3O7q1j77J00p7j59J92J34m1K7j37Q8Q1j53Q1J04K3N9k72J01J46j21J80
6080A89k78p5L2j5qj1L01k44J51j32o5P4J48J65j82P4J17l52L9J18k75K39l6L85
6104C59l98J09k59K95J18m84L52R5j00j86N6j42K90o9j21J49j48J56K32n5l01
6125e2K52j82j93M7J95N6q3j52J87p0j95q1N23k56k89K48J38m1J17j06Jj7%k06
$$ plain form
6149 -159 -102 -152 106 -89 -16 50 -200 121 -98 -224 -109 -210 -52 -274 -17 288 -204 -190 64 19 -253 7
6171 7 -51 -122 -43 -38 21 -150 -23 26 -184 -167 154 -162 153 55 294 134 -161 195 -87 9 209 88 -88 76
6195 76 178 57 -75 -23 31 -93 -7 -11 -59 72 -234 -63 -63 111 -115 -15 -44 229 37 -190 -76 -7 68 12
6219 12 50 -142 80 147 -89 155 211 231 55 -163 32 62 17 -79 177 -70 63 -149 25 -77 -36 -122 -61 -46
$$ packed form
6149a59N7n0K58j95P3O6k50L21k19j26J15j01J58k22K57L05m92J4K54m5k72K60
6171Gn8p1P9NN9j71J27M9k10J7L21l16L15r8K39j60k95L56k82R6K00j21j76J64
6195G6J02j21j32N2N4j24Q6mm8J31l06J71%J74k26J00k9K73j92k27J14O9P5n6
6219A2L8j92K22O7k36K44N6K0j76k18J95L0m5r6K56k47J33k12J74j02M1q6O1J5
$$ [...]
8191a
##END NTUPLES=NMR FID
##END=
