##TITLE=1H_Ser 5-6-V-3
 CDCl3
 8 sc, 
 31.05.2022
##JCAMPDX= 6.0         $$ Bruker NMR JCAMP-DX V2.0
##DATA TYPE= NMR FID
##DATA CLASS= NTUPLES
##ORIGIN= UXNMR, Bruker Analytische Messtechnik GmbH
##OWNER= root
$$ XWIN-NMR		Version 3.5
$$ Tue May 31 16:26:34 2022 Russian Standard Time (UT+4h)  she@DPX200
##.OBSERVE FREQUENCY= 200.1313499996
##.OBSERVE NUCLEUS= ^1H
##.DELAY= (6, 6)
##.ACQUISITION MODE= SIMULTANEOUS
##.ACQUISITION SCHEME= undefined
##.AVERAGES= 8
##.DIGITISER RES= 18
##SPECTROMETER/DATA SYSTEM= spect
##.PULSE SEQUENCE= zg30
##.SOLVENT NAME= CDCl3
##.SHIFT REFERENCE= (INTERNAL, CDCl3, 0, 15.7039)
##AUDIT TRAIL= $$ (NUMBER, WHEN, WHO, WHERE, WHAT)
$$ ##TITLE= Audit trail, XWIN-NMR		Version 3.5
$$ ##JCAMPDX= 5.01
$$ ##ORIGIN= Bruker BioSpin GmbH
$$ ##OWNER= she
$$ F:/spectra/data/she/nmr/H-F/1/audita.txt
$$ ##AUDIT TRAIL=  $$ (NUMBER, WHEN, WHO, WHERE, WHAT)
(   1,<2022-05-31 16:25:26.90 +0400>,<she>,<DPX200>,
      <created by zg, POWCHK disabled, PULCHK disabled
       configuration hash MD5:
       00 E9 B6 7A A2 85 ED C7 34 08 36 98 17 FE 4E 26
       data hash MD5: 16K
       5F 03 0C 2F 16 58 DF F4 2E C7 C9 3E 29 51 00 01>)
$$ ##END=
$$ 
$$ hash MD5
$$ F0 6E A5 88 00 E2 B6 8F 02 08 3D 46 96 10 04 E8
##$RELAX= 
##$RELAX= 
##$RELAX= 
##$RELAX= 
##$RELAX= 
##$RELAX= 
$$ Bruker specific parameters
$$ --------------------------
##$DU= <F:/spectra>
##$EXPNO= 1
##$NAME= <H-F>
##$PROCNO= 1
##$TYPE= <nmr>
##$USER= <she>
##$AMP= (0..31)
100 100 100 100 100 100 100 100 100 100 100 100 100 100 100 100 100 100 
100 100 100 100 100 100 100 100 100 100 100 100 100 100 
##$AQSEQ= 0
##$AQ_mod= 1
##$AUNM= <au_zg>
##$AUTOPOS= <>
##$BF1= 200.13
##$BF2= 200.13
##$BF3= 200.13
##$BF4= 200.13
##$BF5= 200.13
##$BF6= 200.13
##$BF7= 200.13
##$BF8= 200.13
##$BYTORDA= 1
##$CFDGTYP= 0
##$CFRGTYP= 5
##$CHEMSTR= <none>
##$CNST= (0..31)
1 1 145 1 1 1 1 1 1 1 1 1 1 1 1 1 1 1 1 1 1 1 1 1 1 1 1 1 1 1 1 1 
##$CPDPRG= <>
##$CPDPRG1= <>
##$CPDPRG2= <>
##$CPDPRG3= <>
##$CPDPRG4= <mlev>
##$CPDPRG5= <mlev>
##$CPDPRG6= <mlev>
##$CPDPRG7= <mlev>
##$CPDPRG8= <mlev>
##$CPDPRGB= <>
##$CPDPRGT= <>
##$D= (0..31)
0 1.2 0 0 0 0 0 0 0 0.06 0 0.03 0 0 0 0 0.0002 0 0 0 0 0 0 0 0 0 0 0 0 
0 0 0 
##$DATE= 1653999926
##$DBL= (0..7)
120 120 120 120 120 120 120 120 
##$DBP= (0..7)
150 150 150 150 150 150 150 150 
##$DBP07= 0
##$DBPNAM0= <>
##$DBPNAM1= <>
##$DBPNAM2= <>
##$DBPNAM3= <>
##$DBPNAM4= <>
##$DBPNAM5= <>
##$DBPNAM6= <>
##$DBPNAM7= <>
##$DBPOAL= (0..7)
0.5 0.5 0.5 0.5 0.5 0.5 0.5 0.5 
##$DBPOFFS= (0..7)
0 0 0 0 0 0 0 0 
##$DE= 6
##$DECBNUC= <off>
##$DECIM= 32
##$DECNUC= <off>
##$DECSTAT= 4
##$DIGMOD= 1
##$DIGTYP= 9
##$DL= (0..7)
0 120 120 120 120 120 120 120 
##$DP= (0..7)
150 150 150 150 150 150 150 150 
##$DP07= 0
##$DPNAME0= <>
##$DPNAME1= <>
##$DPNAME2= <>
##$DPNAME3= <>
##$DPNAME4= <>
##$DPNAME5= <>
##$DPNAME6= <>
##$DPNAME7= <>
##$DPOAL= (0..7)
0.5 0.5 0.5 0.5 0.5 0.5 0.5 0.5 
##$DPOFFS= (0..7)
0 0 0 0 0 0 0 0 
##$DQDMODE= 0
##$DR= 18
##$DS= 0
##$DSLIST= <SSSSSSSSSSSSSSS>
$$ [...]
##$SUBNAM2= <"">
##$SUBNAM3= <"">
##$SUBNAM4= <"">
##$SUBNAM5= <"">
##$SUBNAM6= <"">
##$SUBNAM7= <"">
##$SUBNAM8= <"">
##$SUBNAM9= <"">
##$SW= 18.0517283424761
##$SWIBOX= (0..15)
0 0 2 0 0 0 0 0 0 0 0 0 0 0 0 0 
##$SW_h= 3612.71676300578
##$TD= 16384
##$TD0= 1
##$TE= 0
##$TE2= 300
##$TE3= 300
##$TEG= 300
##$TL= (0..7)
0 120 120 120 120 120 120 120 
##$TP= (0..7)
150 150 150 150 150 150 150 150 
##$TP07= 0
##$TPNAME0= <>
##$TPNAME1= <>
##$TPNAME2= <>
##$TPNAME3= <>
##$TPNAME4= <>
##$TPNAME5= <>
##$TPNAME6= <>
##$TPNAME7= <>
##$TPOAL= (0..7)
0.5 0.5 0.5 0.5 0.5 0.5 0.5 0.5 
##$TPOFFS= (0..7)
0 0 0 0 0 0 0 0 
##$TUNHIN= 0
##$TUNHOUT= 0
##$TUNXOUT= 0
##$USERA1= <user>
##$USERA2= <user>
##$USERA3= <user>
##$USERA4= <user>
##$USERA5= <user>
##$V9= 5
##$VALIST= <valist>
##$VCLIST= <CCCCCCCCCCCCCCC>
##$VD= 0
##$VDLIST= <DDDDDDDDDDDDDDD>
##$VPLIST= <PPPPPPPPPPPPPPP>
##$VTLIST= <TTTTTTTTTTTTTTT>
##$WBST= 1024
##$WBSW= 4
##$XGAIN= (0..3)
0 0 0 0 
##$XL= 0
##$YL= 0
##$YMAX_a= 108097
##$YMIN_a= -201208
##$ZGOPTNS= <>
##$ZL1= 120
##$ZL2= 120
##$ZL3= 120
##$ZL4= 120
##$ABSF1= 10
##$ABSF2= 0
##$ABSG= 5
##$ABSL= 3
##$ALPHA= 0
##$AQORDER= 0
##$ASSFAC= 0
##$ASSFACI= 0
##$ASSFACX= 0
##$ASSWID= 0
##$AUNMP= <proc_1d>
##$AZFE= 0.1
##$AZFW= 0.1
##$BCFW= 1
##$BC_mod= 2
##$BYTORDP= 1
##$COROFFS= 0
##$CY= 11.3945322036743
##$DATMOD= 1
##$DC= 2
##$DFILT= <>
##$DTYPP= 0
##$F1P= 2.36226072786647
##$F2P= -0.459571619588291
##$FCOR= 0.5
##$FTSIZE= 0
##$FT_mod= 4
##$GAMMA= 1
##$GB= 0.15
##$INTBC= 1
##$INTSCL= 1
##$ISEN= 128
##$LB= 0.24
##$LEV0= 0
##$LPBIN= 0
##$MAXI= 10000
##$MC2= 0
##$MEAN= 0
##$ME_mod= 0
##$MI= 1.114404
##$NCOEF= 0
##$NC_proc= 0
##$NLEV= 6
##$NOISF1= 3.799351
##$NOISF2= 2.8
##$NSP= 1
##$NTH_PI= 0
##$NZP= 0
##$OFFSET= 15.70392
##$PC= 1
##$PHC0= -18034.45
##$PHC1= 14.00074
##$PH_mod= 1
##$PKNL= yes
##$PPARMOD= 0
##$PSCAL= 0
##$PSIGN= 0
##$REVERSE= no
##$SF= 200.130013532006
##$SI= 16384
##$SIGF1= 3
##$SIGF2= 2
##$SINO= 400
##$SIOLD= 16384
##$SREGLST= <1H.CDCl3>
##$SSB= 0
##$STSI= 0
##$STSR= 0
##$SW_p= 3612.71676300578
##$SYMM= 0
##$S_DEV= 0
##$TDeff= 0
##$TDoff= 0
##$TI= <>
##$TILT= no
##$TM1= 0
##$TM2= 0
##$TOPLEV= 0
##$USERP1= <user>
##$USERP2= <user>
##$USERP3= <user>
##$USERP4= <user>
##$USERP5= <user>
##$WDW= 1
##$XDIM= 8192
##$YMAX_p= 0
##$YMIN_p= 0
$$ End of Bruker specific parameters
$$ ---------------------------------
##NTUPLES= NMR FID
##VAR_NAME=  TIME,          FID/REAL,        FID/IMAG
##SYMBOL=    X,             R,               I
##VAR_TYPE=  INDEPENDENT,   DEPENDENT,       DEPENDENT
##VAR_FORM=  AFFN,          ASDF,            ASDF
##VAR_DIM=   8192,          8192,            8192
##UNITS=     SECONDS,       ARBITRARY UNITS, ARBITRARY UNITS
##FACTOR=    0.0002768,     1,               1
##FIRST=     0,             0,               0
##LAST=      2.2672688,     0,               0
##MIN=       0,             -201208,         0
##MAX=       2.2672688,     108097,          0
$$ Real data points
##PAGE= N=1
##DATA TABLE= (X++(R..R)), XYDATA
$$ [...]
1854G9K22Q45m74j455K79K05j04J38M16m81m25Q6J4j6O12N0j80L78n64pN97P20
1876I35J6q07l50J78M48L57L97o10q01m54N85Q48K5k21j584r9O72M05J69Q8p53
1897e56p49Q60O71l37P0M0l51J47L47p4K79L67n16k92L54J49k60M27p8r08l56
1918g66P00N5K28K85o72m13J3J49M71N83o33j077L04L45P06K80j78n55p48O33
1938b90P02P2j42k04l25J77M77L13l9j74m13k39J08M10O6o04L90j45m16K28N00
1959D52m98lk4m83j44O86L54j22j33r03j81J060O97m23n0m75m90Q73R67N3r30
1980B83n79K12N5R68Jp89k71M3k28J58N10m04n6l58j69j02K07M78j5j14q7k34
2002d91L4R76K56k61o95J81LP64M69n0r94n51J60N00O77m19p39n97p3M89N29K04
$$ y = [79, 301, 1146, 672, -783, -504, -299, -403, -265, 151, -330, -755, -669, -655, -671, -59, -9, -189, 189, -375, -382, 215, 935, 951, 144, -206, -28, 420, 777, 1174, 564, -237, -691, -106, 742, 767, 546, -1038, -1137, -465, -60, 109, 197, -556, -1305, -445, 226, -111, -41, -1, -352, -205, 142, 68, 347, 714, 198, -94, 260, 409, 149, 576, 498, -410, -766, -66, -11, 217, 502, -170, -583, -570, -421, 50, 633, 0, -1077, -773, -428, 278, 558, 380, -175, -923, -290, 412, 484, 342, 138, -187, -10, 467, 780, 741, 567, 154, -85, 23, 433, 499, -105, 285, 140, -276, -48, 452, -46, -49, -73, -556, -700, -14, 340, 218, 85, -818, -999, 61, 758, 335, 285, -190, -680, 193, 1160, 1213, 283, -296, -84, -29, 939, 940, 151, -120, -77, -305, -147, 363, -41, -97, -455, -624, -726, -519, -41, -56, -170, -257, -491, -457, 519, 775, 514, -181, 0, 3, 767, 1236, 1186, 192, -359, -199, 301, 978, 559, -180, -777, -850, -361, 168, 372]
2024C72o38p66K9M77O3P69k55o48Q2N04N5M06N8l95Q8l1O3qL49J41n70j84P8j43
2048a04M0L70m4p43l47L89L72M44j96n54m80M98P0M71K97m49q47M97L08L32N8
2069C82j59j91o16P68O59k98k72l36k31L05M06k44j10J22j41k77O7R8J25N0j83
2090g6m59q7j09O43L73k02n84k07K30O85L03j5m78o17M20O89M9m0m51j94J87M70
2112E30n8J1l77k41k6J52J93M7o35%L6j96N0K75K64k16q1J8p6L57L01k19J25m16
2136a82j05L77O87j62j56k15m31M63R3M17l44l74n48j72R99j29l01l18l63O9L60
2157c35K73j75j85j05j12O58J11l0l18L73j06j81O12Ll63J38r8p8J0k7J67j00
2179A32j22m36MK65j89M88j78n43k42N81L69J40J23r38k06N80L53M49k96n14j9
$$ y = [372, -266, -1032, -1003, -526, -463, 306, 51, -597, -515, -11, 44, 450, 508, 113, 201, 170, 233, 225, 574, 715, 145, -39, 39, -104, -64, 306, 262, -481, -828, -439, -67, 377, 181, -373, -853, -355, -285, 186, 483, 34, -813, -316, -8, 324, 382, 223, 32, -584, 184, 843, 545, 273, -63, -294, 11, 417, 173, 63, 185, 44, -233, -166, -68, 57, 107, -76, -535, -622, -731, -88, 285, 83, -501, -708, -478, 207, 510, 495, 17, -600, -180, 509, 558, 518, 67, -127, 60, 530, 472, 483, 106, -135, -161, -9, 184, 231, -404, -404, -368, -564, -514, -239, 25, -191, -272, -254, -330, 27, 328, 109, 234, -182, -287, 90, 777, 615, 459, 244, -187, 276, 369, 786, 442, 68, -480, -652, 347, 218, -83, -401, -764, -695, -335, -62, -237, -422, -527, -639, 19, 130, 100, -218, 155, 49, -132, 480, 483, 120, 258, 160, 82, 92, 65, 232, 132, 10, -426, -422, -157, -346, 142, -36, -579, -821, -240, 129, 269, 392, -546, -752, -172, 181, 630, 334, -180, -199]
2200a99M78M80j47l78l12rL93K03q9p6j42n00M91ll11k2K15q5k9k78l64M54K01
2223b9j88j70Mk76k19R81M51q58K9mK69N53K91j011J37J92J43J59J96o11m54M28
2245A3K32j65k4j06n24J01O00l71N5k7j20k6L37l61J97M6L41J43j80J75n85N53
2267C04J9K47J07m68j20L37j68O6n7r09K62L79K3r0J70o34k84N44J46j12j95K18
2289b15n11O21R6L18l70Q0k10M41O01k65p14N07J78q6M1R0o74J86M75r62L71K55
2311B53n42l0K95j5p03K66R7J6K32R0p10M11L77N1L85l72k64J75M82j60m2l28
2333c6k72K18M03K03m52o9k6J1K90l07k83L26k91k54O35k85j16K87Pk11M12j91
2355al35O33M2l37j3N6j82N06kj79l56M00n8J20M97m47o27L20M0j98K97N1o72
$$ y = [-199, 279, 759, 612, 234, -78, -87, 306, 509, 420, 344, 202, -298, 193, 190, -121, -143, 72, -13, -42, -320, -684, -230, -29, -217, -387, -383, -659, -878, 103, 554, -304, -275, -279, -10, 543, 834, -177, -40, 152, 295, 454, 650, 39, -415, 13, 245, 80, 56, -50, -574, -473, 127, -244, -189, -216, -336, -362, -25, -386, -189, -143, 198, 341, 161, 336, -249, 304, 323, 570, 677, 209, 89, 426, 258, 324, 267, -642, -380, -1, 22, -68, 102, -532, -816, -272, -126, -238, -433, -215, -726, -105, -9, 309, -61, 19, -191, 250, 851, 586, -128, 379, 557, 471, 512, 602, -72, 114, 589, -373, -2, 253, -289, -319, -24, -39, -742, -476, -379, -363, -131, -41, -751, -340, 37, 88, 473, 101, -163, 12, 494, 334, 292, -36, -308, -90, 313, 516, 64, -5, -31, -20, 270, -37, -320, 6, -285, -539, 96, -189, -305, -18, -11, -222, 190, -1, -336, 297, 339, 2, -11, 45, -137, 369, 367, 188, -168, 232, 174, 294, 791, 344, -283, 37, 77, -121, 176, 227, -445]
2378d45j41L69m9K77P6n71n5O56k27k7L8j48k48M97J80Q7j26Q7l3L49k07q2k11
2401D6K81o7j1k59j92N6L63j00J16n87m22N23K36k76O6p4l14N63K12Q7n91J05
2423b39k77L16P25j28k94J99J11n71N44Q8o92NM20K8l25K83n72l9M75k89k39K87
2445a84L11l88K59m8l72j6N76l8j70L31m55J34J05K17k75P6l17J02M97K77k57
2466C65l59j11L40P6l9j52j78l0J20m70L46n6k28L78l79L12J8m04N64N0k44J66
2488H5J22l85J67M87r7m45L94j42j0M36m48l83K44n5j15J84K67o55k54R3K71Q6
2510a53K91m07m46N76O0J62rj85n07K43M84K85k88O0j8L0L04j54n2q9p3K03Pk92
2534C2P2j41K16o7m74K9N3J25j90M90j45n61K58L62J04k64k58j27J60O29J13l08
$$ y = [-445, -586, -217, -266, 11, 87, -484, -539, 117, -110, -137, -99, -247, -495, 2, 182, 269, 143, 230, 197, 546, 339, 257, 46, 327, 260, 249, -10, -202, -146, 217, 117, 233, -354, -776, -253, -17, -293, -227, -301, -615, -52, 160, 247, -344, -239, -516, -200, 525, 397, 103, 302, 413, -158, 386, 474, -218, -213, 207, 235, -90, 193, -379, -418, 57, -232, -471, -184, 127, -261, -2, -50, -422, -438, 138, 100, -70, 261, -194, -60, 45, 262, -13, 63, -254, -152, 345, 622, 365, 6, -105, 235, 311, 272, 120, -58, -88, 32, -438, -92, -148, -376, 2, -377, -65, -47, -451, 113, 163, -81, 85, 207, -178, -11, 476, 379, -66, 328, 186, 176, 612, 164, -219, 25, -30, -145, 39, 306, -349, -603, -510, -239, -153, 138, -269, -715, -139, -79, 83, 74, -111, -618, -375, 109, 394, 106, 166, 148, 178, 482, 328, 276, 187, 114, 317, 324, 32, 104, -37, 179, 112, -362, -333, -280, -155, -345, 145, 0, -561, -303, 59, 163, -101, -359, -486, -326, 303, 416, 108]
2556A08K29l41J19L87O3n14n9L6j60K38M4m6m96K35J76j55L21k38n48O19j01n20
2578f03K01R4K78l43L41k4p6M9P78k48m01Ml8J29K80N8l10o9j22K46PR3m04m34
2602e14J92J20J90M2j84l06K75k42M64J77l24M0j24J66K71n11K41J56j27K17J07
2623C26j36j07L20n58O15l25j98L04K58l58lk50k29L98K56k00l04k81m4J67L12
2644c7J4j26l72K49K18M95l69J7l77J39L18L3J69n52L11J44J0k01pj54l4R2O9
2667D9j21m2k94K96J07j96l62L19m6K15P0n2k75K31O6K44K67n00j70K41J40M04
2689E91l33k1l13R8J8N48m26k41J56k02K66k98j00K57m3l26N8K60K75n13p9K86
2711h2K8J36M1Q1Q8m8l67K99J46j54M59l09k76N6j68L17J9k70l6k26j7K50nN8
$$ y = [108, 337, -4, 115, 502, 565, 51, -8, 28, -132, 106, 150, 104, -392, -157, 19, -136, 185, -53, -601, 18, -83, -603, -402, -308, -30, -373, -32, -56, -132, -83, 695, 447, 46, 50, 12, 141, 421, 479, 169, 100, -22, 224, 231, 324, -80, -514, -322, -202, -12, 30, -154, -460, -185, -427, 37, 214, -110, -70, -194, -28, 243, -268, -27, 129, 2, 219, 326, 190, 83, 403, -155, 460, 135, -63, 241, 499, 141, 138, -112, -341, 57, 313, 113, -191, -472, -516, -349, -37, -23, -149, -521, -272, -54, 441, 72, 89, -288, -149, 169, 202, 371, -181, 130, 274, 284, 83, 76, -78, -112, -20, 49, -72, -114, -408, -112, -5, -201, -563, -244, -290, -75, -5, -57, -332, -101, -35, 209, 476, -24, -194, 47, 187, 591, 258, 237, -76, 22, 40, 588, 162, -79, 77, -125, 141, -157, -257, 0, -43, -369, -311, -51, 224, -289, -368, -82, -54, 82, 123, 204, 292, 244, -123, 176, 322, 168, 627, 318, 42, 98, -70, 247, 266, -4, -40, -266, -283, -33, -38, 20]
2735B0k71K3k62K69J46K02o58j65O89j73K07k26j76M59l13L62%N9j47m0K68j6
2757B57m76K31om4N28o04k29L63o0K39k70k44k49N32J9J83l93j20P1Q4N53Mn26
2780a57j44L09k37P33j92j74k65M07j28mK18l46j6QO8k98L76l39J34j6k22k25
2802e10K39JL06R0k43J03k80K39J65J34k34m40N48O7p7N1Q6l51r1K46R6L52l86
2825A11l27n1J26r2M44m9j95n56L2O07l95L48j42o9J17o0O3K1O7q5L7K46r3P6
2849A81L97r9j77k37q4j26M14K32m14J5j48k17N04j08P1m67p3L21K38k89M6o9
2871h9k48j82N84K46l06l82K34K50J4L42l06m3J3l1o5J37J29j30L18n89k94J94
2893b04L02l32J69r7j92j37N74jk89R3m44J55N23L99o96J10k89K34P6L50ok03
$$ y = [20, -251, -228, -490, -221, -75, 127, -531, -696, -7, -180, 27, -199, -375, 84, -229, 133, 133, 192, 45, 5, 273, 257, -219, 12, 6, -38, 490, -114, -343, 20, -40, 199, -71, -315, -564, -32, -13, 170, -223, -343, -272, -188, 365, 369, -157, -301, 8, -229, 504, 312, 138, -127, 280, 152, 148, 366, 20, 4, 12, 80, -218, 158, -181, -47, -63, -285, -510, -271, -270, 36, 126, -117, -14, -294, -55, 110, 244, 10, -430, 118, 185, 108, 159, 245, -106, -197, 49, 145, 497, 111, -216, -267, -141, -233, 211, 162, -33, -589, -557, 50, -345, 3, -139, -208, -91, -151, -88, -67, 0, -85, -48, 198, 105, 181, 578, 479, 302, 65, -19, -145, 269, 501, 87, 102, -46, -263, 241, 133, 204, -263, -336, -15, 223, -66, -20, -89, -337, -519, 65, 311, 5, -377, -143, 107, 121, 463, 157, 114, 127, 96, 31, 168, 297, 167, 485, -104, -398, -204, 98, -234, -65, -162, -354, -491, 83, 82, -207, -114, -558, -403, 120, 519, -177, -67, -356, -122, -46, 304, 298, 95]
2915I5k22J03K04J48o6m44K07L5L2j44J50m03L78k94j86K50k4Q1j10J33j43j24
2937c44j04N04J14j59m5j95R3J14K66J06m88K0K80j45K68K08l00j73q1Q2P5N2
2959A48l24j78R3J77k8J11k06k01J50K20J48j22L6n5j29L9K53m61L07L92m01l7
2981f8qj5q5M23k8k52l22K09K06J94l6l22j97j07P3M60l69J4k32J31O13n9l47
3004a24R2j7J48K5K63j73l98L88K20k66J64l90k9K73p2k27p1M58j56Qj34j66k10
3027c94J68L16l21L67m56k22K50L55r3J74j88k87K04L76J39j50j19j5j11J90J64
3048C47l43J97Km09q6K12m3j50o4L17j58MK24k57K03j39p7N2k1J15K95j58J60
3071B23j09j75K83J76j41k03j42j76L19L18l02o8l35K06L70K73n52k57J43q9L05
$$ y = [95, -127, -24, 180, 328, 262, -182, 25, 60, 92, -52, 98, -305, 73, -221, -407, -157, -181, -100, -210, -77, -220, -344, -448, 56, 170, 11, -34, -229, -136, -22, 244, 350, -138, -118, 162, 17, 285, 493, 193, 20, -61, 21, 96, 148, -176, -354, -261, -84, -112, -1, -207, -408, -258, -38, 110, -12, 24, -31, -160, -121, 132, -329, -22, 370, -31, -68, -76, -91, -176, 247, 219, -33, -355, -146, 60, 254, 218, -104, -301, -408, -335, 125, -244, -230, -462, -331, 282, 223, -124, -32, -49, 99, 124, 387, 214, -184, 204, 424, 158, 322, -68, -97, 176, 104, -123, -194, 264, 108, 116, -18, -184, -394, -226, 90, -231, 136, -320, -542, -292, 63, -30, 144, -44, -331, -127, 249, 388, 238, 119, 104, -7, 183, 347, 4, 201, 203, -206, -292, -80, -123, -273, -337, -20, -178, -174, 50, -207, -4, -143, -220, -168, -189, -74, 221, 63, 223, 114, -61, 222, 398, 257, 54, -88, -264, 55, 373, 71, 3, -332, -126, 244, 517, -35, -292, -149, -238, 67]
3092F7j63J81m66l3K82k6j69J30M90k87J63j41o8JK31r5J45l9o4p7J84J13l64
3115eJ34q7J96R5k49j90j26J63j90K28L3l26j24J26K54l0Q9k39K99k92L30Q4j23
3138E0N8l40J06P5K33m08J16K67J16n53l3J21PJ10L79l71j88J23j24J47p4K19
3160C6m77K12L75j21j0J66m24P3J75L86l59J31J5k0k48M99j74k23K19k19M8J99
3182B59J7l55N7k56K68M6n2j0l32K41J72o5n4j20M8J56K32J10l42J50J15l6k54
3205em0r4M28J18p0m77L12l34J26L6K0l6k13j05K28K46k14j53j24L01Nj17m0J46
3229e6j39J86N02n24q6J42J61j36r8J41J48k30L16k34o8J6l32K26K41k12K53k06
3251A1o8k8OK3m1j24J67L6O4j03J89k70K65j71n7Q3m9J85m2O7j4l7o6K19oJ29
$$ y = [67, -96, 85, -381, -414, -132, -158, -327, -197, 293, 6, 169, 28, -40, -39, 192, 97, 242, 203, 139, 62, 246, 359, -5, 129, 42, 238, 333, 84, -106, -232, -69, -259, -31, 2, -324, -448, -322, -68, -98, -9, -248, 51, -241, 89, 173, 50, 108, -232, -126, -51, 182, -226, -110, 157, 273, -280, -313, -192, -185, -75, 304, -67, -255, -132, -256, -109, -183, 36, -441, -229, 146, 25, 15, 181, -243, -170, 5, 391, 32, 163, 178, 158, -90, 409, 235, 12, 231, 12, 60, 259, 276, -79, -22, -278, -10, 36, -16, -26, -358, -117, 55, -10, -64, -184, -136, 20, 252, 362, 20, 170, 285, 249, -5, -45, -139, 289, 407, 337, -140, 172, -162, -36, 0, 20, -16, -229, -334, -106, 140, -74, -227, -351, -50, -45, -162, -202, -56, -195, -9, 493, -31, -117, 25, 186, 50, -48, 93, 241, 11, 327, 93, 25, 41, -291, -65, 176, -36, 217, 11, -57, -85, -79, -56, -97, -221, -54, -18, 46, -57, 132, -138, 127, -44, -101, -18, -67, 118, 76, 143, 129, 92, 26, 245, 239, 368]
3277C68l35J99l33l4J88M7j94r7K02q7mj01J53j42K58j40R4ql36L27L29k90K80
3300C44k29Q8j44J72n4kk50L5J62J96j50j00l41K41L2j98m7J51m45L79M14k17
3322C7j46k94L23kj3KL9K2K8J58q9k62K91L6k62M26q5k10o2K37n8K18l42j24j12
3347b44L08j09M4j53j6KJ47J32l51K57j35O6n4K15M0k51m2K92m8K1j4k32J95K30
3371C00j6j8j77j38J42J63j73o5J82k60j74M49p9m79L9K37N7K63n30r5L84q6K39
3394A65j54J0O1k4L03l32L04k15j33J69j3o1K23l05k13J8J71N9l8j8k74J88K06
3417I7p3k70J65J17o7L5J79l41J63K31m0k66J13k32K50R7p8k6j83M72m09K98m7
3440A85m76K92j1K6k01K63k23j96K35K43k80j44L29m5k04J53K43j49j64l8K61
$$ y = [368, 33, 232, -101, -135, 53, 100, -94, -191, 11, -76, -80, -181, -28, -170, 88, -52, 42, 34, -302, 25, 354, 64, 344, 115, 203, 59, 231, 177, 175, -75, -40, 122, 318, 168, 68, -273, -32, 0, -198, -245, -94, -539, -160, 254, 37, -109, -403, -80, -82, -95, -93, -54, -32, -4, 154, 65, -197, 94, 130, -132, 294, 209, -1, -63, 174, 116, 334, -8, -132, -244, 64, -45, -1, -154, -170, -168, -21, 111, -240, 17, -118, -52, -106, 109, 149, -102, -144, 148, 100, 121, 107, -125, 70, 300, 284, 266, 89, -49, 93, 256, 83, 18, 200, -60, -234, 215, 136, -343, -304, -67, -10, 253, -277, -372, 12, -74, 165, 11, 21, 82, 58, 361, 29, 333, 118, -15, 154, 141, 80, 303, -2, -215, -197, -26, 33, -5, -23, -297, -109, 97, 24, -246, -81, 36, -31, 4, 183, -158, 5, 236, 196, -70, 43, -189, 61, 158, 80, 54, -129, 343, -66, 232, 185, -291, 1, -10, 16, -185, 78, -145, -341, -106, 137, -143, -287, 42, -3, -207, -54, 189, 40, -124, -162, 99]
3461I9QL4l03J93oL11k31L5k47J4L22j31k6j08p8l1n2K22l84j16N77j8k1k43J08
3486g2j31J03M32j62k05Qk3r5K15L59m03J40J59k47r9L10j67k49L4M25j92j71
3508c1L5j2j71K93j45q3J62J49q3n1l39r8L88j35K08j67pJ13K31J68k52k61K81
3531A93k06L26q8J3j81j52m2L50j91k75K08k57o7M95j87l16M01l90J72J75p6q4
3553a79J82q1K07k82M36k48j73L66k3m73K61L00l63L36l4k10j15N0R9K15l14p7
3575a20K8R1J33M6l82J58k05Q4N8L56j35J51n30J92J84k2lp2K69P4k30J00k04
3598B1M6j49K65l9j49j42K47l93L22K9m13M3K02J03j15k23R1K63P3j61m7J29k54
3621b51N4P4N41l74j29M1J41R2l7q2P5j35J39l9nJk22P3J74J30k93j94O2q1J09
$$ y = [99, 107, 141, -162, 31, 25, 336, 105, 140, -107, -93, 229, 98, 72, -36, -114, -145, -197, 25, -359, -475, 102, 84, 63, -180, -72, -203, -100, 332, 170, -35, -27, -50, -145, 70, 429, 26, 166, 325, 78, -21, 289, 122, -127, -93, 332, 140, -31, 4, -8, -179, 114, -31, -114, 48, 197, 114, 63, -276, -374, 14, -121, 87, -80, -87, 26, 257, 425, 173, -88, 193, -13, 313, 225, 238, 57, -95, -137, 213, 22, -253, -45, -302, -369, 126, -61, -377, 24, -366, -194, -19, -95, -179, 3, -78, 129, -153, 283, 35, -138, 228, 205, -268, -7, 293, -70, 266, 232, 22, -93, -43, 56, 271, -43, -120, -92, -1, 132, 178, -204, -46, -251, -167, -109, 247, 112, 263, -267, -75, 109, 87, 84, 12, 281, 355, 125, 225, 21, 67, -82, 183, 144, -5, -147, 100, -293, 29, 58, -355, -312, -110, -7, -122, -345, -254, 9, 82, -79, -126, 3, -251, -197, -123, 418, 44, -85, -44, 97, 189, 152, 70, 145, 10, 149, 110, 105, 106, -116, -43, 131, 261, -32, -226, -164, -245, -136]
3646a36J34l38K10L0LJ00m6J40%j71L66k30j32L82m12J44K82l27j4j7K01j10P9
3669A38k22r3j27j47M85j03M3k62K74j75N1K27l43J08O6K9K40m31J09J38K67j74
3691I8l44J15J04K70j4j13l24K21j96J20K36k19J81k11L0O3n6l24K12l36N14n0
3713b3J61k41j1n3L12L6j11R5k54J93j11O7J85l76K26J91n14M99l26j10J53L27
3735C15l91m1J1j06M9M32l29j12k24M17K99k91p7K71n61M89j06j40J34L1j43N1
3757b2M30j62k29J26j62j4MJ39k67q5K7K31p8P5R4l46K65j09l18M41j03K99k29
3780GJ30k80J56Q8l9J59K0k47j68M82P4m2l18p4M7l5J42P1k64j47p9K24J61o7
3804AM2J04k95K7Q9L6j33j80N17j50k54L27Q5r8n9j3Q8k3k02N5QP1l8KOl7J87
$$ y = [-136, -2, -340, -130, -100, -97, 3, -43, 97, 97, -74, 292, 62, -70, 312, -100, 44, 326, -1, -15, -32, 169, 59, 138, -84, -177, -304, -451, 34, -69, -26, -288, -14, -189, -138, 89, -254, -146, -80, -51, 189, -242, -133, 5, 272, 98, -246, -131, -27, 243, 229, 116, -208, 13, -183, -63, 173, -46, 135, -76, -46, 17, -39, -363, -151, -487, 27, -23, 138, -103, -114, -167, 145, 181, 70, 165, -89, 104, -7, 60, 245, -131, 95, 286, -228, 271, -55, -165, -12, 315, -76, -117, -106, -212, -163, 269, -60, -172, -396, 21, 320, 29, -48, 223, -338, 151, 45, -95, 39, 70, -73, -22, 408, 246, 17, 143, -19, -33, -29, 110, -157, -242, -215, 16, -62, 13, 107, -239, 26, -83, -401, 40, -63, 236, 7, 137, -143, 13, 101, 62, 221, 241, -6, -174, 308, 382, 340, 22, -52, -5, -40, 102, 173, -91, -238, -317, -93, 68, 1, 43, 147, -148, -121, -32, 4, -129, -309, 208, 58, -196, 131, 216, 118, 59, 46, 134, 111, -91, -36, -28, 43, 5, 7, 13, -24, 163]
3831A63k06k25J55J35q9J54j89j09q2K84J66j14q7J73k16J44K40k03J45O2k58
3852D3L63o2r6l23J18j30M92k86j92L50n68L96j60J62r8k27J59mR7k83P9J14n0
3875a06K12l77J35o3J68K74l4j69qm11M01N42n03j4j63J23M02l90O0M9k10j01
3897a83K88O0j58N5j06K94n14K23k5m2K08j6o6m7mr6J91Rk8L7K24L2J3j89l53
3922a93N2L38J67j98j2l68R3J09P6K18k19o1r0J94m4j5j07JJ10k20K65Ok92M01
3946B11j19j85K96J50j62p2k13N7J9Nj84J72P8n3j72J35q2J81r4k34Q5K17p1K93
3970B58r4m47J70n4J02L09q7j20j8j6K05q8o6J3J08m75M09k6N2j10j07kK2J56
3994I4l24L36l28K25R9j5l75K59K0L08j70j80j31J45J06l1M0K7L8l29L40K48n91
$$ y = [163, -43, -268, -113, 22, -67, 87, -102, -211, -293, -9, 157, 43, -44, 129, -87, 57, 297, 94, 239, 301, 43, 406, 344, 248, -75, 43, -87, 405, 119, -73, 277, -291, 105, -55, 107, 9, -218, -59, -63, 34, -249, -170, -56, -106, 106, -271, -136, -199, -31, 243, 209, 40, 32, -379, 22, 564, 61, 47, -116, 7, 409, 19, 79, 128, -82, -183, 105, 165, 7, 62, -44, 250, -264, -41, -66, -108, 100, 84, 18, -29, -33, -129, 62, 71, 43, 80, 304, 336, 349, 160, -193, -141, 197, 364, 166, 154, -214, -121, -12, 64, 282, 63, 2, -88, 106, 62, 47, -60, -59, 51, -169, 96, 102, -190, 211, 92, -93, 203, 353, 191, 119, -94, -37, -18, -13, -197, -25, 53, 0, -172, -37, -119, 62, -32, -266, -181, 36, -35, 258, 164, -283, -113, -167, -65, 244, 157, 37, 19, 3, 208, 120, 54, 67, 175, -300, 109, 83, 135, 25, -82, -84, -62, 94, -230, 106, -222, 3, 102, 87, -288, -29, -9, 299, 129, -51, -182, -37, 69, 38, 78, 105, 143, -186, 154, 402, -189]
4017a89J85J94p4J30q5J4k30J38o7o0O9kl6K4R7j83n2L4q4J19j7l34L09KN7J56
4043A15q0p8l9M1L00j39L5j99p0p5J31J46j5l25M03j74J56q1K6j5L1l0l57J44
4067a49J69p4J74j5k23K5N5J55L3K7k69M1J32K34k49QO0K0j80Q0K53l48k58K07
4091i2J13j48K91j24m86L28K16m8j18j56J47k31M27k8n6J13j54M1j07K80L4j32
4113A10k56N41m74L12p2j35J94l54P2j71J91j01J79j4O1k85k03J64K37L8j46J45
4135C3j83k21O00l72O4k08L93O9L6K55m52j97L75j65m6j35O9q7J82m0k32J1R5
4158a56J94k3j47O3j05J39j07J4k6J34M4J67j50j91O7J20K7PK01j89n2k48K65
4181D8R0NJ01j56j84o2K84o7Jj98j68L08o8J46j51P7k96J79L82k27j49J08o7%
$$ y = [-189, -4, 190, 116, 246, 161, 175, -55, 83, 16, -44, 25, 23, -13, 11, 108, -75, -127, -93, -177, -58, -75, -409, -100, -98, -41, 115, 35, -43, -82, -41, 259, 120, 155, -44, -114, -189, -58, 88, 73, -252, 151, -23, 133, 52, 78, 63, 94, 64, -293, -149, 20, -54, 120, 105, -118, -93, -38, 117, 150, 177, -92, -51, 81, 315, 66, 74, 134, 154, -26, 54, 307, -41, -299, -92, 21, -127, 164, 40, -446, -118, 98, 50, -68, -224, -77, -308, 119, 91, 35, 148, -6, 35, -72, 208, 242, 110, -146, 395, -79, 233, 161, 26, 220, -134, -62, -233, -42, -143, 36, 22, 83, -202, -405, -241, -4, 34, -112, 33, -150, -371, 229, -143, -79, -287, 106, 175, 211, 466, 14, -183, 192, 27, -19, -154, -85, -172, 10, -30, -262, -251, -156, 38, 15, -132, -69, -174, -35, -142, -128, -154, -20, 24, 191, 41, -150, -83, 37, 64, 71, 272, 83, 31, -217, 48, 138, 143, 244, 88, -96, -158, 126, 59, 60, -138, -306, 2, -66, 80, -71, 6, -290, -111, 271, 44, -105, 3, -64, -64]
4205f4j85K90o1J3J09P6J2l92k1J33J69j7k03j0K84k17K37l29J20j53J77j23m4
4228a99J51n0j87K67m5L6j88J00K46K3J9O8k73J57J26k81K14j22K3k03R7J93k27
4251e5j3J3j01J84j17j5K5lp2J70o9n1rL01j13j04K30k67k5J5j10L73l20J38K26
4276B31j97r7KR8l00L30j2M7j8j79J63j52K14n0j79L3j13J86O3k05j26M1K13J26
4300A19O4k52Q4OK77k89O8K84k40l94L68N9K0r1k34O9Q7J40l4l56R2J84k13l5
4324b17R4J95J67k14j06l4L9k20L69P2j49J82n8k85K14j84L85p3l14K99j75j05
4346a18k4L30l12r0O6J87m9j66J75j26J47pj75n7L25q9K18j04p7J76J16j59k7
4369A60J4Q3l75M27J17l93n6q0K73r7J37m8k28j3j36K25J42q3j02k7J2J36q3l23
$$ y = [-64, -249, 41, -20, -7, 102, 178, 190, -202, -223, -90, 79, 62, -141, -151, 133, -84, 153, -176, -56, -209, -32, -155, -199, -48, -98, -285, -18, -63, -27, -215, -115, 131, 154, 173, 241, -32, 125, 251, -30, 184, 62, 85, -118, -21, 172, -55, -68, -55, -156, 28, -89, -104, -79, -82, -154, 16, -53, -104, -113, 188, 75, -29, 201, -66, -91, -76, -186, 187, -133, 5, 231, 34, -63, -61, 37, -263, 67, 55, 102, 84, -95, 68, -84, 130, 80, -99, -66, -179, 7, 70, -135, -261, -220, -7, 119, 183, -69, 15, 21, 298, 9, 77, 361, 121, -273, 95, 154, 174, 83, -151, -82, 5, 145, 111, -245, -153, 31, -182, -217, -123, 72, 239, 25, -81, -115, -76, -296, 73, 145, -4, 178, 120, -165, 49, -135, 250, 177, -137, 162, -13, -118, -142, 188, -124, -214, -148, 39, -10, -176, -1, -127, 20, 13, -162, -219, 106, 17, 235, 131, 54, 230, 346, 187, 160, 174, 257, -118, 309, 426, 33, -23, -103, 170, 73, 210, 162, -66, -79, -215, 10, 152, 69, -33, -60, -48, 88, 5, -318]
4393c18K62J18L1j00J17qj6QJ09j28O8L7j32L65k28j71L6m6j11L4J25l38o2K12
4417a36M2J55k04r4L07r3k61N32k49j57j27M20J48k72J61l62L32j22K07K6k88
4438c5k45L20m5p0q8J18M9mj09J96K67m36J49j26N8P3n24N37k28K12l9k36R6L01
4462A91l4l49K69j67K68N1kk60Q8k14L66n7k74O7J3K78k27J75j53m9M6n8R1r3
4486c4j35Q6M6k35K39Oj21K26R6j53K58k32N9l20R9L41P6j95j33Q8k71K26J45
4509A62r7K4j71j0j06K7o6J67J49o7mk1Q2q2QR3J08j75J45k43K17O1j1j84J5M5
4535F6N7L4j10K8j96J04l3J52l26J52J68m13L79j74p5R1L23n52K05J12k51K51
4557hQ2K54k08J28j59q9K67Mn17N19k47K24j77o3K75k24j2J98K8j84l82J82K61
$$ y = [-318, -56, 62, 93, -7, 110, 102, 86, 94, 203, 75, 143, 180, 48, 413, 185, 14, 50, 4, -107, -73, 52, -286, -348, -136, -94, 61, -143, -237, 70, -23, -284, 248, -1, -158, -285, 135, 283, 11, 172, -190, 142, 20, 227, 253, -35, -280, 40, -5, -75, -163, -45, 4, 0, -109, 87, 354, -82, 67, -59, -1, 72, -452, 85, -143, 69, 30, -206, -110, 191, 157, -192, 77, -90, 178, 229, 227, -33, 55, -159, 207, 150, -124, -57, -44, 234, 7, 182, 29, -20, 26, -32, 59, -34, -169, -83, -37, -272, -33, -27, -148, 78, 174, 21, 279, 47, 106, -214, -115, 226, 302, 107, -26, 62, -209, 17, 162, 65, 89, -82, -92, -198, -171, -237, -70, 79, 12, 8, -13, 69, -13, -5, 88, 196, 21, 166, -77, 140, 201, 190, 6, 21, 66, 123, 157, 47, 75, -121, -17, -50, 102, -224, -72, 96, -317, 62, -112, -187, -96, 227, -325, -120, -8, -259, -8, 74, 328, 120, 248, 89, 0, 267, 271, -246, 273, 26, 250, 73, 10, 285, 61, 49, 247, 275, 91, -291, -109, 152]
4580A52j7j56j22JL19k9k43j6J36j17J7K88k04j84J96j47L31P5k98O2l64M71j65
4603a4oj49K09M0k87K51J8o4p2j79L59j09j59o6L44r0N2j27J5K40j63R3k36P6
4627b4j02J88j03J89j84RR6k41K69R5j75j74K28l0K31l17q4J50r1K5r3K00l62
4650c00K9L04J10m19K56l5J8J61On6J2j51nJ47j8M5k12N8R6K8l1j41p0K30l7r0
4676f5J11j51k06M07q4n9N5j56k6M1K06Q7j83M3J02k05K87l14J61K67k06k27J78
4699F3m6P5r3K7J30l03J65q1K74l01J76o3k01J61n5Q4J14j13P7l15J57L57l83
4722i4K99j45n5l9R5K15j42L2j28k8j4J45k30j57M25k77R3k82J42LL95P7o28L56
4746E8p4l0L7p0K1k3K13k00J81j15J8j43J6o3J46M7j38K00j4R9k03k08o3J09O9
$$ y = [152, 135, -21, -143, -142, 177, 148, -95, -111, 25, -92, -75, 213, 9, -175, 21, -126, 205, 280, -18, 44, -320, 151, -14, -20, -169, 40, 80, -207, 44, 62, -2, -74, -253, 106, -3, -162, -228, 116, 26, 78, -49, -34, 206, 43, 136, -100, -24, -126, 62, -41, 148, -36, -27, 69, -172, 97, 192, 17, -157, 71, 41, 272, -45, -129, 21, -70, -45, -138, 62, -300, -271, 33, 143, -276, -20, -55, -37, 124, 130, 74, 86, -65, -70, 77, 59, 104, -108, -50, 46, 74, 43, -98, -168, 62, 25, -65, 46, -105, -311, 96, 12, -47, 8, -148, -174, -133, 73, 160, -23, 20, 122, -83, 204, -110, 51, 318, 112, -115, 63, 17, 92, -1, 26, 156, -147, 18, -63, 211, -90, 86, 23, -178, -17, -72, 12, 126, 13, 90, -225, -68, 289, -94, 205, 60, 5, -34, 61, 276, 134, 166, 38, 10, -4, 141, -89, -246, 179, -98, -5, -287, -145, -142, 253, 330, -298, 58, -16, -46, -9, -79, -58, -81, 132, -68, 113, -2, 16, -127, -111, -174, -28, 19, -119, 81, 67, 166, -37, -245, -308, -199, -130]
4771a30N7J92k10J71k08j30J21J80n2p2M3ML20k42j62R8J09n2j4O5l4k23M01l39
4795a07j9J13L85l97k18K94l02L32p9m8q9n3K38n3Q6l56K11j76J94pN2n9l12N11
4819A41l7J17j03q2n7P2l45J40K50p3r9J66J24R6m33J03j83M05l53J38N6k96L05
4842E2k32K26j58N1K34p6o6J08k44K10j06J89m1j9k39K39k66K14n4j95N5J13k0
4865b5%J68n1J13r2k69L08j80j25K53k16K29p4N0j95K52l02K77P6m08J06m7J42
4888a0R3J24j61l10L52J97j09j97N6q7J90q6j44j2Q9K18m24K43L13k68k06K55
4910A16j76J04J47k57K1J62j05R1o4J74J66m71M4J36Nk5J65lm37L53k04j38N4
4933a42K18n09M13j22L13q6j08l46L5M01j37J86l39K21R8j44K14qo8j62lP3K9
$$ y = [-130, -73, 119, -91, 80, -128, -258, -137, 43, -9, -81, -38, -34, 286, 44, -118, -20, 89, 37, 23, 88, 54, -169, 232, -107, -126, -13, 372, -25, -243, 51, -251, 81, 2, -46, -135, -188, 50, -3, 83, -273, -62, -238, -44, -51, 1, -58, -370, 141, 104, 221, 118, 36, -21, 51, -294, -154, 96, 23, -76, 90, 214, 310, -123, -20, -203, 202, -151, -13, 43, -253, 52, -180, 46, -112, -61, 173, 97, 31, 139, -105, 105, -1, 188, 147, 128, -111, 128, -138, 76, 22, -173, -118, -5, -25, -25, 143, 92, 205, 113, -156, 152, -28, -153, 100, -116, 113, 39, 89, -106, 146, -156, 121, 197, -211, -105, -152, -10, 83, 207, 46, -264, 88, 285, 176, -21, 35, -52, 138, 52, -92, -104, -15, 203, -221, 22, 335, 67, -139, 116, -60, 44, 191, -66, -45, 117, 12, 103, 39, 213, 379, -92, -48, 88, 93, 68, 233, 230, -207, 146, -58, -196, -142, 76, -433, -20, -142, 171, 85, -23, -369, -334, 67, -70, 116, -223, -2, 96, -48, 166, 158, 90, -72, -75, -2, 27]
4956B7pJ38k32k02K45M2Mk8k04K30J4j17JJ14k4n5l8m9n4L2J03q0J83M9l26M52
4982B18J04k60j44Q1Q3m31K96J50P8j45n5J34J63j69j57j37L50j79k9K07j08j00
5004e0J47k79L87j37j11o9P1Kr6K51L3J98k19j57J56k17L5J97m5q3k31K10K71
5027B64r2j70jP6j49P9n0m1J70j08L4P2l2N3j38pR8N2P2q3j85K56l7k1m9J43j58
5054D8O1Pk93K9N8Or4L49r3q8k4J08j64k1j23J88j57J39J1Q9m9q1J61r0K17m19
5080b25K82J45k25O8J22m3m40J93J08K88l10k18J46J02k8O1N9r9J97k48K22%k81
5103a24J55J30j70n7J29j42J30q5p9K52Mj15j80J31J65O4k78Q2J58j73k59N09
5125B47k75n4J75L2j37j53J08o1n0J36Mj05j10L19L3K71n02M11j56m7j32Q0j8
$$ y = [27, 20, 158, -74, -276, -31, 11, 15, -13, -217, 13, 27, -90, -89, 25, 1, -54, -92, -141, -195, -163, -60, -140, 43, 92, -234, 218, 322, 62, -82, -1, 82, -349, -53, 97, 175, 30, -25, 109, 272, 103, -54, -191, 159, -20, -49, 158, 50, -50, 97, -182, 205, 68, -43, -112, -41, -39, -135, 116, 149, 347, 128, -29, 127, -90, -55, 142, 97, 14, -217, -7, 264, 172, 2, 1, 77, -72, 7, -43, -84, 86, -22, 12, 84, 52, 105, -33, -40, 58, 110, 182, 99, -86, 170, 133, 112, 63, 206, 48, 109, 116, -177, -148, -90, -84, -178, 171, 78, -10, -34, 74, -90, -111, -234, -46, -203, -64, -53, 36, -13, -94, 67, -23, 194, -225, 57, 202, -23, 45, 167, 124, -316, -123, -15, 273, -37, -255, -109, -7, -35, 26, 85, -14, 183, -65, 157, 157, -124, 31, 161, -9, -66, 63, -79, 51, -34, -113, 139, 143, 28, -152, -21, 144, 208, -70, 12, 170, -3, -262, 247, -28, -82, 93, 125, -12, -165, -57, -118, -168, -32, -28, -133, -243, 76, 109, 380, -122, 289, 133, 86, -46, 34, 16]
5148A6l6J60k70K66j78R7N0j18J67r6J16l22L29j78Rk3o4J33l07K38M2r8L76l53
5172d4J28j62N6J2J11J58l55K00m7n0j01P7n3K38l25J10Q2j90J22Mj06P4j93J95
5196e9J38j38j30K65k93N26m41p0K20l6L6J80J05k20k77M15o9M5l38L72k62J93
5218A62n6k05K44k54K07q6j67J93o0k18L01K77k82l9k10K98J77k55M2P1j46q6
5240i2K47q5J62p0j35N7j76j3J24k75J55L02j20k07R2R6r0J40k95J70Jk08K10
5263a0P2j32J32m0l5J09j09q3N8L7JQ4r6n2J86j13OJ01k51K03k2J09m1k93L24
5288A45j49j6K21l40q0l4L82K5K6lk48k02J26J04J52N3k88J06%J35j89J87k67
5311a54K95J00j42j45P8k37K35j49J59l1r2J44j26K3p8n3K67l35L37j66J03m3
$$ y = [16, -20, 140, -130, 136, -42, 55, 105, -13, 154, 58, 174, -148, 181, 3, 12, -11, -75, 58, -249, -11, 31, -67, 309, -44, 84, -78, -22, -10, 101, 259, -96, 104, 57, 7, -94, -17, -70, 168, -157, -47, 35, -155, -33, -29, -135, -61, -254, -59, 79, -59, -189, 76, -217, 309, -132, -202, 18, -18, 18, 198, 303, 83, -194, 221, 152, 197, -141, 231, -31, 162, 106, -99, 145, -109, 98, 12, -155, 38, -22, -240, 61, 338, 56, 17, -193, 105, 282, 27, 69, 140, -6, -92, 155, 70, 232, 162, 27, 84, -92, -105, 19, -256, -101, 201, 81, -126, -34, 62, -28, 112, -183, -13, -12, -220, -10, 62, -70, 62, 22, -13, 96, -13, -96, -38, -1, 0, 84, -12, -64, 122, 9, 15, 116, -135, 68, 46, 155, 114, -179, 145, -4, -20, 201, -139, -219, -253, 129, 154, 180, 177, -71, -273, -147, -43, 109, 162, -126, -20, -20, 115, -74, 113, -154, 141, 241, 99, -46, 32, -205, 30, -119, 40, 9, -83, 61, -65, -42, -120, -173, 94, -241, 96, -70, 33, -10]
5333a0o8J87j69L83l29J43K5J66m05O9J66k72J52j37L90j81l8k7K00k49m00K59
5355a45M6JR2j17p9%j02J56K02q9J66k16j55o1L22Q5k56J24J16P3j83K06j58J2
5379D0J1K25j20k85Q6O1P6j42j74N6K46j6%mJ07l55J34J42l62K94j22LK70k32
5403f1L13l96J63j27K33j03J63j81K01j29o6o2J42k45J99j87K84n1j24J85j78
5424b7N2o7p2%J55J15j94J99j34L8n9j91M11n82M57J33q8m6k30J21r8J62j05j51
5448b01K60K4j37Q5k02k3J61J20r0k57K70N8j55m3K60O3k14n1j47PJ94j5Rj93
5472b17K20P5q4%N0k01J74J26l53N51j58n0k90J51J57k90Rrp7L00m5k64J46J41
5496F2K72j82o9k6j87J55J46k26mj18J87L6Q9Nl8k11M8J07l9o1N0k55K03ok3J45
$$ y = [-10, -78, 109, -60, 323, -6, 137, 162, 328, -77, -8, 158, -114, 38, -99, 291, 110, 72, 45, 245, -4, -404, -145, -99, -98, -6, -123, -202, -202, -304, -148, 54, -35, 131, -85, -240, -301, 21, 106, -150, -26, 90, 163, -20, 186, 28, 40, 51, 276, 156, -129, -43, 18, 94, -48, -222, -166, 80, 64, 64, 60, 167, -188, -54, 88, -274, 20, -102, -99, 171, -61, 252, -144, 19, -108, 125, 22, 185, 4, 205, 76, 10, -52, 90, -155, 44, -143, 141, 90, -34, 151, -27, 25, -42, -114, -114, 41, 156, -38, 161, 27, 65, 6, -185, 226, -356, 101, 234, 146, 100, -130, -9, -107, 55, -50, -201, 59, 83, -54, 31, -171, -194, -33, 87, -3, -260, 10, 68, -87, -130, 130, 193, -21, -72, -219, -212, -18, -33, -24, -217, 3, 78, -6, -6, 44, -157, 17, 143, -210, 341, 183, 133, -157, -6, 151, -139, -130, -139, -216, 84, 39, -225, -79, 62, 334, 152, 83, 57, -130, 25, 171, -55, -59, -177, 10, 46, 135, 140, 102, -109, -61, 46, 7, -54, -4, -259, -56, -62, -85, 60]
5522F0k3q3L9j78J22J08o8J09j41K52q5q5J71r1j09J34j25k25K74m5K1J28j36
5545B4j42O9q8o7J59M3l9o7J76k01R8j5k53J96O5m4J24j24K3J40j04n0j39R4J92
5570G0P1j0j96k7j09J09J7O1r3L1M3k06L68j42j94K43k9K3Mm7P7k25J03J95k21
5595h4L31l41J42m2J81n5k23J16j3k0P7j66j42J48J24m8L00l05k35L34n9j11L43
5618B52k82N3j16M4Q8q2k4j86K95m78L32J84J08j67o1K32l8j2q8k01K25l6k5K72
5642B89k96J51j88k04J95N1j60pR9Pj26K63j55J0j01L3l9K87r2J18k37Q6K23j35
5666G2J04m3l0j32p2K16k22J92j09nJ59k52K44j73K20j94m5J75o2j07J99k71K02
5689F6j59M5r7K38J62l21J82K4j57J46lJ27p0k67K29Mj23j81K04j47Rp7J91N1
$$ y = [60, 37, -46, -7, -185, -63, 45, -23, 86, -55, 197, 112, 27, 198, 107, -2, 132, 7, -218, 56, 11, 32, 160, 24, -118, -49, -137, -204, -45, -2, -41, -108, 68, -133, -35, -50, -303, -107, -42, -86, 38, -86, -63, 77, -27, -77, -216, -122, 70, 141, 131, -65, -92, -201, -92, -75, -14, -107, -76, -33, -239, 129, -13, -207, 36, 7, 30, 34, -13, 64, -161, -58, 137, -84, 247, -94, 48, 6, 187, 132, -91, 25, 12, -8, 69, -97, -239, -91, 33, -15, 285, -20, -255, 79, 20, -91, 252, -30, 23, -93, -49, 39, -43, -67, -253, 42, -436, -104, 80, 188, 21, -40, 192, 154, 142, 54, -147, 78, 42, 17, 289, -7, 144, -44, -248, -53, -2, -162, -169, -70, -63, -189, 74, -81, -71, -172, -139, -178, 109, 17, 135, -102, -16, 207, 72, 176, 133, 103, -29, -101, 115, -107, 85, -24, -29, 130, -122, 122, -51, 169, -25, -70, 105, 43, -64, 135, -136, 66, -93, -48, -145, 93, 255, -66, 116, 140, -17, 129, 126, 253, 183, -84, 145, 149, 26, -155, 49, -98, -89, -166, 25, 76]
5713G6j45J92j72J66k75N9k2J51j68K34m33K01J63K12k10P1m7k0o3j1k14l9N7
5736b37L25kp8l02L74m2M6j65J62j12k21N0K59j02M8n8o3K70k28J89k66K44j95
5759a04J49K7k5r3J66K0J4k29N4k0k9k8L25l46m4L02r4J41k77jj50k3L62j16j4
5784c3M21m37o8J54M7j01m0J39m5Q0o5j64O1R0J71k48K04n3m08L65r4M7k70J62
5808h5J87k49M09k97J75j1k11j12P0J80p8j89K30n2J30j98J98LQ8n9k58J24J1
5831Fj64K35J41k56L5j02J74L0L7M2l37O4Q9j6J83k07J12j78k0L27k80m4J65K69
5855C05n1l50L04j49q3L63k96k34O2j59K35j1J96r4j49O1k39K48L1L8N8j69j96
5878b79N03k00j35Q9j61J55J94l25qL21j4k97L27l5l79M15l3N0n4j13R7k13K84
$$ y = [76, -69, 123, -49, 117, -158, -99, -121, 30, -138, 96, -337, -136, 27, 239, 29, 100, 53, 33, -30, -41, -255, -294, -237, 88, 86, 8, -294, 80, 38, 84, -81, 81, -31, -252, -202, 57, -45, 3, -55, -118, 152, -76, 113, -153, 91, -104, 45, 72, 47, -46, 120, 140, 154, -75, -21, -41, -70, -98, 227, -119, -163, 139, 45, 186, -91, -92, -242, -265, 97, -19, -33, 388, -49, -117, 37, 84, -17, -57, 82, 37, 117, 52, -112, -51, 39, 210, -38, 166, 113, -295, 70, -24, 23, -247, -85, 102, -147, 262, -35, 140, 129, -82, -194, -124, 56, -22, -211, 19, -33, 97, -101, 97, 100, 188, 129, -129, -5, 6, -158, 77, 218, -38, -3, -105, 69, 99, 136, 178, -159, -95, -6, -22, 161, -46, 66, -112, -132, 195, -85, -129, 36, 305, 254, -96, 208, 59, -24, 339, 43, -191, -129, -288, -53, -64, 132, 38, -111, -50, -289, -41, -10, 28, 86, -83, -279, 224, 24, -111, -22, -183, -28, 166, -159, -167, 154, 140, -157, 170, 135, -244, 171, 138, 188, 134, 21, 118, -95, 189]
5901A89j33j11m6J21J1J45k49J88m41L19R2l0J98k80j25J18lJ41k24j40M16l61
5923b05K87j65J9J65K1m08K72J09m02M25k2o5Jk15J8L79k09p2J04j66Q9j78L26
5946A08l32K41k67J50J12l6J06k01J23M9j18J02O6j1j35k20N37n83K23O0j13L07
5968A68k05k24j2j36M45J55o7p8j98L19m11L83l22M4J59J22k28Q5O9l7J61j67
5990B5J25p7L5j87p4J4j04K04j04R0J23n4o1K07j00k76L96r3j01R9k94K10J27
6013A30n2K6k88L71j41J41k25n0J7J29k9J64j7k39P9K18j29j14n9R4J71Rn8j48
6037@K89m77J59m6j75M00k14j5j4K18l33K93n03M55J29N0m15L27l72L30q7k5J06
6060H0k99L08J53m8k68K29m9j69p7L3r7J62j64K98N8K9j09m49L57j4J59m5q7j13
$$ y = [189, 56, -55, -101, 20, 31, 176, -73, 115, -326, -7, 85, 55, 253, -27, -152, -34, -37, 104, -120, -260, 156, -205, 82, -83, -64, 101, 122, -286, -14, 95, -307, 118, 96, 31, 32, -183, -165, 214, 5, -67, 37, -129, -40, -218, 108, -224, 17, -250, -100, 12, -24, 82, -119, 4, 53, -65, 37, 103, 92, -43, -263, 274, -309, -86, -26, -139, 168, -37, -261, -273, -409, 36, 191, 124, 46, -152, 167, -244, 139, -183, -139, 20, 142, -86, -1, 68, 31, 192, 25, 150, 73, 108, -79, -153, -139, -243, -39, -143, -53, 70, 16, -45, 162, 62, -214, 182, 89, -12, 87, -207, 3, 130, 78, 104, -184, 187, 46, 187, -38, -88, -71, 58, 29, 193, 176, -63, 16, 234, 105, -9, -68, 26, 197, 206, 148, 0, 289, -188, -29, -75, -250, 150, -64, -79, -93, 125, -208, 85, -418, 37, 166, 216, -199, 128, -244, 86, -1, -26, 80, -219, 89, 242, 194, -74, 155, 106, -63, -140, -107, -204, -42, -206, 92, 150, 179, 70, -379, -22, -36, 123, 78, -9, -122]
6084a22J55Q7l06M0J38j56K26J59k64J11n5p3j18J02J03J51o9o8n31M64ql6P7
6107GQ0n2j19J04j24l4M83m92J35J6j1K30Q3l17j80J43J96m1jp5j30L5j27L78
6131A87l4n3j69L4r1J00j00P2Q1j66K55K4j8l03M65l52M8P4j85L16p8j99L1N2
6155iJ08k0j17Jlk15PL39j34j33J03o1J54m9j33KJ1J74NL0j38pl6J16n4k2J43
6182F2j3M8j67L01j3n11M31j78K30l85J24J72l89L35j48rK31r3j27%j79K39r6
6205a35K47k40r3L69k24Q6J1P7J8k71J41K67o7p9j46J31k88J79J70o8k60J64k1
6228c2N9j79PL78k32m5J7j32J76j36k5J48n6p5kK61k93%J56J02J09k55JJ77K45
6253C74p37N47j14k00L34q4k21Q9J18j69K28j41k20J99l2P9M4k2j78j97L09J24
$$ y = [-122, 33, 120, -186, -146, -8, -164, 62, 221, -43, 68, 13, -60, -178, -76, 27, 178, 109, 41, -490, -26, -34, -70, 7, 87, 35, -84, 20, -104, -138, 345, -147, -12, 4, -7, 223, 306, -11, -191, -48, 148, 107, 106, 31, -99, -64, -191, 187, 153, 100, -69, -35, -126, -26, -126, -54, 27, -139, 116, 140, 122, -181, 284, -68, -20, 54, -131, 185, 107, -92, -61, -9, 99, 79, -38, -37, -40, -255, -248, 91, -43, -176, -73, -134, 20, -29, -162, -160, -149, 25, 30, 60, -78, -85, -121, -5, -59, -81, 62, 49, 97, -70, 231, 218, -293, 138, -40, 190, -195, -71, 101, -288, 47, -101, -110, 121, 28, -99, -99, -278, -39, -135, 112, -128, -221, 148, -76, 10, 21, 98, 116, -155, -14, 253, 186, 107, -39, 92, -196, -17, 153, 85, -175, -11, -32, 27, -152, -145, 233, 1, -44, -27, -159, 17, -119, -144, 4, -52, -127, -129, 132, -161, -161, -5, 97, 206, -49, -48, 129, 374, -363, 184, 70, -130, 204, 120, -101, -12, 106, -63, 165, 24, -196, 3, -29, 50, 94, 72, -106, -303, 6, 130]
6275A30P7j43k62M41k4k41R2k04J08L9K74M8l49o9J56o8q6N2K82k23J98k20j12
6298a04j10O2J38o9K68k75K08jl63L68J10j38k12P1J40k89K18j34M5o3K48p3k91
6321b46K68p7k17K63P3o2M0M2k85mM29k03k32J32l7M5J89j64K6J40k33OR4j80
6345a93M13K97m73N5j08J88o5n3K8Q0j57k20J24k48K47M8J41l54M23r3j3JnJ42
6369B05q6K58l09j10k11J93J64o8k55R0N2r6L81j2j51L05l60J25j03k50J70J9
6391d9N3M4l75L78q1M8l5P2J48l65K52j44J02k35K03M0L5k37K79p7l4O9P4l49
6415a84K08M7J14l81J59J89k68k0J63J21l7O7m9k73M3R0j35L03K1Qj97q2J34J44
6439A85n6n8P1j26j35K20J4j8j85P7L00k43j41J88k90N51n32L15j04L4j22M1p0
$$ y = [130, 207, 64, -198, 243, 219, -22, 70, -134, -26, 13, 287, 335, -14, -83, 73, 5, -81, -29, 253, 30, 228, 8, -104, -214, -152, -14, -83, 185, -90, 118, 117, -246, 122, 232, 94, -118, -47, 93, -196, 22, -112, -67, -130, 118, 45, -246, 22, -55, -272, -9, 64, 2, 42, 84, -201, -205, 224, 21, -211, -79, -116, -71, 118, -46, -20, 120, -113, -107, -13, -193, 220, 517, 44, 99, -9, 179, 114, 61, 89, 169, 12, -208, -84, -332, -85, -37, 104, -250, 173, 80, 67, 68, 63, 205, 119, 377, 68, -42, -253, -60, 104, 36, -219, -129, -77, -173, 208, 196, 45, 350, -10, 115, 12, -238, -68, -49, 4, 48, -327, 51, -30, 18, -17, 55, 203, -162, 90, -54, 48, -187, 16, 56, 91, -146, 133, 56, 22, 91, 165, -184, 24, 71, 185, -196, -37, 152, -116, -136, 27, 148, 111, 178, 129, -144, -101, -11, -146, 157, 178, 186, -11, -93, 41, 185, 129, 71, 142, 16, -119, 101, 115, 97, -88, -11, 289, 46, -95, 93, -197, 354, -178, 137, 33, 67, -55, -14, -84]
6462h4K11l76J76J81J27j26k04K63j34M9p9o8o9K82k33J39J67j85j23K38k54L14
6484B12k11j44J2J09M4R4k25K10J6r3K6k69j0L57m0J58j78j78J11J03J57k53M9
6507E7l12L86l12K47j79Q9q6J4j01K87k69K97k34n9K59n6L1j72L91m50J05p0K53
6530A16j06k7j9P3o4k49K42K04k03Lp8j3M2J77j29mQ7k52J17R6P0j39Pp9J9M5
6556f4n0j6O3L78l03QJ03L7lj00q7R0j1j78K93k61K07m9pp4J29j87K37k09o2j25
6582b41J72Qp9P7J68n0n0K1n9P0j02L13l19m1J7L02j06J60l34PM9l6K96l55K48
6607A36k92J3K24p2L69m88O3j11J75K5N6j37o9K06J6l18R3K41o1k80L01j66k5
6630a01J6j13J68m6J84j70j88K92Q9j92M0K19k43J30j53O0LK85k95J56m4k64K5
$$ y = [-84, 127, -249, -73, 108, 235, 109, -95, 168, 34, 83, 4, -64, -133, 149, -84, 55, 222, 37, -86, 152, -102, 212, 1, -143, -131, -22, 22, 116, -109, 101, 117, 24, 50, -219, -229, 128, 88, 246, 68, -110, 1, 104, 261, 8, 57, -255, 131, -181, 66, -113, -24, -110, -96, -197, 90, -179, 118, -116, -175, 84, 28, 59, -113, 278, -172, -67, -137, 116, 10, -17, -36, 37, -27, -276, -34, 170, -33, -30, -108, -121, -79, 98, -31, -35, 52, -200, -83, 13, 83, -56, -49, -128, -109, -64, -114, -130, -67, 311, 8, 16, 119, 156, 153, 53, -34, 56, 45, -133, 160, -101, 106, 57, 50, -24, 105, -82, 155, -54, -116, -241, -69, -61, -140, -63, 105, 55, 5, 26, -33, 37, -65, 248, -71, -112, -95, 207, 101, 261, -73, -66, -17, -53, 243, -112, 136, -156, -143, 81, 9, 378, -110, -47, -158, 17, 42, 98, -39, -108, 98, 114, -204, -111, 130, 69, -211, 90, -76, -101, -85, -198, -30, -76, 108, -62, -250, 42, 131, -61, -21, 198, -45, 85, -68, -8, -5, 280, -15, 141, 97, -167, -142]
6653a42J70R8rp8k12K50j28Q9o9M60n36j02L62J9l90K93j51J04K8J36k68j5J61
6676G0k91M10l64j9l1K03j79J12J41q7k9J64Q4k34N3J02j59l26K00L38j67J38
6698A29j99J20n1J05q3k71L01J57j89K42m88J67J25J64j31J71n6l13J92j66Nj47
6720b16M7J74O5J53j44k06O2J27n3q8jJ08j32K07j77J29k42K21J7m6J42r3p8p1
6744i5J29o2L9k07J18J43j9l83N46k03J72j86J90k08j77R2J38K79l37J34k28K97
6766A72j5j50J97k20J04k37L23m5N6k66J9J03j98J42j07M3n3K38k37J69j1O8j91
6789i6J90j78J24k43K11m7j01N2K04j9l82L68k38J87k10K00j24K36o6J64m29J65
6811c2J3O3j73P8k5J50l71L76k17J2K02k16k01J11J91j38K95k88K46M3k78L41
$$ y = [-142, 28, 126, 117, 39, -173, 77, -51, 38, -31, 429, -107, -209, 153, 172, -218, 75, -76, 28, 56, 192, -76, -91, 70, -221, 189, -175, -194, -225, -22, -201, -89, 52, -35, -64, 100, 184, -50, 3, 105, -54, -380, -180, 158, -9, 129, -70, 50, -1, 104, 21, -250, 51, 208, 19, 261, -227, -60, 65, 229, 98, 269, 213, -100, 92, -74, -69, -216, -169, 5, 70, 223, 79, -127, -65, 62, 9, -79, -80, 28, -104, 103, -74, 55, -187, 34, 51, 5, 147, 54, -24, -95, 34, -28, 11, -196, -78, 65, 46, -337, 209, 6, 178, -8, 182, -26, -203, -111, 27, 306, -31, 103, -125, 172, 157, 7, 204, -16, 88, -149, 174, 129, 185, -81, -62, 41, -157, -15, -122, -79, -132, 106, -131, 38, 27, 95, -96, 94, -84, 40, -203, 8, -39, -140, -88, 116, 97, -285, 83, -155, 32, -178, 22, -102, 134, 68, 232, -197, -32, -19, 44, -129, -51, -76, 74, -297, 79, -138, -126, 76, -140, -341, -230, -39, -177, 118, -170, 76, 119, -159, 182]
6833A82k04L5r4j11L97j74L3r7k11K15j18m4J97m9O0j5P7L37k70Qj9k03N8k8O0
6858B2j10J9j01J34J40l0K79l15j91Q6l9K4R0J26l52M17j41j0k79j8K22L5n9M4
6882gQ0j31j85K76k01L02j45qK19j64k32J76KL96k93j03j06J2K00k81K80q8j40
6905a41J76J25p2K57m09j31J20j31r6J90J73p1j51N4K87j08Q6L6j48j52J73k8
6927C9N0J67M8k84l2K01j8o7j58L21k08j03l2j6J42j04j54L24J17p2r2l0o5N6
6951C0l5k0J6J1J65j47k83L83k51M27L0j16k17K87m08N0J63m03M85k71j26L27
6973I7j97K08J38m79K90r5L7j04J12l8O9k21J05J44j39J22j00Q6j31M5J0j8O0
6996AM6J22j33j65J57k0j68J15R5oQj17j23J96J12k32P8k3Mk54L28n5%P7O6k46
$$ y = [182, -22, 13, -81, -192, 205, 31, 64, -33, -244, -29, -147, -191, 6, -43, 17, 2, 79, 416, 146, 154, 135, -68, -10, -38, 22, -88, -69, -170, -36, 104, 74, 353, 38, -153, -67, -106, -82, 8, 134, -218, 199, 58, 48, -231, -249, -27, 8, -51, -7, 73, -58, -243, 33, -168, 134, -11, -19, 200, 36, -196, -20, -18, 378, 85, -18, -124, -112, 88, -193, 87, -1, -141, 35, 160, 88, 345, -64, -195, -75, -206, -302, -112, 61, -10, -161, -107, 180, 72, 158, 194, 46, -106, 67, 39, 89, 256, 304, 20, -12, 189, 171, 104, -54, 267, 59, -44, -76, -92, 50, -54, -208, 116, 233, 161, 69, 39, -26, 30, -5, -25, -9, 2, 167, 20, -263, 120, -131, 296, 326, 210, -7, 280, -128, -78, 85, -318, 167, -104, -230, 97, -100, 108, 246, -233, 57, -38, -1, -105, 7, -31, 38, -183, -78, 66, -73, 49, -51, 35, -96, -51, -41, -59, 1, 47, 169, 36, -129, 28, 8, -160, -45, 50, 44, 52, -65, -188, 8, 120, -112, -34, -57, -53, -307, 21, -34, -34, 43, 109, -137]
7022a37k9J98J72j90N1R0l92M25n08L67k38L82m20Q0r5J32J15Qj73O7O0K07J25
7045B97k54k1mq8L1O6j38P8k1J59k65l5J65J31l7j10L6j19P0P3l76L37n3n7P5
7070f0K7J91J5j51j18q4R6Oj0j46K38Oj57J37l9P1k07K84K7j82K55l54K25K2j30
7095c8K7m4M8m4P9J55r0j76K66j07l56K51Q1o8k05L81k40j10Q4K60r7J42l81P4
7119a08K25Q2j44k42M36m1J0M4k56j98J17J98k59J62Q7j59K1j5K45p9j93r6K57
7142I4k27J33N2l01K41j11OL08l41J99j83J6K79m3Q3Kj25o1j9J85j56P2k32Qj71
7167b92K6J46P6Q3j5l2jJ90l03K1J1J03K9j29K23o7pJ8K6o6n5J18j54m2J77k74
7193a90M55k48j54R3q8L38l11Q8j56j53K12O3j5m7J45j48K79j88k76J49RJ79O6
$$ y = [-137, -166, 32, 204, 14, 65, 155, -237, 188, -320, 47, -191, 191, -229, -149, -244, -112, 3, 11, -162, -95, -35, 172, 297, 43, 22, 18, -70, -39, 27, -111, -33, -54, 105, -160, -195, -30, 101, 64, -46, -10, -129, -59, 14, -362, -25, -78, -135, -60, -33, 158, 173, 22, -96, -180, -84, -78, -88, -234, 4, 10, -147, -10, -49, 22, -185, 99, 126, -56, 199, -155, 70, 92, -38, -11, -55, -7, -51, 28, 183, 93, -83, 183, 76, -280, -29, 52, -16, -221, 160, -80, -190, -106, 154, 57, 199, -182, -108, 117, 199, 55, -187, 249, 208, 218, 262, 6, -192, -75, 123, -136, 26, 113, -46, -25, -40, 205, 126, -67, -163, 94, -133, 0, 52, -249, -8, -119, -113, 195, -146, 53, -130, -114, 165, 122, 205, 207, 82, 21, 2, 187, 31, 103, -129, -121, -292, -266, -120, -44, 39, 24, -8, -9, 181, -122, -101, -90, 13, 42, -87, 136, 69, 62, 80, 106, 40, -15, 103, -51, -93, 84, -190, 265, 17, -137, -44, -132, 206, -105, -17, -173, -326, -114, -51, -66, -113, 32, -116, 163, -25, -301, -152, -143, 36, 102]
7216A02k00q5K46on3Mk3O2P6J1r5k8p4R6l88O15m12L16k55K15m6j32L30k69K5
7241C2j63J77k68n3J6M07M4r9Rj88j49M66l52q7J05K7n1K95q1mj38Q9k60O1K50
7266H5q0K2l1PL3N3k85L89K4k93k3J22j28PO3M0K5J82k43K24j58j63J17O3R0K3
7292A65J1k44L37l55J97l12R5K5k1J95j41p8J6J24oo1R7k30L33P4k45l3N3k41
7316b45N2M70K8l53K7J84j27o4J72j84j45L58L5k00m4l7K4K66k03Rq5r0J75n9
7340c6k09J37K54j59J8k8O2j35J4K85l22K07j02R0r6J6J6m8j19J32k17L03J14
7363A77j25j78K3K44j31p6j03M86j70j00l1p1k80L53o2m4J09J06j50J93j43R8
7385A25o0j09K76m09K80j53J94j60L2n9j18L4r7K98MR1l06K25j09K74k28J77j52
$$ y = [102, -98, -183, 63, 57, 4, 8, -15, 47, 123, 134, 39, 11, -63, 33, -355, 260, -152, 164, -91, 124, 78, -54, 276, 7, 32, -131, 46, -222, -275, -259, 148, 192, 93, 102, -86, -235, 231, -121, -208, -103, -76, -127, 168, 87, 83, -55, 34, -226, -165, 85, 5, 27, -4, 3, 36, 89, -196, 193, 217, -76, -99, 23, -105, -98, -35, 5, 30, 212, -31, 193, 35, -128, -11, 52, 142, 165, 176, -68, 269, -86, 111, -201, -106, -81, -102, 93, -48, -126, -110, 14, 8, -53, 44, -186, 147, 221, -24, -57, -4, -245, -193, 277, 305, -48, -21, 163, 36, -28, 144, -40, -185, 173, 208, 8, -36, -73, -49, 217, 14, 23, -62, -152, 23, -36, -245, -108, 146, -13, 5, -23, 39, -96, -82, 203, -119, 88, -14, 76, -20, -4, 12, -36, -155, -23, -240, 63, 177, 52, -126, -103, 141, 10, -66, -169, 317, 147, 47, 16, -55, -335, 18, -44, -88, 21, 127, -23, 170, 27, 125, 65, -44, 232, -177, 103, -50, 144, -16, 16, -43, -161, -127, -224, 74, 78, 169, -137, 88, -21, 253, 25, 202, 50]
7408E0k74J91J96j80n9o6J2J56j26J40q0p8O6L3j60J31lK44j31q4J43k4pj88J36
7433C8j80J87j72J51n5K22k13K9l69K16J28N2J87l30K61k93K78m3K2k68J96j28
7455h4o3L92n91N46l30j6J22K11k66K35k14J27J45k37J75k9n7k51J23o4P8j54
7477b02L8J83J70j08m8kJ39k31l4L08p2n4o5j69K26r8N5J5L6oj8M4r6L22l90j36
7503a93J25Q3P2p0O0l9N3j12p2J5M65m52P5j53R5qJ8j39J98J13N0l14P4rP8J6
7529B9Q3k35K05l41K8M09M1k59J09J29m70M37n6Jj6k01Km9O4J56k80K39k91K90
7553B4jl6N9p6k09J81j19L9j17Q4J61J2L00j90k57K53N1l90J39j5M33k62k35L21
7577A50k80K15L2j23K7l25Q3J85K30P9l65k20M39j10QJ22q9r8P5L6m3L8j20j60
$$ y = [50, -224, -33, 163, -17, -76, -142, -130, 26, -100, 40, -40, -118, -52, -19, -179, -48, -51, 193, 62, -22, 121, 97, 90, -98, 38, -142, 45, -127, 24, -31, 191, -22, 7, -362, -146, -18, 34, 221, -109, 152, -141, 137, 94, 116, -152, 44, -84, -147, 245, -346, 200, -130, -146, -24, 187, -79, 156, -58, 69, 214, -23, 152, 123, 66, -185, -62, -126, -48, -202, -164, 19, 189, 81, 33, 31, 170, -61, -95, 213, 141, 87, 22, -147, 79, -19, 36, 51, 87, 81, 63, 107, 11, 333, -57, -193, -68, 15, 87, 17, 77, 38, 91, -21, -93, -78, 387, -65, 10, -143, -48, -56, -38, -177, 21, 134, 184, -130, -56, -65, 13, 29, 112, -123, 82, -259, -231, 178, 219, -40, 69, 198, -272, 165, 109, 110, 94, -107, -105, -154, -90, 66, -214, 25, -266, 24, 23, -13, 46, -30, -239, -58, -177, -138, -255, -171, -10, 2, 302, 112, -145, 108, 159, -231, -92, -107, 326, 64, -171, 150, -130, 85, 117, -6, 21, -304, -221, -36, 194, 273, -92, -312, 127, 17, 25, 147, 58, -40, 35, 71, 28, 66, -54, -214]
7601b14R9P2p6O1J21p9J60q5p5K3O7M5j92K20o6K5p3j15J09M1k02K62k21R8J3
7626A8k22oL13r4j01N6L33m93J93J11J10l13K30j55j85J93P1J18m0j01j79O1L85
7649C03k61j67L01j83j46M2K72m17K88n5k17J76J31k46M13o7m7o0j8J06j6j68
7671c6J52j92K92o4j26M0j51L08j25k35o8J21j41J67N6j86K33r0j6J10J47j12
7693H4P9k34j11J55j26K06l3r8j6O5L2J74k11r2R7O6k41O1K59oj29km0R6n1J93
7719A77kj16J05j69J24j63J35j34k9j1K97nj03j6j3j08Q7j77M9P7p1j5L17k35
7743AOj8L3o9N0Q0j26J62J36k33QJ34j47J14o0j25J87k51J57K2j16o0L40k46M3
7768B2j77PJ55J29J01k27J80J9n5J4j53ro4Q7k53J84j98K00J57o2L4o1k08J46
$$ y = [-214, -115, -43, -119, -58, 63, -16, 144, 59, -16, 7, 74, 119, -73, 147, 81, 106, 33, -82, 27, 68, -134, 128, -93, 5, 18, -204, -210, 103, 9, -92, -36, 297, -196, -3, 108, 218, -95, 135, -20, -205, -12, 59, 177, 137, 36, -143, -82, 303, 42, -125, 176, -7, -153, -111, 161, -256, 32, -23, -240, -64, 67, -179, 234, 167, 120, 60, 42, 148, 132, -36, 116, -76, 216, 152, 26, 66, -85, 223, 98, -137, -205, -84, -225, -58, -2, -188, 45, -45, -61, 49, 196, 84, 163, -71, -182, -27, -153, 53, 20, -78, -94, -29, 3, 177, -34, -126, -29, 37, -204, -143, 116, 110, -19, -21, -61, 35, -16, 177, 175, 59, 164, -5, 119, -44, 91, -43, -72, -83, 214, 209, 106, 90, 77, -31, 56, -121, -72, 5, -66, -81, 236, 1, 7, -11, 22, -47, 3, 83, -43, 119, 255, 22, 30, 164, 17, 131, 71, -54, 133, -118, 39, 61, -55, -115, 225, -21, 22, -155, -148, 7, 136, 237, 10, 190, 209, 154, 168, 15, 6, -58, 29, -224, -40, -238, -38, 119, 57, 91, 30, -178, -32]
7792c2J63m14K98l47L31J01p5m0J58k39nL48J08k68j26p9k2J23j0j77K51L6K8
7815A11J2j59j88J18J33J6k25K18o1j19R4K92m02K78r9l4q0q9Q1K42l9l55M44
7838A89j31O6m20M45j59J25j09o7J31on1L1o2k03N0L3O5j13j7L82k40j35J31r9
7862a64J43Q0nj44J79k5p3p8M5J09n9jL8j57n5L18l72L8L57J55m47K14m57L18
7886d3%o9J35r6J54k77K95j82K39j17K11j02l1k70N0j8L10j23j25K2J36L9q1o0
7910cp4J72l06q9N25k67j67L22j60L1K2P8j33K5k2J3N2o1n9Rj12K46k0m7p4K73
7936A74j60P0nK6j67j0j08n9N3J66j40N7K17r9R1j97j10J08J5Q0j61M3N2K93j83
7961D6m2r6j77J02Q4J79j74J13l81K71L59k02m88L88j8R5m7J07j87Q8J21j35R3
$$ y = [-32, 131, -283, 15, -332, -1, 100, 25, -15, 143, -96, -101, 247, 355, 87, -39, -118, -140, -17, -27, -204, 47, 83, 111, 123, -36, -224, -106, 27, 43, -182, 36, -25, -144, -50, 242, -160, 118, 19, -15, -95, -184, -103, 139, 100, -255, 189, 58, 124, -296, 149, -10, 115, 6, -61, 70, 64, 13, 44, -18, -221, -171, -138, -73, -186, -203, 179, -61, -196, -65, -164, -21, 59, 54, -90, 89, 64, -9, -87, -42, 67, 8, 7, 45, -112, -167, 151, -221, -183, 174, 329, -118, 96, -361, -43, -43, -112, 23, -73, 81, -196, 99, -83, 156, 39, 250, 148, 117, -153, -103, -121, 189, 66, -59, -37, 99, 138, 57, -3, -77, 95, -211, -300, 225, -42, -209, 113, -47, -16, 6, 84, -49, -24, -46, -33, 19, -42, -101, -92, -204, 42, 22, -25, -99, 174, 14, 84, 79, 105, -62, -72, -180, -239, -186, -20, -160, -103, 114, 15, 106, -91, -201, -93, -78, 2, -159, -116, -64, 229, 46, 4, -92, -269, -167, -83, 96, -78, 35, -346, -75, 284, 82, -406, -18, -36, 59, 12, 119, -68, 20, 141, 6, 99]
7984I9RJ6l43L2n5L2K30k01J02O8J28j49J32j58j0o5o5M68j76j26j30L8K3n0J72
8009B1L03k83j05m1Q5K8M0K1o9O0j08K42k72K61k44P0m5M8L4%J11j68l2m4J84
8034I7m7o5%J06k17K50k56k3L2K02n8j85K61o2l2J25j85jJ41k47K36L3j02J57
8058A60r6r4k22J07R7o6K43k28M8L36k49p6O6j96R8K72l17N6R3j50J45p3j62L25
8082A17j25K05j04j85J67J99k42O6k22j7K98j70nJ84j79L22r2k26J20m18M20j33
8104b0r8o0L8M32k63J12N8j58p5j53K8L78j32j2n5kn4J00k43J73r9K89L3l78J76
8129A5K65k77l7l42L42P7j19J4k1J10j81J91l0k16J08j62M02m8k32K81p5J79j78
8152F6m1J46l00n5M24l51l6PK14N5o3k62L95k05j36LJ39m5R4k6j91L02M8l25K99
$$ y = [99, 108, 124, -219, -187, -242, -210, 20, -181, -79, -11, 117, -32, 100, -58, -68, -133, -198, 270, 94, -32, -162, -124, -101, -151, 21, 324, 41, -64, -105, -20, 8, 48, 69, 0, 60, -48, 194, -78, 183, -61, 9, -36, 12, 46, 46, 157, -11, -43, -87, 97, 50, -15, -15, 91, -126, 124, -132, -155, -123, 79, 21, -164, 97, 35, 3, 128, -57, -58, 83, -164, 72, 105, 3, 160, 64, -30, -252, -145, -48, -114, 129, -99, -51, 285, 36, -40, 26, -170, -72, 200, -117, -61, 32, -118, 27, -46, -208, 117, -8, 197, 93, -92, 75, 274, 32, 98, -124, -141, 157, -13, -18, 166, -13, 309, 217, -9, 111, -307, 113, -20, -118, -178, -140, 292, 29, 141, 199, 41, -34, -187, -159, 219, 87, 75, 20, 18, -36, 64, -179, -6, -105, 184, 217, -161, 15, 280, 3, -34, -376, -34, 43, -76, -62, -83, 27, -154, 37, 7, -209, -101, -263, 139, 91, -141, 140, 65, 244, 66, 25, 171, -129, -184, 240, -111, -147, -140, 74, 129, 66, -196, 199, -6, -142, -139, 0, -45, 49, 23, -168, 134, 182, -143, 156]
8177A56k18K21n0j97K39k14J02N0M7j48MM6R6r4
$$ y = [156, -62, 159, 109, -88, 151, -63, 39, 89, 136, -12, -8, 38, 134, 40]
8191D0
$$ Imaginary data points
##PAGE= N=2
##DATA TABLE= (X++(I..I)), XYDATA
0@%%%%%%%%%%%%%%JrJ6j6J6j6K4l2L2m0M8n6O6p4Q8j02J15j30J49j68J87k11K37
37A25k64K94l28L68m10M52n01N55o11O73p43Q19r04R98j097J208j333J473j634
56h60J815k021K264k551K896l325L868m574N546o974R264j3523K3971r4625j22379
71b01208K38533N3649r2691M5149K5067j13617K6956J05538m1328p9644K9645
82c951J8478j7242O964Q018j3686N552J0946j3372k9104J3153L8667j7492l7687
95c0756K9788J8605l2241J5155L4268l8976j9486M9548L328m2540R144K0827Q32
108A7496N605k7386l0402L7567K5703k8060O29L31m3465R732O1950o188m8206
121b4694M46J5027K091J5501R643j1253j9922j8249J7881L3758j0850j7066J2272
$$ y = [0, 0, 0, 0, 0, 0, 0, 0, 0, 0, 0, 0, 0, 0, 0, 1, -8, 8, -8, 8, -8, 16, -16, 16, -24, 24, -32, 34, -40, 48, -54, 61, -69, 80, -88, 99, -112, 125, -139, 155, -173, 195, -215, 237, -264, 291, -320, 353, -390, 429, -475, 523, -574, 634, -699, 774, -860, 955, -1066, 1198, -1353, 1543, -1782, 2086, -2488, 3058, -3916, 5348, -8175, 15796, -78829, -201208, 37325, 90974, -1717, 43432, 68499, -45118, -18162, 87376, 46048, -33596, -3951, 14527, -2715, 4249, 12267, -1419, 4133, 15079, 1707, -27397, -14244, 24423, 6931, -30756, -968, 17637, -14604, 551, 34819, -4157, -23643, 25905, 29233, -13307, -4163, 16664, 17496, 23101, -4285, -34687, 2880, 28583, 523, 1152, 1483, -41982, -32250, 29700, 23512, -24694, -24248, -9221, -7130, 8371, 18014, 6761, -13161, -31410, -13529, 20229, 9379, -7687, 4585]
134D585j0519j0000L5270P544l4615L649J3486k5890N371L2977j9195j8421K3858
147H100n319k1589J9893J5084j6560p522O90j970L734K660N82N434m521n753J3332
162F275L767j2176J0480P348k5231r196J2137l443N712J3791j5723j5769J6970
175e058J4980J626J819r387r734R346M827k686R640l540j7851O534O272j0807
189d019J1264J2334k1547j5212J0774N543M947O604j3986j4047J2210R609n25
202C949O345o706j4686R636R798o222L126L993o090j092K501n453K830N828q617
217h60q770K032k927J81J0631n94q412J270K26J476P338j016k246J595p629m094
233a1799J4195P587p061K13o07q506P907J4645p594j0243l9o741K214J3892k885
$$ y = [4585, -5934, -15934, 19336, 26880, -7735, -4086, 9400, -16490, -11119, 21858, 2663, -15758, 8100, 2781, -18808, 1085, 16169, -391, -7913, -7223, -9193, -5459, -2799, -2217, 3217, -1304, -7057, 6275, 10042, -2134, 8346, 15694, -9537, -18733, -6596, -10039, -4327, 9464, -6259, -22028, -5058, 9922, 11548, 13367, 3980, -5754, 3592, 8419, 5733, 15373, 11833, -6018, 516, 6788, -4019, 7245, 19579, -1968, -17180, -6406, -863, 4084, 10688, -3298, -17345, -5135, 4474, 3949, 10294, 3588, -11098, -1462, 8336, 2114, 5240, 9233, 3143, 2051, 4552, -901, 1929, 7757, -860, -9630, -7598, -10525, -10344, 287, -307, -8719, -7449, -7223, -5747, 1591, 575, -1671, -76, -7705, -11799, 2396, 9983, 2922, 3135, 2528, -5978, 1929, 16574, 8980, -1263, -1302, -8043, -5829, 8063, 5178]
248E178q527K209k146j981J0219M027j0096k733J673m432M044P584k806k698Q67
263C82k392L288N096k491p16M49o164j323M915N98p48L391l568o020L532M159
279B388j41L427m826j0444M014P249o20L097%r694j751Q646L540k621k892n451
295f079l243N831L906o00J582l068l392O182L703k140N60K69l418j146J687J156
311A790K113P48k864k164Q50o47R63M012l509p432o93K005K657L576j607k694
327b896k048P59M968M514j649n006j576K138K460L346J615l515k327N21M89K643
343D436R03m972k280J27k060J064L021k92l707o87J807n79R54J791j576p13N08
360b255o17K306M066J642o32j618j540m24K607K444l042n713j128J121K609L568
$$ y = [5178, -3349, -1140, -3286, -5267, 4952, 8979, -1117, -3850, -2177, -6609, -2565, 5019, 2213, -485, 382, -2010, 1278, 6374, 3883, 3167, 3616, -2548, -3871, 1044, 1642, 894, 4285, 717, -5303, -1771, 2388, 2247, 5674, 848, -9596, -5582, 1667, 1047, 4144, 4144, -5550, -7301, 1345, 4885, 2264, -628, -6079, -9322, -3491, 415, -185, 1397, -1671, -5063, 1119, 4822, 2682, 3242, 3511, 93, -1053, 634, 1790, 3903, 4651, 1787, -377, 473, -174, 789, 4801, 1292, -6140, -6833, -4828, -2171, 1405, -202, -2896, -4944, -4185, 783, 5297, 3648, -1358, -2934, -796, 1664, 5010, 6625, 3110, 783, 1304, 1793, 4436, 5339, 367, -1913, -1786, -3846, -2782, 239, -53, -3760, -4447, -2640, -3219, -2265, -474, -2050, -2763, -2255, -2872, -566, 3500, 5142, 4510, 2892, 1352, 928, 3535, 5979, 2937, -2776, -3904, -2783, -174, 3394]
376C394o08l763j917J353K237R28p75m099l946Q35K490J296K893j146k817K236
392a409L590J431N82j447k775j195K285j60j906O44J084l32m77o16K90L040M73
409C102k038j611j454J328L649J398k382l451k96K384K828K47k626j244n76p68
425a510L520L071l775k158Q57q86J114K357j710k325K28M55J115K565j33k779
441FK342J525m925o25K800j900o55r53m516O8M980J615j160k146l497J377O207
458E43l54n173L95J492q06L979L176j483J904J065k402J115J857j351o11k265
474A081n925l58P238N02m908j295R76J593N059j445n276R75J724N82J358l420
490a539l217O248M599m769l109K598J578K990J890n862l920M405K037L02M6n189
$$ y = [3394, 2786, -977, -2894, -1541, 696, 1624, 849, -3250, -7196, -6361, -3871, -2575, 318, -828, -3645, -1409, 2181, 3612, 4194, 2747, -28, -1223, 1062, 902, -1004, -360, 724, 392, -85, -701, -411, 2629, 3102, 1064, -547, -2001, -673, 2976, 4374, 1992, -1459, -1755, 629, 3457, 3704, 1078, -166, -742, -1510, 2010, 5081, 1306, -852, 5, -881, 233, 2590, 880, -1445, -1217, -762, 353, 2918, 2785, 6, 2348, 3873, -1052, -1677, 1123, -777, -1432, -2385, -6901, -6833, -1853, -238, -1398, -3544, -7041, -5664, 543, 189, -4984, -4589, -3097, -3903, 76, 3252, 1769, 3673, 4738, 2336, 3451, 5308, 3957, 3346, 1081, -4844, -5202, 2036, 2538, -2370, -3665, -2689, -1096, 3963, 2518, -2758, -1783, -59, 523, 1881, -1539, -4756, 1492, 6091, 1322, -1787, 811, 2389, 5379, 7269, 1407, -2513, 1892, 3929, 4231, 4277, -912]
506i12k699M538m7k680J864j084l231M19J954M83L107m88o442J157M499r82K488
523A944J383p675J56Q754Q14l142Q45j546o27L566j379m846J469l05l085K895
539g79o69n399M440N612n029j514K654l002R58M330k525l122J549l2N13N862r4
556C753n414J432J139j368L347k44o128K35J461k69L118R99m243J396M312j834
572A692j646L572m39l057J30j583j62L047j297j501J044k736P30O510j914m882
588b492L424J363k838L089J647m493K754L097o387j101N585j857j020K937n704
603a996k821P462K183m431j320k189j389O042O63o997P11L533l409K049M550m295
619a654j291N440j319l033J130R01J10Q21k095j624K714J470r91J940o94l477
$$ y = [-912, -3611, 927, 880, -1800, 64, -1020, -4251, -3832, -1878, -1395, 1712, 1224, -5218, -4061, 438, -544, 1944, 3327, -4348, -4192, 4562, 5376, 2234, 3079, 1533, 906, 4472, 3093, -1753, -284, -589, -3674, -779, -1448, -6847, -2407, 3205, -1824, -3338, -684, -3686, -2728, 1602, -923, -4045, -2496, -2528, -2015, 3847, 3753, -1661, -229, 910, -458, 2889, 2645, -3483, -3248, -1787, -2056, 1062, 2061, -2182, -786, 3526, 1692, 46, 3618, 3179, 122, 252, -1331, -1493, 1554, 257, -1244, -200, -2936, -2206, 4304, 2390, -2492, 932, 2295, -543, 2546, 4193, -300, 2454, 5551, -836, -1937, 3648, 1791, 771, 3708, -1996, -4817, 2645, 4828, 397, -923, -3112, -4501, 1541, 2204, -4793, -4082, -549, -3958, -1909, 2641, -1654, -2945, 2495, 1176, -1857, -727, 174, 284, 1105, -990, -2614, 100, 1570, 579, 2519, 1825, -1652]
635a652J502J341j206J227j621l884K231J310j415K637J631n313q95M435P61q27
651B62K86k810n27M613n07n17K956k948k405O116J16n666K885J794n041O25L015
668B247l144J8L331l111k101L249j776j164M953k138m365L153J497j952K504J375
684B576l531n27K008m79J596J542l488j632K436K10R47K360k811k749R63O22J120
701A163O84k870j585J124j73J014J920j495k868K060J040k322K447P43l118J239
717i97K005k789J171L277j682l28J387k718o03M312j25k777J324j978l093N396
733A782K402m266m03k15k341K679L246l163j999P84j251J225M136j593l406J501
749h82O50p05K597Q17k837L50O84JJ401k95n83J222n97j947j49J132m69p9R8k740
$$ y = [-1652, -150, 1191, -15, 1212, -409, -4293, -2062, -752, -2167, 470, 2101, -3212, -4107, 328, 1089, 262, 548, -2262, -2789, 1824, 1317, 800, 3756, 808, -1597, 4519, 4635, -1031, 1854, 3648, -1393, -768, 2247, -897, -879, 2452, -659, -2760, 489, -1287, -2451, 2502, 364, -4001, -848, 649, -1303, 1201, 2576, -955, -1482, 526, 47, 1643, 3185, -303, -1935, 501, 711, 1658, 4018, 1207, -1542, -579, 43, 1163, 1847, -1023, -2608, -1484, -1657, -643, 1277, -218, -3086, -1026, 14, -2308, 139, 882, -2236, -997, 1008, -1781, -610, 2667, 985, 657, 2044, -674, -1277, 3035, 2910, 133, 1457, -521, -3614, 1782, 4184, -82, -485, -700, -3041, -362, 2884, -279, -2278, -1494, -2745, -1520, 2616, 1023, -2383, -882, -232, -937, 1660, 2477, -360, -10, 674, 675, 2076, 1781, 1198, 2420, 1823, -124, -273, 859, 390, 311, 409, -2331]
769b331k34J456P58J163K97m186n20L312J44N0O34k446k076K854K729l07J38q37
787E98k288J751K799j553M27L96l792m03L616n83j010N92j209j560J760N92m66
804c33Q31m77k798J211J655j153J368J265k135r73Q46P75J334J506j316k089N36
821E3R60J660J495j539l233j91J159Q95J446j799k649j69M00R74K183j002k338
838a695p19P94N69J513J36j625r66J668j76N08K011r11j128P11q38q24J841N97
856A466o30q09j291j052K397K464j051k059j152j177J431L135q14k895j404K7
872c414J819K831j63j270r55j70Q26K117J140j780j602J26J49Q36J092J76o29
889A129j201k77J137J023k09J59k83j709j259O10J600N20q47j626j641Q68J919
$$ y = [-2331, -2565, -1109, -351, 812, 1109, -3077, -3597, -285, -141, -91, 543, -1903, -3979, -1125, 1604, 1297, 1435, 598, -1690, 61, 2860, 1307, 1734, 2130, -1662, -2065, 1551, 968, -42, 550, -659, -2219, -459, 133, -333, 498, 21, -2777, -1566, 89, -1064, 304, 1569, -566, -1539, -693, 82, 1416, 2922, 1606, -483, 53, 1013, 2673, 4168, 2629, -604, -795, 364, 1259, 2705, 906, -1743, -1912, -1512, -538, 1645, 643, -1695, -2414, -1620, -1051, 462, 598, -1027, -1993, -325, -501, 7, 2018, 1107, -21, 690, -148, -972, 869, 1466, 836, 27, -1264, -2316, 81, 2545, 1494, -565, -1717, -2894, -1463, 1672, 858, -2037, -3441, -3414, -1595, 1236, 1073, -197, -1152, -1322, -496, 1621, 2761, 981, -621, -495, -346, 490, 1582, 1758, 1129, -72, -349, 788, 1811, 1602, 1761, 1478, -231, -1490, -880, 720, 1240, 393, -1233, -2874, -2006, -87]
906h7J391M35j881k513J058L121J125l0j639j386q30R60K521O13j314j883p16
923a055J220J646Q76p84j982k037M66J279J187p79k019m07K0J069M82Q91K0o75
941e82p52J22J26Q38J793q17j438j140M49J951K006m49j936j812Q3J700J521K42
959A905j909l308L72J960J758N29j601j995m24R92K086O66r59j266r19J179J237
976C03M74O27K38r26p44J98J426J471K17j673j741k87O71J399J508j740l452j97
994b228J877R97P65p34j776q91O31J092J582K67j707k317O95J801J032P92l72
1011A506k729P1J522J289N34j206j039l81m3K26O45L13o68j125l42k54P21J968
1029A008L07j753j976r22J902K675m93j428j244q09J447K126J082j051j149j016
$$ y = [-87, 1304, 1739, -142, -2655, -1597, 1524, 2649, 2619, 980, -406, -1236, -276, 2245, 2858, 1544, -339, -1055, 165, 1811, 2687, 1903, -79, -2116, -1650, -371, 816, 37, -1982, -2389, -2369, -1300, -818, 73, 93, -582, -1334, -1212, -1086, -248, 1545, 728, -710, -1850, -1401, 550, 2556, 2107, 171, -1641, -1558, 142, 1663, 1905, -4, -3312, -2940, -980, 778, 1307, -294, -2289, -2713, -1721, 365, 1031, 72, -1194, -2113, -934, 303, 777, 1404, 1642, 716, -28, 170, 1596, 3067, 3284, 1611, -130, -417, 254, 1653, 3161, 1421, -2031, -2228, -351, 646, 1411, 677, -1099, -1990, -1359, -267, 1315, 1582, -125, -2442, -1747, 54, 1086, 1878, 1506, -1223, -1152, 370, 1659, 2193, 987, -52, -433, -476, -250, 395, 708, 40, -1085, -1427, -1681, -960, 1008, 1315, -438, -2414, -3336, -1434, 1241, 748, -680, -1924, -2733, -1286, 840, 1922, 871, -278, -1294]
1045a294J60K063J353p25o75j535j588K432K781j370j387r18q46Q52J799q7j705
1062f90j95n37k19J519N58j052J214k61k015L86K114K59M23j83j576j104J378
1079A9K126P16j214k009j650K053J749J40k51k064k024J032K541L97r41j881j111
1096b372R00J194O47j52p88j261K23J503M76m15J068n28q84L17j57J078J131j194
1114G86q31M34j000N40J952J25k410j145L43J49J251J168j838j420J5m1K094J885
1132B057k167j944O08J34R15K323l61k339n19J256K33J591K3j619l44O49n07L74
1150C63J388r35j126l8p6j79Q45J5j44q71o04O5Q72N82j13r3r80q37J392J459
1170I85M21l07j435j298J514J755j7j19j407j649R98K370P5j246n53j382n9K087
$$ y = [-1294, -1134, 929, 2282, 1557, 882, -653, -2241, 191, 2972, 1602, 215, -703, -1549, -697, 1102, 1015, -690, -885, -1422, -1641, -122, 436, -616, 598, 337, -1678, -1292, 822, 1081, 1504, 1321, -255, -1359, 19, 2145, 2861, 1647, -362, -2012, 41, 1790, 1930, 1679, -385, -2409, -1377, 1164, 1561, 620, -1261, -2372, -1472, -278, 369, 217, -571, -1832, -1609, -106, 370, -45, 1023, 495, -389, -72, -229, 849, 1980, 786, -45, 389, -611, -71, 1881, 2006, -404, -1549, -1206, -1057, 194, 1362, -476, -1896, -1881, -1922, 172, 2057, -110, -2054, -1446, -1312, -397, 1926, 1565, -774, -1293, -37, 196, 1787, 1810, 191, -153, 496, -11, 363, 1751, 816, -310, -348, -424, -603, 242, 257, 113, -758, -1362, -1297, -425, 157, 44, -49, -1029, -1866, -474, 985, 1406, 1099, -336, -1634, -120, 1635, 1618, 1499, 92, -1557, -559, 1811, 1886, 640, 87, -1295, -1354, 733]
1188G33J72j482ml87n55J112P38q34J36L78r60k43J138j68M74J315j534j311J412
1207A30P80J78O73q44j862M86J284P21m85n53j460k32J612L00m49j8j446p95J041
1226i39Q49K96l80p91Q7L45J11J378J71j091n61Q21q7K75P31k44m91K00n42j98
1246f0J574k09j435K76m93r01J091J479j223j224Ok25L32J815l36j876L85j55
1264a179K9K054J33j705k43Q41K18O89R19j171j183O60M73l56R30o70r69L70L50
1283A90k90k03K22n27J09K5l53j21K74P94j7n71m92K3J030N20M68p81j474J063
1303a11J423J38J37n35j868Q47J398N3l44o36j125O6J349n6j251j7J05q33J193
1322f7M76j367J63N38l61j24R48o67P5O09m06j96P85M46q34Q22P9j436L71O22
$$ y = [733, 905, -577, -581, -968, -1523, -411, 327, -507, -371, 7, -953, -1196, -58, -226, 248, 1563, 29, -1282, 130, 910, 1088, 1761, 917, -945, -459, 825, 1546, 1061, 508, -952, -1184, 428, 728, 279, 261, -1185, -1980, -939, -90, 206, -174, -965, -878, -533, -422, 956, 1127, 36, -525, 296, 209, 484, 1215, 971, 480, 680, 138, -60, 1514, 1305, -130, 146, -347, -1248, -157, 1322, 99, -1125, -1119, -1344, -1012, 803, 467, -1409, -1024, -1179, -1150, 904, 1037, -668, -911, -70, 148, 837, 1756, 585, -598, 62, 535, 179, 1109, 439, -530, -160, 190, -100, -303, -81, -608, -499, -474, -827, -948, -674, 120, 103, -468, -960, -937, 93, 613, 1081, 300, -1174, -111, 1312, 1450, 1587, 1052, -816, 31, 1429, 1482, 1138, 502, -623, -557, 792, 736, -515, -532, -427, -1260, -67, 409, -958, -795, -257, -618, -742, 206, -461, -386, 223, -183, -379, 406, 852, 18, 840, 919, -517, -146, 476]
1342D76l8j55K04m74r95N38R62j02n21q25n85P12J074l35k08n25j40O4Q11N33
1362D71j87j096N18P90l16LR84m77q26P24r8k19M97j32o69N02q3q60L63N14j097
1383f94M06J02m04l98J091J9l39m85l48M25Q35R28j163n52L67M9J241L19q67j015
1403d83N17J022P9K92p60l32k53N50J71l56M3q68m7L41J06n4o50j17L23J96l36
1424f16J18m59N01R66n94m76j8N12O44O76o75j338J19J208N34m03l98j178j68
1443a045J504P8n45q65j98L22N98K66n72m45K68j86r3J071K33n94j88K06J62K62
1463B39L95J06N5m36k7M45j1l06K97m2k82m71l33N33O28n60q83j76L1L82O14o4
1485A34p22n90P54Q30J61m40m19p0J6M35M94M43p75o79N47O96l19K11m99pk20
$$ y = [476, 438, 283, 487, 13, -982, -444, 518, 416, -105, -930, -1515, -803, 271, -64, -272, -797, -937, -873, -62, 471, 284, -812, -294, 496, 180, 183, 1167, 690, -136, 588, 490, 271, 768, 636, -33, 469, 386, -474, -111, 403, -694, -288, -186, -590, -988, 103, 122, -217, -702, -1050, -625, 210, 1138, -25, -577, -210, -161, 1080, 1399, 532, -483, 34, 1056, 1135, 1427, 667, 335, 82, 632, 803, 447, 490, -378, -425, -84, 22, -32, -682, -799, -476, -280, -616, -498, -957, -456, 510, -84, -560, -578, -66, 578, 1254, 579, -759, -640, 568, 1102, 699, 301, -877, -1045, 459, 537, -8, -873, -1071, -749, -151, 115, -457, -902, -634, -820, -913, 158, 391, -203, -391, -185, -23, 239, 634, 740, 795, 359, 332, 777, 766, 460, 757, 715, 433, -38, -371, 162, 790, 230, -653, -829, -798, -416, 198, 134, -588, -1178, -424, 406, 567, 127, -292, -362, -346, 89, 583, 1026, 251, -428, 119, 815, 496, 707, 208, 201, -19]
1506a9J20M75k47m45k45M26j88l26l54M35O94l61n62l76L10P94N8k03l93p19J126
1527@N51L63m99q41j22O15L80N51k75p25o06K60P69P28j282r2o80M63M80J81n94
1548c75n59o4P82j05j31M0k74N44m1o4J55PM99Q12p92l02l8N31Q97j99p57l70
1570A96k63O40P06n39o97n91R6L84p5L18m37p46o5O48o4M40j3o71O7K12N72M62
1592E80K08p81j72N45K77r6q8L7k35o4J04l68Q4J33j97j64j90n81J43O42K40o93
1614f36k95K18L37P81j55k89m26k60O47R71k08k54o75Q0Q01N80l85l45m22l19
1634b54K15N71j1q10k9J65j16K63l0n51L58J98n66M82J18K8L5J28l49m41N49N30
1656D83N3R6l95j016L98R70J56j34l70o32K43O73N07p22p27k74J13P67M25o45
$$ y = [-19, 101, 576, 329, -116, -361, 65, -123, -449, -803, -368, 326, -35, -597, -973, -663, 131, 189, -14, -407, -1126, 0, 551, 914, 415, -426, -548, 67, 447, 998, 723, -2, -608, -348, 421, 1149, -133, -225, -905, -442, 38, 219, -375, -934, -998, -216, -321, -452, -412, -686, -142, -183, -247, -92, -85, 414, 1226, 434, 132, 94, 625, 1522, 1323, 566, 196, -67, 573, 1279, 740, 43, -548, -452, -68, -143, 175, -262, -1008, -1073, -425, -489, -49, -62, -733, -666, -454, 118, 580, 788, 7, -165, 380, 657, 561, 473, 510, 275, 211, 315, -53, 31, 164, -33, -197, -387, -968, -825, -183, 57, -636, -931, -713, -376, 405, 250, -39, -465, -725, -78, 893, 685, 431, -244, -164, 637, 1217, 832, 487, 65, -254, -39, 532, 521, -289, -318, -153, -269, -6, -36, -587, -229, -31, -597, -115, 3, 31, 66, 194, -155, -596, -47, 483, 536, 632, 237, -779, -381, 589, 745, 611, 241, -391, -148, 525, 1032, 310, -417, -691, -578, 189, 614, -31]
1676c1l99m08J91N45j70j20k1j12M2L17q6R7K49m0M0J50N5j53M74K45m23l64K81
1699C59k28K23Q10j095k95J04k56L61P32n61j054j22M14k5O67L1q72l90Q79J18
1719b00R43k39o95j78O85J46J62Q4J9q14j96Q09J19m72k5r8j58J77n52J85K71
1740b7l93j07P0l15L8L83N80j42p31l08Q52N73N61q64j79m29N93R60Nq88l21o58
1762g47N48J064R2j029o8m2m20O46O16r53k80L31m75PL72k1j62O44m04p73R77
1783g7K66oK61l07n40q1J163q5j09K04r27k81J173L79l74k84n81l64L30Q74j65
1804D69n61m24k04M91N38m7k72m00OK77K83J67k35l66k81O35K10k29O25J8o61
1825C9o7M16l76N93L47o34l37k6o69O21P42l77j182P2J79l46J035L93j098p60
$$ y = [-31, -430, -838, -647, -102, -272, -392, -413, -525, -483, -166, -252, -155, 94, 54, 94, 244, 299, 146, 620, 865, 442, 78, 359, 131, 354, 1164, 69, -226, -122, -378, -17, 715, 154, -900, -1022, -608, -633, 34, 65, -807, -1197, -318, -200, 743, 504, -191, -369, 316, 462, 624, 708, 727, -87, -283, 526, 645, 173, 148, 50, -108, 69, -483, -298, -27, -420, -527, -457, -772, -734, -351, 229, 87, -644, -952, -100, 473, 1034, 170, -9, -438, 155, 1115, 1120, 232, -89, -747, -199, 865, 957, -72, -140, -182, -602, 44, 660, -293, -573, -242, -717, -710, -338, -359, -521, 123, -281, -1054, -77, 189, 183, 444, 137, -403, -484, 679, 594, 485, 689, -238, -519, 654, 1033, 659, 375, -206, -570, -240, 634, 469, -92, -516, -720, -229, 309, 262, -10, -410, -404, -127, 156, 323, 88, -278, -559, 76, 286, 57, 682, 700, 39, -28, 388, 12, 605, 952, 318, -19, -45, -714, -93, 649, 272, -910, -838, -659, -1005, 30, 423, -675, -1435]
1845a435M81O87Q90K32j137r44R54K41O17O71m80j121J65Q56o2J28J18o55k44
1864c8o7k93J55N01k68m61l35J85k14N21N02k06n28n31P46N80L54J44o58q32L71
1885c72J238K58J0o82q42j60J253L61l67k90p12l39Q11L64n04m31j76N4j28P21
1905F7k81L1L61j94p88Q64L38m91O34k52m69q8P50J57kK04q90m55L72Q45l68J97
1927E42p08q95K06J357j77rn02p15p6P19O19p1q92l35J3O41P63o01M33n87l28
1948f03L82N59K33j11n75rJ33O3L90M18k81m34k58j59J13M67Q9k76k43n57n10
1969a169J168Q66r14q21j47R8Q30J000n77r58n11O67P86N71R1j052P2L76j68N78
1989G86K78o77l55k22K00R4om4j97L8l37l31M66L22R8o14l92J02J24P66M48l62
$$ y = [-1435, -954, -267, 623, 855, -282, -1226, -272, -31, 586, 1257, 777, -344, -179, 677, 615, 743, 861, 206, -38, -105, -398, -243, 258, -10, -471, -806, -621, -835, -314, 188, -18, -546, -1077, -331, 249, 603, 747, 89, -743, -372, 866, 1124, 1134, 452, -390, -550, 703, 1064, 697, 407, -305, -644, 167, 531, 27, -404, -580, -526, -654, 67, -214, -183, 178, -16, -804, 60, 398, -93, 541, 289, -180, -268, 482, 639, 637, 841, -49, -504, -132, 713, 345, 542, -166, -1061, -855, 502, 325, 316, -186, -901, -977, -258, 361, 290, -602, -937, -924, -283, 480, -121, 312, -275, -603, -221, 338, 571, 460, -115, -124, 9, 72, 462, 880, 599, 165, -93, -252, -139, 328, 417, 141, -102, -659, -1169, -1, 865, -49, -870, -1017, -919, -89, 911, 334, -624, -1135, -468, 318, 889, 980, -72, 0, 376, 208, 786, 1064, 387, 32, -190, 10, 104, 98, 54, -143, -105, -442, -773, -307, 15, 113, -501, -893, -791, -667, 99, 547, 185]
2011A85p81J61P94L89J92k49q41j28M5J002M78n89n35p42L32O97j15j62l56m66
2031f89l15O84J26j74M0l40q9M96L82L2L41j42m69j61N31L74l26M79m34n38k75
2052d67O53O02r3l76m30n14K92Q01k14j8q57l58N65P72L08m71p33J82p7K27Q87
2073F81l40n30k31N37L41j80j33k17j73lL52J39Q8j17J54j34k34l26K65M04k1
2094C22j18p40l85N18N67K43m79n95l71L59J013K86p59o94Q4M30N77M72k31o47
2114a48RP30J73J19l15m35pj26j99L10ll8l51j86M8J00j05M35rn29j83M86R7L70
2138B43k40Rm59J42M79M35K14n80k35j13P85K93j43n51j44j70p0N23L7p43k29
2159e17p2L12J18J94l29n6K1K80n1J23j58k44N76l0o03L18J76J76K68o4m93K45
$$ y = [185, -596, -435, 359, 748, 940, 691, -150, -278, -233, 769, 1247, 658, 123, -619, -287, 410, 295, 133, -223, -689, -1004, -320, -194, -368, -328, -668, -757, -261, 121, 153, 494, 352, -117, -278, 253, 627, 301, 780, 346, -192, -467, 186, 788, 695, 319, -111, -625, -333, 468, 254, 236, -621, -979, -414, 358, 666, 195, -538, -356, -433, -206, 681, 341, -189, -420, 117, 458, 278, 145, -72, -245, -248, 104, 243, 331, 214, 368, 234, 0, -326, -61, 343, 322, 204, -536, -921, -403, 164, 407, -72, -667, -1038, -679, 334, 620, -139, -833, -749, -319, 258, 730, 499, -148, -139, 591, 764, 883, 568, 133, 126, 0, -199, 111, 108, 70, -281, -467, -419, -319, -424, 11, 2, -527, -710, -224, -127, 243, 3, 12, -447, -305, 174, 609, 823, 243, 8, -105, 680, 973, 830, 279, 135, -35, -105, 418, 455, -288, -517, -589, -277, -159, 35, -294, -350, -329, -49, -100, 23, -135, -379, 197, 167, -436, -118, 58, 234, 502, 438, -55, 190]
2181A90Q4J40k16p3n44l24Q59K93m82j73j19l50P19N66m50m71l28n9K86N28pk73
2203b04j48J70K99N01m70K61j56j04K54j30j63j37K65j3J53j13m82J90O48m41
2223A80m46J83l63O0N53J63p82l25L46K61L24K34r09n3N27J30K40R2l40k27M86
2244C34J99j15k57K53j86qK01l95L02k90O1j18r0k3m16L05L0q1q8K03l9K76M2
2267A00j74R3l07M10K06J64j95j84l89P0P82k07m9j84R9m63K37P48o75m26J34
2288b10l38M61L45o85k94J74J55K13L84k48o88M51O20Pm57L98j90J80L41l96k69
2309d6M36q0l0L19n14l09J38N82k5n37j24l03J58O08m40k5j25k16K81O60l19j56
2331f7q5m87Q54J87n9l29n21M34K98O3L7l01o9J96N1J43k88j65Pk6j84L34m70
$$ y = [190, 274, 414, 198, 125, -419, -743, 116, 409, -73, -246, -365, -715, 4, 570, 120, -351, -679, -738, -452, 76, 69, -204, -352, -182, 117, 618, 148, 409, 253, 149, 403, 273, 110, -27, 238, 225, 378, 265, -217, -27, 621, 180, -266, -83, -446, -386, 167, 330, -452, -777, -431, -170, 154, 388, -521, -574, -47, 83, 323, 415, 75, -152, 334, 533, 418, 161, 414, 228, 220, 421, 26, 328, 38, 99, -19, -109, -132, -548, -243, -213, -294, -382, -179, -218, 58, 100, -74, 19, -288, 122, 328, 492, 297, 113, -276, -206, 576, 369, 320, 136, 235, -228, 9, 757, 82, -344, -210, -548, -87, 258, -427, -721, -547, -392, -179, 205, -43, -731, -280, 340, 347, -110, 288, 98, 278, 619, 223, -46, 390, 310, 280, 599, 85, -224, -86, 496, 471, -66, -190, -493, -335, 273, -167, -192, -317, -533, -252, 408, 89, -67, -152, -639, 215, 402, 343, 14, -507, -73, 225, 288, 325, 24, -45, 151, 202, 345, 57, -108, -101, -127, -311, 23, -447]
2354d47j13O14ok07k46L91j83p3N49l18n74P53n0m8K74j25m02L43M37j88k0O1
2376D22m57j21M36l5jl1l22l25N82k01j0n8o6j56J57m4Oo2R5J35p4L41m20L02
2400I3J17J91l32N7K9O4K54j12j0l74k66N03L12lm87k80L8J96N53l03p04J76j65
2423d53J8O22k07p43L37N28j10J5L39l90O8L43K75n20k28J99l0M39l01l18K88
2444A71R6j08rk1n47j76O02P6l74l80J19n0N54K51o05J28L3k58R07K16l28l05
2466hj82N62K20l97R8N4l71J73K05P3k97l41K78k74K64J46k23K4K00o21K29J94
2488Fk31j71K78J6l43M37j2k9K85J46m20L5K47L0N4J50o22j39M57P4m4J54n96
2511b38l66M54N44j01o81J07n32M80M84j29m18n0K46P3J75M1k62k5L40o8J10K
$$ y = [-447, -560, 54, 48, -159, -405, -14, -197, -270, 279, -39, -613, 140, 90, 42, 316, 191, -211, 132, 569, 381, 361, 422, -35, -156, 280, 245, 244, 213, -109, -434, 148, -53, -63, -121, -187, -343, -186, -230, -224, -286, -191, -56, -130, 211, -209, 93, 210, 401, 69, 126, 155, 219, 473, 361, 351, -23, -289, 214, 526, 523, 36, -244, -206, -10, 543, 240, -464, -288, -453, -435, 187, -20, -763, -426, 102, -8, 7, 346, -44, 24, 367, 642, 122, -106, 93, 63, 502, 201, -117, 171, 267, 159, 150, 129, -418, -594, 8, 84, -290, -670, -551, -601, -47, 204, -401, -273, -240, -498, 409, 625, 297, -8, -190, 372, 592, 195, 293, 347, -24, 149, 354, 427, 130, -211, 67, -207, 57, 203, -20, 4, 204, -417, -188, 6, -225, -396, -118, -102, -445, -8, -20, -49, 236, 382, -38, -3, 244, 274, 328, 478, -144, -283, 174, 248, 204, 358, -238, -604, -150, 394, 293, -388, -281, -813, -333, 151, 22, -396, -446, -200, -127, 48, 89, -173, -198, 142, 74, 184, 186]
2533A86q0N37l7l32j23j21M77k89m9k5l56n5K59J37o0j99k77j34K03K87rk24k13
2556d97J99K98J95J76o99R4K87L21k10k0K6m51L42K65p7j89M8m8oK57o74K44l9
2579a58K72l14J42l76J92n8N98n61J00k31Q5K58O7J04n26O30j52Q0K96k56p1k47
2601a26L74K56n32K38k93j50P5L18j19Q2k54k01k07L50J51L0j44j0r2K04J46j50
2623e4k61J75L80j57j02k10L24j9J49q7l41L34J79J15r7k59l37L33P2K40m48j12
2645a83k90K19K45k3r7j46j32K24L15k4k56l59M29J35J11K65jl91L86R3k40j41
2667A39k05K97m1m7l28J16j24M60j77j97j61N8J61j6j94j22j50j15O24L2J94m69
2689b65P2n9M26M18l36j1n17J59K71L99l10j51Q5q3n3N3oj69J45l3j47j7j97J62
$$ y = [186, 106, 643, 606, 274, 151, 30, 507, 218, 169, 144, -212, -267, -8, 129, 69, -130, -407, -541, -338, -51, -60, -284, -497, -298, 0, 195, 371, -328, -234, 53, 374, 164, 144, 170, -281, 61, 326, 249, 60, 108, 60, 54, 311, -363, -119, -158, 114, -200, -58, -434, -242, -300, 298, -263, -163, -394, -309, -51, 16, 120, -406, 224, 72, 152, 448, 192, 121, -126, 248, 504, -28, 210, -83, -233, -158, 160, 41, 123, -131, -332, -539, -189, -38, -8, -152, -162, -254, -50, 96, -54, -315, -140, 240, 83, -19, -229, 95, 76, 225, 138, -203, 131, 310, 425, 328, 69, -268, 65, 137, 377, -71, -183, -473, -254, -9, -32, -129, -275, -407, -183, 132, 108, -148, -507, -78, 57, 168, 433, 432, 41, 427, 520, 280, 139, -66, 231, 190, 143, -185, -69, -193, 267, 90, -107, -268, -210, -49, -65, -259, -381, -531, -646, -22, 10, 204, -265, -193, -252, 174, 592, 256, 245, -272, -113, 158, 557, 247, 96, 181, 98, 45, 98, 92, -77, 68, 35, -112, -129, -326, -164]
2713a64Q1j36L27o32M67o0M44J5j35n14L76J68j3L41k81l18N7K68M58m31P5n24
2735a31r3L34J12N7k12l44p2K55L31k03l56j53J30M0M00k39M7j9J67K43k11k66
2757a83K43L10j16j33qq9P1K01j19k26j54K36nN12m40o75M1o8M78L52j83n66J52
2780c69l9K58N84l12j79j57K93j26j2Q4j7k0J55k2q8L93m67L30k40r3o6L11k57
2803e6J37m5k23O2K3J08P1k58o3j79K00M14J64n11J19r3j35M07K5K4m2k29N6L58
2827C34J35J23m25K12p08M19K02k61o2j42r7K79l0L1k46%L7q6k7J77J71q9L9M9
2851C5k96L00J65K68k82l94P8J08J38L35J70o77k03K64Q5K35k89l46n2k2J99K44
2873F3L14q06p1M45R0o7J59k74k5K16n0m13N17p6P1J71J50l89j20O64l8m40R4
$$ y = [-164, -83, -219, 108, -524, -57, -117, 327, 342, 207, -307, 69, 237, 224, 565, 284, -34, 23, 291, 749, 318, 393, -131, -224, 110, 222, 279, 67, -277, -349, -94, 237, 34, -322, -475, -345, -305, 95, -144, -97, -116, 51, 294, 83, -183, 60, 370, 254, 121, 113, 24, 95, 296, 177, -49, -203, 33, 28, 540, 100, -575, -534, -602, -124, 228, 45, -521, -369, -408, -150, 434, 122, -57, -214, 79, -47, -59, 25, 8, -12, 143, 121, 33, 426, -41, 289, 49, -44, -110, 201, -56, 81, 36, -187, -125, -102, 6, 77, -181, -244, -423, -223, 191, 355, -156, -37, -130, -265, 142, 167, 191, 149, -80, -24, 334, 469, 592, 167, 379, -329, 90, 292, 31, -31, -173, -270, 9, -21, 10, -236, -236, -199, -285, -312, -135, 36, -53, -14, 35, -261, 39, 204, 472, 190, -204, -126, -18, 120, 455, 625, -52, -255, 9, 94, 329, 40, -306, -358, -380, -181, 63, 377, -429, -500, -55, 35, -32, 127, -147, -172, 44, -6, -419, 98, 22, 93, 264, 414, 25, -95, 569, 531, 91, 185]
2896A85l81PM89j4j44l11k95K76K72O96q69l73L04L5j87N08N7n35N2P2K22O22
2918F88l34k88oJ81k11J09j14K80l65R5p6PN2J30L30m39k11l16L90j5J94m48m0
2941d07P0J62K7K45L9k26k30J35J89mK87k76k50M50o0J54Pk82k43J05K55m7K5
2964A25ml06o2M15q8m11J56K57k88j09Q2K8K07K6j64j98K33pL58K82j90n09P0
2987i7K58J32jp4n76K57j45L13K18mn19j89k9N89M2n11p0K0K46J59j58RP6q0J51
3012A7k8P8o9R4L02k55j08l3M39k21N0n8k91K7Q3K08K0k05k35P7J6K48K5m08P2
3037a55l66Q1M11K48k87k08L05j70L48J42j98j60J8P9K37j50j09J03J88K2m09
3058c0K68n3J04l8j60K0l11N2L47m04j24J23k89L86K74j3n27Q0J20K69J24pj73
$$ y = [185, -196, -189, 300, 286, 142, -169, -464, -188, 84, 780, -89, -462, -158, -123, -310, 198, 255, -280, -228, -156, 66, 688, 354, 66, 60, 241, 30, 139, 25, 305, -60, 35, -41, -34, 18, 148, 478, 39, -172, -488, -98, -113, 81, -367, -407, -337, -175, -148, 97, 136, -90, -320, -185, 4, 0, 287, 11, -239, 211, 151, 305, 312, 30, -213, -108, 147, 100, 125, 121, -185, -247, 168, 80, -331, -175, 82, -206, -315, -233, -205, 2, 28, -136, -334, -101, -108, 250, 532, 342, -167, -97, 161, 293, 292, 218, -358, -101, -246, 67, 285, 281, -238, -427, -456, 133, 175, -336, -406, -386, -140, 19, -139, -130, -54, -134, 17, -11, 67, -2, 92, 394, 139, 31, -2, 437, 216, 266, 208, -83, -56, 27, 235, 255, 50, -185, -108, -92, 156, 181, -227, -155, -521, -440, -29, 219, -68, -276, 29, -141, 207, 349, 151, -9, 9, 88, 325, 175, 66, 169, 357, 379, -30, 238, 185, 289, 251, 91, 111, -200, -148, 199, -205, -329, -206, -495, -109, 165, 152, -375, -295, -175, 94, 218, 211, 38]
3081C8n47L20N24N4j98J48m35J51L18k65m8O6m00K45K00j67k76J03j64K76j47
3102b04J56m63L47M4K56k15r4kj3O03k79o4l78K44K16M2M25n71J64k42M32K9L9
3125D72n89j39J07J78K12l51R1j42k1K84m9p4o5r4Q4J04l1J10O1lL7p2K8L11m84
3150c5L10J32l35j78K08P1J50l80n7k73k3K36K7j61K17l65K08J68j77J27J1p8
3172a97j04M12J88o1l92L2K88J2J38o6l22P1L6r2J30qk20J50J07j00j36k14M37
3195H9L5m23L07k42j7L4N78m92J62j16r7K95K12k22k21p6J74N6J88r7M3j55K58
3218B73K86k19j34j45j53K97q7k58k7m5J78N8j48P4k40K55j27J48p8M0L1L36k88
3241B7L0n7O0j13J21J75j50j5k00L11j25N3m3k04m4P3m7J89k40Rj61K47M7j34
$$ y = [38, -509, -189, 335, 389, 191, 339, -96, 55, 373, 108, 60, 126, -274, -29, 171, 4, -272, -169, -333, -57, -204, -48, -511, -164, -120, 136, -79, -173, -175, -188, 415, 136, 72, -306, -62, 154, 196, 621, 50, 214, -28, 404, 433, 472, -117, -256, -149, 29, 241, -110, -19, -161, -182, 102, 53, -21, -86, -180, -96, 8, -23, 87, 148, 145, 182, 110, 138, 449, -35, 275, 407, 72, -106, 102, 173, 323, -57, -114, -387, -410, -174, -147, -308, -91, -456, -248, -80, -257, -130, -119, -197, -301, 111, 299, 238, -154, -122, 166, 178, 316, 250, -72, -1, 35, -57, 73, 65, -155, -5, 102, 2, -134, -348, 89, 124, -299, 8, -234, -251, -217, 361, -131, 31, -85, -182, 113, 325, 103, -118, -194, -20, 36, 224, 127, 170, 15, 273, 559, 340, 206, 61, -92, 205, 118, -140, -167, -212, -34, 24, -124, -50, -290, -35, -162, -14, -92, -52, -21, 315, 27, 57, 0, 60, -53, 68, 243, 93, 78, -122, 189, 64, 117, 74, -130, -174, -101, -148, 41, -199, -190, -351, -104, -57, -191]
3265a91R6L1j17k38N97L2k34J32j28l2j56J49p8J41n3L93m10j3K85k31j10L26
3287A91k36j97R8J4K92o8j29J13j58M22l75j93K50j93M03l21M3l5N9j32N04j36
3309B16q3j80M1K04L5L08k85l51J34K21k01J12M9k20q0K0J76r8l56r9L36j3q5
3332a99j55K98m9J93o0Q5l4k48J47J85j34l1N3n0O4M49l02k41J15R7o2o7k06L7
3356a15j58K82k8j50J8j15J53l7R0J26q5k29J78K01o2L3j48K65K9j79l6m7j64
3379a78K62K09j86J33l61J59MK24k54j77j34K22j93P8K35n11K73J25j26R1J58
3400E3m21M42o0K20Q6j99q9r1j09M66j5k26o8O4q5m0q1J67j69K67j65r4J99j42
3424i0j36J75J51l02K63j46R7m8L20n96J00K41O2K8J06m41l9L66J20j34K0j58
$$ y = [-191, -95, -64, -181, -419, 178, 210, -24, 108, -20, -52, -208, -59, -137, 4, -49, 344, -66, -79, 206, -25, -135, 191, -45, -242, -144, -130, 162, 94, -35, 78, -80, 342, -33, -226, 24, -169, 234, -87, -44, -79, -20, -152, 352, 216, 133, -47, -6, 198, 233, 541, 256, -95, 39, 260, 59, 171, 220, 0, -80, -60, 116, 18, -338, -437, -101, -114, -199, -354, -56, -105, 88, 28, 113, 79, -169, -22, 163, 29, -2, 51, 1, 65, 514, 212, -29, 86, 183, 121, 54, -152, -115, -273, 9, -19, -169, -151, -266, -113, -150, -60, 66, -19, -248, -70, 131, 69, 102, -46, 219, 248, 69, 33, -14, -178, 84, 293, 107, 240, -121, 38, 42, 266, 12, -165, -299, -77, -270, -192, 43, -468, -195, -70, -196, -105, 53, -368, 74, 14, 234, 320, 121, 32, -59, -168, 298, 283, 57, -11, 53, -32, -72, -153, 14, -155, 112, -53, -147, 52, -90, -226, -51, 100, -202, 61, -85, 12, -36, 284, -312, -212, 29, 91, 119, 225, -216, -255, 111, 231, 97, 117, -41]
3446d1k1J73J77o0Kk43j12N9m6j09n6M4R1r2k1K13j01J19J03J5J35k29l1L64l19
3471A4l0l4J94J64n3m21L05O2m19r9Q00n40j97K75p7J24l0k73m3J11J32j64j63
3494c62J09nJ74J8J19j21N1J45k54J5L1L76l01m1jJ52p9j95l9M40j20m4k57J7
3518a72Q0J09M0k00O2p7j0K61l8J19j45j94J32P4p9M79j51l14j51M25M8p8j65
3541E5J54j23J37j49j64R7k00J3LK33j78Q0j53J8J3J38o9j30K25j08J16o5M3L3
3565A9J98K9m12N9j78M52k8q4j95JJ82K78l39O1p9LJ71l76J62n0%J09j03N3m1
3590a08l8j0K20l9Q9m93N80j23k0J70l7j02M1K67k46j31m9RK27O7m85L74j95P2
3614D0l40J12M23j64l82K73r2J78L01n77k6M07k83L85l00J2p9Q9K41j49J6N9k05
$$ y = [-41, -62, 111, 288, 228, 230, -13, -125, -66, -112, -221, -277, -233, -142, -234, -255, -42, -143, -24, 79, 94, 229, 0, -31, 333, 14, -16, -50, 144, 308, 255, -166, 139, 201, -218, -317, 483, -57, -254, 21, -56, 68, 38, -235, -278, -167, -35, -199, -362, -253, -258, -84, -66, 53, -68, -17, 128, -126, -111, -80, 296, -5, -46, -47, 105, 26, -169, -208, 232, 112, 68, -189, -172, -92, 17, 57, -143, -81, -158, -168, 93, 55, 174, 29, -165, -33, 41, -38, 441, 290, -24, -175, 250, 298, 220, 55, 209, 86, 223, 74, -90, 7, -193, -180, -177, 56, -122, -42, -195, -177, -164, -26, -95, -225, 0, -108, 8, -57, -14, 19, 217, 246, -166, -107, -285, 167, 139, 55, -140, -139, 43, 321, -18, 43, -36, -33, 138, -238, -76, -126, -126, -17, -120, -67, -108, -146, -156, 64, 25, 114, -379, 201, 78, 58, 228, 191, 89, 130, 397, 151, 20, -29, -20, 207, 274, -211, 163, -32, 40, -300, -188, 235, 71, -311, -38, -130, 48, 349, -228, -254, 153, -130, 255, -45, -33, -112, -23, 218, 69, 85, 144, -61]
3637f1L24j30O9q0j29p1Q4rK7j7o8r8K76l5m85L08o8J93k76J80k83J26M04j09
3661G2J49l48k41M1M74k6j87pJ58j52L7K01n7q5R4l66P8J90k7p3J10k07K52k76
3685a96J5pM62k94n6L3K24r8m6J60q7j80L36j35p6Nq7P2Q8kJ56l86J32k27k19
3710d13L18rJ39k00J30Rl26J18J23J0J65j50m6N2M63m50p8L18m7ok99J16K13l
3734A47J42m01l0L85k43R3k09j8k09L38J47n5l00J80j65J13R7j12l47K75R4j09
3756a87L68j00l27L38J04l59M31j59J12n2J24m9j86O3j64j88K17pk0J22J63l04
3778f0M7k34L7p6J38J81j27j54k9p6J76M35l2l56k06L38Q4P2o0j43k3L02j55J2
3802I1J3k18j2K04q0K81j93J0j81N1n3N6j99L2M46m69q5L24kk13K23P8m9Q7l36
$$ y = [-61, 263, 133, 202, 122, -7, -78, 6, -3, 24, 7, -61, -159, 117, 82, -403, -95, -163, 30, -246, -66, -349, -223, 181, 72, 221, -127, -368, -327, 147, 121, -66, -73, 85, -67, -30, 171, 114, 29, 123, -243, -165, 25, -2, -75, 35, -172, 80, -196, -181, -188, 274, -20, -76, -43, 181, 83, 37, 197, 110, -70, 266, 131, 55, 60, -27, 45, 133, 131, 287, -99, 33, -194, -413, -95, -104, 35, -165, -35, -26, -352, -234, -111, -101, 64, -86, -132, -80, 383, -67, -145, 173, 126, 120, -179, -63, 150, 147, 289, -112, -142, 243, 0, 93, -116, -134, -343, -5, 142, 87, -213, -33, -198, -85, 12, -100, -447, -172, -78, -187, 181, 81, -246, 92, 196, -163, 268, 109, 221, 169, 293, 244, 58, 121, -43, -231, -14, -21, -41, 81, 244, -60, -13, -247, -210, -286, -148, 33, -94, -248, -277, -353, -177, 258, 226, -130, -336, 2, 86, 158, 98, -45, -68, 234, 79, 91, 104, -114, -126, 78, -2, 279, 86, 96, -85, -34, -87, -31, -230, -198, 248, -221, -306, 18, 16, -197, 26, 104, 55, 142, -194]
3827a94L27K5k65K98M5q1K23j52j81k59J91Q9j45P8j59K20j11q0J06R9Q9k68J85
3850H0l25J71r3L07m36M78r4Q3J29k20J03J12k67P8Jm06N56k15K4j8j49p6K00
3873B3QJ4j43j0m9L41j67K03l90N7Q5l1L28m02k5n0q8L95k93L46j12K9q1J57m11
3898b66J78Q4J69j50j08K8J15J9m6J2o1l00r2N10k90J85k82J37K8K70r7j46q0
3921a83J30K16Q5J2k29Q0k01J82n7K95j06k81N8k56K17J17j78M8j6j42J54j00
3943a55J57k91L43L1k05K50j40R0J22P6k01l5J22M6J47O1l53j68q9N49l37l3M6
3966C3j48K16k39O0K13o6q2J93k79J42j63M0j40J59k8J98k11l6L23k06m0K91j41
3989H9j30J07k53L27k93M11j64n4k02lj5J15K70r7k35k12M54k70L15k92j3K4K23
$$ y = [-194, 133, 158, -107, 191, 236, 155, 378, 226, 45, -214, -23, 66, -79, -1, -160, 60, -51, -131, -25, 74, 163, -105, 80, -245, -74, -167, 140, -296, 182, 88, 171, 300, 80, 183, 295, 28, 106, 107, -299, 257, 42, 66, 48, -101, -177, 23, 31, 45, -98, -108, -157, 184, 17, 220, -170, -113, -28, -59, 269, -133, -158, -208, -296, 99, -194, 152, 40, 69, -12, 145, -266, -88, -4, 165, 15, -93, -65, 50, 69, 23, 35, -26, -326, -418, 92, -198, -13, -295, -158, -130, 140, 43, -103, -183, -53, 163, 248, 260, 31, 111, -90, 92, 35, 330, 224, -57, 1, -255, -38, 79, -99, -51, -67, -209, -55, -155, 2, -289, 54, 85, -120, 130, -10, 80, 202, 278, 77, 42, 164, 210, 357, 418, 65, -103, -192, 357, 20, -13, 33, -115, 101, -138, -78, 135, 69, -13, 180, -99, 43, -120, -80, -220, -61, -89, 109, -102, -138, 185, -21, -61, 230, 89, -41, 66, -187, 140, -153, 258, 94, 40, -162, -165, -180, -65, 205, 108, -127, -339, 115, -155, 160, -132, -145, -121, 102]
4012A02j09m9L20j57j89l9M97l29K37n1Pq3N4j49L11l46J53l5O5j35j83j86K97
4035Cll1k34k5L18r3J41p5j62J10J8j00J39J69j69k5K60j01J50l51J10J54k24
4058b1r7M35j03m86L24o0J38j04j15J12r5j06q9J15j2j10J09J2QJ19j34J76L12
4081C28j14k26J64O1O9R2m59k8K00J51J00j12j89m7l18K71K00m03J56J4j4K5R8
4104A9k44J53P9J05j40K0J67q5J26P2k83k2J00p0j11M49k57N6k26Q1K38j05j27
4127ej5Q4N7k4j95M05k71j74J47K53j40k62J11K2k22N13l79m15O79J4r6j36p7
4150a26p1L06q0K25j62j00j08n3L84j6n3M6k41j76N8O3J9j10J21K24k84k8L95
4173B33k54r5K5J63k1k6J7q6K38k78J48N1j07L95r4m43J56J90j78N4J50k70jq9
$$ y = [102, -7, -56, 264, 107, -82, -121, 376, 47, 284, 233, 240, 157, 211, 62, 373, 27, 180, 145, 210, 75, -108, -294, 3, 0, -31, -265, -290, 28, -65, 76, 1, -161, -51, -33, -133, 6, 175, 6, -19, 241, 140, 290, -61, 49, 203, -21, -118, 317, 214, -272, 52, -8, 130, 26, -89, 23, -72, -178, -267, -152, -164, -274, -165, -153, -145, -26, -160, 16, 328, 214, -12, 152, 213, 282, 374, -85, -113, 87, 238, 338, 226, 37, -10, -328, -57, 143, -260, -104, -90, -104, -79, 19, -225, -72, 7, 112, -28, -8, 159, 74, 200, 272, -11, -33, 67, -3, -114, 335, 78, 134, -92, -11, 227, 122, -5, -20, 64, 121, 97, -98, 307, 36, -138, 9, 262, 122, -140, -29, -7, -229, 284, -95, -510, 169, 183, 87, -49, -126, -197, 109, 29, 254, 92, -8, -116, -169, 215, 199, 146, 192, -49, -225, -167, -104, -85, -195, -74, 150, -134, -162, 233, -21, -116, -91, 72, 51, 25, 42, -44, 194, -84, 64, 115, 8, 403, 309, -134, 22, 212, 34, 88, 238, -32, -33, -122]
4197a22N7L3k33m2J95NK03q4Q4j17mM1J97j02Lk44J18J26P2l04L89j13k35J58
4221H1J04k78k57M63q3j35l1M43m99K65P1j94m5K47l55K17pK6n23O93r5l16L49
4244A41p3J72k87O9K42l85K37k50J06J64r3J11k63J26J01o6k10J81j86J56m1j27
4266a75P2j18L2L07K3j33j30Q6k05K79p8m7P5J49j46j24P6P3j18J30J72q6J20
4289B34q9j09j36M6R1J24m93J64N3j8Q8m4n1m2Q0j09M61m57K9J19J94P2l15L26
4313B18J29k94k4K10k05Oj35M20j89k95J25j7K08q2k93J27J8L1j38K19j03M3j36
4336a57L5O4J48l01j72L45K59l55K05j35J80k22K05J29k11k01J56M20k91P2j72
4357AO0m4K7j12q4k8N3Q1K93j51k31j29K05R3O4K40k70j00J30j00K0J31k37k09
$$ y = [-122, -65, -32, -265, -307, -112, -107, 96, 12, 96, -21, -25, 16, 213, 111, 114, -130, -12, 114, 186, -118, 271, 158, -77, 81, 185, -93, -350, 113, 30, -105, -136, 307, -192, 73, 144, -50, -95, 152, -203, 14, 7, 33, -490, 203, 108, -208, 141, 68, 240, -47, 22, 264, -121, 116, -134, -28, 136, 43, 154, -109, 17, 118, 52, -158, 23, -163, -7, -48, -175, -103, -221, -189, 118, 141, 8, -122, -36, -241, 38, -40, -87, -12, 137, -9, -133, -57, 16, -102, 28, 200, 114, 234, 145, 36, -100, -54, 37, 161, -332, -168, -115, -133, -45, -89, -140, -182, -102, -211, 250, -207, -178, -59, 135, 207, -108, 218, 347, 53, 29, 239, 34, 40, -95, 325, 136, -159, -34, -51, 157, 75, -218, -91, -73, -42, -180, 39, -64, -21, -157, -122, -58, 90, -211, -383, -38, 221, -134, 71, -64, 116, -106, 99, 228, 17, -184, -28, 392, 101, 173, 1, 61, 17, 44, -68, -152, -180, -127, -46, 247, 96, -135, -264, -59, 34, 98, 338, 68, -32, 98, -2, 18, 149, -88, -297]
4381b97L12j56J05J17L16l24K77k59k66k2J42k59J0K97J1j89J47j27K80o3j48
4402i6j54K36j48K28q4j9K6r4K29J29j66k28L8L6m3K20l36L43O2k24J10o6j29
4425a30j05J18L2J10j95K83k7j48J69j2j95j97K35M9N2J75j47J49o5j09l8j61
4447a57L57q8j09n7j02K63j92J07j57K95k73l59K13K16j29m0J56j97N7K02k0l02
4469c16J65K00k04R0M8K55j81l8N9j92K14O5o4j64K1L19m84K58N7k21K65j38K9
4492D3k06L45n8Q4j63r4j97K47P7j43k3L1L47k53Q8j72K51j43K4N8J3k22K9p1
4516a08K60k42j40K98k57M4J62k98K58J05q6K83m15j0L8L4k04L11J12j48j70K66
4538I3j08J54o3J73j24k17J94k14J12L5k05Q3J86j05k96L96rMj53j80J81r8O4
$$ y = [-297, 15, -141, -36, 81, 397, 73, 350, 91, -175, -197, -55, -314, -304, -7, 4, -185, -38, -165, 115, 52, -96, -250, -14, -162, 66, -18, -37, -11, -105, 124, 253, 87, -141, -103, -67, -110, 110, -226, 117, 179, -45, 65, -1, -130, -235, -117, -85, 25, -170, 113, 86, -62, 107, 95, -100, -297, -62, -13, 39, 214, 67, 216, 151, 42, 4, -157, 200, 112, 3, -54, -156, 107, -85, 22, -135, 160, -113, -472, -259, -43, -172, -212, -56, -253, -196, 6, -14, -316, -151, 49, -155, -65, -17, 238, 57, 19, 78, -114, 100, 165, 101, -63, -42, 277, -207, 51, 108, -113, 152, 14, 43, -163, 182, 124, 208, 45, -49, -246, 1, 78, -65, -88, -57, 290, 37, 125, -47, 204, 61, 85, 143, 156, -66, -37, -108, 152, -90, -230, 68, -189, -145, 17, -281, -23, 82, -4, 279, -136, -146, -108, -74, -278, 33, 145, -3, -173, 93, -15, 139, 76, 249, 125, -92, 102, -112, 0, 35, -170, -87, 99, -6, -302, 94, 85, 89, -64, -244, -63, -161, -97]
4561i7R2K02l8m8l9K1q2%M5n0j66R7J15n1k0K16Pj81n8K21n05K14j9m7J74k10
4587b07J86J5J0K18k21N5l3L9J00m15J85J27Q6%J5k07K05k75L44K00j62n5k00
4610A0J87k14J49j55J34l06M25l32rk1j05M8J78J12l04L47l69Q7P8J96J97m93
4632a60Q5M5K0K18m07R2O7K21J8k42j65j03K23J18J33m77L03n1o7N0J36j74J0
4655a07J92l25P0k6K82k08oJ57j15K3P1J39O5j7j39K27j90o6K76k65j18K47j09
4678E8r0R0J36l58r9L35k79J15j14j08M40rl27K38%k2RJ44M3k48M1J42k01K11
4702A47j11Q3j85J05N4j29J22k08rJ5L84m10O1J48j19J7l3N2k24J49L36l06Rk1
4726g3Q3L5k6J47o8R0j68j30J73K08k57j7j65l5M62k96q5J46l43Q7K50L01k85
$$ y = [-97, -5, 197, 159, 111, 72, 93, 11, 11, 56, 6, -160, -63, 52, 1, -19, 197, 204, 23, -35, 186, -319, -105, -124, -171, 3, -207, -21, -6, 4, 222, 1, 56, 23, 62, 162, -253, -68, 59, 145, 145, 160, -47, 158, -117, 227, 427, 265, 210, 10, 197, -17, 132, -23, 111, -195, 230, -102, -111, -132, -237, -189, -11, 101, -203, 144, -225, -138, -60, 136, 333, -160, -75, -30, -10, 208, -199, -107, -40, 181, 199, -43, -208, -311, -88, 30, 163, -314, -11, -62, -129, -79, 57, -117, -107, 85, -240, -170, -196, 86, -122, -128, 29, -86, -63, 8, 147, 212, 195, 56, 283, 93, 27, 303, 38, -80, 167, 58, -32, 58, 194, -164, -263, 72, -207, -92, -206, -314, 126, 117, -210, 28, 28, 6, 15, 159, 202, -46, -5, 137, -64, 147, 36, 119, -66, 39, 93, -36, 86, -122, -131, -116, 268, -142, -81, 67, -52, -35, -68, -16, -240, -91, 245, -61, -52, -73, 10, 45, 19, 166, 98, 188, 20, -110, 63, 271, 14, -3, -168, -203, 259, -37, -122, 24, -319, -232, 18, 319, 34]
4749C4l39j3M83l19K39K47l08Q9o4L2j53n2K09P9rk53J07J52j76K21j08n6j85
4772a43k7J41p0n6J03j51Q9O4L3Rr7n5ppl2N8J05k5K42J8j88n0K3k33M84j27j26
4799b5O0J42k14m7J53j27J35J85k34p4J33N4j36l83M36J62l86l5J89N5j66j1J05
4822b9p2P0l8Q5K57j20m17N42k68O7j46O7J43j32J73J00k05k14J56OL8r2k46K40
4846c5P2m4l77M11P5k14K70k67j92J56j58N13l3l6k53o3J22J17L03l94J45j76
4868e8P2M1K8m3P0L3l87K34n8N8oj91M20k69J21k15R6O4P1k78J79k56Q6k8L87
4893A71j10p9J55J64k52K82p7m37J67K78k85K00k59L33p9m43L43L1k71J16J20
4914F8j95r7J46k01nL86l02N2o0R1P0J32L01k52Q5l25q3l9R5K16J26k46o5L6R8
$$ y = [34, -305, -318, 165, -154, 85, 332, 24, 113, 49, 81, -72, -124, 85, 164, 155, -98, 9, 161, -15, 206, 98, 42, -143, -170, -29, -99, -155, -52, -203, -114, -50, -17, -8, -105, -160, -167, -174, -206, -148, -43, -68, 174, 192, 4, -46, -23, -256, 228, 101, -25, 35, 177, -37, -84, 69, -58, 77, 262, 28, -46, 87, 141, 5, -378, 58, 220, -166, -201, -12, 43, -123, -134, -29, -101, -31, -69, 16, 273, 153, -264, 278, 10, 77, -69, -2, 141, 9, 182, 282, 77, -137, 19, 25, 63, -29, -275, -35, 37, -7, -384, 27, 102, -112, 158, -109, -301, -145, -303, 210, 177, 141, -112, -175, -53, 64, 367, -27, 118, -58, 14, 55, 83, 40, 110, 143, -244, -10, -68, -10, -16, -207, 213, -56, 65, -150, -54, 10, 81, -197, -18, -274, -188, -216, 171, 61, -18, 137, 301, 49, 331, 254, -183, -16, 262, -23, 177, -82, 251, 172, -271, 72, 103, -168, -52, 68, -127, -224, -78, -279, -284, 102, -200, -148, -208, -117, -47, 85, 386, 134, 219, -106, -189, -228, -133, 83, 209, -37, -102, -66, 32]
4939C2l89m0O32K0m75K7k2K26l3r6J46j14K73k26J73k23J42j7pJ91j09Kq0n5o6
4964h8R0J08Np7k6k2Q8J15l58J21J2K8K40m04J93k18J60j48K33r7j1K1jo4j56
4989b56L14J16o9Kj66J29k09L08Q7j74J8o9j50L7nM37l55K2j67J10o3J06j67R0
5013g4N1J23j3k67j25J89J36l95M06n4j10p7PK68j4j78J03J13j95K81J4k78O9
5036b0k00K28J75K6l66J04P6j15j75K09j45N8M58l28q3J36j20J59r7OK32j53j67
5059a02J28J27k42J43J8N39m17j39p4P9j2k0j17J38k20K34J53m25M07m23J65K21
5081A61L2j40N8j39kq6j8J46J66n4k24J46R3j3p0Q0k39L21n0k47J80n3J02k46
5105i6J29n5N8L3r7L2Q1l39J7M83o01L37lJ3O4k3J34j79J3o2J01k19P7J62k01
$$ y = [32, -357, -397, 235, 255, -220, -193, -215, 11, -22, -118, 28, -86, 187, -39, 134, -89, 53, 36, 29, 220, 111, 113, 33, -22, -88, 2, 110, 115, 38, 12, -10, 78, 193, -165, -44, -32, -4, 236, -168, 25, -193, -33, -181, 52, -45, -56, -35, -36, -100, -256, 58, 174, 105, 107, -59, 70, -139, 169, 256, 82, 100, 31, -119, -82, -87, 350, -5, 17, -150, -40, -103, 3, -164, -74, -23, 100, 87, -180, -305, -116, 20, -375, 31, -23, -133, -210, -203, 65, 51, -127, -24, 89, -106, 175, 189, -89, -20, -220, 8, 183, 209, -157, -53, 23, -92, -267, -58, -203, -145, 313, -15, -98, 38, -82, 77, -20, -14, 218, 65, -102, 26, 153, -89, 54, 72, 611, 194, 55, -19, 60, 48, 28, -89, 49, -171, 63, 216, -209, 198, -225, -60, 161, 193, 53, 111, -28, -30, -116, -134, 12, 178, 124, -100, 46, 139, 126, 56, 136, -103, 218, 168, -79, 101, 48, 150, -96, 33, -22, 36, 69, -28, 4, 85, -254, -237, 246, -355, -18, -21, -8, 56, 33, 167, -12, 1, -61, 40, -179, -102, 60, -141]
5130a41J31J26lj25j11o4J12J79k65K02j53R4j90Q4J59mP1R3k77p3N5J61j32J46
5154G5J34J01k14k56O1K08j72N9R1k26RJ40M9o2k2k50J94K57k01L17m15J84k10
5177a49nK24l6p4r4L44k60j0L4j1J27l25J93j0J33P6l9l59L70p9k68j73L86P7
5201G2o0j78k65L01K12k85NJ54k7m8J65j27K73n03L85J87l07L03K9k37L7j62Q7
5224A1j79J59pJ62n8J52l35k47L88m9K34m31J03N1n7l8j74o6J89K80k6R6l83K57
5248C2j20L05kk29k41K64K27j59jl3k26j53L69l6qQ4j09J46M4j3r9O2q1k10K17
5273C0N5k18P1P9O2K25l23kM9O8k00L33j76j01J20k4n6n4O4L7n3j47P3j6j26K80
5299E0m1j5L5k62J51J12M9r5j21k96L04K18p1J24j33j48o9Q9L32o3j01r2K6K75
$$ y = [-141, -10, 116, 113, -12, -123, -187, -75, 104, -161, 41, -112, -18, -208, -124, 35, 31, 102, 195, -82, -155, -100, 61, -71, 75, 209, 310, 96, -160, -99, 109, -63, -4, 87, -139, -130, 10, 59, -3, -25, -275, -81, 176, -25, 292, -123, 61, -149, -154, 70, 34, -40, -134, 210, -50, -60, -26, -37, 90, -235, -42, -52, 81, 157, 118, -241, 129, 50, -218, -391, -5, 72, 12, -166, -431, -130, 82, -203, -198, -44, -71, -119, 46, -81, 192, -311, 74, 261, -46, 257, 286, 49, 86, -76, 11, -168, -9, -16, 146, 88, 240, -95, -342, 46, -3, 231, -200, -97, -46, -103, -141, -315, -381, -192, 88, 62, 158, -225, 32, -88, 217, 215, -14, -255, 9, 236, 77, 76, 43, -183, -336, 33, -3, -11, 73, -36, 110, 154, 141, 42, 104, 23, -187, 30, 85, -133, -62, 17, 79, 304, -19, -21, 28, 96, -104, 229, 53, -48, 72, 48, -8, -62, 2, 39, -14, -161, -88, -104, -230, 50, 9, -6, 29, -233, -82, 30, 79, -16, -137, -433, -129, 89, 18, 142, 9, -139, -208, -119, 213, 150, 49, -43, -17, 258]
5323B58r6j55j38k65M61k05j2J36P7j44r1M3l0j9L25k33P5l88K71J83q8l9N3J57
5347A36j73r0M63p2k05K0po1N8m9J22O5k62K5K30l1k57k8J70K80l56N2k9r7j7
5372a13R5J46j54O0N4j50J99O2j60k08M44l5j80R2q1q2J36L6O2j57k8l75L28L36
5396C27l40j3p4J32R3j12p7o7O4j94K74k6J08Q5j81l1j85q7M01j34K72j22j3j85
5420h5J80M0j28J62j20Ok55L04j58Q3J94k02l82M09m0J19k19j15M3PmJ59J78o7
5444A09l41L53K55m65J43j01K77j06j79L3K49l10j27K18p1j45j04J47o6M0L17
5465A26k89O9P1J13k87P8L49p3o3J0p2kM2K16k26Rp3j54J72P8k23K20l7l11L47
5490I0r0m2J4n6O6Mj3j12N5q0J45P8j84o8n9L30j86K8M71m95n0M34q7J41l67K16
$$ y = [258, 162, 7, -131, -396, 65, -140, -152, -16, 61, -83, -174, -131, -161, -180, 145, -88, -13, -401, -130, 53, -35, -74, -21, 136, -37, -127, 336, 264, 59, 79, 72, 11, 69, 20, 142, 207, -55, -30, 200, 169, -88, -116, 54, 334, -22, 30, 1, -96, -113, -18, 128, -26, 34, 88, -62, 137, 199, 39, -169, 275, 240, 60, 152, 71, -11, 125, 161, 223, 66, 38, -337, -9, 327, -13, -26, -100, 32, 125, 13, -64, -131, -67, -261, 13, -13, 95, 180, -1, -32, -217, -304, 97, -37, 235, 113, 100, -85, 95, 135, 7, 169, 49, 55, -200, 104, -54, 29, 223, 21, -361, 48, 8, 127, -92, -207, -164, -157, -161, -2, 176, 109, -232, 121, 376, -89, 54, -47, 230, 124, -55, -22, 227, -83, -210, 8, -63, -208, -312, -165, -231, -191, 126, -163, -94, -23, 90, -197, -119, 230, 157, 94, 104, 32, 30, 72, 288, 62, 71, -2, -156, 16, 94, -129, 91, 54, -257, 90, 0, -42, -28, -84, -18, -14, -27, -139, -84, -164, -19, 59, -125, -193, -252, 78, -108, -80, 391, -104, -154, 280, 193, 334, -33, 183]
5516A83m47L25p2L42l93N9L4k15k2R6KM2j69L08P2k17J24L2p3J44k33k35M38l46
5540b21P1J84K65o4n71M57j74L88l48J5K13q8j60M7k24M31Qk92%N1J88n8j12j05
5564i9J07O4q7rj41N6K82l61L01k17K02J1l6k08K72n9l5k9j8j8k1k1J18j09O4
5589IN1j92O8J80j33K84l55Jj69K84J01k70R3J6l4j36L82m0J36j66k2j46M8K15
5613B05j36l9J73q1j54K29j26m4k03K29j67O4J17J01l21R1J51N3j44j69K88j60
5635d3J01o9L32j83Rn6pO7nN6l15K17K6o5J38k61j70L93l00J10q9j16J86J82n7
5660H1q6J7j73J76M9j73K08l39J58J07Q9m4O4p5M4j06j33K73j13P5M9J22k13J4
5684G1Q5j49L35l71p6m4r0K95j87o9J49m4J61R8j13R8jj32q8K50j86l9J89j56
$$ y = [183, -264, 61, -11, 331, -62, -3, 31, -184, -206, -110, -108, -66, -235, 73, 145, -72, 52, 84, 11, 155, -78, -313, 125, -221, -150, 34, 299, 235, -336, 121, -53, 335, -13, 2, 215, 127, -33, 14, -210, 221, 229, -63, -63, -12, 176, 118, 6, -99, 8, 72, -15, -24, -165, -109, 173, -188, 113, -104, 98, 109, 73, -135, 137, 78, 43, 14, -4, -22, -43, -64, 54, -55, 9, 60, -132, -64, 116, -17, 267, -88, -87, -256, 28, 129, -141, -48, -32, -66, -202, 180, 140, 276, 110, 88, -58, -10, 205, 69, 30, 203, 122, -32, 197, 71, 27, -176, 53, -114, -50, 67, 168, -153, -62, 89, 142, -2, -171, 117, -43, 58, -11, 321, 138, 147, 91, 84, 151, 146, 202, -113, 104, 130, 65, 203, -58, -228, 165, -135, -25, -114, -230, -44, 138, 81, -5, 12, -161, 15, 64, -109, 99, -240, -82, 25, 114, 70, 134, 59, 103, -3, -136, 137, 24, 99, 148, 270, 57, 71, 156, 7, 342, -29, -105, -149, -239, 56, -131, -200, -51, -95, 66, 164, 51, 149, 148, 16, -72, 178, -8, -47, 142, -14]
5708a4o9K45P7k62L8J46j64J50o3j44r2J38J03j00j13L79l31KJ40Q7k38j34L75
5731A56j03j33Q8n3j74Q4J8L44o2l17oK27k06Q6j31J59J17l0L8k04n4L9K07m31
5755c41K16J01j07RP9L02k36j30J10k8k27L37L1q3L5q8k9K88l22k3J42m7n5NK68
5780B07l56K23j82N9J10L6p5j96L28k63K1m7l0J59k42K91K6J09l05L4o9K38q0
5803dJ51J69l39J17q6j7J35k98J61j0K53j57r5j88JJ28J40k11N6Q8j43K28j67
5826h8K33j01l8r0J73R4q3J90n56J94J57r3O8Rj83j45J20n4Q2J67J29k86K83j85
5850cL4j80L69j80J54p6Ok76ML47j42j03J46K19k8l75J75p4J65q7o0J35m06J47
5874h9j17M97j42j73J41p7L8j25k1J42n4j72K60l66J99j48J29K6K56M2l10j73
$$ y = [-14, -83, 162, 239, -23, 15, 161, -3, 147, 84, -60, -152, -14, 89, -11, -124, 255, -76, -74, 66, 153, -85, -219, 156, 53, -80, 8, -45, -219, -135, -117, 227, 165, -152, -158, 69, -137, -51, -182, -23, 94, 64, 102, -102, -156, -117, 90, -341, -125, -24, -131, -122, -43, 259, 23, -107, 3, -25, -252, 85, 116, 33, 68, -20, -49, 239, -83, -106, 36, -11, -66, -61, 207, -149, 74, -108, -49, 61, 97, 22, -174, 154, -109, -88, -135, -165, -6, -248, 43, 69, 178, -127, -93, -162, 76, -4, 147, 316, -23, 94, 8, -9, 126, -172, -11, -21, 232, 75, -20, -208, -207, -79, 61, -150, -94, -6, -149, 79, -88, 145, 44, 6, -84, 89, 183, 100, 290, -266, -72, 85, -8, 60, 69, -114, -259, -139, -193, -111, 56, 185, -101, 182, -3, 31, -149, 220, 40, 194, 118, 124, -152, -148, 199, 57, -46, 100, 319, 291, -84, 91, 17, 182, 95, 35, 170, -236, -89, -206, 291, 149, -24, 117, 40, 78, -47, -68, 74, 20, -152, 108, -258, -59, -207, -78, -52, 204, 246, -64, -237]
5896b37J13K77j31llK2Q5m0J60q2l63K8L08j12L6k5k85K29K55j47o3j80J67Kk
5921Ij7p0n6J11K56k95k9K25q1n0L16j75j12N6j52J74J6j64p4L64n57L34k59K47
5945A7m8j99J7L71m3j53J32k14J91k63J47L08n30K93p4J26j34r1J07L22n6j77
5967D9P1l8j85K24J43j59q3m6J07L8K4j11j6k45J72K02j7K2N1J30l35J33q5k20
$$ y = [-237, -124, 153, 22, 19, 16, 38, 123, 83, 243, 161, -202, -174, 134, 22, 58, 33, -252, -23, 232, 85, 22, -158, 9, 11, 9, -8, -78, -134, -23, 233, -62, -91, 134, 53, 3, 319, 144, 32, 88, -64, 110, 126, -38, -112, 252, -305, 29, -230, 17, -31, -230, -213, 158, 115, -38, 94, -120, 71, -192, -45, 263, -267, 26, -48, 78, -56, -147, -40, 282, 226, 49, 120, 82, -103, 121, 264, 105, 22, -24, 83, 121, 145, 34, 18, -227, -55, 147, 130, 152, 203, 333, -2, 131, 46, -174]
$$ [...]
8191a26
##END NTUPLES=NMR FID
##END=
