##TITLE=1H_Ser 5-6-V-2
 CDCl3
 8 sc, 
 16.11.2021
##JCAMPDX= 6.0         $$ Bruker NMR JCAMP-DX V2.0
##DATA TYPE= NMR FID
##DATA CLASS= NTUPLES
##ORIGIN= UXNMR, Bruker Analytische Messtechnik GmbH
##OWNER= root
$$ XWIN-NMR		Version 3.5
$$ Tue Nov 16 11:37:33 2021 Russian Standard Time (UT+4h)  she@DPX200
##.OBSERVE FREQUENCY= 200.131346
##.OBSERVE NUCLEUS= ^1H
##.DELAY= (6, 6)
##.ACQUISITION MODE= SIMULTANEOUS
##.ACQUISITION SCHEME= undefined
##.AVERAGES= 8
##.DIGITISER RES= 18
##SPECTROMETER/DATA SYSTEM= spect
##.PULSE SEQUENCE= zg30
##.SOLVENT NAME= CDCl3
##.SHIFT REFERENCE= (INTERNAL, CDCl3, 0, 15.7039)
##AUDIT TRAIL= $$ (NUMBER, WHEN, WHO, WHERE, WHAT)
$$ ##TITLE= Audit trail, XWIN-NMR		Version 3.5
$$ ##JCAMPDX= 5.01
$$ ##ORIGIN= Bruker BioSpin GmbH
$$ ##OWNER= she
$$ F:/spectra/data/she/nmr/H-F/1/audita.txt
$$ ##AUDIT TRAIL=  $$ (NUMBER, WHEN, WHO, WHERE, WHAT)
(   1,<2021-11-16 11:36:06.28 +0400>,<she>,<DPX200>,
      <created by zg, POWCHK disabled, PULCHK disabled
       configuration hash MD5:
       00 E9 B6 7A A2 85 ED C7 34 08 36 98 17 FE 4E 26
       data hash MD5: 16K
       40 EF 4B 68 C7 59 52 E4 CE B5 83 53 AA 84 82 B2>)
$$ ##END=
$$ 
$$ hash MD5
$$ 1C 95 18 05 83 46 D8 84 73 C5 4E A2 DF 1F CD 13
##$RELAX= 
##$RELAX= 
##$RELAX= 
##$RELAX= 
##$RELAX= 
##$RELAX= 
$$ Bruker specific parameters
$$ --------------------------
##$DU= <F:/spectra>
##$EXPNO= 1
##$NAME= <H-F>
##$PROCNO= 1
##$TYPE= <nmr>
##$USER= <she>
##$AMP= (0..31)
100 100 100 100 100 100 100 100 100 100 100 100 100 100 100 100 100 100 
100 100 100 100 100 100 100 100 100 100 100 100 100 100 
##$AQSEQ= 0
##$AQ_mod= 1
##$AUNM= <au_zg>
##$AUTOPOS= <>
##$BF1= 200.13
##$BF2= 200.13
##$BF3= 200.13
##$BF4= 200.13
##$BF5= 200.13
##$BF6= 200.13
##$BF7= 200.13
##$BF8= 200.13
##$BYTORDA= 1
##$CFDGTYP= 0
##$CFRGTYP= 5
##$CHEMSTR= <none>
##$CNST= (0..31)
1 1 145 1 1 1 1 1 1 1 1 1 1 1 1 1 1 1 1 1 1 1 1 1 1 1 1 1 1 1 1 1 
##$CPDPRG= <>
##$CPDPRG1= <>
##$CPDPRG2= <>
##$CPDPRG3= <>
##$CPDPRG4= <mlev>
##$CPDPRG5= <mlev>
##$CPDPRG6= <mlev>
##$CPDPRG7= <mlev>
##$CPDPRG8= <mlev>
##$CPDPRGB= <>
##$CPDPRGT= <>
##$D= (0..31)
0 1.2 0 0 0 0 0 0 0 0.06 0 0.03 0 0 0 0 0.0002 0 0 0 0 0 0 0 0 0 0 0 0 
0 0 0 
##$DATE= 1637048165
##$DBL= (0..7)
120 120 120 120 120 120 120 120 
##$DBP= (0..7)
150 150 150 150 150 150 150 150 
##$DBP07= 0
##$DBPNAM0= <>
##$DBPNAM1= <>
##$DBPNAM2= <>
##$DBPNAM3= <>
##$DBPNAM4= <>
##$DBPNAM5= <>
##$DBPNAM6= <>
##$DBPNAM7= <>
##$DBPOAL= (0..7)
0.5 0.5 0.5 0.5 0.5 0.5 0.5 0.5 
##$DBPOFFS= (0..7)
0 0 0 0 0 0 0 0 
##$DE= 6
##$DECBNUC= <off>
##$DECIM= 32
##$DECNUC= <off>
##$DECSTAT= 4
##$DIGMOD= 1
##$DIGTYP= 9
##$DL= (0..7)
0 120 120 120 120 120 120 120 
##$DP= (0..7)
150 150 150 150 150 150 150 150 
##$DP07= 0
##$DPNAME0= <>
##$DPNAME1= <>
##$DPNAME2= <>
##$DPNAME3= <>
##$DPNAME4= <>
##$DPNAME5= <>
##$DPNAME6= <>
##$DPNAME7= <>
##$DPOAL= (0..7)
0.5 0.5 0.5 0.5 0.5 0.5 0.5 0.5 
##$DPOFFS= (0..7)
0 0 0 0 0 0 0 0 
##$DQDMODE= 0
##$DR= 18
##$DS= 0
##$DSLIST= <SSSSSSSSSSSSSSS>
$$ [...]
##$SUBNAM2= <"">
##$SUBNAM3= <"">
##$SUBNAM4= <"">
##$SUBNAM5= <"">
##$SUBNAM6= <"">
##$SUBNAM7= <"">
##$SUBNAM8= <"">
##$SUBNAM9= <"">
##$SW= 18.0517287032376
##$SWIBOX= (0..15)
0 0 2 0 0 0 0 0 0 0 0 0 0 0 0 0 
##$SW_h= 3612.71676300578
##$TD= 16384
##$TD0= 1
##$TE= 0
##$TE2= 300
##$TE3= 300
##$TEG= 300
##$TL= (0..7)
0 120 120 120 120 120 120 120 
##$TP= (0..7)
150 150 150 150 150 150 150 150 
##$TP07= 0
##$TPNAME0= <>
##$TPNAME1= <>
##$TPNAME2= <>
##$TPNAME3= <>
##$TPNAME4= <>
##$TPNAME5= <>
##$TPNAME6= <>
##$TPNAME7= <>
##$TPOAL= (0..7)
0.5 0.5 0.5 0.5 0.5 0.5 0.5 0.5 
##$TPOFFS= (0..7)
0 0 0 0 0 0 0 0 
##$TUNHIN= 0
##$TUNHOUT= 0
##$TUNXOUT= 0
##$USERA1= <user>
##$USERA2= <user>
##$USERA3= <user>
##$USERA4= <user>
##$USERA5= <user>
##$V9= 5
##$VALIST= <valist>
##$VCLIST= <CCCCCCCCCCCCCCC>
##$VD= 0
##$VDLIST= <DDDDDDDDDDDDDDD>
##$VPLIST= <PPPPPPPPPPPPPPP>
##$VTLIST= <TTTTTTTTTTTTTTT>
##$WBST= 1024
##$WBSW= 4
##$XGAIN= (0..3)
0 0 0 0 
##$XL= 0
##$YL= 0
##$YMAX_a= 109793
##$YMIN_a= -211553
##$ZGOPTNS= <>
##$ZL1= 120
##$ZL2= 120
##$ZL3= 120
##$ZL4= 120
##$ABSF1= 10
##$ABSF2= 0
##$ABSG= 5
##$ABSL= 3
##$ALPHA= 0
##$AQORDER= 0
##$ASSFAC= 0
##$ASSFACI= 0
##$ASSFACX= 0
##$ASSWID= 0
##$AUNMP= <proc_1d>
##$AZFE= 0.1
##$AZFW= 0.1
##$BCFW= 1
##$BC_mod= 2
##$BYTORDP= 1
##$COROFFS= 0
##$CY= 11.3945322036743
##$DATMOD= 1
##$DC= 2
##$DFILT= <>
##$DTYPP= 0
##$F1P= 2.36226072786647
##$F2P= -0.459571619588291
##$FCOR= 0.5
##$FTSIZE= 0
##$FT_mod= 4
##$GAMMA= 1
##$GB= 0.15
##$INTBC= 1
##$INTSCL= 1
##$ISEN= 128
##$LB= 0.24
##$LEV0= 0
##$LPBIN= 0
##$MAXI= 10000
##$MC2= 0
##$MEAN= 0
##$ME_mod= 0
##$MI= 1.114404
##$NCOEF= 0
##$NC_proc= 0
##$NLEV= 6
##$NOISF1= 3.799351
##$NOISF2= 2.8
##$NSP= 1
##$NTH_PI= 0
##$NZP= 0
##$OFFSET= 15.70392
##$PC= 1
##$PHC0= -15518.41
##$PHC1= 18.80081
##$PH_mod= 1
##$PKNL= yes
##$PPARMOD= 0
##$PSCAL= 0
##$PSIGN= 0
##$REVERSE= no
##$SF= 200.130013532006
##$SI= 16384
##$SIGF1= 3
##$SIGF2= 2
##$SINO= 400
##$SIOLD= 16384
##$SREGLST= <1H.CDCl3>
##$SSB= 0
##$STSI= 0
##$STSR= 0
##$SW_p= 3612.71676300578
##$SYMM= 0
##$S_DEV= 0
##$TDeff= 0
##$TDoff= 0
##$TI= <>
##$TILT= no
##$TM1= 0
##$TM2= 0
##$TOPLEV= 0
##$USERP1= <user>
##$USERP2= <user>
##$USERP3= <user>
##$USERP4= <user>
##$USERP5= <user>
##$WDW= 1
##$XDIM= 8192
##$YMAX_p= 0
##$YMIN_p= 0
$$ End of Bruker specific parameters
$$ ---------------------------------
##NTUPLES= NMR FID
##VAR_NAME=  TIME,          FID/REAL,        FID/IMAG
##SYMBOL=    X,             R,               I
##VAR_TYPE=  INDEPENDENT,   DEPENDENT,       DEPENDENT
##VAR_FORM=  AFFN,          ASDF,            ASDF
##VAR_DIM=   8192,          8192,            8192
##UNITS=     SECONDS,       ARBITRARY UNITS, ARBITRARY UNITS
##FACTOR=    0.0002768,     1,               1
##FIRST=     0,             0,               0
##LAST=      2.2672688,     0,               0
##MIN=       0,             -211553,         0
##MAX=       2.2672688,     109793,          0
$$ Real data points
##PAGE= N=1
##DATA TABLE= (X++(R..R)), XYDATA
$$ [...]
1796F78O5K22l00j198K64K62j51O04l83n40j01J77l52K28N71p2q28K20K63k4Q82
1817D87M0o97j4k00M63P90m4o85l29J56J17M44J27j91o37k64L1K46Q51l92o77
1838c78j2m55J68J178k64k98m33m7L05M96O00k66o07m7j37J65R03l31j27k39o29
1859d55M82L38J58j47m52n62J81O1M22j47j59j83m43J71P82L31o8m96m78P3Q12
1880B21K36Pk60o70M83L84K70k53L2j35o13m7N88l2K29j03j056M6N48J8M38k48
1902H3q44nJ95P57k24Q5k86n14K42N43k4M55R5q60R4MJ21R21m35p29J03k34P01
1925B44J03J49n15m86K64Q5J0P33l88n78J63j72j21J079l0n76o11K99J46M92K61
1946E51k30n41j44M52N6N95j65l57k42j26R3Q15k93l13j64n63K95N13K54K19j012
$$ plain form
1796 678 743 965 665 -533 -269 -7 -158 446 63 -477 -578 -401 -753 -525 46 -26 -854 -634 -371 -395 487
1817 487 527 -170 -184 -384 79 869 825 140 -189 -33 84 528 655 464 -173 -437 -406 -160 691 299 -378
1838 -378 -390 -845 -677 501 237 -61 -494 -541 -236 260 860 594 -13 -60 -197 -32 871 540 413 174 -455
1859 -455 27 365 523 376 -76 -638 -457 -396 26 -121 -280 -463 -906 -735 47 378 310 -186 -664 -591 221
1880 221 457 464 204 -466 17 401 671 418 450 315 -298 -345 243 211 440 337 -719 -673 -125 -107 331 83
1902 83 -761 -766 -571 186 -38 47 -239 -753 -511 32 8 463 558 -302 -208 -204 -83 838 403 -326 -223 -457 244
1925 244 347 496 -19 -505 -241 -156 -146 587 199 -379 -216 -388 -509 570 540 -36 -647 -348 -202 290 551
1946 551 321 -220 -364 88 144 739 574 217 -25 -151 -58 757 464 151 -13 -576 -281 232 486 705 -307
1967c07o68K43M04N23k2m49j77k31K76O34K22N0p05l95M29J98M61K44k93m89l20
1988c72K13O75k33R9n37p00K12P05k47M61o58m69L07pM96M17j05j86p98N21O36
2009D30JJ50j84o67L26M31K27N7k84l68k73k9N88j23j33Qp15l87P01K93k34J36
2031d9m79j25Q9N53N02l93j35k34L1M55M56Mk12o28K0N11J31J83n43k10j47l52
2053e72L32M29m35j22Q4n03L04M95K38j8n14j48J78J28R26k49m71J63j49k52J029
2074H73j96j01n77m24L88K6N51j19q71J8K4p8Q97j47n25k51J89J31J78K97J58
2095D41o90j03N19k71L47K66l46k06k3j03J99L73o1o00k35N41l02L45O47p17m54
2116d33K23j10N14M66m16l72l86K47M36J6J54m46n26J78L9L80M84n10l36J87J
$$ plain form
1967 -307 -975 -732 -328 195 173 -276 -453 -684 -408 226 448 498 -207 -602 -173 25 486 730 437 -52 -372
1988 -372 -159 516 283 382 -155 -855 -643 62 -185 276 -382 -851 -544 -551 -55 362 257 71 -727 -206 430
2009 430 431 581 397 -270 56 487 714 771 487 119 -154 -183 405 282 149 157 -558 -945 -244 49 -185 -49
2031 -49 -528 -653 -564 -11 491 98 -37 -271 -240 215 671 675 463 -165 -145 366 497 680 137 -73 -220 -572
2053 -572 -240 189 -246 -368 -284 -787 -483 12 250 232 -282 -430 -252 -124 802 553 82 245 96 -156 873
2074 873 677 576 -1 -425 -37 -11 540 421 -450 -432 -408 -486 411 264 -261 -512 -323 -192 -14 283 441
2095 441 -249 -352 167 -104 243 509 163 -43 -66 -169 30 403 342 -258 -493 48 -254 91 738 21 -433
2116 -433 -210 -320 194 660 244 -128 -514 -267 169 185 339 -107 -633 -455 -416 -36 448 -62 -398 -211 -210
2137b10M71J98k91K04o14J70L86j87K6m6m01J26K3J5L19j90J94n92j88O73l58
2158b72p7M80m11m70M78N10q5K25l17k47k12R26P7k18J43n89J72M27K35k65k90
2179B20j4l27j57K86J06n83L15l98KK29M85m01J52J04m70J44J61L51J75k45k1
2200A14o1j45P13n63K18k70l77L77J99j20N3m68l10J5OM04P6l13J15k43L30O03
2222C53J21k24j21Q0O1Q1L56J0o65J66Q8j95M07j9o93M09r7R4l1kr5k01m70K77
2246c10n2M91L6l38P4qj82N63J41m32J21k39n1O03k50J4j54j12P1j55N67j27j78
2269I3l20J08M0K72p9j07Jmk00N09l19J34l8m8k74j22O64M8m11K46l54j72P14
2292C81k32r8Q0l92k47N22K5K87n4l38o8j81K84%Jk3m33K0M07k8r7L20m05m68
$$ plain form
2137 -210 261 459 168 372 -242 -72 314 127 153 107 -294 -168 -145 -130 189 -1 193 -399 -587 86 -272
2158 -272 -349 131 -280 -750 -272 238 153 378 61 -186 -398 528 605 387 530 -59 113 540 775 510 220
2179 220 206 -121 -278 8 114 -469 -154 -552 -550 -321 164 -237 -85 19 -451 -307 -146 205 380 135 114
2200 114 53 -92 621 58 276 6 -371 6 205 85 138 -330 -640 -625 -619 -215 -139 -452 -337 -580 -250 353
2222 353 474 250 129 209 270 351 707 717 52 218 306 111 518 499 -194 215 118 212 181 179 84 -117 -587 -310
2246 -310 -362 129 165 -173 -99 -107 -289 274 415 -17 104 -135 -186 417 167 181 27 -85 -14 -169 398 271 93
2269 93 -227 -119 -79 193 114 7 8 4 -196 313 -6 128 90 42 -232 -354 310 358 -53 193 -161 -333 381
2292 381 149 51 131 -261 -508 14 39 326 272 -66 -134 -315 -31 -31 -30 -53 -486 -466 -59 -87 -184 136 -269 -737
2316g37N16L72k35j56K37p9k62M36K8q8M80p48M78K54j62J08K4l65p2R8j64N65
2338E28k97l79J19l48K45j9q8J16k52M1L32l56K55L05n05K28J53R9K13K94o99
2359a5k14K74K92l72J80K47p50K88J08j52r7J18k92J77k72mL06j47L38k38q0K37
2381f8Q1J74m4l25M46J10j79K81p2l30J99l38L8K90P3l47j98J38n1k63M87o90
2403e88L21k10K14l55N41lj61J21k92J60M04jR2p5mj44K61J32Nl38J61r8j27L29
2427C45j82k00j28k32R6K06L5N7k48K7j06N4L02j11J57j96J2K04K14k41j28L66
2449C03l34j3L44l09L62l28K9l8k97K51K60k27k2n01J80L19l8OO9m99M24q4j00
2472b43J73%P6k0k88M42l4J39Q4k80J12J6k5M21k73m77J62j27K89J10m4l06j3
$$ plain form
2316 -737 -221 151 -84 -240 -3 -82 -344 92 120 32 512 -236 242 496 334 442 466 101 29 127 -37 528
2338 528 231 -148 -29 -377 -132 -151 -239 -123 -375 -334 -2 -358 -103 202 -303 -75 78 177 390 684 -15
2359 -15 -229 45 337 -35 145 392 -358 -70 38 -114 -211 -93 -385 -208 -480 -484 -178 -325 13 -225 -305 -68
2381 -68 13 187 143 -182 264 374 195 476 404 74 273 -65 -27 263 336 -11 -209 -71 -122 -385 102 -588
2403 -588 -267 -477 -263 -618 -77 -80 -241 -120 -412 -252 152 151 243 168 164 20 281 413 418 80 241 143 16 345
2427 345 163 -37 -165 -397 -301 -95 -60 -3 -251 -224 -330 -276 26 -85 72 -124 -112 92 306 65 -63 303
2449 303 -31 -44 300 -9 353 25 54 16 -281 -30 230 3 -19 -520 -340 -21 -59 -53 16 -483 -59 -143 -243
2472 -243 -70 -70 6 -14 -302 140 106 245 329 49 161 177 152 573 300 -177 -15 -142 147 257 213 -93 -106
2495a06O3nn0M00J1p56M55J35m40P27m66m00K46m0K55J02L7Lk57K41K50m69K40
2518A76J6l76J68lj8K88K7m58J77l85N01p2j42O2k57l45N81l36L66j01p8j08J40
2541a77K71J61j21k06K82m22J32N30j51k16m6P6L9L8K01j94k51k7j06J40Q9m98
2563d56J68P8j19K80R3m3O4k36L14k05J03M09j90k98J96l31K15J96nj13j37r6
2585a13oM5J86j78l01o6K33m72M74K16l98K23j82J30O8J91o3R2J8K62j9m2R8l78
2609A8J7L30j86k7j05j43k44L00R3k67L5K66j55j73M3k60K88J18m2p8J96m5O5
2632D4m0M37l91j80J32n2J89L21l45l70K89k31M15L9l6m25j55K05L40j75r0J53
2654G4k82O5J21K00j50K01m40K5L48q6K45k59O7j43j36M27j60L3n0Q5l9m25M43
$$ plain form
2495 -106 -43 -48 -98 302 313 -443 12 147 -293 434 -32 -432 -186 -226 29 131 168 171 -86 155 405 -64 176
2518 176 192 -184 -16 -19 -37 251 278 -180 -3 -388 113 41 -101 -39 -296 -641 -60 -396 -30 -131 -209 -317 -177
2541 -177 94 255 134 -72 210 -212 -80 450 299 83 37 113 152 190 391 197 -54 -81 -187 -47 42 -456
2563 -456 -288 -210 -329 -49 44 1 65 -171 143 -62 41 450 260 -38 158 -173 42 238 233 120 -17 -113
2585 -113 -119 -74 112 -66 -367 -433 -200 -672 -198 18 -380 -157 -339 -209 -141 50 -13 79 97 359 340 298 396 18
2609 18 35 365 179 152 47 -96 -340 -40 53 -214 -179 87 -68 -241 -198 -458 -170 -52 -94 -172 24 -21 44
2632 44 4 441 50 -130 2 -50 139 460 115 -255 34 -197 218 257 221 -204 -359 -154 186 11 -79 74
2654 74 -208 -143 -22 178 28 229 -211 -186 162 76 321 62 129 -14 -150 277 117 150 100 185 146 -279 164
2677A64n2j33R2l52k4K65M4q3O9m09J98J56l6l4J92l00J52k04N38J08m79j23L26
2700G5l46M64l2L16m88j18Q5K79N6J68k98j19r6l6N6K18K4r3j83K2L4L9O5J40
2724B32n27J14j8j34N98o4l26M4M5J89J50PN2k35Jk0k47M09Lm17K5o4L1k6J59
2749a9j35k02j43K14k2NL69k05J0L7J51J79J15j24k29j16P2L84l00L21k8m83K28
2772G9J86K9j36k09j32j84K01N9k78N01l13l45J85L74j40N6n4j86L00K78l5q7
2794A49L32l05p0r1N53l76n9J4l78L67O7p5p4j64M1l30K80J78R5j95J86m78J38
2817a95J47P1n1L64m21j2K53MK05j90j22J53l08j4K75j02J09k20j41N2J03L6l69
2840c73m3qN8J91M66k95q8N1K2O8J85j80J91k78qJ75K9R9r3k08J55j12l10O23
$$ plain form
2677 164 112 -21 71 -281 -305 -40 4 -79 -10 -419 -221 -65 -101 -135 57 -243 -91 -295 243 351 -128 -251 75
2700 75 -271 193 161 477 -11 -129 -44 235 291 459 161 42 -54 -90 -34 184 208 115 -68 -46 -12 27 92 232
2724 232 -295 -181 -199 -333 265 201 -125 -81 -36 153 303 310 362 127 128 108 -139 270 273 -144 -119 -183 -152 -178 -19
2749 -19 -154 -356 -499 -285 -307 -302 67 -138 -128 -91 60 239 354 230 1 -115 -43 341 41 362 334 -149 79
2772 79 265 294 158 -51 -183 -367 -166 -107 -385 116 -197 -542 -357 17 -123 -67 -121 -307 -7 271 236 149
2794 149 481 176 106 15 568 192 133 147 -231 136 203 128 54 -110 -69 -399 -119 59 154 -41 145 -333 -195
2817 -195 -48 23 -28 336 -85 -97 156 160 365 175 53 206 -102 -116 159 57 166 -54 -195 -143 -40 -4 -373
2840 -373 -416 -424 -366 -175 291 -4 -92 -41 -19 49 234 54 245 -33 -41 134 163 262 169 -39 116 4 -306 317
2864C17k44q4Kj26p2N19j65n6j90j07J48k64M90j62j29j1l15L26L87O8j95Pl68
2887b24L37o7j32J98k35K7n1J16M12k49J09j77k25J77R8n3o2J20m50K44J59k31
2909a59K51k46Q2k99Q1M87j62L03m83j78K82N1R6M33n23j19m6K39M5K51k27n4
2931A05l68O5L47j3J13l12j41q4j7J26K23m5k57l3j3L69p1K82k44j00K62j49k24
2954a79N97p8m02K97k26J94N8q3k34np2OK90j90J9k37p8J20J57P0M1j32J36l86
2978c17K11L29m4J9j58k19J66L46k60R6j38J14l21O5J62r9j21O6j87L03M5q0l04
3001c26J35p5J04K07O5p4j00N0j58J18K73J70k82J63l27M44L3q2j04R3m91L0J87
3024E3j30K18l29J40n8K5r5K13J38k97j46O6N43l49K63m5m40N20m07K83K13k64
$$ plain form
2864 317 73 -11 -9 -135 -207 312 147 91 -99 -206 -58 -322 168 6 -123 -134 -449 -123 264 332 137 144 -224
2887 -224 113 46 -86 112 -123 -96 -147 -31 381 132 241 64 -161 16 114 61 -1 119 -331 -87 72 -159
2909 -159 92 -154 -72 -371 -290 197 35 338 -145 -323 -41 10 106 539 16 -103 -149 90 135 386 159 105
2931 105 -263 -198 149 136 249 -63 -204 -288 -305 -179 44 -1 -258 -291 -304 65 -6 276 32 -68 194 45 -179
2954 -179 418 340 -62 235 9 203 261 178 -56 -61 -133 -127 163 -27 -8 -245 -323 -203 -46 24 65 -67 69 -317
2978 -317 -106 223 179 198 40 -179 -13 333 73 169 31 145 -176 -111 51 -48 -169 -103 -290 13 58 -22 -326
3001 -326 -191 -266 -162 45 110 36 -64 -14 -172 -54 219 389 107 270 -57 387 420 338 234 327 -164 -134 53
3024 53 -77 141 -188 -48 -106 -81 -176 37 175 -122 -268 -202 341 -8 255 210 -230 290 -117 166 379 115
3046A15n5l07K15R7k35O02k09m00K44k45R3J39j2r0P3j52n6J79j59K73j35j36
3068a61J79K02j95qk45M9K15K41k39K7n0K00l40J64j47J25K61k43j36R3k7O1l6
3091a0M7q9l5J25L9L3K9k62J1l9K84k23L90k39k89J22o8J90R9n7m6J38j61N29
3115E18k77n42K99J4N5J64o5o7l30Q4j01L62J06m32l9o2m4q1K88J35N8J3l2N0
3139G4j19m4L83m8m6o0l20L54K3j37R5k99j02rK41Lk37L9j33j01J26N18k05R2
3163H8l12J37L17k34m6J37J59Q8k48j21L12k25q4L83o1k14J68J11k01l55J61N
3185c5k03L39n0l07K9n5R4L34j44j37k6K57Mj17M70j85l04J63M2k06K67m0k02
3208a2J8J37j13k21J07j80J6J74K52l68J39j36J47k6J62J4j34J89j36n9j79K56
$$ plain form
3046 115 60 -247 -32 65 -170 432 223 -177 67 -178 -85 54 42 -48 25 -127 -183 -4 -163 110 -25 -161
3068 -161 18 220 25 17 -228 -179 36 277 38 65 15 215 -125 39 -108 17 278 35 -101 -8 -35 26 -10
3091 -10 37 -52 -87 38 77 110 139 -123 -112 -151 133 -90 300 61 -228 -106 -174 16 115 58 12 150 -11 518
3115 518 241 -301 -2 12 67 231 166 99 -231 -147 -248 114 220 -212 -251 -313 -357 -438 -150 -15 43 56 24 74
3139 74 -45 -89 294 246 200 140 -180 174 197 60 155 -144 -246 -255 -14 -11 -248 -209 -342 -443 -317 201 -4 88
3163 88 -224 -87 230 -4 -50 87 246 334 86 -35 277 52 -32 351 290 76 244 355 154 -201 -40 -35
3185 -35 -238 101 51 -256 -227 -282 -188 146 2 -135 -161 96 100 -17 453 268 -36 127 169 -37 230 190 -12
3208 -12 6 143 30 -191 -84 -264 -248 -74 178 -190 -51 -187 -40 -66 96 110 -24 165 29 -30 -209 47
3230D7p5kRm8J33J55k38J21J19j60m6l8o5o3N3j26N59n74M89l00R6j43P4Kl3j49
3256b03J34R9j71p7K94l7K28l57j25J04jN4Lj96N29l35n0M6J51K81j96l19J05
3279c9Ok31M61n2k08j48J01r4pK32k9j19l2J60j51J58P9J5j60k9R6K34j25m6k81
3304b09L71j84q8J23J07j01j34k1l8K37m4j3k0k01o3J78R8M3p5j20J21j52n2N80
3328C43l24K31r3j91L91l33j4J92J60k15J19m61K48p4j49J08k57L52j37K8k1j12
3350b09J63J84m71N12Jl52K50l2J79q7K58l24N5J0p1k1mj20J6j76K28j89J79n
3374b6m35N65o8%j44j54O9J06k04J97J04M0Q7m4J84M6k30R2J02k41J43k84j9K29
3398A15N7j51j02k3P0l3J32j53l5j1J44k62K06K06j59K54k0j82K10k13r2p9J97
$$ plain form
3230 47 -28 -30 -21 -69 64 219 -19 102 221 61 15 -23 -88 -151 -98 -224 335 -239 250 -50 46 -97 -23 -21 -54 -203
3256 -203 -69 30 -141 -218 76 39 267 -90 -215 -111 -112 -58 -55 -251 278 -57 -107 -61 90 371 175 -144 -39
3279 -39 -33 -264 197 145 -63 -211 -110 -204 -211 21 -8 -127 -159 1 -150 8 87 102 -58 -87 9 243 118 72 -209
3304 -209 162 -22 -110 13 120 19 -115 -136 -174 63 19 6 -14 -215 -278 -100 -2 41 -34 -154 -33 -185 -237 343
3328 343 19 250 157 -34 357 24 10 202 362 147 266 -195 53 -21 -170 -62 -319 33 -104 -76 -97 -209
3350 -209 -46 138 -333 179 180 -172 78 46 225 138 396 72 127 137 66 45 41 -79 -63 -239 -11 -200 -21 -26
3374 -26 -461 104 36 36 -108 -262 -193 -87 -291 -94 10 50 137 93 277 323 93 185 287 46 189 -95 -114 115
3398 115 172 21 -81 -104 -34 -67 65 -88 -123 -134 10 -252 -46 160 1 255 235 53 263 50 -42 -121 76
3421G6k16K45l4j12j45J34q5J90j98J27o0j4K8j19N4O2j01n0P6Q1J26l6j07oj20
3446b04R3L28l46J83q5M0J11q3K01m25J56p9Q6J25k26K26k28K66M3j51j93J95
3468C3j92L63j9k71NJ74N6l01M20l23L4k04L29k03R5J94n6J54j13j33O4K08k65
3491D9q2J76L2j41K55j64q4K2k2L3p0J91l96J04j41K54k5k28K71O1k83L85j81
3514A6j07n4M81j89k85J51K0MJ23l18J81Ln8J90j56r1j19J04J15k4j00N0k12J88
3538h7M1R0l65J70J19rr4J36r4J27k7n3L81j31j80K31k59q9M77l15j43L8p5j45
3562b56J10R1N0k9J25j13J24O3j17k20J29j90K04J70j54P9o7M3J63j74Q4k26J89
3585G8l39L54n0j25J51j39j73n7J55J84j27j18r5L99r2k6L04l44J86k30J21o5
$$ plain form
3421 76 -140 105 71 -41 -186 -52 -137 53 -145 -18 -78 -92 -64 -183 -129 -67 -168 -218 -142 -61 65 29 -78 -84 -204
3446 -204 -111 217 -129 54 -31 9 120 37 238 -187 -31 -110 -24 101 -125 101 -127 139 182 31 -162 33
3468 33 -159 204 185 -86 -81 93 149 -152 268 -55 -21 -225 104 -99 -4 190 134 288 175 42 106 314 49
3491 49 -33 143 175 34 289 125 41 63 41 74 4 195 -201 -97 -238 16 -9 -237 34 95 -188 197 16
3514 16 -91 -145 336 147 -138 13 33 37 160 -158 23 26 -32 158 2 -89 -208 -104 11 -13 -113 -63 -275 -87
3538 -87 -46 44 -321 -151 -32 -41 -135 1 -93 34 7 -46 335 204 24 255 -4 -93 384 69 -74 -36 -111 -256
3562 -256 -146 -55 -5 -34 91 -22 102 165 48 -172 -43 -233 -29 141 -13 66 -1 42 205 31 115 -111 78
3585 78 -261 93 43 -82 69 -70 -243 -300 -145 39 -88 -206 -301 98 6 -20 284 -60 126 -104 17 -48
3607d8L3K08k55K28k1k10P0L7j12q6J78l6m06M82rn0rk09J72n9K0Q1p8j9j02O6
3633a34j26M40k21j60O16k07lP8j66j39K2l2K46j01j37J23Q%j88K47o2k58J20
3656c4l0J8k91M02P8k46K22k49j05MM28k22o4j7R5j36Q7j2L43j73K6k98O6Q7q1
3681a02PJ02j24Q7r4j20K14j08j56J52l2J32j32P4j61M34k48k44N80l40J96k85
3703a68J60J06Q9j70J88L7j45N4p4R0o6q6k8R1j77J86k09q2J14k8L22k60p3j4
3727a43N6P5k08J89l0l2K25O8L6q0M3j40k0j62K77j78K2j48J10Mn2N5q0J25k07
3752a95O7K5p4J9J47n6o5J03q8K2J26J59k10Ll0R4O7j02J7Q7o6m3J25k00p4J83
3778D1j06j28K46r5J81P0k11j2j04l51L96R0RR3k29J86P5m6k5j07N8j93L84k97
$$ plain form
3607 -48 -15 193 -62 166 145 -65 5 42 -70 -156 22 -14 -420 62 53 3 -6 -215 -43 -102 -82 -1 -79 -98 -200 -134
3633 -134 -260 180 -41 -201 415 208 205 283 117 -22 0 -32 214 113 -24 99 107 107 -81 166 104 -154 -34
3656 -34 -64 -46 -337 65 143 -103 119 -130 -235 -231 197 -25 -89 -106 -11 -147 -60 -72 271 98 124 -174 -108 -21 -102
3681 -102 -95 7 -117 -30 -124 -244 -30 -138 -294 -142 -174 -42 -174 -100 -261 173 -75 -319 261 -79 117 -168
3703 -168 -8 98 187 17 205 242 97 151 77 167 101 15 -13 78 -99 87 -122 -204 -90 -118 204 -56 -129 -143
3727 -143 -87 -12 -220 -31 -61 -93 132 200 236 156 199 59 39 -123 154 -24 -2 -150 -40 -36 -88 -33 -113 12 -195
3752 -195 -128 -103 -177 -158 -11 -67 -132 -29 -117 -95 31 190 -20 -17 -47 47 114 12 29 116 50 7 132 -68 -142 41
3778 41 -65 -193 53 -42 139 209 -2 -14 -118 -469 -73 17 26 119 -110 76 151 105 80 -27 31 -162 222 -75
3802g5L80j34k17n7n9K19P9j58J01k04K83n3J21j45r1k4PM4R0N7j73r6Q8o7K81
3827A97k14J49q7j75K56k32j3PN2Q5j43k26L03q2K04M2l47m6L55n9j44olP8q6
3852a35K04p1J60l76L30k31J77M6j83L80k47j0j69j18M24k99J43P6o8j60J90l07
3874b44M60m24K25J50l2r7j4n9j13NJ48K55j87l5J15m02J66J36J02j28j22J10
3896A5R3j3j27L01j35J33m28K75j49J91k86O5j14J76k49Q4n8L24l87J3M22m1o0
3919D5P9k35n6K62j51L63l60J17o9Q4J39l29J00p9j37K6N4K87J12k62J6L4j04
3942f4K83n56N60ql10j00K50M0K7k9k9MJ52O8k53M8K56l06J18K6n10M01j3k24
3966a69oJ64q6J19J3j69J53r2K8J37n7ok44r0M63j48K15l8j45P7l48K68J47k36
$$ plain form
3802 -75 305 171 -46 -103 -162 57 136 -22 79 -125 158 105 226 81 -10 -34 -27 17 107 164 -9 -105 -17 -84 197
3827 197 -17 132 45 -130 126 -106 -119 -112 -60 25 -118 -344 -41 -123 81 123 -224 -270 85 26 -118 -124 -127 -49 -135
3852 -135 69 -2 158 -218 112 -119 58 104 -79 301 54 44 -125 -243 181 -118 25 101 33 -127 63 -244
3874 -244 216 -208 17 167 135 38 24 -35 -148 -143 5 260 73 38 153 -249 -83 53 155 27 -95 15
3896 15 108 95 -32 269 134 267 -161 114 -35 156 -130 -65 -179 -3 -252 -168 -226 98 -289 -276 146 105 45
3919 45 124 -111 -167 95 -56 307 -53 64 -5 79 218 -111 -11 -90 -227 -201 -147 140 252 -10 6 40 -64
3942 -64 219 -337 223 215 -95 -195 55 95 122 93 64 68 220 288 35 83 339 33 151 177 -333 68 55 -169
3966 -169 -175 -11 -97 22 35 -134 19 -73 -45 92 35 29 -215 -305 158 10 225 187 42 119 -229 39 186 -50
3990e0R6P6j42m1J43L4Kl3j22O7r8oP8K9o3M3M9k6J33l82J29J0L31k48J05p8J98
4017B34j42p4L9Kr2o1n3J66J41k53J16j69J80k32J16l3J79J10l80L67j78n0Pp3
4041a33K83j73J29L0l42O5K11K3j47j72K78k87L81j40o4k15n9N98k38J18j18K0
4063D8Q2k39J2p6J85o0J45j10n3K68j05J29o6o4l08K66N4j86J38L3M8o5LJ31l97
4088a87J00J17O0J37j03j94j25J7K44r0q2J39P8k17n7L22j73J2n3K10J5j82J67
4111A55L1j53j85K56k56k2K09j57K90j51J91l51J63J23O1l25n1J38Rk8m6J30J78
4134B09r7k98M69j29j01K31j48J4J8j71J96r3j02N0J69k93L88l53K10j86K04j58
4156B9k32J07J12l53N7L28j25q3J50j89j45J72J87J65M7l87P3R4m6J15j73K67
$$ plain form
3990 -50 46 122 -20 -61 82 116 118 85 -37 30 -68 -74 4 33 -30 13 62 36 169 -213 -84 -74 257 9 114 36 234
4017 234 92 18 57 59 -33 -94 -147 19 160 -93 23 -146 34 -198 -82 -115 64 174 -206 161 -17 -67 -60 -133
4041 -133 150 -23 106 136 -206 -141 70 93 -54 -226 52 -235 146 6 -58 -273 -332 266 28 146 28 48
4063 48 130 -109 -97 -173 12 -48 97 -13 -66 202 97 226 160 96 -212 54 108 -78 60 93 141 76 79 210 -187
4088 -187 -87 30 90 227 124 -70 -195 -178 66 -24 -106 33 111 -106 -163 159 -14 -2 -55 155 170 -12 155
4111 155 186 33 -152 104 -152 -174 35 -122 168 17 208 -143 20 143 204 -121 -172 -34 -25 -53 -99 31 209
4134 209 112 -186 283 154 53 284 136 150 168 -3 193 100 -2 48 217 -76 312 -41 169 -17 187 29
4156 29 -203 -96 16 -337 -280 48 -77 -160 -10 -199 -344 -172 15 180 227 -160 -87 7 -39 76 -97 170
4178A70k17J74q8j62M4J29k04k61L96j67K91k02K23j35N3j92L19j09j41K96j97
4199B0K01j34J90l13L3K6j96M41j81n0l3l2K49j87j3p2k8O2P7k97J63J81m7r3
4223c3k7N6L4L8p5k31j68M06j8k39N01l03R6m3J19n5k00J59J37J9k8m61N39k53
4247c0M2oM6j25j03M14k78J69k18p5K76k26J63j88J78j07J09j33p4K64L9l11K48
4270G4j21J18n3J61k21J4L26n12K86O5q3k73L42j8N0k63j52L86j42J04j09L7r
4293GJ88m32M48l21K99k23n7J69J75n24L78j5k71J90j09M53m27M7l3Q3q1J65k02
4316i3J87j66j45K99j63K3Mk0J75Q6l67J46p8J69l27K90p8j84M13m9p7j95Q8m
4340f6K45j58n9p5M7j03L51j84j81q6L24j78p2J60J48P8m73O36k63j36O3J22K8
$$ plain form
4178 170 -47 127 39 -123 -79 50 -154 -415 -19 -186 105 -97 126 -9 44 -148 171 62 -79 217 20
4199 20 221 87 277 -36 -3 23 -173 268 87 37 4 -28 221 34 21 -51 -79 -17 60 -237 -74 107 60 -33
4223 -33 -60 -4 30 68 -7 -238 -406 0 -18 -257 244 -59 37 -6 113 58 -142 17 154 173 145 -316 223 -30
4247 -30 12 6 52 -73 -176 238 -40 129 -89 -164 112 -114 49 -139 39 -68 41 -92 -166 98 137 -174 74
4270 74 -47 71 18 179 -42 -28 298 -214 72 137 54 -219 123 105 155 -108 -260 126 -16 88 -21 16 7
4293 7 195 -237 211 -110 189 -34 -91 78 253 -271 107 92 -179 11 -98 355 -72 -25 -58 25 -56 109 -93
4316 -93 94 -72 -217 82 -81 -58 -54 -74 101 187 -180 -34 -112 57 -270 20 -58 -242 171 122 45 -150 -62 -66
4340 -66 179 21 -38 -113 -66 -169 182 -2 -183 -269 55 -123 -195 -35 113 191 -282 354 91 -45 18 140 168
4363A68j75J15N8j58J10l1k67J04J23m4n5k6j13K54j55LJ91l06J52p8J64j21J43
4386E6r4J70m2lj61q4J88mo5K53k15Nj23K50l2k73rr6L03j56J30j05O0J46k65
4411a66J04k9J84K3l47L47k34J20J50n4j7k75J06K1R7J29m8j84j53L28j3k66J02
4434g5R6j79O8l2J31J1l91K44R2L3k44L40j08j1J63j63j10J60L4j16j8j32K06
4457aJ73k99J29Q7m3j38K97m0K05k31p5K64k91J10k6k52J67J49q6k60J60J30j66
4480c7Q9N9j77k00J20K39mk2k24K49j82J82J34k59K44K20n30J27k4n2J24l58K51
4503c1j51N35m58n2J6J02L6l90M41j48J44j07K58j66r5q5K85j03j9K3j23J69Q2
4526A63j71L04k19l80L52k92K12j01J34J65k42O0J04K1j83M9Kj15K94l6j85K4
$$ plain form
4363 168 -7 108 166 8 118 87 -180 -76 47 3 -52 -78 -191 63 -92 -89 102 -204 -52 -130 34 -87 56
4386 56 -38 132 90 87 -74 -158 30 26 -39 214 -1 4 -119 131 99 -174 -183 -279 24 -132 -2 -107 -47 99 -166
4411 -166 -62 -91 93 116 -231 116 -118 2 152 98 81 -194 -88 -67 30 159 111 -73 -226 102 89 -177 -75
4434 -75 21 -158 -90 -122 9 20 -371 -127 -35 -2 -246 94 -14 -25 138 -25 -135 25 59 -57 -75 -207 -1
4457 -1 172 -127 2 89 46 -92 205 165 370 139 64 328 37 147 121 -131 36 185 99 -161 -1 129 -37
4480 -37 52 111 -66 -266 -146 93 89 67 -157 92 -90 92 226 -33 211 431 -99 28 4 -48 76 -282 -31
4503 -31 -182 353 -105 -157 -141 -39 -3 -393 48 -100 44 -63 195 29 -66 -151 134 31 12 35 -88 81 163
4526 163 -8 296 77 -303 49 -243 -31 -132 2 167 -75 -15 89 110 -73 -24 -22 -137 157 121 -64 -40
4548d0n5K02r0n3J24J07p5p9J19j58L0J97k92J99j57j3K64k71J00o1r0nQ6j95
4572b06M7K55j79J98k57lJ26K91m26J09%K22k34j92J72P8j84L26M2l53K60j83
4594i1N8R9p2J26k45K80l5k00L52n17K32K71j75k22J41P4r9K6p8m7J47P1M5p1
4618G0R2j97j71K41r4J42J0o1%k60K87R9m19K63q8rJ41n7O3j49J26nj73K27j63
4643h5M0K84m22Q5k08O9J52KL22k73k6j06J44K9o3J09O0J90k48j2J32k58p0M4
4667a09o8K06q9j62L01j00K14l79M8M5O3PL1J30j61m5J00Q0k15p0n2J54J26n2
4691Cj82J12M7j75K66j1P0k78J52O8j04P3p6N2k46L60n9n2k1q0p8J53K63K4l03
4716b2R3kr9M1j13K78j65q5N2j28o2J53j28O7K55j61J70j27j28r8J0K94O0j16
$$ plain form
4548 -40 -95 107 17 -36 88 195 120 41 160 2 32 229 -63 136 -21 -34 230 -41 59 -2 -92 -97 -11 -206
4572 -206 -159 96 -83 115 -142 -145 -19 272 -154 -45 -45 177 -57 -249 -77 1 -183 143 185 -168 92 -91
4594 -91 -33 66 -6 120 -125 155 120 -80 272 -245 -13 258 83 -139 2 76 -23 3 -75 -122 25 96 141 70
4618 70 162 -35 -206 35 -59 83 93 32 32 -228 59 158 -261 2 -86 -95 46 -11 52 -97 29 24 -149 78 -85
4643 -85 -45 239 -183 -98 -306 -237 -85 -83 239 -34 -60 -166 -22 7 -56 53 113 303 55 43 175 -83 -153 -109
4667 -109 -177 29 -60 -222 79 -21 193 -186 -138 -93 -30 -23 8 138 -23 -68 32 112 -103 -173 -225 -71 55 3
4691 3 -179 -67 -20 -195 71 60 130 -148 4 72 -32 41 -35 17 -229 131 72 20 -1 -81 -159 -6 257 281 -22
4716 -22 71 69 -30 11 -102 176 11 -74 -22 -150 -212 -59 -187 -120 135 -26 144 17 -111 -209 -199 95 155 39
4740C9Kk07M09k15n3J57j24m4K22k4j78k80J88J39J08l13j1J06J58J04k47J53
4762H9Q7k20j28N1o8J16J68o9L4L5p5J10Lm02M12P8j76J58m57J08J02J12P4k26
4786h4J17P8m2j49P3k47J59p9K50j97j2j20K78k0R9O0k18J01n1j10K8J52L45n80
4810a69j6L87k92J23j52J44l7l2J9j52K08J06k62lK70r6j78J0J43m5K1N8k6Kr1
4835f0J23k75J24P2l49K27N5K5M1m36L56k41J81K09l07K68J0k13R5j43K47n8j54
4858b03L38p8l66J98oK43J04j93j11k86M06M8J5j92J37j43M5j84J88N3m8J1jj91
4882b16L51k52J08n2j65j57K52K33q9QL0L4J78k42j18K86j50M1j11O0K0j56R9
4905hQK78j77l36J85J11KO0k39O7J11k4O3k13J80j62LL72l18N1M1l7k97N66k27
$$ plain form
4740 39 41 -166 243 28 -25 132 8 -36 186 162 -16 -296 -108 31 139 -174 -185 -79 79 183 -64 89
4762 89 176 -44 -172 -121 -189 -73 95 26 60 95 20 130 133 -269 143 221 45 203 -254 -146 -44 68 142 -84
4786 -84 33 111 69 -80 -7 -254 -95 -174 76 -121 -133 -253 25 5 104 164 -54 47 -4 -114 -86 66 411 -169
4810 -169 -185 202 -90 33 -119 25 -12 -44 -25 -177 31 137 -125 -128 142 46 -132 -122 21 -24 -3 55 29 31 -60
4835 -60 63 -212 -88 -16 -365 -138 -83 -58 -17 -453 -97 -338 -157 52 -255 13 23 -190 -95 -238 9 -49 -203
4858 -203 135 57 -309 -111 -117 126 230 37 -74 -360 46 94 109 -83 54 -89 -44 -228 -40 13 -35 -24 -25 -216
4882 -216 135 -117 -9 -61 -226 -383 -131 102 13 21 51 85 263 21 -97 189 39 80 -31 29 49 -107 -8
4905 -8 0 278 101 -235 -50 61 63 123 -116 -49 62 38 101 -112 68 -94 -91 281 -37 14 55 18 -279 287 60
4930F0J77k47j04J23o0P8L8K9M4j79Q9k15J17K14q6k58J16j64K59M0k40J62m8
4953e5Q0j10OJ4P4j91M05q9j23j23P8j0j26Q7J66j67J9N3r0J84k06j51J83J3k27
4978c06M38k64K09Rk04L76k12L4k98J49R9j7J84l76J77P1j48n7K64k94K33l21
5000b54K74J88j51r7j36N9J66o7Kj49N5K32m6j9J93j86m3k0q2OK25p3j12j95N7
5025a73J03J18J67j86k5P7j55J15K2j81q0Q0Nj8J25j33L8K0J16k54L05K8j21m3
5049e0M1k79N05k63K08l08J39lK06j89N3L4O0l31J57n3J96k09q3N01k64j09l6
5072g7J25q3p2J44J41l04P8QK78k04M4k7j12J7j90N38j18j22p6J02J24j64p3j
5096b4J82L8o12O15j57n0m8J03k71K45R2M7m8k14Q8J87k34K4J68J9k05j34K96
$$ plain form
4930 60 237 -10 -114 9 -51 27 65 94 138 -41 48 -167 -50 164 78 -180 -64 -228 31 71 -169 -7 -55
4953 -55 25 -85 -79 -65 9 -182 223 134 11 -112 -34 -44 -170 -83 83 -84 -65 -12 -102 82 -124 -275 -92 -79 -306
4978 -306 132 -132 77 86 -118 258 46 80 -218 -69 30 13 197 -179 -2 69 -79 -136 128 -166 67 -254
5000 -254 20 208 57 -40 -176 -117 49 -18 -16 -165 -110 122 76 57 250 64 21 1 -81 -75 150 77 -35 -230 -173
5025 -173 -70 48 215 29 4 81 -74 41 63 -118 -198 -118 -113 -131 -6 -139 -101 -81 35 -219 86 114 -7 -50
5049 -50 -9 -288 217 -46 162 -146 -7 -10 196 7 60 94 154 -177 -20 -73 123 -86 -169 332 68 -41 -77
5072 -77 48 -35 -107 37 178 -126 -48 -40 238 34 78 51 -61 -44 -234 304 186 64 -12 90 214 50 -23 -24
5096 -24 158 196 -416 199 42 -8 -56 47 -224 21 113 160 112 -102 -14 173 -61 -37 131 150 -55 -189 107
5119A07j70P2j81L76j52j57N2j27J96K3l00K27l9K2j4r4K55n7n9j17J73Pj48L42
5143B37k08Q2n9j16J76k53K41j28J02j47J08j63K28k7j27j46O2L19p5l00J78j9
5165c5nn7K81k35J18r6J70k05J78j43j50J10p0K30q8K2n7j32K12n7R3j91J64K30
5189B87n32L70nj93J56k9jk22J84J5r0J52o3M1Q7j55L4J9J18K9o3J8k32O8qj35
5215a50K35o4q4R2o8M7P9j75J40k07K87J0k87K36j22J39M5j86J18Ro8m8N4k21
5239a89L04m25L39n1MJ34k12J65n8m2J31r6K6J72l9k21q4J58j76O7J5J84j33p8
5263a05K5k8N6K13j1j7k49R3N9k39K26J32J0p0j28j6J88O8k57R0L2p4K00j38k40
5288a80KJ01Lom2J03j80K67k15J73j13K36j65N6m9j43oJ42P0j01p3K3J18p6N9
$$ plain form
5119 107 -63 9 -172 204 52 -105 -53 -180 16 39 -261 -34 -73 -51 -65 -159 96 39 -20 -137 36 43 -105 237
5143 237 29 111 52 -64 112 -141 100 -28 74 -73 35 -128 100 73 -54 -200 -138 181 106 -194 -16 -35
5165 -35 -40 -97 184 -51 67 -29 141 -64 114 -29 -179 -69 -139 91 3 25 -32 -164 48 -9 84 -107 57 287
5189 287 -245 125 120 -73 83 54 53 -169 15 30 -60 92 29 70 157 2 36 55 173 202 139 157 -75 -7 -15 -150
5215 -150 85 21 -63 29 -39 8 87 -88 52 -155 132 142 -145 91 -31 108 153 -33 85 94 26 -22 32 -189
5239 -189 115 -310 29 -22 -18 116 -96 69 11 -31 100 4 30 202 163 -58 -142 16 -160 -93 -78 106 -27 -105
5263 -105 -80 -108 -52 161 150 133 -116 -23 36 -203 23 155 165 95 -33 -49 139 207 -50 40 72 -2 198 60 -180
5288 -180 -178 -77 -74 -80 -122 -19 -199 68 -147 26 -87 149 -16 40 -9 -152 -158 -16 54 -47 -120 -97 21 -55 4
5313Dm3j10O7K86j64Q9j21J1k01L72j62J05j98J0J57r8l9j61K03n8J88l13K08
5336C2j46K04l3Q4j71j36l0K40M8L2j86j27N2J65j64P6J35l88J84J18l2K69l79
5359a53J55K69k99r8J27J02n4k57J87p1K40k10K6O0P9j7j11q4J58k5J30J57p79
5382d68N68k54N7M7J70J25M2k77o2MN8o9k46N44r4j97J12r3J51j54o6j21K52K6
5406E5r7J11j80J49o3j12o6qK07J8J65l1j72K5Pj98L18j97j52K16JK1kj35K10
5431I0Kk97L3P9M9P2j6j41K89j72m3Q3j15p3J67K0j60J0J38j03J66q0k35K83r8
5456e2N0K3O6q5LJ15j75M7O9%p9k57J91J23j35J14Rm5m2J13p3m6K80m03J37kK0
5483c4j05J50J99r8M1j03j93J39l5Pn2K06K08l53J91M6j29q9j31J70J08m6q7k65
$$ plain form
5313 4 -39 -149 -82 204 40 129 8 19 -182 190 28 133 -65 -55 102 4 -35 -196 7 -51 137 -176 32
5336 32 -114 90 57 141 -30 -166 -196 44 92 124 -62 -189 -137 28 -136 -60 75 -313 -129 -11 -43 226 -153
5359 -153 2 271 -28 -126 1 103 49 -208 -21 -92 148 -62 -36 24 103 86 -25 -109 49 24 154 311 -468
5382 -468 100 -154 -97 -50 120 245 287 10 -52 -48 10 -59 -305 239 145 -52 60 -33 118 -36 -102 -223 29 55
5406 55 -42 69 -111 38 -25 -137 -203 -211 -4 14 179 148 -24 1 8 -190 128 -69 -221 -5 -4 17 15 -120 90
5431 90 92 -205 -172 -93 -44 28 12 -129 160 -12 -55 28 -87 -160 7 27 -133 -123 15 -88 78 -2 -237 46 -52
5456 -52 -2 21 87 2 5 120 -55 -8 61 61 -18 -275 -84 39 -96 18 27 -18 -60 53 -20 -66 214 -189 -52 -54 -34
5483 -34 -139 11 210 112 153 50 -143 -4 -39 -32 -84 122 330 -23 168 214 85 -4 -135 35 143 97 10 -255
5507b55M84l09P6p5N2N2j49J56l05L25k21J94j43j10J30K71k73k05J5J88J19J54
5529A71R2l04K1J43k29o8J27r0K51J16k51j37K38j53j0J72N1k71n8J85J6j09O
5552i1k0m2J02k4K17k47J06n7jO3J84l84L15J08j43j58J86k59OJ78k99K14k52
5575b98K40o2L5R8N1R4k17O4M5k56M35k25O0O7j94J4O1Pj70J68k2r3L1j21N1J81
5601D4j42J8J21K6j27K5J06Qj93k3L65j56l14M33l4j64j70J28M9N9Rj14j26J58
5625a4J36k0p2r8L4J01j04J38k32R0n6o1OK30r8P2Ql37J14J10J52p9J00k31j5
5650a26K10l05J24j7K28L4k93J0o5L5J40m1q6J58R0k10L77j19k38R1j87K49k85
5673b26K80q3j96K01K47j47p3J66o6p9P7K5K2k70L98m29q3K3K31J31k83J15J53
$$ plain form
5507 -255 229 -80 -4 -79 -27 25 -124 32 -273 52 -169 25 -118 -228 -98 173 -100 -305 -290 -102 17 171
5529 171 263 -41 -20 123 -106 -174 -47 -137 114 230 -21 -158 80 -73 -83 89 140 -131 -189 -4 12 -97 -91
5552 -91 -111 -153 -51 -75 142 -105 1 -56 -57 6 190 -194 121 229 86 -72 114 -145 -139 39 -260 -46 -298
5575 -298 -58 -120 -85 13 64 158 -59 5 50 -206 229 4 64 131 -63 -49 12 19 -151 17 -5 -98 -67 -188 -137 44
5601 44 -98 -80 41 67 -60 -35 71 79 -114 -137 228 72 -242 191 157 -7 -177 -49 0 59 68 -46 -172 -14
5625 -14 122 102 30 -68 -34 67 -37 101 -131 -41 -97 -158 -152 78 -20 52 60 -277 -163 -53 99 20 120 -111 -126
5650 -126 84 -221 -97 -114 114 148 -145 -135 -200 -165 -25 -66 -152 6 96 -114 263 144 -94 -3 -190 59 -226
5673 -226 54 -29 -225 -24 223 76 3 169 103 24 101 126 148 -122 276 -153 -236 -213 18 149 -134 -19 134
5696A34k40Q3M6j58Mm0R9L16l57J55M0j03J66k2n9j55J89M8j91K59J7k07j47L62
5720B39k14O0O5k78n8P2M4J77r4j55j4J66n2j9M07l53l05N92l54J06N4J48k65
5743c1o5M6J68jk75L10r2p2L8j19J09j5R1j15Q2j16M9Q2K1j09R9j19J9o5N8J35
5769A13j99K36o8n0k4L10n9l32J92k51J87j68K50k49K7J32k12K48j84K61l94J36
5791i8K72l56k9K77j16K51j14r1Q7K7k05J08l78L18Om2K09k10R0J92m8j04j17
5814g1Q9k3k65M50l4j57K01j76MN9n0qJ26k34J65j18J47l85K43J0J64pm39L59
5838E0j05R6j47J8L10k81J03r7j8J94k41L30j25k07j5r6K61R5N2k52J61J00m83
5861b97M81k21J70k42J52J36j75J8k75J46K06k12J59k03J41o9m5J94Q4k86J96
$$ plain form
5696 134 -106 -23 23 -135 -131 -171 -72 244 -113 42 82 -21 145 123 64 -91 98 146 -45 214 231 24 -123 239
5720 239 25 85 150 -128 -186 -114 -70 107 13 -142 -156 10 -42 -61 346 -7 -312 280 -74 32 86 234 -31
5743 -31 -96 -50 118 117 -158 152 60 -12 26 -93 16 1 92 -23 59 -57 -8 74 95 -14 85 -34 -15 -80 -22 113
5769 113 -86 150 82 32 8 318 259 -73 119 -132 55 -113 137 -112 -85 47 -165 83 -101 160 -234 -98
5791 -98 174 -182 -211 66 -50 201 87 -4 83 110 -95 13 -365 -47 -41 -83 126 -84 6 198 150 46 -71
5814 -71 18 -5 -270 180 146 -11 190 14 18 77 27 19 145 -89 76 -42 105 -280 -37 -27 137 130 -309 50
5838 50 -55 41 -106 -88 222 -59 44 -53 -71 123 -118 212 87 -120 -135 -231 30 125 177 -75 86 186 -297
5861 -297 184 -37 133 -109 43 179 4 22 -253 -107 99 -113 46 -157 -16 -85 -130 64 148 -138 58
5882E8l72J76J30j42J24j70L06Kn9k3J68j95N8J0n3lR4m9j88K23j33J86m54L80
5906G4o2R4L7j27J1NRj40N6q8K1J79m5J78k84J4J17j3j22K59l04M8L61k77r7L1
5932f5R2p3J42o9K8m7K8k1p5m8r9M53l18Pk23J70O7J54n8M8l25J31P1Q2o5k0K12
5959A79k62n6jK59k72L55k20j13K71k12O0J3R4r1p6J6J33J09k10N1O3j74m2l9
5983a65R3J49Q7k00J64P6l29K27j67J96k35M5q2J14J02K2j66J75j18J05k12J87
6005F8Q6m1k39M08l76Q6j34n0L09j02l8j1r8R7mL5M7O6r2k76L32j52P9j2p4J70
6031H4J18l94J68P5j37K56k03N3k7l3qomo0O2n5N6J5lN9M5J1j02K03r8j01J26
6058A00k32K39k03J45l0M1q4o2N0j2N5N4p7K23m04M14k50k2J41n7m9J76n7k66
$$ plain form
5882 58 -314 -138 -8 -150 -26 -196 110 112 53 30 198 3 61 71 18 15 109 60 -128 95 -38 148 -306 74
5906 74 12 106 143 16 27 32 41 -99 -43 -131 -110 69 24 202 -82 -68 49 36 -86 173 -131 -83 278 1 -96 -65
5932 -65 27 -46 96 27 55 8 36 15 -60 -108 -207 246 -72 -65 -288 -118 -51 103 45 93 -232 -101 -30 52 -13 -33 179
5959 179 -83 -139 -140 119 -153 202 -18 -131 140 -72 -12 1 95 4 -72 -56 77 186 -24 27 90 -84 -126 -165
5983 -165 -72 77 164 -36 128 204 -125 102 -65 131 -104 -59 -141 -27 75 97 -69 106 -12 93 -119 68
6005 68 154 113 -126 282 -94 -8 -142 -192 117 15 -23 -34 -132 -35 -39 -4 43 109 17 -259 73 -79 0 -12 -86 84
6031 84 202 -192 -24 51 -86 170 -33 20 -7 -40 -48 -54 -58 -118 -56 -111 -55 -40 -43 16 61 72 -30 173 75 -26 100
6058 100 -132 107 -96 49 19 60 -24 -86 -36 -48 7 61 -16 207 -197 217 -33 -55 86 29 -20 156 99 -167
6082a67J89o0k8J15J13k59J45K2p6J4L24l09j59L0m2R2Q5j58J73l3j24J04M3J04
6106A38O3l19Q4L9l7j34K26k40J01Q1j14R9K40k12J09j56r1R3j20J41N8L5J6j03
6130cm8k4lp3K31j93J22P7J76J0k83j16j07L39j38q6J80o9Mj51J74n7n4J65j71
6155i8K29k96K56pk2J2r5q3J58o5j28J60Oj45J33M1J3l2L1j58J75j68J70r2l3
6180c8J87j56J39n6R3j59j38p9K37j16k9J31r7J23l4k01l6J34K72l84J83o1j59
6203b44J41j06M01o8j24l3O2p9l9m0J63J35l41N5K1J66m8R9m7l2N4k29j61K91
6227cJ28k39J15K07k91J61j69q2J98j12O6J85k22o4K56j57J90k71N3M8j10J03
6249a0J64k95L24j35O8j6l4q0N7J57k95J85l1Ol58L55j51K8R9o4R0P5k12n3Pk5
$$ plain form
6082 -167 22 -38 -66 49 162 -97 48 70 -6 8 332 23 -136 -106 -148 -56 29 -129 44 11 -113 -9 34 138
6106 138 201 -118 -34 5 -32 -166 60 -180 -79 2 -112 -13 227 15 124 -32 -123 -30 -150 -9 49 84 100 -3
6130 -3 -51 -75 -78 -151 80 -113 9 86 262 272 -11 -127 -234 105 -33 -119 61 -8 -4 -155 19 -38 -92 73 -98
6155 -98 131 -165 91 84 62 74 -21 -104 54 -11 -139 21 27 -118 15 56 69 37 68 -90 85 -83 87 -5 -38
6180 -38 149 -7 132 76 169 10 -128 -207 30 -86 -115 16 -81 42 8 -193 -229 -95 177 -207 -24 -85 -244
6203 -244 -103 -209 192 124 0 -33 29 -50 -89 -129 34 169 -172 -117 -96 70 22 121 74 42 96 -133 -294 -3
6227 -3 125 -114 1 208 -83 78 -91 -173 25 -87 -21 164 -58 -122 134 -23 167 -104 -51 -3 -113 -10
6249 -10 154 -141 183 48 116 100 66 -14 43 200 -95 90 59 65 -293 62 -89 -61 38 -26 64 139 -73 -126 -119 -144
6275a44O3j63N90k96j06j69L11n6j88J96l8Q0j25p7J52r5N1M6l10K72j96L53k70
6298a19J09j02K49k5k03L4j28J03J45j13K19j82K0j2k32K17J3J0j51J70N6j08
6320c0m5o2P2k1O3l4J36j89Q4M4O2m9J2o4k5J14J68p3j94op6J66R6p8k8P5nk86
6348a73L36l58K62L2j9j03q2M5k15K47P7L3q0j03K44j83j24N2J06M7J72l65K56
6371A04j16R6j43L3L8K24j52J36j81k59N08j3m51K86k24K85k32p6K13j29J79k00
6393g4R8K53m81J98n7k4K62j74Q6J08M4j83m6P1M6J99m25J69M7l25J39Q4J00n8
6417E7O4j25P9j61J4K70J0m14N7mk4L93k14k72J06J58m9k8j39J01K27j23J1k94
6441c00L42k48K09k98M56j37R4m4J8j55J40K4k15J52j45k2j50L47k38J80p0k10
$$ plain form
6275 -144 -81 -244 346 50 -56 -225 86 30 -158 38 0 80 -45 -122 30 -65 -14 32 -278 -6 -202 151 -119
6298 -119 -10 -112 137 112 -91 -57 -185 -82 63 -50 169 -13 7 -5 -237 -20 -7 3 -148 22 78 -30
6320 -30 -75 -137 -65 -86 -23 -57 79 -110 -26 18 80 31 43 -21 -46 68 236 163 -31 -37 -113 53 149 71 43 118 113 -173
6348 -173 163 -195 67 99 80 -23 -105 -60 -275 -28 49 82 2 -101 143 -40 -164 -112 -6 41 213 -152 104
6371 104 -12 84 -59 -26 12 236 84 220 39 -220 288 275 -176 110 -114 171 -61 -137 76 -53 126 -74
6393 -74 24 277 -204 -6 -63 -87 175 1 87 195 239 56 10 81 127 326 -99 70 117 -208 -69 15 115 57
6417 57 121 -4 75 -86 -72 198 208 -206 -149 -153 -177 216 2 -270 -164 -6 -55 -83 -222 -121 106 -17 -6 -300
6441 -300 42 -206 3 -295 161 24 118 74 92 -63 77 101 -114 38 -107 -129 -279 68 -170 10 -60 -270
6463b70L69KJ26k13r8j04J81j10K86j35k5R3k31L60l42L8O9M6o5j44O9K90j64
6486B8N9l30pJ48R2O7j00j18K36k46K26j87R2J29k55J50m7K0p0K30j12k12K92
6509H5l51L3Q1j34J51O7K12J01j99K9OP6j83K35j16j66J4J28j14L0m0jq2J67q0
6534e1K36k08M9j05J18J22k2j58P0o8K18j57r3N5j5N0j07J06N3%k44K07J36M0
6558B32l81K56l18N5J13J82o9K7j67J47k65K58j37N8J5j28K91j57j3J14j98M5
6580d0O2k9M0j49J21R9j73j35J59K33p9j16j43k20L87o9J45k37J02k2L62m12r3
6603b07J49K51r2l13M86l44oJ11j67K30j24j63R8N1o7o9J69j62L13J02k06l8p4
6626g2J89Q6k68J01k63J72jp4O0j47P4J55R7r2j0L25k66m1J07j29p0l3J34R0j0
$$ plain form
6463 -270 99 101 227 14 -84 -188 -7 -117 169 34 9 102 -129 231 -111 -73 -4 42 -23 -167 -98 192 28
6486 28 87 -243 -250 -102 -10 57 -43 -161 75 -171 55 -132 -40 89 -166 -16 -63 -43 -113 117 5 -207 85
6509 85 -266 -233 -152 -286 -135 -68 144 245 46 75 81 157 -26 209 93 -73 -59 69 -45 -15 -55 -56 -138 29 -51
6534 -51 185 -23 26 -79 39 161 139 -19 51 -17 201 44 -49 6 -9 41 -66 40 93 93 -151 56 192 232
6558 232 -149 107 -211 -156 -43 139 70 97 -70 77 -188 70 -67 -9 6 -122 169 12 -1 113 -85 -40
6580 -40 22 -7 33 -116 5 104 -69 -204 -45 188 109 -7 -150 -370 17 -52 93 -144 -42 -64 298 -114 -207
6603 -207 -58 193 101 -212 274 -70 -76 35 -132 98 -26 -189 -91 -40 -107 -176 -7 -169 144 246 40 2 -72
6626 -72 117 203 -65 36 -227 -55 -56 -130 -70 -217 -143 12 109 17 7 332 66 25 132 3 -67 -100 34 124 114
6651A14o9j44K19k51R3j2O2J43j57R0J64r4M5p4k87K29k85N19l26q5J50O8M8N5
6675B15k62k7K10j80K65j11J6k12J67K40j06j87L5q4J56j73j72L09N3l55K53K30
6697B80k64j79n4J21K6o0N1R3j22P2j54J58l5j06L8J09j27m9K80k40J89k84M87
6720B30k75J59j82m5o6J32J73k58N0p5K47j54K2J45O2k16n3n4R9K36q6J23n8l71
6744b15J68O7n8j03J74J44k05P2L1K8L1O1J2l15J68rp1l6PQ8N9Op7J03k86K58
6770A02j4j62J68K4n4j19K96k81oj8M8O9o5L5l0n0q1J31Rj85K48OJ33k14N0j33
6796i3Lj7O5j53J12J43k0L65m72J77j47O2Rl5k11R7p6R0L71l62j5J80j18L4K24
6821B13m30K96Oj96J0J23r3K5L9J8O5j69J93j93P3r0J45p5K41k60J03r7J85rr2
$$ plain form
6651 114 45 -99 120 -131 -38 -50 12 155 -2 88 252 158 203 129 -158 71 -214 305 -21 -106 44 112 160 215
6675 215 -47 -74 136 -44 221 110 126 -86 81 321 215 28 63 -21 135 -38 -210 99 152 -203 50 280
6697 280 16 -163 -217 -96 -70 -130 -79 14 -108 -36 -190 -32 -67 -173 -135 -26 -153 -202 78 -162 27 -257 230
6720 230 -45 114 -68 -113 -179 -47 126 -132 -82 -157 90 -64 -42 103 165 -51 -104 -158 -59 177 91 214 156 -215
6744 -215 -47 20 -38 -141 33 177 -28 44 75 103 134 195 207 -108 60 51 -20 -56 -49 39 98 104 27 130 -156 102
6770 102 88 -74 94 118 64 -55 241 -40 -46 -64 -16 53 -12 23 -7 -57 -138 -7 2 -183 65 71 204 -10 40 -93
6796 -93 -90 -107 -42 -195 -83 60 40 405 -67 110 -37 25 34 -1 -212 -115 -191 -101 270 -92 -107 73 -45 -11 213
6821 213 -217 79 85 -111 -101 22 -71 -46 -7 11 76 -93 100 -93 -20 -110 35 -40 201 -59 44 -53 132 123 31
6846C1j4mj96J5K13j6J33j41j57K09M9rj57j64K27j86J10j03J81J48j96k17K64
6869B0k44L68q4o1j41O6m3J75J61k91K29k09j09K87j24k31N09k54J07Qm19K07
6891g3Q5M1l1j04J09j43Q2R1K2k01oJ81J33k88L48l32J40K7j04K4L50m58J0L5
6915f2ol7K7J73J8k06K21j6k65K12k28K23j87O8j40K86m62N62j86j83L04j63k3
6938g0J50m3Q7j84R9q6Q9m9j16L77j46j22J48j7j38m3l1j9kJ85q9J11m19M97j76
6963grl58L65K4j47J29j25M87l29l6J28l96K70k34L98n6j47L73k55j56MK42k49
6986h4K97n2k23J16j46J29l4K04l73J00J96k20k60M31j51n1J36n7j08J45j60M3
7008a22Q5j03P9N6j39L05Pk76K86k46J0M9J22j73J61k67K28l3r3O5q4n6J9J72
$$ plain form
6846 31 17 13 -183 -168 45 29 162 21 -136 73 122 113 -44 -208 19 -167 -57 -160 21 169 -27 -244 20
6869 20 -224 144 60 -1 -142 -76 -119 56 217 -74 155 -54 -163 124 0 -231 278 24 131 139 -280 -73
6891 -73 12 53 22 -82 27 -116 -34 57 79 -122 -128 53 186 -102 246 -86 54 81 -23 1 351 -107 -97 -62
6915 -62 -68 -105 -78 95 113 -93 128 112 -153 59 -169 54 -133 -65 -205 81 -381 181 -5 -188 116 -47 -70
6938 -70 80 37 124 -60 39 -47 42 -7 -123 254 108 -14 134 117 -21 -64 -95 -114 -116 69 -20 91 -328 169 -7
6963 -7 -16 -374 -9 15 -132 -3 -128 359 30 -6 122 -274 -4 -238 160 104 -43 330 75 -81 -77 165 -84
6986 -84 213 161 -62 54 -92 37 3 207 -166 -66 130 -90 -350 81 -70 -121 15 -42 -150 -5 -165 -122
7008 -122 -37 -140 -61 -5 -144 161 168 -108 178 -68 -58 -9 113 -60 101 -166 62 29 -64 1 -83 -139 -120 52
7032E2k2M4L2l16M15l08J78j1k13J33l0L9K86j64j78j48J74p1P9o0K48L0j35j75
7056a21n7J68p1K47l48J91j2p4N2n4J81j09P8J42q1j48O1n2k13K87j59J50j77
7079a19J89j82J41p7K20k88J79N1k10j24K46LJ63j42M4rj45J19k26J08Q2j25m9
7102a51nJ65K8j57P5J23N7j25j85L21m8O9j06m2k08pj70l4K57K46j18P7j60L7
7126f1J38k12J28R0k63L8K32L8l63K53J20j35q4j24L23l9j70K00j37j72M7R8j23
7149a78J44O2qO2k0k2j0j5J3k38j2J28J28m9PR9j87Q4mJ69j99q7K39k81K04r8
7175f9l8J16P1k77K06J70l87K14O9J51k70K23l16J34J00j90J50j21K40k15J17
7196G8j38O7p9J79o8j82J94J23k25J53m5j8p9J33k8j00J68r0r9j49J49nj62j5
$$ plain form
7032 52 30 74 106 -210 205 -103 75 64 -149 -16 -46 -7 279 115 -63 -211 -37 -108 -29 -89 159 189 54 -121
7056 -121 -178 -10 -81 166 -182 9 -3 -77 -25 -79 102 -7 71 213 132 -16 45 -7 -220 67 -92 58 -119
7079 -119 70 -112 29 -48 172 -116 63 114 -96 -220 26 29 192 50 94 85 -60 59 -167 -59 23 -102 -151
7102 -151 -156 9 37 -120 -45 78 135 10 -175 146 98 167 61 19 -189 -196 -366 -400 -143 103 -15 62 -98 -61
7126 -61 77 -135 -7 83 -180 -142 90 128 -235 18 138 3 -81 -205 118 79 -91 109 -28 -200 -153 -55 -178
7149 -178 -34 28 20 82 62 40 30 15 28 -210 -222 -94 34 -15 -8 91 -96 -12 -16 153 -46 -133 106 -175 29 -69
7175 -69 -107 9 80 -197 9 179 -208 6 75 226 -44 179 -137 -3 97 -93 57 -64 176 -39 78
7196 78 -60 7 -72 107 39 -143 51 174 -51 102 57 39 -40 93 65 -35 133 43 -56 -205 -56 -61 -223 -238
7220b38K74j06KJ11k64K12on1n3O5l3M9j6J29J53k69L3K56n36K09MJ48j33L2J2
7245a6J8J01j36J92m31K72k10K69j74N7k8KK61j79k56K38K27k71q7L49p6j80n4
7268a12L16j08j62LR7lJ22k25k90M18j11J35j81J1K19k25Q3J44k32K15K10n38
7290b14L21o2j31Q0n8M0R0o3rp1J85j87j13L03p4p9J17j96K95j84N8l5ok01J86
7315hJ01l6j41J59O0o2j76J79q4m6r8n6J66j54O1J46k97P7J80Jj28N8J74j46L0
7340d0K45j87N8L2k84K90l8j38R7j01n7Q9J90j90K2R3N4j12j21L8j41M6J16J21
7364H2J28k43j67K52J35k06N8m7K31j74r3n5K14m5k67J62J02r9j22J10q1J49k57
7387b33K82m0j63P1OJ51J48j57j92J34J26k6n6Rl46O4K06K6K0j24J31r7J27l73
$$ plain form
7220 -238 36 -70 -68 43 -221 -9 -15 -66 -119 -54 -87 -38 -54 75 228 -41 -8 248 -288 -79 -75 73 -60 -28 -16
7245 -16 2 103 -33 159 -272 0 -210 59 -115 -58 -86 -84 177 -2 -258 -20 207 -64 -151 198 122 -58 -112
7268 -112 204 96 -66 -63 34 31 153 -72 -362 56 -55 80 -101 -90 129 -96 -13 131 -101 114 324 -214
7290 -214 107 45 -86 -6 -64 -24 66 3 -6 -77 108 -79 -192 111 37 -42 75 -121 174 -10 48 13 7 -194 -8
7315 -8 93 57 -84 75 135 73 -103 76 -8 -54 -152 -208 -42 -196 -135 11 -286 -209 -29 -28 -156 -98 76 -70 -40
7340 -40 205 18 76 108 -176 114 76 -62 35 -66 -123 -34 156 -34 -12 81 135 23 -98 -60 -201 -155 -39 82
7364 82 210 -33 -200 52 187 -19 39 -8 223 49 -44 -99 115 70 -197 -35 67 -32 -154 -44 -125 24 -233
7387 -233 49 9 -154 -83 -77 74 222 65 -127 7 133 107 51 60 -286 -222 -16 10 30 -94 37 -60 67 -306
7411c06L82j01j81L22j22K8O7j13q4K2n3J22J67N5j96J41j67J57k05J37k87J71
7433d4j02K00j62L9J94k3j60o4L68l84Q8m1J4j25K77l08K98l5k82K85l01M12p3
7456G1j63L56l72J25K28n85K52j68K42k61rJ91K18P0k51r1j79N56j94j70K11L62
7478D39k28k13J28j31R3l9J47j15k50J27m8j15M20m40L07P6j65L3J35j18N5j72
7500g4J68K5j21j78K69j47J64K5k28L16k94J63l7QN4l29J45J68m08M41k33n4J91
7523C4J6O7j03J39n9j30L3j25m1K72m5J76l21J80m3J02k62K95k78j21J6P8M5M4
7547c1K17n9r4J9J38k12j67Q8J85Rl31N2J93n9p4j9J41j01K03j45K98l92K65j58
7571c4J68k12R4K11J1r2k96l3RJ21k6M70k75m8l5j8k00l0J42k25K20j67J66J0
$$ plain form
7411 -306 76 -25 -206 116 -6 22 89 -24 -108 -86 -139 -17 150 205 9 150 -17 140 -65 72 -215 -44
7433 -44 -146 54 -108 -69 125 102 -58 -122 246 -138 -50 -91 -77 -202 75 -233 65 30 -252 33 -268 144 71
7456 71 -92 264 -108 17 245 -340 -88 -256 -14 -275 -284 -93 125 195 -56 -147 -326 230 36 -134 77 439
7478 439 211 -2 126 -5 88 49 196 81 -169 -42 -90 -205 215 -225 82 158 -7 26 161 43 98 -74
7500 -74 94 119 -2 -180 89 -58 106 131 -97 219 -75 88 51 59 113 -216 -71 97 -311 130 -103 -157 34
7523 34 50 117 14 153 94 -36 -3 -128 -169 103 58 234 -87 93 50 152 -110 185 -93 -214 -198 -120 -75 -31
7547 -31 186 127 33 52 190 -22 -189 -101 84 93 -238 -186 7 -52 -126 -145 -4 -105 98 -47 251 -141 124 -34
7571 -34 134 -78 16 227 238 146 -150 -183 -174 -53 -79 391 116 68 33 15 -185 -215 -73 -298 -78 -245 -79 -69
7595f9j42J57L5J1m6j65J49K18k92K63L6O8k11M5J64j46j63J59K6p3M8j35LJ78
7619A18k78j18L36k30R4Q9rN4O1k58J76QK0j12J98j57L6p5K78Q9l62k46K74K6
7643A2J11l06K09J19R5k78J13j43mQ5j18K89k51J71j84L9j61Q7Nj9L23j85K2l25
7667b94K12J21PM0n7K1j88J04J57Ok85j8L98j4m33L46k3j17o1k74L90Q5p9j24
7691h0P6j8l2K28k03L0j80N3K71k09J58j69n1K09m5j87K55n9n5J08p7j22j41J54
7715h6n0K08k4k03K78j22K50l41J88j4o4k4lKq4J01k2J7J27j13n0j00k3K22o0
7740A0q0K49j63J22k38J55P6j52N1N6k64K25KO0k06j35oJ80k2J78j9m5j3j90M28
7765B59j37l55J05J48q9J74j98r2J29Q4j9j19J32MJ3N4J85n2k47L6l4M2k9l0J87
$$ plain form
7595 -69 -211 -54 -19 -8 -54 -219 -70 148 -144 119 155 223 12 57 221 75 -88 71 97 24 72 -63 -60 118
7619 118 -160 -278 58 -172 -78 11 2 56 117 -141 35 43 63 -49 149 -8 28 -47 231 320 -42 -288 -14 12
7643 12 123 -183 26 145 240 -38 75 -68 -72 13 -105 184 -67 104 -80 -41 -202 -115 -110 -129 194 9 31 -294
7667 -294 -82 39 46 86 29 50 -138 -34 123 129 -156 -174 224 210 -223 123 100 -17 -78 -352 38 123 44 -80
7691 -80 -4 -22 -54 174 -29 1 -179 -126 145 -64 94 -75 -126 83 38 -149 106 47 -8 100 23 -99 -240 -86
7715 -86 -136 72 48 -155 123 1 251 -90 98 84 20 -4 -7 -5 -89 12 -10 7 134 21 -29 -129 -152 70 10
7740 10 -70 179 16 138 -100 55 131 -21 30 86 -178 47 49 109 -97 -232 -238 -58 -80 98 79 34 21 -169 259
7765 259 122 -233 -128 20 -69 105 -93 -185 -56 28 9 -110 22 26 39 93 278 226 -21 15 -19 23 -6 -36 151
7790A51n31K92L3J86k83J02N2j20L37k46l4J62k47K00q5j77L28l24L56k30L84
7811C06n98K07j01J62P1k09K05J06j35L7j51M1L89l17j25m0P6K53j07J37k37K18
7833A88p7j87K83j56Q6K4j96j08lJ4J09P2k7J36o0j26M3L21l67Q9jj43j3P0J50
7858A21L2j71Q6l3J03q2j87J29j94L15l04J52j82J22R6q0R6j19m0R8M3L1p6P3
7882B9L0j98K7J15J32k12K70l09J40j28O8J45j32L1n9Q1O4p7J11j09p5P7K8M1
7906I0j38Q1j90K30p1R0l00L01k48J44Q6j84K23j68NK47l05K03l3j40L11k58J55
7929A31r3j04O7j13K08k04J30q6L80k15j21J45j94Q0p3J63j07J04j96J69q7q9
7951a05L1n5K71j72r7J67q7J05L7R9k55J51j43J03Q3j90kl8L2j85N9J66j29K66
$$ plain form
7790 151 -380 -88 -55 131 -152 -50 2 -118 219 -27 -61 101 -146 54 -31 -208 120 -204 152 -78 306
7811 306 -292 -85 -186 -24 47 -162 43 149 14 51 -100 -59 330 13 -112 -152 -76 177 70 207 -30 188
7833 188 111 -76 207 51 137 161 -35 -143 -146 -132 -23 49 22 158 98 -28 15 336 -31 58 57 -86 -99 -29 121
7858 121 153 -18 68 35 138 56 -131 -2 -196 119 -185 -33 -215 -93 3 -77 19 -100 -140 -42 1 32 -44 29
7882 29 59 -139 -112 3 135 -77 193 -116 24 -104 -36 109 -23 8 -51 30 94 17 128 19 -56 21 49 90
7906 90 -48 33 -157 73 2 92 -208 93 -155 -11 75 -109 114 -54 -49 198 -107 96 63 -77 234 -24 131
7929 131 38 -66 1 -112 96 -108 22 -64 316 101 -20 125 -69 11 -62 101 -6 98 -98 71 -16 -105
7951 -105 -74 -129 142 -30 -127 40 -47 58 95 194 -61 90 -53 50 133 -57 -59 -97 -65 -250 -191 -25 -154 112
7975A12M3p1J02r5k56J2p3J08R6j4p9K45k82K30K2P3l52K59o4J91j38r3K18j56
7999C8J12k14L13k96J17j98K05R8m03N72k21j7R0J8n9l13K31rk5%K93m62J39j6
8023gJ9j0nP3j54J80j61J70k06qj04L32j40J57K5j23M8o3L2j39L3N1N0L0j07J46
8049A19qm8l3n0K16k7l19K08j3j65K73j77l66M06j40J05K1K2j10J53L3j27n8k7
8073a12P7J61p2j26J16n7J28k36Q1R3p6j63J77m7p0K54Q7j64k5l0L9M0P9p5j91
8098a12Q9j07K3R7K90k20r2r2K9J1K03k60L48k8J5m2j42J1n3M1L2k82N3K80L9
8123A31j56J45j38J26q3j18Q5K82k91oJ7j68p5M16j60M6k5j00N1J72k22J21l6
8146A4j25J07p7P1j51j3K95l3k91L07q6J74r3lo7k78K45J1r1J21K59l11Ql5lo8
$$ plain form
7975 112 155 84 186 91 -165 -153 -226 -118 -22 -36 -115 130 -152 78 100 173 -179 80 16 207 69 -24 194 38
7999 38 150 -64 249 -47 70 -128 77 175 -228 344 123 106 196 214 155 -158 73 64 39 39 332 -130 9 -7
8023 -7 12 2 -3 70 -84 96 -65 105 -101 -109 -213 119 -21 136 161 38 86 23 55 -84 -51 0 50 80 -27 119
8049 119 111 63 30 -20 196 169 -150 58 45 -120 153 -24 -390 16 -124 -19 2 24 -86 67 100 -27 -85 -112
8073 -112 -35 126 54 -72 44 -13 115 -121 -40 53 -23 -186 -9 -56 -126 128 215 51 26 -4 35 75 154 79 -112
8098 -112 -23 -130 -107 -10 280 60 -32 -124 -95 -84 119 -141 207 179 194 152 10 21 -32 9 41 -241 -188 92 131
8123 131 -25 120 -18 108 25 -93 -8 274 -17 -23 -6 -174 -249 167 7 53 28 -72 -21 151 -71 50 14
8146 14 -111 -4 -81 -10 -161 -174 121 88 -203 104 18 192 99 96 29 -249 -4 7 -84 37 296 -15 -7 -42 -45 -113
8172a13K03l1j74J93o2k02M7K64k21J96r2L1j58K47j78r9J98q7N7
$$ plain form
8172 -113 90 59 -115 78 16 -186 -139 125 -96 100 8 39 -119 128 -50 -149 49 -38 19
8191A9
$$ Imaginary data points
##PAGE= N=2
##DATA TABLE= (X++(I..I)), XYDATA
0@%%%%%%%%%%%%%%Nj3J6j6J6j7K5l2L3m1M8n6O9p7Q8j04J20j36J52j70J93k17
36a14K43k74L06l39L78m23M68n16N69o28O94p65Q42r29J025j130J246j375J520
55G98j683J870k085K334k631K989l429L987m719N729p208R583j4003K4851r8489
70h2106j29447K47796N8054r6134N0661L7414j17089J4334J11160m1005r9214
81d5576L1498L2781k0351J0756J8385j9950j0311M551q491k7123J5023N1530j6289
94A6433n0251K9769K5397l4272J2347M0595l4812k9482N0707J4687n1470J26K6919
107A6693m52R132k0845m3513L1063L7461k6655q563L371m1964m784O6507J6856
120C4307n3408j4232K2353J794J0467K0955l410k4599k8859J3136M6014k676k2006
$$ plain form
0 0 0 0 0 0 0 0 0 0 0 0 0 0 0 0 5 -8 8 -8 8 -9 16 -16 17 -24 24 -32 37 -40 48 -56 64 -72 80 -90 103 -114
36 -114 129 -145 161 -178 200 -223 245 -271 298 -330 364 -401 441 -488 537 -593 653 -722 798
55 798 -885 985 -1100 1234 -1397 1592 -1837 2150 -2569 3160 -4048 5535 -8468 16383 -82106
70 -82106 -211553 36243 94297 -1837 48824 86238 -30851 -16517 94643 53638 -45576
81 -45576 -14078 18703 -1648 9108 27493 7543 -2768 1783 -6708 -33831 -18808 32722 16433
94 16433 -33818 -4049 21348 -12924 -577 40018 5206 -24276 26431 41118 -10352 -10226 16693
107 16693 16241 25373 4528 -38985 -7922 29539 2884 -5679 -2308 -44272 -49056 17451 34307
120 34307 -19101 -33333 -10980 -9186 1281 22236 18826 -5773 -34632 -21496 24518 21842 -164
133a64R762j2849j7621L6326K0574l6752j1628J7503k2484o831M3001m807l4376
146b0346J9581P357k7553J4050K4452j5358j6867J719N577M514K318L331N650
159H425k71p749P332Q082j7886j743J8993j8151k3025Q934K518O177K2355o953
173G038k4419M879K0652J0330K289q587j8474M03J4996J135M621K801k0512l118
187e966J3752r357K452J7750j5066k3709N654J1675N215P188m424j9098J303J5552
201B921Q52M715Q16j9230J433J6951m631j434Q874n664o823R15m289k637P314
216H3M06j2732l027K929j652J2459J0212j2627m937L567o36P285L210n051K052
231A541l050p138R950J3813k342o866J205p646o586J5814N143j6220l043j429
$$ plain form
133 -164 9598 -3251 -20872 15454 36028 -724 -12352 5151 -17333 -24164 18837 14030 -20346
146 -20346 -765 6592 -20961 -6911 17541 2183 -14684 -12965 -7388 -2874 -556 2775 8425
159 8425 8154 405 7737 15819 -2067 -3810 15183 -2968 -25993 -17059 -14541 -8364 13991 7038
173 7038 -17381 -12502 8150 18480 20769 12182 -6292 -5889 9107 10242 14863 17664 -2848 -5966
187 -5966 7786 -1571 881 18631 3565 -20144 -14490 -2815 2400 9588 5164 -13934 -12631 2921
201 2921 3773 8488 9304 -9926 -8493 8458 3827 2393 11267 5603 -1220 -305 -4594 -7231 83
216 83 489 -12243 -15270 -12341 -13993 -1534 8678 -3949 -8886 -5319 -5955 1330 4540 -511 1541
231 1541 -1509 -8647 1303 15116 12774 5908 7113 -533 -7119 8695 13838 -2382 -5425 -6854
245f854m528J3542P840q421j338q84o643L317J1089k330r892J825J81l439J0294
260C759P529m565j127n393l763P891J046k758K14o191n275M533O819J539k254
275B004k022n943j810O989k26j90L729r283l881J1362K876j064M152m711q130
290f148Q32O217J739j661j146n278q28Q327K511J313K736q878n116O674O52l4
306A912J707m020l690M99L558M311R81j810o158k715L951p67K153L432o243l091
322e990M107K269M314J492l296j926l435P25M118K099j127m205k209K608Q41L127
338C512J525n926k969j419o30M836J178k853l6k011O7M178M163K14n564k655K335
355b055L32L602L344l435q69L55K54L781N89k385l263m673n45Q68J725L640l415
$$ plain form
245 -6854 -11382 2160 10000 1579 241 -643 -7286 -3969 7120 4790 -5102 -3277 -3096 -6535 3759
260 3759 11288 6723 5596 203 -3560 4331 5377 2619 2833 -3358 -8633 -4100 2719 4258 2004
275 2004 -18 -5961 -7771 -782 -1008 -1198 2531 -6752 -10633 729 3605 2541 6693 1982 -6148
290 -6148 -5316 901 2640 979 -167 -5445 -6273 2054 4565 5878 8614 -264 -5380 1294 1946 1912
306 1912 3619 -401 -4091 -3592 -34 4277 5258 3448 -2710 -5425 -1474 -2241 -88 3344 -2899 -5990
322 -5990 -1883 386 4700 6192 2896 970 -2465 -1740 2378 4477 3350 -855 -3064 -456 385 3512
338 3512 5037 -889 -3858 -5277 -5907 -1071 107 -2746 -2782 -4793 -4726 -548 3615 3829 -1735 -4390 -2055
355 -2055 -1723 1879 5223 1788 919 1274 1528 5309 5898 3513 250 -4423 -4968 -4100 -2375 1265 -2150
372b150k944L189J785K409K027k233l161k936l7K758p59J390O27k312K021J535
388A209J719N015j838m909j696p46K183J805q46k273l067J117M208M51P69q48
404B253l018M79q4J169L663j864k134m14j898L595K431k141j988k586r51K337
420a151K522M12k884K64J564l375J731M230m292j688J950l651L68N258P59k444
436d27j227j39o52J433J387n630p72L332m988j39O712j72O14J977l188p24M453
453A850L869p82m990l515J988O642L899m995k061K686q42K110M78n651j562j024
469a900k242M56j555M12O022J103m990o22O929M421k607j561l360j875N865J304
485E800m781P62k423j081P536k431q565M579O051n645n544L042N05o81N284l851
$$ plain form
372 -2150 -5094 -1905 -120 2289 4316 2083 -1078 -4014 -4051 -1293 -2052 -662 -35 -2347 -326 1209
388 1209 2928 7943 6105 1196 -500 -1246 937 2742 1896 -377 -3444 -2327 1881 2332 3101 2253
404 2253 -765 -286 -370 799 4462 2598 464 50 -1848 1747 4178 2037 49 -2537 -3488 -1151
420 -1151 1371 1783 -1101 -837 727 -2648 -917 3313 -979 -2667 -717 -4368 -4000 1258 2017 -427
436 -427 -1654 -1793 -2445 -1012 375 -5255 -6027 -2695 -7683 -7822 -1110 -1282 -668 1309 -1879 -2603 1850
453 1850 5719 4937 -53 -3568 -1580 5062 8961 3966 1905 4591 3749 5859 6337 686 -876 -1900
469 -1900 -4142 -3686 -5241 -4829 1193 2296 -2694 -3316 3613 8034 5427 3866 506 -1369 4496 5800
485 5800 1019 1781 -642 -1723 5813 3382 -5183 -604 5447 -198 -5742 -2700 -2195 -2876 2408 -1443
501a443q264N140L998j586L621l807n536P183N684m496j635M354j69k781Q73r78
517A58p06M284k232n164K448m49Q39O976l718r212J270M357R52j694k573j201
533e665J073K048K476K989K89m785K188N017m609j05M636n465k767M213j164P06
549A075L005l227j731L543r89m327K507K096n263J219L638n263L354O626n072
564A191N86L889n257k46O828l748o173L896R83p263K012O708l301j506J506m453
580d348K528O924j848k083k262l312N189O147l787o166p47P79J364L420k459n817
596f478L176L121k911K627P97l812K878R33l845J087J720q5J719o61l558L064
612b28N774k879l257M062j640m209M842j153m957M500J177m397J332O98m22M220
$$ plain form
501 -1443 -9707 -4567 -569 -2155 1466 -2341 -7877 -694 4990 494 -1141 3213 3044 263 1136 158
517 158 -548 3736 1504 -3660 -1212 -1661 -822 6154 2436 -6776 -5506 -1149 -197 -1891 -4464 -5665
533 -5665 -4592 -2544 -68 2921 3210 -1575 613 5630 1021 916 5552 87 -2680 1533 369 1075
549 1075 4080 853 -878 2665 1676 -2651 -144 1952 -3311 -2092 1546 -3717 -363 6263 1191
564 1191 1777 5666 409 163 6991 3243 -2930 966 1949 -5314 -3302 3406 105 -1401 105 -4348
580 -4348 -1820 5104 3256 1173 -1089 -4401 788 6935 3148 -3018 -3765 -2986 -1622 1798 -661 -6478
596 -6478 -3302 -181 -3092 -465 332 -3480 -602 331 -3514 -2427 -707 -792 927 266 -3292 -228
612 -228 5546 2667 -590 3472 1832 -2377 2465 1312 -3645 855 2032 -2365 -1033 -335 -757 3463
628C463q42o307n72N384m79j281K533m222j802P837J30k616L679k845l607M804
644C257P26m012J517J705m026j818M328L14j577P83l435j501K758j237O74K039
660D95n029m08N092n26q05K763k06k107Q91J202n19J782J090m541N19K261l019
677a065J893L127n967k116L382j260L9K127j594j754K107N06j525L582R39n400
693b979K013K388m085K758L848m104j90J824j541J471K978k245k392P26j728n80
709a838M019K29n230J400J882k878L265K446m416m69O67j174K324J583j314j347
725h51P32l78o1L126j27l095M19l09j567L466K50k480J257j331j324L476O13j974
743a58K64p3j868R0L152k91j825J472j794j567M068n16j520J227l080j574L724
$$ plain form
628 3463 2621 -3686 -4258 1126 647 -634 1899 -2323 -4125 3712 3842 1226 4905 2060 -1547 3257
644 3257 3983 -29 1488 3193 -833 -2651 1677 1991 414 1197 -2238 -3739 -981 -2218 -1544 495
660 495 -4534 -4942 150 -376 -1181 1582 1376 -731 160 1362 843 2625 3715 -826 -307 1954 -1065
677 -1065 828 3955 -2012 -4128 -746 -2006 -1967 160 -1434 -3188 -1081 -575 -2100 1482 2421 -2979
693 -2979 -966 1422 -2663 95 3943 -161 -351 1473 -68 1403 4381 2136 -256 470 -1258 -1838
709 -1838 2181 2410 -2820 -1420 462 -2416 849 3295 -1121 -1590 -923 -2097 227 1810 496 -851
725 -851 -119 -497 -558 2568 2441 -654 -235 -544 -2111 1355 1605 -875 382 -949 -2273 1203 1816 -158
743 -158 106 33 -1835 -1745 1407 1116 -709 763 -1031 -2598 1470 954 -566 661 -2419 -3993 -269
760b69Q84p54J179j170j758J451K902n28q70O24l180n18L854q04l84J993l308
777f56j601L503M10p77P11j615k760P28K146l01j07O53k912k14L856p16N57J795
795B700l194r87K231M95Q47N39j598j772J07J474K36Q95n27l838K15K112j160
812a225J732O82l533m92Q84j18J610N51j616j379L13J188J273K473K1l235P53
829a18Q41l71K548L18l306m57K52n82K180P11j491r92j063k56O52K347r1l459
847b337o7M28K07L374J139j842k48r35O41K589K76o56j475j174k67M33K618M30
865C134k179n80j180k55K847m0j585j334k296K8K890O91l13n96j151p2N33K719
883A261Q59j325l94j615j44K616N9J38p96l047l00K562P84L07o46j376r30N04
$$ plain form
760 -269 615 -139 1040 -130 -1888 -437 2465 1937 1067 1691 -1489 -2007 1847 1043 659 2652 -656
777 -656 -2257 1246 1656 879 1590 -25 -2785 -2057 89 -212 -319 334 -2578 -2792 1064 348 905 2700
795 2700 -494 -1481 750 1245 2092 2631 1033 -739 -632 842 1078 1973 1446 -2392 -2177 -65 -1225
812 -1225 507 1189 -2344 -2836 -1952 -2070 -460 91 -1525 -2904 -2591 -1403 -130 2343 2364 -871 -118
829 -118 723 352 2900 3218 -88 -545 -293 -875 1305 2016 525 -467 -1530 -1786 -1134 1213 1122 -2337
847 -2337 -2404 -1976 -1769 1605 2744 902 654 -281 360 2949 3225 2569 1094 -80 -347 86 2704 3134
865 3134 955 375 -805 -1060 1787 1747 162 -1172 -3468 -3440 -550 141 -172 -768 -1919 -1991 -1458 1261
883 1261 2120 795 401 -1214 -1358 1258 1317 1455 659 -2388 -2688 -126 658 965 319 -1057 -1987 -1483
901a483J798M70k26n20k392r04K351Q67Q76K08k739j192J859K615J058j285r14
918D47j206m82K066J072o30n71j483o04J375R52J406k79k062j017o67J638K305
935B260j017j622r95o93J655K011N03p97k318Q5Q26kJ699L08k074r85n53J197
953e12K397L83o90j767j195J291Q17J008L60k558j535P69P00J588L63q34j451
970h66j748R43K328M20m54k417j568J405M04J204J215j438j264K76Q12J446J241
987A939k11r80j564J66Q59J335J549k780l072J423J88R15J781j372k057p22J267
1004a336J391O85N06j179j844M50N64J295K343r02k785m6J131K336J147j431j309
1021A016j634L26J580L26m77p60j335N06m46O6J595k17l76j769j583K164J982
$$ plain form
901 -1483 315 785 559 39 -2353 -3257 -906 -39 837 1045 -1694 -2886 -1027 1588 2646 1361 447
918 447 -759 -1241 825 1897 1267 696 -787 -1391 -16 936 2342 2063 1 -1016 -1683 -45 2260
935 2260 1243 -379 -1374 -2067 -412 1599 2102 1305 -1013 -928 -102 -104 1595 1903 -171 -1156 -1709 -512
953 -512 1885 2268 1578 -189 -1384 -93 724 1732 2092 -466 -2001 -1232 -532 1056 1419 585 -866
970 -866 -2614 -1671 657 1077 623 -1794 -3362 -1957 -1553 -349 866 -572 -1836 -1560 -748 698 1939
987 1939 1728 748 -816 -650 209 1544 3093 313 -2759 -1336 -1148 -233 1548 176 -1881 -2603 -1336
1004 -1336 55 740 1246 67 -1777 -1327 -763 532 2875 1973 -812 -858 273 2609 3756 2325 1016
1021 1016 -618 -292 1288 1614 1137 377 -958 -452 -898 -832 763 546 170 -1599 -3182 -1018 964
1038I64m64K93j640j936J732K783R03j143j362r43n7J969J143j208L07j524k850
1055c033K369J784q32O1j290k318N93K519J020r68j367q63m98K750J636k058O67
1072A72J50k068J195K256oo32m0o53p16R2J529N50q31j396j677Q20J550M70O40
1091A405j144k494P48R75J561J094k302j232J66M57J551J384l66k104j142J741
1107B98P87M59M81k159r16Q91l62J099K009k430j640O81J61L62J237j2j429j139
1125a622J265m61Q43J401j562p20J023k019J138K913j462j394k37j57K33J501
1141F83J297j862j360P43o9O21K109j544j281L48m92Q87R42P9o07j114n06M88
1159f38Q40N27J49j610q69j16J745J242r63J30r64j174J961J059o45J74o09j145
$$ plain form
1038 964 500 793 -847 -2783 -1051 1732 2635 1492 130 -813 -870 1099 2242 1034 1341 -183 -3033
1055 -3033 -664 1120 288 349 -941 -3259 -2666 -147 873 -95 -1462 -2325 -2823 -73 1563 -495 172
1072 172 322 -1746 -551 1705 1699 1067 1027 374 -342 -250 1279 1829 998 -398 -2075 -1255 295 765 1405
1091 1405 261 -2233 -1485 -510 1051 2145 -157 -1389 -1223 -766 785 2169 1803 -301 -1443 298
1107 298 1085 1544 2025 -134 -1050 -159 -521 578 2587 157 -1483 -802 -641 -279 958 946 -483 -1622
1125 -1622 -357 -818 25 1426 -136 -856 167 -1852 -714 2199 737 -657 -894 -1051 -818 683
1141 683 1980 118 -1242 -499 -568 53 2162 618 -663 -315 -807 80 1022 1101 494 -620 -1126 -638
1159 -638 202 729 878 -732 -1601 -1717 28 1270 307 437 -527 -1701 260 1319 674 848 239 -906
1177i06Q43J254Q0j89J0j464j073J797P64r40O18j234k239K102J153p65N20q91
1195e60j144O79J215K56m51M34n99q34J663M79o10J295q32j772O50P64J60P12
1213A505q02j398j90K31J170l5j19j369j434J240Q71L42L97j310n59R01L9J157
1231F37P61j007m41K76J87L73P68r3j114o52N39m52J092O25j702n85N85r29R15
1250b17J067j258o10L61q8N2R16N93r32k29M00l32Q58J107j469L3N4r04J037J413
1270A852j237o10M3o38L73M87M19p82r45j8j84J253L40j238L26l21j007J551Q16
1289D80l04k95l44j84O55O03K25m17l4p54N6J014J39p40L91l66r84J412j21j16
1309C16J5n55m86L87K71N19k25J13p28m04J307K0n76P34o85r18J237L05k08L08
$$ plain form
1177 -906 -63 1191 1271 1082 1092 -372 -1445 352 1116 176 794 -440 -2679 -577 576 -189 331 -560
1195 -560 -1704 -1025 190 446 -5 429 -170 -1004 659 1138 528 1823 991 -781 -131 633 793 1505
1213 1505 703 -695 -885 -654 516 481 362 -1007 -2441 -1201 -330 12 409 -901 -1460 -559 -520 637
1231 637 1398 391 -50 226 413 786 1554 1461 347 -305 234 -218 874 1499 -203 -788 -203 -1132 -217
1250 -217 850 -408 -1018 -657 -745 -693 223 816 -116 -345 55 -277 581 1688 219 252 306 -598 439 1852
1270 1852 615 5 48 -590 -217 270 689 -93 -1038 -1056 -1240 13 353 -885 -559 -880 -1887 -336 480
1289 480 176 -119 -463 -647 8 611 836 419 385 -369 -313 701 840 100 491 125 -859 553 432 316
1309 316 331 -224 -710 -323 -52 467 242 355 -373 -777 530 550 -26 708 23 -895 342 647 439 747
1329G47o18l95N16j55N43Pj96r26n52J047K39j80L29q17m80P92j49L70L41j369
1349i06J61K20l6L70K45K36r58j87O38J62J99N49j265R9O76qP60k09j321P14j92
1370e3%L42N9j57m89l76K28kM24L66j410J45K65l27R45L53r44j8K89O7L95J94
1392B96K94l50PO3L2N54L35j167L00l32j04P58K55j086k73j86K45M11k18L65l95
1413a96j69J32j87O38K76n21L84m83j71J148K32j69m48o19K37Q17M6k79n80m72
1433c84J30J12M28n10o50Q27j282k6M69K38Q1K37r28K07Q32M39K03l96j33k8J31
1454cR20k74o53O10l48m75P57l41K48R3o75l20jL08O37l51n65o10J08J320O9m27
1476B7nk25J53K44L87np8l09K35j70J71N89p61J47m37l70O62K23m33m86l83K44
$$ plain form
1329 747 129 -266 250 95 638 645 449 -477 -1029 18 257 77 406 -411 -891 -99 -248 122 463 -906
1349 -906 -745 -525 -561 -191 54 290 -668 -855 -217 -55 144 693 -572 -473 203 195 955 746 -575 139 -53
1370 -53 -53 289 348 191 -298 -674 -446 -448 -24 342 -1068 -923 -658 -985 -40 313 -631 -649 -360 -293 102 296
1392 296 590 240 247 310 342 896 1231 64 364 32 -72 686 941 -145 -418 -604 -359 52 -166 199 -196
1413 -196 -365 -233 -420 218 494 -27 357 -126 -297 851 1083 914 466 -153 84 901 947 668 88 -384
1433 -384 -254 -142 286 -224 -874 -47 -1329 -1355 -886 -648 -567 -330 -1258 -1051 -219 220 423 27 -106 -134 -3
1454 -3 917 643 -10 600 252 -223 534 193 441 534 -141 -461 -462 -154 483 132 -433 -1043 -935 385 454 27
1476 27 22 -203 -50 194 581 576 498 189 424 254 425 1014 253 400 -37 -407 255 478 45 -441 -824 -580
1498e80K11QN78k32p68P06k71K4L14J50K5k65l38N72J08J54K15p67L64o0l94R27
1520F81m0n36k01j28J5K52M19P0r51l70N84K33M12J25j359K33P44l54K08J1k34
1541a86m09J76M51l11m5N48k83m04K16k1O05N79o93m99L7L76N81j16k1n87m29
1562d35O31L66p46M29p8n86k45P8N03j1J53n84j73J83Q00k51K59k46l72N52M86
1583G13P6j61l16J33J65n58O50l23m13L36n99m73O08l93M25m03N8o99P7R89K59
1604A51q18J87K83n28J199M88p93Q0J08l5L74L58J50r77k26K12n84R01L56j303
1624d17q8J3l65M61M44p20l30L48J38p1L92P21n61K82J13k58L33L87k36j88l3
1645C65k62K55q7N77k70q50m9j84M8O96k28p57m35L04P01K8J96J25j000J96J030
$$ plain form
1498 -580 -369 -361 217 -15 -783 -77 -348 -324 -10 140 165 -100 -438 134 242 396 611 -156 208 148 -246 681
1520 681 641 105 -96 -224 -209 43 462 532 -419 -789 -205 28 440 565 -794 -561 183 -171 37 48 -186
1541 -186 -595 -419 32 -279 -324 224 -59 -463 -247 -268 337 916 223 -276 -239 137 718 602 581 -6 -435
1562 -435 196 562 -184 245 167 -419 -664 -586 -83 -94 59 -525 -698 -515 285 34 293 47 -325 227 713
1583 713 789 628 312 445 610 52 702 379 -34 302 -297 -770 -162 -555 -130 -533 -475 -1174 -1097 -108 151
1604 151 -667 -480 -197 -725 474 962 169 249 357 322 696 1054 1204 227 1 213 -371 530 886 -417
1624 -417 -505 -492 -857 -396 48 -672 -1002 -654 -516 -587 -195 526 -35 247 360 102 435 822 586 398 365
1645 365 103 358 271 848 578 -272 -321 -505 -457 239 11 -746 -1181 -877 -176 -148 48 173 -827 -631 399
1666C99k66K37L56j143L65M65K26m63L40J6r80KR66m90L1K85r45k62J058j81j85
1687a69M57m43l46J47M66Q5n6K32n56j11M91r2L84ko43o3L37j87L94Q6n45m74
1709f08P2O07M23n9k04m17k26N56k4N41k61n31N6k03o1O47j71o29J03j70J94L84
1731A9M06n57k05J06o0K29Q66j41o95K42k65j20Q35J54n39k9k68l10O77K95l30
1752C10m29n02L6L7Q92%j081Q2L2r1R12k22J38Jl49Q5K26L99P5l31n1l37L5P40
1776F07J95m86l76m00Q8N84l5P2k93p99P0M36L08K2Q7k85o03O69Q21n6k58J35
1798E03o90N6R28K4r6N2n29m06N57J48L45n50k95p49o1O66K4m7Q7j006K44L40
1820d55L23L45j24p16J79J60O08K34j32k42o25K65L56J68M52k74p68k9n9N07M46
$$ plain form
1666 399 133 370 726 -417 -52 413 639 176 516 532 -448 -446 520 30 61 346 -599 -861 197 16 -169
1687 -169 288 -155 -501 -354 112 197 141 373 -183 -294 197 105 489 487 -156 -219 118 -69 325 411 -134 -608
1709 -608 -536 71 494 435 231 -186 -412 144 120 661 400 -131 -75 -278 -339 308 137 -492 -389 -559 -365 19
1731 19 425 -132 -337 -231 -291 -62 804 663 -32 210 -55 -175 660 814 275 246 -22 -332 345 640 310
1752 310 -119 -621 -585 -548 344 344 -737 -655 -623 -714 198 -24 114 115 -234 -149 77 476 551 220 169 -168 -133 607
1776 607 802 316 -60 -460 -372 212 177 249 -44 -843 -773 -337 -29 -7 80 -205 -808 -139 682 626 368 503
1798 503 -187 -131 797 821 725 777 248 -158 399 547 892 342 47 -702 -763 -97 -73 -120 -33 -1039 -795 -455
1820 -455 -132 213 89 -627 -448 -288 320 554 422 180 -445 -180 176 344 796 522 -246 -275 -334 173 619
1841F19j99o84j73k07L90N44k01q9q04J28K40N27O14j31o26l35Q1J86R58k23l22
1862B93l17r7K80L83J81k18m66j72l69L41P03Lr82K6k06J41Q41N1l44k37o51K22
1884e94Q16J75j50m81Q0J3O5R08k21m86J82n71K15O21k61K74n74n56n4M31M48
1905B80k7l65k05o59P20N31J05l52J11r45K45N87j31N19m49n73K37K5P97J56k02
1926D05m17l41j50J076l93K78k72p45M2L53L05J95q1o44K1j06N03J20K74l68q99
1947h44J83N94l9M75M8p92QM37m0P44k16k92m96K61K18L74Q5n8p18l87K79M31
1969B55N98m68p63j09nL41K65o8j91l35l23O05J75L21J51n81k82j43J084N72n48
1990E51n47j9m25O89M31l09k8k99o05L59L29J39j1m75k78l93J23Q16L48r00J27
$$ plain form
1841 619 420 -264 -437 -644 -254 290 89 0 -804 -676 -436 91 705 574 -52 -387 -306 -120 838 615 293
1862 293 -24 -121 159 542 723 505 39 -133 -502 -161 542 545 -437 -411 -617 -476 365 416 72 -165 -816 -594
1884 -594 222 397 247 -234 -154 -141 -76 832 611 125 307 -264 -49 572 311 585 11 -545 -599 -168 280
1905 280 253 -112 -317 -976 -256 275 380 28 139 -806 -561 26 -105 414 -35 -608 -371 -346 451 607 405
1926 405 -12 -353 -503 573 180 458 186 -559 -517 -164 141 336 255 -389 -368 -474 29 149 423 55 -844
1947 -844 -661 -67 -106 369 417 -375 -367 70 30 774 558 266 -230 31 249 623 708 650 -68 -455 -176 255
1969 255 853 385 -378 -487 -492 -151 114 46 -145 -480 -803 -198 -23 298 449 -132 -414 -557 527 1099 551
1990 551 4 -15 -440 249 680 371 343 44 -561 -202 127 266 255 -220 -498 -891 -768 48 396 -504 -377
2011c77k77K20O84N5j0om48R3K87L93pj68l32J5k57O70L53p11j58m73l53M69M54
2034A16L53o75o50M78l47N96M33k02l90P2l16O85N73k5n04l39K65K70m2K03rp72
2056b27L31k31J0M79k97k32k57j55K31J06M56p0o05M1j09J32Q33K19o13m59L23
2077i4M06K61l9k86k89l49N47m0L35O1p11m77K00N01K88j50l70j10o7L83j9J30
2099A11K60o54j95M53o5J44N09l77k77m0J39L13k8J22l83p89O63J77N1K94n11
2120h3l46K5P03k5j2N1m00n84M52M33p7j6n20k43M88O0J91j98J11k4l75M0P05
2143C56j12l39K86k87j43L56L41j27J2k36l62p0Q76M7m16L7o20QJ65M27j65m0
2165fn07m90L95P18K68o46P5k06q4P64L97o30L35j22k76P69j77L14n86l15K44
$$ plain form
2011 -377 -654 -434 250 305 295 289 -159 -66 221 614 607 439 107 122 -135 535 888 177 19 -454 -807 -338 116
2034 116 469 -206 -856 -378 -725 -129 304 102 -288 -216 -532 153 726 701 197 -142 123 393 351 554 545 -227
2056 -227 104 -127 -117 362 65 -167 -424 -579 -348 -242 214 144 -461 -420 -529 -397 436 655 42 -417 -94
2077 -94 312 573 534 248 -41 -390 157 117 452 513 -198 -675 -475 26 314 164 -206 -316 -383 0 -19 111
2099 111 371 -283 -478 -25 -90 54 563 186 -91 -131 8 321 293 415 32 -757 -94 83 134 428 -83
2120 -83 -429 -404 299 274 262 313 -87 -671 -219 214 137 121 -399 -642 -154 -94 97 -101 10 -14 -389 -349 356
2143 356 244 -95 191 -96 -239 117 458 331 343 107 -255 -325 551 598 182 219 -401 -393 -228 199 34 -6
2165 -6 -513 -1003 -608 110 378 -268 -193 -399 -483 281 678 48 383 261 -15 754 577 891 305 -10 234
2186B34k99J26J78n90k07L75m96L46N70j02k81n34K05K07J13N41k00j34j24J15
2206D3K11M28k42k6k24k88N47p7j49K88r93j40K90q7L65J5p11J47n1K83K56K79
2228A64Om37l1P65k79K13J20n14j7K16J71j03K34l78j0k26K88k54K05O7m36k06
2250d42K68k79M07K15j71k58L57k11L99k54k47J43O8J25KJ37j02k60L7J56j41
2271e1N77j75o21L07j60l29O75p4j01m2k3k51L3M23k31oo1q5o7N08n7n11N25j90
2295A3j68M01R8j33j58j7k39K18J91L36m79M2l97j51N57K15o99N18l07k55L77
2316c7J93k53r4q5N2j04qL10m61L47k21OM92N4m29L16l80K66M04j47p1j3O0j95
2340BJ78J60o5P1L9n10R6K87l93N5J77m87j94L62J73J12lj21j71K24K34J7j0Q8
$$ plain form
2186 234 -65 61 239 -351 -558 -183 -679 -333 237 135 -146 -680 -475 -268 -155 386 186 52 -72 43
2206 43 254 682 440 414 190 -98 449 372 223 511 -482 -622 -332 -419 -54 -39 -750 -603 -654 -371 -115 164
2228 164 170 -267 -298 467 188 401 521 7 -10 206 377 274 508 130 120 -106 182 -72 133 200 -236 -442
2250 -442 -174 -453 -46 169 -2 -260 97 -114 285 31 -216 -73 -5 120 122 259 157 -103 -66 90 -51
2271 -51 526 351 -270 37 -123 -452 223 149 48 6 -17 -268 -235 188 -43 -49 -110 -195 -262 246 189 -322 203 13
2295 13 -155 246 344 211 53 36 -203 15 206 542 63 105 -292 -443 114 329 -370 148 -159 -414 -37
2316 -37 156 -97 -191 -276 -224 -328 -336 -26 -487 -140 -361 -355 137 191 -238 78 -302 -36 368 221 150 137 197 2
2340 2 180 340 275 346 385 -125 -29 258 -135 -80 97 -390 -584 -222 -49 63 60 -61 -232 -8 226 243 233 321
2364C21m86L54o3K5J68jm64K89L1p8j03M17o58l07M95k94J45K17j78m68O24k57
2386b71p9K83Q8m00K83q8o8M12K20Ml51K68j9J68N2j96l49r2L6J6J39J59o53M17
2410b1l78J65L59k44k11l7n1L90j48K19P2j87OK00O8L67k07m30O1K18j24K35J01
2433D23j71m29J50K3j5Q5q4l13K19Q7j89L91k82m3K74j64%J88n2j48N3L44j60
2456A87j19K51J11l98q4PR7L44m29k7j61l91N42j28j0K65k51j18k71M22P3j39
2478b27J52Q3m27M10K45l27L62j84j51k7K27l10L63j84N6k52J94K02J98l22k01
2499a20k02J64N83p51L53M3m88K16L69k36Q9K2j45r6l5O8J48j42Jj17J46K00j62
2522i2L09j7j64LL9K88j22O2k65j17Q5J60o5r3r9k76n7K75M9n0o0J57q7j86K61
$$ plain form
2364 321 -165 189 126 151 319 318 -146 143 174 96 -7 410 -248 -555 -60 -354 -209 8 -170 -638 -14 -271
2386 -271 -350 -67 21 -379 -96 -184 -252 160 380 384 33 301 282 450 502 306 -43 -135 -99 -83 56 215 -438 -21
2410 -21 -399 -234 125 -119 -330 -367 -418 -28 -176 43 115 -72 -66 134 202 569 362 -68 -7 211 87 322 423
2433 423 252 -177 -27 -4 -19 66 -18 -331 -112 -25 -214 177 -105 -148 126 -38 -38 150 98 -50 3 347 187
2456 187 68 319 430 32 -52 -45 52 396 -33 -60 -221 -612 -70 -198 -208 57 -194 -312 -583 -161 -88 -227
2478 -227 -75 8 -419 -9 236 -91 271 87 -64 -91 136 -174 189 5 61 -191 3 205 403 81 -120
2499 -120 -322 -158 425 -326 27 70 -418 -202 167 -69 20 42 -103 -199 -234 -166 -18 -160 -159 -276 -130 70 -92
2522 -92 217 200 36 39 78 366 244 306 41 -76 9 169 104 11 -88 -364 -421 -146 -97 -147 -207 -50 -137 -323 -62
2547f2J11J63j70j68r6J19L00n0J43m82K50J72R8l5k3n16L83l81K37J68j22k81
2569b42k18K96K17j34J60j11l18J24K92m6J26K19m07K52l1j0k6M32j56l05k38
2590a24L36l5KJ42m48j86P9J86J33k39k49o8r1O43j10J27j59rj80M13l2k00J46
2613G7j76r3M68O4k1j5q2j31k48K16j1k28J21k46J76k62L8M99l35J33P0l84M46
2636G6j1j13N7J28l69K21K61l7p1j16M0j59n2L92R1n37L91l31K19K1qk18J74j20
2660g1J21P1k14K09m31L52k01k2M22l09J08J25j68l6J40J01P3k07K0jk44J22N00
2683D60n33O3j32j95M42k5J17n29M6K42j18M13k8m87J5M3O3JJ06Q5k22k81K59
2706a95K18R8P6j84L7o7n0rL23j05L4k52K28m0k1K48l7m97J34p0J48N3K63q00
$$ plain form
2547 -62 49 212 42 -126 -222 -103 197 147 290 -192 58 230 328 293 270 -246 137 -244 -7 161 39 -242
2569 -242 -460 -164 53 -81 79 -32 -350 -226 66 20 146 365 -42 210 179 169 143 575 419 114 -124
2590 -124 212 177 179 321 -127 -313 -234 -48 85 -154 -403 -471 -562 81 -29 98 -61 -70 -250 163 131 -69 77
2613 77 -99 -192 276 340 319 304 222 91 -157 59 48 -180 -59 -305 -129 -391 -353 146 -189 -56 14 -370 76
2636 76 65 -48 9 137 -232 -11 250 213 142 26 66 -93 -145 247 338 -199 192 -139 80 101 93 -125 49 -71
2660 -71 50 121 -93 116 -315 37 -164 -186 236 -73 35 160 -8 -44 96 197 270 63 83 82 -162 -40 460
2683 460 -73 -10 -142 -337 105 80 197 -332 -286 -44 -162 251 223 -264 -249 -206 -143 -142 -36 49 -173 -454 -195
2706 -195 23 121 197 13 50 -17 -67 -76 247 142 176 -76 152 112 91 339 302 -195 -61 -131 17 70 333 -467
2730d67J02J33K9K13K48J66m47k59N48J7N8J4o36L34J36mJ22P0l51J52m1j70k7
2753f0J42K74l59o27N09KN3l7l70L06o2j63M55L4l61J68rJ71K1L5J5jl3j87K18
2778A34J22l69j3r5k5J52J28k56J19o5k53r0L13K58k08m7j19J28N8M66p6l51N08
2801D19n29J00M10l9j95n4j35O2O7Q9j55N2k03j06N4L87p9m08n7k8K72O4J93j45
2825C6J02k72J27P9J25J30K16n47L7l9L11j99R7j8n73L11r3O3l3K26j60j22j30
2848c26L03K77m55K36n22J65J47J35J46j6l36J43O4J31J90q7l49q9o5L25K86l17
2870a4L3j79J31k15L01K15j85m34L71j07l5K24J3O1j75k80m4N45o0k62L2o7R6
2893c5K4L26J04l88J90j71l22M82m9MM0n56K80K64R3k12K0k73j74NN60J44n63
$$ plain form
2730 -467 -365 -232 -203 10 258 424 -23 -282 266 283 341 355 -281 53 189 185 307 377 26 178 137 -33 -60
2753 -60 82 356 -3 -630 -121 -119 -66 -103 -473 -167 -229 -392 63 97 -264 -96 -105 66 87 122 137 136 103 -84 134
2778 134 256 -113 -126 -221 -246 -94 34 -222 -103 -168 -421 -511 -198 60 -148 -195 -314 -186 -128 338 262 -89 419
2801 419 -110 -10 400 361 166 112 -23 39 106 195 40 92 -111 -217 -163 224 145 -263 -320 -348 -76 -12 181 36
2825 36 138 -134 -7 72 197 327 543 -4 33 -6 305 106 203 185 -388 -77 -170 -107 -140 86 -74 -196 -326
2848 -326 -23 254 -201 35 -487 -322 -175 -40 106 90 -246 -103 -39 92 282 195 -154 -243 -308 17 303 -14
2870 -14 19 -160 -29 -244 57 272 87 -347 24 -83 -118 106 119 180 5 -275 -319 226 166 -96 -64 -131 -35
2893 -35 -11 315 419 31 221 50 -272 210 161 165 205 -351 -71 193 286 74 94 -179 -353 -348 212 356 -207
2916b07J02j96j41N40k12o2R5k21K94k7O9J82k82M8J7J3K39j57K83k49j87j64
2938b23M18MLQ0m21l7L9k65K87J16k28j53J06K09K9K25J8j16m51K69J47K13j09
2961A60L1j98M5j0K66k13P8k28jK70o8P2j19m46JN1j7L50k47J27nJ59m37M33O4
2986A18J18l74J67K23j88J53J63n07O7J83q4Q3L3j24o5j67P8K05J14m22n7o6J23
3009b26K8R6L30k82j76K62j03M20k26K39l83K6J51m3L21j13q4k67k72K30l6J22
3031A4r5q2j84rO94l11J78k95k36N3L17J27q4J4m26K70K07JO1o8J04j76j14K52
3055B12r2q9K65l00k55L80R7j4N8k73j99lK06R7j89K58m14R2K20j89JN2lK60k59
3080h1o0K43L8l80L39k63M16k9j71K49l45q5J41j51M23k30j14K7k37J90J73J03
$$ plain form
2916 -207 -105 -301 -442 98 -114 -176 -81 -302 -8 -35 34 216 -66 -18 -1 12 251 94 377 128 -59 -223
2938 -223 195 199 202 282 -139 -176 -137 -402 -115 1 -227 -380 -274 -65 -36 189 207 91 -360 -91 56 269 160
2961 160 191 -7 38 28 294 81 159 -69 -70 200 132 204 85 -361 -360 -309 -326 24 -223 -96 -101 58 -379 54 118
2986 118 236 -138 29 252 64 217 380 -127 -60 123 39 122 155 31 -34 -201 -123 82 196 -226 -283 -349 -226
3009 -226 -198 -102 228 -54 -230 32 -71 349 123 362 -21 5 156 113 434 321 237 -30 -302 -72 -108 14
3031 14 -81 -163 -347 -356 338 27 205 -90 -326 -273 44 171 87 101 -325 -55 152 153 214 146 250 74 -40 212
3055 212 120 31 296 -4 -259 121 218 204 262 -11 -210 -213 -7 90 -99 159 -255 -163 57 -132 -131 -79 -82 178 -81
3080 -81 -141 102 140 -240 99 -164 252 223 52 301 -44 -129 12 -139 284 54 -60 -33 -270 -80 93 196
3102A96l87L46k82J65j69M51m69o7o1J48j3L66j04k2O4j31Q5K1O7j66o6K13j77
3125Ho5M64k61k63L12l07j29J4K61k39O0L15l51J13J05J53l99J28L36m18K52J75
3147B64j98Q9J12l20J15K18N4l12l00O98o08K63O8j15m06P3j02L96O4k91K65l14
3169b87J56j02J78J56q9j16K5J34L4L4M1j99K85j85P6P2j64N0l23J73J28j13K23
3192A87j27k26O4rJ85q0l17K21j59K32K16j47J04m8l4R1j3l9M9k23K47p8j30J95
3216A61j30OK70l01l13L49m9Q8j13k20p4J69J54J14j40lJ32r7M9k3l5Q4l6r9M05
3241C48k6l30R2j94J05l03M36J11l35J18m0k60K37j11k9j27P8K97ok18J42J85
3263A70q9j01r8O6K3J45j2J29k78J43p8KK21j70J10n9j94PM2J26j88J18j19K13
$$ plain form
3102 196 -191 155 -127 38 -131 320 -149 -216 -277 -129 -142 224 120 98 162 31 116 137 204 38 -28 185 8
3125 8 -57 407 146 -117 195 -112 -241 -227 34 -205 -145 170 -181 -68 37 190 -209 -81 255 -163 89 264
3147 264 66 155 267 -53 62 280 334 22 -278 420 -188 75 143 28 -378 -305 -407 -11 53 -238 27 -287
3169 -287 -131 -233 -55 101 12 -104 -79 55 89 123 164 -35 250 65 141 213 49 99 -224 -51 77 -36 187
3192 187 60 -166 -102 -111 74 -6 -323 -102 -261 -29 187 40 144 96 62 153 140 101 150 -73 174 96 -34 161
3216 161 31 37 307 6 -307 42 -7 81 -32 -252 -326 -157 -3 111 -29 -32 100 3 52 29 -6 78 42 -57 348
3241 348 322 -8 84 -110 -5 -308 128 239 -96 22 -18 -278 -41 -152 -181 -308 -230 67 61 -157 -15 170
3263 170 81 -20 -118 -52 -29 116 104 233 -45 98 20 22 243 73 183 124 -70 -63 -21 105 -83 35 -84 129
3287A29k48K79m97k4M43l27L79p3k11O0j1k2J70m4J00o6k00L34l45R9N04l18J93
3310C04k35J18m15L48j97J23J3mj78Q9k0j02O9l35K86J33J25o18L21k26M89j37
3332d9K4j16J49p5N6J11Lp4J6l7k7J5l7J49k90J68k26J33N7J94m58J74k04L75
3356C1j74O2KJ34k05K65j62J9K70l75K49j96J09J60J03L4m1m45J81J26k6l26o9
3379b74J66j2l92K43J76l3j80J26L03j21Q2m4M5q5M8O2Q4k07J06oq9K01k66p8
3403a45L39qj72q2K41j08N2j19k88j5P9R2J0P4J1J20j49P0K7M3q8k8m6kK95j48
3429E5K01k08J05j96J34m7k74R2N4J01M4j52M2J24p7j85l3K80j73K23k92K70j07
3452a9k89M03k20K79p8o3J21m3j90m9or8J62P3L73l42j88K82l44J73Q0j11J28
$$ plain form
3287 129 -119 160 -337 -361 82 -245 134 61 -150 -90 -101 -123 47 3 103 37 -163 171 -174 -75 429 111 304
3310 304 69 187 -228 120 -77 46 59 55 -123 -34 -54 -156 -87 -422 -136 -3 122 -496 -175 -401 88 -49
3332 -49 -25 -141 8 -67 -11 100 103 29 45 8 -19 -4 -41 108 -182 -14 -240 -107 -50 144 -314 -140 -344 31
3356 31 -143 -81 -79 55 -150 115 -47 -28 242 -133 116 -80 29 189 292 326 285 -160 21 147 121 -205 -274
3379 -274 -108 -120 -512 -269 -93 -126 -306 -180 123 2 84 40 85 0 48 110 194 -13 93 87 -2 199 -67 -145
3403 -145 194 186 14 -68 173 65 117 -2 -290 -305 -226 -134 -124 -50 -39 81 -68 2 29 72 -16 -44 -90 -92 203 55
3429 55 256 48 153 -43 91 44 -230 -138 -84 17 61 -91 -49 75 -2 -187 -220 60 -113 110 -182 88 -19
3452 -19 -308 95 -125 154 76 13 134 91 -99 -148 -154 -252 -90 -17 356 14 -174 108 -236 -63 17 -94 34
3475C4N7k04M8J15o7J76k04L7J20l49J13K5j25L86m04Q3M07j69k28L34j11l50
3497b76K12N2K06k3k76oK14J51k13k09J08Q8r7L26m77R9j35o3L52k64R5rK33k51
3521a63J29R8m9oK6J29q0M7qJp8J19k20J95r4n7m26N51j88l1m1L34k12J03n3m13
3547c87L25J76QPj74j1P9J50l6K46j43k04j03K04K7J4Q2l19Q5k12M3r4K43k26
3571b20J69q9J0J08R9O0l2R1j74N0O5Lj62lR2J10R7k6k90j65J11J31o2J92j97
3596c2j14k3K4J30N6j56n2J85pk33K92j85R6J23p9j33K8J91O8j74l1J53j91J93
3620A29J67k5l71J0Q6K03jK2k79J11k78K97m9J59k16j28J68k02J48k09M18k33
3642g3O8M7K7n9O5J47j63J42k00P7k9O0l8j98R7j69K99j09K98j97k03K34j74K28
$$ plain form
3475 34 91 -113 -65 50 -17 159 -45 -8 112 -237 -124 -99 -224 162 -242 -159 248 79 -149 185 74 -276
3497 -276 -64 -12 194 171 -105 -111 103 254 41 -168 -60 28 -69 257 -220 -121 -256 -319 33 -231 -136 -145 88 -163
3521 -163 -34 64 15 9 35 164 84 131 123 124 46 165 -55 140 46 -11 -437 114 -74 -105 -146 188 -24 79 26 -387
3547 -387 -62 114 122 129 -45 -56 23 173 137 383 240 36 -67 137 164 178 260 -59 26 -186 -143 -237 6 -220
3571 -220 -51 -140 -130 -22 77 137 105 196 22 72 137 140 -22 -25 67 177 274 248 -42 -207 -96 35 -27 165 -32
3596 -32 -146 -169 -145 -15 41 -115 -167 18 11 -222 70 -115 -19 104 25 -108 -80 111 179 5 -26 127 -64 129
3620 129 296 271 -100 -90 -4 199 198 220 -59 52 -226 71 22 181 -35 -163 5 -197 -49 -258 160 -73
3642 -73 -5 42 69 10 75 222 59 201 1 78 49 109 71 -127 -30 -199 100 -9 289 92 -111 123 -51 177
3666A77K0P8k76j14R4M43l02l25J57M7k40K98m8J37o7j36N2m8J6L02J9k15J65
3689B34k15M8m1K28l28j11K72l2o0k17J22j69o4K35J0J97k68L4O5k05K13J72j78
3712e8J94k02jM0N9J92j25l6qj72Q8K74Q7l20j15R8o2J31j09J01j05M7k12L84
3736A70J5J63n24P3j48L88K42l64J73k82K82l9J56m09J77j52J53n4P7n5L6k68
3758a90J88m9no3K78j86P0k6K7M5l2n2j45R7PJ35K94l30O5l30j3K43j5k0J61k86
3784a32Q4L6n6J4K64k27k17J43j57Q7p4M33k45J17j11q8J48k9nLJ82p6M3j55L25
3809C07l08L7o8J15l0J6j68J9j3R8J91p4l9j54lP1j0K61k19k7o1J46r0J21m0j01
3835b3J27j80j32K43L3O9k97N8K9K95l3j29Q2q7j32l9r1K04p0J82j47OK41q3l54
$$ plain form
3666 177 197 275 -1 -115 -21 422 120 -205 -48 -1 -241 57 9 146 79 -57 -5 -53 -37 265 284 69 234
3689 234 19 67 26 254 -74 -185 87 55 -5 -222 -100 -269 -333 -98 -88 109 -159 -125 -60 -265 -52 120 -58
3712 -58 136 -66 -67 -27 32 224 99 63 55 -117 -29 245 332 12 -103 -5 -67 64 -45 56 -49 -2 -214 170
3736 170 185 348 -176 -103 -251 137 379 15 188 -94 188 149 305 -104 73 -79 74 20 97 42 78 -190
3758 -190 -2 -51 -56 -119 159 -27 43 17 44 89 57 5 -140 -43 -36 99 393 63 128 -202 -215 28 13 -7 154 -132
3784 -132 -48 -12 -68 -54 210 -17 -234 -91 -248 -161 -235 198 -47 70 -41 -129 19 -10 -15 -12 170 94 137 -18 307
3809 307 -1 36 -32 83 53 69 -99 -80 -93 5 196 122 83 -71 -74 -3 -13 248 29 2 -59 87 -3 118 78 -23
3835 -23 104 -76 -208 35 68 137 -160 -102 -73 222 189 60 142 55 -77 -116 -207 -3 -73 109 -38 -32 209 126 -228
3860b28L81j90K9K5j20J55p4l0k1k5L1M3O3N1P4k48L30k29nJ28k34K97l08L66
3884B61j24m0n35K92J35j78J70j40Q2L6j05J59K88k26J40k35J22j00LJ20K3J64
3906C12k29m6j05K34jm7p4J11p3j69l0N4oR4k19k7Nj2J70J64l14J96J02j10k8
3931d8k5oK36j15l7J62l31L24l3M9j28l56K25K86l58J46m4l2rj20K25j53q6L31
3955A03M0j25K53m44K65J59k98L16j87q4PJ69km07L12n46N44K0n3L08k13m1m09
3978c13J95J50P3M3p0J42k66k10L52P4n6k32K12j79J15k00K84M4l69P4L47k10
4000@Q0j78L15m78J12N9J53j54L2J06m2j35j85L84L2J8M6k30Q3m8q2k26K23J00
4024a5m1jK23o2M3k61L7J15j78L60m96N5J31n9K8Q6l1R4m63M22J14j74M6k66M45
$$ plain form
3860 -228 153 -37 -8 17 -103 52 -22 -52 -73 -98 -67 -24 39 90 164 -84 246 17 12 140 -94 203 -105 261
3884 261 137 97 -438 -146 -11 -189 -19 -159 -77 -41 -146 13 301 75 215 -20 102 2 5 125 148 312
3906 312 83 37 -68 166 165 118 44 155 82 -87 -117 -63 -69 25 -194 -221 -216 -228 -58 106 -208 -12 90 -20 -48
3931 -48 -73 -79 157 42 5 167 -164 160 127 176 48 -308 -83 203 -155 -9 -53 -85 -94 -214 11 -142 -228 103
3955 103 143 18 271 -173 92 251 -47 269 82 -2 5 174 172 -235 77 -469 75 95 42 350 137 96 -313
3978 -313 -118 32 105 148 78 220 -46 -256 96 170 114 -118 94 -85 30 -170 114 158 -211 -137 210 0
4000 0 80 -98 217 -261 -149 -90 63 -91 -59 47 5 -130 -315 69 101 119 165 -65 18 -30 -112 -338 -115 -15
4024 -15 -56 -57 166 104 147 -114 -77 38 -140 220 -276 -221 -90 -149 -121 -35 -66 28 -435 -13 101 -73 -27 -293 152
4049A52m4j77J35l19O2L30l96K41J49j35O4P9o3q1j8j4J52k72J15R6P9l8m9r1
4073d3M8K33o5p1k7j33J4j19J09K28k43M04K0m18q9J40J58n5j11l8N4j36L09k33
4097f4L45j74R1k68k20K16J61J21k75j30j49M32p9q8J19j00j30L26m56N83N1l19
4119gN8J33k70K50j44J80j90j82J11OK65j27J46m09J30P7o9q0k31M73k2K5j08
4142A5j80J19o0J26K1J8K1J80j79m5O4j31K3N4Q7k1Q6j29O7j55O4m8J28j89k6
4167i0P1j84J87J97n80J45P5K41j46J5K70j87J69k55L74k29j54J90j70K42l14
4188a33J7l2l1K19k09J98j49N6K96l55K31k8k2m2Q5j34k06J82J44J16k20J74j94
4211c7M6p3K36j11j58J63k89L62q4k10J39J26k97L35k08J9J43j25j30K7J12J50
$$ plain form
4049 152 108 -69 66 -253 -191 139 -257 -16 133 -2 62 141 78 -3 -21 -35 117 -155 -40 56 135 97 48 -43
4073 -43 5 238 173 102 75 -58 -44 -163 -54 174 -69 335 355 -63 -152 -12 146 91 -20 -58 -4 -140 169 -64
4097 -64 281 107 198 -70 -290 -74 87 208 -67 -197 -346 86 7 -81 38 -62 -192 134 -322 261 312 -7
4119 -7 51 184 -86 164 20 200 10 -172 -61 -55 210 83 229 -180 -50 27 -42 -122 -353 120 98 123 15
4142 15 -165 -46 -106 20 41 59 80 260 81 36 100 -31 -8 46 133 112 198 69 136 -19 45 -3 125 -64 -90
4167 -90 -19 -203 -16 181 -399 -254 -179 62 -84 -69 201 14 183 -72 302 73 -81 109 -61 181 -133
4188 -133 -116 -148 -179 40 -169 29 -120 -64 232 -123 108 80 58 16 101 -33 -239 -57 87 203 -17 157 -37
4211 -37 9 -64 172 61 -97 66 -223 139 55 -155 -16 110 -187 148 -60 -41 102 -23 -153 -126 -14 136
4233A36k67L22J9j98m3k17J80j2J73j48M2n4q4J86k66L28J19m69M50j51L3j33
4255e4K3k37K59J70j34L0O5j76j10J80lK8J03l3j37k7k9N7o3M6R3r2K19O8P5k36
4281H5n1k2J75K0k92K00j7k36N9M2J09j45j16L07j33j15k53M42r8K0K78l65J32
4304B6j26o9K73p0Q4k03L60L9k41j1k5J30q8k14K41L2j4j19JN4o9L8j50p5K04
4329HO5q8O5j68J59p2J23P5m6J6o5n9K9L22j60l10Q5K45m85J52J85N1k63j18L80
4354A26o3j90P5J27J33p1j8j56J05P8k63K11j8l35J95J11p8J60k1O0O5j34j50
4377e1M2j4k44J58J71m07L03K4k30K60K2j48Q8M2PJ81l8j89K8J88k60J96q7l07
4401b65K91Q0j44k04J60J7P8K50k75K26k84j40L91j17r5J38k61N5J23J0l9o5o2
$$ plain form
4233 136 -131 191 210 12 -31 -248 -68 -80 93 -55 -13 -67 -151 35 -231 97 216 -253 197 46 79 -54
4255 -54 -31 -268 -9 161 27 57 122 -54 -164 16 13 41 144 111 -26 -53 -82 -25 -88 -42 51 -41 178 246 321 85
4281 85 34 12 187 207 -85 115 98 -138 -79 -37 72 -73 -189 118 -15 -130 -383 59 -39 -19 259 -106 26
4304 26 -100 -169 104 34 118 -85 275 314 73 62 37 167 79 -135 106 138 124 5 6 60 -9 29 -121 -196 8
4329 8 73 -15 50 -118 41 -31 92 167 121 137 72 13 42 364 204 -106 -21 224 -261 -109 76 127 -136 -254 126
4354 126 63 -127 -52 75 208 137 119 -37 68 146 -117 94 76 -259 -64 47 -31 129 108 168 233 99 -51
4377 -51 -9 -23 -267 -109 62 -345 -42 -18 -248 12 34 -114 -26 16 23 204 166 -23 5 193 -67 129 42 -265
4401 -265 26 106 -38 -242 -82 -65 13 263 -12 214 -70 -210 181 64 -31 107 -154 -99 24 34 -5 -70 -132
4424a32N2j08K16n6j07J79j90K60l50K86j80K19j20J38j19J67p9o8P4k5k34K92
4446A15k2o5J66l46J94Q3n26O51l05J75j47k96M38n9O7q4n4l6J6l5J94J84k14
4469I4J57k94J50j98J77Jj12n0j39J86j50J23M3P9k16K6L5LJ61K08n1j61j02J56
4493A26l4k67K86o5m8l6J27j79K8K82j57K7rj64rJ96k07P7o2o2L30l01J86m35
4517c70M90p4k91N2rJ37Q0m2j63M20j90M7k59L48k82J08j05J93r4j6J2L00n10
4540b18J4J39J24O9JK20l65r2K21j91J56N5m2Pj40j8J57j00J70q9Q3j25p1NJ29
4565I9k04J57p9Rj40L05j46j1k49J90J36j09j7m3J41R9p4q6Pr3J08l6K17k61J03
4590B3J87k16O5k13K68k00K19j58L1R8j36j52L00k88J89J09k54J94j64p2L50m6
$$ plain form
4424 -132 -80 -188 28 -28 -135 44 -146 114 -236 50 -130 89 -31 107 -12 155 76 8 82 57 -177 115
4446 115 93 28 194 -152 42 125 -401 250 -55 120 -27 -323 115 56 123 39 -15 -51 -35 -70 124 308 94
4469 94 251 -43 107 -91 86 87 -25 -75 -214 -28 -178 -55 -12 67 -149 -123 -88 -85 76 284 233 72 -30 126
4493 126 92 -175 111 46 -2 -38 89 -90 -62 220 63 90 81 -83 -92 104 -103 -26 -88 -150 180 -121 65 -370
4517 -370 120 46 -245 -193 -202 -65 15 -27 -190 230 40 87 -172 176 -106 2 -103 90 -4 -20 -8 292 -218
4540 -218 -204 -65 59 128 129 349 -16 -108 113 -78 78 133 91 98 -42 -60 97 -3 167 78 161 36 -35 -30 99
4565 99 -105 52 -27 -18 -158 147 1 -10 -259 -69 67 -42 -59 -102 39 138 64 -22 -15 -108 0 -36 181 -80 23
4590 23 210 -6 59 -154 114 -86 133 -25 6 104 -32 -184 116 -172 17 126 -128 66 -98 -170 180 134
4612A34k52K91l39M00n7j81k7K64j64K55m54R4K42l13j0J49m1K09j08qj45j03
4634a64K45n6J2k5J1k10K09l2j91K12pj36Q8N2n5j8L9J27q3P6k20L6P7K08l90
4659a95L18qL1j36L9n3p8k8K54l63J18k0J5K08r7j3k99K83J9J71m40K57r5m8K18
4684E8L1j41J1K46q0j2j72p3K66J57k10j70J09R3l82L92o2p9N0r4j04L0J12o2
4708h6Q6J13l29J03M04k20k27R2M3J88j14J53J68l23o3p0J13J53r5k08K03P8j69
4731gk2P2O8l0j65o1K16m1k54K58j24J92j93J80o4k2J34k82P9J82J20m0k80m4
4755a28n2J10J05R2l7k19L21k21J13j86j2J77j47M5J31O7o1L3n6Rk1J0L59m68
4779c6J36k19P6K83j43o9P4l20o9L64p6J02k89J59N1q2n6P8r1Q6R4j57J18l9J84
$$ plain form
4612 134 -118 173 -166 234 177 -4 -31 233 69 324 -130 -36 206 -107 -117 32 -9 200 92 84 -61 -164
4634 -164 81 25 37 12 23 -187 22 -10 -201 11 4 -132 -44 8 -47 -65 -26 101 18 94 -126 -90 -13 195 -195
4659 -195 123 115 146 10 49 -4 -82 -110 144 -219 -101 -121 -106 102 5 -8 -307 -24 -5 166 -274 -17 -112 -160 58
4684 58 89 -52 -41 205 125 113 -59 -132 134 291 81 -89 20 113 -269 123 61 -18 32 -62 -166 -136 -24 -86
4708 -86 0 113 -216 -113 291 71 -156 -64 -21 167 53 206 374 51 -12 -82 31 184 89 -119 84 162 -7
4731 -7 -29 43 111 81 -84 -145 71 30 -224 34 -90 102 -91 89 25 3 137 -145 -66 116 236 196 -84 -128
4755 -128 -180 -70 35 127 90 -129 192 -29 84 -102 -114 63 -84 -39 92 159 98 131 75 84 63 73 432 -36
4779 -36 100 -119 -43 240 97 28 102 -218 -287 77 1 103 -186 -27 24 -58 -114 -36 -127 -41 53 -104 14 -25 159
4804A59m2n2j10L23j09M2p7k18K13j18p1k2P5m3R4q8R5k82K11L3l96P57m28J10
4828E6M6j20N6M6p3K1l0l8L5J09j36k5j43j84L83J3oK4L1j39K98l69J5j9J08K20
4854A79q9k05O2Q7k83O9J24l1L8L5j70O2K0J92q3q0j93J61Q0M9J96l04K54o1j67
4879e8K9J16L07n05PM43m54J73k39M8J0j6P4J19O4l84N05j64o0J11kp5Or2r9L93
4905B57l49K09o5J60l5j67p1J72k35K27j38l4J54j49N8o4l5O0j17K66J12j28k67
4928a79J99j34K43q8j4J4q8j22J00K70k89J82j81j9K37k95O2k69K90j8O4K66k25
4951FNp5P2j33K97j61M8k23J9P0Q8j29N7J69j30L55o04L67k86L47k03lj23R1j23
4976b02K41j73J81L9k79O5P0K58k09k44K20J8R0R6p1k96J41K05o1q3K68m07P3
$$ plain form
4804 159 117 65 -45 278 169 211 134 -84 129 11 -60 -82 -7 -50 44 -44 51 -231 -20 13 -383 374 -54 56
4828 56 102 -18 38 84 11 32 2 -36 -1 108 -28 -53 -196 -380 3 16 10 34 65 -74 224 -145 -130 -149 -41 179
4854 179 90 -115 -53 34 -249 -180 -56 -87 -49 -14 -184 -122 -102 90 7 -73 -266 -105 -25 24 220 -84 170 109 -58
4879 -58 -29 87 394 -111 -104 339 -115 58 -181 -133 -123 -139 -65 54 118 -266 239 75 15 126 124 49 55 -37 -136 257
4905 257 -92 117 52 212 177 10 -61 111 -124 103 -35 -69 85 -64 -6 -70 -105 -45 -162 104 216 88 -179
4928 -179 20 -114 129 41 27 41 -47 -169 -69 201 -88 94 -87 -106 131 -164 -102 -371 -81 -99 -35 231 6
4951 6 11 -64 8 -125 172 11 59 -164 -145 -75 13 -116 -59 110 -20 335 -269 98 -188 159 -44 -47 -170 -79 -202
4976 -202 39 -134 47 86 -193 -128 -58 200 -9 -253 -33 -15 75 171 100 -196 -55 150 89 6 274 -133 -60
4999f0K78l32N3o2K65l01P2m3J93j43J06J58m3N0k77J96k69J69P0j5L1k94O9R9
5023c0j66L16k04K9N5KJ4o6Q6p0R5j51J01m2L0k5Q3k92K05J99k56J41j59P5K3
5048gJ95k80q2J34N7J00j64k3pk9J61j02J18k16K30J79m36J79M7q9o1K72l73N13
5072C16m41K33m7m0k6j60K06k9K1P3kk31J00M4J25j46n3j8K3O2J28MJ6Q1j87p7
5098b5n7K08J2m5j88K56k54K12j31O1j52J92k16j06K15j62J93j99m1J80K20r4
5120G9m21J57j7L87j70J19K7l05M0PL6O6jR7j76j24M32k11Or6J8J52j22k1J1Q0
5146E0N0L6j39K07k28N1j71J25J10j77k1lJ44J42m40l5J26M8J39LJ4N3Oj07l6
5171e3J13l0j15OJ38R7j16j49R5l0J46l9rk55J86p3O6J28j36M1k34K65J07j23
$$ plain form
4999 -60 218 -114 -61 -123 142 -159 -87 -130 63 -80 26 184 141 191 -86 110 -159 10 80 65 96 -198 -129 -30
5023 -30 -196 120 -84 -55 0 2 16 -50 36 -34 61 -90 11 -31 -1 -26 57 -235 -30 169 -87 54 -105 -30 -7
5048 -7 188 -92 -174 -40 17 117 -47 -70 -77 -106 55 -47 71 -145 85 264 -172 7 54 -35 -96 176 -197 316
5072 316 -125 108 61 21 -5 -165 41 12 33 106 104 -127 -27 17 142 -4 -57 -75 -52 10 138 142 158 239 52 -25
5098 -25 -82 126 138 93 -95 161 -93 119 -12 49 -103 89 -127 -233 -18 -180 13 -186 -227 -47 173 79
5120 79 -342 -185 -202 185 15 134 161 -144 -104 -97 -61 5 4 101 -75 -199 233 22 28 -68 -50 102 -20 -41 -30 50
5146 50 100 136 -3 204 -24 27 -144 -19 91 -86 -107 -110 34 176 -264 -299 -173 -125 14 17 31 84 90 -17 -53
5171 -53 60 30 -85 -79 59 156 40 -109 -14 -44 102 63 54 -201 -15 -88 -22 106 -30 11 -223 42 149 26
5195B6p5Q4J28J34k00k02O0r3K29rm1j69K23N0j19R7r5K5P3j70J01K35j74l33
5219b15K94j74K8L09j93J07k71p4J08M03k94N1k45K67Q4j06r2p8K62K2k92L32
5241B33l20K27k74K68k02K11j49l2j7r1J8J66m7J60n6r2l1Q7J02k23L65j85j32
5264a4k31N96m32L4J64m24J90M3o4rK23Jn6k7J18kj47J67L0r0LQ6l04q3M09k03
5290b2k3J22K4k7r4M6j49J58J54o8j03j2j10K7pp6Q3J78Nj6l10N6J9P6J89L6k48
5317i2L2K34m32M21l51K22K01j84N2k09j82M5j91M15O4l22K58o3N2K22l2j55N2
5340E7q7j9K57k37K02p2o9R5m11L03l9j18K40O3k72N2j08LJ12M5M1j86N9L06j32
5365H5Q5j46m7J72k94L31j40J73n37M36j90p8K76j56k9R6L1o0O3J8l35K36p6p6
$$ plain form
5195 26 -49 35 163 297 97 -105 -45 -138 91 82 41 -128 95 145 26 123 28 53 126 -44 57 292 118 -215
5219 -215 79 -95 -67 242 49 156 -115 -189 -81 322 28 79 -166 101 185 79 -13 -91 171 193 -99 233
5241 233 -87 140 -134 134 -68 143 -6 -38 -55 -146 -128 38 -9 151 95 3 -28 59 161 -62 303 118 -14
5264 -14 -245 351 -81 -47 117 -307 -117 -74 -138 -147 76 77 21 -6 112 110 -37 130 160 70 73 159 -145 -228 181 -22
5290 -22 -45 77 101 74 -20 26 -123 35 189 121 18 6 -104 -77 -84 -160 -77 101 106 90 -220 -164 -145 -69 120 156 -92
5317 -92 -60 174 -258 163 -188 34 235 51 103 -106 -288 -243 -434 -19 45 -277 -19 -82 -30 192 160 5 57
5340 57 -30 -49 208 -29 173 101 32 127 -284 19 -20 -138 102 165 -107 -55 -163 -160 -48 -3 38 -148 -89 217 85
5365 85 170 24 -23 149 -145 186 46 219 -318 118 -72 -150 126 -30 -59 37 68 8 71 89 -246 -10 -86 -162
5389a62J56J93j9j32J15k8pj53L1J78j41l44L64j8O1j77J87K70k08j38Oj10k6
5412a02K28o2r2j44J14n3J46J7j88M23l74J68M2j92p5j51K86mn7J72j93K18N5
5435A82l07K06k67J97KM8p9J07K21j64j66Q8j72L07n3k0k90J78J30j53K38Jl13
5458g9MJ27l6J98l19K39l68J69M6J0L9j20k4J83J6k26l4J70J49j08N0j36J69j93
5482g4K80l29L75k55J60k38OJ30J44m57J94J1l9K73j67j66M4%J92P3Qj64j42J12
5506b9r3J8L14k85J08J24k30q9J56j19K1J80k10J22O1r1O2n2J00om77L36J55j50
5530g4Q7%J59l2j11N3j13J64j45J37l5k66R2p0J19K1l6K29N5j43j24R7j05OJ10
5555G5jK9lp7n0j48L11l20K80qj57J87j64j6J2j2J38j00K66n2k52j3J34P3j56
$$ plain form
5389 -162 -6 187 168 36 151 123 116 -37 -6 172 31 -313 51 33 94 -83 104 374 166 28 34 -76 -102
5412 -102 126 64 -28 -172 -58 -111 35 52 -136 287 -87 81 123 -69 -144 -295 -9 -13 -70 102 -91 127 182
5435 182 -125 81 -186 11 13 61 -18 89 310 146 -20 68 -104 203 150 130 -160 18 148 -5 233 234 -79
5458 -79 -75 52 16 214 -105 134 -234 -65 -19 -9 30 -90 -114 69 85 -141 -175 -5 144 36 86 -50 119 -74
5482 -74 206 -123 252 -3 157 -81 -75 55 199 -258 -64 -53 -92 181 14 -152 -108 -108 84 157 165 1 -141 -29
5506 -29 -122 -104 210 -75 33 157 -73 -162 -6 -125 -104 76 -134 -12 49 -42 20 -32 68 62 -415 -79 76 -74
5530 -74 13 13 172 140 29 82 -31 133 -12 125 90 -176 -84 -154 -35 -14 -50 179 234 91 -33 64 -41 -35 75
5555 75 74 103 100 23 -27 -175 136 -184 96 88 -69 118 -46 -62 -50 -62 76 -24 242 190 -62 -75 59 132 -24
5580b4P2J92j77j29R6l60L1L56L1j89P2J25j03o9J57n4K14l02J20j87J43O5m8
5603C2p9K70k33j98L23p8q7J26j00N6J47k94L38k06j2K98k09r6o5K58j45j68J07
5626a5K54m03mJ18J66j60q2K46j99J41P8j46m4r5L01j36j20J86mo4l0p0R6M6l5
5651B5k21L41k83k4K05p3J94k14p2J26m7J80m4k39l9J07N0J94q2J92l16J47o7
5674D0j18J71j86J93n2K5l27K81O0j01j05J01m7O0J9L5Q7j81O3jjJ6J14p9J83
5699B50k52j03K99N4l45n4M0J26J69l52Q1%M5j08J38L01k11q7p5O7j30J80M7j59
5723g9K5K79k87K68m50K23J84l24K00k08K45k06Q9J23J45j25j22j83K18J6J92
5744B23k14J03k06L3LK91m41M66l38kJ09J43k37J02J50k94j9K21J01l40J93Nr2
$$ plain form
5580 -24 48 240 63 -66 30 -330 -299 57 88 -101 -29 96 -7 -76 81 27 241 -61 59 -128 15 80 32
5603 32 -47 223 -10 -208 115 37 -50 76 -24 32 179 -115 223 17 5 303 94 -2 -67 191 46 -122 -15
5626 -15 239 -164 -168 -50 116 -44 -126 120 -79 62 140 -6 -50 -145 156 20 -100 86 82 18 -12 -82 14 60 25
5651 25 -196 145 -138 -162 43 -30 164 -50 -122 4 -43 137 93 -146 -185 -78 -28 166 84 276 -40 107 40
5674 40 -78 93 -93 100 48 73 -254 27 87 -14 -119 -18 -65 -5 14 49 136 -45 18 17 16 32 146 67 250
5699 250 -2 -105 194 248 -97 -151 -111 15 184 -168 -87 -87 -42 -150 -12 289 78 -9 -84 -17 -147 33 80 -79
5723 -79 -54 225 -62 206 -244 -21 163 -161 39 -169 76 -130 -41 82 227 102 -20 -203 15 31 223
5744 223 9 112 -94 -61 -58 233 -208 258 -80 -82 27 170 -67 35 185 -109 -128 93 194 -146 47 52 -40
5767d0J0J09j02j07K01m4k5J04J1N2l22K15k3j02J56k2m2K5j67m7M25k71k2l1
5791e9K08k39J16R9q9k49L37K6n6O2l83M78j79n9J1J76k70L0J82j51R4R7m6k73
5815a37r0L45j96j7L27j31j66L0j80K17j18J11L2J4LP1j86o3P4K17k70l8R0K29
5839A68l48J03J67j27M3k27L42nm01Q9N9O4r6J18k63J67Q9k61L26j27N6p2K16
5862H0j56J70k22L1J80J22k93N1r3L1O0J20k61K62r3Op8n3K7L93j21m8%k41j19
5887b45R1J63J33k40K43L1k51L2J21k92K97p0Kj32RL77l03L22j98k25K98r9l47
5910b83K96J4q1r3K37j4K0j09K01k95J50k59K20l4J34j36L4R5l14K49q0K26k59
5933h1M1J63r0k77q4L51k21kl4P7J0P5K03j63K06K5k74O5M9r7KJ11j82J75l1n8
$$ plain form
5767 -40 -30 79 -23 -130 71 27 2 106 117 169 -153 62 39 -63 93 71 29 54 -113 -160 265 -6 -28 -59
5791 -59 149 -90 26 125 36 -213 124 150 94 156 -227 251 72 13 24 200 -70 -40 142 -9 85 182 136 -137
5815 -137 -227 118 -78 -95 232 101 -65 -35 -215 2 -116 -5 27 41 44 115 -71 -134 -60 157 -113 -151 -61 168
5839 168 -180 -77 90 -37 6 -221 121 116 -285 -196 -137 -73 -169 -51 -314 -147 -58 -319 7 -120 -64 -136 80
5862 80 -76 94 -128 -97 83 205 -88 -37 -130 -99 -39 81 -180 82 -11 -5 -83 -136 -109 284 163 115 115 -126 -245
5887 -245 -154 9 142 -98 145 176 -75 -43 78 -214 83 13 15 -117 -108 269 -34 288 90 -135 163 64 -283
5910 -283 13 27 -54 -147 90 76 96 -13 188 -107 43 -216 4 -30 104 -32 2 97 -217 32 -48 178 -81
5933 -81 -40 123 33 -244 -328 23 -198 -200 -234 -157 -147 -72 131 -32 174 199 -75 -10 39 -58 -56 55 -127 48 17 -41
5959d1L4l8J06l5K93l74L28p2k31Rj02J35k12J89J19p2j36k46M95k68J56n1o1
5982g5J58j43O6j71J7J3J36k3nm5m8J48j0j65M3K18j88Q6L9j15m3K44j35J24p6
6007E0q4O7k8o7j86K85j83J58l5J15j07M4P2k50K11j24M6J5q1J22l7r0k8l9L78
6032B24l23j47P1nL17l58L89k21n9N2NP4j95L07o7l25K74R5j05P8j35J36j28j01
$$ plain form
5959 -41 -7 -45 61 26 319 -55 273 201 -30 -21 -123 12 -200 -11 108 36 -100 -346 149 -119 37 -14 -75
5982 -75 83 -60 6 -165 -148 -135 1 -22 -27 -72 -120 28 18 -147 -104 114 -74 12 51 -64 -107 137 2 126 50
6007 50 -34 33 5 -62 -248 37 -146 12 -23 92 -15 29 101 -149 62 -62 -16 -1 -82 40 3 -87 -115 -154 224
6032 224 -99 -246 -175 -180 137 -221 168 -53 -112 -60 -55 19 -176 131 64 -261 13 108 3 81 -54 82 -46 -147
$$ [...]
8191D
##END NTUPLES=NMR FID
##END=
