##TITLE=1H_Ser 5-4-i
 CDcl3, 8 sc, 
 23.10.2020
##JCAMPDX= 6.0         $$ Bruker NMR JCAMP-DX V2.0
##DATA TYPE= NMR FID
##DATA CLASS= NTUPLES
##ORIGIN= UXNMR, Bruker Analytische Messtechnik GmbH
##OWNER= root
$$ XWIN-NMR		Version 3.5
$$ Fri Oct 23 13:08:55 2020 Russian Standard Time (UT+4h)  she@DPX200
##.OBSERVE FREQUENCY= 200.1315066352
##.OBSERVE NUCLEUS= ^1H
##.DELAY= (6, 6)
##.ACQUISITION MODE= SIMULTANEOUS
##.ACQUISITION SCHEME= undefined
##.AVERAGES= 8
##.DIGITISER RES= 18
##SPECTROMETER/DATA SYSTEM= spect
##.PULSE SEQUENCE= zg30
##.SOLVENT NAME= D2O
##.SHIFT REFERENCE= (INTERNAL, D2O, 0, 15.7039)
##AUDIT TRAIL= $$ (NUMBER, WHEN, WHO, WHERE, WHAT)
$$ ##TITLE= Audit trail, XWIN-NMR		Version 3.5
$$ ##JCAMPDX= 5.01
$$ ##ORIGIN= Bruker BioSpin GmbH
$$ ##OWNER= she
$$ F:/spectra/data/she/nmr/H-F/1/audita.txt
$$ ##AUDIT TRAIL=  $$ (NUMBER, WHEN, WHO, WHERE, WHAT)
(   1,<2020-10-23 13:07:25.23 +0400>,<she>,<DPX200>,
      <created by zg, POWCHK disabled, PULCHK disabled
       configuration hash MD5:
       00 E9 B6 7A A2 85 ED C7 34 08 36 98 17 FE 4E 26
       data hash MD5: 16K
       8B 4B A8 4A E1 D3 4E 14 D6 6F D7 BF EA F5 83 08>)
$$ ##END=
$$ 
$$ hash MD5
$$ B0 B1 6D 60 3B 9B 8A B7 BA 8E A2 11 74 ED CD 6E
##$RELAX= 
##$RELAX= 
##$RELAX= 
##$RELAX= 
##$RELAX= 
##$RELAX= 
$$ Bruker specific parameters
$$ --------------------------
##$DU= <F:/spectra>
##$EXPNO= 1
##$NAME= <H-F>
##$PROCNO= 1
##$TYPE= <nmr>
##$USER= <she>
##$AMP= (0..31)
100 100 100 100 100 100 100 100 100 100 100 100 100 100 100 100 100 100 
100 100 100 100 100 100 100 100 100 100 100 100 100 100 
##$AQSEQ= 0
##$AQ_mod= 1
##$AUNM= <au_zg>
##$AUTOPOS= <>
##$BF1= 200.13
##$BF2= 200.13
##$BF3= 200.13
##$BF4= 200.13
##$BF5= 200.13
##$BF6= 200.13
##$BF7= 200.13
##$BF8= 200.13
##$BYTORDA= 1
##$CFDGTYP= 0
##$CFRGTYP= 5
##$CHEMSTR= <none>
##$CNST= (0..31)
1 1 145 1 1 1 1 1 1 1 1 1 1 1 1 1 1 1 1 1 1 1 1 1 1 1 1 1 1 1 1 1 
##$CPDPRG= <>
##$CPDPRG1= <>
##$CPDPRG2= <>
##$CPDPRG3= <>
##$CPDPRG4= <mlev>
##$CPDPRG5= <mlev>
##$CPDPRG6= <mlev>
##$CPDPRG7= <mlev>
##$CPDPRG8= <mlev>
##$CPDPRGB= <>
##$CPDPRGT= <>
##$D= (0..31)
0 1.2 0 0 0 0 0 0 0 0.06 0 0.03 0 0 0 0 0.0002 0 0 0 0 0 0 0 0 0 0 0 0 
0 0 0 
##$DATE= 1603444044
##$DBL= (0..7)
120 120 120 120 120 120 120 120 
##$DBP= (0..7)
150 150 150 150 150 150 150 150 
##$DBP07= 0
##$DBPNAM0= <>
##$DBPNAM1= <>
##$DBPNAM2= <>
##$DBPNAM3= <>
##$DBPNAM4= <>
##$DBPNAM5= <>
##$DBPNAM6= <>
##$DBPNAM7= <>
##$DBPOAL= (0..7)
0.5 0.5 0.5 0.5 0.5 0.5 0.5 0.5 
##$DBPOFFS= (0..7)
0 0 0 0 0 0 0 0 
##$DE= 6
##$DECBNUC= <off>
##$DECIM= 32
##$DECNUC= <off>
##$DECSTAT= 4
##$DIGMOD= 1
##$DIGTYP= 9
##$DL= (0..7)
0 120 120 120 120 120 120 120 
##$DP= (0..7)
150 150 150 150 150 150 150 150 
##$DP07= 0
##$DPNAME0= <>
##$DPNAME1= <>
##$DPNAME2= <>
##$DPNAME3= <>
##$DPNAME4= <>
##$DPNAME5= <>
##$DPNAME6= <>
##$DPNAME7= <>
##$DPOAL= (0..7)
0.5 0.5 0.5 0.5 0.5 0.5 0.5 0.5 
##$DPOFFS= (0..7)
0 0 0 0 0 0 0 0 
##$DQDMODE= 0
##$DR= 18
##$DS= 0
##$DSLIST= <SSSSSSSSSSSSSSS>
$$ [...]
##$SUBNAM2= <"">
##$SUBNAM3= <"">
##$SUBNAM4= <"">
##$SUBNAM5= <"">
##$SUBNAM6= <"">
##$SUBNAM7= <"">
##$SUBNAM8= <"">
##$SUBNAM9= <"">
##$SW= 16.880792210976
##$SWIBOX= (0..15)
0 0 2 0 0 0 0 0 0 0 0 0 0 0 0 0 
##$SW_h= 3378.37837837838
##$TD= 16384
##$TD0= 1
##$TE= 0
##$TE2= 300
##$TE3= 300
##$TEG= 300
##$TL= (0..7)
0 120 120 120 120 120 120 120 
##$TP= (0..7)
150 150 150 150 150 150 150 150 
##$TP07= 0
##$TPNAME0= <>
##$TPNAME1= <>
##$TPNAME2= <>
##$TPNAME3= <>
##$TPNAME4= <>
##$TPNAME5= <>
##$TPNAME6= <>
##$TPNAME7= <>
##$TPOAL= (0..7)
0.5 0.5 0.5 0.5 0.5 0.5 0.5 0.5 
##$TPOFFS= (0..7)
0 0 0 0 0 0 0 0 
##$TUNHIN= 0
##$TUNHOUT= 0
##$TUNXOUT= 0
##$USERA1= <user>
##$USERA2= <user>
##$USERA3= <user>
##$USERA4= <user>
##$USERA5= <user>
##$V9= 5
##$VALIST= <valist>
##$VCLIST= <CCCCCCCCCCCCCCC>
##$VD= 0
##$VDLIST= <DDDDDDDDDDDDDDD>
##$VPLIST= <PPPPPPPPPPPPPPP>
##$VTLIST= <TTTTTTTTTTTTTTT>
##$WBST= 1024
##$WBSW= 4
##$XGAIN= (0..3)
0 0 0 0 
##$XL= 0
##$YL= 0
##$YMAX_a= 102097
##$YMIN_a= -99652
##$ZGOPTNS= <>
##$ZL1= 120
##$ZL2= 120
##$ZL3= 120
##$ZL4= 120
##$ABSF1= 10
##$ABSF2= 0
##$ABSG= 5
##$ABSL= 3
##$ALPHA= 0
##$AQORDER= 0
##$ASSFAC= 0
##$ASSFACI= 0
##$ASSFACX= 0
##$ASSWID= 0
##$AUNMP= <proc_1d>
##$AZFE= 0.1
##$AZFW= 0.1
##$BCFW= 1
##$BC_mod= 2
##$BYTORDP= 1
##$COROFFS= 0
##$CY= 11.3945322036743
##$DATMOD= 1
##$DC= 2
##$DFILT= <>
##$DTYPP= 0
##$F1P= 16.9975609425685
##$F2P= -3.02152046262296
##$FCOR= 0.5
##$FTSIZE= 0
##$FT_mod= 4
##$GAMMA= 1
##$GB= 0.15
##$INTBC= 1
##$INTSCL= 1
##$ISEN= 128
##$LB= 0.24
##$LEV0= 0
##$LPBIN= 0
##$MAXI= 10000
##$MC2= 0
##$MEAN= 0
##$ME_mod= 0
##$MI= 1.114404
##$NCOEF= 0
##$NC_proc= 0
##$NLEV= 6
##$NOISF1= 3.799351
##$NOISF2= 2.8
##$NSP= 1
##$NTH_PI= 0
##$NZP= 0
##$OFFSET= 15.70392
##$PC= 1
##$PHC0= -10694.68
##$PHC1= 16.40088
##$PH_mod= 1
##$PKNL= yes
##$PPARMOD= 0
##$PSCAL= 0
##$PSIGN= 0
##$REVERSE= no
##$SF= 200.130013532006
##$SI= 16384
##$SIGF1= 3
##$SIGF2= 2
##$SINO= 400
##$SIOLD= 16384
##$SREGLST= <1H.CDCl3>
##$SSB= 0
##$STSI= 0
##$STSR= 0
##$SW_p= 3612.71676300578
##$SYMM= 0
##$S_DEV= 0
##$TDeff= 0
##$TDoff= 0
##$TI= <>
##$TILT= no
##$TM1= 0
##$TM2= 0
##$TOPLEV= 0
##$USERP1= <user>
##$USERP2= <user>
##$USERP3= <user>
##$USERP4= <user>
##$USERP5= <user>
##$WDW= 1
##$XDIM= 8192
##$YMAX_p= 0
##$YMIN_p= 0
$$ End of Bruker specific parameters
$$ ---------------------------------
##NTUPLES= NMR FID
##VAR_NAME=  TIME,          FID/REAL,        FID/IMAG
##SYMBOL=    X,             R,               I
##VAR_TYPE=  INDEPENDENT,   DEPENDENT,       DEPENDENT
##VAR_FORM=  AFFN,          ASDF,            ASDF
##VAR_DIM=   8192,          8192,            8192
##UNITS=     SECONDS,       ARBITRARY UNITS, ARBITRARY UNITS
##FACTOR=    0.000296,      1,               1
##FIRST=     0,             0,               0
##LAST=      2.424536,      0,               0
##MIN=       0,             -99652,          0
##MAX=       2.424536,      102097,          0
$$ Real data points
##PAGE= N=1
##DATA TABLE= (X++(R..R)), XYDATA
0 0 0 0 0 0 0 0 0 0 0 0 0 0 0 0 0 0 8 -8 8 -8 8 -16 16 -21 24 -30 32 -40 48 -56 64 -72 83 -96 109 -125 141
37 141 -159 180 -200 225 -253 282 -314 349 -389 430 -473 524 -576 638 -701 772 -850 934 -1029
56 -1029 1133 -1250 1380 -1528 1696 -1888 2112 -2377 2692 -3075 3538 -4098 4669 -11874 96528
71 96528 -68655 -14229 18939 -36413 -6406 22079 -61323 453 56409 -99652 72624 -40295
83 -40295 -2967 30352 -36115 1885 18782 -7908 -17638 67031 -80700 46999 10561 -45258
95 -45258 50680 -27183 16061 3924 1372 -38226 63968 -34415 -6823 39499 -52751 56664
107 56664 -32725 -3167 14060 9414 -31350 21413 -1843 -31993 61201 -73116 34556 1779
119 1779 -29481 16221 -6237 -20134 6006 24307 -68954 62298 -36533 -11631 31109 -43428
131 -43428 22078 1707 -6518 -21986 38603 -48377 29977 1335 -40874 54762 -43897 7383
143 7383 206 -3941 -18618 29772 -31449 -13599 40131 -60662 35965 -25554 -4340 8240
155 8240 -12698 -14651 5647 4479 -37264 40459 -48559 24991 -2507 -31959 24632 -15252 -2014
168 -2014 -7429 18052 -39189 36360 -24541 -7724 30931 -40519 30929 -13521 -1684 -5455 22839
181 22839 -25225 15571 9908 -31508 48355 -40618 18489 7542 -4316 -2381 8172 -3238
193 -3238 -7981 27384 -43918 42960 -20260 -7962 17932 -19241 6532 -2819 5705 -24180 34074
206 34074 -36302 12706 6646 -28007 28221 -22272 7983 -9259 8666 -20879 20012 -13793
218 -13793 -10864 28822 -41704 26367 -15407 -118 -1292 3150 -10730 410 10435 -31093 35371
231 35371 -31312 15383 339 -13070 11076 -6887 4005 -10603 24203 -31725 28066 -11937
243 -11937 -8972 21275 -20779 16799 -9829 11790 -15608 19507 -16851 7085 12461 -23501
255 -23501 30695 -23321 13811 -4348 6143 -5709 9023 2649 -14413 26771 -28741 24580
267 24580 -11109 2316 5370 -6143 5116 -8089 14105 -22052 27116 -22108 7191 5286
279 5286 -15969 14555 -12510 11228 -15226 17315 -20006 10729 -2760 -11448 19026 -23268
291 -23268 18110 -15580 7588 -9828 7294 -5550 -5182 14490 -25722 23106 -20208 10149
303 10149 -4878 301 1385 -6553 9931 -17325 21649 -21484 17610 -6780 -2621 9953 -10806
316 -10806 12552 -10986 18435 -17187 17677 -8196 950 11080 -11777 19228 -14165 16995
328 16995 -11271 12088 -4682 4726 8415 -10887 21428 -18443 18076 -9261 9511 -1463
340 -1463 1580 7796 -11712 18113 -17597 18702 -12363 9145 -837 -4975 9283 -12892 15363
353 15363 -16945 17201 -13834 6231 -866 -6747 9600 -12901 15340 -17966 15396 -12676
365 -12676 3605 238 -6221 10257 -15172 15024 -16839 12142 -11610 5221 590 -8515 12070
378 12070 -17042 14356 -14239 10494 -8417 5580 -625 -8346 13923 -17207 16932 -12994
390 -12994 11450 -5287 1138 3101 -4377 11296 -14368 21408 -15330 12092 -2183 -428 7954
403 7954 -4875 12262 -9592 18657 -15162 15973 -2496 1862 11130 -9493 17695 -10453 11829
416 11829 -7104 15288 -7844 4862 9440 -13550 19274 -15422 12764 -5009 5447 -4424
428 -4424 2564 2771 -10534 15609 -19137 17277 -12463 808 2741 -7130 2494 -5548 8607 -17798
442 -17798 17320 -16900 4802 1100 -10813 10919 -11443 6657 -10770 10928 -13870 9963
454 9963 -3912 -6301 13897 -18868 13764 -9108 5852 -5237 6820 -5284 -340 10199 -17330
467 -17330 20244 -15081 10086 -713 -3242 2797 1372 3326 -9734 19378 -18243 15752 -6059
480 -6059 -2722 11490 -8425 7129 -3819 10276 -12244 15498 -10504 7376 7496 -15140 20284
493 20284 -11604 5255 -382 8018 -9040 10156 -28 -8568 19849 -20598 15955 -3017 -364
506 -364 311 2404 -463 -2840 8528 -15269 21366 -17815 4258 5667 -9852 5889 -4941 4330
520 4330 -8783 11767 -18992 13442 -3955 -10598 14322 -14182 6946 -7553 3608 -8406
532 -8406 9814 -11108 928 9739 -21118 16930 -12406 4810 -1604 -990 -2469 4091 -1810 -10168
546 -10168 20058 -21230 14685 -4013 -5925 9277 -5504 540 610 8883 -16380 19801 -12687
559 -12687 2560 10099 -12835 14171 -6096 3498 -2831 9287 -12657 13433 -583 -10615 20405
572 20405 -18225 10900 -775 -588 -2007 8085 -6386 -1972 11674 -19137 19638 -12682 1862
585 1862 3656 -6352 1371 -1249 932 -9291 15681 -21214 10902 -2068 -10794 10660 -10909
598 -10909 3610 -3526 2571 -13639 14091 -12011 -1858 10305 -18776 14931 -10025 -241 104
611 104 4134 -9556 6769 1332 -12785 18965 -18243 11296 -988 -4121 4580 287 -2391 -93
625 -93 11033 -17235 19879 -11195 599 10022 -11140 8005 146 2704 -7188 14440 -14261
638 -14261 10218 1274 -10460 17378 -13277 5844 -1238 2182 -6530 10367 -7253 -1992 12875
651 12875 -20254 15786 -8164 -412 2058 -969 -4221 1509 1574 -12080 17056 -18596 9029 -262
665 -262 -9906 7519 -4988 -543 -2599 7147 -16304 14335 -9845 -3562 10877 -14546 9659
678 9659 -5478 394 -4076 7640 -11463 7125 2877 -13294 17608 -15175 6747 284 -992
691 -992 -1098 5032 -2836 -3594 12560 -16899 17079 -7641 62 6836 -5938 3012 743 3641 -8715
706 -8715 16622 -14536 7857 3622 -9734 12655 -6667 3980 -1982 6252 -9669 11047 -5126
719 -5126 -2572 13136 -15623 12185 -5205 100 -472 4057 -5834 2915 4523 -13519 16031 -13963
733 -13963 6383 657 -5185 2737 -1269 -986 -4764 10495 -16110 13049 -7376 -4533 8186 -10111
747 -10111 4292 -3378 2955 -8902 10141 -11810 3571 3905 -12130 13099 -11004 4210 -2340
760 -2340 1698 -5447 6705 -2597 -5836 12824 -15720 12345 -5087 516 3001 -370 -303 6 6023
775 6023 -10463 15987 -11130 6019 3522 -6732 7785 -2618 3793 -3350 10337 -10868 10202
788 10202 -2370 -3554 10912 -9995 9177 -4017 3461 -4217 7034 -5321 1993 6138 -12427
801 -12427 13765 -10704 4632 -670 -59 -1613 1207 765 -7306 10928 -14152 10236 -5192 -2379
815 -2379 4082 -5775 2238 -3649 5583 -10691 10958 -9635 1350 3867 -9058 8153 -6732
828 -6732 4532 -5587 5820 -7535 4872 -713 -5881 10985 -12098 8774 -4666 2152 -1786
841 -1786 3156 -781 -2213 7611 -11327 12501 -7946 4215 1385 -1690 3288 -2432 4818 -5766
855 -5766 11366 -9848 8615 -675 -3599 7764 -5418 6794 -4337 6990 -6985 7992 -4037
868 -4037 106 6975 -8495 10331 -7578 5438 -3356 3360 -2778 1953 2894 -7864 10693 -10903
882 -10903 7366 -3797 727 174 -2135 1751 -5595 7207 -10579 9171 -6924 779 1666 -5382
896 -5382 4254 -5821 5538 -7869 7395 -7582 2653 613 -5460 6717 -7952 6778 -6444
909 -6444 4693 -4555 3441 -891 -3369 8196 -9884 8895 -6084 4245 -2305 2177 884 -2366
923 -2366 6632 -8605 10634 -7188 6082 -1280 268 3352 -3791 6051 -5244 9145 -8076
936 -8076 7825 -1779 -1053 4961 -4447 7521 -5945 7108 -5684 6593 -2949 134 5038 -5749
950 -5749 7868 -7616 6962 -4947 3781 -2325 646 3515 -7319 7424 -8553 6422 -5613
963 -5613 2709 -1376 -1742 2169 -6394 7158 -9330 7153 -5842 1558 -444 -4024 3086 -5034
977 -5034 5846 -8711 7976 -6774 1463 509 -3661 5367 -6837 6196 -6278 6188 -5640
990 -5640 3573 167 -2924 7042 -7931 8454 -5027 4610 -2738 3891 19 -2257 6727 -8033
1004 -8033 9391 -6185 5368 -1359 1178 1723 -2121 5642 -6334 9201 -7565 6061 -1960
1017 -1960 -1120 3709 -3666 4914 -5112 6682 -7600 6511 -3953 -304 4373 -6484 6596
1030 6596 -5836 4671 -5426 4725 -4198 1365 2140 -7588 8365 -8817 5295 -3997 2297
1043 2297 -1654 -221 80 -4550 6969 -9975 8207 -5927 1353 308 -3565 2526 -3154 4012
1057 4012 -7573 8617 -7952 2903 358 -3818 6020 -5796 4935 -4504 5083 -5761 5423
1070 5423 -1381 -2278 7084 -8739 7778 -4802 3215 -1909 3957 -1697 -370 4684 -7717 10086
1084 10086 -7506 5540 -960 -667 1730 -1000 2556 -4132 8522 -9057 8251 -3518 -1043
1097 -1043 4453 -4714 4457 -3139 4649 -6347 6964 -6303 2358 2894 -7229 8354 -6945 3495
1111 3495 -3082 2664 -4258 3192 -693 -5195 7836 -10300 7031 -4906 517 -194 -1204 -388
1125 -388 -2243 4222 -8563 8981 -8169 2835 915 -4954 3758 -2898 2507 -4677 6587 -8242
1139 -8242 5878 -1846 -3409 7062 -6959 5521 -3368 2927 -3819 5504 -3824 608 5255 -8590
1153 -8590 9420 -6201 3776 -167 1309 -1237 1649 1727 -4931 9424 -9150 7971 -2147 -1245
1167 -1245 3791 -2484 1816 -1207 4971 -7400 8894 -6297 1332 4049 -6235 6166 -3908
1180 -3908 2624 -3328 4356 -6326 4320 -320 -5282 8413 -9298 4942 -2818 422 -1757 2065
1194 2065 -2538 -2001 5083 -9947 8953 -7014 1650 961 -3158 886 -1134 1327 -5388 8107
1208 8107 -9595 5646 -1239 -4310 5525 -4767 2905 -2263 3739 -6195 6726 -4280 14 5625
1222 5625 -8037 7865 -4413 2268 -839 3295 -3044 3089 1999 -5790 9372 -8145 6096
1235 6096 -636 -625 1877 107 90 -1277 5984 -8108 9491 -4901 552 3977 -4700 3627 -1220
1250 -1220 2404 -4223 6698 -7008 3884 733 -5496 7538 -6463 3594 -2054 1597 -3944
1263 -3944 4157 -2943 -1958 5931 -9725 7482 -5140 508 116 -491 -1706 -85 1543 -6703 8341
1278 8341 -8537 4344 -507 -4162 3356 -2735 1199 -2177 5116 -7404 6620 -4031 -1313 5336
1292 5336 -6138 5512 -2787 2005 -2735 4397 -4268 2861 2373 -5723 8771 -6875 3852 -323
1306 -323 589 -296 2330 102 -2239 6796 -8162 8094 -3234 614 2854 -2158 1494 -337 3255
1321 3255 -5104 7932 -6741 3340 1090 -4818 5059 -3716 2681 -2557 3636 -5528 4642 -2430
1335 -2430 -2133 5907 -7815 5576 -3697 585 -1856 1895 -3013 -1 2173 -7132 7612 -7297
1349 -7297 2600 -241 -1648 585 -1176 318 -3527 5629 -7635 6442 -2970 -2058 3673 -4386 3036
1364 3036 -2207 2558 -4229 5535 -4923 1803 2892 -5287 6658 -4705 3137 -1710 2239 -2361
1378 -2361 3412 -34 -3013 7059 -7196 6084 -2455 1102 1267 224 193 -685 3609 -6053 7504
1393 7504 -4993 2672 1214 -2756 3131 -1898 2156 -2897 5406 -5858 4071 -1156 -2492 4723
1407 4723 -4840 3670 -2722 2040 -3242 3178 -2808 -129 3282 -6598 6076 -5366 1883 -1043
1421 -1043 335 -1346 163 875 -4893 5706 -6639 4388 -2307 -938 1671 -2568 1511 -2404
1435 -2404 3623 -5171 5237 -3921 612 2153 -4281 4064 -3189 3145 -3034 3278 -3418 2478 796
1450 796 -3406 5992 -5141 4374 -2484 1843 -1120 1827 329 -1406 4737 -5388 5702 -3213
1464 -3213 2505 524 -315 1447 -898 3041 -3918 5775 -4532 3527 -314 -1833 3164 -2837 3031
1479 3031 -2708 3844 -4239 3553 -2191 -665 3067 -4732 4398 -4180 2284 -3135 1803 -2020 89
1494 89 1753 -4825 4904 -5714 3179 -2226 229 -584 -1076 1197 -3838 3810 -5316 4470 -3147 533
1510 533 651 -2317 2044 -3280 3328 -4167 4152 -3461 1184 917 -2762 3693 -3273 3538 -3095 3255
1526 3255 -2553 1962 582 -2005 4672 -4175 4387 -2890 2722 -1141 1625 345 -1111 3743 -4552
1541 -4552 5297 -3596 2792 -475 139 1048 -1666 2807 -3814 4900 -4184 3496 -1297 -979 2139 -2914
1557 -2914 3036 -3180 3631 -3691 3115 -2159 -496 2061 -3771 3725 -4126 2337 -3221 1818 -1711
1572 -1711 -384 1718 -4143 3995 -4889 2608 -2319 1088 -1266 -497 1323 -3960 3836 -4936 4037
1587 4037 -2553 380 693 -1485 1403 -2462 3357 -4204 4337 -3407 1378 1199 -2179 3150 -2858
1602 -2858 3161 -2674 3650 -2714 2495 107 -1506 4046 -4025 4350 -2576 2414 -1399 2029 -97
1617 -97 -976 3443 -4424 5129 -3502 2844 -568 323 847 -977 2348 -3531 4718 -4359 3169 -1286
1633 -1286 -765 1552 -2271 2254 -2614 2949 -4360 3264 -2636 -649 2046 -3764 3524 -3588 1893
1648 1893 -2736 1998 -2699 852 1186 -3773 4289 -5007 3073 -2165 807 -999 287 -160 -2050
1663 -2050 3670 -5308 4837 -3154 1080 720 -1444 1114 -1271 2371 -3666 4898 -3914 2258 145
1678 145 -2083 3537 -2511 2729 -1998 2544 -3135 3026 -702 -813 3996 -4282 4440 -2514 1768
1693 1768 -955 1880 -937 406 2141 -4351 5569 -4399 2813 -451 -733 673 -764 911 -2330
1708 -2330 4058 -5042 4252 -2389 -724 1953 -3101 2054 -1952 1707 -3518 3437 -3835 1352 968
1723 968 -3938 4094 -4044 2064 -1957 1391 -2269 1797 -848 -2607 4036 -5432 4165 -2696 182
1738 182 123 -154 -377 -927 2298 -4405 5343 -4225 1943 798 -2258 2413 -1135 1613 -1933 3903
1754 3903 -4361 3427 -1069 -1130 4133 -3561 3451 -1399 1634 -1898 2965 -1968 620 2544 -4344
1769 -4344 5261 -3904 2178 -71 470 -408 820 766 -2561 4799 -5438 4465 -1620 -693 1553 -1746
1785 -1746 916 -1343 2642 -4152 4319 -3872 798 1581 -3726 3194 -2415 1488 -2234 2432 -3637
1800 -3637 2116 -604 -2769 4209 -5170 2656 -2009 410 -909 1041 -1296 -810 2643 -5227 5028
1815 5028 -3516 1198 507 -1175 692 -812 1356 -2765 4659 -4827 3634 -728 -1563 3199 -2277
1830 -2277 2282 -1087 2517 -3094 3986 -2355 392 3243 -3954 4397 -2601 1812 -735 1878 -1703
1845 -1703 1697 992 -3118 5248 -4909 3518 -869 -173 724 -194 19 -1381 3371 -4937 4694 -3259
1861 -3259 317 1359 -2852 1973 -1467 1427 -2881 3393 -4270 2087 -172 -2884 3574 -3812 2552
1876 2552 -1868 997 -2347 1994 -1695 -948 3376 -5222 4266 -3416 1246 -180 -74 -615 -324 1106
1892 1106 -3622 4999 -4547 3160 -302 -1034 1660 -1445 1205 -1527 3330 -3766 4304 -1907 -171
1907 -171 2690 -3075 3609 -1844 1871 -1754 2889 -2252 1629 1616 -2842 4925 -3934 2940 -941 762
1923 762 -593 1154 86 -1656 3689 -4642 4448 -2414 702 753 -1201 481 -1213 1855 -3197 4219
1939 4219 -4066 1768 73 -2491 2599 -2738 1917 -2127 2405 -3413 2335 -1498 -1136 3202 -4305
1954 -4305 3329 -2805 1069 -1549 1422 -1495 -48 1815 -3919 4625 -4077 2237 -310 -6 518
1969 518 -338 922 -2005 3743 -4206 3970 -1658 -156 1919 -2231 2498 -1494 2114 -2735 3691
1984 3691 -2512 1354 1126 -2653 4036 -2764 2626 -1495 1808 -1493 1452 384 -1321 3996 -4144
1999 -4144 3608 -1895 1129 -106 244 420 -1146 2536 -3881 4030 -3318 1634 -155 -1498 1145
2014 1145 -1690 1699 -2852 3359 -3635 2386 -1185 -1603 2517 -3175 2290 -2509 1791 -2650 1862
2029 1862 -1448 -452 1944 -3841 3751 -3669 1767 -1348 950 -724 45 927 -2880 3705 -4115 2896
2045 2896 -1705 664 818 -1079 1492 -1850 2934 -3252 3734 -2274 892 1191 -1638 2635 -2025
2060 -2025 2757 -2307 3157 -2316 1586 597 -1693 3195 -2834 3179 -1886 2014 -1394 1214 62
2075 62 -1177 3048 -3291 3514 -2870 1540 -840 -219 217 -1247 1838 -3559 3346 -3245 1986 -922
2091 -922 -961 1340 -2292 1548 -2518 2612 -3354 2032 -1593 -489 1616 -2846 2465 -2505 2141 -2367
2107 -2367 1616 -1412 -76 1429 -2784 2887 -3467 2374 -1775 1075 -524 41 1199 -2347 3157
2122 3157 -3304 3312 -1762 843 410 -525 1383 -1772 2844 -2698 3333 -1883 1198 459 -1350 2303
2138 2303 -1832 2766 -2009 2782 -1889 1552 340 -1433 3013 -2824 2692 -2053 2001 -1501 1171
2153 1171 105 -931 2183 -3091 3134 -2877 1605 -703 -47 175 -1008 1745 -2915 3324 -3013
2168 -3013 2288 -1147 -684 922 -1939 1425 -2545 2519 -3182 1942 -1359 -300 1305 -2509 2378
2183 2378 -2370 1846 -2355 1708 -1447 -45 1045 -2692 2832 -3062 2374 -1575 1264 -833 382
2198 382 735 -2104 3151 -3466 2995 -1708 851 680 -500 1304 -1444 2652 -2737 3243 -2107 1313
2214 1313 734 -1365 2298 -1598 2469 -2036 2619 -2174 1839 75 -1089 2637 -2655 2751 -2101
2229 -2101 1534 -1251 1278 -455 -461 2054 -3311 3283 -2802 1652 -839 -24 -20 -1018 847 -2465 3063
2246 3063 -3579 2547 -1190 -785 631 -1795 1141 -1987 2034 -3235 2210 -1949 -138 1063 -2595
2261 -2595 2201 -2295 1549 -1995 1820 -1812 681 610 -2243 2973 -3293 2548 -1287 809 -278
2276 -278 555 357 -1176 2786 -3061 3297 -1923 1088 689 -434 1292 -1078 2081 -2218 3321 -2447
2292 -2447 1871 -155 -1208 2470 -1751 2284 -1541 1950 -2018 1970 -866 -699 2699 -2988 2884
2307 2884 -2197 1148 -1067 970 -698 -116 1133 -2757 3184 -3379 1839 -997 -208 475 -818 436
2323 436 -1756 2522 -3144 2658 -1599 -719 974 -1953 1480 -1795 1336 -2164 2118 -2433 699
2338 699 834 -2562 2934 -2858 1532 -1398 905 -1171 1148 -106 -1430 2865 -3141 3118 -1661
2353 -1661 838 441 -104 250 -548 1668 -2635 3703 -2456 1735 220 -1042 1501 -1015 1714 -1446
2369 -1446 2570 -2357 1971 -779 -700 2023 -2381 2243 -1487 1487 -1570 1925 -1182 355 1651
2384 1651 -2870 3137 -2525 1428 -808 141 -346 224 351 -2098 2794 -3761 2373 -1398 -115 711
2400 711 -1277 619 -1493 1626 -2631 2684 -2444 569 590 -2213 1850 -1989 1365 -1481 1712 -2011
2416 -2011 1288 -244 -1326 2710 -2936 2428 -1638 1005 -641 947 -126 -321 1930 -2982 3293
2431 3293 -1902 1320 266 -150 988 -250 1431 -1848 2950 -2425 2491 -314 -363 1918 -1589 1507
2447 1507 -891 1806 -1685 2099 -1332 571 1776 -2403 3004 -1857 1110 -904 1019 -1122 553
2462 553 443 -2007 2667 -3188 2044 -1091 194 151 -273 119 -1086 1770 -3008 2754 -2074 388
2478 388 268 -1660 1164 -1154 1262 -1820 2021 -2485 1259 -317 -1658 1956 -2301 1383 -1391
2493 -1391 1140 -1579 1194 -585 -543 1787 -2936 2559 -1948 1126 -317 785 -258 -303 1373 -2111
2509 -2111 2983 -2318 2094 -365 -274 944 -673 992 -949 2424 -2250 2437 -1226 -46 1268
2524 1268 -1642 1996 -1105 1485 -1040 1773 -1564 815 749 -1909 2492 -2300 1717 -1362 630
2539 630 -664 517 199 -1212 2126 -3054 2258 -1769 417 -44 -958 305 -1022 1018 -2132 2514
2555 2514 -2438 881 -258 -1594 1327 -1802 1289 -1392 1527 -2128 1651 -696 -863 1719 -2102
2570 -2102 1929 -1527 918 -945 1057 -473 102 1170 -2028 2662 -2389 1694 -428 304 331 -78
2586 -78 998 -1287 2546 -2323 2561 -653 144 977 -661 983 -1040 1898 -1661 2183 -1299 690
2602 690 879 -1384 2168 -1688 1517 -1331 1285 -1241 854 37 -1271 1986 -2730 1691 -1549 454
2618 454 -621 159 49 -934 1229 -2436 2059 -2102 932 -219 -363 439 -1204 916 -1781 1951
2634 1951 -1991 1520 -887 -533 993 -1447 1481 -1435 1338 -1789 1269 -1084 -94 1393 -2078
2649 -2078 1947 -1603 1529 -911 779 -638 43 755 -1268 2564 -2227 1946 -772 653 352 115
2665 115 781 -1000 2121 -1991 2461 -1071 693 600 -850 1183 -1289 1416 -1785 1856 -1543 967
2681 967 236 -928 1813 -1741 1558 -1514 1159 -1327 620 -204 -792 1535 -2261 1922 -1784 986
2697 986 -886 146 -138 -906 1111 -1904 2018 -2135 1317 -574 -544 433 -1394 854 -1572 1669
2713 1669 -2219 1536 -1004 -127 805 -1524 1423 -1487 1406 -1412 1349 -1072 606 893 -1462 2373
2729 2373 -2098 1330 -950 1149 -313 635 645 -1094 2017 -2171 2370 -1133 958 311 -123 871
2745 871 -983 1892 -1973 2294 -1252 1023 331 -623 1237 -1182 1332 -1591 1727 -1619 1059 136
2761 136 -615 1119 -1651 1574 -1518 1231 -1366 808 -250 -558 1035 -2154 1887 -1965 972 -783
2777 -783 421 -296 -718 880 -1701 1951 -2393 1184 -1104 -197 402 -1023 807 -1579 1859 -1815
2793 -1815 1269 -1292 139 979 -1163 1661 -1418 1222 -1346 1560 -1056 669 721 -1296 2075 -1602
2809 -1602 1643 -1219 966 -440 456 604 -905 1837 -2084 2221 -1188 736 -174 -129 576 -929
2825 -929 1392 -1576 2258 -1630 1027 1 -673 1050 -1325 1244 -1340 1641 -1545 1109 -477
2840 -477 -585 1410 -1958 1662 -1551 1010 -1390 732 -1043 -68 1054 -2076 1722 -2109 1261 -606
2856 -606 283 -234 -630 419 -1725 2191 -2251 1630 -1080 -31 370 -1030 768 -848 1788 -1902
2872 -1902 1661 -1609 562 596 -1181 1657 -1364 1289 -1302 1285 -978 1030 512 -854 1962 -1850
2888 -1850 1842 -1165 1175 -353 597 45 -371 1674 -1628 2327 -1508 1073 12 -339 551 -430
2904 -430 827 -1360 1886 -1980 1447 -573 -442 950 -1096 1358 -1234 1242 -1427 1356 -996
2919 -996 -126 982 -1580 1645 -1756 1390 -1264 913 -1007 147 583 -1560 1656 -2306 1353 -1178
2935 -1178 244 -313 -603 422 -936 1542 -2016 1818 -1317 371 463 -767 1208 -1072 1219 -1308
2951 -1308 1702 -1639 955 182 -873 1724 -1493 1430 -836 1278 -1056 1103 -166 -377 1685
2966 1685 -1723 2236 -1322 724 -274 583 116 -58 928 -1547 2395 -1901 1407 -524 -118 616 -618
2983 -618 872 -861 1633 -1791 1651 -1158 -210 1008 -1543 1386 -1308 1045 -1475 1169 -1103
2998 -1103 247 451 -1369 1540 -2070 1020 -1124 562 -582 220 -42 -1223 1509 -2302 1751 -1363
3014 -1363 295 342 -693 265 -570 1169 -1648 2060 -1867 853 -225 -822 1072 -1033 1174 -1144
3030 -1144 1346 -1299 1139 -282 -345 1621 -1455 1786 -1244 993 -780 1044 -194 44 1054 -1719
3046 -1719 1869 -1733 1401 -499 267 38 -186 657 -1408 2015 -2276 1651 -808 -137 522 -874
3062 -874 840 -1046 1126 -1533 1551 -1540 335 351 -1202 1859 -1289 1156 -1252 839 -1098 439
3078 439 -200 -1025 1678 -2260 1585 -1448 388 -325 58 27 -896 1148 -2031 1696 -1453 868 -196
3095 -196 -376 762 -1040 1073 -1280 1433 -1649 1532 -320 -543 1179 -1347 1469 -933 1042 -773
3111 -773 1276 -451 226 1073 -1449 1858 -1360 1181 -614 770 1 260 737 -1005 2022 -1796
3127 -1796 1640 -847 116 439 -372 421 -818 1431 -1583 1733 -1050 430 485 -1031 902 -825
3143 -825 1303 -1077 1182 -1542 906 -109 -1035 1577 -1760 1591 -1064 609 -671 423 -157 -738
3159 -738 1037 -1814 1593 -1424 722 -156 -311 151 -460 786 -1273 1797 -1662 1195 -472 -419 764
3176 764 -726 944 -781 1416 -1436 1497 -751 19 952 -1120 1572 -1230 1307 -930 942 -704
3192 -704 240 641 -1120 1763 -1543 1575 -622 748 -181 194 326 -883 1597 -1642 1714 -936
3208 -936 464 83 -513 560 -636 1376 -1233 1518 -1413 527 -141 -1188 957 -1200 1178 -1285
3224 -1285 883 -1400 515 -287 -735 1146 -1711 1285 -1402 1025 -946 664 -418 -338 620 -1627
3240 -1627 1747 -1463 861 -551 33 208 -314 677 -1389 1625 -1621 1171 -627 -27 594 -790
3256 -790 982 -770 1108 -992 1292 -909 516 487 -1097 1543 -1108 1342 -860 864 -538 291
3272 291 586 -887 1331 -1390 1223 -949 676 -150 295 25 -803 1198 -1549 1470 -1133 585
3288 585 -329 -282 582 -731 899 -1177 1585 -1166 545 -319 -433 746 -1117 1175 -1260 897 -1215
3305 -1215 711 -117 -498 634 -1306 1371 -1396 786 -720 600 -372 -305 443 -1359 1583 -1315
3321 -1315 1170 -612 9 -114 -441 592 -573 1212 -1344 1381 -742 401 372 -511 1008 -704
3337 -704 1330 -843 1001 -936 593 581 -840 971 -1013 1170 -742 868 -547 364 254 -490
3353 -490 1240 -1538 1593 -954 725 -302 152 103 -652 922 -1279 1593 -1255 804 -410 -50
3369 -50 192 -679 814 -1230 765 -1405 810 -513 -374 787 -999 1075 -1059 697 -1132 674
3385 674 -481 -170 416 -1082 878 -1368 761 -677 485 -120 -204 238 -840 1247 -1413 1258 -871
3402 -871 300 83 -347 365 -713 1589 -1150 1488 -910 579 454 -477 984 -646 1131 -933
3418 -933 1376 -734 811 239 -372 1272 -936 1082 -886 733 -761 708 -138 -506 888 -1414
3434 -1414 1323 -863 678 -346 131 71 -428 536 -1277 1368 -1275 868 -328 -177 383 -802 557
3451 557 -983 1158 -1377 1053 -930 -150 400 -815 1022 -1075 932 -1099 785 -386 48 239
3467 239 -1070 1054 -1055 1004 -650 419 28 144 325 -526 956 -1440 1490 -725 295 84
3483 84 -160 331 -476 1009 -1021 1075 -1040 748 231 -505 1092 -704 873 -743 1077 -688 846
3500 846 103 -320 1013 -933 1152 -812 928 -337 378 -380 70 830 -1177 1264 -1214 962 -609
3517 -609 158 -112 -460 403 -895 1107 -1096 1087 -850 -133 288 -701 737 -814 705 -1318 963
3534 963 -786 -23 329 -818 1077 -1105 628 -956 386 -515 496 50 -385 1076 -1363 1192
3550 1192 -633 343 -151 124 -23 -203 756 -1128 1368 -1002 539 131 -26 437 -441 650 -513
3567 -513 1151 -1169 1022 -390 -234 769 -725 933 -963 740 -922 791 -425 227 554 -1060
3583 -1060 1172 -1171 813 -540 238 -98 52 86 -646 1336 -1404 946 -785 -207 205 -377 368
3600 368 -602 876 -1318 1099 -863 359 59 -682 791 -659 350 -867 813 -742 397 27
3616 27 -317 1151 -824 817 -570 779 -317 564 78 -406 918 -1081 1297 -817 546 -35 78
3633 78 189 -254 391 -718 1279 -1096 795 -191 -404 806 -283 1014 -556 721 -729 1091 -407
3650 -407 55 571 -814 896 -674 788 -549 495 -362 -15 348 -678 1190 -1307 894 -400
3666 -400 116 -148 130 -33 -749 992 -1459 912 -751 383 66 -473 135 -639 453 -667 1041
3683 1041 -835 266 -1 -506 633 -1143 718 -679 601 -628 500 -229 -123 894 -1007 1076
3699 1076 -894 483 -479 547 -159 -158 586 -1304 1230 -1039 851 -136 64 321 -234 345 -533 1151
3717 1151 -787 976 -602 215 448 -524 561 -648 1079 -918 764 -461 520 318 -862 1056
3733 1056 -780 685 -743 350 -559 267 -259 -655 1188 -1362 1022 -751 258 -271 -198 4 -543
3750 -543 750 -1107 1073 -1053 417 -274 -193 285 -696 515 -842 724 -1113 815 -314 -341 628
3767 628 -999 781 -782 489 -752 607 -324 -200 511 -968 1052 -918 877 -268 113 -65
3783 -65 -32 435 -595 1384 -854 1114 -532 421 185 -345 440 -441 1086 -715 958 -675 409
3800 409 237 -510 654 -471 682 -750 867 -664 309 114 -489 690 -743 905 -828 436
3816 436 -460 51 8 -547 441 -1204 851 -741 476 -409 -275 6 -377 523 -760 1020 -1137 592
3834 592 -371 -189 535 -757 717 -898 685 -896 406 -492 -264 381 -637 811 -901 794 -578
3851 -578 353 -384 -78 469 -681 987 -826 783 -397 376 -91 6 276 -656 830 -920 1142 -873
3869 -873 175 170 -231 610 -759 914 -1063 943 -869 307 -70 -335 881 -588 674 -644 524
3886 524 -855 522 52 -199 660 -926 1010 -690 331 -151 161 64 -123 355 -1180 893 -1000
3903 -1000 453 -248 18 -34 -751 381 -929 800 -1082 562 -407 -131 291 -538 446 -918 732
3920 732 -681 672 -627 -43 391 -649 887 -875 716 -472 429 -534 168 476 -620 931 -915
3937 -915 878 -715 442 -198 106 385 -283 1051 -865 978 -495 375 86 -106 500 -609 781
3954 781 -800 737 -603 686 -164 -455 818 -790 825 -787 467 -839 518 -189 -279 501 -906
3971 -906 758 -929 600 -443 299 29 -123 334 -864 856 -1061 590 -349 -83 -165 -479 187 -561
3989 -561 896 -897 595 -693 -32 198 -622 551 -546 632 -752 741 -440 250 391 -630
4005 -630 651 -699 697 -619 620 -592 463 329 -260 694 -831 1210 -535 499 -24 -74 185
4022 185 -361 597 -422 860 -774 760 -139 -198 295 -470 502 -550 714 -438 590 -27 -328 529
4040 529 -652 519 -694 512 -650 468 -292 -149 283 -827 969 -747 555 -399 171 -57 -71
4057 -71 446 -751 721 -1023 631 -496 -93 291 -452 305 -520 675 -876 523 -761 57 133 -565
4075 -565 602 -482 694 -660 586 -428 457 200 -414 801 -697 623 -701 381 -309 165
4091 165 178 -168 532 -884 1129 -693 560 212 30 273 -244 641 -868 1023 -1036 482 -146 23
4109 23 423 -212 613 -620 567 -713 501 -377 -155 439 -657 538 -846 321 -447 369 -430 5
4127 5 194 -775 743 -938 720 -602 144 -54 -189 272 -488 554 -960 943 -581 310 -6 -391
4145 -391 442 -502 613 -698 627 -808 345 96 -308 386 -677 588 -519 500 -718 593
4161 593 39 -388 870 -670 676 -687 778 -251 424 42 -227 439 -872 941 -827 402 -304
4178 -304 -78 422 -296 554 -600 787 -914 739 -306 -51 198 -632 427 -684 422 -618 859
4195 859 -368 287 383 -569 662 -630 462 -650 287 -208 -81 293 -577 785 -924 876 -444
4212 -444 194 -45 -364 5 -455 586 -767 670 -535 354 36 -341 397 -539 443 -508 790 -572
4230 -572 281 -205 -218 492 -632 795 -687 540 -472 236 -151 -160 453 -983 647 -749 711 -93
4248 -93 197 111 -41 589 -599 776 -780 783 -192 -146 242 -367 562 -406 629 -698 760 -289
4266 -289 220 285 -590 346 -556 374 -634 700 -502 160 18 -235 444 -1009 659 -297 327 -498 31
4285 31 131 -397 558 -1102 848 -638 624 -113 -362 268 -455 613 -644 810 -1033 551 -214
4302 -214 -60 481 -412 588 -635 585 -615 575 -430 -111 565 -1064 865 -846 753 -183 367
4319 367 -204 38 383 -563 1016 -733 455 -225 235 195 -96 443 -424 880 -649 596 -468 123
4337 123 278 -274 248 -595 594 -720 431 -708 131 24 -322 231 -799 487 -506 367 -398 158
4355 158 -42 -447 519 -618 617 -463 378 -171 77 42 -154 498 -851 640 -523 542 -300 119
4373 119 97 -259 316 -503 708 -831 720 -85 -244 667 -489 527 -851 517 -286 577 -193 204
4391 204 394 -629 832 -607 584 -541 154 147 15 239 -582 752 -517 663 -375 112 11 -361
4409 -361 404 -213 730 -566 665 -529 440 54 -233 253 -479 450 -463 439 -760 232 -74 -21 248
4428 248 -634 470 -718 277 -286 62 -146 -394 218 -704 599 -600 373 -308 -211 -143 -197 238 -491 824
4448 824 -799 759 -370 34 213 -384 475 -562 640 -662 493 -345 -12 210 -375 702 -495
4465 -495 491 -110 441 -298 0 143 -495 603 -576 596 -473 268 -174 82 -193 -410 540 -969
4483 -969 498 -553 406 46 -27 337 -264 589 -558 578 -517 495 -104 68 278 -495 458 -468
4501 -468 344 -586 175 -203 -503 444 -607 614 -637 184 -427 -13 -57 -103 120 -891 739 -925 346
4520 346 -277 166 -156 -175 179 -542 471 -833 531 -151 156 235 -181 442 -445 588 -418 485 -527
4539 -527 160 -50 -355 607 -258 655 -478 439 -167 467 73 -331 568 -554 719 -425 191 -187 298
4558 298 276 -509 481 -722 1063 -490 428 61 67 -79 -141 303 -657 526 -537 373 -8 -67 253 -503
4578 -503 366 -587 340 -486 598 16 -149 399 -513 628 -537 351 -317 281 -83 18 311 -763 417
4597 417 -729 361 -479 208 -69 18 170 -224 669 -411 782 -375 273 205 -451 453 -189 319 -513
4616 -513 643 -484 279 48 -284 625 -443 605 -292 351 -9 420 281 -25 613 -704 543 -439
4634 -439 367 -372 -30 133 -138 574 -443 671 -576 408 -305 33 397 -325 381 -353 524 -691 209
4653 209 -359 -174 238 -552 496 -377 261 -371 339 -146 -147 383 -709 444 -658 374 -279 223 -172
4672 -172 -181 312 -454 664 -705 474 -366 213 -98 -308 -38 -162 426 -367 549 -626 126 193 -50 221
4692 221 -522 591 -410 304 -481 474 39 23 761 -513 526 -417 494 -83 459 -61 -356 430 -508
4711 -508 623 -194 384 -183 -38 -66 -243 277 -600 322 -443 419 -290 -228 6 -359 273 -553 348 -586
4731 -586 520 -51 57 160 -371 88 -527 347 -417 231 -325 67 -15 -530 399 -536 485 -70 294 -79
4751 -79 22 338 -482 615 -564 380 -502 241 111 -212 267 -248 736 -518 511 -343 270 274 -117 429
4771 429 -476 440 -60 270 -496 393 10 251 390 -543 576 -538 342 -211 279 -112 81 200 -649
4790 -649 751 -616 524 -221 105 89 -171 20 -314 504 -660 337 -460 78 453 -188 105 -571 365
4809 365 -566 177 -438 -55 -155 -291 269 -283 333 -254 267 -203 184 -104 -408 269 -548 498 -451 559
4829 559 91 -13 -144 -218 227 -578 625 -572 465 70 -59 370 -350 416 -550 684 -606 436
4847 436 -340 134 549 -403 453 -158 381 -333 496 -109 78 219 -476 528 -543 296 -284 10 -131
4866 -131 85 -10 -455 413 -656 530 -165 189 -35 -434 267 -514 499 -450 322 -480 -29 -25 -221 511
4886 511 -513 153 -363 127 -328 259 -12 110 261 -391 365 -440 190 -173 357 -140 -167 211 -593 508
4906 508 -548 362 -26 -157 13 -210 411 -289 604 -352 437 -80 -39 303 -310 236 -236 542 -348 484
4926 484 -529 25 351 -432 338 -466 396 -283 198 -182 258 320 -582 261 -501 577 -413 144 -91 -132
4946 -132 130 35 447 -278 580 -169 138 -150 -256 28 -346 366 -431 435 -469 208 -169 -221 457 -404 214
4967 214 -103 267 -372 258 -145 19 461 -601 576 -387 364 6 472 138 -46 149 -586 645 -642
4986 -642 308 -228 215 9 -306 304 -277 386 -553 314 -467 154 285 -333 366 -351 651 -555 427
5005 427 -147 376 240 -175 568 -253 395 -381 158 -545 -59 -155 -214 336 -506 608 -396 360 -70 156
5025 156 140 -89 401 -679 420 -405 380 -389 -36 357 -325 98 -606 253 -368 60 -121 -271 513 -394
5045 -394 522 -441 600 -222 89 -220 80 316 -654 526 -588 519 -329 235 111 118 445 -55 707
5064 707 -331 438 -337 70 79 -141 143 -371 328 -484 260 -461 195 208 -246 413 -324 254 -507 228 -319
5085 -319 243 13 -234 312 -477 473 -256 442 -325 193 -44 -126 194 -601 645 -514 286 100 -71 30
5105 30 -483 107 -571 571 -361 404 -43 -127 286 -203 220 -411 218 -502 236 -356 360 211 -356 494
5125 494 -460 460 -456 205 -19 55 183 -324 655 -550 699 -159 292 -225 -173 272 -233 342 -521 707
5145 707 -395 164 -24 51 180 -190 521 -198 449 -448 193 16 -139 357 -321 429 -352 284 -262 341
5165 341 -150 -306 273 -432 310 -417 292 -234 84 -53 -41 355 -308 546 -545 445 -312 199 161 -317
5185 -317 179 -534 370 -912 332 -383 40 74 -596 188 -166 560 -261 456 -262 133 9 64 399 -526
5205 -526 433 -164 321 -66 53 -71 -4 369 -537 439 -198 275 -294 -141 50 -324 383 -26 538 -473
5225 -473 457 60 -155 219 -196 419 -613 421 -164 304 141 -52 417 -380 495 -478 432 -367 336
5244 336 -53 -323 186 -314 642 -766 339 -134 323 -115 -103 472 -384 287 -563 412 -205 96 75 -37
5264 -37 386 -408 317 -497 230 -484 189 81 -340 129 -265 577 -474 302 -438 61 -40 -340 451 -426
5284 -426 515 -415 317 -211 115 8 -6 592 -571 531 -256 311 -169 69 184 -423 336 -311 639 -503
5304 -503 257 -92 26 100 -356 428 -543 431 -352 250 -106 -174 282 -319 200 -214 252 -140 512 -195 -135
5325 -135 291 -385 413 -641 256 -382 189 -225 -114 243 -501 293 -678 519 -544 123 28 -186 213
5344 213 -274 350 -275 260 -156 25 -66 -245 315 -302 376 -113 204 -180 155 -42 -260 437 -490 490
5364 490 70 294 82 302 354 -207 106 -365 533 -467 301 -88 80 73 -380 524 -415 317 -368 298 -93
5385 -93 128 140 -72 239 -446 412 -301 385 -112 -23 71 -360 235 -267 315 -109 301 -406 -36 15 -389 460
5407 460 -411 404 -401 100 -80 -248 42 -285 312 -331 344 -159 174 -221 -153 312 -426 133 -383 333
5427 333 -475 270 -210 -301 221 -474 647 -288 344 -376 215 114 -205 405 -568 572 -385 423 -243 115
5447 115 2 28 191 -305 363 -393 221 -205 44 139 -50 439 -611 365 -547 305 -97 -11 343 -586 261
5468 261 -426 310 -203 347 -133 103 -155 -322 282 -600 218 -156 11 -72 68 -36 -193 437 -529 294
5488 294 -117 -91 -58 -274 -94 -274 217 -353 607 -277 126 -46 -181 245 -317 229 -333 337 -160 212 5
5509 5 -136 246 -405 429 -104 212 -126 -89 -123 -197 502 -376 468 -286 364 -21 212 79 -211 347 -421 246
5531 246 -231 432 -142 275 173 -142 407 -372 161 -586 309 -496 145 160 -274 299 -533 315 -341 74
5551 74 23 116 -39 -125 313 -461 314 -180 144 -23 -49 71 -252 443 -424 456 -341 19 -112 -106 226 -262
5573 -262 278 -188 335 -379 243 69 114 69 -226 375 -388 465 -230 270 -115 -114 126 -426 254 -558 369
5594 369 -257 167 -75 -388 -66 -222 197 -173 510 -317 250 -103 -42 128 84 447 -737 565 44 -19
5614 -19 41 -232 267 -293 244 -443 269 -327 139 180 -233 104 -355 416 -252 229 -232 -140 -63 -8 277 -663
5636 -663 264 -525 -10 143 -137 50 -125 214 -315 310 -448 311 -121 123 57 -144 -31 -329 202 -290
5656 -290 210 -171 16 26 -105 381 -267 370 -144 168 -266 233 135 -312 358 -443 311 -79 273 24 -8
5677 -8 153 -169 193 -325 611 -82 233 -27 91 28 -1 284 -360 328 -322 13 74 -197 275 -204 237 -142
5699 -142 45 -187 19 -150 29 181 -328 337 -413 289 -263 143 27 -188 419 -293 535 -518 257 38
5719 38 6 246 -196 95 -154 302 -470 310 -251 -89 143 -7 68 -255 61 -195 372 -57 180 240 -154
5740 -154 409 -307 539 -273 358 -120 93 -17 -313 223 -411 222 -135 128 -438 18 158 -171 279 -292
5760 -292 372 -148 385 -206 41 370 -118 247 -280 392 -340 414 54 -293 139 -243 546 -290 302 4
5780 4 140 -225 -58 136 -328 186 -273 -82 -280 42 -128 -50 102 -332 648 -150 270 -330 118 254 -102
5801 -102 -21 -290 338 -478 254 -283 -117 -19 -82 194 -304 224 -431 211 -377 -102 -115 -209 148 -166 193 -193
5823 -193 341 -291 237 -91 -149 222 -266 221 -374 287 -267 41 105 -98 233 -475 466 -384 505 -17 11
5844 11 171 -62 242 -251 531 -292 289 -415 -121 455 -31 385 -364 144 -435 345 -334 -208 -4 -293
5864 -293 416 -410 399 -29 29 -226 46 196 -264 247 -628 614 9 230 -122 -219 209 -172 278 -380
5884 -380 311 -244 209 15 -204 174 -348 286 -140 167 -347 280 183 -2 112 -309 259 -410 76 -58
5904 -58 148 -90 -223 187 -368 347 -136 350 -58 250 118 -147 228 -533 542 -306 212 -49 -74 109
5924 109 31 111 -397 151 -383 375 -311 300 100 -247 430 -317 51 -347 369 -269 162 -169 -28 397 -585
5945 -585 406 -176 19 -63 -22 23 -252 317 -107 -47 -400 348 77 -87 370 -82 347 27 253 -250 82
5966 82 6 -39 62 -135 467 -248 189 -79 122 -44 -300 306 -216 150 -535 91 -307 169 -79 94 242
5987 242 -193 561 -245 97 -218 19 121 -50 278 -354 438 -308 -70 -91 86 216 0 216 -410 284
6007 284 -290 212 -166 15 -2 -475 339 -165 278 -123 -85 -394 -17 -66 -52 239 -238 196 -389 365 -262
6028 -262 -112 48 -115 168 65 453 -161 398 27 -241 155 36 286 -481 76 -104 269 -20 -44 223
6048 223 -130 12 66 296 -262 201 144 -209 133 -159 320 -352 152 -190 -123 -56 -186 210 -298 590 -153
6069 -153 492 -115 -21 121 -374 5 -232 7 -362 183 -307 -57 216 6 142 -251 292 -304 215 -182
6089 -182 231 -96 -127 285 -401 178 -128 -98 -1 92 -9 -93 362 -196 358 -125 148 -175 -133 8 -366 275
6111 275 -431 238 -441 281 -268 -180 164 -236 165 -269 524 -175 51 102 161 314 -299 350 -379 95 -149
6132 -149 229 77 -18 73 -104 381 -324 339 -286 44 -198 200 59 -350 275 -133 440 -473 45 176 179
6153 179 339 -312 239 -258 142 -247 148 -216 -193 136 -319 272 -326 168 -95 31 125 -74 109 -149 338
6174 338 7 299 -625 194 -15 69 96 -95 263 -332 154 -177 -91 73 134 41 -148 217 -387 475 54 99
6196 99 158 -99 12 -94 362 -151 204 20 -146 -64 -69 353 -434 182 -450 -62 11 28 81 -161 349 -271 309
6219 309 -258 242 -395 -50 -80 -165 116 -441 219 -151 229 -40 -72 118 -28 179 -141 479 -293 99 -46
6240 -46 -212 130 -35 226 -154 285 -411 255 -88 -140 68 -260 150 -383 208 -161 233 -112 -34 247 -269
6261 -269 500 -269 343 8 81 -3 9 88 -240 62 -290 530 -156 -18 250 -114 -163 -110 195 -110 211 -107
6283 -107 17 -29 -537 236 -374 427 -397 226 103 66 68 -269 176 -289 425 -255 -111 14 -58 -58 -151 337 -319
6306 -319 218 -228 -67 -118 -136 311 -146 9 -508 343 -443 99 -122 46 37 -93 68 -328 299 -192 283
6327 283 -36 43 180 -79 93 -121 196 28 87 -64 -117 283 -167 253 -331 262 -255 -119 34 117 163 -262
6349 -262 230 -129 62 73 177 -55 -159 301 -202 222 -89 425 -58 85 71 -175 111 -248 246 -106 52
6370 52 -76 4 -38 -229 134 -217 331 -354 110 -170 20 27 -198 256 -243 288 -344 173 193 -44 11 -252
6392 -252 435 -237 465 -414 -8 120 -183 101 -108 34 -85 159 -23 506 -82 -70 -29 -81 201 -257 571
6413 571 -78 216 -153 -35 187 -323 316 -255 269 -343 60 -95 -173 42 -212 115 -240 194 -381 207
6433 207 -11 89 255 -79 230 92 263 -111 229 -46 -1 199 -243 359 146 43 -311 37 -231 -13
6453 -13 157 -100 136 -222 529 -52 224 222 -188 207 -195 87 -318 -201 -165 -17 -131 -142 174 -201 199 -67
6475 -67 341 -248 47 -2 -125 163 -198 264 -294 196 103 41 128 -64 292 -204 144 -16 -140 -119 -219 -74
6497 -74 -305 54 -193 210 -140 238 80 -236 221 -245 284 -238 200 -158 31 -140 -12 198 -209 31
6517 31 -435 37 -266 128 274 50 157 -241 395 33 293 -224 -27 -200 66 45 -128 54 -154 -92 -356
6538 -356 -65 -25 -157 20 -97 255 -359 241 108 318 135 -157 110 -206 284 -284 280 -93 75 10 1
6559 1 225 -178 381 -429 -209 -41 -168 4 30 187 -179 255 -34 324 -248 -54 172 45 464 -303 14
6580 14 -151 26 -110 -122 193 -231 150 -174 209 -134 -21 -244 52 21 -185 191 -57 235 -226 57 343
6601 343 -124 141 -220 122 -235 147 36 -33 -56 -56 162 -63 23 -424 91 -200 -65 -3 -453 -315 -91 114
6623 114 -169 99 -269 -112 -56 -20 129 -196 322 -128 5 -161 71 58 218 162 45 187 -68 377 49
6644 49 42 109 38 224 -115 397 -45 185 14 56 -82 -195 209 -102 183 -208 89 -166 61 100 -287 -112
6666 -112 9 217 -92 3 -152 63 178 -208 141 -68 156 36 151 -140 57 217 -269 138 -341 70
6686 70 -81 229 -16 -193 120 -403 14 -360 206 19 -121 293 -173 314 22 -68 -52 103 -95 381 165
6707 165 146 180 -239 69 -113 168 -158 276 5 45 43 -221 399 -69 332 -17 -39 331 21 -15 -66 185 -179
6730 -179 205 -90 -48 5 211 109 -46 249 -199 198 -138 173 96 -187 39 -390 71 -87 -77 84 46 70
6752 70 -87 171 -394 298 -229 145 -7 52 -112 -20 137 -255 198 -369 146 -4 -103 27 32 36 -29 4 -261
6775 -261 116 152 -31 -7 -123 -48 -85 339 -14 301 -36 -53 -130 -40 306 -286 365 -12 -8 -141 -216 -15 -66 130
6799 130 -244 93 -12 11 -203 -35 156 -199 278 0 144 -153 -22 117 -114 73 -91 47 -297 348
6819 348 -199 198 157 -31 58 -223 29 -287 25 -147 344 59 -190 120 -347 -3 -5 -222 -53 246 24
6840 24 -278 44 -436 54 14 177 -164 -224 64 -204 -203 -73 488 -327 223 -99 -273 121 -218 149 -361 -19
6862 -19 20 -61 93 -24 60 -109 -29 -473 198 -166 118 86 179 301 78 405 -42 57 -312 155 -83 74 -114
6885 -114 -79 58 -166 158 -132 80 88 -116 284 -237 -90 -257 250 -66 -201 -53 -270 28 -323 149 -231
6906 -231 -44 52 162 -90 161 217 -156 313 -37 110 -273 -175 193 -113 219 -174 165 -215 -73 107 44
6927 44 143 -268 142 -74 -98 -219 264 -161 11 81 -148 208 -62 131 -28 9 -247 -29 -3 -32 -34 -203 261
6950 261 113 134 -33 120 -146 -81 320 -127 13 37 -101 25 -4 296 -222 227 58 129 21 202 18 -399
6972 -399 29 -207 257 -478 -62 132 57 -33 -34 34 -26 85 121 44 -102 116 -80 22 80 -132 286 -341 236
6995 236 -183 82 -91 -36 203 21 78 -164 186 -9 -6 183 62 35 -85 239 -156 118 -148 -127 292 -276
7017 -276 74 125 305 -38 10 -115 245 -82 -61 196 -111 2 -69 96 -192 104 -278 -173 160 -98 64
7038 64 11 249 19 -219 30 -7 136 -90 88 -158 139 -88 81 273 20 350 -222 -92 -126 212 -107
7059 -107 -55 261 14 193 -236 -52 -130 -25 73 -318 -108 -232 7 -282 189 21 -68 78 -249 -214 -46 322
7081 322 -191 -37 1 106 71 -173 125 -328 88 -105 103 -106 -47 -157 10 190 -339 161 150 32 -379
7102 -379 180 -104 -97 163 -177 77 -195 212 -22 147 -141 4 45 -163 242 -302 293 119 143 211 -252 30
7124 30 -172 -97 -21 84 -82 -32 -34 -108 403 -89 128 112 -2 53 -116 19 -114 181 -23 120 -211 24 -269
7147 -269 16 0 29 325 12 146 -268 35 -3 -295 127 281 82 -311 127 -144 -122 101 -111 136 -105
7168 -105 258 -211 83 -323 182 -147 16 223 -290 209 -166 149 -246 292 113 -61 252 -191 14 -244
7188 -244 148 31 127 166 -23 51 142 464 -143 -35 6 -205 11 -107 -109 -301 -11 114 -106 -208 67 166 -119
7211 -119 74 -259 161 -294 161 -155 -150 336 -142 15 -372 225 -85 78 2 -296 137 20 279 -127 305
7232 305 -126 192 -84 3 4 -262 280 -384 252 -273 -10 6 54 98 112 104 -189 153 -206 230 -352 -63 113
7255 113 -285 220 -126 18 -26 -91 59 113 164 -84 -15 -146 292 -92 -281 157 56 73 -111 163 -171 210
7277 210 -155 24 128 -66 236 122 188 -177 176 -119 110 26 -82 -29 -121 -4 -308 334 -169 240 -93
7298 -93 -83 203 -262 76 -152 34 -81 -9 -7 -101 7 17 284 350 162 258 -68 85 -25 73 -13 267 -129 33
7322 33 -183 -200 151 -38 366 -105 423 -77 219 -200 211 28 -217 130 -153 78 -104 21 22 11 50 -227
7344 -227 64 -58 211 64 106 -77 27 -3 59 258 -147 -148 174 -21 -227 -119 1 -21 148 -302 127 -219
7366 -219 -77 162 -185 106 -284 -39 -267 -202 -114 -53 -61 -61 -103 -220 361 -215 161 -108 73 96 -39 248 -19
7389 -19 214 58 213 -80 172 -166 -30 198 -152 266 -65 169 70 62 225 -113 56 -274 210 -51 55
7410 55 -21 -157 150 -130 174 -43 168 -269 106 -61 104 -93 -151 69 -259 400 -151 95 -118 -95 226
7431 226 -242 120 -223 5 -320 126 -165 -157 113 -52 -104 -408 99 -85 138 -62 -91 -132 -198 165 -96 168
7453 168 -10 -92 2 61 116 -92 84 118 -75 -66 88 -385 68 178 24 89 -169 251 -15 103 67 -35 37
7476 37 -310 235 -211 -5 34 78 173 76 -83 -313 -51 -122 -48 -101 -14 140 -60 -103 67 67 -157 294 -97 115
7500 115 310 22 75 -132 -115 -170 90 -137 -175 -121 -256 36 -114 126 -252 -5 233 131 -9 -23 27 -182
7522 -182 91 -56 29 24 -310 38 14 54 -229 65 -348 -215 -66 -145 39 -168 166 -286 -147 -145 108 111 -22
7545 -22 -198 -21 205 -143 250 52 97 -103 173 103 38 158 -410 213 50 -5 -223 -252 220 -104 118 30
7567 30 139 -10 -29 -123 33 237 -383 353 -71 -43 89 82 -41 19 102 -69 226 -74 -49 -175 -281 103 -8
7590 -8 199 -236 86 -136 278 -251 -86 238 -302 95 11 358 29 49 -64 57 123 142 175 -8 323 133
7612 133 -8 22 143 47 -226 380 -221 -9 -19 180 -16 195 240 -215 59 233 175 -152 132 -85 -53 -6
7634 -6 116 350 122 107 -33 -16 299 -64 262 -156 171 -154 -20 -41 -49 -229 -270 -122 -276 222 -71 106 188
7657 188 10 26 50 -27 -67 98 -280 152 -51 145 212 25 -4 41 -191 -123 112 -134 -140 42 -68 170 -89
7680 -89 -24 -114 -20 -24 144 -1 -175 98 -147 92 -162 -138 -178 171 -23 -149 37 -169 84 -132 101 -157 58
7703 58 38 -331 16 -139 -50 139 65 -18 7 -124 -50 14 -109 184 21 21 -81 -278 -50 -244 20 29 -279 -48
7727 -48 -116 -198 123 -25 -103 313 -214 159 -175 7 6 30 31 3 139 -6 -40 -40 244 -22 181 -35 24 -50 31
7752 31 91 -35 126 -25 -17 276 45 15 -101 -29 -24 -92 109 -304 111 -295 86 30 -110 -28 -88 -137 -222 288 14
7777 14 111 8 336 91 -58 14 -70 30 2 38 -158 -295 -22 -276 22 -177 -18 -248 104 -263 57 -177
7799 -177 -15 77 -244 210 -145 -85 -108 -14 -132 16 91 -118 48 -35 23 -14 9 -98 -229 255 4 71 -207
7822 -207 115 -223 195 -61 -203 -103 24 -16 -99 263 -79 -89 -365 179 -121 -215 242 -73 171 -15 65 133
7844 133 6 -27 70 404 -7 -159 6 -219 -137 -84 -54 -276 202 -60 231 190 -149 91 -45 23 -52 -117 -208
7867 -208 -26 -63 -133 65 -129 203 -10 -163 -14 162 121 113 50 -205 104 -253 263 -42 88 -96 -74 -208
7889 -208 -81 -59 -248 -37 -245 55 -275 -115 62 -76 60 -2 -73 -177 -194 -15 89 -3 -40 -48 -292 -6 -226
7912 -226 81 11 29 30 -56 257 -221 262 195 18 155 76 51 -288 193 -59 258 20 81 147 65 -117 -82 240
7936 240 -105 110 23 -76 -17 -171 302 51 202 -165 63 -116 -26 11 29 144 -15 212 32 151 -9 -36
7958 -36 -114 -132 137 -293 26 -11 -28 -9 137 64 -8 37 39 134 -256 35 -195 -205 -84 136 23 6 35 -16 168
7983 168 -44 125 31 -140 256 -192 29 35 99 -361 -155 70 141 94 -170 376 -210 151 -66 -29 -149 -234 -8
8006 -8 -208 171 -170 -81 -90 -62 304 -96 -28 -36 -109 -214 -107 84 -11 143 -53 -59 -354 303 -23 38 -96 -52 127
8031 127 -283 10 -215 135 132 -18 -30 -297 -57 79 369 -26 85 -18 53 162 -87 178 -181 -24 -283
8052 -283 134 110 -11 72 -185 -54 -222 244 -80 113 25 91 68 -230 186 -50 -65 -170 -166 34 129 113 160 34
8076 34 -168 293 -5 -150 34 -34 -22 -83 146 -176 -35 -65 136 -192 -121 25 -85 220 -339 6 -179 49
8098 49 -52 30 75 -16 -22 64 298 -25 60 28 153 -20 -255 225 -578 -63 1 107 356 45 75 -111 32 -202
8122 -202 24 -220 -104 468 -150 9 -315 2 -46 141 4 -74 26 -102 10 -225 210 -65 -103 61 154
8143 154 40 -119 58 -152 -178 189 80 -46 5 53 -186 243 -160 138 -304 56 43 -9 12 -38 187 -182
8165 -182 165 -37 -120 -35 -15 -8 -207 37 -59 321 11 157 -50 -22 75 -109 48 -136 165 141 -95 -85 128
8188 128 56 2 328
8191C28
$$ Imaginary data points
##PAGE= N=2
##DATA TABLE= (X++(I..I)), XYDATA
0 0 0 0 0 0 0 0 0 0 0 0 0 8 -8 8 -8 11 -16 16 -24 24 -32 40 -48 56 -64 73 -84 97 -113 129 -147 169 -193
33 -193 217 -245 276 -310 347 -387 430 -480 530 -590 650 -720 796 -877 965 -1062 1169 -1287
51 -1287 1417 -1560 1720 -1900 2101 -2330 2592 -2898 3257 -3684 4208 -4863 5707 -6841 8459
66 8459 -10953 15346 -25402 94008 29327 -57975 88377 -22056 21644 30105 6833 -26192
78 -26192 102097 -69686 26724 44405 -52036 68944 -32701 3672 18856 8850 -29412
89 -29412 52025 -29715 -22098 73438 -80554 45943 -9278 -11212 12336 -8116 -24879 20482
101 20482 11416 -66249 62640 -51196 18997 4486 -44421 29166 -10405 -13470 -11052 34966
113 34966 -52229 48249 -32668 -21916 54037 -53332 27076 -2326 -7821 -9569 35094 -49769
125 -49769 21336 29401 -59741 60524 -39077 9030 16590 -8217 -12331 26947 -5589 -16549
137 -16549 51361 -58006 53832 -5997 -16859 33454 -8458 2350 12235 14503 -35557 63767
149 63767 -35306 6876 25520 -30669 36154 -14593 4875 -1154 23884 -35552 26957 -5740
161 -5740 -16634 42285 -49917 30216 -6787 -8021 -3450 13337 -17850 2208 17459 -47293 45344
174 45344 -38418 6803 8664 -23090 4738 211 -6220 -23126 32781 -46223 30440 -13974 -23829
187 -23829 29845 -28090 4990 -7150 10405 -24242 25444 -29883 5679 19994 -42005 36342
199 36342 -22499 3133 -2442 4159 -17270 15821 -1487 -24193 37854 -41413 24795 -6544
211 -6544 -6309 9006 -1557 -303 -3378 17477 -31237 40852 -25138 6151 17573 -20452 17907
224 17907 -7534 8975 -11053 26101 -26391 19902 -41 -17275 30418 -27652 20276 -7639
236 -7639 5018 -10418 14890 -11581 -2598 21961 -35263 31570 -22351 4114 -519 -3149 -2350
249 -2350 -3247 4888 -23621 26135 -33834 17387 -7330 -12953 11094 -16579 4270 -13170 14168
262 14168 -26596 20538 -16514 -5095 11934 -24615 18642 -17278 9757 -12241 9766 -14266
274 -14266 5247 4584 -20111 27678 -26496 15414 -8093 2915 -2823 3050 3707 -11358 21629
287 21629 -25450 24407 -13985 6375 6027 -7448 10909 -8746 13717 -17086 24417 -17982
299 -17982 11538 3625 -11602 16625 -15236 15300 -13152 15117 -13982 9493 -3335 -7708
311 -7708 16301 -22111 20543 -16319 7953 -8391 3968 -3540 -5487 12325 -21370 19473 -20988
324 -20988 10395 -7614 -1027 2787 -9874 9520 -16978 15606 -20474 14374 -9675 -2309 6347
337 6347 -13862 11637 -15469 15427 -16640 12511 -8250 -790 5133 -12889 16258 -17496 16015
350 16015 -13865 8988 -6259 79 6496 -12374 17438 -17856 15264 -12211 9216 -4319
362 -4319 553 9337 -13353 16968 -15620 15469 -10863 9499 -389 -2146 9219 -11345 17012
375 17012 -16132 17841 -9288 6527 1323 -4731 9248 -10082 15092 -15971 17751 -11402
387 -11402 4207 1836 -6621 11276 -13531 13593 -12951 11539 -13264 7279 -701 -9631 13812
400 13812 -17652 12728 -13844 7452 -8984 4708 -3136 -7508 11661 -19624 15674 -16036
412 -16036 9572 -4804 -2969 2040 -4317 5662 -15014 19966 -18443 12478 -4988 -3897 8482
425 8482 -8839 8668 -8081 13854 -14710 14244 -8241 2270 9404 -13276 18307 -11560
437 -11560 8610 -5106 9874 -7887 7337 6003 -11722 19618 -17123 14823 -4569 3982
449 3982 768 2993 2463 -5768 14466 -16874 20839 -11642 5088 5215 -6398 7150 -4865 8770
463 8770 -11046 17660 -16237 9258 14 -8870 14162 -14431 9383 -5935 6050 -13330 11751
476 11751 -6059 -5183 12143 -19743 16731 -12457 2441 -2538 3682 -5402 -508 4456 -13861
489 -13861 18042 -21295 13661 -1522 -7990 7273 -2624 287 -4759 13822 -16991 19267 -10473
502 -10473 -574 12966 -12679 10791 -3183 8501 -8188 12598 -9931 10463 3550 -11911
514 -11911 22747 -14100 8622 -1558 5238 -3291 7635 -2192 -2690 16019 -21201 19489 -7451
527 -7451 1614 3873 -1846 1971 -1035 4850 -12239 20902 -18213 8923 2840 -9618 10152 -8322
541 -8322 5906 -3096 7447 -14736 16102 -8415 -4414 15168 -17625 14618 -6634 -208 -1921
554 -1921 7822 -10725 5438 5931 -16883 20090 -17406 7845 127 -3904 2006 1104 -3168 -4497
568 -4497 13789 -21468 18955 -8478 -4182 10537 -10887 3985 -706 4384 -11635 16939 -15048
581 -15048 6019 5201 -13544 16556 -9924 5573 -2055 5434 -7691 11792 -4345 -4629 18696
594 18696 -18768 15215 -4609 1472 4034 2383 -2669 4945 7026 -14928 21728 -14489 8660
607 8660 5045 -8357 8992 -1117 149 -3175 14128 -16690 15741 -5639 -5594 13516 -13758
620 -13758 9227 -2756 1072 -6316 10584 -13283 4251 6490 -17039 18253 -14898 2646 566
633 566 -1718 -5984 5738 -2540 -8839 13806 -21016 14580 -6758 -5053 6292 -5206 -1360 -1026
647 -1026 4391 -13941 17864 -15518 3830 6511 -13209 10319 -5307 2482 -3046 8555 -12725
660 -12725 11460 -3501 -6642 17090 -16056 11451 -1877 -15 -1061 7386 -6248 3112 9284
673 9284 -15818 19364 -11579 4442 4290 -3507 3092 2171 -100 -6229 15005 -17163 14337 -2947
687 -2947 -6270 10931 -8906 3345 -1575 4901 -10201 12913 -11717 2155 6820 -14818 14217
700 14217 -9527 2063 -1736 2381 -8890 6901 -1908 -9567 15318 -18100 9523 -4037 -3122
713 -3122 1327 -151 -3163 -2013 6551 -15744 16114 -12258 2011 5493 -9234 5132 -2888 1225
727 1225 -5707 11687 -14020 9334 -1067 -8257 12518 -10989 7510 -2121 2777 -5915 8988
740 8988 -6942 764 9997 -14842 15847 -8645 2339 1785 1327 -1950 3782 2758 -8842 15146
754 15146 -14608 10712 -1008 -3479 6796 -4037 1700 -2034 7481 -11982 14270 -8910 94
767 94 7220 -10984 8628 -5445 2981 -4470 7041 -9788 5250 -10 -9324 13323 -13521 6608
781 6608 -3155 -635 -3210 3666 -3268 -3615 9122 -14986 11811 -9255 1299 2107 -3917 1265
795 1265 -2146 3063 -8984 12114 -13016 7609 -338 -6945 8183 -6853 4344 -3985 6905
808 6905 -8902 8918 -5250 -1524 8498 -11219 11657 -6002 3889 -2086 4460 -4231 3001
821 3001 4473 -9248 13781 -11118 7339 -1326 -63 2046 302 2571 -4405 9193 -10973 11711
835 11711 -5847 438 5395 -6189 4781 -3864 5126 -7480 9388 -8752 3359 1828 -8407
848 -8407 9076 -8854 5445 -5271 3658 -5781 3275 -2434 -4795 9202 -12872 8941 -6753
861 -6753 1528 -2192 -95 -550 -2832 5247 -10728 10544 -10383 4829 -831 -3110 4064 -4983
875 -4983 4118 -6056 8241 -9271 8104 -2591 -2002 6646 -7307 7392 -5234 6227 -5372
888 -5372 6403 -3542 918 5215 -7774 11086 -7747 6851 -3401 3041 -1191 941 3780 -5787
902 -5787 9941 -9561 8422 -4470 2468 1634 -1880 3986 -4818 7034 -8719 9810 -6335
915 -6335 2644 2476 -4653 5469 -5463 6432 -6995 7753 -6573 3116 532 -5040 6626 -7984
929 -7984 7129 -7060 4675 -4306 2040 -1350 -3400 6908 -10144 7662 -7511 4042 -3566
942 -3566 -141 801 -3095 4639 -9017 8443 -8173 4791 -2710 -515 2592 -4921 4850 -6467
956 -6467 8195 -7707 6095 -2153 -542 3382 -5039 7322 -6164 7359 -5585 6247 -2745
969 -2745 410 4929 -5451 8748 -6225 7370 -4127 4931 -2303 1678 4792 -6080 9082
982 9082 -7189 7375 -4671 3408 128 -421 3064 -5091 7511 -8433 8771 -5851 2805 1485
996 1485 -3665 3541 -4366 6124 -7866 7530 -6479 2199 100 -4946 5227 -6615 5770
1009 5770 -6818 5040 -6003 2631 -1193 -3691 6316 -8916 6666 -6833 3313 -3539 1906
1022 1906 -957 -2583 4879 -8780 8448 -7978 4578 -1233 -418 1378 -2469 3763 -5747 8845
1036 8845 -8684 7475 -1988 -1350 4352 -3941 5524 -4351 6336 -5583 7317 -4498 1657 4495
1050 4495 -5973 8566 -6052 5818 -2909 3959 -3492 3214 2168 -5344 9040 -8454 7316
1063 7316 -4200 1876 498 -128 890 -3230 6113 -8769 9278 -6531 2628 1391 -4149 3339
1077 3339 -3374 3637 -6430 7360 -7791 4002 -1073 -4500 6117 -7189 5054 -4223 3175
1090 3175 -5679 4506 -3556 -1458 5827 -9556 8535 -6716 2273 -1682 1249 -1502 92 2412
1104 2412 -6806 9358 -9807 6742 -1573 -1905 3109 -2211 2136 -2936 6366 -8339 9116 -4520
1118 -4520 12 4444 -5693 6307 -3716 3976 -3538 5874 -5447 3716 1948 -5472 9553 -7740
1132 -7740 5557 -2136 1818 -1876 3190 -720 -2457 7162 -9849 9123 -5265 1723 1435 -1770
1146 -1770 843 -1348 2826 -6707 9233 -8829 4595 43 -5036 4778 -4631 2716 -3250 4595
1160 4595 -7323 6118 -4076 -2103 6210 -8814 6992 -4559 1063 -2443 2783 -4326 1524
1173 1524 2660 -8110 9479 -8741 4189 -767 -1021 813 49 38 -3207 6835 -9594 8969
1187 8969 -4001 -621 4453 -4426 3072 -1678 3516 -4979 8023 -6336 3414 2577 -5961 8033
1201 8033 -5273 3826 -1450 3297 -4126 4950 -1488 -2660 8578 -9197 7630 -3710 731 441
1215 441 1086 -1172 184 3414 -7710 9376 -7991 3841 1185 -3693 3024 -2149 979 -3529
1229 -3529 5988 -8460 6758 -3073 -3101 5413 -6988 4183 -2979 1661 -4134 4737 -5710 1368
1243 1368 3259 -8360 8693 -6743 2262 -818 -155 -2364 2152 -489 -4425 7613 -9599 7154
1257 7154 -3155 -989 2771 -2014 743 -1212 3954 -6600 8730 -6237 2626 2932 -5233 5466
1271 5466 -3160 2431 -2080 4816 -5758 5051 -695 -3288 8123 -7144 6248 -2022 857 -1216
1285 -1216 3459 -2527 246 4959 -7915 8567 -6120 2456 1080 -1216 1178 -1 1057 -4491
1299 -4491 6926 -8636 6210 -1697 -3249 4304 -4606 2069 -2098 3004 -5630 6150 -5281 256
1313 256 3415 -7166 6196 -4620 1943 -2139 1998 -4434 2487 119 -4872 7618 -8326 4788
1327 4788 -2342 -464 -34 668 -210 -1565 4181 -7630 7676 -5416 1536 2546 -3695 2921 -1459
1342 -1459 2043 -3390 6565 -6115 4914 -72 -3644 6505 -4733 4040 -1732 3158 -3177 4275
1356 4275 -2569 -84 5433 -6761 7601 -4322 1707 126 773 -761 921 1753 -4910 7533
1370 7533 -7389 4522 -945 -1556 2584 -2162 1355 -2381 3941 -6638 6772 -4281 -328 2965
1384 2965 -5424 3780 -3705 1945 -3273 4026 -4914 2082 635 -5192 6156 -6377 3903 -2575
1398 -2575 530 -2153 1812 -647 -2465 5202 -7010 5984 -4224 1178 793 -1311 1126 -1047
1412 -1047 2506 -4931 6497 -5552 3693 481 -2737 4236 -2890 2608 -2198 4435 -4234 4440
1426 4440 -1590 -1222 4703 -5128 5602 -3134 2645 -1704 2434 -1794 791 2897 -4700 6849 -5430
1441 -5430 3625 -938 414 326 -483 1403 -2967 4846 -6327 4819 -2383 -241 1741 -2844 2281
1456 2281 -2929 2609 -4486 4709 -4046 854 1139 -4198 4105 -4363 2979 -2818 2487 -3344 1549
1471 1549 -27 -3154 4559 -6023 4609 -3191 861 -1220 433 -152 -1784 3608 -5279 5498
1485 5498 -4690 2353 -197 -937 2036 -1740 2545 -3649 4974 -4442 4176 -886 -1095 3119 -3282
1500 -3282 3808 -2651 3939 -3125 3388 -1339 -95 2861 -3806 5197 -3618 3388 -2173 1893 -995
1515 -995 63 2052 -3557 5193 -5050 3592 -2147 1011 272 -750 1783 -2854 3843 -5095 4297
1530 4297 -2925 565 766 -2175 2063 -3126 2974 -4131 3913 -3428 1240 124 -3130 3228 -4134
1545 -4134 2865 -3537 2855 -2721 1345 -733 -2220 3750 -4636 4245 -3594 2230 -1648 619 225
1560 225 -1381 3007 -4358 4615 -4086 2902 -681 193 1474 -1777 2981 -3425 4690 -3682 3314
1575 3314 -784 -365 2101 -2400 2948 -2721 4006 -3255 3832 -1425 53 2630 -3145 4416 -2994
1590 -2994 3010 -2432 2242 -1659 751 1407 -3391 4763 -4632 3213 -2137 913 -239 -18 775 -2650
1606 -2650 3892 -5402 4388 -3068 701 430 -1781 1352 -2728 2470 -4000 4083 -3791 1405 -266
1621 -266 -2806 2910 -3343 2820 -2930 2746 -3375 1808 -757 -1624 3726 -4410 4086 -2860 1840
1636 1840 -1548 1442 -213 -407 2673 -4203 5221 -3851 2775 -420 -139 1021 -839 1949 -2877
1651 -2877 4533 -4403 4334 -1414 -206 2483 -2374 2561 -1816 3286 -3052 4071 -2704 852 2121
1666 2121 -3413 4424 -3367 2510 -1577 1876 -2056 1463 602 -2913 4748 -5282 3688 -2064 520
1681 520 -334 -285 136 -1737 2823 -5089 5010 -4108 1294 710 -2408 1720 -1883 1397 -3179 3708
1697 3708 -4579 2459 -869 -2351 3467 -4024 2914 -2059 1568 -2605 2574 -1871 -159 3338 -4822
1712 -4822 4907 -3597 1717 -590 758 -516 664 1376 -3428 5149 -5229 4140 -773 -460 1619
1727 1619 -1236 939 -1939 3707 -4110 4915 -2679 438 2244 -3362 3576 -1924 2112 -2048 3241
1742 3241 -3176 1810 437 -2831 4867 -4415 2811 -1197 772 -1343 1545 -795 -1506 3636 -5618
1757 -5618 4908 -3432 588 708 -1295 504 -724 1476 -3886 4718 -4705 2648 -254 -2873 2733
1772 2733 -2722 1177 -2055 2575 -3691 3153 -2489 -1067 3177 -4818 3737 -2431 1440 -1359 1616
1787 1616 -2151 984 1642 -3793 5204 -4575 2845 -341 36 506 503 638 -1300 3991 -4841 5154 -2417
1804 -2417 109 2191 -2195 2098 -1082 2041 -2381 4833 -3954 2302 1206 -3283 4226 -3015 2354
1819 2354 -1522 1884 -2617 2399 -993 -1761 4417 -5237 3933 -2418 514 -340 326 -711 -283 1851
1835 1851 -4587 4888 -4951 2252 230 -1675 1769 -1697 650 -2366 3206 -5205 3831 -1961 -1429
1850 -1429 2874 -3672 2636 -1783 1335 -2322 2984 -2847 610 1623 -3985 4829 -3878 1890 -1041
1865 -1041 531 -894 1256 351 -2012 4520 -5220 4433 -1741 342 1627 -714 920 -909 2374
1880 2374 -3908 5177 -3507 1762 1333 -2325 3080 -1951 1781 -1789 3552 -3193 2900 -542 -1693
1895 -1693 3997 -3850 3576 -1796 970 -1317 1715 -1403 148 2274 -4370 4826 -3847 1678 -340
1910 -340 -675 242 -223 691 -2923 3877 -4996 3427 -1499 -1110 1940 -2896 1476 -1772 2042 -3434
1926 -3434 3429 -3016 274 1657 -3784 3840 -2972 1854 -1698 1786 -2236 1164 468 -2581 4281
1941 4281 -4430 3395 -1601 419 32 551 434 -1082 3055 -4231 4652 -3085 1425 874 -1250 1867
1957 1867 -1167 1920 -2646 3901 -3734 3079 -35 -1471 3310 -3055 2566 -1559 2450 -2380 2379
1972 2379 -1635 -442 2649 -3969 4110 -3108 1489 -903 522 -1083 239 1119 -3350 3874 -4755
1987 -4755 3208 -1535 -397 813 -1432 1149 -2082 2576 -4298 3417 -2606 342 1396 -2889 2331
2002 2331 -2342 2016 -2491 2602 -2678 831 501 -2505 3467 -3460 2549 -1754 1346 -1650 1128
2017 1128 1 -1421 3237 -3783 3888 -2803 1395 67 127 752 -696 2270 -3282 4148 -3011 2566
2033 2566 172 -984 2255 -1744 2164 -1960 3111 -2725 3050 -741 -548 2403 -3151 3168 -2419
2048 -2419 1985 -1968 1741 -1254 -55 1784 -3181 3823 -3452 2622 -1663 571 -621 -444 1168
2063 1168 -2512 3039 -4168 2943 -2189 329 428 -1423 1174 -2052 2216 -3368 2884 -2606 845
2078 845 303 -1822 2254 -2849 2468 -2187 2533 -2275 1200 26 -1788 3101 -3298 3119 -2195
2093 -2195 1655 -1075 1003 94 -836 2676 -3429 3963 -2774 1738 -525 118 977 -986 2262 -2529
2109 -2529 3601 -2731 2824 -632 -156 1814 -1792 2478 -1937 3002 -2630 2735 -1285 -154 1589
2124 1589 -2463 3189 -2458 2254 -2242 1656 -1268 -44 1254 -2336 3004 -3357 2374 -2034 612
2139 612 -569 -248 770 -2070 2701 -3649 2719 -2092 594 231 -1069 1089 -1960 2195 -3240 2756
2155 2756 -2581 1161 170 -1855 2330 -2248 2366 -2102 2426 -2151 1296 -352 -1416 2758 -2977
2170 -2977 3044 -2060 1613 -1218 1269 197 -656 2644 -2869 3444 -2815 1952 -458 389 736 -823
2186 -823 2167 -2384 3382 -2904 2440 -785 -246 1348 -1698 1799 -1957 2570 -2274 2615 -1440
2201 -1440 48 1494 -2293 2656 -2300 2266 -1789 1460 -1319 69 970 -2417 3259 -3478 2218
2216 2218 -1790 684 -562 -73 668 -2140 2401 -3512 3165 -2238 612 165 -1271 1061 -1935 1798
2232 1798 -2883 2866 -2720 1593 156 -1692 2009 -2210 2344 -1810 2060 -2148 1645 -386 -866
2247 -866 2510 -2862 2822 -2233 1582 -1294 1025 -261 -245 1890 -3045 3484 -3024 2009 -574 41
2263 41 892 -539 1384 -1964 2963 -3101 2807 -1323 -187 1574 -1744 2001 -1537 2191 -2057 2479
2279 2479 -2012 511 1094 -2638 2759 -2677 1886 -1439 1241 -1236 868 188 -1821 2704 -3695
2294 -3695 2261 -1830 489 -98 -155 229 -1184 1846 -3331 3254 -2810 1172 156 -1144 958 -1400
2310 -1400 1300 -1989 2673 -2663 1847 -469 -1315 2350 -2567 2100 -1564 1333 -1389 1587 -752
2325 -752 -254 2092 -2848 3428 -2222 1621 -629 658 -259 200 1106 -2138 3113 -3227 2264 -877
2341 -877 -34 1026 -822 986 -1280 2224 -2805 3190 -1836 372 1071 -2094 2065 -1678 1358 -1687
2357 -1687 1860 -1862 750 367 -1912 2665 -2801 2197 -1471 685 -1068 432 -248 -1035 2138 -3292
2373 -3292 3184 -2247 663 -37 -563 359 -976 1216 -2633 2664 -3168 1565 -444 -1242 1435 -1831
2389 -1831 1407 -1485 1964 -2244 2346 -1405 -564 1895 -2474 2895 -1579 1240 -887 1214 -1062
2404 -1062 806 1103 -2063 3113 -2948 2041 -767 100 481 154 860 -1047 2446 -2978 3107 -1380
2420 -1380 571 1082 -1244 1215 -1323 1376 -2025 2570 -2197 1297 431 -1654 2385 -2188 1906
2435 1906 -1195 1177 -1538 1332 -315 -1023 2243 -3160 2424 -2064 799 -550 168 -376 -532 1090
2451 1090 -3063 3137 -2926 1228 -282 -651 740 -899 708 -1761 2419 -2858 2378 -1050 -633
2466 -633 1790 -2335 1673 -1268 1344 -1436 1520 -1385 479 1195 -2008 3188 -2158 1714 -798
2481 -798 669 -616 653 372 -1280 2837 -2846 2539 -1258 186 551 -312 570 -830 1872 -2489
2497 -2489 2735 -1880 981 453 -1276 1522 -1519 1186 -1517 2014 -1939 1542 -390 -1094 2109
2512 2109 -2622 1976 -1487 699 -1247 1014 -957 -294 1306 -2679 3146 -2597 974 -499 -69
2527 -69 177 -239 435 -2044 2590 -2839 2180 -1094 -425 937 -1178 930 -1253 1471 -1966 2540
2543 2540 -1391 425 953 -1973 2160 -1669 1514 -1201 1601 -1182 686 442 -1343 2695 -2593
2558 -2593 2152 -1066 890 -148 362 361 -773 2094 -2301 2775 -1920 975 547 -398 842 -953
2574 -953 1406 -1618 2375 -2056 1737 -97 -755 1829 -1826 1428 -1295 1126 -1630 1499 -1120
2589 -1120 -578 1170 -2462 2266 -1913 773 -1027 430 -840 20 609 -1854 2212 -2648 1392 -1084
2605 -1084 -163 80 -415 523 -1334 1631 -2573 2061 -1192 382 579 -1494 1363 -1329 1408 -1400
2621 -1400 2029 -1608 890 603 -1351 2078 -1838 1696 -994 1286 -983 745 155 -789 2022 -1966
2637 -1966 2400 -1650 977 -425 281 263 -472 1576 -1740 2428 -2146 1197 -145 -361 847 -1079
2653 -1079 1065 -1463 1802 -1874 1864 -901 -112 1122 -1787 1578 -1323 1312 -1337 1262 -1184
2668 -1184 -22 554 -2043 2171 -2340 1588 -1287 332 -540 -181 444 -1607 2075 -2454 1921 -1358
2684 -1358 390 -125 -573 702 -1033 1468 -2081 1922 -1412 687 433 -1074 1286 -1126 1367 -1422
2700 -1422 1652 -1238 1064 55 -881 1920 -1919 1955 -979 1265 -1074 871 -119 -393 1900 -1996
2716 -1996 2356 -1518 1293 -393 240 189 -516 1076 -1602 2142 -2098 1505 -267 -151 630 -913
2732 -913 1186 -1476 1640 -2023 1657 -1136 -199 809 -1665 1313 -1466 1509 -1452 994 -1051
2747 -1051 -5 384 -1405 1995 -2056 1334 -1353 644 -443 322 331 -937 1644 -2280 1712 -1268
2763 -1268 981 -191 -163 708 -931 1328 -1972 1996 -1548 1085 7 -842 1247 -1327 1573 -1432
2779 -1432 1599 -1341 1118 -85 -494 1564 -1525 1731 -1375 1118 -916 834 -356 -51 1344
2794 1344 -1919 2285 -2058 1398 -603 353 -26 -451 1030 -1448 1953 -1900 1633 -813 222 789
2810 789 -804 887 -1084 1482 -1846 1626 -1139 214 495 -1639 1356 -1624 1351 -1233 1269
2825 1269 -1362 50 334 -1342 1986 -2060 1667 -1268 854 -499 424 410 -1029 1650 -2355 1932
2841 1932 -1738 913 0 -470 486 -974 1222 -1685 1850 -1626 1323 -309 -501 1266 -1146 1598
2857 1598 -981 1600 -1451 1213 -561 -248 1421 -1499 2015 -1505 1232 -686 817 -108 213 893
2873 893 -1617 2254 -1961 1644 -481 221 119 -347 485 -1225 1722 -2128 1962 -1097 206 479
2889 479 -1189 683 -1282 1120 -1490 1704 -1396 346 91 -1193 1406 -1813 1204 -1251 681
2904 681 -1289 581 -122 -901 1536 -2071 1773 -1563 670 -162 160 166 -514 1264 -1908 2064 -1948
2921 -1948 1369 -356 -218 776 -877 881 -1297 2038 -1798 1791 -740 -504 1352 -1340 1543 -1101
2937 -1101 1233 -995 1562 -934 293 1023 -1482 2066 -1581 1568 -678 586 -471 221 564 -1212
2953 -1212 1999 -2217 1865 -1012 191 163 -283 639 -838 1143 -1893 2152 -1675 631 102 -1353
2969 -1353 1051 -1240 1247 -1307 1218 -1401 751 -150 -799 1336 -1664 1729 -1224 978 -916
2984 -916 627 -436 -406 1337 -1804 1997 -1765 897 -591 -50 22 -355 1027 -1559 2019 -1914 1634
3001 1634 -603 -384 873 -738 869 -1074 1516 -1473 1841 -1128 397 1082 -1397 1791 -1143
3016 -1143 1226 -838 1007 -839 674 420 -1245 1953 -2010 1487 -878 229 -308 364 273 -838
3032 -838 1415 -2053 1885 -1541 701 74 -482 595 -961 680 -1562 1601 -1809 936 -315 -876
3048 -876 981 -1609 1057 -1100 959 -1390 978 -778 -378 1229 -1863 1692 -1554 695 -769
3063 -769 428 -402 -21 476 -1644 1947 -1962 1341 -599 247 521 -556 662 -809 1464 -1822
3079 -1822 1914 -984 322 669 -1018 1187 -875 881 -1044 1378 -1085 545 312 -1104 1945
3094 1945 -1416 1441 -936 597 -535 520 -5 -622 1385 -1832 1884 -1208 540 -234 138 141 -516
3111 -516 1087 -1771 2157 -1770 854 -220 -429 624 -1048 857 -1229 1419 -1498 1157 -309
3126 -309 -313 947 -1482 1390 -1070 851 -903 1058 -742 17 573 -1187 1878 -1618 1269 -559
3142 -559 336 -59 180 379 -1138 1229 -2144 1604 -942 201 552 -526 550 -752 1222 -1315
3158 -1315 1602 -1097 639 353 -827 1435 -1263 1419 -889 1187 -898 831 41 -682 1837 -1560
3174 -1560 1602 -1200 937 -633 554 51 -475 929 -1690 1773 -1567 1017 -284 148 422 -608
3190 -608 547 -1188 1394 -1715 1227 -533 -371 539 -968 823 -1114 875 -1341 1156 -910 34
3206 34 584 -1450 1328 -1522 1085 -989 544 -434 179 484 -1123 1614 -1644 1265 -900 262
3222 262 -112 29 277 -624 1314 -1425 1674 -1100 865 177 -440 688 -587 1042 -1033 1474 -1218
3239 -1218 780 199 -598 1014 -893 1250 -813 1153 -955 703 -44 -489 1095 -1345 1316 -1475
3255 -1475 1158 -672 280 -156 -259 952 -1518 1595 -1699 1217 -728 226 408 -776 420 -1088
3271 -1088 1061 -1638 1127 -823 169 212 -753 941 -1117 1099 -1238 849 -872 154 214 -808
3287 -808 1683 -1395 1173 -1004 569 -611 358 175 -646 1383 -1625 1522 -1203 574 -257 182
3303 182 569 -451 1018 -1473 1697 -1199 887 1 -427 800 -455 1095 -1177 1300 -929 1089
3319 1089 -350 -271 900 -1096 1264 -946 1023 -918 907 -360 -192 991 -1325 1392 -1385 717
3335 717 -456 377 -234 -306 427 -1267 1229 -1646 1240 -951 387 195 -516 577 -1067 1164 -1341
3352 -1341 1083 -1079 276 55 -717 819 -1005 1168 -1322 894 -1049 347 -183 -851 1301 -1331
3368 -1331 1210 -981 606 -601 477 -29 -398 1111 -1284 1543 -1233 867 -307 -75 498 -326
3384 -326 712 -1131 1570 -1047 1105 50 -97 571 -780 867 -813 1436 -939 1039 -312 -141
3400 -141 795 -1038 1133 -1002 753 -1108 759 -451 -22 522 -1113 1455 -1413 1018 -973 419
3416 419 -96 -182 458 -850 1114 -1462 780 -889 272 -139 -597 252 -939 891 -1455 1103 -1012
3433 -1012 613 53 -709 664 -968 680 -954 1109 -934 644 34 -268 882 -1393 1242 -781
3449 -781 773 -382 311 -136 -390 684 -1040 1039 -1193 775 -385 282 134 -371 788 -891 1258
3466 1258 -1208 1281 -386 -30 666 -646 796 -776 1188 -926 849 -464 -25 698 -866 1157
3482 1157 -970 721 -948 674 -616 275 422 -824 1310 -1405 988 -977 335 -253 -125 -65
3498 -65 -775 716 -1405 1264 -1090 531 -151 -629 257 -614 236 -968 1189 -1105 750 -137 -515
3515 -515 748 -663 1048 -631 498 -699 506 -177 -94 900 -913 1300 -1202 876 -276 390
3531 390 133 197 589 -1087 1318 -1127 1066 -309 178 435 -66 806 -439 1018 -1009 1453 -822
3548 -822 133 350 -622 934 -854 506 -888 1060 -892 372 113 -439 1147 -1019 735 -750
3564 -750 515 -556 225 -111 -251 884 -1472 1199 -1049 522 -138 -119 -79 -527 417 -1009 1286 -1230
3582 -1230 709 -143 -423 486 -944 550 -681 949 -1070 848 -376 -599 821 -1079 958 -1006
3598 -1006 606 -721 694 -330 84 821 -628 1144 -1062 1132 -357 170 140 98 245 -634 1260
3615 1260 -1174 1008 -614 255 275 -485 408 -390 752 -694 1214 -810 382 89 -475 926 -708
3632 -708 791 -698 877 -563 554 -159 -536 905 -909 1060 -825 380 -277 144 -287 -132 621
3649 621 -1076 1101 -1309 502 -364 -197 324 -376 456 -639 993 -1083 924 -557 -241 285 -578
3666 -578 746 -821 493 -597 783 -425 159 375 -885 841 -1086 766 -700 427 -362 113
3682 113 171 -691 1132 -1233 1088 -489 124 213 56 276 -277 864 -1016 1120 -895 482 325 -386
3700 -386 520 -530 759 -812 1191 -799 633 70 -330 894 -860 766 -710 580 -595 583
3716 583 -151 -222 604 -925 882 -1025 484 -471 6 -239 -298 484 -791 923 -1104 851 -509 -5
3734 -5 -10 -808 266 -838 643 -1051 669 -740 24 175 -845 700 -689 499 -740 552 -634
3751 -634 540 263 -446 1185 -827 827 -537 375 -123 154 99 -275 973 -982 1253 -702 588
3768 588 -22 -332 189 -275 563 -1153 978 -1144 684 -196 -536 630 -672 947 -445 640 -908
3785 -908 804 -218 -150 549 -894 886 -1089 470 -999 407 -166 -205 453 -968 1029 -1197 548
3802 548 -477 156 84 -321 272 -731 796 -1316 678 -260 129 -77 -517 453 -635 658 -845 1029
3820 1029 -838 431 208 -727 748 -881 701 -670 661 -624 214 200 -481 944 -703 1039
3836 1039 -415 321 -512 114 -57 -190 873 -978 1284 -1054 526 45 23 379 -149 634 -707 930
3854 930 -982 627 -473 -194 370 -709 666 -522 526 -753 462 -154 81 479 -677 708
3870 708 -809 721 -582 231 -511 -75 471 -710 936 -950 986 -573 -104 240 -284 213 -570
3887 -570 674 -713 895 -770 121 109 -353 447 -613 719 -768 677 -723 416 65 -458 704
3904 704 -745 879 -695 675 -423 392 283 -499 760 -1127 1011 -686 710 -203 120 21 -208
3921 -208 670 -900 1263 -906 929 -156 142 436 -393 651 -886 925 -780 838 -432 -140
3937 -140 334 -684 589 -834 959 -710 557 -459 69 -19 -805 477 -736 677 -601 217 -558
3954 -558 -100 7 -862 614 -817 895 -854 272 -191 -275 104 -531 511 -754 890 -675 418
3971 418 -31 -255 404 -619 445 -626 1073 -678 420 84 -389 555 -932 899 -690 769 -552
3988 -552 436 -85 -108 884 -770 1203 -742 749 -291 280 159 -53 356 -638 948 -955 1039 -400
4006 -400 55 410 -462 299 -446 830 -776 600 -590 222 308 -452 759 -856 609 -829 525
4023 525 -371 60 143 -600 455 -869 739 -686 339 -287 -120 183 -475 738 -1179 1060 -1026
4040 -1026 497 -91 -350 331 -485 756 -726 841 -1027 613 -83 -194 608 -384 571 -590 831
4057 831 -846 918 -69 -148 932 -451 930 -613 796 -595 412 -148 46 626 -605 963 -823
4074 -823 914 -17 211 78 21 427 -751 1116 -1155 1016 -194 48 236 -400 396 -387 587 -710
4092 -710 922 -759 214 84 -610 708 -822 632 -523 674 -685 90 -164 -331 643 -859 562
4109 562 -596 260 -341 3 82 -669 308 -882 789 -842 542 8 -254 195 -657 336 -589 1202
4127 1202 -719 746 -124 -169 273 -481 1006 -326 664 -470 683 -459 77 572 -743 980 -903
4144 -903 579 -281 344 -188 85 147 -598 1002 -991 726 -351 301 33 -121 375 -658 357 -924
4162 -924 1053 -527 312 158 -436 440 -575 780 -831 874 -480 410 -121 -641 726 -852 760
4179 760 -486 406 -677 434 -99 65 346 -1062 927 -750 316 -434 132 120 -269 297 -625 776
4197 776 -974 543 -112 -235 260 -451 281 -633 698 -793 842 -313 64 175 -391 897 -765
4214 -765 552 -510 713 -206 345 259 -348 940 -592 723 -403 478 -82 -101 200 -222 1086 -1197
4232 -1197 629 -810 169 -46 -313 520 -273 345 -774 1033 -705 317 64 -404 323 -797 431
4249 431 -563 458 -532 384 -295 -104 618 -962 675 -458 459 -454 378 -125 -2 443 -495 901
4267 901 -904 757 -389 147 -24 -118 122 -485 846 -954 679 -120 276 359 -373 664 -389 711
4285 711 -348 731 -379 466 229 -345 766 -729 662 -567 395 -428 320 175 -547 876 -697
4302 -697 947 -659 303 -6 112 217 -186 726 -830 722 -642 340 -19 -302 321 -406 298 -496
4320 -496 713 -696 596 -380 -66 432 -590 540 -515 303 -702 92 -381 -93 457 -801 432
4337 432 -578 302 -379 145 -146 -183 274 -790 622 -1030 648 -488 159 140 -234 404 -525 696
4355 696 -840 689 -505 487 431 -328 358 -583 756 -457 583 -564 392 38 -260 527 -687 881
4373 881 -629 188 -377 432 5 -46 665 -633 760 -656 571 -384 93 115 -171 487 -652 867
4391 867 -551 378 -281 -59 189 -350 217 -709 459 -716 473 -514 -266 147 -757 713 -912 521
4409 521 -499 226 -310 -188 185 -610 597 -916 252 -426 158 -63 -125 252 -607 769 -719 550
4427 550 -555 191 -200 -215 229 -399 476 -634 678 -551 464 -102 -189 512 -435 912 -359 442
4445 442 -599 119 -43 -125 465 -736 469 -401 574 64 244 51 -52 426 -729 680 -645 231
4463 231 -210 46 241 -113 247 -603 600 -876 780 -365 -131 206 -284 215 -594 496 -675 287
4481 287 -454 108 52 -582 722 -776 430 -362 549 -312 21 243 -426 469 -598 579 -473 296
4499 296 32 56 468 -406 703 -835 692 -692 191 197 -35 333 -301 544 -452 828 -549 396 -19
4518 -19 18 591 -356 625 -208 468 -363 208 65 161 448 -662 659 -537 272 -359 95 125 -290 27
4538 27 -269 190 -767 410 -358 300 -245 -197 108 -597 446 -632 296 -607 -323 68 -204 461 -287 448
4558 448 -628 399 -382 364 -44 -326 318 -509 237 -525 479 -217 -13 103 -133 336 -658 562 -839
4577 -839 291 -193 -21 -3 27 549 -547 564 -532 492 -113 -239 248 -324 420 -347 409 -605 523
4596 523 -196 -52 300 -567 601 -542 292 -541 654 -161 340 509 -518 452 -664 519 -343 273
4614 273 -83 27 28 -351 638 -507 464 -426 34 -25 -445 -63 -538 587 -540 661 -460 -235 -108
4633 -108 -500 247 -536 449 -570 359 -545 240 -133 -281 388 -604 861 -345 344 -342 298 -89 77
4652 77 314 -426 627 -346 412 -103 -56 20 -3 456 -464 457 -552 427 -97 117 603 -501 565 -372
4672 -372 311 -416 421 -47 -274 289 -618 710 -659 527 -418 408 -150 233 186 -598 642 -539 335
4691 335 -386 137 -127 68 294 -450 496 -537 524 -373 107 -78 -130 104 -311 398 -479 506 -463 293
4711 293 -1 -240 252 -426 549 -304 156 -439 198 -313 -250 492 -509 585 -679 224 -340 223 -41
4730 -41 -71 442 -564 742 -600 548 -119 91 152 -253 258 -309 562 -728 719 -268 133 291 -328
4749 -328 661 -332 471 -534 421 -409 294 216 -224 537 -496 486 -156 295 -220 158 83 -326 488 -519
4769 -519 636 -467 400 116 -80 70 -351 350 -591 547 -548 33 -117 -338 77 -423 407 -105 469
4788 469 -705 234 -288 141 375 -535 540 -387 310 -281 78 -113 200 422 -631 477 -631 371
4806 371 -345 39 -35 154 361 -71 550 -511 493 -622 179 136 -261 473 -367 442 -463 527 -359 408
4826 408 147 -490 408 -385 433 -10 589 -342 226 -226 -254 451 -621 636 -160 359 -222 81 140 -313
4846 -313 673 -578 289 -372 199 -201 129 220 -247 -12 -538 535 -405 554 -200 -113 295 -549 51 -254
4866 -254 442 -265 358 -383 -252 -125 -549 626 -638 298 -356 263 -332 8 14 -202 564 -638 332 -413
4886 -413 196 179 -34 198 -532 193 -632 579 -278 62 -7 -193 286 -28 435 -396 395 -408 298 -145
4906 -145 -309 431 -420 519 -380 478 -186 230 -79 15 507 -566 430 -670 188 -192 -130 -176 -219 345 -545
4927 -545 641 -688 242 -149 -68 195 -457 174 -557 449 -348 267 -330 -43 197 -234 344 -368 474
4946 474 -493 286 -346 161 46 -463 461 -443 371 -345 137 -144 59 51 -307 374 -523 845 -340 275
4966 275 -128 -175 253 -226 477 -535 683 -397 253 36 -128 287 -329 453 -343 312 -240 117 -69
4985 -69 8 308 -232 467 -473 350 -241 54 -225 -127 321 -552 429 -453 28 -216 176 -164 191 251 -552
5006 -552 462 -734 340 -401 -3 -77 -198 437 -138 337 -380 541 -67 44 306 -127 299 -18 278
5025 278 -550 384 -226 128 -67 -100 242 -452 327 -454 294 -66 187 -172 -93 489 -594 429 -523 228
5045 228 164 -92 264 -88 565 -266 714 -610 402 -162 -268 201 -445 439 -65 487 -309 -2 -95 -98 296
5066 296 -348 400 -235 312 -476 234 -120 -7 399 -396 483 -334 279 -301 -199 156 -81 144 -155 374
5086 374 -520 269 -535 11 195 -204 322 -357 400 -491 375 -370 198 -39 -207 344 -385 301 -314 315
5106 315 -191 231 112 -53 333 -315 175 -290 387 -27 155 -25 132 511 -530 869 -284 408 -89
5125 -89 -7 12 -224 632 -506 429 -383 598 -174 263 100 -232 281 -264 383 -530 394 -190 248 206 -449
5146 -449 288 -267 384 -363 301 -230 285 -92 -626 362 -615 540 -189 0 45 -54 99 -358 154 -545
5166 -545 536 -356 237 -200 -521 363 -558 453 -385 602 -440 191 57 -361 585 -472 471 -146 613
5185 613 -427 270 -58 32 373 -441 515 -417 212 -180 161 -18 -142 130 -442 250 -454 403 -28 86
5205 86 144 -6 385 -152 378 -370 423 -243 242 94 -74 553 -506 508 -234 346 -324 -220 200 -316
5225 -316 407 -348 265 -268 287 -554 -367 -109 -379 435 -316 110 -497 164 -184 21 -152 -23 394 -435
5245 -435 493 -408 227 131 133 197 -268 432 -596 248 -277 423 -21 -453 273 -424 453 -312 755 -288
5265 -288 259 12 11 306 -309 509 -307 491 -393 470 176 -217 90 -322 602 -411 453 -571 -147 2
5285 2 -15 173 -205 386 -279 596 -232 216 74 -262 330 -358 476 -542 277 -350 346 220 37 243 -697
5306 -697 423 -570 441 -319 14 -67 -415 200 -419 372 -633 204 -42 -97 271 -100 90 -405 501 -366
5326 -366 104 -222 -45 257 -458 278 -558 474 -117 626 -1 171 202 -177 369 -623 353 -223 381 -28
5346 -28 -13 -44 -211 731 -492 534 -194 232 -6 -184 -75 -195 428 -422 493 -362 243 -20 -169 180
5366 180 -478 538 -365 310 -381 208 143 -437 243 -422 308 -213 372 -474 206 83 -231 164 -585 564
5386 564 -563 250 -219 -10 146 -26 280 -283 478 -674 146 -266 21 16 -400 61 -356 268 -383 476
5406 476 -38 -75 175 -698 266 -89 387 -354 305 -28 183 52 -225 443 -406 458 -314 331 -171 -74 178
5427 178 -113 406 -411 618 -275 198 66 91 99 83 568 -463 393 -482 -71 52 -69 63 -507 463 -397
5448 -397 542 -352 235 243 -187 336 -628 604 -441 482 -204 -208 -65 -215 135 -552 527 -288 224 -316
5468 -316 230 -112 -297 187 -462 622 -748 315 -151 -156 101 -120 198 -478 258 -490 216 -172 -60 177
5488 177 -229 238 -357 318 -355 192 -66 81 33 -200 496 -466 277 -356 241 84 203 108 -139 380 -461
5509 -461 441 -276 81 77 -192 168 -170 279 -360 434 -386 178 -27 -219 160 -460 102 -294 170 -550 243
5530 243 -81 -251 26 -384 430 -409 370 -249 -60 -256 -167 208 -367 282 -411 263 -251 239 17 -186
5550 -186 373 -281 438 -345 423 -107 119 151 -334 361 -333 187 -66 313 -130 -42 -61 -83 639 -264 344
5571 344 -331 14 -62 97 184 -199 451 -412 588 -591 156 42 -156 84 -155 211 -389 585 -272 225
5591 225 -22 -246 373 -120 180 -329 430 -339 172 103 -57 383 -124 553 -308 304 -210 229 -61 -176
5611 -176 94 -600 553 -347 233 -237 74 42 -36 447 -209 384 -548 391 -85 -55 46 -77 221 -301 470
5632 470 -338 421 -257 347 366 -272 135 -208 393 -109 116 -412 18 199 -50 228 -381 357 -469 241
5652 241 85 3 -64 -27 228 -289 467 -466 319 -21 -42 67 -161 64 -402 118 -293 317 -51 62 148 -368
5674 -368 365 -269 48 -126 351 -71 102 73 -196 173 -303 331 -45 384 -268 31 82 -231 292 -401 290
5695 290 -128 60 -191 308 41 -335 363 -385 294 -194 148 -115 -35 228 18 532 -343 507 -264 197
5715 197 -74 -210 138 -436 92 -205 183 -271 215 260 120 430 -346 323 -328 294 -337 324 52 72 481
5736 481 -176 457 -635 243 -248 38 164 -219 82 -197 350 -557 545 -215 97 58 -435 -64 -249 455
5756 455 -541 486 -112 273 -66 -50 496 -136 354 -329 17 -55 102 48 -174 396 -347 387 -173 -130 -240
5777 -240 72 102 3 259 -638 262 -481 277 -143 -3 -31 -336 73 -187 348 -203 263 -99 4 71 -108
5798 -108 143 -269 95 -349 327 16 -150 367 -282 308 -373 427 -415 212 27 36 225 -529 293 -433 318
5819 318 -65 -24 50 -22 26 -374 201 -264 186 -455 269 41 84 309 -256 321 -280 40 -201 -44 -200 -310
5841 -310 210 -334 214 -210 70 -173 104 86 -25 334 -433 582 -89 -33 -39 60 29 -109 -3 -279 584 -306
5863 -306 377 -175 -69 321 -79 402 -153 483 59 308 10 49 253 -355 208 -321 51 27 395 -122 45
5884 45 -25 -259 420 -373 213 -266 296 -312 206 165 -143 110 -190 356 -232 176 -229 -166 122 -253 365
5905 365 -282 416 -240 -247 -141 -232 151 -362 223 -210 175 -244 -9 -10 -105 445 -275 308 -324 82 -241 1
5927 1 -83 -87 280 -260 392 -300 376 12 -28 -27 -255 372 -187 637 -468 224 -102 376 94 -211 166 -284
5949 -284 292 -263 201 -87 17 300 -199 196 -268 236 -39 230 -250 -127 318 -383 370 -301 640 13
5969 13 239 99 -47 -88 -214 410 -441 219 -349 -142 -168 -192 222 -252 119 -476 392 -149 -78 -64 241 82
5991 82 -325 98 -221 272 -378 70 -285 59 197 -11 404 -396 328 -31 160 -50 -155 -67 -410 279 -422
6012 -422 413 143 -55 60 -27 243 -142 349 -270 386 -404 33 87 -369 470 -306 376 -106 279 -316 -39
6033 -39 32 -504 351 -202 437 -167 206 -222 228 -22 -434 280 -188 361 -178 181 -240 95 41 -61 389
6054 389 -504 333 -475 383 -291 -170 278 -419 230 -504 171 -166 200 -112 -82 73 -484 442 -362 191
6074 191 -352 162 -34 38 204 -551 182 -329 302 -258 133 108 -302 251 -277 299 -492 207 -161 68 8
6095 8 -168 354 -169 233 -233 390 -361 103 57 -231 267 -380 324 -366 439 -263 145 195 -129 108 -584
6116 -584 455 -617 181 -173 275 264 -14 371 -232 387 -234 95 -50 148 -2 -37 339 -219 221 -387
6136 -387 269 -130 -81 200 -269 375 -339 239 -462 266 50 -126 133 -108 168 -299 205 -41 141 -133
6156 -133 73 62 -537 403 -335 -4 -159 205 83 60 -154 -83 390 -367 209 -211 156 72 -409 228 -273
6177 -273 344 -136 324 -244 252 240 -175 314 -376 397 -71 497 -192 54 -262 78 238 -61 472 -243
6197 -243 204 -268 161 70 -126 -24 -112 308 -359 170 -129 277 -197 -165 201 -338 288 -326 68 -338 59
6218 59 52 -239 132 -335 332 -300 184 -181 125 -147 -552 -53 -359 95 -375 27 -380 33 244 -55 234
6239 234 -296 446 -268 261 -93 -117 281 -238 146 -101 290 -298 26 -45 -60 287 -59 138 -185 -8 -170
6260 -170 128 -169 135 137 -215 347 -44 228 -374 -78 66 -183 -88 -32 196 -278 285 -233 -12 -313 66
6281 66 334 -77 116 -360 211 -291 -28 11 -269 177 -311 176 -200 320 -238 -54 306 -175 -108 -15 -11 -366
6303 -366 105 -206 -112 32 -343 344 -30 -25 -268 208 53 -11 24 -158 253 -115 216 17 182 135 64 -19 -82
6326 -82 214 -184 243 -44 96 -81 28 257 -156 149 -386 187 -119 156 18 -48 176 -168 426 -346 169
6347 169 -347 91 -184 -380 288 -362 398 -75 299 104 -6 52 -251 61 -204 280 -172 42 -269 175
6367 175 -186 69 356 -49 226 -264 342 37 115 239 -211 83 -85 64 -125 234 -170 141 227 -80 246
6388 246 -523 589 -177 -11 -226 -27 -132 36 145 -189 252 -198 278 -160 -100 154 -113 293 2 350
6408 350 -250 24 -119 -46 130 -270 181 -284 259 -132 279 30 -101 -297 -291 155 -638 424 -22 249 85
6429 85 -174 214 -258 257 -167 199 -243 115 137 2 33 -88 167 -241 263 -153 50 -60 -159 39 -50 194
6451 194 -143 332 -92 -60 -101 -31 49 19 296 -304 -29 -204 -54 -152 -100 41 -207 150 48 191 112 -44 74
6474 74 48 132 -246 66 -287 227 -133 154 175 -372 208 20 388 -293 241 -115 -35 3 -423 291 -67 300
6496 300 -411 206 -108 -63 144 -227 402 -321 351 -125 -55 63 7 -157 -258 172 -374 131 -174 243 -76
6517 -76 -45 17 -56 111 -227 410 -196 24 -253 28 -73 -53 397 -246 107 -162 23 -48 -163 11 -234 -245
6539 -245 -125 86 -66 136 99 -98 190 -56 244 -116 137 69 71 -62 154 58 -422 414 -542 334 -29 319
6561 319 113 8 176 -195 180 -154 2 -148 80 -244 229 382 -156 323 -126 76 -338 28 27 -290 155
6582 155 -250 99 -204 149 -373 30 137 -61 87 -245 478 -145 202 -62 -222 -3 -317 71 -288 318
6602 318 -426 -75 -6 -134 71 -79 -4 -122 78 -107 305 -33 -51 -88 -266 333 -151 117 -52 4 -120 50
6624 50 220 -196 170 -66 51 -58 247 144 -52 -105 -152 477 -221 101 -208 -125 -323 23 439 -129 252
6645 252 -188 376 -116 295 120 -98 143 -371 404 -173 255 -109 141 -77 -22 313 -199 186 -159 67
6665 67 86 -46 32 -42 116 -281 317 -161 169 -300 -198 -8 -147 -12 -176 85 -327 222 -19 -86 51 -155
6687 -155 222 -34 215 35 156 -93 -137 39 -264 196 -275 96 -118 460 -108 -55 -130 -415 525 -73 194
6708 194 -363 -36 -189 150 92 143 134 -62 86 -126 244 -97 127 283 -173 38 -3 203 -225 81 -140 -134
6730 -134 -34 -176 309 -118 283 -46 -130 -37 -101 171 -421 119 -547 240 -128 -27 45 -161 11 -356 324
6751 324 -57 325 -108 133 -81 -46 297 -46 212 -226 318 -45 -112 26 -377 215 -162 367 -403 133 24
6772 24 23 41 15 70 -269 392 -181 101 -184 149 -311 -240 226 -279 238 -159 160 -42 -17 -46 -50 -1 -382 287
6796 287 -85 164 13 -160 309 -284 -8 103 136 44 18 -17 -74 68 -68 82 -192 74 -349 51 -106 -90
6818 -90 135 -255 31 -384 -33 106 363 -2 -388 -36 -26 315 -59 56 -180 100 -185 -97 56 -263 88
6839 88 -342 43 -286 -66 -8 148 228 -243 152 7 103 53 178 -79 -184 71 -204 242 -270 166 -63 36
6861 36 150 143 311 -12 198 -115 256 -3 -58 253 46 -109 -29 98 -107 -158 -17 283 234 -221 -50 -244
6883 -244 245 -410 -9 -127 -188 386 137 107 -240 295 -24 -58 -70 19 32 -162 332 -207 421 -229 -27 124
6905 124 -78 204 -207 162 -305 -69 -147 215 166 -225 -16 1 103 -262 101 -114 -45 82 -18 160 -529
6926 -529 105 -192 123 -73 298 120 -138 231 -35 180 -322 107 -167 289 -85 -249 170 -201 115 -53
6946 -53 174 68 97 134 -163 235 -390 203 -166 222 -177 -5 208 -132 65 -21 252 -75 -38 -158 5 98
6968 98 -34 47 -394 -12 -201 -86 21 130 204 18 205 -252 241 -209 132 -108 23 110 -167 34 -196
6989 -196 156 -208 59 -43 -90 74 -130 35 -25 56 -110 -16 221 -101 77 -322 141 45 116 -192 -56 6
7011 6 -44 290 -287 225 70 151 -212 -198 -93 -237 100 -194 123 -255 252 -68 185 29 -76 28 44 -1
7033 -1 -260 -72 9 265 -276 -253 240 -99 219 -148 133 -35 378 54 -226 216 -16 -3 -142 151 86 -151
7055 -151 135 120 29 -265 71 50 92 -118 217 261 -264 61 -111 146 -181 -138 -46 -174 85 -186 170 -269
7077 -269 109 -69 -111 82 -106 -43 -176 131 -211 64 100 70 -55 45 141 2 233 -133 -42 51 168 -81
7099 -81 -133 -66 -227 20 -266 367 -89 133 -7 -10 132 -284 17 -296 -8 -353 -26 -9 28 159 -216 144
7121 144 -239 137 -28 64 -118 -31 176 -124 175 -368 136 -149 -276 108 14 -8 -221 -8 -60 121 -148 135
7143 135 -5 44 294 -366 105 -323 69 -236 -214 5 40 242 -120 286 -293 -227 128 238 0 -200 50
7164 50 -282 237 -109 52 -104 -81 43 -222 -71 -358 185 -169 294 -29 138 -132 -156 113 -129 240 -126
7185 -126 42 -298 75 162 -331 45 -46 74 -130 171 -97 -205 324 -140 147 -184 278 -173 -152 41 -63
7206 -63 80 -112 87 -208 18 139 5 83 -113 74 -140 152 -366 157 -254 93 161 -259 -34 -321 -76
7227 -76 19 92 -186 159 1 7 186 -260 196 -155 68 -162 29 -52 -49 85 -386 290 -419 221 107 57 147
7250 147 -55 157 -281 347 -187 -124 -1 148 -232 -321 548 -202 353 -130 128 -324 -119 401 -81 -120 -206
7271 -206 182 -89 5 -99 38 145 -191 161 -256 302 -136 -188 -55 -144 -60 -117 15 -160 -129 -175 235 228 -266
7294 -266 -17 -148 23 -87 118 -293 39 -36 -45 359 -356 221 -148 323 -42 342 -77 189 203 -80 100
7315 100 -85 234 -1 97 101 209 110 -184 108 -191 264 -219 104 73 -34 148 -80 23 -308 107 94 -244
7337 -244 -23 -301 60 -195 116 -55 19 -195 -22 82 -41 178 -55 17 -278 249 -67 -202 40 -10 225
7358 225 -164 208 31 122 -103 70 25 -124 165 -111 52 -88 50 122 143 40 -229 256 7 97 -55 9
7380 9 -85 45 89 -109 384 -245 -5 -273 116 91 -108 27 -51 126 151 57 18 -65 -193 159 48 -13 86 -233
7404 -233 157 -307 -11 92 -208 64 -119 172 -33 71 -64 92 87 -193 221 -395 181 -20 -13 -189 195
7425 195 72 102 3 -397 108 -199 3 32 -113 93 55 211 -192 -56 -104 -139 -11 -197 367 -185 43 -94
7447 -94 348 -374 38 61 -96 281 -220 355 -265 251 11 209 -172 -141 10 -179 103 -64 291 2 -5 -83
7469 -83 -30 183 -251 -43 -253 6 -88 -298 -87 -119 90 -127 109 -151 213 11 -167 169 302 -181 -230 -61
7491 -61 117 320 -329 -116 -56 -88 49 -303 239 -200 207 142 -7 -15 -61 96 -345 372 -53 126 58 12 167
7514 167 -325 228 -197 150 -244 133 -228 -309 2 -229 243 -104 0 -176 -40 26 -53 -73 121 -74 -101 66
7536 66 -317 208 58 -30 11 -75 27 -54 17 -133 33 80 93 94 -276 -159 68 232 -300 -58 -150 134 -170 -61
7560 -61 23 180 39 -170 115 -75 -259 115 17 -50 -415 239 -252 40 78 93 239 -202 54 -30 133 -132
7582 -132 109 80 72 -63 -220 -32 -1 -53 -68 49 -87 62 65 -53 76 131 -122 9 23 -45 82 -88 0 156
7606 156 -48 185 6 -358 15 -94 366 -181 69 -189 56 -194 126 288 2 252 -192 233 10 -297
7626 -297 -22 -289 80 -46 -46 3 24 -175 35 4 38 -85 -193 57 -163 110 36 184 162 103 182 -29 14 -77
7650 -77 -61 -56 -28 121 -127 -74 -131 229 -17 -71 -147 259 -43 14 137 2 188 -3 -67 -3 166 -246 30 150
7674 150 46 258 -276 -65 239 -33 -149 75 295 -130 81 -474 -57 -98 -260 130 -245 103 -168 20
7694 20 -179 -22 -171 -30 -216 -55 -52 -102 -63 -208 -147 -19 190 -57 -230 91 -104 62 -96 318 32 -96
7716 -96 114 -15 106 -105 121 104 -175 -6 -51 -20 32 -32 -43 -12 -144 -222 -125 116 301 -183 -10 -29 335 -135
7740 -135 84 -149 -115 188 -198 244 -283 -37 -18 210 108 -35 -128 -338 -38 -211 -56 9 67 65 -150 -232 -121
7763 -121 -247 66 85 -75 142 -155 86 93 -166 -94 12 51 -142 44 53 -332 -14 -8 25 22 -6 -5 -40 229 -1
7788 -1 -84 -97 121 -181 115 14 -19 -90 -346 81 -23 141 -11 -253 -59 -204 72 -368 -92 -39 83 -41
7810 -41 61 -342 -45 -38 -174 243 -94 -79 145 162 -53 112 -67 140 348 -92 195 -310 -51 96 -60 -22
7832 -22 25 6 -29 385 -110 -114 -179 -95 -14 150 44 -52 116 -51 -103 -171 -140 265 -186 -33 -419 37 27 84 18
7857 18 -84 164 -102 193 -223 264 -171 205 137 98 264 -231 55 -202 168 -99 108 25 -224 9 -266
7878 -266 -104 -116 203 40 224 -195 -222 150 -524 94 -93 36 147 72 0 -195 511 28 -46 -212 10 -169
7900 -169 49 52 -98 359 9 187 -221 163 106 -174 19 -108 151 -49 162 -89 -16 245 13 53 99 128
7922 128 85 -73 -145 124 -106 27 90 -220 -71 -27 94 38 16 96 -70 105 -105 284 99 175 -130 191 295
7945 295 89 -18 -23 26 -371 225 98 2 82 -50 -79 -92 279 -13 37 109 -285 55 318 27 -31 -8 -187 119
7969 119 13 319 94 -86 -141 8 63 -147 5 -43 33 156 76 73 75 54 134 -211 -225 82 -42 -83 191 -165
7993 -165 -94 -155 292 -88 -7 -80 -157 282 54 -114 18 -44 -76 -89 -102 -106 280 -96 335 102 193 9 67 -32 -71
8018 -71 11 -137 91 71 -301 -131 -135 -244 -150 -9 -126 380 108 205 163 -140 -49 -40 183 -136 53 -139 -4 157
8042 157 126 78 -295 64 -34 -185 -56 -225 99 -151 240 3 -56 38 -52 -212 -192 -102 -14 -13 -142 154 -234 270
8066 270 -108 -212 71 -77 78 -39 431 106 36 -25 41 -64 -135 121 -247 154 -223 94 -213 90 116 -179
8088 -179 83 -140 -96 173 114 -331 105 -89 -192 61 -83 105 -71 55 76 -16 -80 -67 -29 168 91 -191 98
8111 98 199 -33 -124 33 44 -305 149 48 120 -143 -38 147 -155 273 -1 165 -185 -63 -35 45 -13 -175
8133 -175 112 98 140 95 146 -61 191 98 35 126 115 224 -58 -147 115 -146 -136 -39 157 137 165 -45 174 87 -94
8158 -94 127 74 -61 -111 175 -44 -31 85 127 234 -119 0 -84 164 -158 143 -3 -135 122 -130 -135 69 136
8181 136 -83 50 -53 -127 41 -144 310 -169 -105 -52
8191e2
##END NTUPLES=NMR FID
##END=
