##TITLE=1H_Ser 5-4-i-H 
 CDCl3, 8 sc, 
 8.04.2021
##JCAMPDX= 6.0         $$ Bruker NMR JCAMP-DX V2.0
##DATA TYPE= NMR FID
##DATA CLASS= NTUPLES
##ORIGIN= UXNMR, Bruker Analytische Messtechnik GmbH
##OWNER= root
$$ XWIN-NMR		Version 3.5
$$ Thu Apr  8 11:28:22 2021 Russian Standard Time (UT+4h)  she@DPX200
##.OBSERVE FREQUENCY= 200.131506
##.OBSERVE NUCLEUS= ^1H
##.DELAY= (6, 6)
##.ACQUISITION MODE= SIMULTANEOUS
##.ACQUISITION SCHEME= undefined
##.AVERAGES= 8
##.DIGITISER RES= 18
##SPECTROMETER/DATA SYSTEM= spect
##.PULSE SEQUENCE= zg30
##.SOLVENT NAME= DMSO
##.SHIFT REFERENCE= (INTERNAL, DMSO, 0, 15.7039)
##AUDIT TRAIL= $$ (NUMBER, WHEN, WHO, WHERE, WHAT)
$$ ##TITLE= Audit trail, XWIN-NMR		Version 3.5
$$ ##JCAMPDX= 5.01
$$ ##ORIGIN= Bruker BioSpin GmbH
$$ ##OWNER= she
$$ F:/spectra/data/she/nmr/H-F/1/audita.txt
$$ ##AUDIT TRAIL=  $$ (NUMBER, WHEN, WHO, WHERE, WHAT)
(   1,<2021-04-08 11:27:10.01 +0400>,<she>,<DPX200>,
      <created by zg, POWCHK disabled, PULCHK disabled
       configuration hash MD5:
       00 E9 B6 7A A2 85 ED C7 34 08 36 98 17 FE 4E 26
       data hash MD5: 16K
       3D 49 29 8C 3C 87 F2 2E A6 E4 29 98 0C A6 E7 2B>)
$$ ##END=
$$ 
$$ hash MD5
$$ 60 66 B3 90 B4 28 2C 40 3E 9E AE 05 F5 CA 59 34
##$RELAX= 
##$RELAX= 
##$RELAX= 
##$RELAX= 
##$RELAX= 
##$RELAX= 
$$ Bruker specific parameters
$$ --------------------------
##$DU= <F:/spectra>
##$EXPNO= 1
##$NAME= <H-F>
##$PROCNO= 1
##$TYPE= <nmr>
##$USER= <she>
##$AMP= (0..31)
100 100 100 100 100 100 100 100 100 100 100 100 100 100 100 100 100 100 
100 100 100 100 100 100 100 100 100 100 100 100 100 100 
##$AQSEQ= 0
##$AQ_mod= 1
##$AUNM= <au_zg>
##$AUTOPOS= <>
##$BF1= 200.13
##$BF2= 200.13
##$BF3= 200.13
##$BF4= 200.13
##$BF5= 200.13
##$BF6= 200.13
##$BF7= 200.13
##$BF8= 200.13
##$BYTORDA= 1
##$CFDGTYP= 0
##$CFRGTYP= 5
##$CHEMSTR= <none>
##$CNST= (0..31)
1 1 145 1 1 1 1 1 1 1 1 1 1 1 1 1 1 1 1 1 1 1 1 1 1 1 1 1 1 1 1 1 
##$CPDPRG= <>
##$CPDPRG1= <>
##$CPDPRG2= <>
##$CPDPRG3= <>
##$CPDPRG4= <mlev>
##$CPDPRG5= <mlev>
##$CPDPRG6= <mlev>
##$CPDPRG7= <mlev>
##$CPDPRG8= <mlev>
##$CPDPRGB= <>
##$CPDPRGT= <>
##$D= (0..31)
0 1.2 0 0 0 0 0 0 0 0.06 0 0.03 0 0 0 0 0.0002 0 0 0 0 0 0 0 0 0 0 0 0 
0 0 0 
##$DATE= 1617866829
##$DBL= (0..7)
120 120 120 120 120 120 120 120 
##$DBP= (0..7)
150 150 150 150 150 150 150 150 
##$DBP07= 0
##$DBPNAM0= <>
##$DBPNAM1= <>
##$DBPNAM2= <>
##$DBPNAM3= <>
##$DBPNAM4= <>
##$DBPNAM5= <>
##$DBPNAM6= <>
##$DBPNAM7= <>
##$DBPOAL= (0..7)
0.5 0.5 0.5 0.5 0.5 0.5 0.5 0.5 
##$DBPOFFS= (0..7)
0 0 0 0 0 0 0 0 
##$DE= 6
##$DECBNUC= <off>
##$DECIM= 32
##$DECNUC= <off>
##$DECSTAT= 4
##$DIGMOD= 1
##$DIGTYP= 9
##$DL= (0..7)
0 120 120 120 120 120 120 120 
##$DP= (0..7)
150 150 150 150 150 150 150 150 
##$DP07= 0
##$DPNAME0= <>
##$DPNAME1= <>
##$DPNAME2= <>
##$DPNAME3= <>
##$DPNAME4= <>
##$DPNAME5= <>
##$DPNAME6= <>
##$DPNAME7= <>
##$DPOAL= (0..7)
0.5 0.5 0.5 0.5 0.5 0.5 0.5 0.5 
##$DPOFFS= (0..7)
0 0 0 0 0 0 0 0 
##$DQDMODE= 0
##$DR= 18
##$DS= 0
##$DSLIST= <SSSSSSSSSSSSSSS>
$$ [...]
##$SUBNAM2= <"">
##$SUBNAM3= <"">
##$SUBNAM4= <"">
##$SUBNAM5= <"">
##$SUBNAM6= <"">
##$SUBNAM7= <"">
##$SUBNAM8= <"">
##$SUBNAM9= <"">
##$SW= 16.9725357007746
##$SWIBOX= (0..15)
0 0 2 0 0 0 0 0 0 0 0 0 0 0 0 0 
##$SW_h= 3396.73913043478
##$TD= 16384
##$TD0= 1
##$TE= 0
##$TE2= 300
##$TE3= 300
##$TEG= 300
##$TL= (0..7)
0 120 120 120 120 120 120 120 
##$TP= (0..7)
150 150 150 150 150 150 150 150 
##$TP07= 0
##$TPNAME0= <>
##$TPNAME1= <>
##$TPNAME2= <>
##$TPNAME3= <>
##$TPNAME4= <>
##$TPNAME5= <>
##$TPNAME6= <>
##$TPNAME7= <>
##$TPOAL= (0..7)
0.5 0.5 0.5 0.5 0.5 0.5 0.5 0.5 
##$TPOFFS= (0..7)
0 0 0 0 0 0 0 0 
##$TUNHIN= 0
##$TUNHOUT= 0
##$TUNXOUT= 0
##$USERA1= <user>
##$USERA2= <user>
##$USERA3= <user>
##$USERA4= <user>
##$USERA5= <user>
##$V9= 5
##$VALIST= <valist>
##$VCLIST= <CCCCCCCCCCCCCCC>
##$VD= 0
##$VDLIST= <DDDDDDDDDDDDDDD>
##$VPLIST= <PPPPPPPPPPPPPPP>
##$VTLIST= <TTTTTTTTTTTTTTT>
##$WBST= 1024
##$WBSW= 4
##$XGAIN= (0..3)
0 0 0 0 
##$XL= 0
##$YL= 0
##$YMAX_a= 101204
##$YMIN_a= -96623
##$ZGOPTNS= <>
##$ZL1= 120
##$ZL2= 120
##$ZL3= 120
##$ZL4= 120
##$ABSF1= 10
##$ABSF2= 0
##$ABSG= 5
##$ABSL= 3
##$ALPHA= 0
##$AQORDER= 0
##$ASSFAC= 0
##$ASSFACI= 0
##$ASSFACX= 0
##$ASSWID= 0
##$AUNMP= <proc_1d>
##$AZFE= 0.1
##$AZFW= 0.1
##$BCFW= 1
##$BC_mod= 2
##$BYTORDP= 1
##$COROFFS= 0
##$CY= 11.3945322036743
##$DATMOD= 1
##$DC= 2
##$DFILT= <>
##$DTYPP= 0
##$F1P= 15.9154993809931
##$F2P= -4.1035820241983
##$FCOR= 0.5
##$FTSIZE= 0
##$FT_mod= 4
##$GAMMA= 1
##$GB= 0.15
##$INTBC= 1
##$INTSCL= 1
##$ISEN= 128
##$LB= 0.24
##$LEV0= 0
##$LPBIN= 0
##$MAXI= 10000
##$MC2= 0
##$MEAN= 0
##$ME_mod= 0
##$MI= 1.114404
##$NCOEF= 0
##$NC_proc= 0
##$NLEV= 6
##$NOISF1= 3.799351
##$NOISF2= 2.8
##$NSP= 1
##$NTH_PI= 0
##$NZP= 0
##$OFFSET= 15.70392
##$PC= 1
##$PHC0= -11120.96
##$PHC1= 15.00092
##$PH_mod= 1
##$PKNL= yes
##$PPARMOD= 0
##$PSCAL= 0
##$PSIGN= 0
##$REVERSE= no
##$SF= 200.130013532006
##$SI= 16384
##$SIGF1= 3
##$SIGF2= 2
##$SINO= 400
##$SIOLD= 16384
##$SREGLST= <1H.CDCl3>
##$SSB= 0
##$STSI= 0
##$STSR= 0
##$SW_p= 3612.71676300578
##$SYMM= 0
##$S_DEV= 0
##$TDeff= 0
##$TDoff= 0
##$TI= <>
##$TILT= no
##$TM1= 0
##$TM2= 0
##$TOPLEV= 0
##$USERP1= <user>
##$USERP2= <user>
##$USERP3= <user>
##$USERP4= <user>
##$USERP5= <user>
##$WDW= 1
##$XDIM= 8192
##$YMAX_p= 0
##$YMIN_p= 0
$$ End of Bruker specific parameters
$$ ---------------------------------
##NTUPLES= NMR FID
##VAR_NAME=  TIME,          FID/REAL,        FID/IMAG
##SYMBOL=    X,             R,               I
##VAR_TYPE=  INDEPENDENT,   DEPENDENT,       DEPENDENT
##VAR_FORM=  AFFN,          ASDF,            ASDF
##VAR_DIM=   8192,          8192,            8192
##UNITS=     SECONDS,       ARBITRARY UNITS, ARBITRARY UNITS
##FACTOR=    0.0002944,     1,               1
##FIRST=     0,             0,               0
##LAST=      2.4114304,     0,               0
##MIN=       0,             -96623,          0
##MAX=       2.4114304,     101204,          0
$$ Real data points
##PAGE= N=1
##DATA TABLE= (X++(R..R)), XYDATA
0 0 0 0 0 0 0 0 0 0 0 0 0 0 0 8 -8 8 -8 8 -16 16 -16 24 -24 32 -34 40 -48 56 -64 72 -82 95 -106 120 -136
35 -136 154 -171 193 -214 240 -265 296 -328 361 -399 439 -485 534 -587 649 -713 786 -867 956
54 956 -1059 1173 -1304 1457 -1634 1845 -2101 2418 -2821 3355 -4095 5190 -6971 10320 -18706
69 -18706 80614 101204 -96623 64049 24829 -32250 73090 -10733 -21574 91176 -36635
80 -36635 -9531 61761 -35585 26375 25995 -38436 40645 5958 -28881 47489 -19269 -28456 56932
93 56932 -29630 -4273 31347 -39447 14688 16308 -42449 27345 20733 -42623 10250 -6214 -3077
106 -3077 25845 -34866 813 18983 -29565 5329 10315 -27772 18750 -4827 -29539 30166
118 30166 -19424 -15058 25726 -29722 -4902 27842 -32303 -2769 19222 -33778 15191 3687
130 3687 -25417 23475 -13290 -17964 23179 -15931 -4928 25656 -32018 2505 21905 -27614
142 -27614 19121 926 -24928 27195 -2816 -21589 26542 -11748 -8569 26260 -27364 8759
154 8759 20031 -30413 13266 9663 -19431 18115 -5427 -16432 28256 -21682 -6606 28654
166 28654 -26945 3345 12751 -22863 13728 3542 -23552 22770 -9964 -20586 31218 -19582
178 -19582 -9154 18697 -22693 5498 10918 -27027 13237 4930 -28799 22510 -6766 -18410
190 -18410 19943 -18571 -4302 17108 -22560 815 14979 -26737 8860 5328 -20301 19555
202 19555 -11894 -13987 22672 -13233 -9590 20571 -16591 -1177 16544 -22274 13121 7232 -19920
215 -19920 16481 163 -11900 18223 -6876 -9893 21012 -12232 3235 14297 -18938 13823
227 13823 7260 -15824 16668 3756 -13393 20430 -6989 -8082 26198 -13974 617 17072
239 17072 -13716 9073 11706 -15584 13444 8177 -14652 19365 -4157 -6595 18526 -12191 1025
252 1025 14463 -12684 4759 8242 -19440 14183 3347 -17998 16433 -9626 -10334 15033 -13944
265 -13944 -7237 14122 -17852 -2323 8791 -21673 9237 -217 -19453 10578 -4961 -10950 9612
278 9612 -12301 -6519 13925 -16972 2747 7881 -17603 11792 -168 -13058 15631 -1430 -11571
291 -11571 16440 -7654 -2449 19180 -14236 4907 12392 -10963 9271 6466 -9401 12728 1867
304 1867 -8934 16662 -5913 -871 12754 -11230 6319 9692 -10837 6631 5342 -12118 13966
317 13966 -502 -10138 15676 -8109 -3237 12048 -8832 612 10009 -12518 3897 7249 -12195
330 -12195 10672 -2859 -8907 11049 -5522 -4381 8057 -9141 -1131 8505 -14436 5161 3350
343 3350 -14694 7736 -3480 -9345 8614 -6733 -10363 9303 -9324 -4020 8189 -14937 2342
356 2342 3165 -11556 4683 -211 -8193 7009 -4499 -6954 13174 -8304 -1149 8032 -9081 6847
370 6847 5589 -8731 7900 4918 -8746 12399 23 -4791 13080 -5768 923 9934 -4627
383 -4627 3617 6753 -8402 7255 6087 -7812 9878 -3323 -2597 10004 -7003 -624 8975 -7982
397 -7982 -484 7136 -9647 5807 1424 -9953 7733 -3094 -5310 7313 -5102 -6617 7524
410 7524 -5418 -1336 4046 -9953 5122 -180 -8915 5281 -244 -6991 3285 -4455 -3726 7162
424 7162 -10483 -513 4422 -9382 2318 942 -7793 3382 38 -8686 6783 -4141 -4786 7774
438 7774 -7979 -1634 5891 -4135 -269 1548 -5303 5404 813 -6645 8007 -3259 -1703 6363
452 6363 -4017 2281 4976 -5457 4276 5616 -7104 8338 1937 -5914 9074 270 -1554 6568
466 6568 -1018 -11 7625 -4130 2641 6693 -4314 4501 -254 -42 5964 -2477 -1560 5837 -4015
481 -4015 -606 6856 -7237 1221 1525 -5969 4246 -1794 -7766 3539 -323 -9523 3097 -2101
495 -2101 -5617 -363 -5645 176 -1777 -6700 -782 -54 -6621 -516 -1759 -3403 2700 -7455 -1153
510 -1153 4207 -5808 -388 3769 -5109 -467 4610 -3889 4442 6 -3661 6999 1167 -1459 3680
525 3680 1966 1057 4072 -1333 5624 3453 -4353 7697 1919 -1174 5650 880 321 5631 -2182
540 -2182 1347 8291 -5109 2791 5039 -3505 3473 2286 -974 2495 -139 -1348 6060 -2070 -823
555 -823 2530 -3161 3939 757 -3802 1774 489 -3210 2839 -1845 -3190 4074 -4354 -979 999
570 999 -3108 398 -527 -3940 -86 872 -4382 765 -1997 -1689 267 -3641 864 288 -3408 -1097
586 -1097 1390 -3131 1648 622 -3809 2605 -426 843 1842 -2014 -192 4941 -892 -1039 4351 -1242
602 -1242 2256 1271 -592 3650 1631 -807 2321 2003 -874 3923 -599 1000 2724 -2370 2364 1486
618 1486 -1841 1347 1513 -2494 2614 427 -1663 3293 -4010 223 3663 -2407 -1947 1272 -885 683
634 683 590 -2995 2993 -1412 -1658 1882 -1501 719 131 -1743 148 730 -2544 2343 -1073 -3254 2795
651 2795 -2196 -1128 821 -2568 -1850 910 -3049 -1154 1290 -4010 -345 -1381 -771 243 -2661 -1660
667 -1660 -270 -452 -1259 408 -2195 1087 12 -2000 2428 -529 -689 1596 186 -761 3476 606
683 606 -249 3279 -581 1840 2175 987 1094 2032 796 1330 2641 -115 2635 66 732 1893 286
700 286 1549 193 -412 1130 1768 -2049 1290 -136 -1969 1780 -1531 -742 761 -1253 -2058 684
716 684 -1699 -815 641 -3055 -144 -762 -1035 -304 -1759 -1192 -224 -998 -906 910 -2378 222 -379 -2538
734 -2538 1762 -728 -1110 -111 -195 -1238 1665 -1060 -995 1563 -1414 1225 -44 173 587 388 -265 800
752 800 772 -80 1815 -1355 1401 1465 -480 1418 417 435 1394 1893 -844 2227 714 236 1915 212
770 212 1557 1040 951 36 1146 872 795 1007 -612 1424 -174 970 136 -780 165 233 -536 -520 990
789 990 -1833 -344 -889 -1594 176 -1332 -1818 -1275 -180 -1875 -145 -1320 -1663 -244 -1487 -381 -1409
806 -1409 -386 -1078 -682 -789 -351 -203 -969 677 -1989 825 768 -1236 648 460 206 -180 1147 -665
824 -665 1590 258 -487 1405 521 1059 -21 873 108 827 586 842 -126 -399 2016 -913 960 627
842 627 -187 1011 138 -249 822 1450 -1561 1152 204 -91 846 -125 705 -457 517 100 565 -358 -38
861 -38 119 -113 802 -1168 1228 -467 -1552 752 516 -797 -832 75 -1161 592 -1582 -937 500 -1432
879 -1432 -1237 -965 185 -1163 -957 -869 -610 -937 -767 291 -1893 217 -983 -299 178 -691 -437 176
897 176 338 -1458 1361 471 -353 267 641 765 -16 883 21 1487 757 496 1045 747 861 333 1983
916 1983 239 814 851 1204 68 340 2313 96 856 213 409 1257 588 -325 233 1052 -1350 1346
934 1346 -97 -606 250 -407 388 -639 -286 -259 -71 -1211 290 -554 -1056 339 -1894 235 49 -1885
952 -1885 -410 601 -1645 -1086 -24 -1490 660 -1551 -1594 -131 -1204 -334 -640 -858 -1219 -357 -931
969 -931 719 -1634 -995 1579 -1614 60 561 -195 204 606 -650 827 971 -1050 1676 325 408
986 408 963 602 1296 804 436 849 1771 207 1620 534 237 1795 159 1285 753 -378 382 1920
1004 1920 -418 -269 858 -756 642 -77 -22 -19 -250 -940 -280 105 -1437 415 -997 -594 -873 -594
1022 -594 150 -859 -528 -589 -133 -1426 515 -560 -1156 446 -1777 181 535 -1187 -807 757 -898
1039 -898 120 551 -1590 1047 -349 -411 784 -470 -353 703 -220 -264 797 -1094 1327 -292 -1465
1056 -1465 1944 -954 -74 1163 -399 -427 1304 -1124 720 1439 -1789 1426 394 -210 1238 -126
1072 -126 -308 1482 430 186 1228 -922 1583 773 -522 1290 -250 -66 1166 -243 -751 1867
1088 1867 -925 -232 1039 -1667 927 116 -1012 203 175 -1345 312 -52 -1377 596 -1601 -262
1104 -262 -225 -1169 -372 -781 -1161 -139 -87 -1964 613 -1247 -807 1088 -1338 -354 447 -964 -324 984
1122 984 -1488 460 730 -1407 1187 177 -135 1117 -312 -100 1464 -145 111 1401 -1105 1339
1138 1339 601 -541 1970 169 -423 1562 77 -377 2058 -798 474 1546 -1061 1463 659 -1080
1154 -1080 945 484 -794 1071 -157 -615 1366 -1719 693 926 -1213 670 -55 -1272 1162 -20
1170 -20 -1760 1368 -1328 -1141 1138 -1504 -672 398 -1502 -370 580 -1692 349 -438 -1677 831
1186 831 -1355 -570 242 -1535 -205 401 -1629 386 595 -2111 1312 -258 -1124 1694 -757 -483 1372
1203 1372 -342 -344 2110 -1187 709 1592 -1002 1647 2 -24 1290 356 -138 2078 -509 542 1945
1220 1945 -1386 1715 749 -1058 1304 416 -789 1681 190 -977 1898 -870 -131 1383 -1116 296
1236 296 329 -1331 384 422 -1478 908 -871 -1074 1390 -1565 -191 565 -1506 184 420 -1946 784
1253 784 -73 -2462 1536 -942 -1388 1380 -1330 -904 1082 -1010 -374 894 -1962 533 340 -1600
1269 -1600 1032 -573 -588 394 -821 -504 1230 -1452 -150 1191 -1735 1298 466 -1220 1264 288
1285 288 -1056 1961 -144 -838 2106 -829 511 1785 -688 1237 775 -617 1647 673 -921 1806
1301 1806 -591 -242 1758 -1257 793 1290 -1453 967 1083 -1284 1467 209 -1530 1807 -753 -495
1317 -495 1369 -1351 -293 1175 -1100 -80 548 -1927 855 -413 -1590 1288 -1088 -1041 543 -1384
1333 -1384 -514 1044 -1967 162 572 -2248 1365 -411 -1444 879 -541 -1165 1225 -1056 -773 1146
1349 1146 -1768 391 743 -1466 805 239 -541 1121 -336 -968 1506 -1106 -39 1692 -1455 917
1365 917 1117 -1260 940 642 -1143 1469 227 -887 2009 -474 357 1462 -717 567 1005 -789
1381 -789 1075 932 -1067 1608 -78 -548 1862 -974 -67 1254 -1019 -76 1458 -1501 591 775
1397 775 -1979 1435 -358 -1191 719 -976 -1113 941 -1407 -1057 398 -1685 541 -256 -1651 966
1413 966 -507 -1256 1115 -645 -1272 1363 -1453 -379 1097 -1922 753 800 -1306 830 297 -1063
1429 -1063 1447 -200 -830 1990 -1125 310 1448 -774 690 991 -632 1388 603 -1212 2040 -369
1445 -369 -577 2187 -1010 139 1178 -1027 487 1015 -1587 1160 808 -1279 1482 -289 -283 1123 -853
1462 -853 -122 920 -1144 360 750 -1678 1207 -232 -1100 1159 -845 -639 1038 -1194 -414 920
1478 920 -1613 51 1024 -1865 718 -255 -1358 1005 -295 -1271 907 -618 -609 979 -1595 138 383
1495 383 -1055 365 -145 -1064 940 -78 -1321 1425 -772 -392 1377 -1088 289 796 -632 561
1511 561 1066 -1170 788 449 -872 1745 -448 -251 1478 -445 239 953 -1018 772 1220 -981 1515
1528 1515 122 -1029 1607 -437 -153 1349 -662 62 1351 -1401 525 774 -1249 1129 -137 -975
1544 -975 973 -566 -499 922 -1137 -71 804 -1257 450 304 -1431 927 -270 -1042 708 -315
1560 -315 -927 1312 -1216 -136 848 -1149 28 205 -885 323 211 -989 911 -402 -624 980
1576 980 -982 -96 668 -1026 34 476 -1034 768 357 -1164 1306 -169 -560 1425 -476 81 1039
1593 1039 -519 336 1076 -690 1071 576 -886 1260 102 80 982 -51 159 1097 -616 148 931
1610 931 -858 1104 556 -873 958 -8 -909 840 -313 -704 1181 -1074 -296 775 -1346 413
1626 413 215 -1003 469 -288 -1147 722 -651 -559 899 -1223 24 307 -1260 154 -225 -1223 408
1643 408 -47 -1062 1106 -459 -614 919 -643 -67 568 -775 224 540 -902 819 57 -602 859
1660 859 -436 -112 801 -316 165 834 -837 583 674 -795 857 216 -764 944 -95 -286 1186
1677 1186 -187 -347 1034 -644 487 858 -795 519 121 -416 618 92 -538 826 -367 -108 597
1694 597 -1066 587 787 -1026 512 356 -783 575 -76 -817 884 -758 -429 402 -725 -143 316
1711 316 -570 -203 295 -1041 561 -318 -704 629 -569 -214 359 -767 -130 506 -960 287 383 -887
1729 -887 600 -348 -483 789 -188 -353 672 -219 -72 884 -370 231 532 -810 654 256 -199 861
1747 861 -192 -206 1190 -425 -3 950 -580 429 519 -602 420 364 -427 795 70 -460 731 -742
1765 -742 -142 284 -326 146 272 -410 193 222 -746 616 -224 -209 762 -576 -101 222 -531 -23 605 -840
1785 -840 160 228 -923 464 -316 -513 588 -547 -443 290 -198 -333 -1 -558 426 -169 -489 690
1803 690 -207 -557 364 -115 -500 471 -744 -15 567 -795 228 410 -467 385 414 -185 676 154 -17
1822 -17 784 -269 419 480 -158 329 288 -239 528 418 -489 1041 -93 -70 639 -294 196 362 -467 66
1842 66 416 -702 476 -68 -497 706 -365 -237 219 -394 -74 102 -514 -167 52 -788 413 -234 -427
1861 -427 233 -480 -384 139 -313 -241 337 -676 -173 209 -700 20 -39 -212 308 -101 -340 324 -92 -215 459
1882 459 -483 140 -52 -196 297 149 -346 385 365 -278 733 -446 -201 661 -288 93 363 -174 160 455
1902 455 -399 481 206 -233 495 56 -119 429 -109 70 493 -298 360 147 -414 63 -21 -344 500 -62
1922 -62 -131 351 -313 -215 339 -250 -6 165 -546 252 -98 -414 -65 -122 -297 133 -141 -153 511 -553 145
1943 145 -190 -576 236 -78 -296 268 -74 -492 447 -137 72 232 -468 12 106 -209 13 31 -359 141 -134
1964 -134 -112 406 -181 91 333 -167 -1 164 -109 197 363 -123 420 -13 -201 633 -15 -28 532 200 26
1985 26 235 -267 146 148 -228 295 184 -127 409 -128 94 331 -291 194 451 -459 350 -94 -269 76 60
2006 60 -450 163 55 -432 201 -406 -227 -72 -369 -115 159 -236 -40 -38 -375 183 -279 -221 -54 -377 218
2027 218 -71 -270 85 6 -368 -72 96 -338 372 -279 50 368 -146 -91 453 17 65 252 -277 312 78
2048 78 7 512 42 166 322 -34 96 339 48 285 298 -150 276 97 -142 180 484 -97 94 167 -230
2069 -230 289 -222 -151 51 -15 84 162 -434 -153 25 -435 259 -256 -79 175 -67 -128 -189 -75 50 139 -411
2091 -411 134 307 -140 295 -97 -202 116 -170 -19 288 -160 -152 231 -251 94 17 -134 109 -191 -60 56
2112 56 -298 -248 362 -233 131 72 -42 179 156 -11 297 379 -25 182 68 -40 292 -95 25 115 12 246
2134 246 279 149 -71 -5 78 302 -118 185 261 -35 234 306 30 -119 219 -457 -46 297 -198 327 -272 42
2156 42 -55 -139 172 -132 -287 -170 41 -303 72 -123 -268 -82 -384 -180 -13 1 14 -53 -282 6 141 -303
2178 -303 431 -272 -294 52 83 -94 -10 -245 -312 76 -127 310 -163 54 216 -129 149 341 -93 -244 247
2199 247 -159 241 93 -30 25 381 198 53 77 -7 257 378 230 194 49 467 234 -213 54 -187 8
2220 8 70 224 -118 127 -287 -20 172 -46 105 -318 22 -140 -41 -253 194 57 -316 83 -184 -255 -135 -142
2242 -142 -93 103 60 -129 -9 -410 -71 -204 -301 110 -224 117 86 -188 -123 -6 -407 -37 62 -124 247 98
2264 98 -67 -46 145 13 24 146 -73 -3 -52 389 -155 458 163 -49 12 -163 85 -118 259 -60 19 315
2286 315 -176 -125 230 -234 9 336 149 85 9 214 139 -76 25 -191 -54 -73 209 -89 -5 201 -103 317
2308 317 -103 -336 -205 -122 -314 -318 62 -194 32 -162 -102 -58 -39 128 -225 -4 -65 -101 -154 -128 -283 -51 -108 -269
2332 -269 345 25 63 -207 -349 -8 14 257 -52 129 -20 105 -26 -108 242 121 357 -100 257 14 -84
2353 -84 207 167 -35 114 121 -92 21 167 65 -43 -51 74 -97 164 -128 28 -18 -68 -45 388 102 -225 45
2376 45 -193 -92 140 -161 -154 26 29 29 -235 94 248 -235 3 90 -123 134 -157 -204 -10 -183 -141 -33 91
2399 91 -332 173 -331 8 -58 -117 -100 10 35 -15 -9 -68 -48 -111 143 186 -390 208 -1 55 73 -61 7 63 -29 31
2425 31 91 -112 109 65 86 89 -92 253 84 -77 162 -136 28 59 67 135 111 -101 72 -99 -72 -39 193 94 35
2450 35 24 -139 154 47 43 -179 -188 -1 -89 -63 -293 -12 -106 -176 -98 -258 -61 -32 -140 256 122 -293 30 -189
2474 -189 -159 -121 -325 9 -184 258 -73 -132 68 -93 65 19 88 -57 103 125 26 146 -360 -47 -200 144
2496 144 -12 -37 -47 167 330 -108 25 -123 111 145 240 256 306 -49 -72 -114 -2 80 385 -76 -92 -67 107 -90
2520 -90 145 -43 66 239 144 -74 -127 4 123 8 -98 5 -267 -75 79 -206 121 -366 -306 41 -259
2541 -259 72 11 -218 98 128 -481 -53 -99 -130 167 -250 -40 285 -161 -57 -45 -52 -96 167 -271 78 170 -42
2564 -42 -11 173 -31 187 -100 -231 5 -93 152 130 -206 556 318 -110 223 164 82 183 -32 -55 112 -10
2586 -10 -12 130 105 128 190 158 138 75 -202 332 -200 14 214 -32 -28 26 -312 15 233 -181 192 -89 -276 343
2610 343 -66 -100 195 -65 -243 132 -211 -164 55 -226 10 -13 -103 31 2 -311 54 85 -196 -194 -274 36 104
2633 104 -133 -105 42 -343 -123 -9 -236 26 -118 -168 99 -99 1 -193 17 -158 456 -171 76 -89 63
2654 63 336 -4 -12 79 -7 94 138 -104 -122 219 -54 173 167 -2 149 64 -132 168 211 165 197 -167 139 176 23
2679 23 405 97 66 142 -244 -96 71 -140 -75 419 -407 43 -185 -136 219 -92 -275 64 151 -273 -54 -356
2701 -356 -348 83 -231 -30 -85 -130 -33 125 -395 192 -106 10 376 -267 -285 24 -266 -10 29 -12 83 177 -115
2724 -115 119 -103 24 274 -86 90 341 139 176 212 -172 305 66 -20 137 -2 -37 197 -228 40 213
2745 213 -70 322 228 -343 219 -68 -148 183 10 89 282 -144 -276 11 -210 -130 43 -322 144 -164 -399
2766 -399 165 -78 -165 58 -172 -358 88 -512 -52 125 -246 124 -48 -198 218 -291 -31 102 -119 -73 -110
2787 -110 -212 113 117 -152 188 -5 -176 233 -100 -46 217 -93 -91 319 -9 -293 307 77 -4 295 -236 16
2809 16 182 -186 273 6 -156 245 219 15 242 -161 311 243 -353 208 100 -47 161 25 -203 359 -61
2830 -61 86 211 -437 -103 -44 -241 49 -157 -391 144 42 -52 279 28 20 181 -268 -112 -7 -207 104 10
2852 10 -319 122 -146 -305 270 -326 -1 236 -238 -217 83 -441 9 157 -25 -134 -124 -135 169 149 67 -16
2874 -16 -63 -22 208 -48 304 169 -115 211 -28 103 417 120 17 368 -73 105 628 -227 179 156 59 22
2896 22 272 193 6 -131 -288 371 -47 277 125 -233 -60 23 -103 -148 77 -406 290 184 -349 437 -61
2917 -61 -110 165 -175 -95 -57 -76 -128 177 -298 -40 -55 -104 54 -293 -86 -17 -132 -74 231 -225 76 41 -203 225
2941 225 -147 -297 -21 -192 -201 333 -362 -27 281 -307 112 46 116 13 -40 41 471 178 95 491 140 421
2963 421 152 27 276 129 84 66 54 -132 208 23 -253 91 -229 -157 386 -4 17 143 -84 241 -235 -115
2985 -115 37 -39 -59 116 -174 -143 40 -13 -34 226 -286 26 -18 -347 321 -58 -335 28 -94 -68 290 -274
3007 -274 30 92 -96 -164 -66 -340 95 -399 70 135 -79 -32 229 -178 148 -84 -238 255 246 -111 -22 135 -136
3030 -136 364 -27 -8 324 -114 -56 352 25 226 130 -51 268 35 -304 262 56 103 296 -43 189 210 -55
3052 -55 238 110 -301 96 -48 -252 149 -66 -349 75 122 -100 -139 -185 13 195 26 229 -193 -177 236 -283
3074 -283 -175 78 -65 -216 164 -472 180 36 -226 -220 -74 -413 323 -73 -119 291 -257 -215 204 77 -201
3095 -201 88 -130 46 60 -33 -6 -266 -163 356 -111 31 152 -228 170 174 -185 -85 158 -258 313 8 -75
3117 -75 -14 -128 342 179 -36 48 477 -76 24 133 -341 259 -130 32 350 -93 163 39 -173 33 245
3138 245 14 203 225 -37 -35 -56 -276 -77 155 -56 -26 -349 101 -140 -299 107 -113 -109 159 -46 -205 52
3160 52 -2 -278 215 -48 58 36 -29 -105 -106 -331 -110 218 -133 48 29 137 141 -173 53 173 185 -97 125 -33
3184 -33 288 -248 -330 218 -52 -27 113 247 40 272 -120 363 429 -61 165 1 -245 171 2 150 -21
3205 -21 29 47 174 -443 -16 182 -177 350 -129 -128 -7 -118 -217 354 -147 -39 -161 -73 52 184 -139 -32
3227 -32 -32 -267 -181 -70 -235 116 -195 -210 329 -79 -48 115 -258 32 5 -86 247 -145 11 -97 -145 -47 -198
3250 -198 -122 -219 -4 -196 -54 236 -99 6 -14 -26 387 82 -155 152 11 60 307 13 -38 293 -20 282
3272 282 44 -247 208 17 -93 219 95 102 500 -118 -3 170 -106 110 -202 -155 153 155 -90 29 -121 38
3294 38 49 -263 -106 114 -110 -111 68 -165 125 -15 -159 86 -98 -140 255 -16 -15 -17 -232 -14 -96 -267 -42
3317 -42 -19 -353 -66 -286 -26 55 65 -128 276 78 73 32 62 100 36 -110 -68 -3 -59 328 -58 -31 41 -277 191
3342 191 12 -207 93 177 171 13 209 -144 87 -151 89 303 162 69 240 105 147 90 -15 14 -47 88 186
3365 186 -135 59 -24 28 -165 212 -1 -169 141 -83 266 -323 -310 263 -188 -278 382 -80 -230 170 -158
3386 -158 -111 52 -443 -153 -207 -213 -21 115 -119 287 -175 -253 17 -265 98 155 7 156 -46 -282 132 96
3408 96 -217 221 -259 76 212 -89 107 60 -33 141 237 -274 159 -26 -32 67 -11 189 163 -10 -8 64 134 -53
3432 -53 237 198 -21 -37 -206 -178 -115 10 -17 88 284 -43 -361 127 -120 -360 246 -87 -196 23 139 -56
3454 -56 5 -66 0 -51 -93 -74 -74 -258 -36 -191 -50 256 -312 -225 321 -92 41 -201 12 273 80 -457 -249
3477 -249 88 -237 -156 -93 21 129 76 -169 126 -32 39 27 -15 220 151 41 182 -48 -235 138 -253 -220 347
3500 347 -48 172 38 -78 -61 48 5 211 -65 54 17 39 126 70 -97 39 10 -40 175 -33 63 74 -82
3523 -82 -179 54 -179 54 -99 -231 40 -91 -142 38 -51 59 -140 -283 -405 -87 -89 -56 0 -510 -52 42 131
3546 131 28 -17 -398 103 52 -248 77 -362 226 -114 13 150 91 -11 -7 409 -14 291 -80 -303 -181 -3
3568 -3 -49 202 281 58 280 -117 -40 45 215 172 113 48 182 270 36 227 208 -83 -5 -88 -43 -88 146 -12 72
3593 72 -118 252 126 -143 78 -74 120 -77 -81 137 318 212 -82 -162 32 -132 -115 -26 150 -457 70 -119
3615 -119 -26 -90 -3 92 35 -158 -42 26 -162 -97 5 -200 111 6 -104 -94 122 -141 148 -162 -83 146 8
3638 8 329 25 70 -235 110 -225 150 184 -7 -7 269 -53 193 -58 -183 197 30 -18 100 -74 128 51 0
3661 0 338 27 -53 -1 125 164 114 228 -226 -99 359 345 20 -143 36 244 -35 -274 115 -377 42 -12 14
3684 14 34 49 -226 -183 -92 -154 136 -160 220 72 -65 -41 -122 -58 -184 151 -222 40 -138 -200 -22 -314 151
3707 151 -108 3 -22 249 -50 -19 -332 -192 90 -115 -76 62 -30 328 114 -21 17 14 -108 266 272 26 -6
3730 -6 -51 -67 73 134 -151 57 -51 -137 24 -7 150 -123 -167 59 57 120 -183 192 -93 435 -181 -148 -118 -176 -58
3755 -58 -239 82 18 9 -99 49 -85 62 38 -119 -84 53 18 -156 142 -32 118 196 -9 -108 13 139 -101
3778 -101 -11 -152 -30 2 -30 133 -167 -31 -212 105 118 14 -95 -108 -79 -54 4 -41 225 334 185 50 -86
3801 -86 272 38 -23 -17 375 -142 194 205 108 70 -91 -95 -228 -95 106 20 60 103 -59 -290 -191 80 -78 123
3825 123 -270 -48 -75 -77 143 -206 116 10 -62 -356 -45 -110 18 55 54 160 -123 -56 108 62 -225 -34 -162
3848 -162 -2 2 -263 -104 -63 137 -227 23 9 -99 161 -7 20 -19 -216 50 4 183 72 -109 189 -8
3870 -8 39 -156 143 31 -60 -34 346 -12 155 216 -99 -97 60 9 34 155 -127 35 50 219 330 62 -29 61
3894 61 -61 -80 -197 158 -122 146 -70 89 -85 52 -8 75 -68 -53 45 -165 396 65 25 -126 15 -141
3916 -141 -220 -71 -126 -178 -28 -68 -48 -52 10 -150 -155 -178 -79 -77 -77 37 12 277 -48 66 298 86 -5 -265 262 238
3942 238 24 265 -225 46 2 166 27 24 -25 -52 140 231 118 -18 -310 -48 -121 157 25 -145 114 169 206
3965 206 -7 -133 -80 -122 143 136 113 -59 -269 -90 -147 -148 170 -72 -15 207 -144 -219 284 -61 -51 6 -89 -228
3989 -228 -120 -83 76 -27 -138 102 -198 -36 -35 85 155 6 146 61 -173 -59 47 -236 -126 -157 -10 317
4011 317 168 100 -13 -157 104 94 -8 -91 28 124 164 36 144 29 472 -16 -379 95 232 214 -59 101
4033 101 10 -29 -150 -28 114 52 -36 -270 25 41 22 73 -82 168 40 48 46 -125 -208 170 3 -159 219 -55
4057 -55 -109 65 -213 -32 198 -32 -39 77 -364 67 34 46 -251 -208 -224 -23 358 20 -121 293 -149 163 -40
4080 -40 -40 3 -204 -144 27 88 -168 -150 -96 31 -129 63 84 -171 242 230 35 90 107 17 -144 -138 -51 227 163 -18
4106 -18 66 170 -109 250 129 -48 220 -392 78 247 -184 -149 302 291 -37 -8 -95 101 -229 239 10 -196
4128 -196 -45 -175 134 -95 84 -247 -121 -65 -176 127 107 -21 -171 38 71 -18 79 114 85 -73 -10 -38 -41 79
4152 79 11 14 48 -274 -133 257 -3 -101 73 -77 114 -87 -115 101 -19 123 208 198 -158 156 -49 -12 -90 37
4176 37 106 30 -173 38 59 -138 61 248 -34 47 100 -3 114 86 -85 -138 -4 237 180 -268 13 11 152 -32
4200 -32 -121 39 54 123 -116 51 106 -56 -52 -383 -60 -100 8 218 -192 -67 -49 -417 71 222 -3 -35 -83 171
4224 171 84 41 -18 -128 -159 32 28 -16 25 -15 -79 -108 184 -37 139 -28 -55 78 -112 -71 213 -34 257 -16
4248 -16 -207 79 21 111 -381 -41 13 379 54 186 -10 157 -37 -33 82 -49 339 54 66 23 118 -184 158
4271 158 139 31 83 74 9 -42 -186 7 -139 -43 -11 -23 -80 -39 25 23 9 3 90 -66 -102 105 -183 12 112 -358
4297 -358 -24 25 -92 -100 22 -226 227 -89 -35 -228 111 -10 128 -87 -72 251 -13 -17 109 240 -19 -174
4319 -174 -148 101 -107 106 97 80 204 -57 18 143 130 84 31 123 37 189 126 57 150 -198 308 -265 -246 45 -90
4344 -90 -128 -10 -36 86 10 152 148 25 -138 22 114 -96 56 70 1 166 -144 7 -379 -87 203 -301 -372
4367 -372 63 -10 -338 140 80 -136 56 -17 -104 100 28 80 68 41 -86 -120 21 -76 -95 -86 40 -115 115 -85
4391 -85 -57 91 -86 -90 242 26 -122 79 -19 -125 166 -141 -60 156 -211 218 143 -94 65 -129 26 108 15
4414 15 -65 69 -117 125 147 74 238 60 163 -16 91 -56 81 -55 40 127 67 95 106 126 146 355 135 -87
4438 -87 52 -282 -266 -93 -151 5 -48 -189 -138 88 -125 49 238 -100 53 -251 60 -110 -60 15 -55 56 203
4461 203 112 -217 90 -47 240 -53 -53 292 -182 -146 222 252 -108 189 -136 327 32 -338 164 -139 9 167
4483 167 -62 -92 169 -34 -332 -7 -45 -173 77 52 23 230 150 28 55 27 41 90 -118 2 18 41 -131 -321
4507 -321 57 17 -151 -149 29 28 24 -27 -37 57 -87 -88 -115 126 -151 26 -232 -183 9 -192 172 -18 -226 173 -24
4532 -24 -53 -56 -92 69 -242 61 -110 94 -159 -158 178 -121 17 215 -64 68 217 27 314 -16 219 52
4554 52 -194 -96 97 -163 280 127 -186 16 86 -124 21 18 -87 -88 -202 241 107 118 281 144 -3 287 13
4577 13 -238 99 35 -27 -140 3 64 90 4 169 -103 -27 235 185 -239 -241 -17 -10 -152 -3 419 -75 -191 -30
4601 -30 -31 -12 -113 62 -154 190 -60 161 -9 -234 3 -191 -322 -95 -240 -138 155 28 -295 172 -248
4622 -248 -101 152 -94 -32 -178 -95 -1 138 58 256 17 -233 58 -109 45 170 72 60 121 153 -123 -18 -53
4645 -53 204 229 -12 -206 -135 173 292 146 -84 208 -402 -15 -81 -83 230 107 126 115 -231 -94 -63 184 -41
4668 -41 -256 -259 19 -129 -258 3 -123 -14 -61 94 -145 50 -204 260 -39 -66 202 74 -79 171 -51 -21
4690 -21 49 21 4 -205 -199 -232 -45 -229 -26 -43 -523 108 -95 -51 103 36 154 106 33 -147 12 -127 -156 -97 71
4715 71 77 1 -64 -19 190 -13 -44 7 -207 -37 140 82 40 153 -100 -136 -95 -73 212 -278 68 117 -176 82 -3
4740 -3 -71 57 -43 108 -135 -41 47 -212 -330 -241 -23 56 232 -58 152 -27 -327 -28 -128 -110 -30 132 -213
4763 -213 -29 -61 128 -10 -115 -26 86 74 57 142 -119 46 -215 -68 -111 -75 -33 80 -46 -189 45 -19 -139
4786 -139 293 38 -53 -3 -210 440 -19 63 28 -48 166 116 -270 -18 -7 186 200 122 25 63 133 -94 244 -42
4810 -42 111 -70 -94 4 101 -147 86 -125 33 30 -19 -21 -98 -18 -267 -197 97 16 98 92 83 117 -57 -107 -46 -124 124
4837 124 257 -170 -41 -95 114 89 -267 -115 166 119 -31 -127 -81 -74 28 -199 15 228 -140 202 91 8 41
4860 41 86 121 117 -33 281 72 -103 205 42 -124 17 29 104 116 -287 141 75 187 28 150 -15 -38 53 91
4884 91 -104 -72 77 -148 -95 79 41 46 118 -142 59 139 -265 -110 -79 -3 54 -141 -1 111 -85 -280 -82 -283
4908 -283 -104 -161 75 48 -66 -27 11 -80 -161 -10 110 -155 -64 -83 9 178 -61 49 12 7 23 152 -74 82
4932 82 102 -29 12 83 -92 -77 -76 8 53 285 110 52 -90 136 264 -54 174 -6 4 180 66 91 265 -33
4956 -33 21 292 -137 -7 152 -182 -187 -6 -171 -91 199 75 1 27 -47 -105 -174 -40 32 -107 37 137 136 101 -157
4981 -157 -75 135 -46 92 -60 169 -63 -164 -123 -183 -83 -153 -144 -208 -237 68 110 -104 -53 -77 168 -175 -50 -67
5005 -67 300 -131 56 -30 -77 209 -163 169 -49 21 -111 35 -127 145 169 98 -42 27 -15 88 6 -86 52
5028 52 181 31 149 -162 -62 82 -79 -94 -98 -7 -286 324 129 -153 -17 -252 -308 -94 217 167 10 76 -81
5051 -81 -106 -94 -36 -125 133 90 165 -186 -113 -236 87 -209 -292 -55 -56 -104 -33 69 71 65 47 0 -70 31 -168 106 -146
5078 -146 28 83 144 -75 78 4 -12 108 -64 -102 87 154 48 307 157 194 -271 -58 -172 86 -46 -2 335
5101 335 29 -6 2 247 2 -5 -110 83 -154 59 -46 158 276 -263 -294 178 -26 -185 -6 -11 33 -118 214
5124 214 -129 -54 -247 -158 125 4 -62 230 50 84 64 -213 128 0 24 -47 28 14 -78 -227 -1 48 69 137
5148 137 197 -2 -167 78 -132 -67 -124 -31 -225 131 114 -58 -22 -19 60 -174 241 -33 -130 -56 112 -2 -109 -121
5172 -121 -121 278 92 203 66 62 229 202 28 123 141 -200 48 173 -141 74 45 170 205 136 225 -40 62 -58
5196 -58 -54 84 154 -154 -98 180 -219 -146 -158 213 92 32 -67 -129 212 -285 69 -119 133 32 9 -173 74 148
5220 148 -58 -1 -79 -14 -17 41 -162 46 39 -58 76 151 -31 150 -175 49 -145 257 98 -14 -21 239 80 150
5244 150 -7 -90 103 179 -51 -43 241 -45 207 26 -61 276 33 313 -99 -62 87 11 127 -77 74 -120
5266 -120 194 -149 -80 -48 39 138 -8 218 98 76 -71 15 -114 5 70 48 97 218 -105 -95 186 -9 -178
5289 -178 -138 -56 -15 -184 29 -82 154 -15 -50 123 -75 -8 -298 21 69 -128 -31 -101 -30 -2 -307 -20 140
5312 140 2 25 50 -189 -163 -26 5 106 52 -83 197 256 -85 -47 128 -28 29 -45 187 212 26 -10 207 -99
5336 -99 85 79 190 192 28 54 -92 -65 -89 45 -148 91 -2 -91 -36 72 81 75 -91 -84 -69 55 -141 -198 -2 -14 80
5363 80 -138 -43 -98 119 -309 -163 -136 -294 19 219 134 38 46 51 -153 21 -180 -1 -65 -42 -13 -6 132 -33 -71
5388 -71 -200 -142 145 -20 -146 -77 -122 39 111 -117 -40 98 -199 174 118 160 -38 -8 -41 -88 -42 -246 160 307
5412 307 104 30 -126 -24 -189 -4 -161 -186 153 -9 -49 142 -111 157 -169 -81 -83 -37 -162 -133 -63 -160 -187 45
5436 45 214 -66 -2 -141 -59 -42 24 211 99 35 -51 253 -101 178 -50 118 201 -135 -2 129 -93 128 14
5459 14 108 16 -213 -327 -45 -43 -27 -247 13 121 210 -114 188 219 217 120 43 156 58 194 52 -30 382 -59 6
5484 6 26 263 2 149 -181 -121 -51 76 -112 -22 -193 157 61 -107 33 80 97 -4 -143 300 75 153 0
5507 0 24 163 98 84 -90 183 -330 78 70 -34 -34 -37 -242 -238 92 31 -52 55 14 -139 -20 14 -38 -44 -176 -101 103
5534 103 -86 -98 -127 -154 20 -77 135 -171 -3 -13 -162 162 -91 7 -206 -113 98 -109 5 -73 -98 87 -21
5557 -21 115 203 239 -22 322 30 -35 69 -4 -90 -49 -175 162 145 195 -80 -41 -21 45 -49 -333 22 -40 -11 77
5582 77 -82 51 -4 99 -60 -187 92 75 204 70 -143 -114 27 -102 -172 0 -190 66 -182 89 -133 -284
5604 -284 -200 74 221 -96 199 -30 -207 116 -142 -64 -120 -92 -94 -115 135 6 196 84 -63 126 -22 -157
5626 -157 -158 -16 104 -53 -80 -21 120 -151 51 -10 -15 136 26 385 34 -34 -110 -88 -113 -63 -86 -125 -107 -126 -68 -73
5652 -73 -204 -12 4 -94 -116 34 13 -186 -28 164 -85 210 -206 -218 -179 41 -217 16 -29 191 -97 164 241
5675 241 -44 98 67 35 -93 92 31 -168 227 -179 -31 71 210 -223 16 -108 -106 477 -109 151 -242 411
5697 411 -70 -97 75 -132 152 56 165 136 -111 106 37 250 74 -46 -91 -316 -56 212 38 -90 70 -430
5719 -430 -63 -131 216 -158 17 -56 126 156 251 180 -20 153 -112 54 -42 -131 26 -55 -46 135 -173 63 97 8
5743 8 -43 11 -111 -119 -229 47 -107 -145 81 -126 31 61 -14 -222 30 -116 7 -13 201 -311 58 175 267 -85
5767 -85 -126 157 81 72 181 247 102 -157 132 13 -170 153 132 196 -103 -110 117 -35 76 26 47 -14 26 -29 173
5792 173 -139 40 -118 13 283 410 -158 24 -3 -87 -4 -60 -9 69 -117 -186 259 -85 1 42 0 7 280 -58
5816 -58 -70 -21 -95 121 76 81 -174 -53 22 116 73 21 42 -65 -141 -170 -100 -33 93 -74 2 250 -26 17 131 25
5842 25 -209 -141 -168 123 -87 341 -183 174 39 67 161 -45 -59 -76 25 220 43 -33 43 -138 -117 8 48 200
5866 200 -22 149 -166 -372 -46 -51 59 -64 101 80 232 -120 70 -146 5 -41 31 49 -55 -135 -101 138 66
5889 66 6 169 4 -36 42 65 -14 -94 -37 131 7 -81 -76 -18 151 82 -59 -110 126 -185 0 89 -202 77 -60
5914 -60 155 96 -211 -177 337 29 -38 0 33 -37 -122 -182 -55 93 17 40 -43 -97 107 -99 206 201 76 125 0
5939 0 102 101 -299 11 -71 17 -48 -51 95 156 141 18 142 107 -44 50 155 22 169 176 -66 116 82 143 -138 -124
5965 -124 -27 152 -22 -21 -3 -42 73 -7 -1 75 103 112 88 -183 46 19 60 -54 90 -295 208 -120 34 -105 -69
5990 -69 -103 -150 -162 -54 -128 -11 26 -65 78 -18 -54 -55 -18 261 158 -249 37 86 130 -20 74 -44 16 -32 8 -2
6016 -2 -58 -181 -13 -57 2 61 149 60 75 23 -35 135 -6 -32 -154 231 149 16 -114 36 -126 -144 -74 -46 62
6041 62 102 30 -48 -65 6 207 -87 71 -58 -74 -141 85 -247 12 0 16 -105 -37 -212 -71 77 -114 -151 -110
6065 -110 -107 134 186 -49 -56 6 37 -235 99 -28 114 136 92 262 151 119 195 7 219 -138 32 335 -116 -181
6089 -181 127 60 33 22 14 36 -310 265 -26 89 -144 -27 -158 169 -221 171 -176 -264 137 -155 228 178 25
6112 25 -122 215 116 247 11 -65 -11 -50 -117 190 94 88 96 33 -58 -1 -146 115 0 -247 88 -101 260 -134 196
6137 196 74 90 149 94 -97 -47 -38 26 83 8 76 174 -47 -210 -48 -149 59 15 0 82 33 -131 263 110 -17
6162 -17 140 -40 86 107 -12 171 19 3 -100 -89 -285 47 -230 132 -42 -56 -118 -34 22 84 -35 43 88 53
6186 53 -24 -37 105 -216 32 -51 -30 51 133 -38 78 311 166 -23 -17 -43 -144 -79 81 172 30 149 96 -35
6210 -35 -37 -62 265 -69 -212 40 -175 -149 39 26 -11 33 188 33 -127 90 -120 -92 -34 -49 -58 -14 -7 -37 -180 18
6236 18 163 9 -49 -33 -61 106 -27 18 -60 -85 90 210 -19 -148 -116 -45 -74 -36 178 235 -293 -42 124 176
6260 176 -35 -138 7 34 -201 -6 87 178 -106 -142 132 -35 16 -76 -137 -69 -88 50 -30 -18 129 -211 198 171
6284 171 -84 47 -250 123 -15 -4 56 168 -223 93 -178 -94 170 -19 277 -49 31 -235 102 44 -43 193
6306 193 -36 -32 -107 242 -5 64 204 -14 22 29 -73 -59 -111 175 367 -155 146 -133 -6 55 -47 -57 35 56
6330 56 -156 -52 -42 -126 83 -77 50 -54 99 -21 -151 35 -1 -81 -177 68 149 83 -19 27 -117 -92 -47 -246
6354 -246 -49 -29 101 95 107 -80 175 154 252 165 -12 -40 127 3 -74 -10 29 268 -8 65 75 -183 25 90 -72
6379 -72 135 204 52 -98 14 268 -24 -46 -116 29 22 221 -245 90 23 39 121 -208 223 -50 171 58 27
6402 27 56 289 46 4 152 7 -198 80 -186 73 -154 -91 112 -14 -83 -43 -132 112 -32 10 -50 -129 1
6425 1 -211 153 -51 48 -64 -55 -75 -147 -29 95 31 -40 -195 -62 -144 103 -213 72 191 -128 -44 -54 131 154
6449 154 -278 -155 -25 53 -70 -249 -105 -8 233 -41 -24 80 -172 -35 116 -189 77 -74 111 140 -64
6470 -64 -18 -35 -15 -212 -104 -16 -231 52 -9 84 107 -248 94 97 -313 -135 23 -2 11 130 64 -41 -136 196 -42
6495 -42 -48 49 -22 22 68 25 32 -5 7 -158 111 130 -11 -88 -331 -110 84 -100 186 143 -11 64 -48 -70 51 44
6521 44 -100 7 -39 47 78 186 -129 -21 -79 -74 48 68 2 151 123 17 -139 -40 -47 -19 33 -6 95 108 115 26 -360
6548 -360 -103 -6 117 110 50 47 134 72 89 -15 2 -61 109 192 172 -113 -23 -50 -174 170 79 -3 -1 -132 -155 -28 -16
6575 -16 -122 202 -31 134 -4 91 -300 198 0 -43 -22 50 -156 114 6 115 -21 -82 192 -202 143 -118
6597 -118 -197 -228 -339 0 -13 82 26 40 -3 -14 3 -27 146 -91 87 -167 30 -186 -64 202 88 14 82 73 -195
6622 -195 8 77 -162 1 25 339 -4 -189 87 -8 -41 -70 197 -94 5 33 -230 178 177 -104 138 -83 26
6645 26 234 -201 -4 122 70 28 -69 -11 -74 127 -29 -182 -126 106 -72 66 182 -38 -145 117 27 -194 22
6668 22 -268 -34 -149 -14 -15 -69 4 349 -16 4 89 -72 91 201 -128 156 -178 300 259 -58 -4 -30 -37 -128
6692 -128 -121 0 -12 20 159 111 14 -35 79 -177 -85 29 -69 66 -17 -31 15 49 169 -257 64 -67 92 -138
6716 -138 -155 -166 57 197 211 -286 -39 -50 43 -309 -2 -35 -276 -50 -100 -248 -261 -186 -7 8 -85 -110 81 112
6740 112 25 -31 9 209 11 23 -7 -188 33 -127 94 247 -15 61 112 -13 -227 -6 194 116 -197 103 142
6763 142 -77 -107 -41 87 308 -62 -41 58 167 120 221 26 19 -157 -90 117 134 101 -34 56 172 -195 22 33
6787 33 128 31 80 -133 -110 25 -53 64 -174 -148 -135 155 -55 -122 -30 -85 -21 -221 -145 -114 -183 -252 173 100 39 -49
6813 -49 -120 36 59 -43 -162 38 -43 -222 219 357 26 341 -171 -51 207 -172 145 171 -20 33 25 -47 -92
6836 -92 -167 123 -84 -245 274 139 -260 49 69 -91 -60 86 -22 10 -117 170 37 -145 -12 5 230 -247
6858 -247 138 184 4 -25 -92 79 54 -81 -40 -66 -130 121 106 26 91 80 94 -123 -63 94 -210 -32 12 251 83
6883 83 -50 70 -18 102 -12 57 116 -18 84 6 25 -14 31 -35 105 17 88 83 84 -77 105 104 -133 -56 -69 248
6909 248 130 30 102 95 -90 -241 46 277 235 207 -29 -219 91 -80 -112 -61 45 96 -85 -4 61 168 -121
6932 -121 37 87 200 121 -200 -175 40 -121 317 306 7 -195 -40 25 -37 -99 12 -98 -1 12 51 -279 -52
6955 -52 -9 -127 77 261 88 -52 211 -88 -9 19 22 18 -133 33 75 -181 173 -217 -123 47 -26 -29 -10 27 42
6980 42 -118 63 265 86 -29 104 -242 55 -163 25 36 152 -91 -84 -156 144 -84 205 -29 -312 156 17
7002 17 -131 -283 20 -18 294 112 58 -200 -230 -181 -51 175 18 -27 -36 -29 -124 93 -59 -253 32 109 -26 42
7026 42 -58 86 -45 -117 -129 -42 178 -262 115 -91 168 -146 -217 -7 -95 -10 -143 -108 151 5 -115 17 -32
7049 -32 -170 -111 -35 123 -148 -26 30 142 144 -135 -14 158 48 141 247 -4 58 -84 20 -36 372 -44 -179
7072 -179 144 -177 45 215 101 50 -79 184 26 -54 -9 53 13 167 17 -70 -77 105 -273 144 -25 20 -78
7095 -78 -51 -19 86 119 112 -63 -16 187 71 36 45 -98 -83 -144 86 -197 66 -118 -305 77 -65 11 160 64 -255
7120 -255 -148 112 -17 32 -329 -88 58 -224 205 -191 50 -27 42 147 62 -39 -221 -21 101 -132 -45 197
7142 197 12 -326 -86 -108 150 155 -26 102 101 311 63 178 -92 -19 -135 45 78 -140 27 -82 219 41
7164 41 85 -78 -62 -331 -89 -151 -114 33 21 154 73 103 -173 -172 -220 49 27 -184 147 -116 140 -70 87 -219
7188 -219 -290 136 -90 -189 -97 115 -77 141 68 -229 -60 80 124 -19 253 15 -385 167 46 -43 176 -106
7210 -106 22 -47 -7 -67 -304 -90 151 -88 151 -87 -292 -144 184 113 -8 124 -139 59 44 17 50 -305
7232 -305 6 130 100 -126 164 -127 62 -109 29 -42 -101 34 -8 11 34 192 39 -180 -159 -83 268 100 -177
7255 -177 -156 -316 -124 -72 65 -42 -160 -7 91 181 42 1 -276 224 89 -34 -79 -52 -278 -3 31 -115 10
7278 10 -64 50 187 -27 53 -29 -173 66 -131 -111 170 6 -65 -41 -37 -16 9 30 89 -2 -7 -82 -3 -82 -148 -230 43
7305 43 163 -154 112 -125 -29 116 176 2 -3 -216 -136 -13 134 -3 -69 91 307 157 125 -95 -83 46 58
7328 58 -44 -49 34 296 -188 -218 -7 -170 180 25 291 -38 111 -76 -74 39 11 -200 -164 99 197 -86 83
7351 83 -45 238 30 -116 37 -263 -5 6 90 -20 188 -128 -64 92 14 -20 -70 -97 101 16 -100 116 -137
7374 -137 -83 74 200 -167 -146 20 100 138 -22 26 182 -140 58 193 11 -185 -118 -239 116 14 -4 426
7396 426 558 145 -43 -414 101 -6 -39 226 252 233 -126 -80 83 -115 -257 -68 16 -10 22 -38 9 -21 -18 100
7420 100 33 21 -236 -144 -120 5 19 70 -82 48 140 -54 -19 106 90 -179 4 57 -205 -52 119 107 -7 112
7444 112 171 20 104 48 51 -242 -23 91 137 -61 19 92 79 113 47 133 106 -164 -119 35 71 1 15 -67 -163 -259 264
7471 264 -48 68 79 -48 -10 1 -57 -8 2 -286 -43 80 -177 -243 -81 -60 -216 -197 -96 -231 142 81 -87
7494 -87 -37 156 -275 92 21 -215 -12 -29 27 84 273 -112 103 -15 98 -79 140 -124 11 -38 -29 -73 -114 -3
7518 -3 29 43 -72 23 36 -160 -109 -130 86 -25 164 126 100 -106 11 206 74 -7 3 34 59 66 -23 -174 158 47
7544 47 95 -80 -78 178 -290 59 17 119 -21 35 -145 199 -86 -34 -176 -152 -72 84 -255 170 -97 -119 97
7567 97 -310 113 -53 -99 -121 -58 12 -177 41 -243 -183 -87 17 -175 165 63 113 -120 111 -229 15 -53 66
7590 66 -123 -50 78 -125 72 -47 -106 10 4 -10 245 -102 -90 127 82 -63 32 224 76 -81 -70 14 -83 355
7614 355 -156 63 179 41 184 202 261 -9 91 147 -7 179 -84 26 165 -193 -32 -71 63 75 43 5
7636 5 -213 -52 -23 -192 123 -157 239 -50 26 -269 -87 152 119 -106 -70 -42 177 -329 30 -225 -76 103
7658 103 -75 111 -151 187 122 3 110 -123 7 -292 -321 88 -58 -109 -277 -93 257 147 172 65 -102
7679 -102 -49 -59 113 -167 -27 -50 -59 -172 -15 7 -126 40 -35 113 109 161 80 -257 33 -237 -33 -249 139 104
7703 104 -211 -230 71 -45 -34 -20 52 100 -29 17 107 -118 14 -340 257 -42 -11 89 7 125 145 -153 -109 84
7727 84 5 -87 94 -341 120 99 32 -125 -199 -29 -123 71 6 -76 -22 -140 -213 57 -169 -163 -105 -29 86 43 -67
7752 -67 7 75 -91 18 25 42 151 -3 105 -145 -167 262 -71 -66 12 141 60 20 40 -34 78 79 -301 -94 -99 -203
7778 -203 155 91 -182 32 6 18 -179 79 -26 -63 -134 -94 -145 -275 -103 65 -69 -208 143 26 185 107 -127
7801 -127 86 110 102 288 49 107 -133 -120 19 80 -1 356 -159 -65 16 49 126 -32 198 -37 -96 -27 47 -4 82
7826 82 173 -23 10 -23 248 24 -66 86 -141 151 60 37 -252 193 -244 61 173 -323 -124 155 213 -183 -114
7849 -114 90 -30 -102 256 -52 182 22 198 -13 -71 -63 119 -89 -25 217 74 -225 -157 -57 -103 62 107 -90
7872 -90 -68 -34 91 -48 -58 -222 -81 -85 -38 -72 23 150 -117 204 -220 207 67 239 -46 71 52 225 62
7895 62 -113 127 172 -42 1 214 -172 39 125 14 -132 -80 118 91 85 9 -19 -116 114 65 -204 -9 -58 106
7919 106 -73 255 -78 -186 98 133 77 21 109 148 79 -219 125 -111 -40 -133 91 -1 -208 -233 103 -103 73
7942 73 -88 117 -77 142 -177 -22 -34 59 168 -76 -12 -109 134 -35 179 175 -191 -6 -182 104 45 -130 46
7965 46 22 11 -56 19 223 34 -170 -87 23 -26 220 -128 55 -11 -232 -30 75 242 -152 79 -28 -75 100
7988 100 230 43 -96 115 95 12 79 40 -125 148 104 -7 63 78 -224 -98 381 211 -25 222 -195 -61
8010 -61 -190 -93 103 171 23 -42 64 -138 -50 -99 -86 -23 52 66 70 -340 124 104 215 -257 -213 12 -79 -149 -55 93
8036 93 -62 -170 -84 -210 -160 -86 -210 -177 44 34 197 42 -120 -222 86 124 -82 -46 -64 1 -152 90 -340
8059 -340 99 78 -27 -30 -175 48 115 -4 -99 -7 -4 9 104 -57 143 -36 -173 -52 -38 52 205 154 -89 178
8083 178 -253 14 -102 55 10 -50 78 173 167 85 100 76 -174 226 208 -117 223 194 -140 5 92 -98 170 -60
8107 -60 -126 62 23 -62 -15 101 -48 101 -60 65 54 104 23 -160 -29 97 68 -34 -58 178 174 -1 -94 -30 -100
8132 -100 -100 140 161 -8 186 -82 -56 54 33 52 -189 30 -115 50 31 71 5 77 -32 50 83 85 -161 -2 85
8157 85 119 -164 173 120 -32 104 190 -97 155 96 -17 -57 -187 -68 -73 -132 120 -144 40 23 39 -75 -87 -112
8181 -112 130 36 -104 79 -118 -88 -16 136 -88 244
8191B44
$$ Imaginary data points
##PAGE= N=2
##DATA TABLE= (X++(I..I)), XYDATA
0 0 0 0 0 0 0 0 0 0 0 0 0 0 0 7 -8 8 -8 8 -16 16 -17 24 -27 32 -40 48 -55 63 -72 81 -95 107 -121 138 -158
35 -158 177 -200 224 -252 281 -313 348 -388 428 -476 525 -580 639 -705 777 -855 940 -1036
53 -1036 1142 -1261 1394 -1545 1716 -1913 2144 -2415 2743 -3148 3663 -4342 5282 -6687 9044
68 9044 -14069 53201 -73405 -808 95044 -51101 57148 26921 -41633 71997 4921 -55073
80 -55073 73646 -18068 -13869 42640 -40847 9680 26111 -46926 21148 2491 -53273 40658
92 40658 -8121 -45952 34447 -33132 -15916 27429 -39412 -281 31545 -48073 -7055 18403
104 18403 -17007 21402 -20953 -17439 31956 -20132 -6739 24268 -20210 4730 17885 -31071
116 -31071 23234 6881 -28693 30476 -9497 -17536 33689 -16152 -19766 31373 -20864 -3029
128 -3029 23772 -29296 13318 6015 -26689 21670 630 -18423 25310 -14090 -14714 36143 -19076
141 -19076 766 20946 -24589 18975 17273 -24054 21804 10186 -18666 30417 -6212 -7601
153 -7601 35258 -20405 2571 27664 -17007 9433 12978 -20537 22478 -210 -22528 33054
165 33054 -14678 -15884 23665 -19696 -1246 14136 -26164 7212 6693 -32289 22100 -4310 -28976
178 -28976 21231 -14726 -11204 17400 -22399 -2481 18148 -28427 9114 12742 -28038 18348
190 18348 -1788 -15041 22405 -10600 -9068 24094 -15502 -2916 22932 -18854 11445 7055
202 7055 -20207 22759 972 -17389 21451 -2696 -13343 22646 -13440 -2144 19698 -21248
214 -21248 7878 11734 -16675 10986 4237 -17166 17880 -910 -11638 19320 -14005 1188
226 1188 17661 -17081 7554 13056 -16960 10787 6863 -17747 22301 -2688 -14810 20854 -9644
239 -9644 -3419 15880 -14752 -76 14759 -18833 6492 5401 -19513 13503 -7027 -12567 13606
252 13606 -11493 -9154 9928 -18066 -913 12204 -24451 6034 1864 -19943 12709 -5066
264 -5066 -15368 14351 -7829 -12655 16212 -13710 -555 13791 -18558 8612 8398 -12051 10373
277 10373 1553 -8821 18492 -3600 -5546 19442 -11308 5777 13583 -12281 12618 9700 -13360
290 -13360 13286 5999 -10436 20160 -5420 -6644 18592 -9339 303 11446 -10303 3909 7997
303 7997 -14006 9249 1544 -12509 12256 -8265 -4842 11273 -12187 -3498 8384 -13063 3019
316 3019 6149 -18005 8999 -1003 -13258 11339 -5644 -8114 9776 -8621 -5516 11842 -11821
329 -11821 1503 5708 -13698 8858 681 -9654 7881 -3080 -6740 10691 -8181 -3394 11590
342 11590 -13505 3491 6259 -10855 7093 1391 -11329 9224 992 -8873 12294 -7167 -2939
355 -2939 11919 -8567 2626 7325 -6592 5097 4729 -7832 12762 1482 -7121 13440 -3657
368 -3657 2020 11286 -6769 3814 10764 -7898 6547 8257 -10145 10951 405 -6481 11019
381 11019 -3382 -3000 7344 -7112 -1041 8569 -10900 1674 1624 -10171 6960 -5009 -7846 7036
395 7036 -6207 -7962 7324 -7723 -3097 6112 -12478 3202 2300 -8893 5578 -688 -8562 7290
409 7290 517 -5857 7760 -5735 1070 6939 -7896 4993 5434 -6302 3001 3137 -4272 8102
423 8102 -3119 -4726 10269 -6002 -539 6210 -6164 1201 4535 -7758 3828 2852 -8503 7548
437 7548 -2812 -5649 8185 -2678 -3338 3458 -2834 1946 5062 -7265 5374 2918 -5244 7941
451 7941 -788 -824 6690 -3077 630 8747 -5594 2478 7453 -8213 5972 3703 -5623 4423 210
466 210 -4343 4572 -2633 -4371 5602 -6607 -2289 762 -5969 1872 -4376 -7073 1639 -3946 -7386
481 -7386 3966 -7243 -6676 3275 -8160 -386 -302 -8979 889 2499 -9084 725 3060 -6752 2148
496 2148 -1586 -12 2678 -3906 1226 3854 -2322 356 4612 -1859 4118 -1115 -1644 8134 -2039
511 -2039 -1145 6308 -1613 -1984 7296 -1616 382 3871 -4755 5506 3045 -4019 2178 2319 -1030 2038
527 2038 -792 452 4472 -5873 3287 4193 -5148 3201 1257 -2810 3228 -355 -3173 6894 -3956
542 -3956 -3400 6187 -4443 -436 2831 -3288 -688 -39 -3451 2402 -1229 -5800 2409 -3852 -573
557 -573 961 -6306 -545 1032 -4437 -284 83 -5521 2546 -1974 -4055 2901 -2504 -693 642 -2422
573 -2422 -146 2993 -2566 673 2092 -1700 2874 -1014 1299 3118 -1175 445 3622 181 1056
588 1056 3914 -2611 2871 2967 -112 2901 -723 95 4107 1117 -3269 4019 91 -827 2103 -1796
604 -1796 2113 933 -2103 113 1476 -2224 1067 124 -2401 2774 -2681 -87 2097 -2916 -147
619 -147 1458 -2433 247 1801 -3337 2437 -1765 -2059 4459 -2088 -2970 1587 405 -1283 882 -2892
635 -2892 908 608 -3711 2034 -1266 -724 334 -1920 -792 987 -2082 -155 1031 -4340 2329 -290
651 -290 -2848 1813 -1394 -1549 1505 -423 -1742 2848 -1735 -940 2160 -443 1985 -867 43 1832
667 1832 1646 197 1832 855 967 3233 -882 3255 1973 -57 2325 1529 172 2711 2188 -1718
683 -1718 2612 373 58 2203 -375 -176 260 57 -956 1056 -1648 -548 -713 -2211 712 -1860
699 -1860 -1049 -1344 -2180 -1258 -16 -2619 -1538 542 -3661 480 -1043 -2405 596 -1148 -2049 203
715 203 -115 -1929 1258 -2144 -343 1645 -1130 901 -457 -73 881 659 -199 1810 -178 223 2102
732 2102 -1585 2137 1336 -975 1119 1152 85 1493 1413 -1687 2853 338 844 1569 -222 1404 671
749 671 500 449 1652 -100 1089 231 126 2537 -723 1193 563 -106 706 1218 -803 10 1420 -1664
767 -1664 1226 -690 -203 22 -1031 -950 -850 105 -1678 -691 -2087 -672 -961 -1708 -472 -2359 -872
784 -872 -949 -1587 -1906 -356 -1472 -2123 -135 -2042 186 -939 -1666 -724 540 -405 -587 835 -1066 1049
802 1049 -1 831 804 302 1109 263 1193 996 1514 119 1682 468 1068 2594 -501 1080 1590 568
820 568 890 1561 118 631 1498 -701 1819 284 297 36 82 473 -206 766 -133 261 -930 1108 -354
839 -354 -636 923 -1326 311 -250 -573 -151 785 -1570 -763 949 -1398 277 -717 -398 -715 -568 -187
857 -187 -722 -568 -1225 38 -1234 94 -1307 -713 188 -2577 130 127 -1091 -1404 -120 -1311 -390 -289
875 -289 -1737 1239 -1033 -659 -126 579 -113 -467 578 179 777 -99 1406 -218 490 1518 373 1612
893 1612 130 860 1310 1678 -50 1438 1914 -206 1267 791 1414 484 969 377 783 1217 -265 1267
911 1267 75 279 -283 584 -69 -534 143 -209 -362 -1282 1058 -756 -1435 -250 -840 379 -829 -1234
929 -1234 -1083 631 -1719 -641 -190 -2338 -10 -1195 -564 -855 -921 -732 -506 -1170 -741 126 -1651 294
947 294 -1495 -752 871 -2040 -411 715 -750 -1318 1099 -729 622 25 -1728 1492 -29 178
963 178 723 232 237 956 608 1306 882 -808 2867 204 -96 2075 246 961 1500 202 836 2132 -590
982 -590 1445 1477 -455 1259 185 642 430 -112 77 739 -398 62 253 -1524 605 -629 -637 54 -1484
1001 -1484 -528 568 -602 -2263 463 -1141 -752 -87 -1377 -493 -901 -572 -780 122 -1425 -458 -1
1018 -1 -1008 80 -554 566 -120 -296 -6 342 -328 431 1046 -1319 1352 -238 225 1857 -589 -394
1036 -394 1554 373 -386 1732 -1150 685 1199 -470 1172 -5 -211 714 414 -447 605 -166 600
1053 600 992 -1447 1686 211 -853 1399 246 -749 1129 -44 -494 2054 -1962 281 1357 -1182
1069 -1182 926 79 -602 621 487 -1114 489 -758 -146 1053 -1403 318 -124 -1281 477 -449
1085 -449 -1610 606 -383 -1814 897 -1430 -584 493 -1779 -413 93 -1069 -511 502 -1508 252
1101 252 -277 -811 770 -742 35 -137 -264 545 932 -876 768 1132 -1315 2015 -133 -200 1390 262
1119 262 -50 1559 50 79 2227 -1153 664 1300 -328 1153 280 -213 1010 401 -265 1654 -836
1136 -836 285 1472 -1529 1194 469 -1084 1089 460 -977 987 -290 -1751 1582 -1247 -232 728
1152 728 -1595 56 448 -911 -309 221 -1807 921 -1122 -839 1142 -1603 -122 102 -1321 -21
1168 -21 628 -2020 227 223 -1745 1325 -1126 -1140 885 -961 -681 1184 -888 -405 1030 -1523 968
1185 968 34 -864 1382 -481 -35 1386 -279 -111 1991 -885 846 1625 -1309 1897 797 -1022
1201 -1022 1686 715 -525 2146 -43 -452 2335 -818 571 1005 -787 998 389 -681 1064 265
1217 265 -762 1364 -1329 -411 1203 -1979 35 463 -1750 75 416 -2094 738 -257 -2045 1594
1233 1594 -1401 -739 770 -1329 -359 605 -1111 -163 244 -1753 999 -610 -911 1178 -1038 -415 829
1250 829 -1063 -184 1453 -1764 603 982 -1743 1166 -416 -1276 1454 -154 -1006 1600 -497 -305
1266 -305 1844 -1226 821 582 -978 1288 99 -356 1460 -32 -821 2073 -731 610 1659 -1383
1282 -1383 1071 952 -1025 1121 874 -1376 1669 387 -950 1866 -624 139 900 -1012 421 815
1298 815 -1496 407 599 -1792 1380 -1364 -725 1344 -1648 -449 982 -1643 -224 699 -2396 756
1314 756 250 -1646 1046 -999 -1298 1051 -869 -1382 882 -1351 -207 723 -1852 1158 -30 -1186
1330 -1186 1209 -374 -803 1566 -694 -628 2025 -1562 644 1539 -1703 947 707 -1093 1263 518
1346 518 -1164 1852 -314 -361 2225 -899 466 835 -732 1112 649 -1069 1309 -22 -1427 2239
1362 2239 -896 -391 1698 -1229 214 1140 -1080 435 1149 -1459 1321 268 -1497 1557 -722 -397
1378 -397 980 -1315 -200 1010 -1515 285 882 -2022 865 -635 -1171 1004 -1252 -1370 795 -1407
1394 -1407 -845 1428 -1897 -12 436 -1784 227 -272 -1371 856 -228 -1380 1076 -651 -423 1196
1410 1196 -1243 987 780 -749 1109 305 -944 1554 73 -827 2142 -864 105 2246 -1366 453
1426 453 1806 -775 703 1059 -1131 1769 338 -791 1992 -588 -159 1195 -1002 464 878 -1710
1442 -1710 1006 645 -1753 1540 -901 -1267 1594 -797 -679 1141 -1443 -424 1087 -1930 791 340
1458 340 -1498 1011 -578 -1023 1002 -680 -897 1125 -1366 -193 780 -1595 974 -146 -1246 874
1474 874 -321 -1100 946 -773 -646 1802 -1281 -31 905 -1159 322 641 -1086 409 18 -850 1325
1491 1325 -441 -449 1609 -942 372 688 -740 739 980 -957 1071 619 -950 1752 -174 -302 1423
1508 1423 -509 -98 1502 -748 189 1497 -1266 992 470 -1038 1183 -98 -553 1066 -600 -582
1524 -582 1106 -1286 184 687 -1708 974 -225 -1104 709 -265 -1130 929 -714 -818 1320 -1291
1540 -1291 9 507 -1389 574 73 -1248 632 -226 -1014 1149 -998 -711 1018 -1421 468 918
1556 918 -1118 604 304 -1260 1124 -215 -987 1490 -883 -235 1015 -630 303 790 -775 398
1572 398 688 -837 1075 -77 -564 1185 -460 180 1090 -586 264 1380 -984 1014 812 -902 1176
1589 1176 126 -275 1200 -212 -457 1000 -422 58 1250 -938 650 767 -905 526 -177 -644
1605 -644 528 -412 -929 692 -979 -387 634 -1372 230 59 -1300 288 63 -1481 718 -391
1621 -391 -1236 938 -1172 -658 663 -893 -248 423 -962 604 210 -1175 1082 -603 -274 1027 -749
1638 -749 -137 971 -760 83 815 -1092 859 697 -939 985 -2 -494 1081 -307 -87 1207 -310
1655 -310 91 656 -731 861 175 -653 937 215 -233 904 -237 -256 1060 -857 104 918 -925 692
1673 692 233 -741 609 -39 -950 890 -342 -590 590 -828 -99 497 -846 97 92 -1178 328 -148
1691 -148 -974 779 -814 -284 570 -967 -50 377 -966 -266 432 -1206 205 100 -970 936 -378
1708 -378 -243 887 -569 -404 503 -317 33 750 -743 789 35 -648 836 -217 -362 1025 -191
1725 -191 -347 1198 -814 585 938 -629 557 97 -398 751 145 -323 1157 -152 -107 815 -577
1742 -577 375 551 -458 438 390 -516 562 -83 -757 874 -464 -20 605 -953 -49 326 -821 -6
1760 -6 441 -806 419 -207 -832 614 -366 -321 316 -655 -136 284 -835 149 111 -757 531 -426 -382 524
1780 524 -628 -247 498 -420 79 668 -783 273 307 -794 339 10 -279 343 52 -389 510 -142 191
1799 191 623 -445 300 401 -254 512 203 -292 661 227 -238 1197 -216 86 719 -335 116 552 -570
1818 -570 242 347 -674 420 186 -260 864 -52 -7 483 -474 -86 459 -634 423 185 -876 680
1836 680 -438 -414 375 -591 -373 404 -440 -359 223 -788 -103 -139 -449 155 -233 -398 84 -191 -368 297
1856 297 -494 44 118 -461 414 -83 -503 369 75 -240 595 -124 -190 653 -510 112 473 -486 499 184
1876 184 -295 500 166 -255 443 -334 -101 533 -120 447 496 -147 74 569 -255 556 351 -375 753 75
1896 75 -48 557 -86 -147 349 -330 -48 367 -512 268 -19 -400 479 -400 -397 42 -53 -438 357 -340 -8 173
1918 173 -563 610 -194 -454 -28 -40 -698 189 -315 -450 431 -603 214 218 -433 303 199 -416 -119 17
1938 17 -268 483 -471 -45 484 -414 356 186 -456 244 450 -72 309 125 -271 535 4 18 228 -134 62
1959 62 403 198 266 97 -285 556 -180 -106 435 -89 156 376 98 66 221 -127 20 501 -256 141 -16
1980 -16 37 46 281 -407 443 -197 -62 267 -224 -39 46 -435 -78 28 -439 12 -163 -581 230 -277 89 9
2002 9 -537 -26 51 -276 -113 147 -672 79 28 -412 271 -42 67 138 -213 122 43 -209 199 125 -126 448
2024 448 -226 -220 442 -106 -57 422 25 39 117 -297 492 183 -187 153 191 -84 423 158 201 391 40 210
2046 210 179 -244 298 44 39 273 -130 -47 150 129 -105 286 -335 67 77 -207 113 -24 -428 -36 6 -287
2068 -287 321 -222 -147 189 -423 -251 -25 -73 132 -9 -167 -84 152 -261 318 -335 -234 38 -236 76 289
2089 289 -170 -74 424 -167 153 12 -310 85 -7 -142 193 -46 100 263 -73 180 105 -85 161 187 128 230
2111 230 81 -7 306 40 -39 434 -46 222 9 -172 67 64 -57 229 75 -232 207 -17 -4 228 -340 152
2133 152 -342 7 -78 266 -27 -60 101 -134 104 -28 -193 -36 -6 -28 97 -39 -110 38 -249 87 10 -194
2155 -194 -33 1 -409 14 -33 -37 82 -73 120 128 -78 164 -66 -198 3 -77 -52 117 -116 7 338 -145 137
2178 137 410 -24 146 24 134 306 437 105 -9 -54 99 269 -2 400 -72 -162 314 87 -235 111 -324
2199 -324 -235 404 22 -101 351 -52 117 344 43 63 -3 -72 137 -114 -308 111 -76 202 -17 120 -218
2220 -218 -67 -200 159 26 -211 80 -96 -298 15 -172 -36 -9 -168 -40 62 -166 111 18 -252 -1 -266
2241 -266 223 -54 214 192 -52 -134 178 267 -96 158 -157 185 88 127 -135 444 335 -231 385 25 227 88
2263 88 22 -153 269 -134 161 -49 269 44 -78 30 176 -92 -78 247 -47 31 193 101 216 100 -306 126
2285 126 -194 -101 -211 112 -193 224 -64 95 -58 -355 -133 -133 -261 -57 7 5 -211 -62 -270 -38 -265 97
2307 97 -65 -391 157 -264 -166 -22 49 -180 136 -93 -119 294 -218 -116 76 -3 291 189 -3 44 126 131 213
2330 213 206 209 130 -105 326 117 104 -77 363 -64 392 138 182 313 -125 182 -245 -152 -179 263 162 -62 -233
2353 -233 -31 -206 -41 49 9 -143 -13 -284 5 200 251 -56 162 99 -125 -121 136 32 12 -93 -209 -93
2375 -93 23 110 8 -333 -332 -312 -84 -95 -51 -32 11 -46 -125 203 -132 57 -211 -123 18 130 -60 -179 437 -128
2399 -128 236 -23 -116 7 -122 184 35 -187 91 -117 -13 122 -328 69 373 -168 -7 83 74 23 67 -79
2421 -79 126 26 -69 293 -124 114 193 -296 -4 -240 41 -34 62 -32 -193 -32 -233 192 -381 106 -86 -27
2443 -27 81 -75 5 -206 39 -416 90 -184 -283 65 246 81 -272 -312 -193 -185 -87 51 -313 -101 152 -312
2465 -312 201 -28 14 -13 -74 73 186 74 -38 7 -52 55 56 161 -56 72 87 -106 137 -89 -25 -151 30
2488 30 478 -16 51 60 146 311 448 87 -21 381 -274 157 46 27 10 -72 214 -130 -6 -49 27 -94 -110 229
2512 229 -194 336 -136 134 -19 -190 -76 -20 -74 -262 -21 -344 175 -77 -175 -128 -21 -274 2 -128 -65 61
2534 61 -417 -22 281 45 39 -38 -108 -6 -93 -61 -109 -436 -99 292 -70 278 -70 -38 2 149 -218 213 -95
2557 -95 113 405 -50 247 148 -115 275 305 -220 115 -58 -30 370 -287 -39 226 4 21 31 7 112 -29
2579 -29 82 45 284 17 26 21 11 214 -140 -11 -22 -13 -127 -114 -130 -149 -53 -312 140 -149 -220 -114 -149 -173 68 -315
2605 -315 -58 239 -226 -92 -113 -80 -71 28 97 160 -11 -148 86 -43 -134 -32 -336 -76 69 94 -40 45 -144
2628 -144 49 33 40 516 -109 94 6 35 181 58 -196 169 256 -153 123 -178 8 76 127 44 233 173 -11
2651 -11 235 32 309 120 -238 162 -236 48 278 -195 113 76 -190 150 -95 -353 125 -84 -241 15 -22
2672 -22 -133 -71 -195 -148 199 -446 -120 -285 -240 -97 35 -76 85 -88 -145 206 -226 74 86 -88 89 46
2694 46 -139 23 115 -155 36 -133 -413 188 -33 168 95 -128 67 200 -146 73 115 -54 290 -159 -81 293
2716 293 -174 143 81 17 149 237 -228 167 89 -172 172 -73 -33 -91 71 1 369 -2 -23 234 -289 321 50
2739 50 -317 55 -14 -70 123 -27 -305 27 -262 249 109 -118 102 -17 -276 -231 -89 -285 63 -227 -177 145
2761 145 -250 36 -26 -281 -243 -206 -269 88 184 -165 297 -84 39 406 -244 -179 228 221 -64 -67 -59 25 255 -152
2785 -152 220 173 18 23 -52 17 278 54 -60 222 -379 430 -23 -120 211 -212 -129 207 91 -205 414 -79
2807 -79 78 12 -119 168 -2 -126 222 105 -287 255 -167 49 450 -416 144 332 -321 -75 -200 -159 -20
2828 -20 19 -469 247 7 -153 205 -117 85 -62 -290 -267 -147 -138 177 -108 -19 174 -304 45 -168 17 -78
2850 -78 -73 -43 61 325 -210 290 55 10 18 -9 -104 132 177 40 323 -217 253 186 -4 170 -64 -1 120 231
2874 231 -88 218 -220 64 96 -128 244 286 -128 125 126 -60 158 144 -289 199 -10 -152 151 -109 263 -48
2896 -48 -57 65 124 -108 -25 94 -199 327 -260 -286 43 -227 -320 -67 -275 -5 264 -282 254 50 -515 63
2918 63 -401 -39 274 -279 -151 168 -190 81 -128 -473 44 -106 59 371 75 57 315 -247 23 -54 -300
2939 -300 310 11 -72 70 212 332 198 147 -31 369 -253 178 -12 188 170 132 21 292 203 -320 108 -39
2961 -39 -129 286 -136 -24 64 -199 12 99 -9 152 202 -364 174 59 -369 168 -392 -88 8 12 10 122 -210
2984 -210 -81 -25 -365 51 -68 -408 -64 -76 -263 26 -241 -74 127 -443 196 -190 -300 155 66 -98 27
3005 27 77 -22 278 93 162 18 -138 121 -188 296 257 73 131 271 12 -101 212 -190 228 192 -336 140
3027 140 139 -138 206 55 -175 305 -270 209 137 144 196 106 -183 136 287 -188 328 22 -238 563 16 -78 48
3050 48 -50 -108 152 -249 -20 91 -330 354 -142 -306 -145 -91 -344 100 -78 -218 21 -265 -128 336 -78
3071 -78 190 -8 -216 95 -56 72 299 -142 79 222 -137 77 88 -75 -119 195 -338 262 272 108 260
3092 260 -351 -102 305 205 -16 269 106 227 98 -37 281 -26 -143 434 -313 -201 389 -51 -17 417
3112 417 -44 -242 332 -318 149 -18 322 103 1 21 16 -122 -15 -73 -264 148 208 -172 -17 -77 -182 23
3134 23 -162 -113 124 -170 -167 119 -144 9 -135 -199 -83 34 -78 277 -283 -324 170 -292 -257 361 -123 133
3156 133 132 52 33 155 -247 -27 29 69 73 90 80 25 17 -36 228 0 130 248 99 316 -36 73 151 40 -93
3181 -93 303 -36 256 320 -213 340 182 -198 277 -116 -175 252 57 -359 55 -147 38 65 -291 121 -45
3202 -45 77 -110 -265 -357 131 70 -26 91 -493 -61 58 -487 -173 10 -86 -130 -52 -322 175 -363 -72 95
3224 95 -104 -8 59 -151 -282 170 -332 -38 236 -103 110 -74 -191 265 -203 -92 298 -60 115 402 -300
3245 -300 215 172 -68 205 -73 -135 5 -336 -1 349 62 267 326 -114 104 149 -119 54 -7 -359 362 12
3267 12 -117 316 -55 38 -103 -61 -5 183 -40 -1 -205 -91 196 -192 39 87 -207 44 141 -182 -35 194
3289 194 -204 -126 -42 -130 43 -71 -101 -23 -88 -361 228 -255 12 -187 -355 70 -225 -8 135 -374 -239 -5
3311 -5 161 -168 246 -222 113 222 111 5 -48 -164 -188 -49 18 146 2 102 47 -154 176 394 -15 369
3333 369 124 -17 -72 -48 -141 228 13 127 237 276 39 -8 28 101 -17 -217 17 137 -96 -85 -221 139 -61
3356 -61 -35 -241 -434 -149 44 -136 -380 40 -133 76 133 -24 -33 -24 -130 -165 143 -281 -224 342 -335 -63 27
3379 27 -229 83 127 -201 18 -259 -188 16 -91 217 -201 -130 270 192 -152 179 -75 -123 -22 -98 117 23 -325
3402 -325 14 311 24 313 -72 -131 27 30 -96 246 42 136 50 140 163 87 -55 -140 55 -99 46 -229 -232 75
3426 75 -201 154 41 -17 -193 33 162 111 -170 40 104 -120 -223 88 -10 5 22 -241 -130 125 -29 48 -79
3449 -79 -169 27 -164 -105 -27 -17 -71 78 7 -89 103 -247 -123 94 -118 230 123 -113 59 145 -371 185 -35
3472 -35 66 119 209 -186 38 -109 -109 -68 -101 192 0 180 103 -83 287 99 -60 -12 101 218 116 -34 -75
3495 -75 131 -66 -287 359 24 -121 190 -92 124 10 -19 17 79 -145 70 10 -83 -94 135 101 -128 -301 16
3518 16 -164 -230 -200 -63 -64 -43 -89 -168 20 -276 -261 134 -101 -127 -138 -36 -181 -45 -88 -41 -2 64 -36 -42 -137 5
3544 5 -123 154 70 179 -74 350 -134 118 178 -62 148 109 22 186 140 109 191 -130 3 102 -63 67 -44
3567 -44 37 20 28 24 88 -184 -248 309 -55 -116 -162 -178 27 125 -155 -10 95 -122 184 155 -8 -394 -144 -192 220
3592 220 -172 107 128 -268 -75 16 -378 -5 -238 4 138 48 -128 -21 -78 -313 88 63 106 89 42 91 32
3615 32 4 -88 148 60 89 0 271 38 67 165 142 -36 -62 -78 -116 -119 161 394 179 -143 272 157 -95 23 63
3640 63 -45 -89 132 -319 235 96 65 -94 75 -12 -194 -100 -134 21 -6 -55 -94 -24 -3 -17 12 -82 -73 -13 276 -223
3666 -223 67 52 -204 3 -38 31 -26 -215 58 -363 36 -170 -75 3 -167 279 -39 -186 -49 -107 203 -129
3688 -129 -184 -3 132 -1 273 150 -99 -89 164 31 -187 -80 -102 118 128 140 123 -21 129 -69 -37 165
3710 165 -53 544 125 184 83 -228 -274 251 -133 19 69 240 -127 27 -145 122 -137 -197 -15 -120 -162 -27
3732 -27 277 201 70 -289 -1 -113 -132 19 24 139 102 -70 -18 -94 -2 -207 34 -244 -28 43 27 -142 -179 -79
3756 -79 166 -66 40 -284 -139 24 47 49 -1 71 13 107 -57 126 -106 -171 -70 -34 -185 -149 219 97 76 92
3780 92 -38 -73 239 -109 -54 71 -98 137 47 -183 75 -33 66 72 242 55 28 -155 203 89 76 -54 -281
3803 -281 95 11 80 57 -103 -25 17 -84 54 -117 133 -47 -140 -76 148 -164 65 -125 -40 -366 -209 -187 -60
3826 -60 166 -118 -169 8 202 -48 -14 -114 -354 -263 96 38 -77 -162 31 -192 151 -165 4 -81 -62 -156 -50
3849 -50 48 -216 234 -50 168 114 375 80 -79 0 -77 225 25 267 238 -58 -103 197 9 11 106 93 102 181 124
3874 124 -180 -118 -142 66 23 1 159 69 74 -80 180 142 -242 63 -61 163 -280 3 -27 -19 110 -119 80 -168
3898 -168 -126 -79 112 20 -31 -18 -162 -41 95 99 -33 104 32 -249 -62 -110 -130 -14 64 -6 33 15 121 -87 137
3923 137 -45 -114 70 102 70 32 -43 68 64 99 257 -16 2 22 82 88 2 -225 102 78 144 -33 1 -128 -44 200
3949 200 -211 -79 180 1 309 332 -35 -52 302 61 105 84 64 50 -98 -63 -257 57 -19 73 39 -309 -51
3972 -51 -6 -177 -113 -112 -145 -16 140 -453 -156 -94 -294 -232 -275 14 -27 107 80 -264 85 114 -79 5 -322 -141
3996 -141 -17 -3 -118 94 -187 -1 140 -109 134 188 -173 205 -249 -8 12 -64 86 100 30 137 46 -22 100
4019 100 -66 5 11 -136 131 48 185 -137 268 188 105 122 37 -126 20 -54 -212 52 107 -190 -89 -23 85 -30
4043 -30 -348 313 -36 -136 -117 194 91 15 -212 -25 55 3 36 52 -215 -3 15 33 -23 -124 -103 -30 -138 160
4067 160 157 -180 -165 55 206 -27 103 106 93 76 -63 -68 100 124 70 28 29 -72 -12 52 104 128 109 68 -7 243 118
4094 118 127 140 -79 15 -117 101 -31 138 -22 -18 113 51 219 105 -24 29 7 -63 102 45 129 93 -17 60 -190
4119 -190 -159 246 117 -108 -48 -168 91 -40 -62 -86 172 -146 13 112 -59 56 -203 -7 70 -83 24 80
4141 80 -211 -67 -96 -103 63 -69 56 -196 -97 161 41 -29 -104 260 -166 91 305 217 338 -48 116 -4 78
4164 78 -162 194 153 140 -25 -2 127 195 250 -103 -84 41 15 197 -271 180 -21 27 -56 -167 119 237 3
4187 3 -31 -53 -274 87 4 -9 133 -134 -56 -3 -134 58 -4 -275 -86 45 -114 -225 -343 -34 89 -262 124
4210 124 -118 -74 -208 25 -223 72 11 -143 132 -151 22 -76 326 102 0 71 -216 96 -71 212 -110
4231 -110 238 37 -46 244 149 118 -118 157 54 -68 -62 -356 325 29 154 105 105 -72 -367 0 176 156 -98
4254 -98 170 -68 -137 -118 -20 -183 141 116 -35 59 35 -43 -118 -30 -32 -112 -165 -209 -88 68 -42 -117 -251 -32 -301
4279 -301 84 65 -117 -16 157 -185 -128 -74 -106 120 -295 -331 42 -286 93 -257 30 32 65 -5 -78 178 -184
4302 -184 208 60 34 82 -217 146 332 -64 153 -3 -79 -27 -152 -212 82 -43 -146 102 -50 245 -11 96
4324 96 398 72 -81 242 126 -177 -74 24 187 22 -199 -4 -112 -104 -51 120 -2 287 -233 -156 281 -101
4346 -101 226 -1 -103 -46 42 -64 190 -196 -77 50 -46 -36 -108 128 -212 157 -120 -14 -77 -234 -109 -88
4368 -88 -50 45 -12 -36 100 112 81 109 38 -130 -97 64 -181 258 -103 -57 112 -177 164 82 -128 -127 395 155 16
4393 16 34 -25 94 131 185 117 -214 150 251 35 34 197 14 124 -188 115 219 -55 160 31 -256 393 -95
4416 -95 75 100 36 65 -40 -163 24 1 -339 -196 239 205 -230 -1 -293 -114 -236 -255 -36 -70 -111 24 -52
4439 -52 64 44 26 -109 12 -43 -214 129 -44 -62 15 138 179 33 301 48 -32 62 -244 -148 241 -58 112
4462 112 105 -38 -5 55 -122 121 -62 -236 280 320 144 83 -23 -120 92 109 259 -14 -77 54 -40 -12 -24 21
4486 21 -124 63 -298 -39 341 70 7 -73 29 -90 127 -68 16 180 -101 191 -22 -79 164 -162 -113 -77
4508 -77 20 -4 154 -258 -232 93 -177 27 -244 45 -219 41 -54 222 24 -182 25 43 106 30 32 361 -51
4531 -51 -15 39 -117 -66 323 -78 9 134 -94 86 -269 67 -255 -125 -64 -29 -54 122 444 157 -74 83 -108
4554 -108 -63 110 -142 90 116 132 222 104 164 175 11 -174 91 -21 -257 102 -75 36 98 -254 -337 -19 42
4577 42 -27 -241 -53 158 -213 86 33 -351 -197 -173 -124 -57 67 -125 161 -13 -299 38 -62 82 150 79 -30
4600 -30 229 125 225 -109 -15 -90 178 -216 145 -178 -28 -109 139 102 138 19 -285 215 63 22 -344 122
4622 122 -54 5 -154 -155 -81 102 19 130 142 59 -232 212 -176 26 42 358 -153 42 -149 -94 41 -468 -168
4645 -168 -33 -178 70 4 -280 -55 -191 1 169 -192 -206 195 -148 63 -88 -100 62 93 -382 85 160 -290
4667 -290 -63 -173 381 -95 -66 123 82 20 -115 -69 -33 134 110 -181 45 163 69 27 32 -112 221 -289 225
4690 225 -29 -52 279 -167 -133 59 -40 -176 267 24 120 162 -152 69 -19 -46 -12 55 -73 -7 63 -45 33 -136
4714 -136 171 -84 -366 232 53 99 104 88 179 183 -231 -5 -55 -73 92 -18 13 -212 -119 -228 -40 84 25 43
4738 43 -133 -124 100 18 -49 -41 -192 -241 -106 -186 89 90 -163 46 -186 -38 169 -143 166 405 -196 -135 15 -22
4762 -22 85 -23 -200 107 -65 -120 105 -176 161 148 -43 218 282 284 275 46 189 -34 262 212 174 -72 -11 95
4786 95 -65 221 -63 -107 124 286 -68 201 130 45 18 119 68 177 115 -183 100 42 -152 -120 144 208 -172
4809 -172 -40 109 -103 -155 -132 -76 -280 -123 -188 -107 -28 173 -118 -205 -31 -112 -8 -152 73 -38 -148 81 228
4832 228 85 -73 -64 104 -91 97 -99 -59 71 92 -178 42 -23 -207 -46 33 3 78 -283 -120 39 90 4
4855 4 -40 9 -26 338 -219 181 130 -29 110 233 -102 190 -119 -154 113 -61 -34 -206 67 115 405 54 -8
4878 -8 304 -72 -17 -54 -70 41 108 3 64 217 155 -75 -90 -25 -10 -178 103 -87 148 -116 87 -220 238 -50
4902 -50 -249 -60 -19 255 -72 -255 -79 59 -71 187 83 77 204 99 -69 37 95 127 41 -30 72 66 -47
4925 -47 98 31 320 -4 60 131 200 -89 140 75 236 67 142 -87 98 222 -97 -149 -79 -51 51 -63 -31 143
4949 143 -180 135 -145 -327 -132 -108 135 83 -121 80 107 10 -218 -30 -82 125 10 -221 -30 18 -19 179
4971 179 113 -73 270 -131 84 -96 191 83 -13 -87 91 -235 -78 6 -189 -249 74 58 38 -79 11 9 143
4994 143 -32 -39 132 -17 335 374 -125 86 50 -45 469 -142 40 94 -77 84 155 60 108 21 43 47 140 -15 -55
5019 -55 -128 -108 -154 -84 -229 -99 45 -2 5 -241 195 -306 112 19 -311 7 -36 -126 53 3 -69 77 148 -276 -28
5044 -28 -284 57 65 -18 99 6 -49 -158 239 -130 95 414 9 223 79 125 -125 -201 40 369 -190 227 62
5067 62 -229 97 179 169 -9 256 225 190 30 -38 173 -51 89 206 -137 190 141 -7 67 -12 -22 -98 -9 -31
5091 -31 79 -116 205 -27 95 15 32 172 -132 7 -75 42 -171 102 -55 236 -35 -21 -133 -187 -119 -20 -13
5114 -13 -86 105 -29 -379 -152 64 -79 44 74 -398 -324 27 -36 71 -273 40 -15 -4 -150 -105 -39 81 23
5137 23 -7 14 -73 151 -312 -220 -3 4 76 2 30 -39 122 53 -104 41 -12 60 333 88 -91 -128 59 -19 68 -198
5163 -198 -99 1 -61 -148 182 181 25 151 157 6 -195 -110 336 -37 38 57 -44 -38 -58 -92 140 -53 -63 -54 -97 -209
5189 -209 -39 -213 84 -47 -108 -222 66 133 -100 -83 46 138 89 20 -57 130 35 -186 -283 93 -109 87 36
5212 36 -8 -32 -10 20 23 29 -98 84 124 65 -70 118 265 201 -88 -169 -466 -19 -298 135 146 113 197 45 -145
5237 -145 -267 -23 -29 198 47 71 -119 -59 113 52 -45 72 -75 13 -69 -63 25 -162 168 -27 -52 223 59 72
5261 72 -120 31 52 -38 -141 -235 -177 122 -284 -32 -86 83 -163 138 37 127 -50 -54 21 -369 -51 10 -12 -11 -247
5286 -247 163 173 51 166 229 135 72 -6 83 120 -171 155 76 37 125 -38 -137 -21 -204 56 -13 -99 -66 48 -228
5311 -228 -255 -373 -229 -11 43 45 -41 -116 -75 -10 -10 351 -51 92 62 68 -29 85 10 77 44 -172 -264 -11 88 -49
5337 -49 54 112 -49 16 -126 86 -35 50 -21 -10 -39 155 125 137 73 -182 73 -57 23 75 -209 -310 79 44
5361 44 -61 -308 68 -37 2 -105 97 -373 -64 124 -60 63 -40 227 31 -65 80 -139 104 -76 234
5382 234 -161 100 13 24 312 -339 -10 -238 66 -90 -239 -282 34 11 38 -152 214 -35 -54 -46 84 -90 54
5405 54 -242 -125 28 -28 -25 -113 -33 43 -70 -27 85 -65 -98 -120 -187 101 -207 -59 -39 84 37 18 30 48 -139
5430 -139 -103 -35 -103 -13 25 -135 -51 179 147 151 -50 170 119 -30 -100 203 -54 -4 166 -4 -93 120 89 55 -6
5455 -6 79 -58 168 91 -16 64 141 191 -185 24 -52 20 -107 -141 282 -136 91 -37 -58 174 156 -30 -251 99
5479 99 133 179 100 43 49 122 82 -250 114 104 43 -104 -294 -3 -154 -64 -6 251 -130 59 -204 45 -46 154 185
5504 185 -16 -100 -220 37 31 -86 63 169 80 35 29 121 -85 228 62 108 169 -34 -131 223 41 24 103 -136
5528 -136 -208 105 -63 154 -147 113 312 122 216 -32 81 19 -30 -79 -4 -252 -135 30 -134 -8 -17 206 86
5551 86 4 -162 23 -64 74 -32 -139 148 -5 -103 -3 -386 -45 167 -112 -26 -21 -177 -20 -233 -246 -189 -195 251
5575 251 -131 -17 -77 -19 -233 -288 -79 166 27 -128 -17 -103 20 174 80 -131 275 12 -178 9 99 15
5597 15 100 5 -3 60 -122 -88 53 203 -44 23 65 -177 25 50 141 -10 -255 -19 217 41 246 41 -44 179
5621 179 20 -197 179 27 -69 187 24 97 -62 -69 -29 -45 23 152 -117 -244 90 -195 14 64 -133 -15 -94
5644 -94 -182 85 -146 -96 63 -138 -137 -103 57 -202 33 -50 73 -81 85 180 -58 -78 64 -190 -10 -28 -200
5667 -200 45 -24 -242 -105 -90 49 127 138 -220 22 -87 73 104 -106 53 53 35 -172 101 195 258 27 96 -126
5691 -126 -93 173 20 -73 -194 -94 -70 37 -112 -34 103 226 -22 101 -10 -20 -159 -229 201 94 170 -200
5713 -200 3 160 -82 -55 -18 -72 80 29 113 100 100 -14 20 76 65 287 -44 -88 57 246 -24 -395 -70 -84
5737 -84 -319 -100 128 14 127 16 -169 -6 43 -15 -97 125 -55 172 -153 109 14 -158 197 100 -8 -104
5759 -104 -147 13 -48 132 159 80 7 38 -23 -67 13 -8 54 130 -42 -24 -65 -124 8 -223 -13 -126 37 -16 -270
5784 -270 -211 192 -148 -186 58 -196 -125 104 -135 58 30 190 198 -101 -75 -128 -44 -42 -99 -41 26 -281 -200 266 56
5809 56 -298 -183 -1 32 -210 134 102 -201 -110 144 112 73 5 -42 95 88 308 196 79 88 109 218 28 -84
5833 -84 267 262 132 -78 179 131 51 23 180 -44 106 10 9 -33 72 -230 -132 177 -125 195 -75 138 85 -28
5857 -28 57 3 152 -79 58 -159 66 110 -187 -179 -182 -91 -129 -10 -127 134 -60 -120 31 -170 162 21 102 64
5881 64 -195 283 -77 192 -55 138 -19 -105 -228 -141 -184 112 27 -103 21 -21 84 93 -225 -104 80 138 141 100
5905 100 64 106 55 -182 102 -73 180 -83 75 67 -23 62 -18 145 183 21 -107 148 -69 -19 40 -217 -104 -14
5929 -14 -26 8 -134 86 48 25 99 -6 39 243 92 -150 -167 -270 -42 -140 225 -39 -32 -35 -159 -5 12 27 -26
5954 -26 86 -34 -15 145 -37 -63 -63 14 201 -132 6 -72 -139 6 264 -27 -68 -83 -59 -197 -49 -55 77 137 86
5979 86 50 -10 -25 -16 -134 -26 100 -148 227 -95 19 -47 187 225 105 43 206 -109 71 322 95 13 149
6002 149 -57 81 -131 -81 115 23 -48 49 -76 -9 65 71 55 49 54 24 -39 -296 130 -132 -32 -138 151 -72 28
6027 28 -97 194 21 -7 -123 -3 -121 104 -46 -43 -90 -48 17 -33 -97 -10 164 -121 -73 -64 -25 46 -25 -124 96 46
6053 46 54 65 191 144 69 -64 115 -51 -4 46 -22 -199 -53 -14 165 215 -130 234 -17 210 185 70 -137 11
6077 11 53 -86 -154 74 -50 81 81 -296 127 67 -105 -110 157 127 -72 -441 57 -292 -177 -164 54 6 -167 43
6101 43 -169 -131 166 -122 31 -75 -145 17 -108 -181 103 -153 9 114 -33 -91 60 82 -241 27 -29 -87 88
6124 88 35 198 78 -100 90 -38 49 -86 111 92 -39 -157 -127 136 -68 147 -104 -138 -80 -41 -79 -46 -218
6147 -218 -65 -25 114 169 -52 163 225 89 -143 20 -89 -205 200 19 78 -91 298 -17 -245 -59 -105 -156
6169 -156 75 -41 -167 -88 -148 -17 92 -56 -226 -154 -196 158 121 76 -218 204 -53 215 43 -51 -130 35 -162
6192 -162 111 113 -139 300 -200 -19 455 55 -34 -136 124 204 103 -92 149 179 181 -274 36 73 -155 -121 -196
6215 -196 -102 -17 62 -72 81 203 29 322 182 -3 -20 -151 -80 115 352 -36 136 -27 79 -29 -147 196
6237 196 205 68 72 -19 -35 171 141 3 83 48 -45 -313 -289 -6 105 22 -35 99 -75 -321 -262 -82 -82 30 73 -5
6263 -5 120 73 -121 -56 -171 -164 39 -182 9 -109 -141 178 -104 179 51 -118 119 -163 -41 -121 98 72 62
6286 62 49 -121 -65 26 149 102 -59 -120 4 120 -33 168 -16 -4 4 178 16 79 170 157 8 -150 -52 -51 119
6311 119 27 -77 241 -112 -154 -23 -163 4 -151 -147 5 -191 -129 30 -132 -5 221 7 36 -35 -259 -90
6333 -90 40 -20 99 -116 1 347 147 -111 -18 -33 69 -165 72 28 131 52 -202 -167 -169 13 250 -57 4
6356 4 29 -44 54 9 -47 -66 -155 165 -26 -6 161 -102 32 -34 231 -64 66 -80 78 -176 72 -12 106 272
6380 272 -153 -66 68 -88 118 8 -11 151 112 258 -156 153 50 -21 105 -4 147 2 261 177 -179 -98
6402 -98 -28 -117 -103 -44 84 99 -72 -23 15 -170 -136 -170 295 141 -31 77 -74 17 150 -144 -38 -100 31 103
6426 103 -59 11 -83 90 -290 -148 -115 115 268 -197 69 9 200 -44 -17 41 -115 -92 -204 51 177 -108
6448 -108 296 122 -143 -46 98 -92 -157 -29 -207 -52 -55 181 -57 -11 -167 -56 -75 31 -112 -77 115 4
6470 4 -107 79 84 89 14 2 -122 -9 -152 11 -216 3 45 -30 33 -106 -189 -10 38 92 81 -127 24 -147 -132
6495 -132 100 -115 -350 -157 132 -14 207 227 290 167 -142 -60 -207 59 -43 205 -323 9 -187 163 -178
6516 -178 -69 38 -115 185 184 -83 170 158 -170 -34 117 -82 -129 154 -272 -89 -173 -97 216 -113 -173 -31
6538 -31 -220 7 -65 -84 10 -157 -113 -33 48 -76 105 -112 -173 163 -77 192 -43 -7 13 -133 312 -221 -314 -42
6562 -42 59 -128 52 141 132 19 96 46 171 86 122 -103 144 115 -147 -17 -11 122 0 108 -174 252 -11 -281
6586 -281 -78 -21 -92 -16 38 74 -254 -179 58 340 183 110 38 -120 45 32 120 -185 21 98 179 260 10 112
6610 112 275 28 -155 37 46 -91 -72 86 152 354 -181 -98 94 -189 -193 -32 -65 142 173 3 324 -48 -52 -76
6634 -76 -61 -64 47 -40 -65 2 -99 1 100 -120 121 -44 -124 135 35 -29 366 -82 27 30 -102 306 33 -31
6658 -31 -51 -146 28 72 253 -14 -8 280 -240 159 46 135 -44 91 -50 56 77 295 -57 -58 48 63 -80 -17
6682 -17 -88 -77 -24 79 -83 -44 204 -65 -49 94 84 164 -128 -249 167 37 259 155 78 -33 -120 -171 -84 101
6706 101 96 43 -295 -120 -54 138 -113 60 -104 36 -121 -45 -90 35 103 -88 -47 -110 166 86 84 -100 -304 -81
6730 -81 234 85 190 -41 -19 -15 149 80 -2 43 172 39 -28 42 56 144 -18 33 -21 -32 -32 -128 -27 102 -117 -79
6756 -79 147 349 -35 -277 -270 93 108 96 -38 -202 -58 126 240 -229 39 43 236 33 113 258 20 53 153
6779 153 4 145 -77 -70 87 -9 13 -41 199 -140 -6 111 -40 94 -110 318 7 74 -6 93 183 80 81 167
6803 167 145 48 -145 2 -216 9 112 118 291 45 69 -189 -131 -59 137 37 87 -136 60 142 -20 56 101 -81
6827 -81 111 45 -69 -87 -6 123 -129 25 -65 -217 104 47 106 -152 -75 -32 9 -17 -65 -25 -83 132 -106 -131 -184
6852 -184 -89 -335 151 -144 -188 315 57 53 109 -272 11 -75 53 7 18 -41 -62 -189 35 120 21 -66 19 -111 106
6877 106 336 20 -39 41 -179 -19 -138 210 -193 -234 335 6 196 -3 -302 272 -131 162 142 -314 210
6898 210 252 -69 45 90 -24 -67 20 167 70 -160 124 -93 11 204 -8 -33 -36 -210 161 97 -195 -110 -193 -168
6922 -168 34 -127 71 127 -96 -9 23 -152 -127 -73 14 -249 81 22 74 -127 -42 40 -46 -45 -213 114 142 -87 182
6947 182 43 -260 -196 -97 187 -96 -258 -144 -186 1 76 -21 -31 245 -243 207 -144 -20 -69 115 172 -145 98
6970 98 86 -101 33 -160 140 35 47 95 -25 58 -80 -68 31 -128 62 78 141 0 -39 55 267 35 -214 21
6994 21 32 128 -237 113 -208 -86 24 -42 -78 10 -5 -18 -104 21 -65 -47 -460 -46 116 174 199 94 -3 -5 41 160
7020 160 250 -263 172 129 -31 205 -7 119 -154 3 105 47 -157 287 213 -331 214 -157 -72 156 130 -18
7042 -18 -55 83 15 33 -137 -352 -127 163 239 190 34 192 35 390 268 -121 47 -25 321 13 72 125 196
7065 196 110 115 -397 -4 -4 -92 156 -17 -217 30 -103 -172 -42 -9 46 -154 115 -238 -97 -85 -223 -40 -22 56
7089 56 113 -91 261 122 117 -238 -118 185 -64 -62 211 -171 -103 -6 72 74 -43 119 -66 103 61 73 88 38 176
7114 176 69 -193 -60 13 -111 -249 23 -220 -136 -72 31 -25 -33 -250 -46 182 -13 60 -72 -268 -27 146
7136 146 365 188 64 221 89 127 -76 164 -57 128 -98 39 -191 -30 -180 -120 181 -126 -265 -122 -390
7157 -390 -61 -379 117 4 -82 -208 -77 99 -33 51 -188 -42 76 165 -6 -56 -182 392 100 -204 -189 88
7179 88 -150 198 299 30 181 315 115 -49 -91 -94 -176 98 -139 -32 -11 -27 112 45 21 102 -103 -12 43 137
7203 137 86 95 24 74 -142 -172 204 223 -1 -79 103 -44 68 118 -92 26 -160 23 171 -236 104 -71 89
7226 89 283 -232 110 97 27 -4 -2 -30 -194 -117 -59 64 -195 -42 -118 46 133 -16 75 166 -87 -3 236 23 -16
7251 -16 -161 -114 84 299 -112 -25 -82 -74 95 133 221 -97 284 79 111 -67 31 -50 -214 50 68 -52 71 133
7275 133 160 -17 12 -86 6 102 -191 -186 32 -30 -51 71 143 125 46 184 -95 -67 58 -58 -42 -58 121 -170 183
7300 183 -104 139 -161 -110 -80 -144 -89 -6 -21 -143 173 74 74 124 75 -87 -89 1 25 -286 129 -116 35 67 17 -110
7326 -110 -153 -5 81 -97 -76 140 -39 -129 0 -54 -33 -73 -92 122 -121 -6 69 -147 -39 174 -76 3 -19 50
7350 50 -160 47 -76 100 -52 -125 69 -67 60 29 -133 287 15 -2 67 -128 50 29 -27 -128 -40 204 163
7373 163 -23 -225 21 147 -2 16 -263 -55 -97 -71 -43 -9 141 19 70 185 49 50 -55 23 -244 -92 -345
7396 -345 -230 29 227 197 -258 -84 -420 -80 -114 -205 103 71 181 191 -261 9 110 -106 -8 28 5 312 -140
7419 -140 -132 -63 7 148 143 114 193 -129 -136 97 -15 -27 -64 -278 -89 121 127 127 80 152 -25 122 -60 -310 168 235
7445 235 -180 66 174 1 148 -8 161 -136 136 -162 -11 55 29 -64 65 -159 86 125 131 62 159 149 -332
7468 -332 -1 -115 -76 -230 -190 -63 221 9 -5 0 145 -19 -172 1 -197 -38 -70 98 -100 124 -52 -11
7490 -11 186 -267 -3 26 48 48 3 15 20 136 48 -1 -113 -4 -65 -95 139 -223 -7 -83 76 205 -78 -3 -196
7515 -196 -157 409 17 -9 196 190 39 33 -33 -104 -11 -128 21 -125 73 82 4 -139 -181 51 95 76 33 51 -17 105
7541 105 148 -37 -192 234 258 149 56 -20 -78 101 106 -13 198 16 -211 -455 357 265 23 -47 -49 89 99 -6
7565 -6 156 66 14 66 -78 6 -153 66 -173 -355 -178 -40 126 -56 26 8 204 57 -213 117 -66 -55 209
7588 209 -167 84 -221 -104 -128 169 -18 -64 55 -166 87 -39 31 -62 21 -238 -58 26 -30 -11 62 -60 25
7611 25 294 162 -134 -175 -75 123 49 96 9 -100 -51 -59 -101 -178 -27 -298 20 -30 5 293 143 39 -72 -138
7635 -138 -10 99 151 7 -11 -134 -154 98 -214 -86 106 47 -54 139 -71 -126 20 -145 49 270 -159 338
7657 338 -133 93 61 7 132 -72 149 -52 90 91 -97 47 136 -75 -95 -19 -36 -187 43 -27 -119 124 -185
7680 -185 -22 -86 -141 154 -87 -140 -3 -10 127 -76 187 37 -111 193 55 176 78 117 112 -200 -47 8 80 -56
7704 -56 231 -271 88 -171 -81 -148 -34 128 159 -72 -38 199 -201 -147 -18 45 10 -49 -63 -9 35 125 2 89 -138
7729 -138 -87 305 55 -21 68 73 62 47 -59 -23 -22 -7 -34 -45 154 50 -176 -70 -122 96 -159 5 49 95 226
7754 226 101 112 0 -70 90 99 226 -24 -117 -31 14 -153 238 99 -121 43 41 -64 33 -150 -140 72 -30 -13
7778 -13 -54 -111 122 -159 77 51 -405 51 -70 -58 78 -86 136 71 124 304 -102 130 -137 75 -187 -41
7800 -41 -80 14 -33 44 -112 -77 3 122 -97 -12 -77 16 269 26 127 -53 -36 98 4 -83 0 -233 -45 147 -189
7825 -189 -182 267 -53 -98 -85 57 48 253 65 107 67 -40 99 -183 167 -222 -102 -42 19 -334 -215 -37 -174
7848 -174 -80 -86 -76 -289 -3 -17 -77 -10 41 138 234 10 42 -19 166 -58 -186 -89 -168 -269 98 -112 -74 82 182
7873 182 105 -170 -194 -68 123 267 -219 228 -68 -280 -124 28 -165 5 34 94 -49 109 106 28 87 130 -245
7896 -245 -177 64 48 -162 -156 -134 152 -89 -340 74 -65 -140 -222 61 149 163 165 164 147 -162 120 -174 -153 125 109
7921 109 279 5 222 3 -50 -187 45 -26 11 161 -120 55 -58 106 -3 3 -65 130 124 6 -2 92 38 -233
7945 -233 -41 -176 22 -39 -253 86 118 228 89 -4 -102 122 -69 -63 149 -150 243 -17 -2 -150 104 193 40
7968 40 -37 -258 227 -38 14 200 12 241 -46 280 65 -49 -146 78 -15 73 -88 187 -116 -38 178 24
7990 24 207 28 -100 -55 -53 70 132 -120 174 127 -193 -2 8 -344 292 -95 -190 23 71 72 -90 16 202 -1
8014 -1 -50 -63 86 105 88 -11 -244 -43 -37 216 -12 -59 39 10 39 63 46 249 -169 361 244 113 67 8 4 133
8040 133 27 -11 38 29 15 -172 75 96 50 -63 -17 45 -155 18 -28 43 -133 -112 -141 33 282 -51 -155 -95 71
8065 71 -87 39 190 227 -253 7 -81 182 96 100 -1 -94 -25 -10 323 -84 31 -30 -210 -90 -67 -363 75 62
8089 62 -193 208 182 52 -111 -326 31 -85 209 10 209 150 -81 -38 -93 73 -152 114 -93 -53 87 -40
8111 -40 43 97 166 -122 25 76 -106 125 178 143 97 -118 21 33 -168 -63 17 24 -270 -96 255 85 -56 -25
8135 -25 210 -248 -181 -15 -19 112 -45 -70 -49 211 68 -262 41 203 86 86 15 -210 213 -261 212 211 -118 -21
8159 -21 -203 -56 -167 218 -38 143 21 64 130 29 -122 -91 -163 168 -226 -200 139 -99 455 -86 146 -39
8181 -39 -131 122 233 236 87 -97 3 -56 -52 111
8191A11
##END NTUPLES=NMR FID
##END=
