##TITLE=1H_Ser 5-4-V-H
 CDCl3,8 sc, 
 7.04.2021
##JCAMPDX= 6.0         $$ Bruker NMR JCAMP-DX V2.0
##DATA TYPE= NMR FID
##DATA CLASS= NTUPLES
##ORIGIN= UXNMR, Bruker Analytische Messtechnik GmbH
##OWNER= root
$$ XWIN-NMR		Version 3.5
$$ Wed Apr  7 10:43:10 2021 Russian Standard Time (UT+4h)  she@DPX200
##.OBSERVE FREQUENCY= 200.131506
##.OBSERVE NUCLEUS= ^1H
##.DELAY= (6, 6)
##.ACQUISITION MODE= SIMULTANEOUS
##.ACQUISITION SCHEME= undefined
##.AVERAGES= 8
##.DIGITISER RES= 18
##SPECTROMETER/DATA SYSTEM= spect
##.PULSE SEQUENCE= zg30
##.SOLVENT NAME= CDCl3
##.SHIFT REFERENCE= (INTERNAL, CDCl3, 0, 15.7039)
##AUDIT TRAIL= $$ (NUMBER, WHEN, WHO, WHERE, WHAT)
$$ ##TITLE= Audit trail, XWIN-NMR		Version 3.5
$$ ##JCAMPDX= 5.01
$$ ##ORIGIN= Bruker BioSpin GmbH
$$ ##OWNER= she
$$ F:/spectra/data/she/nmr/H-F/1/audita.txt
$$ ##AUDIT TRAIL=  $$ (NUMBER, WHEN, WHO, WHERE, WHAT)
(   1,<2021-04-07 10:41:54.12 +0400>,<she>,<DPX200>,
      <created by zg, POWCHK disabled, PULCHK disabled
       configuration hash MD5:
       00 E9 B6 7A A2 85 ED C7 34 08 36 98 17 FE 4E 26
       data hash MD5: 16K
       89 E2 35 2B E0 7F CF D1 71 1C 30 3D 65 8A 81 92>)
$$ ##END=
$$ 
$$ hash MD5
$$ E2 22 4B 57 95 1F 3A A8 6F 65 69 D0 A0 AB 77 C8
##$RELAX= 
##$RELAX= 
##$RELAX= 
##$RELAX= 
##$RELAX= 
##$RELAX= 
$$ Bruker specific parameters
$$ --------------------------
##$DU= <F:/spectra>
##$EXPNO= 1
##$NAME= <H-F>
##$PROCNO= 1
##$TYPE= <nmr>
##$USER= <she>
##$AMP= (0..31)
100 100 100 100 100 100 100 100 100 100 100 100 100 100 100 100 100 100 
100 100 100 100 100 100 100 100 100 100 100 100 100 100 
##$AQSEQ= 0
##$AQ_mod= 1
##$AUNM= <au_zg>
##$AUTOPOS= <>
##$BF1= 200.13
##$BF2= 200.13
##$BF3= 200.13
##$BF4= 200.13
##$BF5= 200.13
##$BF6= 200.13
##$BF7= 200.13
##$BF8= 200.13
##$BYTORDA= 1
##$CFDGTYP= 0
##$CFRGTYP= 5
##$CHEMSTR= <none>
##$CNST= (0..31)
1 1 145 1 1 1 1 1 1 1 1 1 1 1 1 1 1 1 1 1 1 1 1 1 1 1 1 1 1 1 1 1 
##$CPDPRG= <>
##$CPDPRG1= <>
##$CPDPRG2= <>
##$CPDPRG3= <>
##$CPDPRG4= <mlev>
##$CPDPRG5= <mlev>
##$CPDPRG6= <mlev>
##$CPDPRG7= <mlev>
##$CPDPRG8= <mlev>
##$CPDPRGB= <>
##$CPDPRGT= <>
##$D= (0..31)
0 1.2 0 0 0 0 0 0 0 0.06 0 0.03 0 0 0 0 0.0002 0 0 0 0 0 0 0 0 0 0 0 0 
0 0 0 
##$DATE= 1617777713
##$DBL= (0..7)
120 120 120 120 120 120 120 120 
##$DBP= (0..7)
150 150 150 150 150 150 150 150 
##$DBP07= 0
##$DBPNAM0= <>
##$DBPNAM1= <>
##$DBPNAM2= <>
##$DBPNAM3= <>
##$DBPNAM4= <>
##$DBPNAM5= <>
##$DBPNAM6= <>
##$DBPNAM7= <>
##$DBPOAL= (0..7)
0.5 0.5 0.5 0.5 0.5 0.5 0.5 0.5 
##$DBPOFFS= (0..7)
0 0 0 0 0 0 0 0 
##$DE= 6
##$DECBNUC= <off>
##$DECIM= 32
##$DECNUC= <off>
##$DECSTAT= 4
##$DIGMOD= 1
##$DIGTYP= 9
##$DL= (0..7)
0 120 120 120 120 120 120 120 
##$DP= (0..7)
150 150 150 150 150 150 150 150 
##$DP07= 0
##$DPNAME0= <>
##$DPNAME1= <>
##$DPNAME2= <>
##$DPNAME3= <>
##$DPNAME4= <>
##$DPNAME5= <>
##$DPNAME6= <>
##$DPNAME7= <>
##$DPOAL= (0..7)
0.5 0.5 0.5 0.5 0.5 0.5 0.5 0.5 
##$DPOFFS= (0..7)
0 0 0 0 0 0 0 0 
##$DQDMODE= 0
##$DR= 18
##$DS= 0
##$DSLIST= <SSSSSSSSSSSSSSS>
$$ [...]
##$SUBNAM2= <"">
##$SUBNAM3= <"">
##$SUBNAM4= <"">
##$SUBNAM5= <"">
##$SUBNAM6= <"">
##$SUBNAM7= <"">
##$SUBNAM8= <"">
##$SUBNAM9= <"">
##$SW= 16.9725357007746
##$SWIBOX= (0..15)
0 0 2 0 0 0 0 0 0 0 0 0 0 0 0 0 
##$SW_h= 3396.73913043478
##$TD= 16384
##$TD0= 1
##$TE= 0
##$TE2= 300
##$TE3= 300
##$TEG= 300
##$TL= (0..7)
0 120 120 120 120 120 120 120 
##$TP= (0..7)
150 150 150 150 150 150 150 150 
##$TP07= 0
##$TPNAME0= <>
##$TPNAME1= <>
##$TPNAME2= <>
##$TPNAME3= <>
##$TPNAME4= <>
##$TPNAME5= <>
##$TPNAME6= <>
##$TPNAME7= <>
##$TPOAL= (0..7)
0.5 0.5 0.5 0.5 0.5 0.5 0.5 0.5 
##$TPOFFS= (0..7)
0 0 0 0 0 0 0 0 
##$TUNHIN= 0
##$TUNHOUT= 0
##$TUNXOUT= 0
##$USERA1= <user>
##$USERA2= <user>
##$USERA3= <user>
##$USERA4= <user>
##$USERA5= <user>
##$V9= 5
##$VALIST= <valist>
##$VCLIST= <CCCCCCCCCCCCCCC>
##$VD= 0
##$VDLIST= <DDDDDDDDDDDDDDD>
##$VPLIST= <PPPPPPPPPPPPPPP>
##$VTLIST= <TTTTTTTTTTTTTTT>
##$WBST= 1024
##$WBSW= 4
##$XGAIN= (0..3)
0 0 0 0 
##$XL= 0
##$YL= 0
##$YMAX_a= 101812
##$YMIN_a= -60592
##$ZGOPTNS= <>
##$ZL1= 120
##$ZL2= 120
##$ZL3= 120
##$ZL4= 120
##$ABSF1= 10
##$ABSF2= 0
##$ABSG= 5
##$ABSL= 3
##$ALPHA= 0
##$AQORDER= 0
##$ASSFAC= 0
##$ASSFACI= 0
##$ASSFACX= 0
##$ASSWID= 0
##$AUNMP= <proc_1d>
##$AZFE= 0.1
##$AZFW= 0.1
##$BCFW= 1
##$BC_mod= 2
##$BYTORDP= 1
##$COROFFS= 0
##$CY= 11.3945322036743
##$DATMOD= 1
##$DC= 2
##$DFILT= <>
##$DTYPP= 0
##$F1P= 15.9154993809931
##$F2P= -4.1035820241983
##$FCOR= 0.5
##$FTSIZE= 0
##$FT_mod= 4
##$GAMMA= 1
##$GB= 0.15
##$INTBC= 1
##$INTSCL= 1
##$ISEN= 128
##$LB= 0.24
##$LEV0= 0
##$LPBIN= 0
##$MAXI= 10000
##$MC2= 0
##$MEAN= 0
##$ME_mod= 0
##$MI= 1.114404
##$NCOEF= 0
##$NC_proc= 0
##$NLEV= 6
##$NOISF1= 3.799351
##$NOISF2= 2.8
##$NSP= 1
##$NTH_PI= 0
##$NZP= 0
##$OFFSET= 15.70392
##$PC= 1
##$PHC0= -11125.44
##$PHC1= 23.60092
##$PH_mod= 1
##$PKNL= yes
##$PPARMOD= 0
##$PSCAL= 0
##$PSIGN= 0
##$REVERSE= no
##$SF= 200.130013532006
##$SI= 16384
##$SIGF1= 3
##$SIGF2= 2
##$SINO= 400
##$SIOLD= 16384
##$SREGLST= <1H.CDCl3>
##$SSB= 0
##$STSI= 0
##$STSR= 0
##$SW_p= 3612.71676300578
##$SYMM= 0
##$S_DEV= 0
##$TDeff= 0
##$TDoff= 0
##$TI= <>
##$TILT= no
##$TM1= 0
##$TM2= 0
##$TOPLEV= 0
##$USERP1= <user>
##$USERP2= <user>
##$USERP3= <user>
##$USERP4= <user>
##$USERP5= <user>
##$WDW= 1
##$XDIM= 8192
##$YMAX_p= 0
##$YMIN_p= 0
$$ End of Bruker specific parameters
$$ ---------------------------------
##NTUPLES= NMR FID
##VAR_NAME=  TIME,          FID/REAL,        FID/IMAG
##SYMBOL=    X,             R,               I
##VAR_TYPE=  INDEPENDENT,   DEPENDENT,       DEPENDENT
##VAR_FORM=  AFFN,          ASDF,            ASDF
##VAR_DIM=   8192,          8192,            8192
##UNITS=     SECONDS,       ARBITRARY UNITS, ARBITRARY UNITS
##FACTOR=    0.0002944,     1,               1
##FIRST=     0,             0,               0
##LAST=      2.4114304,     0,               0
##MIN=       0,             -60592,          0
##MAX=       2.4114304,     101812,          0
$$ Real data points
##PAGE= N=1
##DATA TABLE= (X++(R..R)), XYDATA
0@%%%%%%%%%%%%%%qJ6j6J6j6J6k4L2l2M0m8N6o9P7q8J04j20J36j52J72j96K20
36A16k46K76l10L45l83M26m72N24n79O37p04P78q57R43j039J145j262J391j535
55h06J700j889K104k354K651l005L439l985M696n664P057r247J3189k2370Q1125
70F6641L5171j62404P6258K4103l0404K7842l3296j5107N0803l7124j0652K1610
82A3441j2212o00J65l010K376j3964K3079J0401l6264P176K8024j6303K933K938
96H180p723J4591m777k1684K1088K3428m0246j7519M4692n619l1716K1645m552
109b12j7173K2706j3335l899J9112k3037P00K1416j3386k341O951m715M479j114
123c848O87k346k291J7167j4341j4715K2813k777o340R120j8162K647K4442j2748
$$ plain form
0 0 0 0 0 0 0 0 0 0 0 0 0 0 0 0 -8 8 -8 8 -8 8 -16 16 -16 24 -24 32 -37 40 -48 56 -64 72 -80 92 -104 116
36 116 -130 146 -164 181 -202 224 -248 276 -303 334 -370 408 -449 494 -545 600 -662 729 -806
55 -806 894 -995 1109 -1245 1406 -1599 1840 -2145 2551 -3113 3944 -5303 7886 -14484 66641
70 66641 101812 -60592 15666 39769 9365 37207 3911 -11196 39607 2483 -8169 13441
82 13441 1229 629 794 -2216 160 -13804 9275 19676 -16588 -9412 18612 2309 5242 8180
96 8180 457 15048 10271 -11413 9675 33103 -7143 -24662 20030 14411 -17305 4340 -212
109 -212 -17385 5321 -8014 -11913 7199 -15838 -15138 6278 -7108 -9449 -2498 -7213 -2734 -3848
123 -3848 -3161 -5507 -7798 9369 -4972 -19687 3126 349 -5991 3129 -15033 -12386 12056 -692
137f92q336K968J268J2550n899p873O264j41O653j288j3726J2693M314q994M469
152D230r850O156J1940j9326J253J3677j4215M3J0188p753l271R03M773J200p828
167g880K761M125j73l643l471J0639K206j3691N116P778o212M415m308l841J0375
182D196k939n456L582k547K72M741k616n224l180J1878L787j9400L568J3069l999
197b68k429n045k05J4821n867j1839J0357J486l329L753k567l219M151N149n247
212b98m479O120J384m201M381l391k973J1112o036p099J0437N22o151L895K23
227C446j952M077j002k679J925J812m531J775N306q135q20P861n989l445P193
242D842n341j950P265o773k481P310q88m903J418J715j414L829j016o490L584
$$ plain form
137 -692 -9028 -6060 -4792 7758 1859 -6014 250 109 6762 5474 -8252 4441 8755 -239 4230
152 4230 -5620 536 12476 -6850 -5597 8080 -6135 -6092 4096 -3657 -6928 -6025 -1252 -52 -7880
167 -7880 -5119 -994 -1167 -4810 -8281 2358 4564 -9127 -4011 3767 -2445 1970 -2338 -6179 4196
182 4196 1257 -4199 -617 -3164 -2892 1849 -767 -5991 -9171 2707 6494 -12906 -9338 3731 -268
197 -268 -2697 -7742 -7947 6874 1007 -10832 -475 1011 -2318 1435 -1132 -4351 -200 4949 -298
212 -298 -4777 1343 2727 -1474 2907 -484 -3457 7655 1619 -5480 4957 5479 -672 3223 3446
227 3446 1494 5571 4569 1890 3815 5627 1096 2871 8177 42 -778 7083 1094 -2351 4842
242 4842 -499 -2449 4816 -1957 -4438 2872 1984 -2919 -1501 214 -1200 2629 1613 -4877 -1293
257a293P210o950j913M766m422L504K307r648K205Q987o591m723M409r83J542
272a593K145n939k508R296R15q035K210L485r27K591j414n929P169N202r791M3
288c080N287j239N25J34o493L300P762o421m812N254J935k529K118l458j414Q803
304E672j780p442M551L824l512K034j142l413O446J383p079j78N729k502k104
319D87K271l835Q89M903m451m689O907m28m558L624j808j821N133j631n090M369
335B72J450l894J675O65l340J549L184m851j494M529k707j213L489k860k125N616
351e5k520k735M713j397j252L710m75l491L753K648l877l93K892o33J91J993n470
368b398J346N846m924k140M140k505k39L891l968j903N600j18l781J01L529j86
$$ plain form
257 -1293 5917 -1033 -2946 1820 -2602 902 3209 -6439 -4234 4753 -1838 -6561 -2152 -3135 -1593
272 -1593 552 -5387 -7895 1401 2316 -5719 -3509 -24 -951 1640 226 -5703 1466 6668 -3123 -3080
288 -3080 2207 968 1493 1627 -4866 -1566 6196 -225 -5037 217 2152 -377 1741 -1717 -3131 5672
304 5672 3892 -3550 1001 4825 1313 3347 2205 -1208 5238 6621 -458 -636 5093 2591 487
319 487 2758 -1077 -188 4715 264 -4425 2482 2054 -2504 1120 -688 -2509 2624 993 -4097 272
335 272 1722 -2172 -497 168 -3172 -1623 1561 -3290 -4784 -255 -2962 -4175 -686 -3546 -5671 -55
351 -55 -2575 -5310 -597 -1994 -3246 464 -11 -3502 251 2899 -978 -1371 1521 888 1079 3072 -2398
368 -2398 -1052 4794 -130 -2270 1870 -635 -874 3017 -951 -2854 2746 2628 -1153 -1052 2477 2291
384B291n13k14l366M207M081p166j070O361l959K37K310n021K098L327l352k176
400a925K525J231Qk156j797J548M248q65q007L675O677o159j555K877l504K387
416g92J933o047J335J793j300J411k398k427L611L302l174m847M942M760n196
431c094J52K393k317M271j071m229O923k281m695O927n66n015L529J058j197j665
447h77J415K209k963Q55J324j038K210l233q90P440n034n224R312k717m648N035
463C176k540j187K226j222J0N66j761m70J761K965n132l100R266l864l896O722
479C520n402j011P950n204k912L966l766M506J721q951N16P330M41p864m16O754
495A178l336j680M946p573Q12R202p166j450M108m413M728K078q376L195N751
$$ plain form
384 2291 1778 1564 -1802 2405 6486 -680 -1750 4611 652 889 3199 -1822 276 3603 251 -1925
400 -1925 600 1831 1839 -317 -2114 -566 3682 2817 -5190 -1515 5162 -997 -2552 325 -3179 -792
416 -792 1141 -4906 -3571 -1778 -3078 -1667 -4065 -6492 -2881 421 -2753 -7600 -2658 2102 -3094
431 -3094 -2942 -549 -2866 1405 334 -3895 3028 747 -3948 2979 2413 -2602 927 1985 788 -877
447 -877 538 2747 -216 639 1963 925 3135 -98 -988 6452 1418 -3806 5506 2789 -1859 3176
463 3176 636 -551 1675 453 463 1029 -732 -1202 559 3524 -1608 -4708 4558 694 -3202 3520
479 3520 -1882 -2893 5057 -147 -3059 907 -2859 1647 3368 -5583 -5067 2263 2704 -5160 -5576 1178
495 1178 -2158 -3838 1108 -6465 -5653 3549 -3617 -5067 -959 -5372 -644 1434 -6942 -3747 2004
510B004l412k170J531L673l002j654N291l579J177L046o555M634N368r384L475
525D43M827p868M815M211p165j054N271K389n008l159M675J300k16j328n800O318
541B651M169q715L620J261o487P104K196q131J214L389L82J28l815K1K114J818
557B919p16o522N393L479p983L947K835p578M651K805n256K494j737j69M269l189
573c58k530K794N00j223j704K661K74n262M658J851o059M353M89m457N149q70
589B66l208M066j295j674L735j501p82j63K270J525m427J360J208n57L094l427
605D90l873O995n90l537L045m254J403O420m377l936K788K830m67k666q51K007
621A427J1J716l032k677N161j350j200R66l723K312M764o442q44M575j652p15
$$ plain form
510 2004 -1408 -3578 -2047 1626 -1376 -3030 2261 -1318 -141 2905 -3650 984 6352 -3032 443
525 443 5270 -2598 2217 6428 -737 -1791 3480 5869 861 -2298 2377 3677 3461 2133 -3667 2651
541 2651 6820 -1895 1725 2986 -3501 3603 5799 -2332 -1118 2271 2653 2781 -1034 -1013 1101 2919
557 2919 2203 -4319 1074 4553 -3430 517 3352 -4226 425 3230 -2026 468 -1269 -1438 2831 -358
573 -358 -2888 -94 406 -817 -2521 140 414 -4848 -190 1661 -4398 -45 444 -4013 1136 266
589 266 -2942 1124 -171 -1845 1890 389 -393 -556 1714 3239 -1188 172 1380 823 3917 490
605 490 -3383 3612 3022 -515 2530 -1724 -321 6099 1722 -2214 574 3404 2937 271 -580 1427
621 1427 1438 3154 122 -2555 2606 1256 56 1022 -2701 -389 4375 -2067 -2911 1664 12 -703
637g03O4n73J035L73m11j779J380K542m050l12L918l621P88K634m864J804L064
654A289l293O55O82k126K701Q42l739N33K971k06k677J206J681k261K394M45m072
671b975K774K389l536J427R74k853K949J337l624L12K312n88m49M55j384N20K990
688C030j578l013L333K7k246K810j527k234M234k69l772J677J415j422P06n18
704F53j584J460J990k778j675L222p94n10Q71k030oL700k927k427L697k17j370
721g25M54j239o68L527p47l401Q08K809j068j233N36j085J549K109l501j059L981
738A047n49j652J062j300R27K761k225k550K888J750k367K97J3j123K613J7l267
755a658J331K469j861o47J233r45J159J289k364r36L325l46j991Q59l1l77J664
$$ plain form
637 -703 -639 -1212 -177 196 -215 -1994 -614 1928 -2122 -2434 1484 -2137 -1349 1285 -3579 -1775 1289
654 1289 -2004 -1349 -667 -2793 -92 750 -2989 -2456 515 309 -2368 -1162 519 -1742 652 1097 -2975
671 -2975 -201 2188 -1348 79 1053 -1800 1149 2486 -1138 -826 1486 898 449 904 -480 40 3030
688 3030 1452 -1561 1772 1799 -447 2363 836 -1398 2836 2567 -1205 472 1887 465 1171 653
704 653 -931 529 2519 -259 -1934 1288 494 -16 855 -1175 -1181 2519 -408 -2835 862 645 -725
721 -725 -271 -1510 -2178 1349 602 -2799 -1991 818 -250 -1483 -947 -2032 -483 1626 -1875 -2934 1047
738 1047 498 -1154 -92 -1392 -465 2296 71 -2479 409 2159 -208 89 102 -1021 1592 1609 -1658
755 -1658 -327 2142 281 -366 867 -78 1081 2370 6 -930 2395 2049 58 917 886 509 2173
772B173n67k811K262J138k504O01M60j258J160Q86k738O22J859j067n62O15p43
789d74k2J992j541j355J795J02j324Q26n3j964K458k7k689P40J696j343k89O10
807h62j574J779J100k716j08K393l29j066J554j395J24K759j396k456K261J440
823A508j771O83p38q02K822n24k952J349K597k074m71R18j127J046J669k181j360
840a408L258m16j155Q83j289M79K698k197k540L545M03k547M99L46l79Q73O4k475
858a358R30K044j785m29J263j484M65K250l069o78L437j401j574J618j22o62Q82
875C27r93o06J460j90j466O43Q57j821J476J009l018M40L145k313p01J686j039
892a104J110L35k098J301J425j071n04J310n25r31J428J110k656J11K424r59J39
$$ plain form
772 2173 1606 -1205 1057 2195 -309 292 752 -506 654 1540 -1198 -576 1283 216 -346 269 -474
789 -474 -496 1496 -45 -1400 395 497 -827 -1 -54 -2018 440 413 -2276 -1536 160 -1183 -1472 -862
807 -862 -2436 -657 443 -2273 -2381 12 -317 -1383 171 -1224 -1100 1659 263 -2193 68 1508
823 1508 -263 420 -318 -1120 1702 1178 -1774 -425 2172 98 -373 545 -582 464 2133 -48 -1408
840 -1408 1850 1434 279 1162 -127 352 3050 853 -1687 1858 2261 -286 213 559 180 1053 1117 -1358
858 -1358 -428 1616 -169 -598 665 -819 -354 1896 -1173 -1851 1586 185 -1389 229 107 -555 327
875 327 -666 -1272 188 -2 -1468 -825 32 -1789 -313 696 -2322 -1882 1263 -1050 -1751 -65 -1104
892 -1104 6 341 -1757 -456 969 -102 -606 704 179 -752 676 1786 -870 -759 1665 706 845
909H45o74j392L065R2l320J967J209k247J300N23r39m19J104N77j515j90J047
926A033q3N91j123j995L668k11l987L027N02k342J701m78r77J497j437n42J316
943A60j09k91q66R23j40q51K497j659l129M364J95l343J876r77K71K344l067q20
961b622K254N76r57p62K51L62J50J357j795j957M478j189k068K492j880L79L138
978B207k653j037K731j184l2J145j231q5M83J108j287j232K762j212j333K993
994B143j746j339K781k254Q72K163l601Q82K223j597q99Q93L11j78o70J834j720
1011I8j495K978j425k99J292l213J449L300l960K1K145j688N93O78j471M55J10
1028d32Q31l44r82J9k52J734K98m153K043L591l734K26J143j894K111M56k330
$$ plain form
909 845 171 -1221 1844 1936 -1384 583 1792 -455 845 1368 429 10 1114 1691 176 -14 1033
926 1033 950 1541 418 -1577 2091 1880 -2107 920 1422 -920 781 303 -674 823 -614 -1156 160
943 160 51 -240 -1106 -183 -323 -1174 1323 -336 -3465 899 1094 -2249 -373 -1350 -1079 1265 -1802 -2622
961 -2622 -368 208 -749 -1511 -1260 -898 -748 609 -1186 -3143 1335 146 -1922 570 -1310 -931 2207
978 2207 -446 -1483 1248 64 32 1177 -54 -139 344 1452 165 -1067 1695 483 -850 2143
994 2143 397 -942 1839 -415 457 2620 -981 -99 2124 527 -372 521 832 654 -16 1818 98
1011 98 -1397 1581 156 -143 1149 -2064 -615 2685 -1275 -1254 891 -797 -204 474 -997 -542 -432
1028 -432 399 55 -927 -908 -1160 574 872 -3281 -1238 2353 -1381 -1155 -12 -1906 205 661 -1669
1045a669J103J21j33Q50n74m16L2J099Q17k941J743J546k447J313L58j569K328
1062A561p31k351L375p81j963J397K60k48k46K4l5L8P93k31j872J328J273j626
1080c5J634j864j197L802j307j797J038k95K07J239j914o59J527K31n77j294J248
1097a3j8o34J452j856p59K496o87j362J808j360J42J820j981l65J430o52l77P85
1115a31k71l88K85O34j061L53J109j660J68K152j946K71J580j790K53J423j147
1132a66Q2M86m02M35l7J68q98O73O87j511O95P05r46Q56L75k219J245J301j396
1151A33r9M30n97Q93M91j527j56J195M41j650K51N56m52R41n75j588J567P48j822
1170h20K92L42o01R28L85j995Q60J127o57q26O62j60L24M08r46n48J497Q8j809
$$ plain form
1045 -1669 -566 -445 -578 272 -302 -718 -686 413 1230 -1711 32 1578 -869 444 802 -767 1561
1062 1561 830 -1521 1854 1073 -890 507 767 519 273 297 262 300 1093 862 -1010 318 1591 -35
1080 -35 1599 -265 -1462 2340 1033 -764 274 -21 186 1425 -489 -1148 379 610 33 -1261 -13
1097 -13 -31 -665 787 -1069 -1828 668 -19 -1381 427 -933 -791 1029 -952 -1317 113 -539 -916 -131
1115 -131 -402 -790 -505 129 -932 -579 530 -1130 -962 1190 -756 -485 1095 -695 -442 981 -166
1132 -166 -84 402 0 435 398 566 -332 341 1028 -483 212 917 -29 827 1202 -1017 228 1529 133
1151 133 34 464 -133 760 1251 -276 -432 763 1204 -446 -195 361 -91 850 275 -1313 254 1002 -820
1170 -820 -528 -186 -787 141 526 -1469 -609 518 -139 -965 -303 -463 -139 269 -677 -1225 272 360 -1449
1189a449J214K20m47K42n0j043J144Q52j595J21P74q1J93K89j044K57J556r39
1207B14q57J255l33l54R67o64p58J396k06r87O62M32q48N80J61j072J084J48p69
1226E1k34J096o71l4R00j372J84J458j033q76J109k32q60J434q96q08J065L57
1244F38j394M47N09j031R52J04j549Q40R30j173k1R18p52K14O30r17j96J355o80
1263a76q16R27m59p8J148p12j307J448J92j208O08M22m50N05J77j265J081J287
1281A324j444j03M63J9l4R23j407k55J787k72j550Q30M41o37L31q3p59J213k0
1300G67j002L64P09o68K20J36j379J264J028r73q51O99L22k85J35m71k94R03j42
1319D82j078O37j32m11R46n65j184J009N73r33p0M79l05K3M95r67N01J033j252
$$ plain form
1189 -1449 -235 -15 -462 -220 -270 -1313 -169 683 -912 -791 -17 -98 95 384 -660 -403 1153 214
1207 214 -643 612 279 -75 892 228 -530 866 660 -327 335 767 -81 499 660 -412 672 820 51
1226 51 -183 913 242 208 1108 -264 -80 1378 345 -531 578 346 -514 920 24 -784 281 638
1244 638 -756 -309 200 -831 121 225 -1324 -484 446 -727 -748 170 -582 -368 262 -655 -851 504 -176
1263 -176 -992 -65 -524 -602 546 -166 -1473 -25 167 -1041 -433 -11 -461 44 221 -1044 37 1324
1281 1324 -120 -223 240 259 225 1148 -259 -514 1273 1001 -549 281 722 85 416 333 -426 787 767
1300 767 -235 129 838 170 390 526 -853 411 1439 466 -385 314 636 351 486 15 -279 624 482
1319 482 -596 41 -91 -502 444 -121 -1305 -296 277 -656 -726 -247 -552 -529 -34 -1001 -500 533 -719
1338g19j25Q04j26n96J115o96p19J012Po18L28r5rN26k05n34L22J098q62j73O33
1359C68k05k45R94j023O1J092p96k44N44l62J87N33j006q3R32J72r78m22R94l7
1379D76mK54j154M28R90r62j74N87p13Q85M51j688K61J246m13p34K33M61k38O7
1399B59k56p19O72N98j442N73K50j046J176P9j239R57K61p94L3K71L07j46j14
1418c20K7M9L95J46j562J455P4j251J370k30j476J621J75j435R65o0j80O67o10
1437a80j01O36M51l92p93P17M02p93J003q34p45J804l71j144J150p16j27J335
1455A302j315n03Q98J35l73k66M08k80J9P05q34n08J157j22r27J351j234j05J426
1474I34j322l51Q98k94k56K30k33q5J97L23n99J7R35j074n2J196j017j0J038j273
$$ plain form
1338 -719 -844 -40 -166 -762 353 -343 -1062 -50 -43 -661 -333 -428 -437 89 -116 -650 -328 770 -92 -265 368
1359 368 163 -82 912 -111 -50 1042 246 2 546 184 371 904 -102 -185 747 919 -59 -481 513 476
1379 476 472 726 -428 0 990 28 -146 441 -272 613 1064 -624 -363 883 470 -264 -31 430 192 259
1399 259 3 -716 -44 554 -888 -315 -65 -1111 65 144 -1095 -138 123 -671 -638 -367 -60 -206 -320
1418 -320 -293 -244 151 297 -1265 190 264 -987 383 153 -1323 298 473 -962 3 -57 -237 430 -180
1437 -180 -281 355 806 414 -379 338 740 -53 950 116 -629 1175 804 -340 810 94 -33 1302
1455 1302 -13 -516 382 517 144 -122 286 6 25 730 -104 -612 545 423 -504 847 -387 -492 934
1474 934 -388 -739 159 -135 -391 -161 -394 -479 -282 41 -558 -541 394 -680 -732 464 -553 -563 475 -798
1494g98K93J391j402m7O19k75L52m33l10J94O58J90j011J6R41l79l9M18j280Q92
1514a0J319j699J94L13L7P96k56j043M19N74j84l59M7M97p09N53J22j013N78M47
1534F23j199R16J16p05P70l23n02O92P4q21L75L33l33k28M08K3n64O89k69j047
1554i72J336j32r80Q96l31q54J359n56m88M30J20K18k49j23k00K25N81j84r82
1573h86Q33L25o37N19m08l94J086k05r76Q85k66L44ql04l52N02L03l2o04M32j88
1594c1O2P92q57j63J073o51r5L79l26j84O13m28M2K88l11m39N15J87m70j19L19
1615A96l04P9Q04r95j02R64o26j31M69n64K6P15p05l41N67l19N6K7k06k31O62
1636D1J3o17O4P60n84P4J83o63N13N23o99M1N58m41L8L89l22j5N28n92j92L95
$$ plain form
1494 -798 -505 886 -516 -563 56 -219 133 -300 -610 -416 242 432 -579 -563 378 -1 -40 378 -902 -10
1514 -10 1309 -390 -196 117 154 950 694 -349 70 644 460 101 148 645 -64 489 611 -402 176 623
1534 623 -576 340 456 -249 521 198 -304 388 462 -359 16 349 16 -212 196 219 -345 344 75 -972
1554 -972 364 232 -748 148 -183 -1037 322 -234 -722 -292 -172 46 -203 -326 -526 -301 280 96 -886
1573 -886 -53 272 -365 154 -254 -648 438 233 -743 142 -124 220 212 -92 -444 58 361 329 -275 157 -31
1594 -31 31 823 -34 -197 876 225 130 509 183 -1 612 184 226 514 203 -236 279 466 -4 -123 196
1615 196 -108 -29 775 -220 -322 642 16 -115 354 -210 -184 531 -174 -515 52 -267 -211 -184 -390 -621 41
1636 41 54 -563 -499 261 -323 -249 -66 -729 -216 307 -392 -351 207 -234 -196 193 -129 -144 384 -208 -400 -5
1658eL7l10M58j53n43Q31J14o47J56M85n04L02J01l04K36N50o13l3M36m45P3m
1680B18n6l19N80j46n47L86K83n23M80k90m27N61Q9o92K97M40m88P9K53m13l1
1701b66P14o23j30N02k57p1J43q5p3L50k08o33L95M0j23j37M3j19M87q9l26J55
1723c11K40j33L7M18o92M59K13n36mN74l7p3k29kJ9L81j95k18K96M9m26K88L6
1746A54k55K27K85m30k36P98k75k4j25J6L1L66m01j32K93q9k32K54l19J77K11
1767B94r0n83M80J04m85K30n2k99K09N38n13n1N08n87R4J56m04J82N12m25q9L15
1789D4j19l63N71k29o21R58n02l23N09n5L5o4K69m95K67J26r4r4M16j62k89K49
1811C4k08j00P49n05k07K42J28j62N4K87k56K35j59j07o5K37j39J53O9k91J12
$$ plain form
1658 -5 32 -278 180 27 -516 315 429 -218 -62 423 -81 221 322 18 254 804 191 158 594 149 222 218
1680 218 162 -157 423 277 -270 116 399 -124 356 66 -361 200 289 -403 -106 334 -154 -75 178 -235 -266
1701 -266 448 -175 -305 197 -60 -131 12 -73 -146 204 -4 -637 -242 -202 -325 -462 -419 -538 -51 -140 -466 -311
1723 -311 -71 -204 -167 251 -441 18 231 -305 -309 265 228 155 -74 -76 -57 324 129 -89 207 256 -170 118 154
1746 154 -101 126 411 -19 -255 543 268 244 119 135 166 532 131 -1 292 203 -29 225 -94 83 294
1767 294 204 -379 101 205 -280 -50 -102 -401 -192 346 -167 -218 290 -297 -203 -47 -451 -269 243 -182 -271 44
1789 44 -75 -438 133 -96 -717 241 -261 -584 -75 -130 -95 -159 110 -385 -118 8 -86 -180 236 74 -215 34
1811 34 -174 -274 475 -30 -237 5 133 -29 25 312 56 291 132 25 -40 197 58 211 280 -11 101
1832A01N48p93J39N11l49M6kk50%L21l09j05M05l01J3P5l36J99K08k7n62Q1Q06
1855D19k89k93J26k12J17L64q58J51P13n75J05J28k65K55J11p0k56J05K07k26
1875b43R1J06m73L51J51l34N23J00n35M00n2j08L4M4j32k8J39J22j99J22K35m23
1897a09L90m4n10N84k07K1K90k9l45L73j87m87M20J31O8j89m3J95l37L21l55k12
1919b61N20m2l27M65l81k44P22m98m30M62Pk4R3m36O7M00K89o22j78L72n3k46
1941c45L43j79m5M32l5q78Q01k77j34M78l40k72M96j19j26L02j67Jl40M84o7j68
1963a55N28n14k24O81m85K95J01l15R1L31l70r1K95q5j49q3L55J15j54K28p02
1984c07N11L77o32l2L98l83L62K21p39l8M46m0J36l88K17l3M8J53m35j0L77l52
$$ plain form
1832 101 649 -144 -5 506 157 203 201 -49 -49 272 -37 -142 263 -38 -25 50 -286 -87 121 94 -468 -387 419
1855 419 130 -163 -37 -249 -132 232 -626 -475 238 -337 -232 -104 -369 -114 -3 -73 -329 -224 -17 -243
1875 -243 -152 -46 -519 -168 -17 -351 172 272 -263 137 85 -23 11 55 -77 -105 34 156 -43 79 314 -109
1897 -109 281 237 -273 311 104 125 415 386 41 414 227 -260 160 291 359 170 127 322 -15 306 -49 -261
1919 -261 259 217 -110 355 -26 -270 452 -46 -476 -14 -7 -31 62 -374 -307 93 382 -240 -418 -46 -99 -345
1941 -345 -2 -181 -226 206 171 -707 94 -183 -317 161 -179 -451 45 -74 -200 102 -65 -64 -404 80 13 -155
1963 -155 373 -141 -365 316 -169 126 227 -88 3 334 -36 -127 168 83 -66 -149 206 321 167 395 -307
1984 -307 204 581 -51 -83 315 -68 294 515 -224 -262 184 144 280 -108 109 76 124 277 -158 -168 209 -143
2006a43K23k83k32N85j39l03K70j19j64R4J39k49L72k30n4P9j18J32m1M56o11
2027c36q6O43r6n91L44L6j16M91n53K49L53n40j60N34K23k29l94K15J47r1K31
2048B74M8o07O73m7m21L38k74L9L12k19j40J85l6j23J75k17K29k31L72l51n8K92
2070B13j23k82J62k47J78K04k44l3K21j91J94J47l02o3K35M7l34L4J19J75n02
2091c92M71m41J08M35m16J53J53j55k16K66k46K18L6j2j11K89Q5m50K28P2n15
2112d40O86j16k31J66J60m06N6L39M7kJ34n86J66L27o1r1P1j27K39J46k80j33
2134F4Q1K15k61O4l39J01R0J94k09l1J22n7K64j56n9k88L51k21k7K24k8m07K15
2157i8J08m4K54m01q0O1J69O7j2k78L88m02K88j28k77K22K5l50M13l27K07%P9
$$ plain form
2006 -143 80 -203 -435 150 11 -292 -22 -141 -305 -211 -72 -321 51 -179 -233 -154 -272 -140 -181 275 -336
2027 -336 -422 221 125 -466 -122 -86 -202 289 -264 -15 338 -202 -362 172 395 166 -228 -13 134 43 274
2048 274 322 -285 388 341 -80 258 -16 23 335 116 -24 161 125 2 177 -40 189 -42 330 -21 -79 213
2070 213 90 -192 -30 -277 -99 105 -139 -172 49 -142 52 199 -103 -166 69 116 -218 -184 -65 110 -392
2091 -392 79 -362 -254 181 -235 -82 71 -84 -300 -34 -280 -62 -26 -38 -149 140 225 -225 3 75 -440
2112 -440 246 130 -101 65 225 -181 -125 214 261 259 393 -193 -27 300 239 148 219 92 331 477 197 64
2134 64 145 360 99 163 -176 -75 15 209 0 -31 91 34 298 142 83 -205 146 -75 -102 122 94 -313 -98
2157 -98 10 -34 220 -181 -261 -200 -31 36 24 -254 134 -268 20 -108 -385 -163 -138 -488 -75 -402 -195 -195 -116
2180a16j68J79J11j30J24n9J11J87j64l67J72J34j30J86K43j84LJ75m63J4J76
2201C4j23m5M99n12K58J43l87J82M55l74J90l63K49R9J46k59m73M40j79j20j35
2222b75N87m29J19J50l00J80n0j57N5j4J13j30K75l43P6N10m32k45L56k00mL63
2244B05k22R0j36K54n31L40j75l1Q9K9j57K37l22K06j68J93J7O6K23j75k10K69
2266I1K51l07J47j2j22K29k1r0l4K37m31N5K49j11K14j91j11m8L27j28p7K29l71
2289b5L12P1l70q8L54j20o3j17J04K24q0k47P9j15J36k42K48K02l72n7R7l76M28
2312a7Q0j81j8K1k5O6O9l28K65m0K3L6O9J05k67O7K3j31j6M58n70J02L21m4k37
2337a69J88k04l0J75J11O4j64O2J00LK5p3m3L53m65M2o2J28j56M30m11K16N8k48
$$ plain form
2180 -116 -284 -105 6 -124 0 -59 52 239 75 -292 -120 14 -116 70 313 129 132 307 -156 -142 34
2201 34 -89 -134 365 -147 111 254 -133 49 504 130 320 -43 206 305 451 192 -281 159 -20 -140 -275
2222 -275 312 -117 2 152 -148 32 -18 -175 -120 -134 -21 -151 124 -219 -143 367 -65 -310 46 -154 -158 205
2244 205 -17 73 -63 191 -340 0 -175 -206 -117 -88 -245 -8 -330 -124 -292 -99 -82 -16 207 32 -178 91
2266 91 342 35 182 170 48 277 256 166 132 369 -62 -7 242 131 345 154 43 -5 322 194 117 346 -25
2289 -25 287 358 -12 -100 254 134 71 -46 58 282 202 -45 34 -81 55 -187 61 263 -109 -166 -69 -445 -17
2312 -17 63 -118 -136 -115 -140 -74 -5 -333 -68 -108 -85 -49 20 125 -142 -75 -52 -183 -199 259 -311 -209 112 68 -169
2337 -169 19 -185 -215 -40 71 135 -29 33 133 136 161 88 45 398 -67 -25 -87 41 -115 315 -96 120 178 -70
2361g0L19l30K14r7K58j34j67Jl3k26K00K40n66M60P1j75q9J4O8J50k26J05m8
2384f1L64l75q4N6J06k43K07K2j77Q1K68m56L30J7r3J11k26p8N87p56J72L48j60
2407d0K66l68R7j98L65m6j1l13K82L62l92J09L7j43L15l08q9N8J26j14j22L30
2429B03j90J56r6M5j61J22k83K17L97m38J01K35n01K01J45j89K36j5j02n9j13
2450h9K05N4o4J05l31j08L63m08L12P6m91M93o1l93L07l1k09J99L64m40p7K96
2472G2jk40l4J91j3j1J6j49K57lm05J99J35k80L43k40j34K63q8J59L5j13N8L9
2496E6J02j3k44J90p8L4J12L8j67K02o2k00J98j53j58K59l6j17K76k55L41k37
2518H8M9M5k66J41J21k80L5r1N3J39j65l38N51l61K9M44k14j05m5n1M5j22L06
$$ plain form
2361 -70 249 -81 133 36 294 160 -7 -6 -39 -265 -65 175 -391 69 140 -35 -124 -110 -42 108 -118 -13 -61
2384 -61 303 -72 -156 -100 6 -237 -30 -8 -185 -104 164 -292 38 55 -38 73 -153 -231 356 -400 -228 120 -40
2407 -40 226 -142 -45 -243 122 76 65 -248 34 396 4 113 150 7 322 14 -75 -17 109 -5 -127 203
2429 203 13 169 73 118 -43 79 -204 13 410 -28 73 308 -193 8 153 -36 200 185 83 24 -89
2450 -89 116 170 106 211 -120 -228 135 -273 39 115 -376 117 56 -337 -30 -61 -270 -71 293 -147 -224 72
2472 72 71 -169 -203 -12 -25 -36 -20 -169 88 85 -320 -121 14 -266 77 -163 -297 -34 -122 37 72 -41 17 56
2496 56 158 145 -99 91 13 47 159 197 30 232 170 -30 168 15 -143 116 80 -37 239 -16 325 88
2518 88 137 182 -84 57 178 -102 -67 -158 -105 34 -131 -469 82 -279 -250 194 -20 -125 -170 -221 -176 -298 8
2541HQ2l95N64l28r1M65l18j61J03J3N2J34j2j81J65j13k34L54k37j2n2J52K8
2564a4j67J90j19m3K97j89K46P2l63j98O05k98p4Q6K64m08P6J73k03P0J65Q7l49
2587i4K12j29L38j41j57NK42j76j60J63j3j60L28k00r9J40p6k43L03Jj08J40k34
2610a18m6K60q1j83l0M8o6J21l0r8J60J87q7j7j15K10j2k04l0O0l8q0Q0K19j22
2635a2m0J88k76M9K24j00qj83K26j62k07L47k21J99K06Q8j48j63R1j44k9O2pK72
2659B52o1r0J05J0N7m3k74r0K03pj24L1K54l46L06K4j94j03J89o7m1L35m44K26
2683A08l2j92L37l61K81k16O1K2j83r0L13j27K7M2m34M10j35J2l8O3j33j3L46
2706F8K3p4ko7K01k31l04K75J36n8K5J22k55J92K97k91r4J13L31k25r6K61j01
$$ plain form
2541 8 90 -305 259 -69 -160 305 -13 -174 -71 -58 -6 128 116 -65 100 -13 -247 107 -130 -142 -194 -42 -14
2564 -14 -181 9 -110 -153 144 -45 201 273 -90 -288 317 19 -55 31 295 -113 -37 136 -67 3 168 255 -94
2587 -94 118 -11 327 186 29 34 276 100 -60 103 90 -70 258 58 -41 99 23 -220 83 84 -24 116 -118
2610 -118 -164 96 15 -168 -198 -150 -216 -95 -125 -223 -63 124 37 20 -95 115 103 -101 -131 -71 -109 -189 -109 110 -12
2635 -12 -52 136 -140 -91 133 33 25 -158 68 -94 -301 46 -175 24 230 318 170 7 98 -46 -75 -13 -20 252
2659 252 191 101 206 216 273 230 -44 -134 69 62 -62 -31 223 -123 183 207 13 -90 99 32 -9 326 -118 108
2683 108 76 -116 221 -140 141 -75 -14 8 -175 -265 48 -79 -52 -10 -444 -34 -169 -157 -195 -132 -265 -278 68
2706 68 91 17 15 -52 149 -82 -386 -111 25 -33 -8 114 -141 51 348 57 -37 76 407 182 86 347 246
2729B46N2j98K17k91J53m5o7o1K63k36N1j16pk5P4p7L08r0J7M2j31l3j05o1J51
2754C1J44L3r6MJ70k76J27j21r5k5K44N8m56K89J89n49L15j15j50J19J85k66J76
2777f5j79K92j79R3o7N5J02k81J2Q1P5J36n9k0J17J70l49K01j11k4r7J11j94K36
2801E6K0J3j37M9K08k49J77R7j73l09N67o0k94J93k80J91J16m9k33J18K74k63
2823C2o6M9r6M4J63k75R7K21j83K94k67J98q2j45m7q8J32m8O0j4J01k89L09j38
2847c8k54K32p1j60M68l46LK35j23m5J43k94K08Ln6m5k4LJ80j15J87k13jRk5J68
2873B9K44l94M8QK45l7k90J07J22N0J77k11k86K82J5Q6qk56q0M31j53k05J71K0
2897A15j76K01j42k50K64N1k07K21l02J60k9K63m32J21Q5rO3Q0j00j00P7J39l07
$$ plain form
2729 246 298 100 317 26 179 134 67 6 269 33 84 -32 -39 -64 10 -67 241 151 168 210 79 46 -59 -120 31
2754 31 175 208 112 116 286 10 137 16 -79 -104 140 198 -258 31 220 -329 -14 -129 -279 -160 25 -241 -65
2777 -65 -244 48 -131 -38 -105 -50 52 -229 -217 -136 -61 75 16 -4 113 283 -66 135 24 0 -97 14 -180 56
2801 56 76 89 -48 1 209 -40 137 234 61 -248 319 259 -35 158 -122 69 185 136 -97 21 295 32
2823 32 -34 15 -81 -37 126 -149 -52 169 -14 280 13 211 129 -16 -63 -151 -19 -67 -7 -21 80 -209 100 -38
2847 -38 -292 -60 -131 -291 177 -169 -166 69 -54 -99 44 -250 -42 -39 -95 -140 -164 -161 19 -96 91 -122 -123 -114 -139 29
2873 29 273 -121 -73 -65 180 143 -147 -40 82 132 309 98 -188 94 109 195 187 -69 -149 282 129 -76 95 115
2897 115 -61 140 -2 -252 12 63 -144 77 -225 -65 -94 169 -263 -142 -57 -66 -3 77 -23 -123 -46 93 -214
2920b14J24n1J20l0J71j98n6j4J88n8J81m00RJ93j7P1P2q1J37O2k48N2LM3n5k15
2946b11J82PJ60J49m00K46P0j97MRL8j05M0k2k4J63RN5pj55J17l6n7j41K70j80
2972a6oJ21J61j58j85J24k01K03M5m8J91n7m40M26m69L86n3k80K45k46J71Rk5
2995a02J62k2j47J11Mj62P7J38j46K2j8k13J50J42j01qJ03j9k4MR1k2K6J29q7
3020H8m0K1m8L16m17M7Q2l7J32j11L7k8r6J38L0l54M43P3Q3k16j23j47L86j83
3044G6R5P7k40K9k30J70L56m30J77j29P0J82l02j9L42l98K63P0j27j90L56k40
3066d2J09Kj58P7j63Q6j64L99j71l6j5J42k72K31O5k02J0K0L61l07J04k65K49
3089F0P0k97J91J5j43Q0J4l37M57M0k65j86M04j4k39J33p6p9Q5L12q7k94K15P2
$$ plain form
2920 -214 -90 -141 -21 -51 120 -78 -134 -148 40 -18 163 -237 -228 -35 -52 19 91 10 147 209 -39 13 16 59 4 -211
2946 -211 -29 -22 138 287 -113 133 203 6 10 19 57 -48 -8 -30 -54 109 118 173 166 11 128 92 35 -106 164 -16
2972 -16 -22 99 260 102 -83 41 -160 43 88 40 231 174 -266 160 -309 77 24 -256 -11 -257 -86 -77 -102
2995 -102 60 38 -109 2 6 -156 -79 59 -87 -65 -83 -296 -146 -4 -105 -113 -10 -29 -53 -49 42 20 46 175 88
3020 88 48 69 21 337 -80 -33 49 12 144 33 70 42 -54 84 114 -240 203 276 359 143 20 -127 259 76
3044 76 171 248 8 37 -193 -23 333 -97 80 -49 21 203 -99 -118 224 -174 89 159 32 -158 198 -42
3066 -42 67 69 -89 -12 -175 -89 -253 146 -25 -61 -76 66 -206 25 90 -112 -102 -82 279 -28 76 -189 60
3089 60 130 -167 24 39 -104 -24 -10 -347 110 150 -115 -301 103 89 -150 -17 -93 -172 -87 225 138 -156 59 131
3113A31j76K9K31m65N99l52k7J90k27R8Qk83K15J10K5p8J62N0l15Q5j17L79j15
3136A57j35N8j70J76rl31L39k42K30J86k72N5M6q1k72K21P8K76j60j64k16K43
3158A3m8k2J94m64L28J11k35K00j42L97k86k13K67Q9j00l57K35j4j36K42J1j41
3180g1J54j81n3J74r2J17j9k3J71j17k69M31k58K48j58J26j18O2k9r9K08j45K7
3203H6jR0k48J2L4O0Kj07J37l01K73J12m09L66j86P0j41L06l56j01K02l0L2K50
3227A52k39M5rl08K37K06j12P4j66o2l5O2L65j07L3j12R2K2o1j58J25L7O3j11
3251C3Q0r8J79r6k91K75k3J52m01J93LJ05j3l8L1J00j9j89j99L11Q9k27j02j2
3275a57O0M01k78n2k44K59K15l54O0J78P8j86j33J17r2J46ok5k0J25N9j74k57
$$ plain form
3113 131 -45 -16 215 -250 349 -3 -30 160 -67 31 39 -244 -29 81 106 28 190 240 -75 10 -107 272 157
3136 157 22 80 -90 86 77 -254 85 -157 73 259 -13 42 88 7 -265 -44 34 310 150 -14 -230 13
3158 13 -35 -57 137 -327 1 112 -123 77 -65 332 46 -167 100 189 89 -268 -33 -47 -183 59 70 -71
3180 -71 83 -98 -151 23 -69 48 29 6 177 60 -209 222 -36 212 54 180 62 124 95 -4 204 59 86
3203 86 85 175 -73 -61 -27 33 35 -72 65 -236 37 149 -260 106 -80 -10 -151 155 -201 -302 -100 -130 -98 152
3227 152 -87 -42 -51 -359 -122 84 -28 46 -120 -182 -217 -155 210 103 136 24 116 138 77 -81 44 81 144 33
3251 33 113 15 194 98 -193 82 59 211 -190 3 6 111 98 60 91 191 172 -17 -216 95 184 -43 -145 -157
3275 -157 -97 304 26 -26 -270 -11 204 -150 -90 88 166 -20 -153 -36 -128 18 12 -13 -33 92 151 -23 -280
3298b80L81j85p9O2m1N5j0J76q8K50l05K32l26j10J07J15P3j0k1K71l91J87l2
3321C1r3Q8m8K27n51N08K74l54N8k18L41k30K09k27j55L31k48L0L17j81k91Q5
3343i7k1L36j31r9j6K72j97j37J51J21q2K40k24qj93R8Q2j1j01q0J25Nk51L97
3367A79l17Q2J70p5j26MJ22r7L0k6J06lj48R1k44J27l5J4P9K19l36Q7k9J09K58
3392B41j20j55m0N4j68J83P9p5J4Rm5J76j29J27l89L91k46K32j77J46j46j7O7
3415A2J64j77o7J44k0k8K39j62J27k23Q3K84m50J31j37O5l4K88k08k82L73J4o9
3438F7p2k46K63J13n5j40J9o2J20q9J01J00k25K65k26j06m2J01K42n00K84J93
3460A05L0l2j84M63n81M0M1J93j81n5J39j53L00j02j46J48n0k8K22j42l12J74
$$ plain form
3298 -280 101 -84 -163 -101 -142 -87 -97 79 -9 241 -64 168 -158 -268 -161 -46 27 17 -4 267 -124 63 31
3321 31 -62 26 -22 205 -346 162 436 82 140 -78 263 33 242 15 -140 191 -57 -27 290 109 -182 -97
3343 -97 -118 218 87 -12 -28 244 47 -90 61 182 100 340 116 108 -85 13 95 84 -17 -97 28 33 -218 179
3367 179 -138 -56 114 39 -87 -83 39 -58 -28 -54 52 49 -99 -8 -252 -125 -160 -146 -67 152 -184 -97 -126 -17 241
3392 241 121 -34 -74 -20 -188 -5 74 -1 13 22 -23 153 24 151 -238 153 -93 139 -38 108 -38 -55 12
3415 12 176 -1 -68 76 56 28 267 105 232 9 92 376 -74 57 -80 -15 -49 239 31 -251 122 136 67
3438 67 -5 -251 12 125 70 -70 -51 -113 7 -82 19 119 -106 159 -67 -173 -215 -114 128 -372 -88 105
3460 105 135 103 -81 382 -199 -159 -118 75 -106 -161 -22 -175 125 23 -123 25 -25 -53 169 27 -285 -111
3482a11O8N2r9K03j71J3J04J5k45L97k15n5J59j36M3j42J31J55q8m3j94J38K98
3505B77l06k40K78j35P8m2r6K46M6j70J3j89K47J22k19j4J62J3k27J35R0j42k99
3528c72K89Kq1K05L8j59J36q0K62k98J4J18l68L42p8oj12L1R7J13J19q2l6l43
3552b49L17q6p3J84j23k94J67Q9J00q2J09Nj87J32M10k71j20o4P0oj36j22J19
3575a11K67j84p8K81M1q1k08L56m08N9Q9J43m1k58K65j95J48J27r3k23K66j59
3597CJ9K12l85j33J29J67L6Nj78L8Q5k99J75L23m02M12l68oj21J41J26l8K30q9
3621H2j69K4R9q7J69k6N5p3L8p7j79J13J71j53L95m18L42k26n2l57N87j63o7Q5
3645A13p7r3j45L25n8L67n29L36l30K73k68K06Q7k1k83K55k84K9J11j3j2K8k08
$$ plain form
3482 -111 -43 9 -90 113 -58 -45 59 74 -171 226 11 -44 115 -21 22 -120 11 166 78 35 -159 -21 277
3505 277 -29 -269 9 -126 -48 -90 -186 60 106 -64 -51 -240 7 129 -90 -104 58 71 -156 -21 69 -73 -372
3528 -372 -83 -81 -162 43 81 -78 58 -22 240 -58 -44 74 -294 48 -30 -36 -148 -117 -20 93 212 130 94 -249
3552 -249 68 -18 -91 93 -30 -324 -157 -68 32 -50 59 64 -123 9 419 148 28 -36 34 28 -108 -230 -111
3575 -111 156 -28 -106 175 216 135 -73 283 -125 -66 23 166 125 -133 132 -63 85 212 119 -104 162 3
3597 3 22 234 -151 -284 -155 12 48 53 -125 -87 -2 -301 -126 197 -205 207 -161 -167 -288 -147 -21 -59 171 82
3621 82 -87 -63 36 -51 118 92 147 74 112 35 -144 -31 140 -13 382 -36 306 80 28 -329 258 95 28 113
3645 113 36 -57 -202 123 65 432 -97 239 -91 182 -86 120 207 186 -97 158 -126 -97 14 1 -11 17 -191
3668a91M7L15l68K45L9j92K54j58J06j49N4j71o8O1J29Q2j31J11l88L27K20j17
3690E7j66J57j77l3R1K56m42L59j20Q2O2k65K36k00L16l87R6M4J65n21J63K50
3712B3kQ4j16k3L62j21j88O2J61j72P6Jj24Mj52M5J67k71K85j35R3n2J76l14J06
3737b5q3R8p1K49L1l79O1K57j3j05l28L86j56j58J62m9J85O9j50J36RL0k21J2
3761e3M0J8j36q0J73R2p2j2Rk59L77l84Q6K14k2J07L7j45K37K6j57k41J55j13
3785a03K10J71j98L4j74M8N13k62j32n4J87l38L19l45p5M63j16k32J62J89m45
3806a78K57o6J21n0L0r1j78K74k47L08K4o5m27K49j74J67%J20k29L1J97l1R4k15
3830g9K22Nj65J00j29J24j1pk7Q9l82K66j56J35K80k00o9J75k53K10k80N9k94
$$ plain form
3668 -191 -144 171 -197 48 87 -105 149 -9 97 -52 2 -169 -237 -176 -47 35 -96 15 -373 -46 174 57
3690 57 -109 48 -129 -162 -71 185 -257 102 -18 64 126 -139 97 -103 213 -174 -78 -34 131 -390 -227 23
3712 23 21 105 -11 -34 328 207 19 81 242 70 146 147 23 27 -125 -80 87 -184 101 -34 59 7 183 -131 -25
3737 -25 -108 -10 -81 168 199 -180 -119 138 125 20 -308 78 -78 -236 -74 -123 62 131 -19 117 126 156 -65 -53
3761 -53 -13 5 -131 -211 -38 54 -18 -30 -21 -280 97 -287 -201 13 -9 98 135 -10 227 253 96 -145 10 -103
3785 -103 107 278 80 114 -60 -12 501 239 107 53 240 -98 221 -124 -199 264 148 -84 78 267 -178
3806 -178 79 13 134 84 114 23 -155 119 -128 180 204 139 -288 -39 -213 -46 -46 74 -155 -124 73 42 136 -79
3830 -79 143 148 -17 83 -46 78 67 60 33 122 -260 6 -150 -15 265 65 -4 171 -82 128 -152 -93 -387
3853c87L16j2J76j17m6p8J94nj84J37J83j90L25ml84K19j53m2M8m1o2J17K33P5
3877C18k10M7k60J8J93K5o3k20J05J62J33j58lK0L5j27M8O7j8r7M2J2j17pJ56
3902A01l3o1O9n0m6Oj44J10j5L4k3N1k81L58M1K2m69J47N4J50J07k66q1J64j30
3927a85J55J24j58mj6K60l29K7j4J58j55K8N7K01j22J6O5L4k58J36J66p3j64K10
3951A59O1l57L50j63K28k58m3Q8J22q0J75k11q1J87j37N8j23N2j27J04j37j21
3973b54K10j8P6r9PL7kJ54l26J70l59K93J16Q6q0K6m3k31oL56n7j03K24l00k04
3998c27L98K4j07K93l42Q4n4k76K39J70p4j80K37P7j17K5j96R7K25m3k64J48j51
4021a14qJ10j21K97k49J48k08J07J75r8j52J25p9L6J66l9J52p0l01mJ1K24r3q0
$$ plain form
3853 -387 -71 -83 93 -24 -70 -148 46 41 -143 -6 177 -13 312 308 -76 143 -10 -52 -4 -45 -107 10 243 318
3877 318 108 155 -105 -87 106 131 68 -152 -47 115 248 90 87 107 142 15 63 130 112 15 57 69 -48 -55 101
3902 101 68 7 76 26 -20 -14 -158 -48 -63 -29 -52 -1 -282 76 117 139 -330 -183 -129 21 128 -138 -219 -55 -185
3927 -185 -30 94 -64 -68 -84 176 -153 -126 -140 18 -137 -109 -52 149 27 43 108 142 -116 20 186 113 -51 159
3951 159 220 -137 213 50 278 20 -23 65 187 107 282 71 -10 177 40 98 -25 27 -100 4 -133 -254
3973 -254 -44 -62 14 -85 -78 -41 -43 111 -215 -45 -404 -111 5 91 11 37 -6 -237 -243 113 56 -47 177 -123 -327
3998 -327 71 95 -12 281 -61 23 -31 -307 -68 102 28 -152 85 162 45 70 -126 -29 196 153 -111 37 -114
4021 -114 -122 -12 -133 164 -85 63 -145 -38 137 39 -113 12 -67 -31 135 96 248 178 -123 -127 -116 108 15 -65
4045f5p7L41K5p3l16L61j8r7O9j72J42K23k87j64j94k20N14K18j41R9j25j25N1
4068c1M3K8j34L27n01J23J33j22j27K23J41j88J30K1o9n8J04P0j04j89J79Q3k99
4091b17K29m4K18k48l2J93omk56K55j80n1O6J89K7l3k20J43j7J58j77J78k81j0
4115a20K45j15j58RQ0K41k38MK81j44L6k98J80j3j96J12J21j00j06J81M5l0m3
4138b6n4R5p8L79k94j72K3R9k9j65K37R7j27K04k61o5K62l49K82j36N5J79j68
4161a2k9j7J37j79K2M0M31k06k59P1l30L20J21p1k6r9m8O2Lm3J24K01j28K9j03
4186A1K2Q1l1l7l4J8K48j44m60J56P6j4o4O9K68j54K4l5k58P6J07J2j37K96k49
4211a53j17K53j78O0K3K03L5k30Q4k4p3M0NL5j60L63l29L23N7k51l6q5q8J57L5
$$ plain form
4045 -65 -142 199 224 151 -165 196 178 81 150 -22 120 343 56 -108 -302 -522 -8 210 69 168 43 -82 -31
4068 -31 12 40 -94 233 -268 -145 -12 -134 -261 -38 103 -85 45 66 -3 -61 43 113 9 -180 -1 82 -217
4091 -217 12 -32 186 -62 -94 99 93 89 -167 88 -92 -143 -77 112 139 106 -114 29 12 170 -7 171 -110 -120
4115 -120 125 10 -148 -139 -59 182 -56 -52 229 85 121 -177 3 -10 -206 -94 27 -73 -179 2 47 17 -26
4138 -26 -80 15 -63 316 22 -150 -127 -28 -57 -222 15 112 -15 189 -72 -137 125 -224 58 -78 -23 156 -12
4161 -12 -41 -58 79 -100 -78 -38 393 187 -72 -1 -331 -11 110 39 13 -86 -134 -72 -69 -112 12 213 85 114 11
4186 11 33 114 83 46 12 30 278 134 -326 -170 -94 -108 -172 -103 165 11 35 0 -258 -182 -75 -63 -200 96 -153
4211 -153 -270 -17 -195 -135 -112 91 126 -104 -20 -44 -117 -77 -72 -37 -197 166 -163 160 217 -34 -70 -155 -243 -86 -51
4236e1RJ33j14P0m6j9M1j57K79r5j79Q3J36j70M1J30j37q3j53K46P7J72j9j16
4260G8%J01j14K19j65k79L0J98Pj36l3L8J43l7P9k70OJ82M6m4o9J63j80j05K54
4285A12o3k52J40K31j40k96K74k77M25p1k21K30j44J49q8o7j63K51L1k39J91k6
4307a3j05L6J61j72K44l56J24J04m1q7j24J92Q4J58j92r5J9K53k38K92k42L8m5
4330eK91j33j17l3M2k23J1L57l39K41k93J74O3k22K08m1J19J35j36N5q2l6k54
4353b18M19k43M3K60k47l8o6q7P4L11l17J38j49K17j30R4J69k46j91LK12M2j87
4376a37k13K63M6J75j93Nj22J06J01r6J72lo0q5N8J05J15n39K36q5q3J19N1J28
4400F4K6k93K24rk06J39J62o8J05m13L00j2l7j37L83o4j6k15j60J58j5J40O9j50
$$ plain form
4236 -51 -42 91 -23 47 1 -18 23 -134 145 50 -129 -46 90 -80 -39 91 -46 -129 -282 -36 41 213 194 78
4260 78 78 179 65 284 119 -160 -130 68 75 -61 -94 -56 87 50 129 -141 -135 47 93 49 -20 143 -37 -142 112
4285 112 49 -203 -63 168 28 -268 6 -271 154 83 -138 92 -52 97 9 -58 -221 30 61 -178 13 -13
4307 -13 -118 -82 79 -93 151 -205 -81 23 -18 -105 -229 -37 47 205 13 -82 -63 190 -48 244 2 40 -5
4330 -5 286 153 36 3 45 -178 -167 190 -149 92 -201 -27 36 -186 22 -19 100 235 99 154 72 36 -218
4353 -218 201 -42 1 261 14 -24 -90 -177 -103 208 -109 29 -120 97 -33 61 230 -16 -207 -204 8 50 -137
4376 -137 -350 -87 -41 134 -59 -54 -176 -70 31 -65 107 104 44 -41 17 122 237 -302 -66 -151 -234 -115 -64 64
4400 64 90 -203 21 12 -194 -55 107 39 144 -269 31 19 -18 -155 228 164 148 -67 -227 -69 -84 56 125 -25
4424b5J43j03p9K24j17k86M06k4k48jj28L42k19O2K80j88p1J98l89J66J56J6M1
4447A56m0m5N4k15K0J02p0R0L5j46J19j56Q3R5j59j76L09J69l83J03J93j88k3
4470g3j57K81j7j41Q0j17L12m7p3k06j00M21m40K89kq6J37k5k1m0n0m8nK40M7
4495A59j29R5j32m1K3r7K12J61l06J37R4j6m93M63k56J9J27K42j55J0j97J12J5
4518D7r6j2P3Mk8J90N1k61l4LJ82j17p3M4l87K80Q6M5n8j61K51N2j37ok34L56
4544F0m6K2l7K57j97J3J05J45m83K61j21j55K80R6j78Om7K5J30k3l1m6J18N4k6
4569A82j88j49M89k50K32l49j30K63o2J28k48J80Qm95J43K10j0l00M30k32k5L3
4591a40k4L10j36Q9k08J46R0N8j05M2j82L7lo0J75J92n8k15l2j12J57%L44l63
$$ plain form
4424 -25 118 15 -64 160 43 -243 163 139 -109 -110 -238 104 -115 -53 227 39 -32 166 -223 -57 99 115 156
4447 156 116 71 125 -90 -70 32 -38 52 87 -59 60 -96 -13 82 -77 -253 56 225 -158 -55 138 -50 -73
4470 -73 -230 51 34 -107 -27 -144 168 121 48 -158 -258 163 -277 12 10 -76 61 36 15 -25 -75 -123 -128 112 159
4495 159 30 125 -7 -48 -25 -122 90 251 -55 82 176 160 -333 130 -126 -107 20 262 107 117 -80 32 47
4518 47 -49 -61 12 16 -12 178 229 -32 -66 -63 119 2 -71 -27 -414 -134 -48 -3 -61 -222 29 81 -56 -62 -296 60
4544 60 14 36 -1 256 59 72 177 322 -161 100 -21 -176 104 200 22 28 -19 6 136 113 82 36 154 208 182
4569 182 -6 -155 334 84 316 -33 -163 100 38 166 -82 98 106 -389 -246 -36 -46 -346 84 -148 -173 -140
4591 -140 -164 146 10 99 -109 37 127 185 80 122 -60 -23 -26 -86 89 281 223 8 -24 -136 21 21 365 2
4615Blk58J5L42o7RJj34J88J1l07L66k75J84j50N4L05m05P7r4L7J8K32j94K4N
4641a7J4p7K73k01M1N7j68J72k45O2j3R9P3k88L27l33K64m2L9L32j78n08J85K67
4665A35r7J05k76J22k4P0j62rp6L95l05M7M9K66l47j55J85m6J43J46j29j70q5
4688b18J93L38l30N2M7q4J43j40j64J11P5M9J21j46N1K4k13J21k76M92k34J55
4710A67p6PM9rl6k1j6o5l2N1o2J79m5O7J00l73N9L08k90R5K8n1K44l62M5k8J69
4737A02j86J71K6K19n77J64k79L70j2J64j16j56r9K31J27k36J50k4N9j82k6J1
4759i9O5j61L57Rj06j41K69j64k16K12Q9j89K19k07J47M0j09n9Q4P0k00N7j13
4782a46L39k47j26J47L22l78J04m8R1R7k05j07R6J40k03K62j24J15j81K6P2L6
$$ plain form
4615 2 -1 -259 -244 98 31 40 41 -93 95 106 -201 165 -110 74 -76 -22 283 -122 -45 -139 -102 -84 148 -46 -22 -17
4641 -17 -3 -80 193 -8 33 90 -78 94 -151 -89 -102 -3 70 -218 109 -224 40 -2 37 369 191 -317 -132 135
4665 135 38 143 -133 -11 -35 35 -127 -136 -212 183 -122 -75 -26 240 -107 -262 -77 -123 20 166 37 -133 -218
4688 -218 -25 313 -17 35 82 -2 141 1 -163 -52 23 72 193 47 98 122 -91 30 -246 246 12 167
4710 167 91 98 147 138 102 81 65 0 -32 19 -43 136 91 158 258 -115 -56 252 -38 57 85 34 278 -84 -39 -67 102
4737 102 -84 87 113 332 -245 -81 -360 10 -2 162 46 -110 -209 22 149 -87 63 39 98 -84 -110 -99
4759 -99 -34 -195 162 171 65 -76 193 29 -187 25 114 -75 144 -63 84 124 15 -44 40 110 -90 -33 -146
4782 -146 193 -54 -180 -33 289 -89 15 -33 58 155 -50 -157 -61 79 -124 138 14 129 -52 -26 46 82
4804H2k24L93m88K34M7J64m22L0M88k37j01m4l6rJ03l26M20j09K88m22J97j24
4826i6N7K99j94j59K09j44o2J41j24j01J46j24K50n9k11L84k94O7L55n54J35J27
4848D8N9j25ok3J66j50k66M33j16R0n3N1k00L2K46j69o5K9R3p7J14p0k01M04j67
4873G7qL7j70J24J37l14p1L00k23K55j38j60J69j50K53k84R5J50j75M7j39L19
4895A31p1j3o2N4n4m19K50K45k19N7O0L0j90N6K01l2L8J41j84o4J21j67M4Q9p4
4920c2J66l09J92J44j20j31l7k7j59L23j3J06p5j89L68j58q2j34K44o4j04J97
4942A06p4L5k5J64r7j28J97r7l6J6N6J3j38Q8k95J5O8K55j08j89J52J19j05Q6
4966G8p4j47J45K7J82k17j41L27k68P8j08M18k21j02k3j1J43r4R8j8j37M2m7m7
$$ plain form
4804 82 -142 251 -237 -3 44 208 -214 -184 304 67 -34 -78 -114 -123 -20 -346 74 -35 253 -169 28 -96
4826 -96 -39 260 66 -93 116 -28 -90 51 -73 -174 -28 -152 98 39 -172 212 -82 -15 340 -214 -79 48
4848 48 107 -18 -24 -47 119 -31 -297 136 20 110 57 108 -92 -60 186 17 -48 -19 74 -3 111 41 -160 244 77
4873 77 69 106 -64 60 197 -117 -188 112 -111 144 6 -154 15 -135 118 -166 -71 79 -96 -49 -188 131
4895 131 60 47 -15 39 -15 -434 -184 61 -158 -101 -41 -11 -201 -145 56 24 62 203 19 -45 76 -91 -47 42 -32
4920 -32 134 -175 17 161 41 -90 -127 -154 -313 10 -3 103 28 -161 207 49 -33 -167 77 13 -91 106
4942 106 32 67 42 206 109 -19 178 81 45 61 117 130 -8 80 -215 -200 -132 123 15 -174 -22 97 -8 78
4966 78 4 -143 2 29 211 -6 -147 180 -88 -10 -118 300 79 -23 -46 -57 86 -8 90 72 -65 -23 -70 -117
4990a17K77j47J65j85K1j1k14K85j64j8K59k70J41k30J64J72k33J69P0l22J74
5011a4m8O2o8L30k26R4j07j80N3K28L5l24M31j31l34J08P4J49j24j11K10j01J63
5034A69j78K5j66K71K33o1o15L05L3k24J72L6n7K8J6J22k16M8k3J84K3k29p1J37
5058c8j3m13N84J22j61k95J50K91r2l29K89m1M0j92R5L7O0J71k85j83J22M42m92
5081a31M6R9k06J96P8j31J72k98r5L89r9j3j91J02O5q0K14k77J43K6l0N1q8K09
5105A51j81Kj21j1L43r8k20J88j09J85q6n3K38l85K70r8R0N2m0m0l36K03j8K81
5129B07k01k0O2l8N4j11K43j13n1j53J53N8j12k26K45j49J83n4j57L13Q0k67J40
5152H6n5j32O6M7p9L3J96j94R9m6j15J73M4j08j34O0K23o4j70j27J2J28l9J06
$$ plain form
4990 -117 160 13 178 -7 14 3 -211 74 -90 -108 151 -119 22 -208 -44 128 -105 64 134 -188 -14
5011 -14 -62 0 -68 262 36 130 23 -157 -104 124 159 -165 266 135 -199 -91 -17 132 8 -103 107 6 169
5034 169 -9 16 -150 121 354 293 -322 -17 16 -208 -36 0 -57 -29 -13 109 -107 -59 -82 102 125 -104 -175 -38
5058 -38 -51 -464 120 242 81 -214 -64 227 135 -194 95 54 94 -98 -3 34 94 265 -20 -203 -81 361 -131
5081 -131 -85 14 -192 4 82 -49 123 -175 -270 119 20 7 -184 -82 -17 -97 117 -160 -17 9 -21 30 -58 151
5105 151 -30 -28 -149 -160 183 85 -135 53 -56 129 43 -10 228 -157 113 15 105 157 117 77 -259 -56 -74 207
5129 207 6 -14 48 10 64 -47 196 83 32 -121 32 90 -22 -248 -3 -152 31 -23 -180 133 213 -54 86
5152 86 31 -101 -35 12 -67 -34 162 -32 67 21 -94 79 123 15 -119 -59 164 100 -70 -197 -185 -57 -96 10
5176A0k23L35r4J05j49J64k66J09p5LK58j16k21M12j95j76K81o6L1j50j41k7K71
5199H0r7j87L10j23j33P4m3j4J70N9l01K41O2m3K9j18J22j24J20j57M1J17l61
5222b76L12k00M53j16r5k42J25J03J25j19K11k63J5M2J29l35K37q8J00l25J62
5243d5R2Q7j11k24L69j12l1j06J96K83k04k63L23k26o4P5J85L4k45J37o9p0k25
5266b14L87j35j01r6J16k12J50m6k3P2K00j79J02p4J38k86K49j32qP6j44R9J60
5289I9L9l02K19l07K79J7j62M1K4N0l39M17j39K9J9q5J22k16L28J2j79o2Q7L8
5313B9o8N7K47k49k71M49K4j50O2j88n2L35J85k28k44P0N7J15j88J55k7Rj81j01
5337a53J31J61J26j87P2J6j96J24K22m38j05J75r2J21p4J30j49p7K22K21l86q1
$$ plain form
5176 10 -213 122 28 133 -16 148 -118 -9 -84 -81 177 61 -160 252 57 -119 162 96 127 -23 -164 -191 80
5199 80 -17 -204 106 -17 -150 -76 -119 -133 37 96 -205 36 98 55 84 -34 88 -36 84 -73 -32 85 -276
5222 -276 36 -164 289 173 78 -164 -39 64 189 70 281 18 33 75 204 -131 106 18 118 -207 -45
5243 -45 47 134 23 -201 168 56 25 -81 115 398 194 -69 254 28 -36 39 224 258 13 150 81 11 -214
5266 -214 173 38 -63 -159 -43 -255 -105 -151 -174 -102 98 -81 21 -53 85 -201 48 -84 -92 -16 -160 -61 99
5289 99 138 -164 55 -252 27 44 -118 -77 -53 -3 -342 75 -64 -35 -16 -101 21 -195 133 145 -34 -96 -9 29
5313 29 -39 18 265 16 -255 194 218 68 130 -58 -110 225 410 182 -62 8 65 180 -8 147 120 129 -52 -153
5337 -153 -22 139 265 78 150 166 -30 94 316 -122 -227 -52 -144 -23 -97 33 -116 -193 29 250 -136 -217
5359b17M50k35q8j1q9L21p8p8k4K2L47j30k24k05L07l3q1O9J1M5J6o8j01j5K08
5384A19N9l65J54j98J79J9n8J82j7o6M1J03m02M16j83p6o6K14k14J68O3j01K6
5407cj49L97n5j46R0L4j53j18L24q9j20N5j5k1p3L17n01M13j65L6j73J75J11j75
5431dJ49j85K02j11j41p4K89m5J29m95N9J75l8NR6l5K7J48k11K71k35r0R0J50
5455A26k2k68P6J36k52L35k59J02j8r3J64n4j42J8M84j98m0k88K60q6j98K32N9
5478G4j90K55j30M4j45K79k48J49k9k5l3O4O4j60J19j09q3p7M38j57J7j05k37
5501b25L2K68j59j10K00J14j20J61j17Rr5j15J57m5o0J21k39J24m9K66K1k85K66
5524A20o0j45j17K82j85P4j48Q3K59l61K84J9K09j92j24j24P7L0o5J20o7P1j93
$$ plain form
5359 -217 233 -2 -90 -101 -190 131 53 -25 -49 -27 320 190 -34 -239 68 35 -46 23 34 79 95 27 -74 -89 119
5384 119 178 -187 -33 -231 -52 -33 -91 91 74 8 49 152 -250 166 -17 -93 -159 55 -159 9 72 -29 -3
5407 -3 -152 245 190 44 134 168 15 -103 221 132 12 67 52 31 -42 275 -226 187 22 58 -115 60 171 -4
5431 -4 145 -40 162 51 -90 -164 125 80 209 -286 -227 -52 -90 -85 11 -24 3 151 -60 211 -24 -114 -24 126
5455 126 104 -164 -88 48 -204 131 -128 -26 -44 -137 27 -27 -169 -151 333 135 95 -193 67 -19 -217 15 74
5478 74 -116 139 9 53 -92 187 -61 88 59 34 1 65 129 -31 88 -21 -104 -181 257 100 117 12 -225
5501 -225 -193 75 -84 -194 6 120 0 161 44 53 -42 -157 0 -45 -105 16 -223 -99 -148 118 139 -146 120
5524 120 60 -85 -202 80 -105 -31 -179 -96 163 -198 86 105 314 122 -2 -126 -49 -19 -84 36 -31 40 -153
5547a53K62k92L63l84L29mJ9j83j29J83j39q2PK68k3r5K53j45k10L38m29J70J52
5570G6O4k02L70l93K06o5n9j00J08K04k30PK9M3j61J7L35k77J73q2k17L9J87K52
5594C24k22j03k34K30J61j73J2k29J81l31Q6K85j75K8J95P4J14k29K6N8j51J1
5616f2r7oM06j94j1m6j69J62J67k23L6K79l2M2m07J55r5J08J76l29r8M50j38l3
5640D1N7j27N0m2n0J29p4N1q0mR0o5j78K35j87L5P5k91M13p2J07o4Q6l00K1K43
5666I9r2l12K33K00Q7k79L3%M6J21j40J37j45N9o6J39q4Q8j03j67J67R5k85J34
5690c5L5K09j84M0j56kj41M49k74k64K69L8p2K11o7J50l29J67R9k36K77k5Q3k20
5714B2n0P9k0J7r7j8P3J24k23J08N1rq5K9k4j8J92j98O1j13J76m5j52L87l23J56
$$ plain form
5547 -153 109 -183 180 -204 125 121 140 -43 -172 11 -128 -210 -203 65 42 -53 200 55 -155 183 -246 -76 76
5570 76 140 -62 308 -85 121 56 -3 -103 5 209 -21 -14 15 58 -103 -86 249 -28 145 63 -154 -115 72 324
5594 324 102 -1 -235 -5 156 -17 -5 -234 -53 -384 -298 -13 -188 -160 35 109 223 -6 20 78 -73 -62
5616 -62 -159 -165 241 47 36 -10 -179 -17 150 -73 -37 242 210 252 -155 0 -95 13 189 -140 -238 212 74 41
5640 41 98 -29 21 -21 -71 58 -16 35 -45 -49 41 -24 -202 33 -154 -119 -44 -335 78 6 113 49 135 -165 -144 99
5666 99 7 -305 -72 128 215 -64 -31 -31 15 136 -4 133 -12 47 -19 120 36 124 21 -146 21 116 -169 -35
5690 -35 0 209 25 65 -91 -93 -234 215 -59 -323 -54 -16 -88 123 56 206 -123 44 143 -93 184 159 242 22
5714 22 -28 51 31 48 -49 -67 6 130 -93 15 66 57 -28 1 -23 -41 151 -47 14 -99 77 32 -120 267 -56 100
5740A00q3j0j13N4mP4j41K59K3j62K11k57n3J95J6r7J11N4m13K97R0r5n5q7J91
5765A05k46K28j41K2Jn8J42j58n1m8J44M1P2m3N8k78M36k65J87l81L46j33J12
5788I2j24J13J14l24M11l13Mn5Q7J44k13l3j17M05k31lj4j3O1L05k34PQ0j73O7
5813D3j84m7M00m12N6O8K84j79j00L26j15m4r3j62J13j46PP6n2J44P4J27j01j06
5837b3j93K02kO7m5Q7l14J86J32j88K08j58J69n6l38J24L38o5J34j64j90l7K57
5860A31o9j91P5M80l44L2l8j72J25j14l1J3J08p9K76j08j07j24RK82N0j39L1m2
5884E4k23J03k7J31j75L90l08K38j67N4j04J37j53K56j58P2k44qJ12j38O3J18
5906B3j77M28l41j43J36m5J38R7p1j53l6K44L6j23l04J76L04k00M9k3n0j47K14
$$ plain form
5740 100 17 7 -106 -52 -56 18 -123 136 159 -3 208 -49 -102 93 109 12 123 177 -236 61 151 56 1 -86 105
5765 105 -141 87 -54 -32 -31 -89 53 -105 -156 -204 -60 -19 53 10 68 -210 226 -39 148 -233 113 -20 92
5788 92 -32 81 195 -129 282 -31 -27 -82 5 149 -64 -97 -214 191 -40 -43 -57 -70 -9 296 62 69 149 -24 43
5813 43 -141 -188 212 -200 -144 -76 208 29 -71 255 140 96 3 -159 -46 -192 -185 -109 -161 -17 57 184 83 -23
5837 -23 -216 -14 -16 51 6 93 -221 -35 97 -91 117 -41 128 72 -266 -142 196 131 265 101 -89 -126 131
5860 131 62 -129 -54 426 82 114 76 -96 29 -85 -116 -103 5 -74 202 94 -13 -137 -128 154 204 65 96 54
5884 54 -169 -66 -93 38 -137 253 -55 183 16 70 -34 103 -50 206 48 120 -124 -132 -20 -158 -95 23
5906 23 -154 274 -67 -210 -74 -119 19 116 45 -108 -144 100 136 13 -291 -115 189 -11 38 15 -35 -182 32
5929C2k26K93j72j41K52K1j85J17J77p7j48M1J50k16J25j81M6L6K9J0J0%L2r4
5953f9j09N9R3j44J52j42J08j07J95Q4L8q5j65P5j80L30J7j84j26R1J20j95j43
5976b87L12J58k72K9R7R1j02j6M1k0J0j33K40l6N8r2j15j00P0R9j07K77k64K12
6000A50q8O9p9kQ1j3L7j1k53j23M67l36K48p6O4j20K64j17l68J21J64m3j2k08
6024a84K18j24M9m1P7P8l07J58k2P5m4K09k89R5Q1r5o9K63j29j1j57L16k27pK15
6049A28j65O8lk44J55K57j22j74J51l1j85J19j58J20k72L15j9L91k53J80j34m9
6071G5j53l1K77k5j37j55M4K8L51q9m3K7k13R8m8J65r3j04p0P8J89k22J58l69
6095b62M08k49K28J25k63j75K32RM5K7k30J06k72M08j02KJ48o6O8k69K00k66L8
$$ plain form
5929 32 -194 99 -73 -214 38 59 -126 -9 168 91 -57 -16 134 -82 43 -138 -92 -56 -27 -17 -7 -7 25 -69
5953 -69 -178 -119 -26 -170 -18 -160 -52 -159 36 120 158 73 -92 -17 -197 133 150 -34 -160 -69 51 -144 -287
5976 -287 25 183 -89 -60 37 128 26 10 51 31 41 -92 148 112 170 78 -37 -137 -67 32 -75 202 -62 150
6000 150 62 131 52 50 131 118 155 144 -109 -232 235 -101 147 71 135 15 279 162 -206 -85 79 36 24 -184
6024 -184 34 -90 -41 -82 -5 73 -234 -76 -98 -23 -67 142 -147 -52 29 -66 -135 128 -1 -12 -169 147 -80 -87 128
6049 128 -37 31 28 -216 -61 196 74 -100 51 20 -165 -46 -204 -84 -356 -41 -60 331 78 258 124 75
6071 75 -78 -109 168 143 6 -149 -105 -77 274 185 142 169 -44 54 6 171 78 -26 -96 -18 171 -51 107 -262
6095 -262 146 -103 125 250 -13 -188 44 53 98 125 -105 1 -271 137 35 37 185 119 187 -82 118 -148 -110
6118a10J8J72k46N0J92k01J46p4mR0k96J85q6Q9K32k74K28k94R7Q5J44j55J55
6141A43k19j76J91L2j8j91P5P0J80k31Q7K01l9J9k11K8O1KP2K5o5l23J75Q2J98
6166A68kk40L1M1j21R7Q4o4R0m7M1j60K23J46l55J58Q9m60L72p1J80k63r5K61
6190A03k22j27M46k17j59J68M4m9K5l0P0Q4k43J87q7o0m1Q3m7K88j12kR5l77J33
6215d7j10R1r4N08ol99J18l0P2L8K1m10L62o6Q5j49O8k2K06l9k19L24j38k83K19
6240A00Kp4k0k99M54J53m67r6M98j41j67k27K18K04j81N8J4J13j72k22K52P8k84
6263b06K41M2J30J39m06O9J51k28J40j0M3j86p4L68p4l68Q7q0K37N7k8k40K14
6286A8J3P4qJ9N8l13R6J75m0J0no9R3k32J49K6kO6l4J96j83j26j10L4O0J31J46
$$ plain form
6118 -110 -92 80 -166 -116 76 -125 21 -53 -57 33 -263 -78 -164 -75 157 -117 111 -183 -86 -1 143 -12 143
6141 143 -76 -252 -61 -29 -47 -238 -163 -93 87 -144 -57 144 105 124 -87 -59 2 4 76 101 36 -287 -112 -30 168
6166 168 166 -74 -43 -2 -123 -26 58 -6 84 37 78 -82 141 287 -68 90 179 -281 91 20 200 -63 -158 103
6190 103 -119 -246 200 -17 -176 -8 36 -13 12 -18 52 136 -107 80 -7 -67 -108 -25 -72 216 104 102 197 -180 -47
6215 -47 -157 -66 -160 348 342 -57 61 31 103 141 162 -248 114 48 133 -16 52 30 236 197 -22 302 164 -119 100
6240 100 102 28 8 -291 163 316 -151 -247 251 110 -57 -284 -66 138 -43 15 29 142 -30 -252 0 78 -206
6263 -206 35 77 207 346 -60 9 160 -68 72 62 105 -81 -155 213 139 -229 -142 -222 15 72 44 -196 18
6286 18 31 105 97 116 174 -139 -43 132 92 102 97 28 121 -111 38 64 62 128 94 290 107 -19 -129 -95 -35 96 242
6313B42l61J75q8K97k82n9K38j85ro5J56j44j39J93j37K07n1p9J28J77j58J71
6335B27l81K02k76K76M0L0j59Q5q0K6k1j31K71k65N8L03o1l92L57j51j2k20J48
6358a26M8L12k40K42l29J94p3j99K54l10k4J11l2K24o2K07j18m4k37K53j56Q7
6380a8j7M1j72M48l88k4J62J03k74O6K15J1n3j37J0O8J09J03k6l51L02l57L56
6403A77k69J71k66R8n0M41k44rJ91n26J61K97l68K79K0r6K19k49J07J7q8J07j68
6426d8L9P8r8M4J50k01M43m33j8r7k8R2K69k41m6J69j91J19K49j45K9N8j88J01
6450A06k78J66m7J22M3M0j21K54l17j07L37m13L68K2j27K89m22J0K02n5j91K65
6472A46l89L34q3l9J04k43K30j29Q0l54N09l33L41l39J4K38j06m2P1k05J38j53
$$ plain form
6313 242 -119 56 -32 265 -17 -76 162 -23 -32 -97 59 -85 -224 -31 -168 39 -12 -91 37 214 56 227
6335 227 -154 48 -228 48 88 118 -41 44 -36 -10 -31 -162 109 -156 -98 205 144 -248 109 -42 -54 -274 -126
6358 -126 -78 234 -6 236 -93 101 28 -171 83 -227 -251 -140 -172 52 -10 197 79 35 -202 51 -105 -18
6380 -18 -35 6 -166 282 -106 -130 32 135 -139 -73 142 153 100 -37 -27 41 150 253 227 -124 178 -179 177
6403 177 -92 79 -187 -89 -139 302 58 49 240 -286 -125 172 -196 83 103 7 226 -23 84 101 13 120 -48
6426 -48 -9 69 -29 15 165 -36 407 -26 -44 -141 -169 -77 192 -49 -95 74 -117 2 251 106 135 193 5 106
6450 106 -172 -6 -53 69 112 152 31 285 -32 -139 198 -215 153 175 48 337 -85 -75 127 72 -119 146
6472 146 -243 91 8 -31 73 -170 60 -69 11 -343 166 -167 174 -165 -151 87 -19 -61 10 -195 -57 -210
6494b10J80j03K92j22k40K92J51k00r7K0J73m9M7m0r5q5k45J86L46j03J9l48Q1
6517a50K42j15K30k54J9J11k50J38Q9J37j97J47k82L16m08J07L63k14j69K47n5
6538E2j6M4j57L09m67M43l0l62M05j74J46j23j24l8rOL12j18k72j42L53p9j10
6561a51J79J50k69l7K56k41J99j85n4K2K55jj03j48J87j74M3qJ93j52K31Q7l19
6584d0K75l56K42j15j47L41k34kK92l93q5J75R6M8j85J57n7K45l55K49j43j09
6606a01o4m3L53j16k49K92J13n39L81Lj1J2J3l4J7N6j96K69k13J25q6j49K83J26
6630B42k20K55k59O0P3k71L23l23Pk3K79l25J53m1P8J26k07J25m5J05k38j5J07
6653c4J22k45L14j53J11K07k57k10k42M11J70pj89N4k21J13k1J08K6j44J67k28
$$ plain form
6494 -210 -30 -133 159 37 -203 89 240 40 -57 -37 136 87 134 94 -1 -86 -331 -145 201 98 117 -231 -150
6517 -150 92 -23 207 -47 -28 83 -167 -29 60 197 0 147 -135 181 -227 -120 243 29 -140 107 52
6538 52 36 80 -77 232 -235 208 178 -184 221 47 193 70 -54 -92 -101 -95 217 99 -173 -315 38 -41 -151
6561 -151 28 178 -91 -128 128 -113 86 -99 -153 -131 124 123 20 -128 59 -115 -72 -80 113 -39 192 279 -40
6584 -40 235 -121 121 6 -141 200 -34 -36 256 -137 -222 -47 49 97 -88 69 12 257 -98 151 8 -101
6606 -101 -165 -208 145 29 -220 72 185 -354 27 30 19 31 44 10 27 83 -113 156 -57 68 -18 -167 116 242
6630 242 22 277 18 78 151 -120 203 -120 -113 -136 143 -182 -29 -70 8 134 -73 52 7 112 -126 -141 -34
6653 -34 88 -157 157 4 115 322 65 -145 -387 24 194 187 -2 52 -169 -56 -77 31 57 -87 80 -148
6675a48O1J75j52J12j27J38J36k58O4j07J9n0o0L62j51K1j9j55K83k13J08J20
6697A59j9l54J58O4J24k91J97R6j30K20l95J16K75K7Q0j31k54J78k69j25K31l9
6719h2J98kj01Q1k21L31j58q1R8j63K45k22P5J57k57q1o5P4K35o8l4n2k1M4J33
6744F3p5j74J32q6L71l77M68l17m1M7K1L9j11q8J77j75NP2R7j34oL65k99J55j86
6769e7m2L12j4j63Q4P5j92j46M45l07k3PJ78j87n9J93J13j49j62l8K29j84JM2
6793d4P1j94J72j8k87J15J16Q9k98J24J34j7j6m8j12M2Q8Q7J84P2k75L34k83j64
6817a28J39j24r1m2K27p6K15j75J32m60K63J02P4m2J06j57M0J89l12M53l44j16
6839a27j8K63j76K23k3l2k41R6O6P3m11N14j75r3M1P8N9j55J00j43r9M1OP5J54
$$ plain form
6675 -148 -87 88 -64 48 -79 59 195 -63 1 -106 -87 -137 -197 165 14 35 16 -139 144 -69 39 159
6697 159 140 -214 -56 8 132 -159 38 134 4 224 -171 -55 220 247 327 196 -58 120 -149 -274 -43 -82
6719 -82 116 114 13 94 -127 204 46 -35 63 -100 145 -77 -2 155 -102 -183 -248 -174 61 -7 -41 -93 -114 -70 63
6744 63 -12 -186 -54 -140 231 -146 322 5 -36 11 32 71 -40 -128 49 -126 -121 -49 48 -86 -92 273 -26 129 -57
6769 -57 -99 213 199 36 120 195 3 -143 302 -5 -28 -21 157 -30 -89 104 217 68 -94 -132 97 -87 -86 -44
6793 -44 27 -167 5 -13 -300 -185 -69 20 -278 -154 -20 -37 -53 -101 -213 -171 -83 4 188 260 -15 319 36 -128
6817 -128 11 -113 -204 -246 -19 -95 120 -55 77 -383 -120 -18 56 14 120 -37 3 192 -120 333 -11 -127
6839 -127 -145 118 -58 165 142 110 -131 -35 31 104 -307 207 32 -61 -20 58 117 -38 62 -81 -180 -139 -133 -58 96
6864I6k17K14r3J47j74L6m9m2K24k47PJ00J51k60K12j69M5j6J90j17J03Mk01K8
6888b8O6K1j45M9o6J09J14Qn8j13K89l67J49j75m7J21j84K89L0n3j52K02J84j30
6912A13Pl26M65m38P6n6L83m63J80Q2l3K6q9J91l11K47k0J72j16r0j73O6K25k29
6936a11M8O4R1Q8k00M3m7J13j79J68Kp5N7n6k94J89n3O3J44m2J87k0l58J07p6
6961a47M8M7P0MPj03J28J88K7k64p5O8J54l33J58J31p4n6P2J8k04R1jm2L43j20
6987A35m8J38j57j05J51j8j42P7n9J52j01R7Q5j25rp0k3J67k10J23J49j63k92
7010b48N02k35j21p3L6K99l59R9K63l03J93j32o1K37n1j98J53P5j12R5j61J40
7032C8q2J20q6K88j47l7k7q0o3k1R3j31J73J18o1k15R4j69M65k17j92K00m7j61
$$ plain form
6864 96 -121 93 0 147 -27 9 -40 -82 142 -105 -98 2 153 -107 105 -64 -19 -35 155 38 141 145 -56 -28
6888 -28 38 59 -86 -37 -103 6 120 128 70 -43 246 -121 28 -147 -194 -73 -257 32 62 9 -143 59 243 113
6912 113 120 -206 259 -179 -103 -159 224 -239 -59 23 -10 16 -73 118 -193 54 34 206 90 0 -173 -107 118 -111
6936 -111 -63 1 92 180 -20 23 -24 89 -90 78 80 5 62 6 -288 -99 -152 -89 55 13 200 180 -178 -71 -147
6961 -147 -99 -52 18 22 29 -74 54 242 269 5 -70 -2 152 -181 -23 108 34 -22 50 68 -136 -45 -46 -88 255 135
6987 135 87 225 68 -37 114 96 -46 31 -28 124 23 120 205 80 71 1 -22 145 -65 58 207 44 -248
7010 -248 254 19 -102 -175 -139 160 -199 -100 163 -140 53 -79 -140 97 46 -152 1 76 -36 59 -102 38
7032 38 -44 76 -10 278 131 94 67 -13 -76 -97 -4 -135 38 156 95 -120 -26 -195 270 53 -139 61 14 -147
7056a47K00m1J05k16O5N9j23J07J85j06M8J14j78p6j25Q4J10j2k87L67K22j10
7078B45l65J41J29m0k04Q8j79L41k91Q5J10K7M0K6j59j77Q6K11j73M0J40k39K81
7101A63k01Q7n0p9j2J89k08J54M1m48K25j2J90m8Qm4p9k8J53j02J14J00k48j7
7125a52K5K1L58k34j32K78j61L9k00J65k16M31k14L3O6j65J16O9l2j30K6r8J5
7148i2K12j67K9j02J81j95N9J59l01N07l17J42j34O3J41k09J91l5p0J43l05L7
7170f3J16J4j8o6Q0r9K7J1Q3l11L20j00j45p4J10J06q7K75k75K56P3j59o9r7J52
7195F0j17j9N4k6J22q9k08K82k2K9M1N2j24j38L3J77j03k6J44k83Q5K40l10K84
7219A38k75J13J18R0K6k48K29j87j08L9J89q9K2j82L13j29k07k2K50l9P9J50l11
$$ plain form
7056 -147 53 12 117 -99 -34 25 -98 9 194 88 136 250 72 -4 -129 -45 65 53 -234 133 355 245
7078 245 -120 21 150 110 -94 -6 -185 156 -135 -50 60 87 127 153 -6 -183 -97 114 -59 -19 121 -118 163
7101 163 -38 49 -1 -80 -92 97 -111 43 84 -364 -139 -151 39 -9 -1 -45 -124 -152 1 -101 13 113 -135 -152
7125 -152 -127 -106 252 18 -114 164 3 42 -158 7 -209 222 8 41 107 -58 58 127 95 -35 -9 -107 -92
7148 -92 120 -47 -18 -120 61 -134 -75 84 -217 290 -27 115 -19 44 185 -24 167 132 62 205 -100 -63
7170 -63 53 67 49 -17 63 -36 -9 2 85 -226 94 -6 -151 -225 -115 -9 -96 179 -96 160 233 74 5 -92 60
7195 60 -57 -76 -22 -48 74 -15 -223 59 37 66 107 159 35 -103 -70 107 4 -22 122 -161 -76 164 -146 138
7219 138 -137 -24 94 184 210 -38 191 4 -104 -65 124 35 57 -125 188 59 -148 -170 80 41 120 270 -41
7242d1J24j80P1l5K23k32J5k29K39J80l33L32j97j22J41l59M68Q9j47O9j81J70
7264F5l9m01L58K8NL4j71Q8j0J48o3k14J03L6J76j71K13n33J92N4p7L27j46L5
7288C7J12J5j05l14J66P5L3r6J6j45L09p4J44m3j66R7k15J24n3J6M15n73K42o3
7312d6J14O8k11L34k93j48K90k47K52n8J17j57k0j39K56q1j04J60L2q5J15k17
7334f8K00l3J4j35J94q3j01j07K8L5J30J9j34J47k86L02j83r6J66N7J03l39l4
7357b04L29k04O8J58m5K6q7j31M2J22k14K02M9K2k09O4L1L6j19R9k2J1J27P5k02
7382B4k06J33J71N3k84K89j73%K3k5j18J28j9J74m9p6j80J11k02K0L3K68l00J63
7406d2L34k37p9M7L37l26J15J6k02r7p9J04J50J44l21J5R1K26j81K47l24M0l0
$$ plain form
7242 -41 83 -97 -26 -61 162 -70 -55 -284 -45 135 -198 134 -63 -185 -44 -403 65 154 7 76 -105 65
7264 65 26 -375 -17 11 16 50 -121 -33 -43 105 42 -172 -69 -33 143 -28 185 -348 -156 -102 -179 148 2 37
7288 37 149 164 59 -255 -89 -14 19 -77 -61 -206 103 29 173 130 -36 61 -154 -30 -83 -67 348 -225 17 -46
7312 -46 68 136 -75 259 -34 -182 108 -139 113 55 172 15 -5 -144 112 31 -73 87 119 34 149 -68
7334 -68 132 99 113 -22 172 89 -12 -119 -91 -56 74 93 -41 106 -180 122 -61 -157 9 66 169 -170 -204
7357 -204 125 -79 -11 147 102 128 41 -90 -48 74 -140 62 111 133 -76 -12 19 55 -64 35 13 24 151 226 24
7382 24 -182 -49 122 175 -109 180 7 7 30 5 -113 15 -4 170 121 45 -135 -24 -226 -206 -173 95 -205 -42
7406 -42 292 55 -24 23 360 34 149 165 -37 -134 -213 -109 41 185 -136 -121 -30 196 15 262 -62 -22 -52
7429e2R7n3oj7O9n0j91O0K01j75J43j01j6O5J04k00L96k38ok37L17J09j62N6m6
7454F7l8j06L9k0pMJ78j38j62L46m70J98K18j5O3q7l9j29J71j36o3R5j69M63j76
7479H7J07o6J71l38J77k79J62r9R7k17J97k0m1R8p4l8J02J75n68M89M8r5J39k21
7503gL44m08q9Q7l0l6L99k4k68NJ85p6J00L2k01M4o6p8O2J10l18K46m4J12M6j42
7529a5j15L08J54k12j39l0m3K6J63k00k14M43m4M6r7nM3j42j69L63j09J59k33
7552f2R6j02l1J35j95L99m84L44J47m92M62k94K2J34j92J05M8l14K44l1K07k25
7574g9J56L7j40m5K02j80J81j53K00J8j51k58L34k63n4K57J22k47J07j07L6j27
7596a54M8k3J06PJ19J87m89K34j32J34J55k61J29j47l6J91N1qr2k00K29q3J22
$$ plain form
7429 -52 45 -8 -14 -31 38 -12 -203 -143 58 -117 26 -75 -91 -26 78 -122 274 36 30 -207 110 219 57 113 67
7454 67 29 -77 -38 -58 -65 -61 117 -21 -183 163 -307 -109 109 94 157 70 31 -98 73 -63 -126 -31 -200 263 87
7479 87 194 128 299 -39 138 -141 21 -78 19 -198 -1 -21 -62 36 -38 -76 26 201 -367 122 170 75 214 -7
7503 -7 337 -71 -160 -73 -103 -139 260 236 -32 -27 158 82 182 214 13 57 -9 -87 -25 85 -233 13 -31 81 127 -15
7529 -15 -130 178 332 120 -19 -49 -92 -66 97 -103 -317 126 82 128 31 26 69 -73 -242 121 12 171 -62
7552 -62 34 -68 -99 36 -159 240 -244 100 247 -245 217 -77 -55 79 -113 -8 40 -274 -30 -61 146 -79
7574 -79 77 114 -26 -71 131 -49 132 -21 179 197 46 -212 122 -141 -195 62 184 -63 44 -63 -27 -154
7596 -154 -106 -129 -23 -16 103 290 -199 35 -97 37 192 -69 60 -87 -123 68 119 111 19 -181 48 -35 87
7619H7M1j39j9j31K42n9j72K20j26K52q9j26n0J0J87j99k5J30k75L3K01R0j93
7642a10P8O1o9j0m0j14L08k57J33K36m14L94l27J35J2P8n2N1k03J82k32L10k87
7665a37K99j95j61L7P7Q1o0j07P0J92k05J22K8j29J28nM6k03K76q0P1l5k58k0
7689a68J34J49l63K67J42o6l40J92K3p4r8N9K69k16K62j95m1J92n8M3j91J5J46
7712H3k00o9J88j68J29j98L06j8j08J08j41M9L0O1k9j4o0m0q5M1r0K8J24m3K69
7737A53k59O9r9K90j50j42K32k18J79M8p2o2nP5k5M9k7M9J44j48j73J33%P0j18
7762gl7j3O3J88r6j30J87j95Q2k23J27K58k13p0R0P3Kl0k24L64m21K54q4m1Nq8
7788a79J21pL5J12Q3l26J52j5l3Q9k74M03k46l5J21J60K39k31j91Q6o8m8J58j62
$$ plain form
7619 87 128 -11 -30 -161 81 22 -150 70 -56 196 107 -19 -69 -59 128 -71 -96 34 -241 -208 -7 83 -110
7642 -110 -32 29 -40 -50 -90 -204 104 -153 -20 216 -198 196 -131 4 16 94 42 93 -110 72 -160 150 -137
7665 -137 162 -33 -194 -157 -80 1 -59 -166 -96 96 -109 13 41 -88 40 35 81 -122 154 74 145 110 -148 -168
7689 -168 -34 115 -248 19 161 95 -245 -53 -30 -104 -202 -143 126 -90 172 -23 -64 128 70 113 -78 -63 83
7712 83 -117 -186 2 -166 -37 -235 71 53 -55 53 -88 -39 -9 52 23 9 -51 -91 -176 -135 -225 -197 -73 -116 153
7737 153 -106 -37 -136 154 4 -138 94 -124 55 103 31 -31 -36 39 14 63 36 85 229 81 -92 41 41 111 -7
7762 -7 -44 -57 6 194 98 -32 155 -40 42 -181 -54 204 -9 -79 11 84 86 56 -168 196 -225 29 -55 -96 -91 -179
7788 -179 -58 -65 -30 82 165 -161 -9 -24 -57 32 -242 161 -85 -120 1 161 400 169 -22 64 -4 -52 106 -56
7812e6J51r7J95k90L2k0j1L39l30J58k13J56j59J40K60m40J18J07j60P9O0J39
7834A58j38J80k55K51l58o2O7K30R5k66J97J64j57m54K55K45k05J42j81K94j35
7855F7J56k27n7P0J30j56N2p5J80k44L10l54K55l93R4N3n1L10j86k1LJ46j07J9
7879b6j65J65J32j27L09k71O5R2j38j31L9J26j57J46k6P0j51M5J79k49J78l2N9
7902A32j21j53J91P9m84M10J74p3J65m39K01k36J68P4l50K81J24M1l10K43k15
7923i8l2Q2Q2M3j24p8O7p9L63k97k0J28N2J1K8l02n8K33O4J61l18J88p6o0m6j20
7949b06J93O0o7J77j63k54J79Q3J58k91L0J49N8K6k36K59k59J35k8j33O6k9K79
7972A86Lk85N3J20J08j67j28M2r1J95K70l46P3j02k9k24J35r0K59R9j43K36k14
$$ plain form
7812 -56 95 -2 193 -97 -65 -85 -96 243 -87 71 -142 14 -145 -5 255 -185 -67 40 -120 -41 19 158
7834 158 20 200 -55 196 -162 -224 -157 73 168 -98 99 263 106 -348 -93 152 -53 89 -92 202 67
7855 67 223 -4 -61 9 139 -17 35 -40 140 -104 206 -148 107 -286 -192 -139 -190 120 -66 -87 -84 62 -45 -26
7879 -26 -191 -26 106 -21 288 17 82 174 36 -95 -56 70 -87 59 33 103 -48 -3 176 -73 105 73 132
7902 132 11 -142 49 128 -356 54 228 155 320 -119 82 -154 14 88 -262 19 143 184 -126 117 -98
7923 -98 -130 -48 34 77 -47 -125 -58 -137 226 -71 -91 37 89 100 128 -174 -232 1 65 226 -92 96 20 -40 -86 -206
7949 -206 -13 47 -20 157 -6 -260 -81 2 160 -131 -101 48 106 132 -104 155 -104 31 3 -130 -64 -93 186
7972 186 189 -96 -43 77 185 18 -110 -68 -159 36 306 -40 33 -69 -98 -322 -187 -277 -18 81 -62 174 -40
7995d0M1k4k0k45O9O06k01k04J74j51j6Q0l2J78j57ok0j02L8Q2j06K70k60J26
8019H0J22m6j3k70K59j6J32l97L52j37m2n3K24j47l0J08j81k7M19k70j74N11l84
8042B0J60l29K40jj78j6j2K19r5O7j1J50k61J08J13r8j05oK09m74M44r6j22jk9
8067a04K26k05j00L8J93J06q2J02j91P1m5J61j83n9j13J96R3j80j40L58l42o4
8089b64Q1P9K31l19M6J01J33Pj2j58J9J22j05K8K7k14K75j26L8L15m83M46j52
8112A15k98J71o8J26k23M49j90j66K50l51J68P6j52r5M03j63k9Lj96L02K8l29
8134a69J30O6j78K17K46l39k31M70l3M4j79J25l35L5L80m09J53%m4J69m3M3j70
8157e2J26k92qn7O97m00j9m1O1K19k33J5m7J22j17NJ5J47k84K78N6j97J06j95
$$ plain form
7995 -40 1 -23 -43 -288 -219 387 186 -18 156 5 -11 69 37 215 58 52 32 -70 -32 50 -56 214 -46 80
8019 80 202 156 143 -127 132 116 248 -149 203 66 24 -29 195 48 18 126 -55 -82 337 67 -107 404 20
8042 20 180 -149 91 90 -88 -104 -116 103 8 75 64 214 -47 61 174 76 -29 -35 174 -300 144 48 -74 -75 -104
8067 -104 122 -83 -183 -145 48 154 72 174 -17 54 9 170 -13 -72 -185 11 104 -76 -216 142 -200 -264
8089 -264 -183 -104 127 -192 -146 -45 88 95 83 -75 -56 66 -39 -11 16 -198 77 -49 -11 304 -179 267 115
8112 115 -183 -12 -80 46 -177 272 82 -84 166 -185 -17 59 -93 -188 215 52 23 26 -170 132 160 -169
8134 -169 -39 27 -151 66 312 -27 -258 212 179 223 44 169 -166 -131 249 -160 -7 -7 -51 118 75 118 -52
8157 -52 74 -218 -226 -283 414 14 -5 -46 15 234 1 16 -31 91 -26 -21 -6 141 -143 135 191 -6 100 -95
8181i5J07k36K13K25r2l20K22j55J68j82
$$ plain form
8181 -95 12 -224 -11 214 122 -198 24 -131 37 -145
8191a45
$$ Imaginary data points
##PAGE= N=2
##DATA TABLE= (X++(I..I)), XYDATA
0@%%%%%%%%%%%%%%qJ6j6J6j6K1k9L2l9M7n5O3p2Q7j00J14j32J51j69J92k17K43
36A29k75L11l49L90m36M84n36N95o58P27q04Q87r78J079j188J308j441J587j752
55i20J935k142K381k653K968l338L785m336N030n938P187r030J2058j8248N7863
70D6602r0654J6970J06177p5612K0050j1724k6056M5281j2422l8578L8083j0313
82G804q093N706m083K163m734O831J5636l3723k371L4467j4393j3662J1558j0538
96g432O669J328j9515J1680K2954l1733k2622M4588P346m0727J6197J4707k2268
109a8828J8811L268j6529K1731j1303r739K6576r286j1678J2126l324l32J453
122B946l849J482m229R837n342j9347K1524N819j7130Q325n923m926K5460r140
$$ plain form
0 0 0 0 0 0 0 0 0 0 0 0 0 0 0 0 -8 8 -8 8 -8 13 -16 16 -23 24 -31 32 -40 47 -53 61 -71 80 -89 103 -114 129
36 129 -146 165 -184 206 -230 254 -282 313 -345 382 -422 465 -513 566 -622 686 -755 832 -920
55 -920 1015 -1127 1254 -1399 1569 -1769 2016 -2320 2710 -3228 3959 -5071 6987 -11261 46602
70 46602 -44052 -27082 79095 3483 23533 11809 -14247 31034 18612 -19966 18117 7804
82 7804 -289 5417 1334 3497 -1237 5594 21230 -12493 -14864 19603 5210 -8452 3106 -7432
96 -7432 -763 565 -18950 -7270 15684 -16049 -38671 5917 13263 -27464 -11267 3440 -18828
109 -18828 -17 3251 -13278 8453 -2850 -12589 13987 4701 -6977 5149 1825 1493 2946
122 2946 -903 579 -3650 6187 845 -18502 3022 8841 -8289 36 -5887 -10813 14647 5507
136E507j6695J1293L111P270k394j1828Q734L434j73J818j1318O792J0607j3532
150B626J682p27j281J3353j4615p217J8651r657p633J3588o309o410M682K122
164B855J027p613J131N402k425l482k272O368L649j3418J166J1963p513j015J494
179b683n961Q757M96q902M466J692j798M513k087m255P79P996N438j6635Q6J8510
195A0412m958p261J85j33J0889j822j5306R257O524p778J846l41l895L712M133
210E464m963n455N896L341n970K041J142m566Q362j518r780R637L685q786K639
225A169L508l974K358M22l876J648J670l335j047N174n257l961Q519l256o426
240f664P191j021n446P264k818n216P624N52n996J223L417j459R81M06n200J910
$$ plain form
136 5507 -11188 105 3216 10486 8092 -3736 4998 8432 8259 10077 -1241 5551 16158 2626
150 2626 4308 3581 2300 15653 1038 -6179 12472 2815 -4818 8770 2461 -3949 733 2855
164 2855 3882 -3731 -2600 2802 377 -3105 -5377 991 4640 -8778 -7612 4351 -3162 -4177 -2683
179 -2683 -8644 113 609 -8293 -3827 -2135 -3933 580 -1507 -5762 -4983 3013 8451 -8184 -8098 10412
195 10412 5454 -1807 -1622 -1755 9134 7312 -7994 1263 7787 9 1855 1514 -2381 1331 5464
210 5464 501 -4954 942 4283 -1687 354 1496 -3070 5292 3774 -6006 3631 7316 -1470 1169
225 1169 4677 703 3061 3483 -393 1255 2925 -410 -1457 3717 -1540 -5501 3018 -238 -6664
240 -6664 527 -494 -5940 1324 -1494 -6710 914 1466 -4530 -3307 110 -1349 -368 38 -5162 -3252
256c252O979n455n243O880k295q00M541p496m0J0044m431o992O291J640q42K378
272A907l910j683P797K387r107J227N879j685j81K36m967L985O632r551k376P828
288D418j393k624J236l842J665P587n167o732O505L298m057M34k58k951O809l8
304D890q825L418N727m729j526J528l457L712K238p483m96O226j455m280K469
319b043r36p69M600k352m726N932K739o275K848J483l157M120L51n455L014L479
335B853m733N83K141k970Q75K923k960k849N210m72l106L024m66l071M932J9m422
352b489M322O39l159K895N66l676K168L403l980j648L720j08j512J470k855o52
368h96O509l549l993M956l33k192L675k634k918N481J34m225n75L312J26k628
$$ plain form
256 -3252 3727 -1728 -6971 -91 -2386 -3186 1355 -6141 -6181 3863 -568 -7560 -1269 371 -471 1907
272 1907 -2003 -3686 4111 6498 -2609 -1382 4497 2812 2631 2867 -2100 1885 8517 -1034 -3410 4418
288 4418 3025 401 1637 -2205 -540 7047 1880 -4852 1653 4951 894 1328 1070 -1881 4928 4890
304 4890 -3935 -517 5210 481 -1045 483 -2974 738 2976 -4507 -5003 1223 -232 -4512 -2043
319 -2043 -2979 -3748 852 -1500 -6226 -294 2445 -3830 -982 501 -2656 1464 1815 -3640 -626 2853
335 2853 -1880 -1297 844 -2126 -1251 1672 -1288 -4137 1073 601 -2505 519 53 -3018 1914 1933 -2489
352 -2489 1833 2472 -687 2208 2774 -902 1266 4669 689 -959 2761 2653 1141 2611 -244 -896
368 -896 5613 2064 -1929 3027 2694 502 4177 1543 -1375 4106 4240 15 -560 2752 2878 250
384B50O9k034J399M083o060l407P390k068l815M234l392J06M899l616k397L531
400h28J704j365q49j387K489K580o12o282K056Q379n730l811M810j380l36L383
416B821m886k6M469k006K94p54j643L144K686l334m170L993N084n266k517M553
432B442k232J124J384n545M609R07o515N364K159o365K258L879k879o81Q04K472
448C185k131r33L085j517O01q26k576N725j855p608Q099O81q098M717J03l583
464b931K629p84r43Q70j673l19J591J611l120l952Q102j99p929O641j124m837
480f367P764k219n998N747j369N61L868p786M78P968l49p056p64P571r11m407
496c269M625l104k972J0182m705n975P115k468M51L820p410O96P483l897l229
$$ plain form
384 250 319 -1715 -316 3767 -2293 -5700 1690 -378 -4193 41 -3351 -3245 1654 -1962 -4359 -828
400 -828 876 -489 -1338 -2725 -236 2344 1732 -4550 -2494 5885 155 -3656 1154 -226 -562 2821
416 2821 -2065 -2091 2378 372 666 -88 -1731 1413 4099 765 -3405 588 5672 406 -2111 2442
432 2442 210 1334 2718 -2827 1782 2689 -3826 1538 3697 -2668 -410 3469 590 -91 713 3185
448 3185 1054 121 3206 1689 2290 1464 -1112 4613 2758 -4850 3249 3930 -4168 549 652 -2931
464 -2931 -302 -1086 -2029 -1159 -2832 -3151 -1560 51 -3069 -7021 1081 882 -7047 -406 -1530 -6367
480 -6367 1397 -822 -6820 -1073 -2442 -1881 1987 -5799 -5321 2647 2298 -4758 -5522 2049 1138 -3269
496 -3269 1356 -1748 -4720 5462 757 -5218 1897 -571 -120 3700 -3710 -3014 4469 572 -2657
511b657K150K481j716l149N162j105k702M565m540P04P029p866j117Q464o556
526h53J03O794p083j678N963J402m915k843M887K158k928p86l057L280O063q598
542b091p13O260o752L360M684q977q8N767j495r47k466jL096K1o79m371K610O002
560C220p191J16O595o731R99O637o373M35K162k239M293j991l484L546J164j571
576d13r41J513J381m417K496M647o739J447M454n325K873J983m659K683J046k814
592g85K767m73k211J136J120J286l765n63L467j383J502j253m570O078K288o387
608a746K441o58j271O386l403n733M376L216j619k817n60K250jk4j410l118M918
625A227L80l949J932j424j10M819m662k965O165r20k632J328o55N73R13q49r74
$$ plain form
511 -2657 -507 1974 258 -2891 2271 1166 -1536 3029 -1511 -807 6222 -1644 -2761 5703 -853
526 -853 -750 6044 -1039 -2717 3246 4648 -267 -3110 1777 3935 1007 221 -2836 444 6507 -2091
542 -2091 -2804 3456 -3296 64 4748 -4229 -4317 1450 -45 -992 -3458 -3459 -363 -342 -1021 -5392 -2782 3220
560 3220 -3971 -3855 2740 -3991 -2992 3645 -2728 -2293 -131 -2370 1923 -68 -3552 -6 1158 -413
576 -413 -1354 159 1540 -2877 -381 4266 -2473 -1026 3428 -1897 976 2959 -1700 983 2029 -785
592 -785 1982 1509 -702 434 1554 2840 -925 -1488 1979 596 2098 845 -3725 2353 4641 -1746
608 -1746 695 37 -1234 5152 1749 -3984 392 3608 1989 -828 -1388 862 861 837 -573 -3691 1227
625 1227 1607 -2342 -410 -1834 -1944 2875 -1787 -4752 1413 493 -2139 -811 -1466 -893 20 -829 -1803
642a803J029K419k927j883M763j493k634M232l218n97M774l099j108K686j531
657c90J359J468l652M24L160j53k877N43K658j786J04J722l458Q00L887l437j023
674f51K783k958J617K319l838k81K877k04j695O96p28l8J973p80k889K083J787
691B073l497J703J81k805L339P12m532J128K775k039K17P3j182J010K003k124
707i65k078K975O30k148J243n31j137L382j223l614L591J141k558N76j39l17K681
724A509l57l655Q21L323o99k109Q85K95L21K077k604j462L745L80l107J117L91
741H71m99K838k254k640K883J927k507j072J573p84J145M76k908M17L502k120
757H48j516J635o42Q0J349k077j059K601J36k772L86R17o51Q95l1k578J217K140
$$ plain form
642 -1803 -774 1645 -1282 -3165 1598 105 -2529 1703 -1515 -2112 2662 -437 -1545 1141 -390
657 -390 969 2437 -1215 -791 2369 2216 -661 -118 2540 754 858 2580 -878 -78 3809 372 -651
674 -651 2132 -826 791 3110 -728 -1009 1868 1664 -31 665 -63 -101 1872 1092 -1797 286 2073
691 2073 -1424 279 460 -2345 994 1706 -2826 -1698 1077 -962 -745 -672 -1854 -844 1159 -965
707 -965 -3043 -68 562 -1586 -343 -874 -2011 1371 148 -3466 125 1266 -1292 -716 -855 -1172 1509
724 1509 1152 -2503 -1682 1641 942 -1167 -282 13 334 2411 -193 -1655 2090 2470 -637 480 871
741 871 372 3210 956 -1684 1199 3126 619 -453 1120 336 1481 1957 -951 -534 2968 848
757 848 -668 967 325 405 1754 -323 -1382 1219 1355 -1417 -1031 -114 -765 130 99 -2479 -1262 878
775H78k727J26J336j099L27J149j860l49K721j061j405J051L29m40J555j061j624
792b154K017Q32j881O76P34j900J376J330k881Q79K349j481n65J101o25Q00J479
809B086k546m04K637j28j723J344k55q68K181q03k549J789J793k071R6K20r07
826a08K009Q1l209J182K675j937j474J624l14j57J095j177j928L473J2k905R34
843a24j40l23J992j516k855L038J168k869j48J339m08J00N27j738m6K619j246
860f30j525J727l55p33K651k283j661L956n46k445J562Q37j219P16k70r90J812
877F04j48j333K94J708j366N9J900k143m98L353j461j936K306m86k01J336k114
894a26N52K214j683r13J136Q5j068R51O46j902n91L064j352j200R64j446K139
$$ plain form
775 878 -1849 -1723 -387 -1486 -1159 -10 -1870 -2219 502 -559 -1964 -913 -584 -1024 531 -530 -2154
792 -2154 -137 695 -1186 -510 224 -1676 -300 1030 -1851 -972 1377 -104 -669 432 -193 607 2086
809 2086 -460 -864 1773 1645 -78 1266 1011 143 2324 1521 -1028 761 2554 483 579 799 -108
826 -108 1901 1982 -1227 -45 2630 693 -781 843 529 372 1467 290 -1638 1835 1847 -1058 -124
843 -124 -264 -587 1405 -111 -2966 72 1240 -1629 -1777 -438 -846 -746 -219 -1957 -2003 616 -630
860 -630 -2155 -428 -783 -1516 1135 -1148 -2809 1147 601 -1844 -282 555 -664 52 -218 -1208 604
877 604 456 -877 -583 1125 -241 -182 1718 -425 -923 2430 969 -967 1339 853 652 1988 -126
894 -126 426 2640 957 44 1180 1265 197 1148 1794 -108 -699 2365 1013 -187 777 -669 1470
911A470R20l695R11K385k424K44J285j287j94J214M6j538o63J802l66m81j62j636
929b169K293R10m013J695K318k891R11O84j400J055l35q20J467j72n18R2K83N06
947a04j066J656j75k928L180J672m102J058J332j073J868j765j703K891Q07j630
963h2n74N29J006m9L97r51j264K954Q60l705K019N2j455L046j875k343L132j94
981A503j393Q25n83l26N54N33m94j344J875J52k509K545o96k265K876q43j461
998a051K815k352q23L234j699j270Q03K88k87m84R71n24j778K338q9j997K151
1015B46k244J85L925l408j400L477j203m29J262j572L95Q05J37k20j146O71N90
1032G1N97M18l000M74M451l028j726K938j892J050J359k424L58J337o79N77l57
$$ plain form
911 1470 2390 -1305 -394 1991 -433 -189 1096 -191 -385 829 875 -663 -1326 476 110 -371 -533 -2169
929 -2169 124 1034 -2979 -1284 1034 -1857 -946 -262 -1662 -607 -942 -1762 -295 -467 -985 -893 -610 -104
947 -104 -1170 486 311 -2617 563 2235 -1867 -809 523 -550 1318 -447 -2150 741 1548 -82
963 -82 -656 -127 879 830 1227 276 -988 1966 2826 -879 1140 1192 -263 2783 908 -1435 1697 1503
981 1503 110 935 352 26 580 1113 619 -725 1150 1302 -1207 1338 642 -1623 1253 410 -1051
998 -1051 1764 -588 -1411 1823 124 -1146 -343 -55 -342 -826 145 -379 -2157 181 92 -1905 246
1015 246 -1998 -1813 2112 -1296 -2696 781 -422 -851 411 -1161 -766 39 176 -44 -1190 -519 71
1032 71 668 1086 -1914 -1440 3011 -17 -1743 1195 -697 353 1712 -712 -354 983 304 881 524
1049E24o29O51N83N11j999L4K681k492k46J991k076J020Q49k677J871J221l116
1066a299J049J369r02k04r8N0J24K06r5j567J001J526k064R96k76j552K778l2
1084A010l214J599M81n98Q71q32j068J679L00p87p26Q21Q01j305J143l06j388
1101a519K143k24k036J860k38p00J986j602j042J994m3r94N13K55l21J26L86l84
1119A60m18J349q98o09J934j104q96K058j355n31J605q38n56O23p9j05L07l41
1137C06k77J92Q30j229m78J718p77o60J289j776L78J910j772j94N52k81J02P76
1155F09j197l20J178Rj122k79J366o42JJ39j439J302J108j427o14J327o49M04
1173b46L11j290M28J337m56j104P97N09n17O11k72q18R41Q08j918M12J235o33
$$ plain form
1049 524 -105 546 1129 1640 -359 -325 2356 -136 -382 1609 -467 553 1402 -1275 596 1817 -1299
1066 -1299 -250 1119 217 13 -85 -35 89 295 200 -1367 -366 1160 -904 92 -184 -1736 1042 1010
1084 1010 -2204 -605 -124 -722 149 -683 -1751 -72 228 -559 -1285 -464 337 -968 175 -131 -1519
1101 -1519 624 400 -1636 224 -14 -714 1272 -330 -1372 622 579 -415 98 353 32 158 544 160
1119 160 -258 1091 193 -416 1518 414 -482 1576 221 -310 1295 457 -99 524 445 340 647 306
1137 306 29 221 1051 -178 -656 1062 285 -375 914 -862 -484 1426 -346 -540 12 -269 -167 609
1155 609 -588 -908 270 279 -843 -1122 244 -398 -397 -258 -1697 -395 713 -714 -1328 -1 -650 -246
1173 -246 65 -1225 -797 540 84 -1020 -223 286 -231 380 108 -710 231 1039 -879 -467 768 135
1191A35K20k9o56P81O68j460J01J167j42l26N92p43l59J403q45j001J048L40q10
1210H4N21j32r18J158K10j678P47O45n22j53N97j254M79J120r57p16J191l02n08
1229c88P10p18k88J261o88j014J009K77j004P42j30r87R02O77j465r2J069m83
1247f10K00P48j607P11J153q80q56J392l77k57R11q15n30J478O4j318N51L33k85
1266FQ24o11j060J189R18j340k7J034n36N2L40o83MJ411j150o95J115L0k99K54
1286G76p78p20J892l38j604O55Q46p62LO1q52J148N17j407%J162q77L16J18p05
1306e49K46R43n77j252J088M80p24L0l01j63P97j93j032O92N53j024M04J44n39
1325i77Q22L83o39m65Q28J43l87N98l78k37Q18k64q73J135k35o69Q12j6q88P92
$$ plain form
1191 135 355 326 -330 451 1119 -341 -240 927 785 459 1051 308 -51 1352 507 -494 554 894 84
1210 84 605 473 -445 713 923 -755 -8 637 115 -38 559 -695 -216 904 -53 -769 422 120 -388
1229 -388 322 -396 -684 577 -111 -1125 -116 161 -843 -101 -231 -1218 -316 361 -1104 -1196 -127 -610
1247 -610 -410 338 -1269 -558 595 -285 -1141 251 -126 -383 528 -287 -817 661 725 -593 -42 291 6
1266 6 830 219 -841 348 1266 -74 -101 933 397 449 789 106 110 1521 371 -324 791 821 522 776
1286 776 -2 -722 1170 832 -772 -117 729 -33 -30 31 -821 327 844 -563 -563 599 -278 38 156 -549
1306 -549 -303 640 63 -1189 -101 379 -345 -315 -616 -779 18 -175 -1207 -515 38 -986 -582 -438 -977
1325 -977 -155 228 -411 -876 -48 95 -292 306 -72 -309 509 245 -628 507 272 -397 415 399 -489 303
1345C03L60o44L41J5l06M27k26l57J87R30n90p81J110j95m97P64l79o95J382n26
1365F23q61O99j94k24M63p85j33R65J38p52n99Q96J05n61L78r10P3J342p52q34
1385i23P69j91O3M57r82K4J296n22j056J96O93K59l70j89k53K18J075j138k74
1404h48J137j086N95M57r39L29J129q57q3N58m14M33k96J13k53K32K65j130M68
1423a90J071j296O55N68j205Q72P85j976Q67O77q42N36k84q0M26M66q47l69M44
1442B78P95j167K81P3j160J547K72j752P69L97q66Q94l04r05R37J14l85n11L23
1461c70N13n45O41m49r10J316J09j272J031m29n32J310q43r57J385j96n64O26
1479a36k73K35j32J21L0l85Q25j89n93J003m45p07J087o74l66J563r31o54J390
$$ plain form
1345 303 663 19 360 375 69 496 270 -87 100 1030 440 -341 769 574 77 841 462 -233 1149 623
1365 623 -238 461 267 43 506 -279 -412 553 691 -61 -660 236 341 -220 158 -752 -679 663 -89 -923
1385 -923 -154 -345 -282 175 -807 -783 513 -9 -1065 -869 -176 83 -287 -476 -729 -511 564 -574 -848
1404 -848 289 -797 -202 255 -684 -355 774 -83 -166 392 -22 411 115 228 -25 207 472 -658 -190
1423 -190 881 -415 240 808 -397 475 1260 -716 151 828 -14 522 238 158 584 1050 203 -166 278
1442 278 1073 -94 187 260 -900 647 919 -833 -64 333 -533 361 57 -848 89 203 -182 -693 -370
1461 -370 143 -402 239 -210 -1120 196 305 -967 64 -365 -897 413 -430 -1387 -2 -198 -762 -136
1479 -136 -409 -174 -306 -185 -155 -540 285 96 -497 506 61 -646 441 -233 -599 964 33 -621 769
1498G69k34j22k65l13K78K60K44p41m67J487j34p79M88p08K66J383j394l07J047
1517G58l65RJ28q16L32M63r0m46k50M83k83J8L04q53L10O52r53L7J089j270P38
1538eL94r35L37J25l55L25J24m83K27k41M53k73J14N45j387Q46O80j420M91M44
1558Fm80N68K27q88M55J85O1K19j55l4p7L66k8p34L09M70m86J74J35p39J043j54
1580D43q44Q13L5m34M41j42l58M39j7J09o09L50K89m13M26p20r0J008m50o02O89
1601C63j69l63N10n21l48P90m16k07j67P03k83m31M53j72j8O38q32k48J066o06
1621b58r2O24r06J42N51m57k08N38J25m78K05K7r7K26K81o08J41O72m45l8N79
1642E24o31O6P84q82r5O87k01j46Q8p6k60P07j35o50K10M18k37N6M24p31J92N10
$$ plain form
1498 769 535 413 148 -165 113 373 617 -124 -591 896 762 -17 471 -237 29 1412 18 -289 758
1517 758 393 402 530 -286 46 509 419 -27 -277 206 -77 -59 245 -608 -298 354 -599 -562 527 -743 -5
1538 -5 389 -546 -209 -84 -439 -114 10 -473 -246 -487 -34 -307 -193 352 -1035 -189 491 -929 -438 6
1558 6 -474 94 321 -567 -112 73 134 353 198 164 87 453 425 -309 0 470 -16 158 293 -446 597 443
1580 443 -401 412 447 13 454 312 -46 393 376 485 -124 226 515 102 528 -192 -282 726 276 -326 363
1601 363 194 -169 341 -180 -528 262 -154 -361 -528 175 -108 -539 -86 -258 -276 362 -470 -718 348 -258
1621 -258 -350 274 -632 -490 61 -396 -604 -66 59 -419 -214 -187 -284 -58 223 -385 -244 428 -17 -55 524
1642 524 -107 -41 743 -139 -234 453 252 106 194 118 -142 565 430 -220 -10 408 171 227 651 -80 112 622
1664F22p41M04M77m75k17P7k03J38J85k47K2M65l43j61l5J4m23N83j74n54K54
1685c32O20l88j41K62m29J82N03n75K9M69l82o8j8j71K36L08k09n84P65j27m01
1706d51K32l05K5N74K37r83O57L50l90l5K2L3L3M31m26r2L78l1k37M71l67j04
1728B2N76n92k80L77M81n40K18j04j27M53k35k20J04K48l01J15J2j93J40K98o36
1749a84L1O78m72j28K33j06j58L32l59r3K20j65l49L22j27j53N17o4o23J60O23
1770A35m61j18M65m74M81l16j43k45Q32l92K8J91J20k36K40O1n53M30J03m41K
1791b91L15l72L81K12m69K86N78o68k21L73J9q6L74l88K07k0J72l78J63J17m56
1812a52N70N4r32N08K66m28L39J76m57M05K58o02L13j02P5l27M74m87j98M43p8
$$ plain form
1664 622 -119 285 762 287 70 147 -56 82 267 20 42 507 164 3 -32 -18 -441 142 -32 -586 -332
1685 -332 288 -100 -241 21 -408 -226 277 -298 -269 200 -182 -250 -268 -439 -203 105 -104 -688 77 -50 -451
1706 -451 -219 -524 -499 75 312 -671 -14 336 -54 -89 -67 -34 -1 430 4 -88 290 259 22 493 126 22
1728 22 598 6 -274 103 584 44 262 158 31 484 249 29 133 381 80 195 207 14 154 452 -184
1749 -184 -153 525 53 -75 158 52 -106 226 -133 -226 -6 -171 -520 -198 -325 -478 39 -25 -648 -488 135
1770 135 -326 -444 21 -453 28 -288 -431 -676 156 -236 -208 -17 103 -133 107 168 -385 45 148 -293 -291
1791 -291 24 -348 33 245 -224 62 640 -28 -249 124 143 57 431 43 250 230 402 24 187 304 -152
1812 -152 418 472 -460 48 314 -114 225 401 -56 349 607 5 318 216 291 -36 438 -49 -247 196 118
1833A18j97L79j60n58L05l06L2L67j87n92Q25j80k17J02J60p8O0J99l80k33Q09
1854B68l30m82N09j68L47%l21k73P99l31l88M66L4k56K02k34J23j15N52k79r0
1875C3J90k57J03N62r49J13O66m51n1K25l10P0K34j82O2J02k4k5n4l8N5J71J17
1898C62m70J15N78q10K51Q5k39K69j46m86P86J0n03L1J65j6j63N3K20m35M86L1
1920A74p49L75J08m36R06l27m85M51j47j30K99m64K88J56J1k67q1L16L4j33J43
1941D2k41Q0N44l61n47O16J54n01M33l33q2L93l2J19j45k6J40j29J15K74n30J01
1963H4L06o45P85l62j36L34l89j4N26n91J66J52N7l07j24K49L7l37M20k73j87
1984b49O15k96k36K97k42R8K61q08L35m6K63J6m07L6L57k56K25n02Q9N63m61K28
$$ plain form
1833 118 -79 300 140 -418 -113 -419 -387 -20 -207 -799 26 -154 -371 -269 -109 -187 -127 72 -308 -541 268
1854 268 -62 -544 -35 -203 144 144 -177 -450 349 18 -370 96 130 -126 76 -158 -35 -150 402 123 33
1875 33 223 -34 69 631 -318 -205 461 10 -41 184 -126 -56 178 -4 58 160 136 111 57 19 74 245 362
1898 362 -108 7 585 -225 26 111 -128 141 -5 -491 295 305 -198 -167 -2 -18 -181 -128 92 -343 143 174
1920 174 -575 -200 -92 -528 378 51 -434 17 -130 -260 39 -425 -137 19 30 -237 -318 -2 32 -101 42
1941 42 -199 -119 425 64 -483 133 287 -214 219 -114 -196 197 165 284 139 113 253 124 239 513 -17 84
1963 84 390 -255 530 168 32 366 -23 -37 489 -102 64 216 273 -34 -158 91 128 -209 211 -62 -249
1984 -249 366 70 -166 131 -111 -13 248 -560 -225 -271 -8 8 -399 -363 -6 -262 -37 -539 -450 113 -348 -120
2006a20J53l64J97M37m11OK9P2L9j7k72N4K11K58j99k14K63j26J30J41m60L35
2028A42J37n09M98m2l36L07j9R1k09J00l24K02M7l1k2R2k8J05N5l27q2J98J53
2051A98l86J94r2k7K32j99j30P1M48k73j89R2l52L07K20l59j36M30k32MJ75L0
2073B6m59M25k15j53K84M2j19nJ71r0J35r3j69R4J65K21m34M46l90J66p9j32K26
2096F3J50k29j83M08j18Q0l6j50pK04j42r6M6L44l34J7L57k33l3K29l28j02L70
2119B77j40o6J79l50J52K55k98J64R1m71K65Q3r5l8J89J92l72k89L00m10K12R3
2141g7m05J45M55k76J72o3k96l1L71j60q1M65k29j43L5n5j77K94N7n6J31P1p3
2164G4k42Q9JN1J0k02L72J14j47k32J48J34P8m9j94J04J66l17k88Q02m54K09k0
$$ plain form
2006 -120 33 -331 -134 303 -108 -102 -73 -1 38 21 -251 -197 14 272 73 -141 122 -4 126 267 -193 142
2028 142 279 -230 268 226 -110 197 178 269 60 160 -164 38 85 54 32 124 96 201 256 -71 -153 45 198
2051 198 -188 6 -86 -113 119 -80 -210 -139 309 36 -153 -61 -413 -106 114 -245 -381 49 -183 -179 -4 26
2073 26 -433 -8 -223 -376 -92 -50 -169 -174 -3 -93 42 -51 -220 -126 39 260 -174 272 -118 48 -31 -163 63
2096 63 213 -16 -199 209 91 171 135 -15 -22 182 40 -56 -10 334 0 17 374 141 108 337 9 -93 277
2119 277 137 71 250 -100 52 307 9 173 264 -207 58 141 46 8 197 389 17 -272 28 -382 -170 -77
2141 -77 -482 -337 118 -158 14 -49 -345 -376 -5 -165 -246 219 -10 -153 -118 -173 -350 -56 1 -55 76 147 74
2164 74 -168 -79 -78 -27 -17 -219 153 267 120 -112 36 170 248 199 5 109 275 -42 -330 472 18 227 207
2187B07j8p4k3JK6J52m5l01M01p8m22j68M44j2l22O14l27R5q9R3j87J15K1j81
2211g8j4M24m02J75j23M2Kr5ML0J41k92M7K81j26k97K81j81R9PM1j24J25J4k70
2236b89L68L5j35L68k43k58J66J38m96L29L01k83j40K09n4j45N03k58k77M65k37
2257F7k66K46J48k19L20j83j60K74j22k82L34K85n58K13Q5j63L5Q5j5k78O8K82
2279A96k04Rj50P0K14j17l16L50j77l19O27j99k14O8K63R9k18j93J43j75J62j43
2301b24%J10m8K14L5j86J4L2q3J20Q8L10m98J93rqK50m39J18J25L8q4k73L17k71
2326a59J86j06J37J8J41q7j46o9K39k03L37p0k54M41k63j20K13j4o8M1n9J36o3
2349B08L04n58O2J87m28O8M38m24O5L37l02P0J06k21n1j51J91o4j5K70Kj45R8
$$ plain form
2187 207 189 115 92 93 119 271 226 -75 326 248 -174 -342 102 90 -232 382 55 150 61 154 -33 82 103 -78
2211 -78 -92 332 -70 105 -18 24 26 -69 -65 -35 106 -186 -139 142 16 -281 0 -181 -82 -75 -34 -158 -33 -19 -289
2236 -289 79 114 -21 347 104 -154 12 150 -346 -17 284 1 -139 70 16 -129 374 116 -161 304 67
2257 67 -199 47 195 -24 296 113 -47 227 105 -177 157 442 -116 97 182 19 54 139 124 -154 -86 196
2279 196 -8 1 -149 -79 135 18 -298 52 -125 -444 183 -16 -230 -162 101 200 -18 -211 -68 -243 -81 -224
2301 -224 -224 -114 -162 52 87 -99 -85 -53 -136 -16 72 382 -116 77 68 60 310 -129 -11 114 152 68 -205 112 -159
2326 -159 27 -79 58 76 217 130 -16 -85 154 -49 288 218 -36 405 142 22 235 221 153 194 135 271 208
2349 208 512 -46 16 203 -225 -157 281 -143 -78 259 -43 27 133 -88 -139 -290 -99 -163 -178 92 94 -51 47
2372D7l48K58K24o57N83j60p9O9M7QN5j00j20J17m8J15L2n6j20k3K42k36j24K33
2396d1K47m14j9K67k2K34m08J19J63k8r1P3n1J85L5l6j74j88L98J93m42J54L9
2419A93j72r5M6j30K16j0j51K47j89J72k11l8J71j19K26J91m25L00l40k35N21
2440A68j98k00L04k47RJ21k71L74k27k6O8J63j4k17j19L64K1k08K70k61p0M21
2462B25j88j22J91j67J91L0l23K62oL5j71r0K17j45L63j58qk91N75l51n6L35k26
2485A22j7K48m07K96K20l75K06j88j46K30j83K47j46n00O65j66Q1L6M7j67K5k31
2507a03P9K4J56r9q2P9j55J74k52K30K7k67J7J15k0o7J02K28l23K91l05M6l7p2
2531b14k5K16k01J13p8M0J04q1K56j34L5L83l29k49J81L3o4K29j85k2j08J02j13
$$ plain form
2372 47 -301 -43 181 -476 107 -53 -132 -63 -16 -8 47 -53 -173 -56 -104 11 43 -13 -133 -156 86 -150 -274 -41
2396 -41 206 -208 -227 40 18 252 -156 -37 126 98 7 80 29 214 249 213 39 -149 249 442 0 154 193
2419 193 21 -74 -28 -158 58 48 -103 144 -45 127 -84 -122 49 -70 156 347 -78 222 -118 -353 168
2440 168 -30 -230 74 -173 -164 -43 -314 60 -167 -193 -125 38 24 -193 -312 52 73 -135 135 -126 -196 225
2462 225 37 -85 106 -61 130 160 -163 99 93 128 -43 -133 84 -61 302 144 136 -155 420 69 13 348 122
2485 122 105 353 -54 242 462 87 293 105 -41 189 6 253 107 -393 272 106 187 223 270 103 128 -103
2507 -103 -24 0 156 57 -25 54 -101 73 -179 51 78 -189 -172 -57 -77 -144 -42 186 -137 154 -151 -105 -142 -214
2531 -214 -239 -23 -224 -111 -189 -149 -45 -126 130 -4 31 414 85 -164 17 50 -14 215 30 8 -100 2 -111
2554a11J90l17j2J90R5j02m5K45k37K02k37L13j41K60k99j53M73m22P1L92l19
2575C6J21Q4j11kj78j69J72J80KM7j18j60j11Q1J08K0K0J55q7j22L1j24r2K72
2599E5j54L1J87j84j1l17K70J83k47o8J39j63K35o1J16J24k06K05l36l5NM28l35
2622a39p7N6M44m04J01m0Q6J8J72j51m1N9j87K49j85J91o7p6p3K89o5j47R0O5
2646A68J5j44r1L25o9k83J44k17Q3l9J66mJ25j45m6j27m5L82n7m38M16j84Q8j28
2670a05K4pj62J74N9j23K25j45j74K64J15k10J43j90J4K28m16R5M06l20MJ53q
2693D4k74K0O30l32k40L09j8q5o9P1j80r8K84o7N8j42Q5RJ1l5J7K52k69J43K04
2718C28Rk43K12l08J70r5kn6K18k02K69m13j8K26J77l72K97m61K05P2K56m48M4
$$ plain form
2554 -111 79 -238 -250 -60 35 -67 -112 133 -104 98 -139 174 33 293 -6 -159 314 -108 -37 355 36
2575 36 157 241 130 128 -50 -219 -47 133 135 182 64 -96 -207 -126 -18 2 22 177 90 -32 -1 -125 -217 55
2599 55 -99 -68 119 -65 -76 -393 -123 60 -187 -255 -116 -279 -44 -105 11 135 -71 134 -202 -237 -232 196 -139
2622 -139 -216 -160 284 -120 -19 -59 27 45 217 66 25 84 -103 146 -39 152 85 9 -64 225 160 13 103 168
2646 168 183 39 -52 273 204 -79 65 -152 -69 -108 58 54 179 34 -12 -139 -184 198 141 -297 119 -65 23 -105
2670 -105 -81 -88 -250 -76 -17 -140 85 -60 -234 30 145 -65 78 -112 -98 130 -286 -191 215 -105 -101 52 44
2693 44 -230 -210 420 88 -152 157 139 54 -15 56 -124 -222 62 -5 53 -89 -4 5 16 -19 -2 250 -19 124 328
2718 328 337 94 306 -2 168 73 71 15 233 31 300 -113 -131 95 272 -100 197 -264 -59 13 269 -179 -135
2741a35L33j78P8j02R0j9M7j50Q2k22L7j02k0M77l04j61J63q0K08q7K25k34r5
2764a49l0j30M14k03K69o1r1l4k50L31k97K20J61k33M8K90O9m46J64J86nN7l49
2787f9N6J30m8n3J86l2j78j18K59k70P1K06m9q4J20Q0q7q0J02j44j15K9m6J20
2811a4q7K8k0K4P7j14j54J08j13L37p0k75J56J30LK8k16J51L50m52Q1j57R7P3
2835b9J13Nk01j13J36Q2j42J08j06K97r0k24n2K01PL87j74k89M0K32m64M67k24
2858c3%j4K92M3n11M72j63m7j11K20m1r6J22j3Qj13k0P9M6N3k3k26K6K36j59J08
2884A35l00K02j47n4K06Q6j42J75k86j14J12K39j63j16O3j30M17l94J78l50K27
2905a56J48MK10n07N4J33R4j15L83k51q7K78k69K16n8O9n0l21L44LJ57k85K2m8
$$ plain form
2741 -135 198 20 98 -4 86 67 114 -36 46 -176 -139 -241 -261 216 -88 -249 -86 -166 42 -45 180 -54 -149
2764 -149 -179 -309 105 -98 171 110 19 -15 -265 66 -231 -11 150 -83 -35 255 324 -122 42 228 223 280 -69
2787 -69 -13 117 69 16 202 170 -8 -126 133 -137 -66 140 91 7 127 207 120 40 142 -2 -117 -88 -134 -14
2811 -14 -101 -73 -93 -69 8 -106 -260 -152 -265 72 2 -273 -117 13 16 44 -172 -21 329 -123 -42 -199 -102 -29
2835 -29 84 89 -112 -225 -89 -7 -149 -41 -147 150 60 -164 -216 -15 -8 379 205 -84 -44 188 -276 191 -33
2858 -33 -33 -47 245 288 -223 249 86 39 -72 148 107 11 133 120 128 15 -5 74 120 173 150 -76 -50 186 27 135
2884 135 -165 37 -110 -164 42 128 -14 161 -125 -239 -127 112 -51 -167 -104 -234 183 -211 -33 -383 -156
2905 -156 -8 -4 206 -301 -247 -114 -20 -135 248 -3 -90 188 -81 135 77 146 96 -225 119 122 279 -6 16 -32
2929c2K67k56j68K47M0qJ05j68j53L39j79K78k61k1OR9l7j0o9J82j15l81L16Q1
2953A02j58K47k47k0K84k99k34L17R2l8p1n0Q9pJ16Jj86J01R6l10J10q3R9L0j51
2978a70J34p9j39K51j0j36j58J92j36K04J92n5k44n7R4k41L57n1p0J17R1k35Q4
3001f5J87m5J31j75l03L49N5j03M13m57O6K8oj59j1J14O1P4l15N25l43n7J4J39
3025A17j37q5K17K9j73J19J5K6l10P8m9J64N0J27k57K02n2N6k70M3j33J94l9N7
3049a1J18k06L43n00Q3j0J14N6ll1K52k67N4j11k48J61K08j24K92j15k81K80k55
3072b01K12k12K63j55j37J04j77J51K54j85L61m27J22K46l57K21M3m1j43R9J24
3093A65k00K0K19j57l9J71n5n5M9j48K5J59j28p1K59k66m7K01o0J95k52k03Q1
$$ plain form
2929 -32 235 -21 -189 58 98 90 195 27 -126 213 34 312 51 30 36 135 98 88 19 201 86 -295 21 102
2953 102 -56 191 -56 -76 208 -91 -325 -8 84 46 -25 -75 14 7 123 124 -62 39 135 -175 -65 -148 -49 -19 -170
2978 -170 -36 -115 -254 -3 -13 -149 -307 -115 -251 -47 145 90 -154 -211 -117 -358 -1 -52 -122 -5 86 -149 -65
3001 -65 122 77 208 33 -270 79 134 31 444 -13 53 81 75 -84 -95 19 80 154 -161 364 21 -36 -22 117
3025 117 -20 -105 112 141 -32 87 102 128 -182 -104 -153 11 61 188 -69 133 81 137 -133 -90 -223 -29 -68 -11
3049 -11 107 -99 244 -256 -173 -183 -69 -13 -16 -47 205 -62 -8 -119 -367 -206 2 -122 170 55 -226 54 -201
3072 -201 11 -201 62 -93 -230 -126 -303 -152 102 -83 278 -149 -27 219 -138 83 126 85 -58 41 165
3093 165 -35 -15 204 47 8 179 124 69 118 -30 -5 154 26 -45 214 -52 -99 102 42 237 -15 -218 -137
3116a37P3K06m6o2j25m5n6J39Lk24J66k22K64J7r7L43j83j84L08l31N9J30j27
3139a31N0J78r5J44k85O7M6m24M81k21L6J42k88L52L1l2Pj10j49J44J48k3k35
3162a67J09J2J34k71L89O1l37J91J19K5k80J73j76L5j44K64k85L56j6M2k14P1
3184I1k59K62J09j77J06l07K48l7k21J47J62K6k55L93n92L04Kk07L4J17J22k93
3206b25J89p5N5j48K84k84Q6M4l4pK93N4j62k33J45o9L3K9K15m1q9k67K91k16
3230a32J00j40K93l9J42l63K72m1k19J45N2J8NM1J95k50n2Mj88J32J27K27k79
3253E0p3J72n6j96Q1M9K4J42l18k4K49l8k11o5K18J59j11o4pR9l32K66J01k92
3277a77Q6nn7J58k84M7P1N05k96n8k92K08J66k45K42J7k13j38K24q6l5j24J64
$$ plain form
3116 -137 -64 142 96 34 -91 -136 -192 -53 -50 -274 -108 -330 -66 -49 -146 197 14 -170 138 -193 -134 -4 -131
3139 -131 -81 97 2 146 -139 -72 -26 -450 31 -190 -154 -12 -300 52 83 51 58 -52 -201 -57 91 68 -167
3162 -167 -58 -46 88 -183 206 267 -70 121 240 265 -15 158 -18 17 -127 137 -148 208 192 234 20 91
3184 91 -168 94 203 26 132 -175 73 36 -185 -38 124 150 -105 288 -304 0 2 -205 -171 -54 68 -225
3206 -225 -36 -111 -56 -204 80 -204 -118 -74 -108 -115 178 232 70 -163 -18 -87 -54 -25 190 149 60 -207 84 -132
3230 -132 -32 -172 121 82 224 -139 133 92 -127 18 70 88 93 134 329 79 27 31 -157 -25 102 329 50
3253 50 -23 149 93 -103 -22 27 51 193 -125 -149 100 62 -149 -214 4 163 52 -12 -19 80 -252 14 115 -177
3277 -177 -91 -96 -153 5 -279 -232 -161 344 48 -10 -302 -94 72 -173 69 86 -127 -265 -41 -127 -162 -286 -122
3300a22J43oj24j7j2K8J17j30JJ00j63J26r4J3K64M3j71p8l5Q2p5L28Lk7j88J43
3326A49n3J0q2L9Lq0J54Kq3j82J02k41K60k6K3N2k36K61Kj18j53J56O9m3j32M5
3352a02K67j94J78l75O9J20J94k06p7R1N5ol6m7l8j6o3L26j31J26kP5k40M0M9
3377E7j71P6L6kP2Q8j5k0j89j4J12J35j78K5k58M04q4l05K96J0K06k09l69K84
3401a3K62l38O8R3k80M04k3j48j62J63K7J62R8n91K23j86J57J59J40m15K17l33
3423c16M87j96L7p9j35K60k35l7l9J96j3K38m1k57K18k58j05L00j23J25j99J39
3445c3j76J52j4pk6K14j43KJ48pk35R5J60J97l45J97Jp3j28j15n7K83j66L14k92
3470e4r4k6L2M04k40K17m90L16N6pl38L92j29P2k4Q0j66j5q9J18j42L35l31J99
$$ plain form
3300 -122 21 15 -109 -126 -138 -110 7 -123 -122 -22 -185 -59 -153 -140 124 167 -4 -82 -117 -35 -110 218 221 194 6 149
3326 149 96 106 24 63 66 -14 140 142 59 -123 -21 -262 -2 -28 -5 47 -189 72 74 -44 -197 -41 28 -15 -147 -102
3352 -102 165 -29 149 -226 -157 -37 157 -49 -126 -35 20 14 -22 -69 -107 -123 -186 140 9 135 133 208 -32 8 57
3377 57 -114 -38 -2 -4 68 156 141 121 -68 -82 30 165 -13 12 -246 158 74 -231 65 75 281 72 -297 -13
3401 -13 249 -89 -21 72 -208 196 173 25 -137 26 53 215 313 -278 -55 -241 -84 75 215 -200 17 -316
3423 -316 171 -25 12 -67 -202 58 -177 -214 -253 -57 -70 168 127 -130 88 -170 -275 25 -98 27 -172 -33
3445 -33 -209 -57 -71 -78 -104 110 -33 -31 117 110 -125 -30 130 327 -18 179 180 107 -21 -136 -193 90 -76 238 -54
3470 -54 -148 -174 -142 262 22 239 -251 65 121 114 -224 168 39 111 87 167 1 -14 -103 15 -127 208 -123 76
3494G6J9o1R3j99l5J08p4L3O9j90l7J89k0l0M8J80k19j71J15mJ60l19L27k45K49
3519F2o2N3J23k54r9j3J18n7L30k77J89j81J92Q3k50j05J25r8J51j7m4NJ51l7
3543H8J09k72q6J13j19L51j34j67O1jJ14j36J15L%k87J19K95k05J18L6j27K05
3566A93l22K60r2q1L0j14j02J93N1j13r3M78k66m2J21m9m58K16j71K40M84m61
3588i8K34j82p1j12J9K27o5K75m11J0r2L38n1J10j78J49j59J58j00j25J32j8p5
3611h5L5K33L6l51M3K48k64J23N0J57l49K71p1KJ81k20j6k28M3M26k75p7J01k1
3635hj80K12k92L57J00k72J90k20J45L7M4rO0n05M90J76k91o8J13j01m6J59k21
3658a30l4J46k9k5J36k53K31j8j76P4k2j37j74N01l03L29j65P7k70M34l04K09
$$ plain form
3494 76 95 34 127 -72 -107 1 -73 -40 29 -161 -198 -9 -29 -59 -11 169 -50 -221 -106 -110 50 -269 58 -187 62
3519 62 0 53 176 -78 -177 -190 -72 -129 201 -76 113 -68 124 207 -43 -148 -23 -121 30 13 -31 -26 125 88
3543 88 197 -75 -161 -48 -167 184 50 -117 -56 -57 57 -79 36 39 39 -248 -129 166 -39 79 115 -12 193
3566 193 -129 131 39 -42 -12 -126 -228 -35 16 -97 -190 288 22 -20 101 52 -406 -190 -361 -121 363 -98
3588 -98 136 -46 -117 -229 -210 17 -48 227 -184 -174 -266 72 21 131 -47 102 -57 101 1 -124 8 -10 -85
3611 -85 -50 183 219 -132 -89 159 -105 18 68 225 -124 147 76 78 259 39 23 -205 -162 264 -11 -88 13 -8
3635 -8 -188 24 -268 89 189 -83 107 -113 32 69 113 104 164 -341 149 325 34 -34 79 -22 -68 91 -130
3658 -130 -164 -18 -47 -72 64 -189 42 24 -152 -78 -100 -237 -411 90 -213 116 -49 28 -242 192 -112 97
3680I7p6Nr4K87k22m4K6L95l51p9J58q9J01j32J62j04O9l7j55r5J12j9M93n02
3704i4K43r6J86k18j07L00j46n9L87k63Lj67m9p5K11O1j66q8j35K14Q1Oj64o1
3728a96L30q7j48J76k07R6K51l79o2L10Q4n57O76l37n6J78k72J37J45QLl12J2
3751b07N9J06q6p1K10mr8J1J82k25K74j46J6l9L16k80jp8Q9M0j2J32l21J27J15
3776A09l6j50M61j71q3j52m8J55m0J98m17N4L9k34K50j8o9J96k1k02K70J20l56
3799a45K01q9n0J8J07j01lL7O6k18n7J16PJ36L9r9k2K24m28L94l80J34O1l7N8
$$ plain form
3680 97 21 26 -68 219 -3 -47 -21 374 23 -56 102 13 114 -18 144 40 109 72 -83 -178 -66 -85 408 -94
3704 -94 149 53 239 21 -86 214 68 9 396 133 136 -31 -80 -155 56 117 -49 -137 -272 -58 23 29 -135 -196
3728 -196 134 47 -101 75 -132 -36 215 -164 -226 84 168 -389 287 -50 -106 72 -200 -63 82 90 93 -219 -207
3751 -207 -148 -42 -128 -199 11 7 -91 -80 102 -123 151 5 21 -18 298 18 17 -61 28 68 56 188 -133 -6 109
3776 109 73 -77 384 213 130 -22 -70 85 45 243 -174 -120 -81 -315 -65 -83 -152 44 23 -179 91 211 -145
3799 -145 56 -33 -83 -65 42 -59 -62 -25 41 -177 -234 -118 -111 25 64 -35 -57 167 -261 133 -247 -113 -52 -89 -31
$$ [...]
8191h5
##END NTUPLES=NMR FID
##END=
