##TITLE=1H_Ser 5-3-k-2
 CDCl3
 24 sc, 
 18.08.2022
##JCAMPDX= 6.0         $$ Bruker NMR JCAMP-DX V2.0
##DATA TYPE= NMR FID
##DATA CLASS= NTUPLES
##ORIGIN= UXNMR, Bruker Analytische Messtechnik GmbH
##OWNER= root
$$ XWIN-NMR		Version 3.5
$$ Thu Aug 18 10:16:18 2022 Russian Standard Time (UT+4h)  she@DPX200
##.OBSERVE FREQUENCY= 200.1313499994
##.OBSERVE NUCLEUS= ^1H
##.DELAY= (6, 6)
##.ACQUISITION MODE= SIMULTANEOUS
##.ACQUISITION SCHEME= undefined
##.AVERAGES= 24
##.DIGITISER RES= 18
##SPECTROMETER/DATA SYSTEM= spect
##.PULSE SEQUENCE= zg30
##.SOLVENT NAME= CDCl3
##.SHIFT REFERENCE= (INTERNAL, CDCl3, 0, 15.7039)
##AUDIT TRAIL= $$ (NUMBER, WHEN, WHO, WHERE, WHAT)
$$ ##TITLE= Audit trail, XWIN-NMR		Version 3.5
$$ ##JCAMPDX= 5.01
$$ ##ORIGIN= Bruker BioSpin GmbH
$$ ##OWNER= she
$$ F:/spectra/data/she/nmr/H-F/1/audita.txt
$$ ##AUDIT TRAIL=  $$ (NUMBER, WHEN, WHO, WHERE, WHAT)
(   1,<2022-08-18 10:15:25.93 +0400>,<she>,<DPX200>,
      <continue with go, POWCHK disabled, PULCHK disabled
       configuration hash MD5:
       00 E9 B6 7A A2 85 ED C7 34 08 36 98 17 FE 4E 26
       data hash MD5: 16K
       47 EE 0C 30 E3 6D 8A 1E 1B E7 8E 0A B3 B2 63 7A>)
$$ ##END=
$$ 
$$ hash MD5
$$ 0F 1B 4E 95 CF 55 45 28 BE E3 0B DC 2B 9C EE 22
##$RELAX= 
##$RELAX= 
##$RELAX= 
##$RELAX= 
##$RELAX= 
##$RELAX= 
$$ Bruker specific parameters
$$ --------------------------
##$DU= <F:/spectra>
##$EXPNO= 1
##$NAME= <H-F>
##$PROCNO= 1
##$TYPE= <nmr>
##$USER= <she>
##$AMP= (0..31)
100 100 100 100 100 100 100 100 100 100 100 100 100 100 100 100 100 100 
100 100 100 100 100 100 100 100 100 100 100 100 100 100 
##$AQSEQ= 0
##$AQ_mod= 1
##$AUNM= <au_zg>
##$AUTOPOS= <>
##$BF1= 200.13
##$BF2= 200.13
##$BF3= 200.13
##$BF4= 200.13
##$BF5= 200.13
##$BF6= 200.13
##$BF7= 200.13
##$BF8= 200.13
##$BYTORDA= 1
##$CFDGTYP= 0
##$CFRGTYP= 5
##$CHEMSTR= <none>
##$CNST= (0..31)
1 1 145 1 1 1 1 1 1 1 1 1 1 1 1 1 1 1 1 1 1 1 1 1 1 1 1 1 1 1 1 1 
##$CPDPRG= <>
##$CPDPRG1= <>
##$CPDPRG2= <>
##$CPDPRG3= <>
##$CPDPRG4= <mlev>
##$CPDPRG5= <mlev>
##$CPDPRG6= <mlev>
##$CPDPRG7= <mlev>
##$CPDPRG8= <mlev>
##$CPDPRGB= <>
##$CPDPRGT= <>
##$D= (0..31)
0 1.2 0 0 0 0 0 0 0 0.06 0 0.03 0 0 0 0 0.0002 0 0 0 0 0 0 0 0 0 0 0 0 
0 0 0 
##$DATE= 1660803201
##$DBL= (0..7)
120 120 120 120 120 120 120 120 
##$DBP= (0..7)
150 150 150 150 150 150 150 150 
##$DBP07= 0
##$DBPNAM0= <>
##$DBPNAM1= <>
##$DBPNAM2= <>
##$DBPNAM3= <>
##$DBPNAM4= <>
##$DBPNAM5= <>
##$DBPNAM6= <>
##$DBPNAM7= <>
##$DBPOAL= (0..7)
0.5 0.5 0.5 0.5 0.5 0.5 0.5 0.5 
##$DBPOFFS= (0..7)
0 0 0 0 0 0 0 0 
##$DE= 6
##$DECBNUC= <off>
##$DECIM= 32
##$DECNUC= <off>
##$DECSTAT= 4
##$DIGMOD= 1
##$DIGTYP= 9
##$DL= (0..7)
0 120 120 120 120 120 120 120 
##$DP= (0..7)
150 150 150 150 150 150 150 150 
##$DP07= 0
##$DPNAME0= <>
##$DPNAME1= <>
##$DPNAME2= <>
##$DPNAME3= <>
##$DPNAME4= <>
##$DPNAME5= <>
##$DPNAME6= <>
##$DPNAME7= <>
##$DPOAL= (0..7)
0.5 0.5 0.5 0.5 0.5 0.5 0.5 0.5 
##$DPOFFS= (0..7)
0 0 0 0 0 0 0 0 
##$DQDMODE= 0
##$DR= 18
##$DS= 0
$$ [...]
##$SUBNAM2= <"">
##$SUBNAM3= <"">
##$SUBNAM4= <"">
##$SUBNAM5= <"">
##$SUBNAM6= <"">
##$SUBNAM7= <"">
##$SUBNAM8= <"">
##$SUBNAM9= <"">
##$SW= 18.0517283424941
##$SWIBOX= (0..15)
0 0 2 0 0 0 0 0 0 0 0 0 0 0 0 0 
##$SW_h= 3612.71676300578
##$TD= 16384
##$TD0= 1
##$TE= 0
##$TE2= 300
##$TE3= 300
##$TEG= 300
##$TL= (0..7)
0 120 120 120 120 120 120 120 
##$TP= (0..7)
150 150 150 150 150 150 150 150 
##$TP07= 0
##$TPNAME0= <>
##$TPNAME1= <>
##$TPNAME2= <>
##$TPNAME3= <>
##$TPNAME4= <>
##$TPNAME5= <>
##$TPNAME6= <>
##$TPNAME7= <>
##$TPOAL= (0..7)
0.5 0.5 0.5 0.5 0.5 0.5 0.5 0.5 
##$TPOFFS= (0..7)
0 0 0 0 0 0 0 0 
##$TUNHIN= 0
##$TUNHOUT= 0
##$TUNXOUT= 0
##$USERA1= <user>
##$USERA2= <user>
##$USERA3= <user>
##$USERA4= <user>
##$USERA5= <user>
##$V9= 5
##$VALIST= <valist>
##$VCLIST= <CCCCCCCCCCCCCCC>
##$VD= 0
##$VDLIST= <DDDDDDDDDDDDDDD>
##$VPLIST= <PPPPPPPPPPPPPPP>
##$VTLIST= <TTTTTTTTTTTTTTT>
##$WBST= 1024
##$WBSW= 4
##$XGAIN= (0..3)
0 0 0 0 
##$XL= 0
##$YL= 0
##$YMAX_a= 160141
##$YMIN_a= -300656
##$ZGOPTNS= <>
##$ZL1= 120
##$ZL2= 120
##$ZL3= 120
##$ZL4= 120
##$ABSF1= 10
##$ABSF2= 0
##$ABSG= 5
##$ABSL= 3
##$ALPHA= 0
##$AQORDER= 0
##$ASSFAC= 0
##$ASSFACI= 0
##$ASSFACX= 0
##$ASSWID= 0
##$AUNMP= <proc_1d>
##$AZFE= 0.1
##$AZFW= 0.1
##$BCFW= 1
##$BC_mod= 2
##$BYTORDP= 1
##$COROFFS= 0
##$CY= 11.3945322036743
##$DATMOD= 1
##$DC= 2
##$DFILT= <>
##$DTYPP= 0
##$F1P= 2.36226072786647
##$F2P= -0.459571619588291
##$FCOR= 0.5
##$FTSIZE= 0
##$FT_mod= 4
##$GAMMA= 1
##$GB= 0.15
##$INTBC= 1
##$INTSCL= 1
##$ISEN= 128
##$LB= 0.24
##$LEV0= 0
##$LPBIN= 0
##$MAXI= 10000
##$MC2= 0
##$MEAN= 0
##$ME_mod= 0
##$MI= 1.114404
##$NCOEF= 0
##$NC_proc= 0
##$NLEV= 6
##$NOISF1= 3.799351
##$NOISF2= 2.8
##$NSP= 1
##$NTH_PI= 0
##$NZP= 0
##$OFFSET= 15.70392
##$PC= 1
##$PHC0= -18043.84
##$PHC1= 19.40068
##$PH_mod= 1
##$PKNL= yes
##$PPARMOD= 0
##$PSCAL= 0
##$PSIGN= 0
##$REVERSE= no
##$SF= 200.130013532006
##$SI= 16384
##$SIGF1= 3
##$SIGF2= 2
##$SINO= 400
##$SIOLD= 16384
##$SREGLST= <1H.CDCl3>
##$SSB= 0
##$STSI= 0
##$STSR= 0
##$SW_p= 3612.71676300578
##$SYMM= 0
##$S_DEV= 0
##$TDeff= 0
##$TDoff= 0
##$TI= <>
##$TILT= no
##$TM1= 0
##$TM2= 0
##$TOPLEV= 0
##$USERP1= <user>
##$USERP2= <user>
##$USERP3= <user>
##$USERP4= <user>
##$USERP5= <user>
##$WDW= 1
##$XDIM= 8192
##$YMAX_p= 0
##$YMIN_p= 0
$$ End of Bruker specific parameters
$$ ---------------------------------
##NTUPLES= NMR FID
##VAR_NAME=  TIME,          FID/REAL,        FID/IMAG
##SYMBOL=    X,             R,               I
##VAR_TYPE=  INDEPENDENT,   DEPENDENT,       DEPENDENT
##VAR_FORM=  AFFN,          ASDF,            ASDF
##VAR_DIM=   8192,          8192,            8192
##UNITS=     SECONDS,       ARBITRARY UNITS, ARBITRARY UNITS
##FACTOR=    0.0002768,     1,               1
##FIRST=     0,             0,               0
##LAST=      2.2672688,     0,               0
##MIN=       0,             -300656,         0
##MAX=       2.2672688,     160141,          0
$$ Real data points
##PAGE= N=1
##DATA TABLE= (X++(R..R)), XYDATA
$$ [...]
$$ plain form
2302 156 -364 299 278 546 362 -598 -900 -497 -341 791 769 -868 -867 -1233 -798 225 -148 -567 -708 -865
2322 -865 79 707 1325 1108 72 125 1018 979 1713 928 62 161 97 657 743 349 168 -1051 -1177 -709 -793
2343 -793 -98 -930 -1749 -1193 -612 -553 413 -15 -1295 -713 -316 574 472 603 208 -310 28 775 1280 1368
2363 1368 481 -639 -33 606 602 425 -635 -969 -1092 -201 764 195 -406 -1060 -1604 -856 -10 -355 -240 -606
2383 -606 -1045 -302 -522 485 1133 194 95 -11 730 1592 929 573 163 -158 809 799 1059 683 -359 -282
2403 -282 -390 -485 363 -413 -1002 -977 -671 -132 345 64 -316 -1153 -593 317 -284 409 -102 -238 5 621 674
2424 674 1264 1182 361 331 309 976 582 207 250 -695 -637 330 68 698 -176 -781 -366 -477 257 -152 -706 -1233
2446 -1233 -795 -464 858 892 -286 48 -219 675 594 709 860 -177 -164 386 459 1513 1493 326 484 -85
$$ packed form
2302A56n20O63k1K68j84r60l02M03J56J132k2j637Jl66M35J023l73m19j41j57
2322h65R44O28O18k17j036N3Q93l9P34p85q66R9o4N60Q6l94j81j219j26M68q4
2343g93O95q32q19N56N81N9R66m28j280N82L97Q90j02J31l95n18L38P47N05Q8
2363A368q87j120O06O39mj77j060l34j23Q91R65n69o01o54n44P48Q46l45J15l66
2383f06m39P43k20J007O48r39r9j06P41Q62o63l56m10l21R67j0K60l76j042P7
2403b82j08r5Q48p76n89K5L06N39M77k81l80q37N60R10o01O93n11j36K43O16N3
2424F74N90q2q21l0k2O67l94l75M3r45N8R67k62O30q74o05M15j11P34m09n54n27
2446a233M38L31J322L4j178L34k67Q94q1J15J51j037J3N50P3J054k0j167J58n69
$$ plain form
2466 -85 148 244 255 -200 -1152 -1080 -533 -142 -324 204 -1198 -1677 -236 -192 17 189 -484 -1013 -54 749 144
2487 144 351 339 54 241 877 716 629 621 -215 -132 721 580 640 -711 -667 -631 -980 182 -437 -1404 -296 -965
2509 -965 -1471 -240 443 215 -553 -424 -365 251 1174 714 -752 -349 671 120 1298 1132 52 148 392
2528 392 317 516 732 -343 -1365 -1205 345 -400 -664 -183 -1639 -870 206 -416 -252 -703 -889 -823 -625
2547 -625 539 -213 413 840 381 75 1626 802 630 723 122 -260 232 1018 501 -248 584 -199 -1115 770
2567 770 762 -1006 -601 -1235 -1371 -38 566 -47 -753 -781 -134 61 1067 684 -1035 -452 560 102 789
2586 789 946 -159 -310 564 1255 563 761 666 -788 -312 631 -115 -504 305 -585 -116 521 -329 -643 -231
2606 -231 153 -1012 -853 -225 -614 -211 897 -192 -598 500 677 476 1490 261 -627 -342 1433 510
$$ packed form
2466h5K33R6J1m55r52P2N47L91j82N28j402m79J441M4K09J72o73n29R59Q03o05
2487A44K07j2k85J87O36j61q7qq36Q3Q53j41O0j351M4L6l49J162o19r67J108o69
2509i65n06J231O83k28p68J29N9O16R23m60j466M03J020n51J178j66j080R6K44
2528C92p5J99K16j075j022J60J550p45k64M81j456P69J076o22J64m51j86O6J98
2547f25J164p52O26M27m59l06J551q24j72R3o01l82M92P86n17p49Q32p83r16J885
2567G70qj768M05o34j36J333O04o13p06k8O47J95J006l83j719N83J012m58O87
2586G89J57j105j51Q74O91o92J98r5j454M76R43p46l89Q09q90M69O37q50l14M12
2606b31L84j165J59O28l89M03J108j089m06J098J77k01J014j229q88K85J775r23
$$ plain form
2624 510 277 953 -302 -415 964 742 -759 -465 -1100 -1287 -210 184 -1069 -1331 -874 -210 -725 678
2642 678 484 -1000 -361 375 248 589 602 507 493 1082 1321 317 1049 995 -296 606 -43 -648 -347 368
2662 368 -120 -876 -713 109 -223 166 850 -1279 -1315 44 -725 -246 929 -830 -1295 145 501 718 380
2681 380 -16 -665 -265 1162 978 -448 498 123 -262 761 1238 240 -680 -452 -219 -506 142 -533 -1095
2700 -1095 -221 -218 -1033 195 190 -540 -156 -49 -285 -440 654 552 -462 256 706 -162 1192 1802 330
2719 330 188 25 111 76 689 64 -899 -869 102 95 262 910 -983 -1599 -95 182 -113 -354 -331 -552 -449
2740 -449 322 398 624 445 -72 -168 1359 372 439 420 245 54 619 678 994 356 259 108 -282 402 -60 -539
2762 -539 203 -498 -1375 -293 222 369 -213 -416 -753 -365 594 48 -497 224 -54 -105 991 1250 513 440
$$ packed form
2624E10k33O76j255j13J379k22j501K94o35j87J077L94j253k62M57O64n15J403
2642F78j94j484O39P36j27L41J3r5j4N89K39j004P32n4j291R02o49o05L01P15
2662C68m88p56J63Q22l32L89O84k129l6J359p69M79J175j759m65J440L56K17l38
2681C80l96o49M00J427j84j426R46l75l85J023M77r98r20K28K33k87O48o75n62
2700a095Q74Lq15J228np30L84J07k36j55J094j02j014P18M50q68J354O10j472
2719C30j42j63Q6l5O13o25r63L0R71pJ67O48j893o16J504K77k95k41K3k21J03
2740d49P71P6K26j79n17r6J527r87O7j9j75j91N65N9L16o38r7j51l90O84m62m79
2762e39P42p01q77J082N15J47n82k03l37L88R59n46n45P21k78n1J096K59p37p3
$$ plain form
2782 440 93 470 1109 828 273 -879 -251 335 -30 -117 451 -607 -138 -405 -574 -459 -468 -895 -806 -898 10
2803 10 102 411 768 139 -68 298 445 791 441 342 -311 185 579 1043 281 428 -65 -319 582 -392 257
2824 257 -528 -730 -490 366 -220 -468 -505 -576 -648 -1108 -85 194 -569 -74 -527 -522 143 523 547 214 -32 331
2846 331 698 71 401 -118 42 28 440 497 467 -232 -27 -168 -190 -45 -195 -301 -638 -494 -418 -368 362 32
2868 32 -312 -1 274 564 1065 590 147 -244 141 708 723 473 707 -1 202 390 241 492 -331 -441 -457
2889 -457 -579 -592 188 -431 -151 25 -928 247 -122 31 -29 -823 -292 151 466 693 430 -151 314 343 797
2910 797 586 77 380 -181 92 317 305 233 -463 -573 382 -392 -6 229 -759 -648 -458 -754 260 161 -759
2931 -759 -681 126 425 483 450 566 -115 -308 591 76 702 439 -93 469 368 470 632 51 -544 -265 -421
$$ packed form
2782D40l47L77O39k81n55j152O28N86l65q7N68j058M69k67j69J15rm27Q9r2R08
2803A0R2L09L57o29k07L66J47L46l50r9o53M96L94M64p62J47m93k54R01r74O49
2824B57p85k02K40Q56n86k48l7p1p2m60J023K79p63M95m53NO65L80K4l33k46L63
2846C31L67o27L30n19J60j4M12N7l0o99K05j41k2J45j50j06l37J44P6N0P30l30
2868C2l44L11K75K90N01m75m43l91L85N67J5k50K34p08K03J88j49K51q23j10j6
2889d57j22j3P80o19K80J76r53J175l69J53o0p94N31M43L15K27k63n81M65K9M54
2910G97k11n09L03n61K73K25j2p2o96j10R55p74L86K35r88J11J90k96J014r9r20
2931g59P8Q07K99N8l3J16o81j93Q99n15O26k63n32N62j01J02J62n81n95K79j56
$$ plain form
2952 -421 23 95 -554 -420 -1026 -836 -470 58 70 -227 -640 -291 -206 -34 107 -166 -64 -95 516 690 765 251
2974 251 215 201 308 172 -387 288 -347 -517 340 358 54 151 -1117 -779 -370 -482 -704 -27 -65 -851 -279
2995 -279 -247 401 -27 409 -227 -382 386 61 815 589 -129 -48 334 662 680 191 442 36 -275 288 340
3016 340 -522 73 -543 -956 -5 236 -17 -403 -885 -491 -579 -25 -95 -227 -47 -196 59 579 837 863 416
3037 416 76 38 12 466 767 65 342 364 -157 14 473 -132 0 -702 -689 -441 308 11 -838 -1048 -8
3058 -8 -292 306 257 -515 -450 -28 180 392 247 -129 -181 97 1046 533 217 751 -276 -455 158 324 -9
3079 -9 -22 -402 -475 32 39 -494 -473 -170 -217 -1275 -259 -169 -524 -199 -279 -569 -200 616 73 318 320 489 -424
3102 -424 655 248 -61 157 497 -376 306 1149 233 -246 -185 -165 -132 -277 -177 -930 -734 396 56 462
$$ packed form
2952d21M44P2o49J34o06J90L66N28J2k97m13L49Q5J72J41k73J02l1O11J74P5n14
2974B51l6j4J07j36n59O75o35j70Q57J8l04R7j268L38M09j12k22O77l8p86N72
2995b79L2O48m28M36o36j55P68l25P54k26p18Q1L82L28J8m89K51m06l11N63N2
3016C40q62N95o16m13R51K41k53l86m82L94q8N54p0j32J80j49K55N20K58K6m47
3037D16l40l8k6M54L01p02K77K2n21J71M59o05J32p02J3K48P49k97q49k10J040
3058hk84N98m9p72O5M22K08K12j45l76n2K78R49n13l16N34j027j79O13J66l33
3079ij3l80p3N07Pn33K1L03m7j058J016R0l55L25q0k90L69Q16n43K45KJ69r13
3102d24J079m07l09K18L40q73O82Q43r16m79O1K0L3j45J00p53J96J130l40M06
$$ plain form
3122 462 335 -372 -673 -96 -253 -34 -366 292 -335 -99 617 233 178 807 606 -36 82 512 202 -91
3142 -91 229 -312 -622 -332 26 -277 313 -280 -1032 -603 -87 233 -614 -230 -580 -568 294 146 -332 232 -89
3163 -89 -385 1029 719 -554 95 -19 105 -13 326 675 314 150 478 -262 -250 239 -605 -400 92 -408
3183 -408 -90 125 -356 -140 -199 -367 -433 29 617 -187 -391 48 -428 -174 650 272 399 211 353 469 -77
3204 -77 409 -165 -581 276 410 -4 303 -99 -474 -81 190 -345 -579 -563 -899 -659 -179 288 -343 339 -154
3225 -154 -156 391 688 -67 476 241 -73 215 845 823 -73 186 732 -488 228 -276 -235 -404 -366 -233 -944
3246 -944 -274 -76 -298 -400 -400 -342 -303 420 -482 -432 131 209 26 383 749 -250 58 346 18 333 501 -78
3268 -78 -193 228 527 475 215 -650 -174 341 275 -48 -536 -591 -668 -981 159 -13 -370 -59 225 -652 385
$$ packed form
3122D62j27p07l01N77j57K19l32O58o27K36P16l84n5O29k01o42J18M30l10k93
3142i1L20n41l10K90L58l03N90n93p52M29N16L20q47L84l50J2Q62j48m78N64l21
3163h9k96J414l10j273O49j14J24j18L39L49l61j64L28p40J2M89q44K05M92n00
3183d08L18K15m81K16n9j68o6M62N88q04k04M39m76K54Q24l78J27j88J42J16n46
3204g7M86n74m16Q57J34m14L07m02l75L93K71n35k34J6l36K40M80M67o31O82m93
3225a54kN47K97p55N43k35l14K88O30k2q96K59N46j220P16n04M1j69L8J33p11
3246i44O70J98k22j02%N8L9P23r02N0N63P8j83L57L66r99L08K88l28L15J68n79
3268g8j15M21K99n2k60q65M76N15o6l23m88n5p7l13J140j72l57L11K84q77J037
$$ plain form
3289 385 412 192 103 5 -124 130 509 342 259 316 358 -149 404 659 34 -247 90 -298 -88 -61 -174 -375
3311 -375 -347 -84 -66 -55 505 -782 -829 -337 -147 368 172 -25 34 -106 235 215 50 462 -159 -94 87 388
3333 388 52 639 202 -71 -436 -27 31 80 394 -285 -728 -224 -486 -95 217 -349 106 -63 -413 589
3353 589 -189 -104 104 -140 324 383 115 -18 66 641 806 300 620 335 -182 -254 -360 -275 263 -114 -544 -333
3375 -333 -570 -58 245 -352 -766 -548 -470 -86 68 42 -110 -339 -66 171 189 947 375 -186 -287 70 415
3396 415 491 198 202 -56 351 280 114 280 -270 -442 -322 18 -280 110 -388 -204 -290 31 250 -241 -133 325
3418 325 -466 112 21 281 352 -228 31 63 574 316 374 -113 131 154 282 9 -96 -400 -571 -552 -137 31
3440 31 163 -113 -823 -494 409 -187 -113 -230 -375 -294 -462 179 305 211 118 311 219 390 288 171 -178 -245
$$ packed form
3289C85K7k20q9r8j29K54L79j67q3N7M2n07N53K55o25k81L37l88K10K7j13k01
3311c75K8K63J8J1N60j287m7M92J90N15j96j97N9j40L41k0j65M12o21O5J81L01
3333C88l36N87m37k73l65M09N8M9L14o79m43N04k62L91L12n66M55j69l50J002
3353E89p78Q5K08k44M64N9k68j33Q4N75J65n06L20k85n17p2j06Q5N38l77m30K11
3375c33k37N12L03n97m14K18P8L84J54k6j52k29K73K37J8P58n72n61j01L57L45
3396D15P6k93Mk58M07p1j66J66n50j72J20L40k98L90m98J84q6L21K19m91J08M58
3418C25p91N78r1K60P1n80K59L2N11k58N8m87K44K3J28k73j05l04j71J9M15J68
3440C1J32k76p10L29R03n96P4j17j45Q1j68O41J26r4r3J93r2J71j02j17l49o7
$$ plain form
3462 -245 -73 413 -60 429 -80 141 -349 -100 30 -84 -805 -226 -632 -371 188 -179 187 5 -410 -661
3482 -661 136 216 -116 -79 478 230 -1 802 117 603 24 108 14 424 -82 -126 -198 -162 352 465 -86 151
3504 151 -164 40 -337 -209 -90 -241 -668 -480 4 248 -125 111 251 -143 -6 169 122 253 188 -401 484
3525 484 -52 255 437 -120 245 -158 13 424 -342 104 -497 36 -116 -34 93 -14 -224 -169 -170 -134 -125 29
3547 29 -659 -26 -11 288 469 -248 422 362 63 606 218 508 -205 -225 96 356 331 100 -154 -79 -23 -276
3569 -276 -88 127 244 -647 -315 -245 -305 349 164 -220 -320 49 -153 137 397 85 -444 383 227 120 697
3590 697 377 -260 -546 330 152 -36 -201 -176 -596 -216 -210 -169 193 -333 -302 -27 -87 37 -288 246 -85 -485
3612 -485 597 68 -427 192 394 283 445 624 258 -77 317 74 -576 89 397 -16 -78 90 -308 -195
$$ packed form
3462b45J72M86m73M89n09K21m90K49J30j14p21N79m06K61N59l67L66j82m15k51
3482f61P97Q0l32L7N57k48k31Q03o85M86n79Q4r4M10n06m4p2L6N14J13n51K37
3504A51l15K04l77J28J19j51m27J88M84K44l73K36J40l94J37J75m7J31o5n89Q85
3525D84n36L07J82n57L65m03J71M11p66M46o01N33j52Q2J27j07k10N5jL6RJ54
3547B9o88O33J5K99J81p17O70o0k99N43l88K90p13k0L21K60k5k31k54P5N6k53
3569b76J88K15J17q91L32P0o0O54j85l84j00L69k02K90K60l12n29Q27j56j07N77
3590F97l20o37k86Q76j78j88j65K5m20L80OM1L62n26L1K75o0J24l25N34l31m00
3612d85J082n29m95O19K02j11J62J79l66l35L94k43o50O65L08m13o2J68l98J13
$$ plain form
3632 -195 558 171 -512 -525 -469 -655 -115 -418 -295 -975 127 -91 103 406 -321 -793 243 116 453 185
3652 185 501 551 519 346 -159 205 257 -592 15 21 -69 -139 209 -410 -287 -131 97 87 -531 128 51 -559 -321
3675 -321 249 -315 528 599 63 -425 832 209 241 155 551 -204 537 916 403 1 -463 -743 367 518
3695 518 155 -229 -216 21 -277 -134 -197 -309 87 -105 78 549 534 -159 -362 93 339 -141 280 256 97
3716 97 77 517 52 -198 387 -137 4 -147 160 289 -14 269 -415 -77 200 -286 248 -325 -258 -703 -502
3737 -502 -61 -123 -298 -24 73 -441 59 589 196 83 554 78 -157 122 -142 80 109 -261 46 342 165
3758 165 10 -278 -141 -298 -463 132 -138 -150 180 -159 -146 218 169 -199 -175 -369 273 -420 716 346 -456
3779 -456 0 219 85 197 235 -35 -21 394 -39 30 352 228 -263 89 121 -182 160 -532 -336 -353 -307 -228
$$ packed form
3632a95P53l87o83j3N6j86N40l03J23o80J102k18J94L03p27m72J036j27L37k68
3652A85L16N0l2j73n05L64N2q49O07Or0p0L48o19J23J56K28j0o18O59p7o10K38
3675c21N70n64Q43P1n36m88J257o23L2q6L96p55P41L79n13m02m64k80J110J51
3695E18l63l84J3K37k98J43o3j12L96j92J83M71j5o93k03M55K46m80M21k4j59
3716I7k0M40m65k50N85n24J41j51L07J29l03K83o84L38K77m86N34n73O7m45K01
3737e02M41o2j75K74R7n14N00N30l93j13M71m76k35K79k64K22K9l70L07K96j77
3758A65j55k88J37j57j65N95k70j2L30l39J3L64m9l68K4j94O42o93J136l70q02
3779d56M56K19j34J12L8k70J4M15m33O9L22j24m91L52L2l03L42o92J96j7M6P9
$$ plain form
3801 -228 -497 -259 44 -235 54 137 408 -203 -374 194 640 34 336 -70 313 176 -230 -241 755 432 -90
3822 -90 -8 -165 -181 78 48 -107 -604 -559 10 118 309 -176 -401 -59 -22 -265 572 158 260 65 -483 269
3844 269 268 154 166 201 -108 -23 -301 -418 -157 19 -87 192 113 660 70 -209 -83 -94 250 -216 -124 -232 -72
3867 -72 -166 -21 -579 -62 393 379 16 255 474 -9 344 21 34 177 337 218 426 -228 -58 282 -251
3888 -251 -74 250 -547 357 -230 -82 239 -441 154 -526 -621 -181 456 169 -46 -208 131 315 -130 542
3908 542 158 -120 384 51 157 144 120 62 59 -232 -455 -258 -218 -493 -129 516 -294 -50 -163 222 -233 -434
3930 -434 -95 459 -99 -17 -62 -227 67 -269 203 195 80 284 209 64 223 871 12 -136 437 -158 367 42
3952 42 63 -512 -48 -587 80 -354 -301 -291 -459 -133 -61 -371 227 -282 -229 -573 -56 327 -60 -12 413 738
$$ packed form
3801b28k69K38L03k79K89Q3K71o11j71N68M46o06L02m06L83j37m06j1R96l23n22
3822i0Q2j57j6K59l0j55m97M5N69J08J91m85k25L42L7k43Q37m14J02j95n48P52
3844B69jj14J2L5l09Q5k78j17K61J76j06K79p9N47n90k79J26j1L44m66R2j08J60
3867g2r4J45n58N17M55j4l63K39K19m83L53l23J3J43J60j19K08o54J70L40n33
3888b51J77L24p97R04n87J48L21o80N95o80r5M40O37k87k15j62L39J84m45O72
3908E42l84k78N04l33J06j3k4n8lk91k23J97M0k75L64O45q10K44j13L85m55k01
3930d34L39N54n58Q2m5j65K94l36M72qj15K04p5j45J59O48q59j48N73n95N25l25
3952D2K1n75M64n39O67m34N3J0j68L26P2l10N98n09N3l44N17L83l87M8M25L25
$$ plain form
3974 738 19 304 -234 263 -656 -105 602 -308 86 194 57 405 -244 -272 452 -446 -577 32 -84 -264
3994 -264 297 -209 -233 -88 -254 232 -11 -153 188 -102 447 265 159 452 -137 -311 275 -62 166 -202
4014 -202 -55 -303 -276 242 -337 -149 -382 -385 145 167 -510 210 -515 70 -182 -227 -90 167 -127 -45 388 11
4036 11 -112 170 256 -65 273 137 450 -176 -247 185 -296 268 -80 -284 -197 -259 -246 -25 -171 -211 92 11 -336
4059 -336 -77 -551 -237 189 354 362 -237 -144 -425 276 468 156 -35 133 289 714 -264 512 106 -347 -29
4080 -29 251 -758 -362 -236 39 18 -208 226 -130 -321 33 -228 -205 93 -166 93 -220 287 304 -76 391
4101 391 30 -222 -82 -206 38 239 -278 -69 42 257 177 368 121 -206 -208 149 -110 -428 465 -201 -110
4122 -110 -400 -112 -279 236 -292 -573 -102 -109 325 -397 335 155 393 51 896 -322 364 229 2 316
$$ packed form
3974G38p19K85n38M97r19N51P07r10L94J08j37L48o49k8P24q98j31O09j16j80
3994b64N61n06k4J45j66M86k43j42L41k90N49j82j06K93n89j74N86l37K28l68
4014b02J47k48K7N18n79J88k33lN30K2o77P20p25N85k52m5J37K57k94Q2M33l77
4036A1j23K82Q6l21L38j36L13o26p1M32m81N64l48k04Q7o2J3K21j46m0L03q1l47
4059c36K59m74L14M26J65Qn99R3k81P01J92l12j91J68J56M25r78P76m06m53L18
4080b9K80j009L96J26K75k1k26M34l56j91L54k61K3K98k59K59l13N07J7l80M67
4101C91l61k52J40j24K44K01n17K09J11K15q0J91k47l27kL57k59l18Q93o66R1
4122a10k90K88j67N15n28k81M71pM34p22P32j80K38l42Q45j218O86j35k27L14
$$ plain form
4142 316 254 11 -527 -10 -200 -611 64 -345 -605 -87 -193 -137 -371 -234 79 -329 188 68 94 267 184
4163 184 304 -456 -310 17 -56 527 14 -225 5 362 55 211 269 -99 -552 19 228 236 54 65 -371 -235
4185 -235 123 107 -430 82 -781 -542 89 36 -129 92 405 109 64 579 -310 285 715 252 102 -168 -39
4206 -39 -71 519 -14 -184 137 343 -19 -37 -444 -231 -385 -70 -29 -331 -48 -84 -421 54 542 -323 87 77
4228 77 159 -96 133 -524 210 32 306 499 -261 298 42 184 365 -397 141 -333 -132 254 11 -16 -69
4249 -69 69 -33 -513 -285 -145 -160 -672 6 220 -129 176 69 -167 321 387 212 235 119 326 -71 80
4270 80 15 -137 190 83 247 -104 2 82 -86 -418 81 -476 -178 133 -247 1 -55 -172 -81 117 204 -273
4292 -273 -288 -32 91 56 89 -233 -69 137 -70 343 -221 39 -173 -31 -195 -99 -31 29 -136 295 -85 -199
$$ packed form
4142C16o2k43n38N17j90m11O75m09k60N18j06N6k34J37L13m08N17j20K6J73q3
4163A84J20p60J46L27p3N83n13k39K30L57l07J56N8l68m53N71K09Qj82J1m36J36
4185b35L58j6n37N12q63K39O31n3j65K21L13k96m5N15q89N95M30m63j50k70J29
4206c9l2N90n33j70L21K06l62j8m07K13j54L15M1l02K83l6l37M75M88q65M10j0
4228G7Q2k55K29o57P34j78K74J93p60N59k56J42J81p62N38m74K01L86k43k7n3
4249f9J38j02m80K28J40j5n12O78K14l49L05j07k36M88O6j75K3j16K07l97J51
4270H0o5j52L27j07J64l51J06Q0j68l32M99n57K98L11l80K48n6j17R1J98Q7m77
4292b73j5K56J23l5L3l22J64K06k07M13n64K60k12J42j64R6O8O0j65M31l80j14
$$ plain form
4314 -199 51 183 -202 -278 -225 -178 -495 11 94 -230 724 268 282 -213 -256 190 239 96 36 -194 58 -5 -276
4337 -276 124 -52 -334 -433 -183 79 -395 -63 3 -383 -26 -55 -330 86 -370 -72 37 279 374 -109 -169 2
4359 2 119 105 269 21 -77 -103 -9 225 -22 286 66 -153 -160 112 83 64 49 192 -603 -7 -41 -8 -263 -67
4383 -67 -324 5 126 -105 -1 -121 -160 39 471 549 218 -161 -98 247 473 49 58 590 -33 -109 262 -8
4405 -8 54 -72 -473 -287 -143 -327 -139 74 239 90 162 309 121 -230 -54 -296 -102 -59 219 79 546 146
4427 146 -53 155 222 137 204 -22 721 103 -201 341 -79 -368 210 -124 47 -278 -657 45 -43 -201 100
4448 100 164 4 -17 213 -125 -135 192 -155 -94 59 155 -313 157 54 195 66 335 -44 68 100 272 -614
4470 -614 -520 -245 -295 -45 -36 247 -153 -77 -137 -231 -77 -130 185 -343 329 -56 12 -30 271 8 381 41 78 -292
$$ packed form
4314a99K50J32l85p6N3M7l17N06Q3l24R54m56J4m95m3M46M9j43o0k30K52o3k71
4337b76M00j76k82r9K50K62m74L32O6l86L57k9k75M16m56K98J09K42R5m83o0J71
4359BJ17j4J64k48r8k6R4K34k47L08k20k19pK72k9j9j5J43p95N96l4L3k55J96
4383f7k57L29J21k31J04j20l9J99M32P8l31l79O3L45K26m24RN32o23p6L71k70
4405hO2j26m01J86J44j84J88K13J65j49P2J47j88l51J76k42J94M3K78j40M67m00
4427A46j99K08O7q5O7k26P43o18l04N42m20k89N78l34J71l25l79P02q8j58L01
4448A00O4j60k1K30l38j0L27l47O1J53R6m68M70j03J41j29K69l79J12L2J72q86
4470f14R4K75n0K50RK83m00P6o0r4J54n3L15n28O72l85O8m2L01k63L73l40L7l70
$$ plain form
4494 -292 38 -114 17 12 -52 219 -175 -114 11 -60 218 -86 -56 -189 -214 -444 182 -276 -179 -135 -523 242 -21
4517 -21 -165 -34 13 -232 17 -163 298 209 203 1 311 80 160 -104 -152 212 -191 -434 -200 -68 -596 -67
4539 -67 -522 -191 425 -382 357 10 49 34 -2 106 65 225 -12 206 -343 323 -78 321 -108 111 238 -262
4561 -262 82 -39 185 -119 -204 16 29 -62 -215 -310 -190 140 5 -676 -458 42 80 434 -171 130 -30 88
4583 88 54 352 -524 203 490 30 252 394 -202 -305 240 -449 371 322 250 106 -92 -327 80 86 12 -146
4605 -146 -325 -610 -266 -470 -484 178 -211 139 154 -235 232 329 122 -365 103 -138 135 -445 510 266 -285
4626 -285 458 -310 -309 31 -251 -423 193 -546 64 -394 -134 -231 100 -114 -242 -281 -85 -187 -569 89 -135
4647 -135 -70 365 198 -114 452 206 323 474 359 -231 -179 -222 -157 -270 -338 118 -344 -256 -178 126 -228 -648
$$ packed form
4494b92L30j52J31no4K71l94O1J25p1K78l04L0j33k5k30O26m58R7M4l88P65k63
4517b1j44J31M7k45K49j80M61q9ok02L10k31Q0k64m8L64m03k43K34J32n28N29
4539f7m55L31O16q07P39l47L9j5l6J08m1J60k37K18n49O66m01L99m29K19J27n00
4561b62L44j21K24l04q5K20J3r1j53r5J20L30j35o81K18N00L8L54o05L01j60J18
4583H8l4K98q76P27K87m60K22J42n96j03N45o89Q20m9p2j44j98k35M07Op4j58
4605a46j79k85L44k04j4O62l89L50J5l89M67R7k07m87M68k41K73n80R55k44n51
4626b85P43p68JL40k82j72O16p39O10m58K60r7L31k14j28l9J96j02l82O58k24
4647a35O5M35j67l12N66k46J17J51j15n90N2m3O5j13o8M56m62Q8P8L04l54m20
$$ plain form
4669 -648 240 -432 -483 37 -418 138 -26 -318 -281 -364 168 32 292 -46 81 250 621 -39 133 392 203
4690 203 -140 488 217 -187 508 10 -15 66 -128 -340 -168 -180 -154 -116 177 -46 -295 11 -336 161 -46 -73
4712 -73 -56 -241 -49 550 272 479 16 -609 53 12 -84 89 317 82 -91 -35 248 -179 153 378 -177 -411
4734 -411 104 189 -252 -40 -159 -531 -373 -232 -68 153 151 -252 105 580 -228 -190 442 10 160 62 391 453
4756 453 138 -122 454 186 67 116 4 -245 -523 159 -74 -51 36 -159 246 -399 -251 -193 -47 14 -43 -83
4778 -83 2 264 80 267 390 33 8 216 572 -291 207 54 -115 -45 364 -208 -27 -92 101 -72 163 16
4800 16 -319 -92 -191 -97 -91 -67 232 -582 170 524 -112 -195 104 -147 -410 -35 101 -74 224 236 359 -62 178
4823 178 255 -560 97 -49 -53 -86 -243 -222 -514 -378 90 -359 356 19 -19 237 151 -138 354 349 396 304 249 377
$$ packed form
4669f48Q88o72n1N20m55N56j64k92L7q3N32j36K60l38J27J69L71o60J72K59j89
4690B03l43O28k71m04O95m98k5Q1j94k12J72j2K6L8K93k23k49L06l47M97k07k7
4712g3J7j85J92N99k78K07m63o25O62m1r6J73K28k35j73N6K83m27L32K25n55k34
4734d11N15Q5m41K12j19l72J58J41J64K21km03L57M75q08L8O32m32J50r8L29O2
4756D53l15k60N76k68j19M9j12k49k78O82k33K3Q7j95M05o45J48N8J46O1n7m0
4778h3Q5K62j84J87J23l57k5K08L56q63M98j53j69P0M09n72J81o5J93j73K35j47
4800A6l35K27r9R4OK4K99q14P52L54o36q3K99k51k63L75J36j75K98J2J23m21K40
4823A78P7q15O57j46ml3j57K1k92J36M68m49P15l37l8K56q6k89M92nM7r2n5J28
$$ plain form
4847 377 -92 -113 43 77 77 -389 -30 247 221 -141 242 145 -234 324 127 -139 -57 3 -94 -271 47 -348 -70
4870 -70 -274 131 225 20 289 209 -91 -62 219 -503 -68 402 444 800 210 -69 116 348 47 -84 -256 217
4892 217 -136 -605 -197 76 165 165 -24 148 -384 -441 -130 118 -76 268 -280 198 184 288 438 34 448 114
4914 114 340 187 170 202 -15 135 165 167 -173 -446 270 -199 -147 -84 -308 -259 -287 -132 86 50 -113 -171 46 -95
4938 -95 249 150 152 355 138 -43 292 143 59 503 151 -21 -193 -4 137 123 136 -111 -6 -24 169 -70 -389
4961 -389 178 -244 -337 -118 -264 -495 49 35 229 -98 -117 94 174 239 -271 -328 221 335 787 -66 264 -177
4983 -177 291 67 182 -45 105 118 124 -240 193 -321 -615 -35 -33 -59 -75 -481 -169 -80 -230 -35 -230 -50 246
5006 246 235 -133 191 344 300 -250 134 -178 29 309 328 95 -67 38 -85 432 46 -17 269 -94 -287
$$ packed form
4847C77m69k1J56L4%m66L59K77k6l62L83r7l79N58j97k66Q2O0r7j77L18l95K78
4870g0k04M05R4k05K69q0l00K9K81p22M35M70M2L56n90k79J85K32l01j31j72M73
4892B17l53m69M08K73Q9%j89J72n32n7L11K48j94L44n48M78j4J04J50m04M14l34
4914A14K26j53j7L2k17J50L0Kl40k73P16m69N2O3k24M9k8J55K18l6j63n8K17j41
4938i5L44r9KK03k17j81L35j49q4M44l52j72j72J89J41j4J3k47J05j8J93k39l19
4961c89N67m22r3K19j46k31N44j4J94l27j9K11Q0O5n10n7N49J14M52q53L30m41
4983a77M68k24J15k27J50J3Ol64M33n14k94N80Kk6j6m06L12Q9j50J95j95J80K96
5006B46j1l68L24J53m4n50L84l12K07K80J9k33j62J05j23N17l86o3K86l63j93
$$ plain form
5027 -287 -86 -892 -390 -361 3 314 -387 -63 68 160 -488 239 380 109 -211 -236 -174 -310 171 15 332
5048 332 -125 -477 -85 133 -166 74 -205 93 -278 32 360 -210 345 112 68 12 -52 -49 103 -626 249 24
5070 24 280 548 285 -25 76 -222 -118 -94 -313 -235 -119 -241 -316 -309 -162 119 -283 -407 90 7 68 -359 -71
5093 -71 -263 94 -139 -41 -346 38 583 201 43 181 327 -111 -198 -14 271 178 287 -123 145 308 -291
5114 -291 262 -135 -454 196 -132 -418 -624 -311 -46 -291 72 -155 -43 16 -134 78 -289 -379 277 -17 73
5135 73 161 -111 257 19 49 -195 410 -85 433 -82 143 102 -183 258 358 -49 -305 -25 129 -185 -88 -71
5157 -71 -79 -122 -74 -247 69 132 179 -129 -349 -70 36 277 22 -160 -158 -381 -59 122 346 157 163 -20 140 -665
5181 -665 -287 319 -352 287 188 -184 310 199 -131 -280 77 -84 -122 205 -48 -208 198 -83 93 463 98
$$ packed form
5027b87K01q06N02K9L64L11p01L24J31R2o48P27J41k71l20k5O2j36M81j56L17
5048C32m57l52L92K18k99K40k79K98l71L10L28n70N55k33m4n6o4LJ52p29Q75k25
5070B4K56K68k63l10J01k98J04K4k19P8J16j22p5PJ47K81m02j24M97q3O1m27K88
5093g1j92L57k33R8l05L84N45l82j58J38J46m38q7J84K85r3J09m10K68J63n99
5114b91N53l97l19O50l28k86k06L13K65k45L63k27J12N9j50K12l67r0O56k94R0
5135G3Q8k72L68k38L0k44O05m95N18n15K25m1k85M41J00m07k56K80J54l14R7J7
5157g1qm3M8j73L16O3M7l08k20K79J06K41k55j82Kk23L22J81K24j89Oj83J60q05
5181f65L78O06o71O39r9l72M94j11l30j49L57j61l8L27k53j60M06k81J76L70l65
$$ plain form
5202 98 60 284 59 367 -20 299 -104 70 190 233 111 -327 -103 -151 -69 54 -171 -109 -64 -390 -96 -89 49
5225 49 181 85 293 -74 335 148 125 -52 389 89 59 303 557 284 -3 202 122 421 264 284 320 78
5247 78 10 20 380 46 -161 205 159 283 -650 -5 355 337 -189 247 -76 141 310 405 -132 457 -19 274
5269 274 306 94 169 -93 237 62 152 -406 135 -54 -13 291 -324 -292 -68 44 -301 -39 54 402 669 130
5291 130 218 -214 347 -205 -161 180 309 27 264 243 440 333 253 21 -271 500 -350 -143 -61 20 -325 95
5313 95 -715 -609 -207 -249 -497 -9 522 -35 67 -114 407 78 446 -34 68 -316 19 134 204 155 351
5334 351 137 -23 63 -86 251 -110 381 74 -25 8 -48 -91 -718 -608 -443 -2 286 260 98 -398 -2 42
5356 42 -189 65 56 394 323 312 218 -7 521 65 32 418 196 43 71 -73 14 -145 -194 -79 -127 -88 11 -429
$$ packed form
5202I8l8K24k25L08l87L19m03J74J20M3j22m38K24m8Q2J23k25O2M5l26K94PJ38
5225D9J32r6K08l67M09j87k3j77M41l00l0K44K54k73k87K05q0K99j57K0L6k42
5247G8o8J0L60l34k07L66m6J24r33O45L60j8n26M36l23K17J69R5n37N89m76K93
5269B74L2k12P5k62L30j75R0n58N41j89M1L04o15L2K24J12l45K62R3L48K67n39
5291A30Q8m32N61n52M4L41J29k82K37k1J97j07q0k32k92P71q50K07Q2Q1l45M20
5313I5q10J06M02m2k48M88N31n57J02j81N21l29L68m80J02l84L35J15P0m9J96
5334C51k14j60Q6j49L37l61M91l07r9L3n6m3o27J10J65M41K88k6j62m96L96M4
5356D2k31K54rL38p1j1r4k25N28m56l3L86k22j53K8j44Q7j59m9J15m8L9R9m40
$$ plain form
5380 -429 -146 -399 -345 31 438 319 -154 111 445 245 85 56 46 298 120 232 274 -138 410 -353 202
5401 202 105 67 -104 -94 -12 98 218 -298 153 -113 -266 -109 17 -202 35 -296 284 -93 258 50 -357
5422 -357 -364 221 30 84 467 -109 93 162 175 394 90 206 -65 -192 560 30 130 265 -171 -46 -306 -462
5444 -462 -179 -222 -377 239 -13 254 -283 125 -33 94 -107 107 -103 -46 -60 102 208 -364 -345 245 47
5465 47 -40 311 24 -11 -154 20 37 262 65 -62 235 169 176 -206 -325 -3 76 -196 -53 -182 141 -21 273
5488 273 -54 606 -113 -126 -468 311 -121 88 -196 320 -68 231 -106 290 167 404 172 -290 193 -372
5508 -372 -39 -156 -450 -263 -264 -138 4 317 -595 -21 -179 307 -21 -259 400 3 92 -19 163 -298 421
5529 421 -287 7 37 -119 -23 -397 440 213 -231 -96 17 114 243 -265 -105 -249 -152 -623 -80 -2 84 -400
$$ packed form
5380d29K83k53N4L76M07j19m73K65L34k00j60k9j0K52j78J12M2m12N48p63N55
5401B02r7l8j71J0Q2J10J20n16M51k66j53J57J26k19K37l31N80l77L51k08m07
5422c57pN85j91N4L83n76K02O9J3K19l04J16k71j27P52n30J00J35m36J25k60j56
5444d62K83m3j55O16k52K67n37M08j58J27k01K14k10N7j4J62J06n72J9N90j98
5465D7q7L51k87l5j43J74J7K25j97j27K97o6Pl82j19L22P9k72J43j29L23j62K94
5488B73l27O60p19j3l42P79m32K09k84N16l88K99l37L96j23K37k32m62M83n65
5508c72L33j17k94J87jJ26J42L13r12N74j58M86l28k38O59l97Q9j11J82m61P19
5529D21p08K94L0j56R6l74Q37k27m44J35J13R7J29n08J60j44R7m71N43P8Q6m84
$$ plain form
5551 -400 390 329 -124 439 -366 35 -177 -96 315 71 208 168 -205 -97 -348 -143 -92 102 128 171 -94 -132
5573 -132 -64 -240 -342 -381 -469 -243 -536 33 -84 124 -152 123 -230 -148 164 64 52 -217 121 88 -275 -209
5595 -209 -265 -285 152 -125 69 69 -284 -79 -115 -168 -105 -28 -297 -62 -221 -409 -134 -212 337 324 314 -129 37 -313
5619 -313 127 -39 -172 99 -200 232 -257 382 549 27 220 -229 -251 145 29 -164 -55 42 -70 -365 15
5640 15 633 27 -123 32 -24 355 96 -353 -81 -60 -71 368 -4 91 409 -76 72 325 279 -23 -35 242
5662 242 -111 -80 100 0 285 -253 -254 596 -80 -336 -286 -259 -13 49 253 80 402 -490 549 -153 104 -69
5684 -69 241 52 79 309 51 261 139 195 72 59 321 123 289 -181 11 217 -324 410 -222 -378 -195
5705 -195 -288 -268 -266 54 31 145 -332 122 39 253 110 214 361 -249 -280 211 130 -370 87 121 -2 -156 -262
$$ packed form
5551d00P90o1m53N63q05M01k12Q1M11k44J37m0l73J08k51K05N1J94K6M3k65l8
5573a32O8j76j02l9q8K26k93N69j17K08k76K75l53Q2L12j00j2k69L38l3l63O6
5595b09n6k0M37k77J94%l53K05l6n3O3P7k69K35j59j88K75p8N49j3j0m43J66l50
5619c13M40j66j33K71k99M32m89O39J67n22J93m49k2L96j16j93J09R7j12k95L80
5640A5O18o06j50J55n6L79k59m49K72K1j1M39l72R5L18m85J48K53m6l02j2K77
5662B42l53L1J80j00K85n38jQ50o76k56N0K7K46O2K04j73L22q92J039p02K57j73
5684f9L10j89K7K30k58K10j22N6j23j3K62j98J66m70J92K06n41P34o32j56J83
5705a95r3K0KL20k3J14m77M54q3K14j43J04J47o10l1M91q1n00M57L4j23j54j06
$$ plain form
5728 -262 -173 -244 401 434 -33 82 9 -611 -87 -324 -237 -65 -460 -275 159 -390 108 189 388 463 -1 2 477
5751 477 -25 246 204 217 339 243 335 321 104 93 -236 -387 274 55 -100 524 36 60 -417 103 -10 -132
5773 -132 150 84 118 -230 228 -13 44 -166 -45 -83 118 119 365 -97 -67 -348 67 163 39 -309 31 51 387
5796 387 -100 119 399 -52 124 248 -191 -121 125 46 216 143 247 255 -200 -144 -122 -144 200 -110 349 -116 514
5819 514 75 108 276 -347 -134 273 -16 -552 -176 103 -182 453 -55 67 150 -461 -204 -347 -124 -201 -88
5840 -88 -44 296 223 -83 -73 145 -32 -73 -591 -154 250 -75 113 -139 -519 -307 82 -55 -62 23 67 -11 213
5863 213 -170 -698 -4 70 -311 277 79 281 248 168 -104 -13 -318 219 148 110 -657 292 535 -119 -163 355
5885 355 39 -11 -132 190 -9 -108 -243 -44 -306 198 35 -96 165 -687 -354 -265 245 -353 28 324 -250
$$ packed form
5728b62Q9p1O45L3m67J15p3o20N24k37Q7J72l95J85M34n49M98Q1J99P5m64LM75
5751D77n02K71m2J3J22r6R2j4k17j1l29j51O61k19j55O24m88K4m77N20j13j22
5773a32K82o6L4l48M58k41N7k10J21l8K01JK46m62L0k81M15R6j24l48L40K0L36
5796C87m87K19K80m51J76J24m39P0K46p9J70p3J04Qm55N6K2k2L44l10M59m65O30
5819E14m39L3J68o23K13M07k89n36L76K79k85O35n08J22Q3o11K57j43K23p7J13
5840h8M4L40p3l06J0K18j77m1n18M37M04l25J88k52l80K12L89j37pQ5M4p8K24
5863B13l83n28O94P4l81N88j98K02l3q0k72R1l05N37p1l8p67R49K43o54m4N18
5885C55l16n0j21L22j99r9j35J99k62N04j63j31K61q52L33Q9N10n98L81K96n74
$$ plain form
5906 -250 172 208 -133 435 99 497 104 12 122 -191 288 88 176 128 241 70 159 -93 -345 -301 210 209 258
5929 258 -112 -218 -6 -96 346 -254 -21 102 -104 -1 324 412 236 -67 -78 158 95 21 527 -110 169 51
5951 51 2 -74 -239 -74 364 -447 -205 -170 278 -88 282 131 -313 -268 -351 154 -37 24 -512 261 171 319 -7
5974 -7 111 33 195 -136 200 150 -257 478 51 93 128 -9 -284 -310 224 -200 -107 -139 199 62 126 142 59 -483
5998 -483 -108 -46 -148 -179 -49 69 106 213 134 -19 366 48 -114 84 -149 154 -245 -51 609 -166 80
6019 80 -127 27 423 193 232 -2 103 -59 -350 -371 -82 -20 -163 16 -188 241 -405 -411 333 -171 -149 -164 366
6042 366 -192 -117 38 -58 59 -176 278 169 -26 18 -101 -139 -152 -305 -404 -212 -320 -192 -50 -177 475 -285
6064 -285 21 135 0 -296 -230 268 91 254 319 -28 -113 -635 196 173 -532 143 93 190 92 -130 -237 184
$$ packed form
5906b50M22L6l41N68l36L98l93r2J10l13M79k00Q8m8J13j71Q9k52k52M4N11jM9
5929B58l70j06K12r0M42o00K33J23k06J03L25Q8j76l03j1K36o3p4N06o37K79j18
5951E1m9p6j65J65M38q11K42L5M48l66L70j51m44M5q3N05j91O1n36P73r0J48l26
5974gJ18p8J62l31L36n0m07P35m27M2L5j37k75k6N34m24R3l2L38j37O4J6q3n42
5998d83L75O2j02l1J30J18L7J07p9j53L85l18j62J98k33L03l99J94O60p75K46
6019H0k07J54L96k30L9k34J05j62k91k1K89O2j43J79k04M29o46oP44n04K2j5N30
6042C66n58P5J55r6J17k35M54j09j95M4j19l8j3j53r9J92j08J28J42j27O52p60
6064b85L06J14j35k96O6M98j77J63O5l47q5n22Q31k3p05O75n0R7r8k22j07M21
$$ plain form
6086 184 151 62 24 -714 -242 142 -127 210 -58 12 -524 -232 -148 120 -42 -199 -218 -60 -142 115 425 47
6108 47 144 73 232 -183 534 263 -241 -377 -253 -296 -74 -50 342 27 8 -92 -396 -437 -129 86 -80 21
6130 21 296 -162 -567 133 -55 39 207 -176 -83 515 -329 3 262 -348 -127 -158 105 -182 -371 -107 -30 -296
6152 -296 -649 -212 327 -12 -364 -143 -74 236 257 -557 -114 257 416 -139 -305 172 -182 165 54 58 174
6173 174 -423 72 -42 319 -251 384 23 -339 52 182 -150 -326 -37 -457 -124 304 220 -118 51 212
6193 212 -235 105 0 310 -157 238 171 -348 -92 155 -376 338 -157 -228 -358 146 102 -43 167 245 52
6214 52 195 20 196 34 -460 -455 179 58 10 -468 155 -293 -43 151 -26 45 -396 -69 134 322 -49 35
6236 35 -278 -205 -229 -311 223 -289 -34 1 226 289 -435 562 -192 166 -26 -309 -87 -89 -87 -528 291 59 -214
$$ packed form
6086A84l3q9l8p38M72L84k69L37k68P0n36K92Q4K68j62j57j9J58q2K57L10l78
6108D7R7p1J59m15P17k71n04j36J24m3K22K4L92l15j9j00l04m1L08K15j66J01
6130B1K75m58m05P00j88R4J68l83R3N98q44L32K59o10K21l1K63k87j89K64P7k66
6152b96l53M37N39l39l52K21O9L10K1q14M43L71J59n55j66M77l54L47j11MJ16
6173A74n97M95j14L61n70O35l61l62L91J30l32j76K89m20L33M28q4l38J69J61
6193B12m47L40j05L10m67L95o7n19K56K47n31P14m95p1j30N04m4j45K10P8j93
6214E2J43j75J76j62m94NO34j21m8m78O23m48K50J94j77P1m41L27K03J88l71Q4
6236C5l13P3k4q2N34n12K55L5K25O3p24R97p54L58j92k83K22kKm41Q19k32k73
$$ plain form
6259 -214 208 -6 -55 -75 221 385 74 -112 163 217 -341 129 624 -166 106 24 -271 328 114 -45 315
6280 315 -146 28 -396 -219 -55 137 40 185 -128 -30 184 -259 279 -32 -386 -395 -4 102 115 116 223 -242
6302 -242 -30 -237 -391 230 222 -98 -2 -86 396 -13 -279 -83 -334 -70 -101 129 -289 -9 -166 131 -41 398
6324 398 -186 -297 73 11 640 -48 29 380 132 -456 -192 -57 218 -119 -132 139 58 -4 252 -440 -241 -30
6346 -30 167 -217 117 267 -137 244 200 -166 128 -183 154 -233 112 -10 -120 -390 230 297 -190 250 -204
6367 -204 -221 185 -16 -301 146 89 -231 -392 -153 -224 -97 44 252 -80 -288 -434 -403 15 -159 -100 -267 177
6389 177 -249 -37 229 -29 255 -250 85 -304 -149 -186 246 -253 210 164 0 -78 -246 -235 474 -288 85
6410 85 -204 65 -132 103 -120 95 227 -215 47 265 100 -109 -173 -67 81 73 27 43 -119 92 38 97 252
$$ packed form
6259b14M22k14m9k0K96J64l11j86K75N4n58M70M95p90K72q2k95N99k14j59L60
6280C15m61J74m24J77J64J92r7J45l13R8K14m43N38l11l54rL91J06J3JJ07m65
6302b42K12k07j54O21ql20R6q4M82m09k66J96k51K64l1K30m18K80j57K97j72M39
6324C98n84j11L70o2O29o88P7L51k48n88K64J35K75l37j3K71q1o2K56o92J99K11
6346c0J97l84L34J50m04L81m4l66K94l11L37l87L45j22j10k70O20O7m87M40m54
6367b04j7M06k01k85M47n7l20j61K39p1J27J41K08l32k08j46L1M18j74N9j67M44
6389A77m26K12K66k58K84n05L35l89J55l7M32m99M63m6j64p8j68J1P09p62L73
6410H5k89K69j97K35k23K15J32m42K62K18j65k09o4J06J48qm6J6j62K11n4N9J55
$$ plain form
6433 252 -139 -45 24 -226 -179 21 -190 -179 -40 -80 7 212 -93 -327 -178 -447 -474 147 68 1 141 77 61 164
6457 164 161 595 240 153 233 -484 70 531 -348 336 -313 248 -2 -201 15 418 108 -369 -147 -225 350 144
6479 144 -179 156 -10 256 -275 153 87 -456 -146 -224 -180 250 133 -59 0 -23 -115 166 58 -375 -55 3
6501 3 -337 -212 36 -187 106 488 -65 -124 -483 -259 443 38 -8 122 72 245 -105 -388 -244 323 -147 -135
6523 -135 178 -299 -114 -267 142 -106 127 -411 -434 -119 -420 -200 -16 383 35 42 -533 89 337 73 -177
6544 -177 348 -15 89 -184 168 354 -275 -240 87 -112 -227 353 -65 66 -359 -238 -162 -100 -71 390 309 424
6566 424 -154 153 132 -48 -267 -9 358 -103 -84 -194 271 -66 -101 -172 16 67 582 9 219 -39 167 -211
6588 -211 -21 -192 -42 296 124 66 168 -67 79 -148 -222 -258 -145 27 28 321 9 -353 127 105 -124 -240
$$ packed form
6433B52l91R4O9k50M7K00k11J1J39m0Q7K05l05k34J49k69k7O21p9o7J40o4j6J03
6457A64lM34l55q7Q0p17N54M61q79O84o49N61k50j99K16M03l10m77K22p8N75k06
6479A44l23L35j66K66n31M28o6n43L10p8M4M30j17j92N9k3r2K81j08m33L20N8
6501Cl40J25K48k23K93L82n53n9l59K24P02m05m6J30n0J73l50k83J44N67m70J2
6523a35L13m77J85j53M09k48K33n38k3L15l01K20J84L99l48Pn75O22K48k64k50
6544a77N25l63J04k73L52J86o29L5L27j99j15N80m18J31m25J21P6O2K9M61q1J15
6566D24n78L07k1j80k19K58L67m61J9j10M65l37l5p1J88N1N15n73K10k58K06l78
6588b11J90j71J50L38j72n8J02k35J46k27p4l6J13J72JK93l12l62M80k2k29j16
$$ plain form
6610 -240 -212 283 -177 -46 154 -426 -56 -109 239 -180 -211 48 40 27 224 157 88 462 2 -339 -331 -371 -49 -157
6634 -157 142 -437 -541 -279 614 -230 -359 -241 -55 -386 125 307 120 -239 -160 401 -106 22 64 35 359
6655 359 -325 27 159 471 320 -58 238 -432 169 93 -157 -188 -26 -119 164 -444 44 -346 -199 224 373
6676 373 -124 234 -78 228 34 -502 -215 -76 -224 323 -101 191 143 126 -276 -151 281 -110 102 283 -6
6697 -6 -33 -308 31 -126 270 -274 177 -125 155 288 -380 -110 508 -7 245 13 116 478 -260 32 -74
6718 -74 502 277 -87 89 -133 23 148 -120 -203 117 10 29 66 409 107 99 -159 -154 277 -109 -336 -291 501
6741 501 257 83 -101 -498 561 -27 -138 48 19 243 -1 -375 -234 -333 -126 173 -110 -68 -127 -130 42 -402
6763 -402 181 -256 304 -428 50 -336 11 -335 221 40 -113 -111 -151 181 -56 -386 264 171 -92 118 -1
$$ packed form
6610b40K8M95m60J31K00n80L70n3L48m19l1K59qj3J97o7o9L74m60l41Qm0L22j08
6634a57K99n79j04K62Q93q44j29J18J86l31N11J82j87l59P9N61n07J28M2k9L24
6655C59o84L52J32L12j51l78K96o70O01p6k50l1J62r3K83o08M88l90J47M23J49
6676C73m97L58l12L06j94n36K87J39j48N47m24K92m8j7m02J25M32l91K12J81k89
6697fk7k75L39j57L96n44M51l02K80J33o68K70O18n15K52k32J03L62p38K92j06
6718g4N76k25l64J76k22J56J25k68q3L20j07J9L7L43l02qk58NM31l86k27M5P92
6741E01k44j74j84l97J059n88j11J86k9K24k44l74J41r9K07K99k83M2n9lJ72m44
6763d02N83m37N60p32M78l86L47l46N56j81j53Km0L32k37l30O50r3k63K10j19
$$ plain form
6784 -1 523 -154 -253 92 -10 -41 417 587 -74 -19 532 -279 -43 -299 -144 103 -257 -14 -258 -115 -5 113
6806 113 -147 -172 -281 -78 331 12 -271 -240 263 -142 -108 218 -50 34 34 97 150 -103 95 8 480 275 53
6829 53 -189 -64 143 -538 -8 -21 377 -183 -257 117 10 -99 67 -88 -212 163 152 23 33 207 460 164
6851 164 -73 -99 288 -118 117 -62 -43 194 -350 47 -20 -214 -490 94 170 -223 43 27 -178 -35 169 -159
6873 -159 346 377 208 236 379 -43 607 -312 239 193 -484 236 128 18 140 -254 -234 83 246 -385 -31
6894 -31 59 3 282 82 -49 -22 -171 -216 -68 515 49 -69 -344 150 -318 250 -25 353 60 -188 7 -265
6916 -265 272 276 156 268 -346 233 -115 156 170 429 -751 -88 467 -53 -175 179 -23 -563 22 111 -350
6937 -350 -229 285 -515 57 -75 -252 -215 181 216 -51 221 389 -246 50 -42 186 138 252 62 -398 57
$$ packed form
6784aN24o77r9L45j02l1M58J70o61N5N51q11K36k56J55K47l60K43k44J43J10J18
6806A13k60k5j09K03M09l19k83L1N03m05L4L26k68Q4%O3N3k53J98q7M72k05k22
6829E3k42J25K07o81N30j3L98n60p4L74j07j09J66j55j24L75j1j29J0J74K53k96
6851A64k37k6L87m06K35j79J9K37n44L97o7j94k76N84P6l93K66j6k05J43K04l28
6873a59N05L1j69K8J43m22O50r19N51m6o77P20j08j10J22l94K0L17J63o31L54
6894c1R0n6K79k00j31K7j49m5J48N83m66j18k75M94m68N68k75L78k93k48J95k72
6916b65N37Mj20J12o14N79l48K71J4K59j180O63N55n20j22L54k02n40N85Q9m61
6937c50J21N14q00N72j32j77L7L96L5k67K72J68o35K96r2K28m8J14j90m60M55
$$ plain form
6958 57 -298 297 -115 50 -7 -108 13 228 -56 -65 -346 -60 -355 350 -14 76 -156 157 73 66 -282 -343 261
6981 261 -185 -18 -251 371 -322 -244 374 183 -163 -190 268 174 25 324 -23 -109 -463 141 279 192 186 -152
7003 -152 -107 31 62 100 31 39 -102 -218 87 166 -98 -301 135 187 -33 144 -11 116 86 170 -160 -98 -56 131
7027 131 -442 241 -200 -205 89 80 114 -57 63 -82 118 45 183 173 -62 -186 42 -121 -185 -148 213 258 -176
7050 -176 -144 22 195 -243 44 -171 213 -116 -92 -8 -73 244 216 -189 170 -412 -3 23 26 19 -212 499 -212
7073 -212 57 72 48 156 31 70 19 153 252 190 -462 42 356 142 -48 -6 -32 333 489 -189 -2 341 28
7096 28 253 -156 -100 264 101 34 -71 115 -111 -55 77 -40 150 245 -218 -20 -77 -127 -266 -120 197 -518
7118 -518 167 369 -219 -146 54 102 419 -80 -342 206 -329 -407 6 -9 136 364 143 -24 35 -198 -5 44
$$ packed form
6958E7l55N95m12J65n7j01J21K15k84rk81K86k95P05l64R0k32L13q4pl48o1O04
6981B61m46J67k33O22o93P8O18j91l46k7M58r4j49K99l47q6l54O04J38q7ol38
7003a52M5J38L1L8o9Qj41j16L05P9k64k03M36N2k20J77j55J27l0Q4l30O2M2J87
7027A31n73O83m41nK94rL4j71J20j45K00p3J38j0k35j24K28j63o4L7L61M5m34
7050a76L2J66J73m38K87k15L84l29K4Q4o5L17k8m05L59n82M09K6Lpk31P11p11
7073b12K69J5k4J08j25L9n1J34R9o2o52N04L14k14j90M2k6L65J56o78J87L43l13
7096B8K25m09N6L64j63o7j05J86k26N6J32j17J90R5m63J98n7n0j39J46L17p15
7118e18O85K02n88P3K00M8L17m99k62N48n35p8M13j5J45K28k21j67N9k33J93M9
$$ plain form
7140 44 107 -144 -396 -239 -297 162 175 -205 -210 53 130 -176 159 -224 -439 -124 -222 16 -118 364 50 -29 6
7163 6 -60 110 -90 -235 -179 -1 -33 341 70 74 106 486 40 -42 55 -323 -568 99 175 142 255 -714 45 -435
7187 -435 -163 178 -198 112 -70 -385 -215 -33 -153 438 -160 -707 341 -52 -67 -99 98 -160 -33 229
7207 229 194 -171 -484 127 515 -75 -145 103 -239 -361 -293 -203 -68 -110 -98 186 140 172 -193 190 -123 63 -138
7230 -138 170 -60 -272 98 -15 343 141 -142 197 -216 -207 -35 -26 -299 3 210 -123 100 -102 -300 -234 -230
7252 -230 -241 -164 106 -292 217 98 -115 -261 198 -20 -88 52 403 284 -8 -104 282 -305 -65 447 -351
7273 -351 -45 193 -153 43 -292 -48 70 -468 122 -173 -512 226 240 -335 156 -141 -211 30 -197 -239 -216
7294 -216 44 24 127 -294 -398 -133 125 206 74 -153 146 -235 -62 -23 100 -205 -125 205 310 135 63 -152
$$ packed form
7140D4O3k51k52J57n8M59J3l80nK63P7l06L35l83k15L15r8K38j34M82l14p9L5
7163Fo6J70k00j45N6J78l2L74k71ML2L80m46q2R7l78k45O67P6l3J13r69P59m80
7187d35K72L41l76L10j82l15J70J82j20N91n98n47J048l93j5l2J97k58J27K62
7207B29l5l65l13O11L88n90p0K48l42j22O8R0J35m2J2K84m6L2l65L83l13J86k01
7230a38L08k30k12L70j13L58k02k83L39m13RJ72Rk73L02K07l33K23k02j98O6M
7252b30j1P7K70l98N09j19k13j46M59k18o8J40L51j19k92r6L86n87K40N12p98
7273c51L06K38l46J96l35K44J18n38N90k95l39P38J4n75M91k97p0K41k27m2K3
7294b16K60k0J03m21j04K65K58Q1j32k27K99l81J73L9J23l05Q0L30J05j75p2k15
$$ plain form
7316 -152 -340 -475 -50 -198 -207 -253 390 21 -149 -175 29 -89 107 -158 450 -226 280 354 -92 245 289 71
7338 71 278 649 -112 76 -146 377 219 255 146 -93 -269 -328 -308 14 -423 480 -71 -134 200 91 -397 -60
7360 -60 -504 -13 248 72 109 157 -152 226 282 133 -161 -379 -347 -150 152 -11 -137 69 -188 -18 -211 -79
7382 -79 -214 114 -154 2 -13 142 -17 -299 -136 -180 14 -191 473 115 -231 -331 130 -136 369 123 -66
7403 -66 -41 278 86 -304 -155 86 -257 -17 -122 -165 -495 -68 61 -148 0 205 138 -151 194 163 -133 -302
7425 -302 77 49 14 63 320 58 -71 176 192 -277 -16 256 -28 344 394 -140 80 -311 -192 43 -283 5
7447 5 -143 -65 -158 -180 -131 -201 112 148 -228 -183 134 446 -8 -379 -158 -319 55 115 25 -364 174 314 -9 165
7471 165 -140 -337 -156 -13 -196 150 235 247 -234 -331 -83 -256 -251 -357 -266 352 -156 -47 329 -375 163 -371
$$ packed form
7316a52j88j35M25j48rm6O43l69j70k6K04j18J96k65O08o76N06P4m46L37M4k18
7338G1K07L71p61J88k22N23j58L6j09k39j76n9K0L22m37R03n51o3L34j09m88L37
7360f0m44M91K61j76L7M8l09L78N6j49k94k18L2J97L02j63j26K06k57J70j93J32
7382g9j35L28k68J56j5J55j59k82J63m4J94k05O64l58l46j00M61k66N05k46j89
7403f6K5L19j92l90J49K41l43K40j05m3l30M27J29k09J48K05o7k89L45l1k96j69
7425c02L79k8l5M9K57k62j29K47J6m69K61K72k84L72N0n34K20l91J19K35l26K88
7447Ej48P8r3k2M9p0L13L6l76M5L17L12m54l71K21j61L74O0r0l89N38J40l23J74
7471A65l05j97J81J43j83L46Q5J2m81r7K48j73Nj06R1O18n08J09L76p04N38n34
$$ plain form
7493 -371 272 -93 -106 -375 94 -251 173 -369 138 124 -192 -63 -151 -163 -14 -48 -131 -120 -378 378 -200 -216 -81
7516 -81 -17 -96 -293 -184 10 129 508 46 -405 151 150 66 95 580 344 -124 671 44 224 -265 -176 161 -264
7539 -264 -123 631 486 -173 -218 -310 127 -194 -118 383 -326 -138 235 66 -189 250 -55 -451 -250 -258 189 9
7561 9 170 422 125 -257 -78 -220 190 -165 -181 -24 -132 -346 182 -359 26 -3 58 -65 231 38 185 240
7583 240 -406 27 280 67 242 -244 404 87 -218 278 -81 -142 61 126 -32 -560 -27 376 214 318 142
7604 142 -191 -24 113 -184 170 -458 -45 189 -320 -277 -68 -340 -187 186 62 100 96 -196 -322 -120 571
7625 571 -199 -317 -498 -79 191 -50 -518 -652 -203 151 220 325 583 -19 57 1 42 -230 -128 -273 33
7646 33 142 -10 -182 -424 142 -243 -26 -321 -108 419 382 427 -334 -75 -13 -239 106 -76 37 -337 -200
$$ packed form
7493c71O43l65j3k69M69l45M24n42N07j4l16J29q8j2J49l4q3J1k58P56n78j6J35
7516h1O4p9j97J09J94J19L79m62m51N56jq4K9M85k36m68P95o27J80m89Q9L37m25
7539b64J41P54j45o59m5r2M37l21P6N01p09J88L73j69k55M39l05l96K01qM47j80
7561IJ61K52k97l82J79j42M10l55j6J57j08k14N28n41L85k9O1j23K96j93J47N5
7583B40o46M33K53k13J75m86O48l17l05M96l59o1K03O5j58n28N33M03j62J04j76
7604A42l33J67J37k97L54o28M13K34n09M3K09k72J53L73j24L8mk92j26K02O91
7625E71p70j18j81M19K70k41m68j34M49L54O9J05K58o02P6n6M1k72J02j45L06
7646C3J09j52j72k42N66l85K17k95K13N27l7M5p61K59O2k26L45j82J13l74J37
$$ plain form
7667 -200 86 -320 -212 -160 -192 315 252 -197 29 -152 120 155 -272 332 250 -207 -20 -141 60 477 -313 -275
7689 -275 -124 -195 -3 398 -12 -544 -154 205 111 13 81 -464 -215 -24 101 69 -78 468 -104 24 -122 -62
7711 -62 62 -432 -185 -96 -32 155 5 91 -177 -39 196 123 -96 228 -207 -392 -82 122 1 -89 417 171
7733 171 316 264 325 -338 313 211 -134 -115 160 -334 125 -301 71 235 111 140 -175 -135 218 -163 -15 369
7755 369 232 270 183 -44 -129 96 -182 58 88 -18 -469 -77 87 -84 -425 40 208 389 335 -441 22 -250
7777 -250 -369 -351 -41 -279 -20 85 -152 63 294 110 145 -17 -669 -121 323 285 231 235 69 -77 -95 -235
7799 -235 158 -149 -182 -83 -123 446 -59 -20 -306 174 227 -142 46 134 -23 101 -57 134 74 328 -349 121
7821 121 27 -219 -133 -453 205 27 354 -43 -55 -78 527 191 -320 -461 160 140 -126 -188 -257 142 37 320
$$ packed form
7667b00K86m06J08N2l2N07o3m49K26j81K72L5m27O04q2m57J87j21K01M17p90L8
7689b75J51p1J92M01m10n32L90L59r4r8O8n45K49J91J25l2j47N46n72J28j46O0
7711f2J24m94K47Q9O4J87j50Q6k68J38K35p3k19L24m35j85L10K04j21r0N06k46
7733A71J45n2O1o63O51j02l45J9K75m94M59m26L72J64j24K9l15M0L53l81J48L84
7755C69j37L8q7k27q5K25k78K40L0j06m51L92J64j71l41M65J68J81n4p76M63k72
7777b50j19J8L10k38K59J05k37K15K31j84L5j62o52N48M44l8n4Mj66j46j8j40
7799b35L93l07l3R9m0N69n05L9k86M80N3l69J88Q8j57J24j58J91o0K54o77M70
7821A21r4k46Q6l20O58j78L27l97j2k3O05l36n11j41O21k0k66o2o9L99j05K83
$$ plain form
7843 320 110 -13 -21 95 247 211 72 -125 -134 -89 63 60 -104 181 -114 109 14 411 22 38 -78 -390 -106
7866 -106 248 265 -201 -25 249 62 -786 -155 344 -491 92 112 461 -226 465 486 -473 331 101 274 -140
7887 -140 -107 -64 -184 96 181 278 200 -291 48 -27 269 237 148 -98 -146 -153 237 -89 -275 131 125 -29 -183 199
7911 199 -520 70 196 -66 166 -111 331 265 246 -220 -79 65 259 -321 -256 -7 90 -177 148 648 -250
7932 -250 -190 -2 241 -121 -14 198 377 185 163 -131 -324 -344 30 -336 142 392 -304 18 21 65 59 273 -161
7955 -161 153 -66 227 201 -332 37 153 -207 455 -33 -34 -27 138 52 -529 -349 93 51 49 341 -13 -138 -73
7978 -73 218 127 145 -111 -8 -182 196 -404 315 146 -386 402 -127 12 -265 194 -90 205 -71 -279 -215
7999 -215 29 242 54 302 -35 -152 303 155 416 -298 164 207 155 95 -38 122 -223 -51 55 -242 262
$$ packed form
7843C20k10j23qJ16J52l6j39j97rM5J52lj64K85k95K23r5L97l89J6j16l12K84
7866a06L54J7m66J76K74j87q48O31M99q35N83K0L49o87O91K1r59Q04k30J73m14
7887a40L3M3j20K80Q5R7p8m91L39p5K96l2q9k46m8pL90l26j86M06oj54j54L82
7911A99p19N90J26k62K32k77M42o6j9m66J41J44J94n80O5K49R7k67L25N00q98
7932b50O0J88K43l62J07K12J79j92k2k94j93k0L74l66M78K50o96L22LM4oK14m34
7955a61L14k19K93k6n33L69J16l60O62m88jPJ65q6n81J80M42m2kK92l54j25O5
7978g3K91r1J8k56J03j74L78o00P19j69n32P88n29J39k77M59k84K95k76k08O4
7999b15K44K13j88K48l37j17M55j48K61p14M62M3n2o0j33J60l45J72J06k97N04
$$ plain form
8020 262 -86 406 364 13 252 327 -199 -17 -399 -210 -58 145 342 137 80 -12 290 -227 -13 246 44
8041 44 265 -144 -113 26 -40 235 65 170 -41 276 181 -150 191 186 21 -122 -262 -188 -106 195 -194 76 270
8064 270 411 28 49 -359 -249 104 -163 -23 59 -9 417 -12 307 21 242 53 -21 -7 -433 -160 -317 -22
8086 -22 -52 228 58 -106 -341 0 -337 -37 62 -230 -275 31 -109 -48 153 37 39 -122 241 81 57 -202 -133
8109 -133 88 203 326 77 306 595 -241 268 314 -218 -121 37 -39 -336 386 -61 -290 261 -229 -616 156
8130 156 -272 -18 134 -286 -59 228 -275 33 84 -120 -277 -232 19 -41 309 -396 116 397 51 257 563
8151 563 9 -114 95 -272 -42 -459 58 98 -184 76 8 -135 -88 253 -379 -75 103 -8 -221 88 -358
8172 -358 -223 -47 -260 22 -328 -78 311 85 -559 142 2 185 190 -62 -390 -59 -323 32 15
$$ packed form
8020B62l48M92m2l51K39P5n26J82l82J89J52K03J97k05n7r2L02n17K14K59k02
8041D4K21m09L1J39o6K75j70J05k11L17r5l31L41nj65j43j40P4Q2L01l89K70J94
8064B70J41l83K1m08J10L53k67J40Q2o8M26m29L19k86K21j89p4J4m26K73j57K95
8086b2l0K80j70j64k35L41l37L00R9k92m5L06j40O1K01j16Kj61L63j60k4k59O9
8109a33K21J15J23k49K29K89q36N09M6n32R7J58p6k97P22m47k29N51m90l87P72
8130A56m28K54J52m20K27K87n03L08N1k04j57M5K51o0L50p05N12K81l46K06L06
8151E63n54j23K09l67K30m17N17M0k82K60o8j43M7L41o32L04J78j11k13L09m46
8172c58J35J76k13K82l50K50L89k26o44P01j40J83Nk52l28L31k64L55j7
8191A5
$$ Imaginary data points
##PAGE= N=2
##DATA TABLE= (X++(I..I)), XYDATA
$$ plain form
0 0 0 0 0 0 0 0 0 0 0 0 0 0 0 0 0 0 0 -21 24 -24 24 -24 24 -37 48 -48 51 -72 72 -93 97 -118 127 -145 166 -187
36 -187 209 -236 260 -291 322 -360 395 -440 486 -536 590 -655 719 -792 874 -962 1062 -1171
54 -1171 1296 -1434 1593 -1780 1995 -2254 2563 -2947 3437 -4085 4991 -6341 8569 -12903 24458
69 24458 -120835 -300656 -21738 115140 85552 24027 -47599 -109616 1450 125631 68377
80 68377 -56417 -56838 -37273 -3282 45452 10933 -34957 9667 13396 -26225 -2167 41118 7722
93 7722 -38479 -26226 -11829 -15100 9867 -2371 -24070 14447 23113 -4924 17097 14343 -15519
106 -15519 24590 58012 -27022 -84127 18745 81970 962 -22743 16 -34062 -3249 70389
118 70389 30237 -44113 -32937 2965 7630 26364 31908 -19374 -29698 4644 -13739 -8672 34065
$$ packed form
0@%%%%%%%%%%%%%%%%%k1M5m8M8m8M8o1Q5r6R9j23J44j65J90k15K45k72L11l53
36a87L96m45M96n51O13o82P55q35R26j022J126j245J374j511J666j836K024k233
54a171K467k730L027l373L775m249M817n510O384p522R076j1332J4910k1472L7361
69B4458j45293j79821K78918J36878k9588o1525p1626o2017J11066J24181n7254
80F8377j24794m21J9565L3991M8734l4519m5890M4624L729l9621K4058M3285l3396
93G722m6201J2253J4397l271K4967j2238k1699L8517Q666k8037K2021k754k9862
106a5519M0109L3422q5034n7105J02872O3225q1008k3705K2759l4078L0813P3638
118G0389m0152p4350J1176L5902M665J8734N544n1282j0324L4342j8383N067M2737
$$ plain form
131 34065 -3574 -65392 -50378 -2743 24971 27935 9231 -25467 -22067 32980 55870 35619
143 35619 1751 -46227 -30742 35515 24226 -27632 -22025 -2668 -11377 283 27654 -563
155 -563 -39827 -6098 6175 -36707 -34048 -18170 -32427 -17493 2223 -16723 -29787 1369 24147
168 24147 8214 6227 1913 -32545 -16683 28563 12855 -17548 -20850 -15373 433 20299 22376
181 22376 -444 -20453 -14296 -4270 8588 11742 -18510 -28837 -13812 -17050 -9474 10057 -4829
194 -4829 -32184 -35025 -15817 -6135 -5434 530 -18876 -32619 -536 19220 14243 15087 5123 -9231
208 -9231 -2204 16576 19848 3281 -951 -1967 -13214 5418 25703 8826 -5999 -11253 -12571
221 -12571 -5092 -1398 -5547 -19655 -26664 -14361 -8195 -5209 2633 -2194 454 7641 -174 68 8978
$$ packed form
131C4065l7639o1818J5014M7635K7714K964j8704l4698L400N5047K2890k0251
143C5619l3868m7978J5485O6257j1289n1858N607J9357q709J1660K7371k8217
155e63l9264L3729J2273m2882K659J5878j4257J4934J9716j8946j3064L1156K2778
168B4147j5933j987m314l4458J5862M5246j5708l0403l302N477J5806J9866K077
181B2376k2820k0009O157J0026J2858L154l0252j0327J5025l238P576J9531j4886
194d829k7355k841J9208R682P01N964j9406j3743L2083J9756m977Q44r964j4354
208i231P027J8780L272j6567m232j016j1247J8632K0285j6877j4825n254j318
221a2571P479L694m149j4108p009J2303O166K986P842m827K648P187p815K42Q910
$$ plain form
236 8978 13258 12151 491 -5326 -626 10882 26348 16274 -5723 -6307 -435 9799 20196 7665
250 7665 -11279 -18409 -8051 9099 8974 4763 -5924 -24125 -13372 8444 9313 4185 -6887 -16285
264 -16285 -9678 8586 23165 14510 -2124 -3952 -3090 7983 25580 13825 -3699 -5825 -2422
277 -2422 8809 16656 14085 2388 -8987 -1778 4449 1270 5766 -2501 -15768 -8587 -3171 -2765
291 -2765 2037 1372 -2222 -5836 -2458 2689 -569 5616 8204 -5391 -2585 7039 7398 14955 17491
306 17491 7516 -2027 -1197 9363 10883 8241 3290 -14140 -13368 7144 11825 8599 2571 -12777
320 -12777 -14486 -614 10709 4334 -10889 -15736 -16375 -7666 15342 14628 -1241 -2739 -2112 5242
334 5242 20011 18894 4895 -7515 -4677 5508 9582 14744 8344 -8506 -2293 6720 5026 6240
$$ packed form
236H978M280j107j1660n817M700J1508J5466j0074k1997n84N872J0234J0397j2531
250G665j8944p130J0358J7150j25m211j0687j8201J0753K1816Q69n128j1072r398
264a6285O607J8264J4579q655j6634j828Q62J1073J7597j1755j7524k126L403
277b422J1231P847k571j1697j1375P209O227l179M496q267j3267P181N416M06
291b765M802o65l594l614L378N147l258O185K588j3595K806R624L59P557K536
306A7491r975r543Q30J0560J520k642m951j7430P72K0512M681l226o028j5348
320a2777j709J3872J1323o375j5223m847o39Q709K3008p14j5869j498O27P354
334E242J4769j117j3999j2410K838J0185M074N162o400j6850O213R013j694J214
$$ plain form
348 6240 1559 -7976 -10019 -6636 -2099 -3845 -2870 817 -8500 -8424 972 -1502 1544 5978 -2926 -6673
364 -6673 -2225 4653 8545 9673 12020 1391 -5434 7236 11485 8535 8344 -7460 -16478 -6197
378 -6197 7207 11211 2397 -6660 -11833 -9222 10022 14309 -4322 -12498 -16566 -16007 -100 8224
392 8224 545 -10474 -11777 -1831 7293 16867 17067 -3747 -9579 2016 5890 12569 11491 -5227
406 -5227 -9990 666 11062 9501 4973 5876 -2970 -5921 4610 137 -5209 686 -6381 -14474 -11128
421 -11128 -5005 -2056 -26 418 -6773 -9343 6320 11229 4928 12802 9660 -2245 3252 12787 14152
436 14152 13784 9177 -3212 -10646 5288 20921 10892 -1162 -11726 -18731 3731 20724 3915
449 3915 -15273 -16838 -10346 -918 10210 9781 -10445 -12812 3687 5551 10019 18101 6115 -3443
$$ packed form
348F240m681r535k043L383M537j746R75L687r317P6R396k474L046M434q904l747
364f673M448O878L892J128K347j0629o825J2670M249k950j91j5804r018J0281
378f197J3404M004q814r057n173K611J9244M287j8631q176m068N59J5907Q324
392H224p679j1019j303R946R124R574K00k0814n832J1595L874O679j078j6718
406e227m763J0656J0396j561m528R03q846k951J0531m473n346N895p067q093L346
421a1128O123K949K030M44p191k570J5663M909o301P874l142j1905N497R535J365
436A4152l68m607j2389p434J5934J5633j0029j2054j0564p005K2462J6993j6809
449C915j9188j565O492R428J1128m29k0226k367J6499J864M468Q082j1986r558
$$ plain form
463 -3443 1917 5801 11153 18151 9069 -11945 -12211 9479 10463 803 3246 -7136 -11051 8661 11618
478 11618 -2058 -3373 2820 892 -4523 -5044 -8705 -6505 7021 -2911 -21809 -7220 7450 5331
492 5331 8627 5078 -9055 -6979 11735 14691 -2882 -5727 -2336 -9414 788 9386 1486 3811
506 3811 3698 -11205 -7415 12431 10243 -9466 -17194 -15320 -16501 168 12834 -11359 -24500 -6615
520 -6615 4685 8861 8176 -5524 -9717 1656 7350 -2083 -1263 8656 -1363 -5909 6644 301
534 301 -5193 10294 7158 -11654 -11037 1004 4966 3253 2529 -6137 -9310 5654 5557 -5146 3424
549 3424 -2041 -17177 -7694 3406 -1897 -2398 4160 -746 -8360 6389 18919 7049 828 -579
563 -579 -6256 5691 13369 1947 809 7340 3388 2914 13934 14906 287 -555 3126 -11393 -10495
$$ packed form
463c443N360L884N352O998r082k1014k66K1690R84r660K443j0382l915J9712K957
478A1618j3676j315O193j928n415n21l661K200J3526r932j8898J4589J4670k119
492E331L296l549j4133K076J8714K956j7573k845L391p078J0202Q598p900K325
506C811j13j4903L790J9846k188j9709p728J874j181J6669J2666k4193j3141J7885
520f615J1300M176o85j3700m193J1373N694r433Q20R919j0019m546J2553o343
534C01n494J5487l136j8812O17J2041L962j713p24q666l173J4964r7j0703Q570
549C424n465j5136R483J1100n303n01O558m906p614J4749J2530j1870o221j407
563e79n677J1947P678j1422j138O531l952m74J1020R72j4619q42L681j4519Q98
$$ plain form
578 -10495 4448 -1948 -11095 -9828 -10327 -2425 11636 12256 -1083 -3908 2722 2156 9177 20038 3071
593 3071 -10375 2937 11471 11283 14488 8865 -4006 -5825 5627 10230 3519 -978 -9803 -11562
607 -11562 3690 5417 -2721 784 -1584 -8941 -4151 3297 1551 -2964 -124 -1723 -7809 3819
621 3819 11923 5033 4059 1463 -5472 3445 9738 2030 -2306 1109 633 -4481 2900 11203 3728 1753
637 1753 2535 -8109 -5528 6268 4603 -5060 -13831 -15050 -5669 6314 9080 -5103 -13348 -5084
651 -5084 357 6995 10713 -3164 -11193 -4303 2320 8071 10325 4778 -3877 -4958 4607 8676 7413
666 7413 4820 -7628 -12017 1998 6559 1135 -2378 -6041 -7090 -2826 1788 -1315 -6961 -3198 -979
681 -979 -5551 -2834 -701 707 7438 3697 -4864 -3574 2142 8814 8246 1678 -4606 -5689 4842
$$ packed form
578a0495J4943o396r147J267m99P902J4061O20j3339k825O630n66P021J0861j6967
593C071j3446J3312Q534j88L205n623j2871j819J1452M603o711m497q825j759
607a1562J5252J727q138L505k368p357M790P448j746m515K840j599o086J1628
621C819Q104o890r74k596o935Q917O293p708m336L415m76n114P381Q303p475j975
637A753P82j0644K581J1796j665r663q771j219R381J1983K766j4183q245Q264
651e084N441O638L718j3877q029O890O623N751K254n547q655j081R565M069j263
666G413k593j2448m389J4015M561n424l513l663j049M264M614l103n646L763K219
681i79m572K717K133J408O731l741q561J290N716O672n68o568o284j083J0531
$$ plain form
696 4842 12903 7742 2713 -3068 -5902 3107 8388 3501 -2340 -8334 -9605 -4625 3273 6329 -3381
711 -3381 -7982 -5432 -3792 3830 8029 -260 -5925 -4750 -105 7461 9941 7196 1088 -1336 4457
726 4457 6826 6870 7528 -1101 -4255 -663 499 3547 4998 128 -3095 -3710 -912 332 -281 -368 -5509
743 -5509 -8409 -2742 -1646 161 5235 478 -2325 -651 2315 5845 6875 5164 -480 -5130 1445
758 1445 7077 7355 8325 1240 -5236 545 5776 7456 3792 -4307 -9350 -7582 813 5702 -995 -4815
774 -4815 -7498 -7901 1595 5916 426 -3507 -7060 -5268 1585 6554 6807 303 -1671 2822 3232 8103
790 8103 9347 379 -2193 -1046 -968 2030 3351 796 -2220 -4133 -333 -231 199 2668 -4311 -7954
806 -7954 -5195 -5212 -2570 479 -1695 -4210 -4798 -495 2679 3418 4946 561 -4635 -740 2414 4360
$$ packed form
696D842Q061n161n029n781k834R009N281m887n841n994j271M980P898L056r710
711c381m601K550J640P622M199q289n665J175M645P566K480k745o108k424N793
726D457K369M4O58q629l154L592J162L048J451m870l223o15K798J244o13q7n141
743e509k900N667J096J807N074m757k803J674K966L530J030j711n644m650O575
758A445N632K78R70p085o476N781N231J680l664q099n043J768Q395M889o697l820
774d815k683m03R496M321n490l933l553J792O853M969K53o504j974M493M10M871
790H103J244q968k572J147P8K998J321k555l016j913L800J02M30K469o979l643
806g954K759j7K642L049k174k515n88M303L174P39J528m385n196L895L154J946
$$ plain form
822 4360 6622 878 -4451 -2781 2760 7615 4938 -831 -6034 -8235 -866 4456 -853 -3977 -8207
837 -8207 -9304 -2986 1318 1071 -3802 -8286 -6893 -3323 2341 5580 -638 -4100 -1436 982 5846
852 5846 7781 1578 -2761 -2167 1253 3432 1399 1008 -2424 -3717 690 -1024 -1284 1305 -2119 -5453
868 -5453 -5249 -4626 -2127 -1915 -1818 -3337 -6635 -1444 1887 92 2940 1449 -2208 -440 1573 4014
884 4014 5216 3772 985 -2863 669 7269 5103 2835 -1019 -6509 -538 6156 4329 -84 -4453
899 -4453 -4549 -1905 1441 3488 -2337 -6142 -3680 -4113 -636 5276 1700 -1600 -1327 119 4715 7696
915 7696 7073 436 -4243 2005 4871 3898 4992 290 -1622 3662 4825 3101 2190 1289 -458 -2885
931 -2885 -2299 -2608 -3865 398 -1309 -8419 -3510 692 941 2129 -119 -3261 -2675 844 4038 1998
$$ packed form
822D360K262n744n329J670N541M855k677n769n203k201P369N322n309l124m230
837h207j097O318M304k47m873m484J393L570N664L239o218l462K664K418M864
852E846J935o203m339N94L420K179k033l91l432j293M407j714k60K589l424l334
868e453K04O23K499K12R7j519l298N191L331j795K848j491l657J768K013K441
884D014J202j444k787l848L532O600k166k268l854n490N971O694j827m413m369
899d453r6K644L346K047n825l805K462m33L477N912l576l300K73J446M596K981
915G696o23o637m679O248K866r73J094m702j912N284J163j724r11r01j747k427
931b885N86l09j257M263j707p110M909M202K49J188k248l142N86L519L194k040
$$ plain form
947 1998 2172 2609 -1612 1946 6246 3872 4718 3242 -4463 -4650 1147 4554 426 -4241 -6183 -6716
963 -6716 -1249 4940 -1000 -6866 -6087 -7896 -3340 2338 -842 -4630 -4906 -2399 -727 2725 7742 1778
979 1778 -6110 -2017 -74 1438 5551 -338 -6516 -3750 1132 4146 3333 1677 -3577 -6205 1075
994 1075 885 -5072 -2498 -3686 -8149 -4568 -1534 -1717 -210 -149 -1470 -4498 -1571 902 -592 2618
1010 2618 1130 -5372 -1066 4188 3989 5737 5212 -935 -4406 1540 7661 4531 -711 -3650 -7051
1025 -7051 -832 7986 2825 -2038 -4402 -7696 -2513 4553 3139 -4423 -7311 -2957 -906 2737 8576
1040 8576 2249 -3577 26 1527 5126 7892 1880 -3450 -1322 3293 5218 4388 4621 -663 -2175
1055 -2175 5360 3384 -2270 560 605 -2886 -2621 -2998 -2414 -257 3581 226 -5298 -2304 54 712
$$ packed form
947A998J74M37m221L558M300k374Q46j476p705j87N797L407m128m667j942n33
963f716N467O189n940n866P79j809M556N678l180l788k76K507J672L452N017n964
979A778p888M093J943J512M113n889o178K766M882L014q13j656n254k628P280
994A075j90n957K574j188m463L581L034j83J507O1j321l028K927K473j494L210
1010B618j488o502M306N254j99J748n25o147l471N946O121l130n242k939l401
1025g051O219Q818n161m863k364l294N183P066j414p562k888M354K051L643N839
1040H576o327n826L603J501L599K766o012n330K128M615J925q30K33n284j512
1055b175P535j976n654K830M5l491K65l77N84K157L838l355n524K994K358O58
$$ plain form
1071 712 4776 990 -6562 -2684 3356 4145 5358 4699 534 -2637 2363 6988 4717 3037 -992 -7129
1087 -7129 -810 6685 3518 100 -4196 -7578 -3716 4319 3401 -6088 -8476 -3858 -2535 915 2955
1102 2955 -3205 -3212 1895 570 232 2451 2035 -173 493 980 -1977 810 6992 2194 -2128 1080 -649
1119 -649 -1020 3103 1215 -4289 -4560 -3529 -3288 -1594 2426 -1748 -6760 -2431 -1921 -1809 4311 710
1135 710 -7064 -5390 47 3135 3724 2889 -1287 -3627 3382 6601 2129 2551 551 -4379 304 4331
1151 4331 808 421 80 -2051 -3616 278 2339 -2305 -2668 -2431 -7299 -3282 2885 -191 -1467 -679
1167 -679 -3294 -1129 3183 4415 -175 -1426 207 -1509 1523 7555 2313 -788 1194 245 1712
1182 1712 5464 3101 -2719 -3948 -1452 -883 -496 2315 -2618 -6081 -735 -322 -1174 1705 -1215 -4736
$$ packed form
1071G12M064l786p552L878O040P89J213o59m165l171N000M625k271j680m029o137
1087g129O319P495l167l418m296l382L862Q035r18r489k388M618J323L450K040
1102B955o160pN107j325l38K219m16k208O66M87k957K787O182m798m322L208j729
1119f49l71M123j888n504k71J031K41J694M020m174n012M329N10J12O120l601
1135G10p774J674N437L088N89q35m176k340P009L219m472M22k000m930M683M027
1151D331l523l87l41k131j565L894K061m644l63K37m868M017O167l076j276P88
1167f79k615K165M312J232m590j251J633j716L032O032n242l101J982r49J467
1182A712L752k363n820j229K496N69L87K811m933l463N346M13q52K879k920l521
$$ plain form
1198 -4736 -3678 -265 486 -255 2850 1116 -2429 2581 3912 1549 5211 3310 -1942 -1550 1943 2758
1214 2758 2476 1508 -1458 -4251 589 4266 61 -777 -2970 -6811 -2893 1944 287 -2456 -3435 -3151
1230 -3151 -1646 2674 4852 -382 -2284 -165 -1149 2137 5717 1421 -859 653 1328 3277 4133 3386
1246 3386 -747 -2149 1109 323 -893 1789 -1429 -3411 -571 -865 -691 230 -249 -2223 -3774 -1974
1262 -1974 -1077 -1260 1498 226 -3199 160 2055 1989 4343 2809 -536 -1028 849 3428 2659 2321 202
1279 202 -3237 -144 3826 1705 730 -2119 -5645 -3358 -642 1039 -1970 -4088 -4389 -3403 -45 3047
1295 3047 5 -2751 -2080 -2539 629 2450 1256 -255 -1326 461 1768 2578 3751 923 -1384 191
1311 191 209 -825 1522 -540 -2302 -2900 -2727 -751 -397 -146 -2186 -5290 -3313 -2166 -2367 -125 -1527
$$ packed form
1198d736J058L413P51p41L105j734l545N010J331k363L662j901n252L92L493Q15
1214B758k82r68k966k793M840L677m205q38k193l841L918M837j657k743r79K84
1230c151J505M320K178n234j902K119r84L286L580m296k280J512O75J949Q56p47
1246C386m133j402L258p86j216K682l218j982K840k94J74R21m79j974j551J800
1262a974Q97j83K758j272l425L359J895o6K354j534l345m92J877K579p69l38k119
1279B02l439L093L970k121r75k849l526K287K716J681l009k118l01R86L358L092
1295C047l042k756O71m59L168J821j194j511j071J787J307Q10J173k828k307J575
1311A91J8j034K347k062j762n98J73J976L54K51k040l104J977J147k01K242j402
$$ plain form
1328 -1527 -3872 -2561 -1056 1929 2879 1661 -24 -2474 -1081 2592 2292 1486 -23 -3333 -966 2297
1344 2297 3221 2179 -1209 -3207 -2989 -1635 1274 -160 -3805 -3636 -4878 -1555 2122 999 -1112 -2647
1360 -2647 -3084 -390 1777 2662 845 -2749 -1005 1921 3188 4788 3182 243 956 785 1794 1913
1376 1913 1417 60 -2405 -2076 790 593 1757 987 -2949 -3163 -1914 -299 739 -1133 -2021 -2489 -1395
1393 -1395 1498 1969 2136 2460 -1180 -390 2063 3053 3830 2084 -1342 -877 995 4496 4390 250 -1210
1410 -1210 -2192 -35 2159 1162 -1758 -3019 -4402 -2508 324 902 7 -2879 -3625 -1965 -282 2043
1426 2043 655 -2306 -2721 -1377 1599 4005 1780 75 -118 50 1340 1476 920 257 -1879 -1638 -1269
1443 -1269 -1431 1199 622 -1887 -2928 -3375 -1607 -614 -1644 -2961 -4786 -3414 -1293 -738 912 249
$$ packed form
1328a527k345J311J505K985R50j218j685k450J393L673l00q06j509l310K367L263
1344B297R24j042l388j998K18J354K909j434l645J69j242L323L677j123k111j535
1360b647m37K694K167Q85j817l594J744K926J267J600j606k939P13j71J009J19
1376A913m96j357k465L29K866j97J164p70l936k14J249J615J038j872q88m68J094
1393a395K893M71J67L24l640P90K453R90P77j746l426M65J872L501j06m140j460
1410a210r82K157K194r97k920j261j383J894K832N78q95k886p46J660J683K325
1426B043j388k961m15J344K976K406k225j705j93J68J290J36n56o63k136K41L69
1443a269j62K630n77k509j041m47J768R93j030j317j825J372K121N55J650o63
$$ plain form
1459 249 -2800 -1382 -117 549 2276 887 -1227 -2405 -940 2342 3086 1647 -847 -2853 -269 2603
1475 2603 636 -637 -2211 -4361 -2516 -251 -158 -937 -1643 -1512 -2558 -1660 797 -624 -1335 -857 -2801
1492 -2801 -687 2737 2389 886 315 771 1531 2041 3393 1171 -369 867 -306 -753 2366 1531 546
1509 546 -156 -1910 -1374 851 1895 -1859 -4259 -2860 -1317 -1083 2437 421 -3152 -236 1238 1622
1525 1622 2644 2061 -18 -410 1284 2717 1050 3894 3131 -1677 444 3420 1305 2071 1105 -2495
1541 -2495 -2773 -214 1156 -372 -439 -587 -3519 -1463 1422 -692 -78 -210 -3987 -3237 1511 2436 1064
1558 1064 370 37 -1534 2133 6370 2051 -1324 -270 -1118 543 4179 1646 -1957 -1231 183 -387
1574 -387 976 1131 -2364 -4607 -941 -1190 -2471 -44 -879 -3680 -1073 25 -642 -260 1032 117 -2108
$$ packed form
1459B49l049J418J265O66J727j389k114j178J465L282P44j439k494k006K584K872
1475B603j967j273j574k150J845K265R3p79p06J31j046Q98K457j421p11M78j944
1492b801K114L424l48j503n71M56P60N10J352k222j540J236j173m47L119q35r85
1509E46p02j754N36K225J044l754k400J399J543K34L520k016l573K916J474L84
1525A622J022n83k079l92J694J433j667K844p63m808K121K976k115P66r66l600
1541b495k78K559J370j528o7j48k932K056K885k114O14j32l777P50M748R25j372
1558A064o94l33j571L667M237m319l375J054q48J661L636k533l603P26J414n70
1574c87J363J55l495k243L666k49j281K427q35k801K607J098o67L82J292r15k225
$$ plain form
1591 -2108 345 631 -923 2641 3177 -1937 -340 1412 804 2134 2460 -1112 -3527 -1494 1165 118
1607 118 408 -686 -6216 -2529 2405 141 -1654 -1396 -4869 -3510 1640 2200 -1593 -2230 -608 -1334
1623 -1334 1991 5467 647 -1587 675 463 498 2799 1564 -1890 -631 1957 421 -324 1934 -361
1639 -361 -2660 -211 -1493 -3643 -491 -264 -2002 -1671 -946 -1779 -772 2982 1248 -2701 -473 -330
1655 -330 -965 3326 3335 -990 -886 1159 2107 2956 3606 283 -3574 -440 2460 375 450 -811 -4848 -1808
1673 -1808 2459 399 -1130 -1014 -2627 -3798 -442 1780 -1329 -1925 -43 -1844 -552 3450 1304
1688 1304 -159 1443 643 -276 1439 2523 280 -385 1609 -603 -519 3610 1639 -1024 19 -1315
1704 -1315 -2528 -412 1210 -1070 -2853 -1713 -1653 -408 2975 1505 -2562 -1706 -581 -480 1909 1534
$$ packed form
1591b108K453K86j554L564N36n114J597J752o08J330L26l572k415K033K659j047
1607A18K90j094n530L687M934k264j795K58l473J359N150N60l793o37J622p26
1623a334L325L476m820k234K262k12L5K301j235l454J259K588j536p45K258k295
1639c61k299K449j282k150L152K27j738L31P25q33J007L754j734l949K228J43
1655c30o35M291Rm325J04K045R48Q49O50l323l857L134K900k085P5j261m037L040
1673a808M267k060j529J16j613j171L356K222l109n96J882j801J292M002k146
1688A304j463J602q00r19J715J084k243o65J994k212Q4M129j971k663J043j334
1704a315j213K116J622k280j783J140O0J245L383j470m067Q56J125J01K389l75
$$ plain form
1720 1534 -1032 -2176 864 2790 2567 3174 1282 -2212 429 2406 436 1260 336 -2713 -1418 867
1736 867 804 431 391 -855 -3339 -1464 933 -872 -1124 -1213 -3548 -2072 859 1412 1246 386 78 -232
1754 -232 976 3024 1885 8 638 -778 -77 2719 2298 138 -1080 -1069 -1283 -727 279 -580 -3087
1771 -3087 -2154 -1947 -1334 1081 188 -2219 -1898 -1354 -312 391 536 -485 -2121 -1101 1242 1203 2881
1788 2881 1908 -303 264 1130 1840 1664 604 -1189 -1464 -1383 969 551 379 -380 -2246 -1720 79 -210
1806 -210 -231 -1727 -2823 -1910 -531 786 924 -663 -170 -262 254 2232 1557 1317 131 -345 676 1705
1824 1705 2211 1923 393 -308 320 499 1189 372 -1333 -1547 -692 -362 849 70 -346 -803 -1337 -427 -84
1843 -84 770 932 -1385 -1305 460 1746 2562 2132 1461 475 1117 2842 2950 895 447 -483 -77 1207 2079
$$ packed form
1720A534k566j144L040J926k23O07j892l494K641J977j970Q24r24l049J295K285
1736H67o3l73m0j246k484J875K397j805k52q9k335J476K931N53j66q60l08l10
1754b32J208K048j139j877O30j416P01K796m21k160j218J1k14N56J006q59k507
1771c087R33K07O13K415q93k407L21N44J042P03J45j021j636J020K343l9J678
1788B881r73k211N67Q66P10j76j060j793k75Q1K352m18j72p59j866N26J799k89
1806b10k1j496j096R13J379J317J38j587M93r2N16J978o75k40j186m76J021J029
1824A705N06k88j530p01O28J79O90q17j705k14Q55L30J211p79m16m57n34R10L43
1843h4Q54J62k317Q0J765J286Q16m30o71r86O42J725J08k055m48r30M06J284Q72
$$ plain form
1862 2079 901 304 -760 -678 184 485 950 -1293 -1941 -1521 -1331 761 1463 -408 -737 -499 469 1728
1880 1728 1495 968 751 -156 1519 1010 2048 2114 979 956 762 909 1367 1610 536 -907 -1640 -832 647
1899 647 100 -368 -983 -1956 -638 -788 6 -116 -1619 -1276 -1617 -689 1704 1124 760 51 -185 1637 2687
1918 2687 2098 391 -1288 -598 597 1345 1120 212 -1393 -336 151 574 573 -467 -2021 -2517 -1806 -690
1936 -690 -367 -128 -1003 -2171 -508 1141 1065 980 -85 -1195 -23 1282 1730 1056 437 752 266 1171
1954 1171 2179 1388 352 39 -1188 -396 483 757 107 -1049 -1326 -595 -177 1269 86 -1653 -1277
1971 -1277 -696 -733 1425 846 376 -576 256 1429 1678 2562 1772 -292 154 513 666 3054 1530 -537
1989 -537 -250 458 1446 1282 697 -395 -2380 -945 419 -296 -363 -522 -2598 -983 1240 1449 281 41
$$ packed form
1862B079j178n97j064Q2Q62L01M65k243o48M20J90K092P02j871l29K38R68J259
1880A728k33n27k17r07J675n09J038O6j135k3j94J47M58K43j074j443p33Q08J479
1899F47n47m68o15r73J318j50P94j22j503L43l41R28K393n80l64p09k36J822J050
1918B687n89j707j679O90J195P48k25r08j605J057M87M23jj040j554m96P11J116
1936f90L23K39q75j168J663J649p6q5j065j110J172J305M48o74o19L15m86R05
1954A171J008p91j036l13j227P92Q79K74o50j156k77P31M18J446j183j739L76
1971a277N81l7K158n79m70r52Q32J173K49Q84p90k064M46L59J53K388j524k067
1989e37K87P08R88j64n85j092j985J435J364p15o7j59k076J615K223K09j168k40
$$ plain form
2007 41 -650 -691 722 1869 653 372 1435 -313 1322 2827 1800 609 1217 171 -616 139 727
2024 727 367 -318 329 -1227 -1206 1242 536 -1020 -636 -1099 -1873 -526 869 322 -1107 -115 245 393
2042 393 2859 2437 -761 -530 368 937 2277 1798 -394 -1116 745 1361 426 1480 591 -2755 -1200
2059 -1200 740 -899 -820 131 -2019 -1370 197 664 -764 -161 -23 -1713 -627 978 -390 629 1336
2076 1336 -120 -824 1838 2341 1118 1623 983 -699 -1301 1899 959 -481 497 -1447 -1811 1724 1657
2093 1657 -226 -1194 -1412 -1774 -637 1551 -335 -2897 -1175 -289 -1149 1991 1508 -1260 -280 1418 877
2110 877 1227 1899 224 -1088 1363 1904 403 1128 1650 -916 -103 1247 -777 -1196 -24 -356 -1745
2127 -1745 -676 619 -870 140 1154 -1550 -1673 826 -60 13 1082 -454 -1046 799 2557 1271
$$ packed form
2007D1o91m1J413J147j216k81J063j748J635J505j027j191O08j046p87P55N88
2024G27l60o85O47j556K1K448p06j556L84m63p74J347J395n47j429R92L60J48
2042C93K466m22l198K31Q98N69J340m79k192p22J861O16r35J054q89l346J555
2059a200J940j639P9R51k150O49J567M67j428O03J38j690J086J605j368J019P07
2076A336j456p04K662N03j223N05o40j682o02L200r40j440R78j944l64L535o7
2093A657j883r68k18l62J137K188j886k562J722Q86q60L140m83k768R80J698n41
2110H77L50O72j675j312K451N41j501P25N22k566Q13J350k024m19J172l32j389
2127a745J069J295j489J010J014k704j23K499q86P3J069j536n92J845J758j286
$$ plain form
2143 1271 1526 1519 -714 86 2807 1020 -731 -41 -1115 -852 1132 1538 -599 -1818 -237 -618 -752
2160 -752 1026 -366 -2224 -494 -240 -1258 581 1312 -402 -23 1307 599 21 1883 1371 -88 702
2177 702 1074 99 1598 2247 77 -483 199 -180 37 1257 327 -2204 -1601 615 -68 504 658 -1832
2195 -1832 -1870 381 571 295 116 -396 -1293 180 2060 1389 794 1171 647 290 2840 1208 69 389
2213 389 72 -148 -25 676 107 -725 198 329 -620 577 147 -838 -591 -619 -1268 79 504 -48 -620 -535
2233 -535 167 -328 1430 1254 -236 -397 72 433 1599 1308 839 -292 -23 954 586 883 295 -1996
2251 -1996 -1087 209 145 109 139 -1632 -1776 -778 -136 -244 -1049 -927 -1859 -1290 866 93 349 1150 413 547
2271 547 1311 1315 1024 418 401 189 -583 917 625 59 -27 -508 -606 209 193 -305 -627 -1455 -1362 -727 93 270
$$ packed form
2143A271K55pk233Q00K721j787j751O90j074K63J984M06k137j219J581l81j34
2160g52J778j392j858J730K54j018J839P31j714L79J330p08n78J862n12j459P90
2177G02L72r75J499O49k170n60O82l79K17J220r30k531O03K216o83N72J54k490
2195a832l8K251J90k76j79n12q97J473J880o71n95L77n24l57K550j632j139L20
2213C89l17k20J23P01n69q32R23J31r49J197m30r85K47k8o49J347M25n52n72Q5
2233e35P02m95J758j76j490j61M69L61J166k91m69j131K69R77l68K97n88k291
2251a996R09J296o4l6L0j771j44R98O42j08q05J22r32N69K156p73K56Q01p37J34
2271E47P64Mk91o06j7k12p72J500k92n66q6m81r8Q15j6m98l22q28R3O35Q20J77
$$ plain form
2293 270 -901 -843 -195 -80 1060 606 19 -141 -207 555 1580 1321 1299 569 279 953 962 1104 1123 -488 -652
2314 -652 78 239 1025 60 -383 -627 -852 196 530 -100 -409 -1679 -1443 81 256 812 574 -675 853
2333 853 849 1285 1960 625 668 80 300 1241 801 746 447 -661 -138 418 681 592 -607 -1682 -1093 -885
2353 -885 -339 -338 -1262 -793 -661 -249 498 356 127 -465 -1213 247 674 607 618 -27 28 514 580 1598 814
2374 814 -198 -223 -594 -280 367 65 -738 -1162 -1164 -153 -38 -80 -397 -1656 -1256 -762 -76 175 -1072 -1010
2394 -1010 -249 -82 817 1215 360 463 -403 144 539 76 717 371 -760 214 111 423 963 17 -306
2413 -306 -978 -764 -184 -451 -1263 -1115 -949 -352 -408 198 362 -555 -724 -525 -58 322 1065 62 365 32
2433 32 538 1751 1229 667 166 -76 133 654 91 18 -706 -863 147 -578 191 189 -408 -775 -697 -263 241
$$ packed form
2293B70j171N8O48J15J140m54n87j60o6P62J025k59k2p30k90O74RJ42J9j611j64
2314f52P30J61P86r65m43k44k25J048L34o30l09j270K36J524J75N56k38j249J528
2333H53mM36O75j335M3n88K20R41m40n5k99j108N23N56K63q9j199j075N89K08
2353h85N46Jr24M69J32M12P47j42k29n92p48J460M27o7J1o45N5M86O6J018p84
2374H14j012k5l71L14O47l02q03m24kJ011J15m2l17j259M00M94O86K51j247O2
2394a010P61J67Q99L98q55J03q66N47L95m63O41l46j131R74j03L12N40r46l23
2413c06o72K14N80k67q12J48J66N97n6O06J64r17j69J99M67L80P43j003L03l33
2433C2N06J213n22n62n01k42K09N21n63p3p24j57J010p25P69kn97l67P8M34N04
$$ plain form
2454 241 -82 -445 -425 -549 576 586 885 1128 -39 -15 521 248 930 1067 139 100 84 1290 1171 737 197
2475 197 -138 -537 355 -142 -565 -299 -870 -836 -3 329 -144 -688 -368 -209 -723 870 108 -757 -84 408
2495 408 20 1312 1292 1002 158 633 398 233 766 348 -746 -906 13 -775 -269 695 -596 -1163 -1054
2514 -1054 -298 -964 -307 -362 -1540 -1126 -148 -23 491 921 -181 -358 714 484 969 212 65 -194 267
2533 267 1165 706 233 1048 -554 -370 568 131 -749 -680 -1073 -981 -685 390 -522 -734 -182 -920 -906 92
2553 92 279 -865 -155 -491 -614 455 1198 995 495 686 200 -75 819 1314 -441 -530 -487 -653 508 737
2573 737 120 -1056 -503 -486 -434 135 246 -1504 -769 355 -516 13 259 -728 -681 692 1018 222 213 88
2593 88 -460 -72 1540 394 -318 740 781 -306 177 833 -171 373 180 -546 -439 374 -180 -220 178
$$ packed form
2454B41l23l63K0j24J125J0K99K43j167K4N36k73O82J37r28l9j6J206j19m34n40
2475A97l35l99Q92m97m23K66n71L4Q33L32m73n44L20J59n14J593p62q65O73M92
2495D08l88J292k0k90q44M75k35j65N33m18j094j60R19p88N06R64j291n67J09
2514a054P56o66O57n5j178M14R78J25N14M30j102j77J072k30M85p57j47k59M61
2533B67Q98m59m73Q15j602J84R38m37q80O9l93R2K96J075r12k12N52p38J4R98
2553I2J87j144P10l36j23J069P43k03n00J91m86k75Q94M95j755q9M3j66J161K29
2573G37o17j176N53J7N2N69J11j750P35J124q71N29K46r87M7J373L26p96rj25
2593H8n48L88J612j146p12J058M1j087M83O56j004N44j93p26J07Q13n54m0L98
$$ plain form
2612 178 -498 -1374 257 -42 -640 -664 -576 -1162 -685 1366 1036 -80 424 649 -70 1452 1702 -117 -525
2631 -525 -256 0 435 1322 453 -1275 -585 803 -72 169 110 -1857 -1181 85 -626 -544 -4 -296 -385 21
2651 21 482 -252 410 979 122 -49 1033 468 268 1354 1115 -221 -30 1321 624 229 291 -740 -1421
2670 -1421 435 390 -16 -50 -624 -1229 -197 908 14 -915 -471 -906 -463 1158 1236 -433 145 314 373
2689 373 1694 1160 232 -290 -340 454 347 1243 470 -690 495 438 -359 277 211 -522 -813 -636 -779 -810
2709 -810 -251 -413 -740 -1081 -157 -516 -12 354 -325 -295 -126 247 477 1121 552 -426 -6 1201 839 216
2729 216 352 -1072 -1105 744 173 -98 -288 -389 -866 -284 455 -233 -884 -396 -935 -960 227 134 -720 -287
2749 -287 50 -150 281 543 291 -253 250 320 315 401 543 -323 441 269 -79 241 870 208 -481 -106 -369
$$ packed form
2612A78o76q76J631k99n98k4Q8n86M77K051l30j116N04K25p19J522K50j819m08
2631e25K69K56M35Q87q69j728O90J388q75K41n9j967O76J266p11Q2N40k92q9M06
2651B1M61p34O62N69q57j71J082n65k00J086k39j336J91J351o97l95O2j031o81
2670a421J856m5m06l4n74o05J032J105q94r29M44m35M43J621P8j669N78J69N9
2689C73J321n34r28n22n0P94j07Q96p73j160J185n7p97O36o6p33k91J77j43l1
2709h10N59j62l27l41R24l59N04L66o79L0J69L73K30O44n69r78M20J207l62o23
2729B16J36j424l3J849n71k71j90j01m77N82P39o88o51M88n39k5J187r3q54M33
2749b87L37k00M31K62k52n44N03P0nQ6J42q66P64j72l48L20O29o62o89L75k63
$$ plain form
2770 -369 -498 227 -324 -929 -910 -404 -544 -47 534 -15 -510 -168 83 451 664 552 228 514 831 966
2790 966 888 765 255 -98 153 250 439 312 85 -366 -189 451 -32 -106 111 -860 -1034 -65 162 -205 -550
2811 -550 -309 69 -34 530 705 374 177 315 398 644 261 524 118 -5 67 436 547 318 -226 -780 -316
2832 -316 -33 -46 62 -1077 -948 -763 -396 353 85 -375 -544 -870 83 124 142 657 -166 -627 688 603 493
2853 493 630 75 421 -148 283 433 255 -465 -428 -633 270 -215 169 -124 -663 -896 -516 -405 -567 -558 -888
2874 -888 -646 327 54 590 -319 -276 -127 -352 430 576 -76 159 -300 132 912 913 890 -342 269 18 -389
2895 -389 -21 -48 -738 -598 -861 -275 -199 -20 -472 -613 -637 -216 209 -5 574 -589 -222 31 -261 583 525
2916 525 173 303 27 983 934 502 259 -154 3 202 85 -254 439 -106 -465 -370 -103 -256 -580 -507 -346
$$ packed form
2770c69j29P25n51o05J9N06j40M97N81n49m95L42K51L68K13j12l24K86L17J35
2790I66p8j23n10l53K51R7J89j27k27m51J77O40m83p4K17r71j74R69K27l67l45
2811e50K41L78j03N64J75l31j97J38Q3K46l83K63m06j23P2L69J11k29n44n54M64
2832c16K83j3J08j139J29J85L67P49k68m60j69l26R53M1J8N15q23m61J315q5j10
2853D93J37n55L46n69M31J50j78p20L7k05R03m85L84k93n39k33L80J11j62Rl30
2874h88K42R73k73N36r09M3J49k25P82J46o52K35m59M32P80Jk3j232O11k51m07
2895c89L68k7o90J40k63N86P6J79m52j41k4M21M25k14N79j163L67K53k92Q44n8
2916E25l52J30k76R56m9m32k43m13J57J99j17l39O93n45l59R5K67j53l24P3J61
$$ plain form
2937 -346 -285 -234 -74 118 280 -221 47 517 685 39 204 33 -167 814 1060 726 365 186 134 49 544
2958 544 410 -178 -495 -766 -134 -186 -355 16 -870 -847 -255 59 -72 -37 -462 -552 -423 262 81 302 715
2979 715 388 90 405 680 -262 484 76 -224 34 -265 423 7 100 264 -297 107 215 -503 -248 -1128
2999 -1128 -817 -230 -259 -199 69 -279 -176 -244 107 294 181 -238 -50 -212 966 672 249 -40 -29 254 495
3020 495 842 61 -331 -142 -199 -516 -29 326 -488 -742 12 -491 -40 149 -150 -569 -286 -445 -71 84
3040 84 714 -675 58 1150 386 305 1011 491 -84 -134 401 236 225 598 -156 -469 190 386 -119 741 -445
3061 -445 -1599 -523 289 -82 -409 -351 -697 -574 706 208 -863 -256 71 -272 674 655 170 326 649
3080 649 209 68 655 274 405 385 457 -400 48 386 -70 -353 168 -500 -204 382 -182 -528 -494 -613 -216
$$ packed form
2937c46O1N1J60J92J62n01K68M70J68o46J65j71k00R81K46l34l61j79n2q5M95
2958E44j34n88l17k71O32n2j69L71q86K3N92L14j31L5m25r0J29O85j81K21M13
2979G15l27k98L15K75r42P46m08l00K58k99O88m16R3J64n61M04J08p18K55q80
2999a128L11N87k9O0K68l48J03o8L51J87j13m19J88j62J178k94m23k89J1K83K41
3020D95L47p81l92J89n7l17M87L55q14k54P54n03M51J89k99m19K83j59L74J55
3040H4O30j389P33J092p64q1P06n20n75n0N35j65j1L73p54l13O59J96n05Q60j186
3061d45j154J076Q12l71l27N8l46J23J280m98j071O07L27l43R46j9m85J56L23
3080F49m40j41N87l81J31k0P2q57M48L38m56k83N21o68K96N86n64l46L4j19L97
$$ plain form
3101 -216 -155 631 -161 -475 432 130 442 1268 57 -906 -120 504 206 843 278 266 -256 598 314 599
3121 599 567 -212 -597 -201 -584 -109 -686 -222 -32 -628 122 -105 -444 573 -161 -880 -32 110 164 426
3141 426 293 221 -72 441 665 318 639 16 -205 180 222 74 -283 -353 -244 -353 599 66 -827 -466 -334
3162 -334 -515 -104 269 -315 -812 305 541 416 541 326 -318 489 669 330 36 598 16 -297 570 -30
3182 -30 -170 672 335 -445 -30 -1 -405 -470 -100 -507 -984 -1 -166 -53 303 -44 -969 -571 -95 579 29
3203 29 18 -410 -12 744 864 444 507 -18 -34 687 392 -82 -551 -442 18 -335 380 25 -782 -369 -491
3224 -491 -270 -427 -121 -889 -380 -342 361 -2 1 424 142 539 223 84 78 522 427 165 -55 59 726 617
3246 617 95 -193 -319 51 309 -561 221 -161 -902 -385 418 -93 5 -73 -506 -365 -51 -133 -421 -8 -255
$$ packed form
3101b16O1P86p92l14R07l02L12Q26j211r63P86O24k98O37n65j2n22Q54k84K85
3121E99l2p79l85L96l83M75n77M64J90n96P50k27l39J017p34p19Q48J42N4K62
3141D26j33p2k93N13K24l47L21o23k21L85M2j48l57p0J09j09R52n33q93L61J32
3162c34j81M11L73n84m97J117K36j25J25k15o44Q07J80l39k94N62n82l13Q67o00
3182c0j40Q42l37p80M15K9m04o5L70m07m77R83j65J13L56l47r25L98M76O74n50
3203B9j1m28L98P56J20m20O3n25j6P21k95m74m69J09M60l53P15l55q07M13j22
3224d91K21j57L06p68N09L8P03l63LM23k82L97l16j39oM44r5k62k20J14O67j09
3246F17n22k88j26L70K58q70P82l82p41N17Q03n11R8p8m33J41L14q2k88M13k47
$$ plain form
3267 -255 -188 522 722 -361 689 399 80 66 228 243 64 -194 -232 -233 -212 275 -376 -248 -194 -391 -180 -188 -340
3290 -340 -227 -392 -698 -515 -110 349 -179 -348 178 -108 475 218 -160 -2 138 323 399 442 791 -21 -180
3311 -180 444 144 191 103 -766 -865 -187 -476 70 -58 -400 -745 -459 261 -204 -577 -280 -281 -974 380 166
3332 166 337 392 302 221 406 108 658 398 260 202 -263 -187 461 -276 -184 -156 -1007 -168 -261 86 -251 -968 -25
3355 -25 -217 -231 365 -420 -457 169 -31 145 608 230 -101 271 -239 799 118 260 -108 -137 -43 385 269
3376 269 145 71 -650 -300 -115 19 -164 135 77 -566 -569 41 -285 52 -746 -552 -390 -4 256 -326 129
3397 129 203 -50 397 787 223 41 33 -478 56 61 89 204 2 -27 100 186 -48 -127 -122 -509 -803 -32 106 -552
3421 -552 246 -570 -17 77 267 478 14 -808 254 539 228 231 95 317 286 180 375 242 -200 -140 -57 103
$$ packed form
3267b55O7P10K00j083J050k90l19j4J62J5j79k58l8jK1M87o51J28N4j97K11qj52
3290c40J13j65l06J83M05M59n28j69N26k86N83k57l78J58J40J85P6M3L49q12j59
3311a80O24l00M7q8q69r9O78k89N46j28l42l45K86P20m65l73K97jo93J354k14
3332A66J71N5r0q1J85k98N50k60j38n8m65P6O48p37R2K8q51Q39r3L47l37p17R43
3355b5j92j4N96p85l7O26k00J76M63l78l31L72n10J038o81J42l68k9R4M28j16
3376B69j24p4p21L50J85J34j83K99n8o43lO10l26L37p98J94J62L86K60n82M55
3397A29P4k53M47L90n64j82qn11N34NK8J15k02k9J27Q6k34p9Nl87k94P71J38o58
3421e52P98q16N53R4J90K11m64q22J062K85l11Lj36K22l1j06J95j33m42O0Q3J60
$$ plain form
3443 103 79 -287 177 -750 -456 -244 145 -589 -470 -241 -123 -318 -265 141 -210 -95 24 -117 416 560 367
3464 367 686 392 -327 -59 136 437 56 15 86 245 18 287 29 31 -322 -72 -112 7 -154 -326 -364 -479
3486 -479 486 67 -312 -108 86 -67 534 -165 460 5 517 85 310 279 809 754 -20 370 -102 11 -34
3507 -34 -333 -76 -69 204 -215 -18 -143 -471 -479 -637 342 -23 -297 -156 -168 -165 -7 365 14 375 8 -548 259
3530 259 91 201 64 103 -309 -88 238 302 -289 78 -131 -679 -523 43 -357 -648 -677 -168 -300 139 195
3551 195 -257 -186 -144 -159 25 432 30 285 -6 526 -171 656 107 106 240 177 320 -385 316 104 195 -436
3573 -436 -513 -110 -68 503 -209 -282 -43 -151 -405 283 -159 -625 -124 -180 287 402 335 -96 -85 381 746 361
3595 361 -85 -236 -107 526 515 340 386 53 447 121 534 -82 -437 -160 -380 -151 -152 142 -708 291 259 -539
$$ packed form
3443A03k4l66M64r27K94K12L89p34J19K29J18j95N3M06l51J15J19j41N33J44j93
3464C67L19k94p19K68J95L01l81m1P1J59k27K69k58Kl53K50m0J19j61j72l8j15
3486d79R65m19l79K04J94j53O01o99O25m55N12m32K25l1N30n5p74L90m72J13m5
3507c4k99K57PK73m19J97j25l28qj58R79l65k74J41j2LJ58L72l51L61l67n56Q07
3530B59j68J10j37L9m12K21L26O4n91L67k09n48J56N66m00k91k9N09j32M39N6
3551A95m52P1M2j5J84M07m02K55k91N32o97Q27n49jJ34o3J43p05P01k12R1o31
3573d36p7M03M2N71p12p3K39j08k54O88m42m66N01n6M67J15o7m31J1M66L65l85
3595C61m46j51J29O33j1j75M6l33L94l26M13o16l55K77k20K29jK94q50R99l2p98
$$ plain form
3617 -539 -154 15 -139 135 373 354 -78 156 176 146 -57 576 320 213 556 -169 -540 279 -171 245 -12
3638 -12 190 -474 -60 230 -172 -576 -46 -282 -282 -292 361 512 324 -31 -96 -316 388 572 -681 132 267
3659 267 -185 335 177 -378 7 316 598 -524 -179 38 -203 -322 459 -389 -230 -87 -416 -587 -253 -505
3679 -505 148 232 62 149 -668 -189 17 -210 435 137 -40 -314 183 350 484 56 -568 117 375 145 220
3700 220 117 -645 -110 504 347 -374 -151 -365 -496 -150 380 -317 -237 303 -239 -51 -81 -276 248 277 79
3721 79 -34 441 284 358 415 450 281 -40 179 514 99 78 70 -213 -67 231 331 153 -423 -456 -168 693 140
3744 140 -724 -493 -84 194 -176 107 -689 -393 53 554 347 103 198 -63 -302 147 -289 -125 455 426 -67
3765 -67 132 21 -13 304 -124 -147 -470 -330 -426 -260 -116 -480 -244 -111 -69 -95 553 -93 -96 -258 422 163 99
$$ packed form
3617e39L85J69j54K74K38j9m32K34K0l0k03O33k56j07L43p25l71Q19m50M16k57
3638a2K02o64M14K90m02m04N30k36%j0O53J51j88l55o5k20P04J84j253Q13J35
3659B67m52N20j58n55L85L09K82j122L45K17k41j19P81q48J59J43l29j71L34k52
3679e05O53Q4j70Q7q17M79K06k27O45k98j77k74M97J67J34m28o24O85K58k30P5
3700B20j03p62N35O14j57p21K23k14j31L46N30o97Q0N40n42J88l0j95N24K9j98
3721G9j13M75j57P4N7L5j69l21K19L35m15k1qk83J46K98J00j78n76l3K88Q61n53
3744A40q64K31M09K78l70K83p96K96M46N01k07k44R5k61k39M49m36J64N80k9m93
3765f7J99j11l4L17m28k3l23J40r6J66J44l64K36J33M2k6O48o46lj62O80k59o4
$$ plain form
3788 99 173 523 86 238 269 271 314 231 -254 -366 131 1 -282 -102 10 -723 65 -71 -3 41 -260 89 469
3811 469 164 -83 129 106 139 435 111 653 135 -75 104 -524 301 -39 -8 276 -8 -209 470 -256 37
3832 37 -330 -35 43 -268 -89 -240 -634 117 33 247 171 -125 128 -17 66 -25 137 388 826 -349 414 304
3854 304 336 -20 542 114 19 426 222 -181 396 -35 -112 -559 -58 -361 -346 -137 -816 -619 -154 -2 83 -86
3876 -86 -122 244 161 194 567 219 333 -283 -15 133 84 118 172 18 319 93 296 -77 -698 -331 90 -211
3898 -211 80 -114 -718 -256 13 139 10 233 -117 -44 -76 -168 39 110 313 -35 -56 236 -27 222 314 -471
3920 -471 477 265 398 500 -175 129 39 140 166 -235 396 133 145 -378 -82 -126 -412 -166 -411 -25 -26 85
3942 85 164 -71 261 123 133 198 75 -379 -337 -185 74 315 186 696 102 -21 -373 18 -218 -66 -56 143
$$ packed form
3788I9P4L50m37J52L1KM3q3m85j12M97j30k83J80J12p33P88j36O8M4l01L49L80
3811D69l05k47K12k3L3K96l24N42n18k10J79o28Q25l40L1K84k84k01O79p26K93
3832C7l67K95P8l11J79j51l94P51q4K14p6k96K53j45Q3r1J62K51M38j175P63j10
3854C04L2l56N62m28r5M07k04m03N77m31p7m47N01l03J5K09o79J97M65J52Q5j69
3876h6l6L66q3L3L73l48J14o16K68J48m9L4N4j54L01k26K03l73o21L67M21l01
3898b11K91j94o04M62K69J26j29K23l50P3l2r2K07P1K03l48k1K92k63K49R2p85
3920d71R48k12J33J02o75L04r0J01K6m01O31k63J2n23K96m4k86K46k45L86jJ11
3942H5P9k35L32j38J0O5j23m54M2J52K59K41j29N10n94j23l52L91k36J52J0J99
$$ plain form
3964 143 -43 -374 120 -468 -180 203 -152 -157 8 -199 327 -163 -33 -252 454 413 142 -291 165 115 255
3985 255 106 320 -189 41 -57 -54 -53 -151 64 -369 1 -528 -4 -111 -200 -260 288 -312 195 180 133 -210 -7
4008 -7 -122 -99 218 157 -20 -286 -196 632 112 312 -51 -58 394 -251 88 -39 -27 39 -202 -204 -68 -242 -23 -108
4032 -108 -126 -231 -271 -440 -20 -389 -496 -631 519 -12 125 83 -108 95 -311 274 146 91 350 227 130
4053 130 156 354 350 211 153 -299 207 -88 233 -274 -355 -461 -339 238 126 -102 569 181 136 -27 137 165
4075 165 27 -93 62 276 157 132 5 204 109 168 159 226 21 -124 96 -185 201 -34 -317 -146 -375 469
4097 469 93 241 322 -266 -489 -74 -267 -253 361 145 239 226 -48 196 355 297 20 -50 72 138 -85 238
4119 238 55 -672 -151 -237 306 16 -394 -368 -265 290 -258 -108 -54 151 -520 -188 129 -18 156 -111 45
$$ packed form
3964A43j86l31M94n88K88L83l55nJ65k07N26m90J30k19P06m1k71m33M56n0J40
3985B55j49K14n09K30r8LJr8K15m33L70n29N24j07q9o0N48o00N07j5m7l43K03
4008gj15K3L17o1j77k66R0Q28n20K00l63pM52o45L39j27J2O6k41kJ36j74K19q5
4032a08j8j05m0j69M20l69j07j35J150n31J37m2j91K03m06N85j28n5K59j23r7
4053A30K6J98mj39n8m52N06k95L21n07q1j06J22N77j12k28O71l88m5j63J64K8
4075A65j38j20J55K14j19k5j27J99r5N9rO7k05j45K20k81L86k35k83J71k29Q44
4097D69l76J48Q1n88k23M15j93J4O14k16R4j3k74K44J59n8k77p0J22O6k23L23
4119B38j83p27N21q6N43k90m10K6J03N55n48J50N4K05o71L32L17j47J74k67J56
$$ plain form
4140 45 -326 597 -92 221 172 295 733 -79 214 234 142 245 -479 -31 314 -33 75 278 -100 -89 -2 -17
4162 -17 -11 68 -139 -762 -381 360 -425 -505 -143 708 -194 56 -176 141 -34 315 424 -260 75 -95 28 430
4184 430 356 -12 318 165 -504 -266 -80 -164 -4 42 226 -161 -289 -52 -254 -423 172 -236 -71 310 390
4205 390 256 36 698 221 33 355 -119 223 313 -263 -244 307 153 -92 -486 -144 -38 -116 -138 -140 -281 -16
4227 -16 -263 -81 -53 66 -116 -193 285 -4 -239 -135 -123 339 454 713 254 307 -19 -15 702 181 89 349 403
4250 403 -339 -340 87 53 203 -186 -222 127 -222 102 -162 4 345 354 -278 -241 75 259 -52 183 67 -77
4272 -77 412 176 402 483 153 168 313 60 -100 -311 234 122 -220 204 -135 -167 -315 -330 -623 -170 -112 -203
4294 -203 -43 -268 275 -283 255 -361 476 156 96 272 276 -8 76 -230 184 -55 184 628 -239 -363 423
$$ packed form
4140D5l71R23o89L13m9J23M38q12K93K0r2J03p24M48L45l47J08K03l78J1Q7j5
4162a7OP9k07o23L81P41p85q0L62Q51r02K50k32L17j75L49J09o84L35j70J23M02
4184D30p4l68L30j53o69K38J86q4J60M6J84l87j28K37k02j69N95m08J65L81Q0
4205C90j34k20O62m77j88L22m74L42R0n76J9N51j54k45l94L42J06p8k2kj41K65
4227a6k47J82K8J19j82p7M78k89k35J04J2M62J15K59m59N3l26MP17n21r2K60N4
4250D03p42jM27l4J50l89l6L49l49L24k64J66L41Ro32L7L16J84l11K35j16j44
4272g7M89k36K26Q1l30J5J45k53j60k11N45j12l42M24l39l2j48j5k93M53N8r1
4294b03J60k25N43n58N38o16Q37l20o0J76Mk84Q4l06M14k39K39M44q67j24P86
$$ plain form
4315 423 -93 -102 -246 211 -67 175 196 187 64 -160 -130 79 -320 238 188 202 -397 -176 685 154 192 261 114
4338 114 70 -127 39 510 90 113 -31 169 330 537 182 401 21 -429 38 -149 -85 -202 105 -426 -215
4359 -215 -48 280 557 217 3 16 235 -9 -159 -238 198 250 151 -136 92 368 120 180 295 191 14 -134
4381 -134 -124 245 -213 183 -343 -24 160 -406 -446 -462 -308 -67 -681 -44 253 -134 301 496 133 -378 -195
4402 -195 193 73 468 32 -143 461 73 395 148 -176 81 -246 -153 -506 -367 -384 -14 -106 -404 30 410
4423 410 -12 184 -122 368 6 -76 94 136 55 191 -174 8 231 241 349 -55 314 53 89 -65 -147 -190
4445 -190 -3 195 115 -193 -167 -82 -594 -207 -226 -13 187 21 -81 218 389 306 262 -183 505 137 210 -85
4467 -85 -5 215 232 230 -68 -152 -284 -28 267 118 133 -205 269 -18 102 -75 -209 -243 155 -359 -400 262 -250
$$ packed form
4315D23n16rj44M57k78K42K1rj23k24L0K09l99N58n0J4n99K21Q61n31L8O9j47
4338A14m4j97J66M71m20K3j44K00J61K07l55K19l80m50M67j87O4j17L07n31K11
4359b15J67L28K77l40k14J3K19k44j50p9M36N2r9k87K28K76k48O0J15j04j77j48
4381a34J0L69m58L96n26L19J84n66m0j6J54K41o14O37K97l87M35J95l63n11J83
4402a95L88j20L95m36j75O04l88L22k47l24K57l27R3l53J39j7L70r2k98M34L80
4423D10m22J96l06M90l62q2J70M2q1J36l65J82K23J0J08m04L69k61L6j54q2m3
4445a90J87J98q0l08K6Q5n12L87j9K13K00j66j02K99J71q3m4m45O88l68P3k95
4467h5Q0K20J7kk98q4j32K56K95j49J5l38M74k87J20j77j34l4L98n14m1O62n12
$$ plain form
4490 -250 -121 165 -419 -230 -84 346 432 509 -59 -42 279 55 146 59 18 294 67 112 368 -45 172 -136
4512 -136 -31 77 269 -39 59 -81 -472 -440 -4 354 -591 -358 129 -250 60 -90 -87 -8 410 -269 351 -95
4534 -95 331 299 484 262 -13 25 246 -47 -100 -283 -594 -597 97 -263 124 163 -307 -1 87 -35 -90 -5 -27 114
4558 114 -238 617 -201 44 -642 279 278 -398 331 169 -45 45 201 -44 -80 -41 32 42 421 -464 -268 -348 188
4581 188 228 -218 210 373 113 -49 47 208 596 -52 319 -205 59 65 -65 0 -95 -257 163 38 103 230
4603 230 -177 -264 -372 -295 7 -276 -56 395 -10 373 -215 -35 230 193 -468 110 -50 -270 215 116 -348
4624 -348 51 298 -341 -63 -73 -295 -20 41 -146 262 428 160 218 349 345 157 -289 170 44 -45 -19 279
4646 279 -244 12 -98 -432 -216 213 299 -27 109 655 -185 213 263 -420 153 78 -47 139 287 148 109
$$ packed form
4490b50J29K86n84J89J46M30Q6P7n68J7L21k24R1q7m1K76k27M5K56m13K17l08
4512a36J05J08J92l08R8j40l91L2M36L58r45K33M87l79L10j50LP9M18o79O20m46
4534i5M26l2J85k22k75L8K21k93n3j83l11lO94l60L87L9m70L06Q8j22n5Q5k2J41
4558A14l52Q55q18K45o86R21jo76P29j62k14R0J56k45l6L9P3J0L79q85J96q0N36
4581A88M0m46M28J63k60j62R6J61L88o48L71n24K64Oj30O5r5j62M20j25O5J27
4603B30m07q7j08P7L02k83K20M51m05L83n88J80K65l7o61N78j60k20M85r9m64
4624c48L99K47o39K78j0k22K75O1j87M08J66k68N8J31mj88m46M59j26q9K6K98
4646B79n23K56j10l34K16M29Q6l26J36N46q40L98N0o83N73p5j25J86J48j39l9
$$ plain form
4667 109 246 290 -115 -85 486 -150 -310 113 117 -79 81 336 -91 281 268 166 -340 -402 -15 -353 -206 -250
4689 -250 -165 -40 -2 -152 121 -131 107 156 649 -112 -702 -143 -176 491 248 -319 373 -330 52 15 -110 -321
4711 -321 -453 -524 153 -256 64 -110 -126 248 82 424 -174 417 345 185 197 168 174 95 -129 -22 -9 195 221
4734 221 66 -317 -12 133 -140 -380 -75 227 -222 136 -506 -512 191 -268 105 330 -7 -43 -96 99 -244
4755 -244 -139 39 117 -111 438 -86 -291 201 433 291 551 -93 71 303 42 -347 36 -703 -25 123
4775 123 -343 -338 -526 -419 -187 -41 -12 192 233 278 -365 70 -142 -211 544 -299 451 238 47 221 -312 -156
4797 -156 179 -259 -393 -72 -7 -135 -137 -98 183 -247 -310 325 -31 -303 229 -360 -309 280 -49 -258 -365 120
4819 120 367 37 244 -170 -89 321 -140 -155 110 -34 -93 216 -205 192 -104 366 -341 63 -221 -116 100
$$ packed form
4667A09J37M4m05L0N71o36j60M23Mj96J60K55m27L72j3j02n06o2L87l38J47m4
4689b50Q5J25L8j50K73k52K38M9M93p61n90N59l3O67k43n67O92p03L82l7j25k11
4711c21j32p1O77m09L20j74j6L74j66L42n98N91p2j60J2k9Op9k24J07J3K04K6
4734B21j55l83L05J45k73k40L05L02m49L58o42oP03m59L73K25l37l6n3J95l43
4755b44J05J78P8k28N49n24k05M92K32j42K60o44J64K32k61l89L83p39O78J48
4775A23m66Nj88J07K32J46K9K04M1M5o43M35k12o9P55q43P50k13j91J74n33J56
4797a56L35m38j34L21O5j28kL9K81m30o3O35l56k72N32n89N1N89l29k09j07M85
4819A20K47l30K07m14Q1M10m61j5K65j44n9L09m21L97k96M70p07M04k84J05K16
$$ plain form
4840 100 -48 22 -837 225 -171 161 75 260 164 -22 447 67 48 -152 258 286 120 172 294 -84 -360 115
4862 115 124 -342 -336 154 188 -170 107 13 59 106 -12 -235 13 -337 255 164 -59 7 296 -39 544 297 191
4885 191 -45 366 178 492 -169 -228 442 34 5 159 -356 100 -270 -44 -386 -562 -379 -367 -562 -311 -385
4906 -385 -134 -13 155 -79 -270 -310 208 12 82 400 146 16 434 543 294 19 71 444 505 103 137 -180
4928 -180 122 230 -742 26 226 -198 -443 -94 -409 139 -375 -42 110 -520 329 46 94 -43 -233 48
4948 48 -198 -367 451 155 257 667 -326 408 243 188 -214 142 -39 13 -51 218 -165 262 -129 -249 -350
4969 -350 51 -196 -409 -16 -452 108 215 70 -51 -391 251 286 156 84 -56 -90 -156 -372 188 302 444
4990 444 -159 -123 -133 -225 113 -81 99 -364 -171 142 143 -329 103 155 -189 -312 247 -350 -177 276 298 225 26
$$ packed form
4840A00j48P0q59J062l96L32q6J85r6j86M69l80j9k00M10K8j66N2J22l78k76M75
4862A15Rm66OM90L4l58K77r4M6M7j18k23K48l50N92r1k23O6K89l35N83k47j06
4885A91k36M11j88L14o61n9O70m08k9J54n15M56l70K26l42j76J83J2j95K51p4
4906c85K51J21J68k34j91m0N18j96P0L18k54j30M18J09k49k75N2L73O1m02L4l17
4928a80L02J08r72P68K00m24k45L49l15N48n14L33J52o30Q49k83M8j37j90K81
4948D8k46j69Q18k96J02M10r93P34j65n5m02L56j81N2o4K69l83M27l91j20j01
4969c50M01k47k13L93m36N60J07j45j21l40O42L5j30p2j40l4o6k16N60J14J42
4990D44o03L6j0r2L38j94J80m63J93L13Jm72M32N2l44j23N59n97J73M53K2p3j99
$$ plain form
5013 26 23 -109 -2 119 349 9 -121 282 -256 8 -115 -63 214 7 -224 -19 -8 -203 -81 -246 -182 -386
5035 -386 -251 -35 -225 -9 -267 -189 -325 -80 27 5 149 412 169 100 214 469 -299 -148 -153 116 -28 234
5057 234 -63 301 -479 -190 111 -257 408 326 -94 -33 97 -185 61 -1 -398 -390 -163 133 -254 -145 -68 -197
5079 -197 652 -146 284 421 19 372 -373 -122 301 -309 278 -217 29 11 102 -357 -161 -144 -329 -147 -413
5100 -413 -137 -88 -33 36 283 310 121 441 34 195 85 728 234 441 30 11 -102 55 68 -146 189 28
5122 28 -164 -604 -277 92 -779 -94 -142 -441 -34 1 -204 169 -176 -92 -234 -120 -124 -308 -29 -392 -301 -226 366
5145 366 -16 -195 229 284 244 -250 -158 -56 6 -135 -41 -94 -9 -43 168 -138 -715 -109 -247 96 -146 -262 52
5168 52 395 -107 -132 337 -202 242 204 -161 406 360 -305 7 312 263 -247 -64 227 -118 217 -141 -393 -643
$$ packed form
5013B6lj32J07J21K30l40j30M03n38K64j23N2K77k07k31K05J1j95J22j65O4k04
5035c86J35K16j90K16k58P8j36K45J07k2J44K63k43o9J14K55p68J51nK69j44K62
5057B34k97L64p80K89L01l68O65q2m20O1J30k82K46o2l97QK27K96l87J09P7j29
5079a97Q49p98M30J37m02L53p45K51M23o10N87m95K46j8R1m59J96J7j85J82k66
5100d13K76M9N5O9K47K7j89L20m07J61j10O43m94K07m11j9j13J57J3k14L35j61
5122B8j92m40L27L69q71O85m8k99M07L5k05L73l45Q4j42J14mj84K79l63R1P5N92
5145C66l82j79M24N5m0m94R2J02O2j41R4n3Q5l4K11l06n77O06j38L43k42j16L14
5168E2L43n02k5M69n39M44l8l65N67m6o65L12L05m9n10J83K91l45L35l58k52k50
$$ plain form
5190 -643 -306 -116 -108 -536 -34 -219 88 380 -351 -183 -478 144 -63 -93 -62 -198 8 65 48 192 -106 -45
5212 -45 45 -4 150 -116 335 -172 -194 25 424 -278 -697 -218 -152 -409 -120 -241 -347 198 -101 -215 -299 103
5234 103 -51 43 184 291 200 31 39 -77 151 -347 -82 342 264 85 -454 -72 350 127 -159 121 -27 162
5256 162 14 -270 -112 -194 69 -34 356 97 -361 -413 10 -155 -4 30 -84 -90 -10 89 -75 125 249 -74
5278 -74 107 -34 267 -89 454 71 -537 111 -161 -142 -91 -360 -205 -235 32 -237 181 -236 -361 197 -82
5299 -82 -93 -390 477 -15 163 -76 -123 361 157 -94 210 284 166 589 60 -171 -42 -177 -157 -177 -126 16
5321 16 180 -178 -391 105 222 -262 -205 1 -85 -82 15 -87 -166 410 -152 29 367 -78 -187 -347 34 -70
5343 -70 468 82 -22 -326 -212 106 130 -222 -84 173 -335 -189 150 -192 -179 -9 13 -93 272 -77 -92 390
$$ packed form
5190f43L37J90Qm28N02j85L07K92p31J68k95O22k07l0L1j36K06N7j7J44k98O1
5212d5R0m9J54k66M51n07k2K19L99p02m19M79O6k57K89j21j06N45k99j14q4M02
5234A03j54R4J41J07r1j69Qj16K28m98K65M24p8j79n39L82M22k23k86K80j48J89
5256A62j48k84J58q2K63j03L90k59m58n2M23j65J51L4j14oQ0R9j64K00J24l23
5278g4J81j41L01l56N43l83o08O48k72J9N1k69J55l0K67k69M18m17j25N58k79
5299h2j1k97Q67m92J78k39m7M84k04k51L04P4j18M23n29k31J29j35K0k0N1J42
5321A6J64l58k13M96J17m84N7K06q6LR7j02p9N76n62J81L38m45j09j60L81j04
5343g0N38l86j04l04J14L18K4l52J38K57n08J46L39l42J3J70K2j06L65l49j5M82
$$ plain form
5365 390 361 62 -64 44 -121 -28 71 209 -1 212 145 252 70 5 -49 232 91 -100 218 -123 132 -185
5387 -185 162 -264 -274 -153 -41 162 -105 -43 -176 -238 290 -127 320 211 369 144 595 348 206 105 152
5408 152 -122 210 16 -417 278 -302 2 -222 -224 -126 -292 109 -74 -370 -282 -16 -73 -131 374 -241 73 -246
5430 -246 366 33 243 -219 99 218 126 -206 677 566 -270 -456 -11 217 428 137 251 121 -107 191
$$ packed form
5365C90k9k99j26J08j65R3R9J38k10K13o7J07j82o5n4K81j41j91L18l41K55l17
5387a85L47m26j0J21J12K03k67O2j33o2N28m17M47j09J58k25M51k47j42j01M7
5408A52k74L32j94m33O95n80L04k24kR8j66M01j83k96Q8K66n7n8N05o15L14l19
5430b46O12l33K10m62L18J19r2l32Q83j11q36j86M45K28K11k91J14j30k28K98
$$ [...]
8191A15
##END NTUPLES=NMR FID
##END=
