##TITLE=1H_Ser 5-3-i
 CDCl3, 8 sc, 
 31.8.2021
##JCAMPDX= 6.0         $$ Bruker NMR JCAMP-DX V2.0
##DATA TYPE= NMR FID
##DATA CLASS= NTUPLES
##ORIGIN= UXNMR, Bruker Analytische Messtechnik GmbH
##OWNER= root
$$ XWIN-NMR		Version 3.5
$$ Tue Aug 31 13:05:21 2021 Russian Standard Time (UT+4h)  she@DPX200
##.OBSERVE FREQUENCY= 200.131506
##.OBSERVE NUCLEUS= ^1H
##.DELAY= (6, 6)
##.ACQUISITION MODE= SIMULTANEOUS
##.ACQUISITION SCHEME= undefined
##.AVERAGES= 8
##.DIGITISER RES= 18
##SPECTROMETER/DATA SYSTEM= spect
##.PULSE SEQUENCE= zg30
##.SOLVENT NAME= CDCl3
##.SHIFT REFERENCE= (INTERNAL, CDCl3, 0, 15.7039)
##AUDIT TRAIL= $$ (NUMBER, WHEN, WHO, WHERE, WHAT)
$$ ##TITLE= Audit trail, XWIN-NMR		Version 3.5
$$ ##JCAMPDX= 5.01
$$ ##ORIGIN= Bruker BioSpin GmbH
$$ ##OWNER= she
$$ F:/spectra/data/she/nmr/H-F/1/audita.txt
$$ ##AUDIT TRAIL=  $$ (NUMBER, WHEN, WHO, WHERE, WHAT)
(   1,<2021-08-31 13:04:02.06 +0400>,<she>,<DPX200>,
      <created by zg, POWCHK disabled, PULCHK disabled
       configuration hash MD5:
       00 E9 B6 7A A2 85 ED C7 34 08 36 98 17 FE 4E 26
       data hash MD5: 16K
       71 7F 11 A9 72 77 E6 0E A6 68 E8 C5 D1 B3 BE F5>)
$$ ##END=
$$ 
$$ hash MD5
$$ 69 AA 61 CE 69 9F 6A 01 6C 3F 6F E0 71 A1 BD 49
##$RELAX= 
##$RELAX= 
##$RELAX= 
##$RELAX= 
##$RELAX= 
##$RELAX= 
$$ Bruker specific parameters
$$ --------------------------
##$DU= <F:/spectra>
##$EXPNO= 1
##$NAME= <H-F>
##$PROCNO= 1
##$TYPE= <nmr>
##$USER= <she>
##$AMP= (0..31)
100 100 100 100 100 100 100 100 100 100 100 100 100 100 100 100 100 100 
100 100 100 100 100 100 100 100 100 100 100 100 100 100 
##$AQSEQ= 0
##$AQ_mod= 1
##$AUNM= <au_zg>
##$AUTOPOS= <>
##$BF1= 200.13
##$BF2= 200.13
##$BF3= 200.13
##$BF4= 200.13
##$BF5= 200.13
##$BF6= 200.13
##$BF7= 200.13
##$BF8= 200.13
##$BYTORDA= 1
##$CFDGTYP= 0
##$CFRGTYP= 5
##$CHEMSTR= <none>
##$CNST= (0..31)
1 1 145 1 1 1 1 1 1 1 1 1 1 1 1 1 1 1 1 1 1 1 1 1 1 1 1 1 1 1 1 1 
##$CPDPRG= <>
##$CPDPRG1= <>
##$CPDPRG2= <>
##$CPDPRG3= <>
##$CPDPRG4= <mlev>
##$CPDPRG5= <mlev>
##$CPDPRG6= <mlev>
##$CPDPRG7= <mlev>
##$CPDPRG8= <mlev>
##$CPDPRGB= <>
##$CPDPRGT= <>
##$D= (0..31)
0 1.2 0 0 0 0 0 0 0 0.06 0 0.03 0 0 0 0 0.0002 0 0 0 0 0 0 0 0 0 0 0 0 
0 0 0 
##$DATE= 1630400641
##$DBL= (0..7)
120 120 120 120 120 120 120 120 
##$DBP= (0..7)
150 150 150 150 150 150 150 150 
##$DBP07= 0
##$DBPNAM0= <>
##$DBPNAM1= <>
##$DBPNAM2= <>
##$DBPNAM3= <>
##$DBPNAM4= <>
##$DBPNAM5= <>
##$DBPNAM6= <>
##$DBPNAM7= <>
##$DBPOAL= (0..7)
0.5 0.5 0.5 0.5 0.5 0.5 0.5 0.5 
##$DBPOFFS= (0..7)
0 0 0 0 0 0 0 0 
##$DE= 6
##$DECBNUC= <off>
##$DECIM= 32
##$DECNUC= <off>
##$DECSTAT= 4
##$DIGMOD= 1
##$DIGTYP= 9
##$DL= (0..7)
0 120 120 120 120 120 120 120 
##$DP= (0..7)
150 150 150 150 150 150 150 150 
##$DP07= 0
##$DPNAME0= <>
##$DPNAME1= <>
##$DPNAME2= <>
##$DPNAME3= <>
##$DPNAME4= <>
##$DPNAME5= <>
##$DPNAME6= <>
##$DPNAME7= <>
##$DPOAL= (0..7)
0.5 0.5 0.5 0.5 0.5 0.5 0.5 0.5 
##$DPOFFS= (0..7)
0 0 0 0 0 0 0 0 
##$DQDMODE= 0
##$DR= 18
##$DS= 0
##$DSLIST= <SSSSSSSSSSSSSSS>
$$ [...]
##$SUBNAM2= <"">
##$SUBNAM3= <"">
##$SUBNAM4= <"">
##$SUBNAM5= <"">
##$SUBNAM6= <"">
##$SUBNAM7= <"">
##$SUBNAM8= <"">
##$SUBNAM9= <"">
##$SW= 20.0188882624521
##$SWIBOX= (0..15)
0 0 2 0 0 0 0 0 0 0 0 0 0 0 0 0 
##$SW_h= 4006.41025641026
##$TD= 16384
##$TD0= 1
##$TE= 0
##$TE2= 300
##$TE3= 300
##$TEG= 300
##$TL= (0..7)
0 120 120 120 120 120 120 120 
##$TP= (0..7)
150 150 150 150 150 150 150 150 
##$TP07= 0
##$TPNAME0= <>
##$TPNAME1= <>
##$TPNAME2= <>
##$TPNAME3= <>
##$TPNAME4= <>
##$TPNAME5= <>
##$TPNAME6= <>
##$TPNAME7= <>
##$TPOAL= (0..7)
0.5 0.5 0.5 0.5 0.5 0.5 0.5 0.5 
##$TPOFFS= (0..7)
0 0 0 0 0 0 0 0 
##$TUNHIN= 0
##$TUNHOUT= 0
##$TUNXOUT= 0
##$USERA1= <user>
##$USERA2= <user>
##$USERA3= <user>
##$USERA4= <user>
##$USERA5= <user>
##$V9= 5
##$VALIST= <valist>
##$VCLIST= <CCCCCCCCCCCCCCC>
##$VD= 0
##$VDLIST= <DDDDDDDDDDDDDDD>
##$VPLIST= <PPPPPPPPPPPPPPP>
##$VTLIST= <TTTTTTTTTTTTTTT>
##$WBST= 1024
##$WBSW= 4
##$XGAIN= (0..3)
0 0 0 0 
##$XL= 0
##$YL= 0
##$YMAX_a= 168715
##$YMIN_a= -234926
##$ZGOPTNS= <>
##$ZL1= 120
##$ZL2= 120
##$ZL3= 120
##$ZL4= 120
##$ABSF1= 10
##$ABSF2= 0
##$ABSG= 5
##$ABSL= 3
##$ALPHA= 0
##$AQORDER= 0
##$ASSFAC= 0
##$ASSFACI= 0
##$ASSFACX= 0
##$ASSWID= 0
##$AUNMP= <proc_1d>
##$AZFE= 0.1
##$AZFW= 0.1
##$BCFW= 1
##$BC_mod= 2
##$BYTORDP= 1
##$COROFFS= 0
##$CY= 11.3945322036743
##$DATMOD= 1
##$DC= 2
##$DFILT= <>
##$DTYPP= 0
##$F1P= 2.36226072786647
##$F2P= -0.459571619588291
##$FCOR= 0.5
##$FTSIZE= 0
##$FT_mod= 4
##$GAMMA= 1
##$GB= 0.15
##$INTBC= 1
##$INTSCL= 1
##$ISEN= 128
##$LB= 0.24
##$LEV0= 0
##$LPBIN= 0
##$MAXI= 10000
##$MC2= 0
##$MEAN= 0
##$ME_mod= 0
##$MI= 1.114404
##$NCOEF= 0
##$NC_proc= 0
##$NLEV= 6
##$NOISF1= 3.799351
##$NOISF2= 2.8
##$NSP= 1
##$NTH_PI= 0
##$NZP= 0
##$OFFSET= 15.70392
##$PC= 1
##$PHC0= -13363.11
##$PHC1= 16.40098
##$PH_mod= 1
##$PKNL= yes
##$PPARMOD= 0
##$PSCAL= 0
##$PSIGN= 0
##$REVERSE= no
##$SF= 200.130013532006
##$SI= 16384
##$SIGF1= 3
##$SIGF2= 2
##$SINO= 400
##$SIOLD= 16384
##$SREGLST= <1H.CDCl3>
##$SSB= 0
##$STSI= 0
##$STSR= 0
##$SW_p= 3612.71676300578
##$SYMM= 0
##$S_DEV= 0
##$TDeff= 0
##$TDoff= 0
##$TI= <>
##$TILT= no
##$TM1= 0
##$TM2= 0
##$TOPLEV= 0
##$USERP1= <user>
##$USERP2= <user>
##$USERP3= <user>
##$USERP4= <user>
##$USERP5= <user>
##$WDW= 1
##$XDIM= 8192
##$YMAX_p= 0
##$YMIN_p= 0
$$ End of Bruker specific parameters
$$ ---------------------------------
##NTUPLES= NMR FID
##VAR_NAME=  TIME,          FID/REAL,        FID/IMAG
##SYMBOL=    X,             R,               I
##VAR_TYPE=  INDEPENDENT,   DEPENDENT,       DEPENDENT
##VAR_FORM=  AFFN,          ASDF,            ASDF
##VAR_DIM=   8192,          8192,            8192
##UNITS=     SECONDS,       ARBITRARY UNITS, ARBITRARY UNITS
##FACTOR=    0.0002496,     1,               1
##FIRST=     0,             0,               0
##LAST=      2.0444736,     0,               0
##MIN=       0,             -234926,         0
##MAX=       2.0444736,     168715,          0
$$ Real data points
##PAGE= N=1
##DATA TABLE= (X++(R..R)), XYDATA
$$ [...]
1876B36k02M2K11m13mL07q0q6M8K60m39K87Jl41L28o8p8J35M1k13J11J54m3n63
1900c69K79M31l27l93O52j93Q9K73j94m23K31K18j83j72j2J27oK99l42nn4L72
1922B98k27j70M6m7K24J13k86j0Q0M7J14k45J35p8j1R9k63J37j4J97j39j69J74
1945Ek26J20n2K94l78J63L21k55M1p7l27J79J88Q9j40K08J18l17p7K99l76m1N14
1968B73K3k54m9m5j43J45p3j06J47J6R0j11J03K14m08L26j78q7M1k1K80k90J33
1991B6M2p2n6K18j60j09J32j16J00j27L3O7Nj8K0k35K71k14K34j60J79k39R1K57
2015A69j81N1J9o6kK91j84k74K64L3l75P2L99j58m23L76Q5n7J57q7l71J80M61
2038C79n30r3L87j02p6J23K64m92k4K71Q5n03L73K83l91P5R3j82j09L05j37L7
$$ y = [236, 34, 76, 287, -126, -130, 177, 97, 11, 59, 319, -120, 167, 168, -173, 155, 87, 9, 144, 185, -28, 83, 237, 194, -369, -90, 341, 14, -379, 273, 80, 169, 442, 248, -175, 56, 274, 91, -81, -93, 34, 28, 327, -15, -20, -74, 298, 71, -99, -53, -100, 124, 237, -49, -59, 21, 68, 182, -63, 72, -6, -17, 82, -181, -44, -58, 139, 0, -169, 5, -221, -101, -153, 141, -237, -74, 247, -8, 33, -44, -371, -192, -4, 85, -55, 153, 271, -46, -123, 176, -200, -241, 273, 296, 42, -7, -52, -195, -50, -123, -229, -82, -66, 24, -87, 16, 230, -178, 148, -30, -117, -76, -97, 183, -107, 26, 68, -4, -60, 158, -2, -111, 21, -95, 5, -122, -89, -22, -17, -35, -15, -250, 21, -193, 41, -119, 60, -179, -88, 169, -12, 39, 58, -8, -10, 281, 97, -177, 87, 120, -255, -183, 216, 58, -365, 11, 96, 39, 196, 109, -262, -82, 379, -151, -244, 143, 41, -35, 88, 352, -140, -164, 107, 192, -311, 62, 345, -46, 29, 122, -60, -169, 136, -1, 36]
2060C6k29K24l07L30J26n65N46L7j8k81K46k96NL1J97l54J45L74k34j67K07P9
2082A32j02N5J72m04j44N64j01j0l8l33nK24K20n08L14j4k95K9K29k09K07R4K73
2105C50q81N53R4k06L6K28n2j81J64L2l33P7K94m31J39K02k41K06k7K10o19L98
2127A2k7J50j43Rl2l9K41j13l72J03L27k35j1j69Q9J79K31k88k78M10J84l66o4
2150b02J55m7j45N14k65Jj81L13l94O35n2o37J78L25l62l42Q03j28l46M7L18k8
2172A60l18N26m18j24J87M5k13M05k53q1j1K56k53q3M14k52k45L00L4j52L2M87
2194D43m66j29M55j89k16M56k57l43K06N79n90p3J18K90m21J01J42k57K52K00
2214C01j98l37N07j59m51M44O7o28P04j38k16j28Q44j96p00L47j30L45J8J00n38
$$ y = [36, -193, 31, -276, 54, 180, -385, 161, 198, 180, -101, 145, -151, -146, -115, 82, -272, -127, 247, 13, -154, 53, 132, 30, 85, 257, -147, -291, 273, 172, 162, 124, -209, -214, 10, 230, -278, 36, 22, -273, -244, -15, -224, -17, 77, 350, -531, 22, 116, -90, -54, 174, 122, -59, 105, 137, -196, -119, 175, -256, -117, 85, -156, 50, 23, 233, -386, 12, -15, 135, -8, 1, -31, -70, 171, 58, -314, -211, 116, -119, -130, -299, -210, -31, 200, -88, -366, 44, 228, -138, -202, -47, -94, -239, 275, 10, 11, -170, 143, -251, 384, 332, -305, -127, 198, -164, -506, 297, 169, -177, -130, 188, 160, -158, 368, -50, -174, 13, 58, -155, 250, -3, -84, -95, 161, -92, -175, 239, -13, -258, 42, 76, -76, -44, 443, -23, -152, 303, 114, -102, 354, 97, -246, -40, 539, -51, -124, -6, 284, -137, -36, 106, -151, 101, 301, 103, -234, 273, 114, -337, 107, 174, -454, 250, 112, -104, -232, 612, 416, -284, 63, -67, 278, 296, 396, -142]
2235a42p8K61jk20M40j37k93L28M8l38K0M95o76K89K63j59k48K60L47m52k06N32
2257C33l45m7K49M3m75K29N59n30j93M51k29o2L23j15n86L11M20n72R1L51j93
2278A3M9K16k47k91M72j75k92J40L14k25m7K00n98K07K49K08m71J97J1k67K14
2299a23J58l36K8N31l83k87N76k02l43L51J26n5j88M1j3J5O7O8j81j74N73l14
2321f5n03P26m3k10P8K18n04J57K83l77J30J74N0l48J61Lj61J60K60j32k16N69
2343D10m2m50K90Km93O58k77n38K90M55K4l66j8R1k3j90N16n61J9L00l2r2P4k0
2367B7k02K79R4k99PL13o0k18rn5l8K79L02o44J80L49m69P1P2q0p9L86J24n25
2391a95j37M84M0o05L41J14l26L68L61p54K62N38k61l29M56j11k74M04k97m96
$$ y = [-142, -220, 41, 40, -180, 260, 123, -170, 158, 206, -132, -112, 383, -293, -4, 259, 100, -148, 112, 459, 7, -199, 333, -12, -59, 190, 233, -242, -13, 546, 16, -177, 274, 45, -17, 306, 191, -395, -84, 336, -236, -145, 206, 13, 62, 278, 31, -260, 212, 37, -255, -115, 199, -26, -73, 127, -471, -264, -15, 193, -278, -81, -70, -337, -123, 35, -301, -273, 258, -125, -412, 164, -38, -381, -30, 96, 41, -147, -106, -119, -104, -37, 31, -150, -324, 249, -65, -568, 158, 115, -95, -17, 201, -303, -146, 137, -240, -110, 64, 114, -234, -73, -70, -231, -71, 189, 57, -159, 410, 368, -82, 208, 210, -283, 375, 98, -440, -150, 305, 329, -37, -55, 36, 13, -177, 339, -222, -203, 97, 65, -27, 47, 27, -175, 104, 198, -101, -94, 219, 159, -59, -68, -123, -161, 118, 420, -224, -44, 305, -164, -93, -21, -101, -180, 206, 330, -195, -332, 152, 192, -413, -72, 42, -284, 84, 445, -309, -47, 491, 230, -99, 357, 246, -28, 376, 79, -417]
2411d17O06k86K25l42O1J32j22M54L6r97O12J38k23j04L10j77j33N60k39m16L70
2432D8L35l33Q4o8j11N6L04r8n88K98L14p2l97L06N1j37K30p1m99M73L4l34l9
2455b14K85K8l94O05J4n43L4L05j96Q9K94l14n28Q20ko24P9M84l88Q4J72k44l0
2478a84L94n60J4L59q7j43K14Q0m49J63L74l16k26K23N2k6M9J83m00J95M36q24
2500d79L83K29l03K15m8O1m49L57L12Qo90N88J63o73L92M0m93L98K80o5n92Q01
2522D35j85k88L58J3m85L42M99q27J42O4j88K3K43J71m86J75N69n14j03O2q2L09
2544B47l12j29p1N43M6k05%jn2J34o2k4j59K08N3m13n3J40K73j53q8L3p0J15N00
2569E00p94K59K20n47K10K4N3k02L49J33j0n72L75J74l17M76j93l75K87Q6J0m02
$$ y = [-417, 189, -97, 128, -214, -153, -21, -143, 311, 347, -650, -38, 100, -123, -227, 83, -94, -227, 333, 94, -322, 48, 383, 50, 134, 66, -45, 11, 315, 217, -371, -73, 241, 169, -228, 78, 129, -8, 222, 151, -348, 125, 159, -175, -214, 71, 99, -295, 310, 324, -219, -185, 120, -76, 13, 307, -7, -535, 285, 283, -341, -262, 222, -166, -82, 90, -154, -184, 210, -350, -336, 23, -64, -207, 7, 87, -362, -199, 175, -141, -367, -144, -92, -118, -69, 114, -286, -91, 345, -479, -96, 133, -170, 45, -3, 58, -391, -34, 278, 286, -404, 184, 347, -326, 66, 106, -387, 11, 291, 226, -366, 435, 250, -38, 320, 333, -152, 190, 689, -138, 4, 68, -120, -97, 146, 317, -169, 6, 575, 61, -42, 20, -62, 247, -65, -194, -265, 278, 324, 119, 119, 118, 66, 200, 138, 114, -45, 163, 216, -197, -250, -110, 163, 10, -78, -45, -115, 0, 500, -294, -35, 185, -362, -152, -128, -75, -277, 72, 205, 195, -377, -2, 172, -145, 331, 138, -237, 50, 136, 146, -256]
2591b56M62k67r6M79n64k11K88J79k57J85J11p4o1R1ml71M77L11p45J8N06l11
2613a10R6p1j78o1L54J66l58p8O51n48J45J92j94m71O70j23p1Q4J50l68P6L58
2635C11l72j64J11J9J56l99N87j84j77L03l11j42M03J23l15K84j10n06K44M83
2655C44l42l34K13L0j85L05j09m69O18J21o75M87J76k16o7P2Q1k06K73l2l71K05
2677h1j67N71n74J01L30l1J91j79k68L5L62j68k19K94N3j05q0K07m27L29P2j81
2699F5j88J26K34k10J13J03l64k79M45j27R0J96k8l15K10j68jl5L46J0k08K43
2721B58r5l01K66M2l47j60O52k16n42L5N58j95N7j33k18J90M52j82k30o2M74m97
2743a94L95K41n31j03M63m13J59l7j5k94M36j23k62m3M72k67j7J42j25n0L89k26
$$ y = [-256, 206, -61, -157, 322, -242, -453, -165, 14, -243, -58, 53, -21, -82, 9, 5, -366, 111, 422, -323, -305, 201, -110, -14, -85, -263, -324, 30, 196, -162, -240, 411, -137, 8, 200, 6, -465, 205, 82, 11, 95, 245, -123, -47, 311, -61, -225, -114, -95, 61, -338, 249, 65, -112, 191, -120, -262, 141, 264, -51, 233, 123, -383, -139, 344, 2, -332, -119, -89, -274, 31, -78, -547, 71, 192, -483, 4, 180, -36, -103, -31, 50, -156, 117, 85, -286, -81, -248, 323, -251, -150, 180, 149, 340, 161, -107, -72, 290, 122, -97, 197, 250, 145, 65, 272, -155, 174, 246, 65, -123, 3, 237, 27, 140, 243, -121, -400, 45, -82, 8, 204, 176, -139, 71, -97, -98, -133, 213, 223, 15, 258, 163, -138, 128, 170, -177, -337, 315, 99, -443, -408, 150, -45, 12, -121, -339, -149, 303, 121, -109, -171, 303, -194, 201, 442, -89, -192, 271, -142, 17, -20, -35, -329, 107, -16, -278, -321, 151, -116, -133, 9, -116, -166, 223, -3]
2765cn94N64L09m40J95l5j93k07N47J37m62K41L7l20K56M9k61ON53l90l43K45
2787a09L29l35J28n6j43M1L11j87k92K35K84m49L85J84o41J54J24J39j30K3Q5
2808H0k30K16K09m20l17O20J05n03M29J11k16m4K02l50J49K09j02k62L35l4k32
2829d5K21R3l81K33J52j07l89J59J96k29L55K3m60J42J76l33k19N30j30R6J84
2850B67l16o0K19j48j69J71K43j53j68K18N2m22K60N03o59k7N29l54R8k9J37k10
2872a8K95q9p6NJ48j76j17K31p1j95K19K15m42K67J16m6l63L07l47n1K32R8k80
2895a38Q7J75k20J07L30k66L3j61J06r3l11L72k40K54O2J06l38L69k26l40qL99
2917E9j0L6M4o2k87M5L44l81J91K65m74J86j11M1l70N23n0j29m7m9K91k04J64
$$ y = [-3, -597, -33, 276, -164, 31, -4, -197, -404, 143, 280, -182, 59, 96, -224, 32, 81, -180, -174, 379, -11, -354, -109, 220, -115, 13, -43, -186, -145, 166, -21, -313, -78, 206, -243, 142, 326, -315, -161, -37, 102, -28, -5, 80, -150, 66, 275, -145, -462, 158, 263, -240, 189, 300, 84, 40, 242, -108, 41, 250, 148, -114, 221, 187, -45, 176, 269, -112, 121, 273, 166, -223, -64, 132, -97, 258, 281, -179, -37, 139, -194, -413, 117, -13, 83, 267, -49, -109, 110, -38, -207, -36, 207, 54, -114, 104, 156, -266, -6, 497, -162, -189, 340, -14, 84, 55, 192, -18, 277, 188, 112, 117, 265, 89, -28, 203, 132, -63, 156, 371, -71, 196, 312, 266, -97, 210, -137, -188, 44, 142, -138, -51, 124, -96, 11, 341, 75, 108, -53, 53, -40, -351, 21, -219, 35, 97, 203, -135, 234, 8, -332, -340, 59, 49, 85, 129, 67, -220, -175, 169, -212, -21, 244, -230, -44, -155, -114, -484, 39, -11, -140, -187, -236, 55, -149, 15]
2940A5p0l65N44j95j45j23K8K52j4O9j82j40K90M8j25J61q9J12j17J53j81l05
2962c79M84p2l54K82J72j15q4p9l9J09J30J28k66l0P3j91K73L88l01j99L26q2
2984A74k16J81j6j24J42L1m82L4L79K42n45L34K7k76J54J26o1k48L94j05j55L24
3006C14j52l47K15O4j22K6K28j47k08J67N7qj37N91o45j84L66j58j23K84K86n08
3028a41M70l45J35k11K33r7O9J6K0m53M00J78k48M5J35L5m23M31k15J2J71Q8l44
3051c9k0M83n74K26o4l8j39L27m1k73M11l10K93k96J84K9j53K67R5n39K85Q9k03
3074@Q7j28j18N0L05l3n70J31K98j1L4j87P3p8J09J43l95K98j7K74n04L84j80
3097c5n37N76j00M9l02K54m0K17rk21KJ81J71m82K82J06q6j0j75K52m05M38k79
$$ y = [15, -55, -420, 124, -71, -216, -339, -311, -59, -73, -4, -186, -326, -36, 12, -113, 48, -41, 71, -46, 107, -74, -379, 105, 33, -321, -39, 133, 18, -66, -145, -184, -75, 55, 183, -83, -113, -40, -231, 42, 430, 129, -70, 256, 174, -42, 139, 123, -1, 141, 172, -310, -276, 103, 345, -200, 134, 161, -115, 39, 165, 104, -144, 250, 145, -10, 314, 162, -185, 30, 94, -28, -2, 226, 79, -129, 38, 95, 87, -50, 541, -104, -288, 78, -80, -203, 81, 367, -141, 329, -16, 119, -92, 141, 44, 113, 129, 149, -304, 96, 274, 26, 71, 206, 241, -182, 249, 34, 46, 217, 305, -39, -59, 424, -150, 76, 12, -26, -165, 162, 121, -152, 259, -51, 242, -54, 130, 159, 6, 273, 368, -171, 114, 203, 0, 87, -41, -159, -109, 196, 163, -407, -276, 22, 11, 45, -142, -69, -147, -38, 105, -290, 8, -9, 265, -239, 145, -35, -572, 4, -96, -47, -349, -95, -135, 82, 73, -148, -146, 35, 206, -276, 6, 112, 26, 16, -159, 93, -312, 126, -153]
3120a53O1J49k36rL89J84m91%K71k05J42p8K24j23k57J58l41K13K98L8l34J44
3142D4r3j43K88J66m08L38L3j26l75K38Q0K01m6q3m2k67L58k65o3M07m18K82J84
3165B90l12j69P9M80j63j91RJ27k42L97j97k40K15p0l32K95P6q7K18k35J41j43
3187e4K5L09k53j80K51K5j40jJ36k60J10m7Kk26M20k70K00k02J53j77K07nQ6l64
3211b55K82J59j37J70j33l20M16l32J5k31K68J50j52J58m14J64l3M26l34K04j7
3232E4k6j43P1M7q5J46k7j37P6R4j18j92N02l48j22J81kQ8p0J66k95Q6L02j08
3256A40m59O22k59k20K58k16P9r0J68j02k04L68J05n45L04n9j15J90k8R0k71K17
3278b7Q5o9Q8l0j84K31J31k32j97K40O0K8k64J6J19j21K08j24O3j01J91j74K09
$$ y = [-153, -92, 57, -179, -188, 201, 385, -106, -106, 165, -40, 102, 24, 248, 125, -132, 26, -315, -102, 196, 234, -100, 44, -49, -192, 96, 262, -146, 192, 225, 99, -276, -38, 42, 243, 197, 114, 72, -195, 163, -102, -165, 242, -176, 106, 290, -22, -191, -112, 368, 205, 14, 23, 150, -92, 305, 108, -132, 83, 13, -319, -24, 52, -35, 183, -52, 89, -54, -29, 280, 27, -153, 98, 123, -17, -18, 118, -142, -32, -79, -77, -303, 117, -153, 47, -155, -2, -179, 28, 23, 109, -255, 27, 186, 49, 219, 86, -234, 182, -150, -135, -366, -98, 52, -100, 58, -356, -192, -225, 201, -133, 71, 54, 28, -115, -44, 3, -82, 64, 37, -100, -24, 70, -48, -240, 262, -86, -208, -27, -29, 59, -11, 155, -140, -54, 248, 140, -319, 303, 44, -176, 82, -134, -55, -145, 23, -79, -283, 85, 190, -355, -51, -110, -225, -35, -63, 27, -244, -27, 58, -11, 77, 47, -137, 94, 225, -7, -204, 36, 96, 124, -140, -124, -5, -126, 82, -42, 21, -80, 111, -63, 146]
3301A46Q7k91K68J76n94K02J93M2k43k12M47j18N2k3l97J24K59j7Q0r7M4j96J55
3324H7K08l03k4K43k7j59j57K43k94K29R9l12J95J92q8j60K13M1j60q1K69m40
3346a86Q0N37m82l9J35p2J34M0j61k46K25J75n7m5K02L4m79J20J09j28m0K58q9
3369B5R5O2k44k12N02m4k78r9K56q7l9K98j47l36J40J96n2m2J07k15J26j08o5
3392a61K99k0p3kk05J25LK77l24P3o0N6J35l46J17n8K19k92L24r7k37K29K54J5
3416B51k29p2%PJ26k30K18j32p5J32l3r4m0J67K05l64K48K46k68r6n8Q0j70K80
3440I9j48J38l72K66q7J67J2j81P4j77R3lJ46p1J16j86j58L31j06j62J09N5k81
3463c26Q03m64r0K8j1N3j17JQ1J41J27l80J73kJ42k73J68j29L30j14R8j12lj09
$$ y = [146, 233, -58, 210, 386, -208, -6, 187, 229, -14, -226, 221, 103, 155, 132, -265, -141, 118, 101, 181, 84, 128, -68, 87, 295, -8, -32, 211, 184, 25, -132, 111, -183, 46, 145, -167, 28, 220, 132, -28, 185, 226, 66, -15, 254, -186, -106, 431, -51, -90, 45, -27, 107, 147, -14, -260, -35, 140, 83, 38, 240, 274, -205, -85, 24, -104, -144, 114, 25, 120, 182, -62, -274, 228, 184, -94, -193, 63, -24, -63, 235, 88, -248, -108, 88, 36, -6, 101, -114, 12, -96, -161, 138, 118, 45, 43, -162, -37, -34, 243, -81, -8, -68, -12, 123, -223, -106, -164, 55, -237, 87, -10, -247, -18, 236, 251, 22, -50, -50, -43, 83, -147, 71, -61, -136, -4, -37, -131, -171, -4, 201, -163, 85, 331, 63, -33, -91, -11, -181, 99, -49, 89, -283, -17, -104, 63, 75, -106, -32, -209, -116, -119, 27, -44, 72, -114, -272, 59, -47, -209, -100, -45, -326, 477, 13, -77, -49, -60, -7, -124, -123, -42, 99, 226, -154, 19, 17, 159, -114, 54, -75, 255, 141, 239, 127, 124, 15]
3487A5J94k84M3J87j88J0J42O3j36J2o3k02N60m64k8K73j2j06j57l7L10j57L7
3510A2K03k69N7Q5j08J54L0l8L6m1k16J00Q8mJ7Q6k28j66J85J66P9p2n0m6M1k94
3536a93K83JK4l33J72J43p2l5q6K47m11K69J83M5r8k06j54L23l77L27J7k33k1
3559a85O3J1K6J10O1R1m77K48P0j72J65J89n48L11P3j14j5J33K03p08P57m95K20
3582A7n2P0n5pJ00k17N9R0k9j92L37k89J43j61K26n1L1P1j46J35J69l44k16M89
3606A78m0k83J97J11j63l02J05L22q2k28K87m6P8J12j64K32l49M4j98K65J58l68
3628a34O7J63k60L58j81k87L65j52k34K47J64J29k04K41k22K4J4M4n1l25K20O1
3650D7j56o8P4j03L29o7J01j22l07K02J89n6K33j20k55J04K8J76N4k17J84r3M8
$$ y = [15, 209, -75, -32, 155, -33, -23, 119, 182, 46, 58, -5, -207, 353, -111, -139, 134, 122, 16, -141, -178, 132, -25, 12, 215, -54, 3, 88, -20, 134, 164, 126, 162, 121, -95, 5, 93, 89, 106, 192, -36, -202, -17, 149, 228, 156, 106, 60, 101, -193, 90, 91, 115, -218, -46, 97, 25, -10, -96, 151, -260, 9, 192, 237, 139, -67, -221, 102, -275, 52, 69, -164, -185, -122, -111, -85, 25, 86, 177, -300, -52, 18, -154, 11, 200, -348, -37, 36, -78, -93, 40, 243, -465, 292, -203, 17, -35, 35, -20, -27, 73, -144, -85, 5, -24, -216, 121, -168, -25, -186, 40, -11, 20, 91, -55, 80, 249, -95, -311, 178, 138, -145, 52, 163, 0, -302, -197, 125, 43, -185, 102, 56, 134, 246, 82, 314, -35, 9, -189, 76, 234, -134, -67, 96, -164, 194, 13, -274, 91, -61, -295, -48, 116, 245, 41, 282, 60, 84, 98, 142, 91, -234, -14, 47, -109, -177, -103, -206, 123, 56, 157, 35, -272, -70, 119, 63, 296, 176, -79, 25, 53, 229, 283, 66, 250, 157, 205]
3673B05l36J88m39P54m23N5K46j11J22j69n5j92L19k22J39N1j02K11k90J92K5
3694A68k34P6J44j74J58k65N6l74P19j94k51M38m45lM8K21l90L10J73k2k41m1
3716a23J79j0k7J01l86K73J44J27k47j28K6J5J5k40N3KK93j42J50j01j72j29N88
3739B61r3k58k12L02J32k00k76J29N2K67l5j52J61l55M09j20J16j53P9m5j17M4
3761f4M3j71J65J08nk02j33M64j90o5J1L02j34k69K58l41M36n0l88L46q8Or3L73
3785C19l92j47L75j47j35R5l2K39k37R6m9j75P7J63j22o2K36K37l44K59j89k95
3807b30M56J90l63J5K4j60k3p7J17K08j55P8K8l7j08o4L36m19J58K84l75L62k30
3830A5j65jJ06M8J29p2k23l6K12O6j48K17l07J66j79N9k14L73P0j71M14o17J91
$$ y = [205, -131, 57, -382, 372, -51, 4, 250, 139, 261, 92, 37, -155, 164, -58, 81, 132, 30, 241, -49, 143, 168, -66, 10, 154, -20, 138, -127, -71, -445, 274, 80, -171, 267, -178, -181, -133, 88, -302, 8, 181, 159, -82, -123, 56, 46, 19, 120, -266, 7, 151, 278, 31, -97, -71, -56, -41, -281, -228, -226, 67, -75, 75, -26, -198, -327, 261, 168, -90, -302, 0, 132, -68, -344, -215, -163, 104, 69, -83, 78, -277, 132, 12, 128, -25, 54, 9, -108, -64, -21, -192, -27, 81, 76, -126, -259, 205, 15, -50, -39, 263, 129, -140, 118, -223, 213, 163, -225, 121, 33, 39, -54, 319, -73, -220, 155, 8, -127, -32, -64, 175, -62, 34, -15, -190, -113, 50, -72, -134, 102, 339, -5, 254, 65, -230, 226, 416, 53, 68, 92, -68, -91, -168, -51, 157, 2, 80, 108, 71, -37, -101, 235, -184, -26, 258, -117, 245, 15, -150, -151, -45, 3, 132, 60, -163, -199, 13, 79, -69, 148, -159, 7, -172, -113, -327, 46, 116, -55, 359, -258, -67]
3853f7N0M9l9j59M3L9M4K2k6k3J69n2P4l62J69J20l12j74K18M10k01J5j30J90
3877F7j16J68k32M7J67j16k9j19K09M1j79J63k15K47j63j24J80K5R2PJ58j37l63
3900b22K58Q1j4l76K56J47k55kO5k92K85K16j03P4L6l36M5N7k0K63r7o1k8N0K7
3925E4p5j9j1K64k30N1k8jK43l10Nq2K94M4m38K68o1n3j10M12l97L89o1K9k1k49
3951i3J56j67rJ31L8j15Q7m05K88j01K41Q1k52L24k81J85R3Qk55J1K20j44l37
3974b96M67j85j47J24J27j71N6m7J28K51k45L9o6l4lR3j34n4q5L18k87M44m36
3997a43K01Nk01l9L14k4j48%P1R7j94M19j47j36J01L1m12L30m12J90J23k49K47
4020B4p3j84N3K63j47m1J38l0m1k86M98j78N9jj01K91k56j1O9M2k13K16J26l9
$$ y = [-67, -17, 32, -7, -166, -123, -84, -40, -18, -44, -67, 102, 50, 124, -238, -69, 51, -261, -435, -217, 193, -8, 7, -123, 67, -49, 119, -113, -66, 101, -15, -44, -163, 46, 87, -92, 71, -144, 103, -60, -184, -4, 21, 113, 120, 278, 141, -222, 36, 117, 103, -273, -17, 130, -125, -127, -62, -354, -69, 147, 44, 118, 154, -182, -137, -80, -100, 163, 66, 5, -23, 27, 54, -21, -40, -51, 213, -17, 34, 6, 5, 248, -62, -57, -139, 155, 199, -239, 29, -32, -85, -195, 217, -180, 209, 148, 177, 156, -93, 63, -104, -113, 18, 56, -59, 28, -377, -89, -190, 51, 132, -120, 204, -77, 108, 201, 209, -46, -35, 185, 41, -296, 171, -14, -161, -37, 90, -81, -25, -72, 56, 307, 62, 101, 35, 1, -2, 91, -43, -97, -182, 136, -151, 293, -143, 58, 63, -138, -177, 137, 113, -35, -35, 36, 133, -61, 358, 211, 75, 176, 207, -205, 125, -287, -97, 26, -223, 24, -49, -233, -180, 83, -64, -105, 33, 3, -38, -324, 174, -4, 55, 54, -47, 244, -12, -23, 46, 88, -125, 91, 217, 178]
4044A78j68j13J54J77m78M90p2l78J05M9l8mJ96L1J6K8nm56K55O2M9j00N5k60
4068b27J39J36j77J26j64K84j46J01l40J86l6%L10m01N3K44M2k2q6j04M9N4k9
4091ho0K52k35K10p2j08Q9M7j07o0M5J86k02n9k20J85N6J99j28p0l05L25K51q0
4115A31j83k72M03O0nk94L00q9J77m3l11K84m4j39P1J43j88m5P9m3m3K00m31L22
4139D0O4M6k60K90o8l06K62J87n38M98l49J11KJ43n2j43K29J05l60J1N0j05Q5
4162e8j13L09l66J48J5j35j15M21J16k67j85J41n0K45j67mm00M46P0j32J24l0
4184A3K66l13M3O4l11K75p2n0J49k45k1J48l4J69k29K74k64J29J3o4m7R1L0l31
4208c17N62k06k87L84J27m6m45kj0K32p4J46j47p7L7Q2K33m35L90q1oj72q0L07
$$ y = [178, 10, -103, 51, 228, -250, 240, 168, -210, -105, -56, -94, -98, 98, 129, 145, 173, 168, -288, -33, 29, 78, -22, 33, -227, -88, 48, -129, -3, -167, 117, -29, 72, -268, -82, -118, -118, 192, -209, -156, 88, 130, 108, 22, -82, -33, 21, -8, -68, 184, -51, 159, 87, -21, 68, 115, 8, -52, -7, 179, -23, -82, -302, -117, -61, 138, 10, -60, -365, -40, 211, 131, -52, -324, 79, 139, 134, -160, 140, 51, 228, 185, -126, 158, 114, -25, 46, 189, 1, -44, 35, -8, -51, 149, -282, 40, 104, 150, -110, 180, 112, -194, 68, 255, -283, 215, -134, -23, -21, 122, 70, -73, 156, 261, -99, -88, -38, -143, -58, -171, 138, -228, -80, -65, -200, -315, 106, 222, -45, -230, -89, -139, 106, -61, -65, -465, -19, 51, -81, 43, 13, 279, -34, 9, 73, -238, 37, -35, -85, 64, -181, -202, -54, -88, 81, -148, 126, -138, -9, 4, -60, -107, -16, 14, -317, 245, 39, -248, 136, 263, 217, -228, -230, -240, -8, -82, 64, -83, -160, -123, -41, 192, -243, 147, 66, 60, -112, -192, 115]
4232A15L5k60q9L20j12Kk16K44k2j50L19j39K12m48O5J94oj68J23P8r6j55R0K26
4256A62k43K22O9k69k43K65K08k3l64L11j64N4L91l59j92O9N6J54k68N1MP6kK76
4280B41R5k51R8Nl20K37k29o5J05R2Pk16K1K15L3r8K1OL05j77l14j5K04q4K24
4305A40j48R8j66K25k52k13M51k22L78r2l05R3k24M14n1l35J31J06k9j95N3K57
4327A14q7J31l18j04k7L73L4Q2k1l15J04L8q8J60K43k87J57k72m49K46P1K92j90
4350a13J91j10l3M0J41l00Q5J3K76j25k08j02J06K30J0j86k08J65q7M22k19k58
4372b70L29q9j9M43m82R3k8k1Q8J18j72oK69k46k60K71J14k38K99k35P3j02O6
4395ek19K64n4JK8Njl4J66q1o4m4j14J72L24m06J94l42L27o9r8K60M3p7l7m02
$$ y = [115, 150, -110, -199, 121, 9, 11, -205, 39, 17, -133, 186, 47, 259, -189, -124, 70, 64, -104, 19, 97, 1, -154, -64, 162, -81, 141, 210, -59, -302, -37, 171, 148, -216, 95, -69, -15, 376, 17, -175, -106, -50, 104, -164, -113, -109, -33, -35, 241, 336, 85, 183, 188, -132, 105, -124, -189, -84, 8, 15, -201, -180, 35, 68, -30, -9, -3, 302, 125, -189, -204, 0, -84, 140, -8, 90, -76, 149, -103, -316, 135, -87, 291, 199, -106, -13, -237, 177, 126, -209, -78, 28, -1, -196, -143, 114, 27, 158, -160, -264, -291, 82, 116, 198, 177, -138, -34, 4, -84, 76, 319, 32, 189, -83, -532, -286, -215, 77, -113, 78, -32, -65, -25, 116, -184, -99, -86, 190, 65, -143, -245, -139, 91, 101, -85, -293, -128, -215, 207, -12, -270, 59, -30, -49, 394, -88, 5, -23, -44, 44, 162, -10, -16, 253, 7, -253, 18, 132, -106, 193, -42, 31, -71, -5, -224, 40, -14, -13, 15, 20, 19, -15, 151, 70, 6, -38, -152, 20, 344, -62, 132, -210, 117, 48, -50, 210, 253, 176, 139, -263]
4421b63L86m40J83p3K15K5j71m0J37J83k05m8J91q6N6j43Q7o1p7J11J44j1n2j13
4445f5l3j7J25j8K46k21O5j54j2J0rk2J07K65l58L31l58K13o5R7K01l80j41K39
4469D6j64j17P7k37L41jK77l81J84j28J31j20j7K71J12j69J73l42L4K74m84J99
4491d1j51L60k46K76j60k52J53J38k90J05J2K90l19K1L5J6JJ5k76R2L49k27PJ81
4515H9l27L03p5k82N27k06J20q4k05L05j53n4K70k17P2k84O2M89l56j11J38j5
4537Fn8K10Q2k00j3P0J24k12J09j37qj13O2K24j15j75J79J12m44K01P6M7rq3l1
4562i6j6K13j07j83J21J47J14j88r8J18k2k93K81M5L22r0l68Q5K99k53j59J35
4584GL0rk04OJ31k4N1L54k70j44O5o7j52L60J9j54q1J55M4K89m92P4j65K68k53
$$ y = [-263, 123, -317, -134, -207, 8, 33, -138, -178, -41, 142, -63, -111, 80, -6, 50, -93, -6, -67, -144, -33, 111, 100, 48, -65, -98, -115, 10, -8, 238, 17, 82, -72, -84, -74, -83, -105, 2, 267, -91, 240, -118, 95, 30, 127, 328, -52, -193, 46, -118, -235, -158, -395, -54, -55, 222, -159, 25, -103, 28, -92, -109, 162, 274, 105, 278, -64, -30, 244, -240, -41, -192, 168, -78, 198, 38, -214, -61, 77, -213, -108, -96, 194, -125, -104, -69, -53, -52, -37, -313, -221, 128, -99, -92, 89, -238, 65, -10, -292, 235, 29, 149, 65, -140, 165, 12, -42, 228, 11, 83, -201, -139, 350, -6, -117, 21, 6, -52, 158, 240, 40, 27, 97, 221, 9, 118, -19, -27, -140, -78, 146, 31, -144, 35, 147, -297, -96, -20, 27, 18, -65, -96, -112, 101, -6, -189, -68, 79, 193, 5, -93, 25, 3, -290, -9, 36, 358, 268, -100, -15, 284, 31, -128, 7, 37, 28, -176, -170, -39, -63, -12, 342, 72, -72, -7, -74, -226, 134, 153, -1, -82, 73, 117, 406, -86, -12, -177, 91, -162]
4609a62L65K5l32J03l9J68k77K53j04L9K5j87K33j07j05j7M9mJ04J40j34m1k31
4632b36J43Q4m7m3K09k9j26J51j23J56j80O9j79J96k70K22o8J99j84R8J04m36
4654b90L22k57J16K47l98L87j52J54j83L1JO0O7j4n3K38j31q5q3P7J5j77M87l89
4678a0l7L05k22j77J67K85n53M42j91j00L4N2j78q4N20j10On7j98J46n9J12l9
4701E4k27K76m56K19qj3J72j79o1J64K35j15J39l30K36k7p1k9j57L36j58K33l25
4724i2r9K73p3L7p2rj76K00J72r6Q2m0j41K04k28M5J20j5l26L47k90J73Jq7L9
4749e1j17J18K87j39k9%k5j63L68l75J79n6kl8J20K07l20k2J35l03L13j71Q8O4
4773F8O0j04k12L65j40j39J23j9J2k6K08j40j54L14m51J19k31O13k45j54J90j68
$$ y = [-162, 203, 228, -104, -1, -40, 128, -149, 104, 0, 39, 64, -123, 110, 3, -102, -119, -70, -74, 30, 170, 36, -5, -236, -93, -9, -56, -99, 110, 81, -45, 106, -17, 139, -41, 28, -151, 45, -225, -3, -71, 128, -56, 42, 146, -290, 32, -225, -109, 138, -260, 127, -25, 129, -54, -23, -22, 38, 105, 91, 38, 276, 145, 60, -23, 54, 69, -108, 379, -10, -47, 258, 36, -141, 26, 311, -242, 200, 9, -91, -57, -5, -183, -267, 253, 143, 149, 92, -106, 40, -19, 93, 54, -173, 103, -353, -134, -142, -155, 17, -162, -223, -59, 176, 61, 200, -130, 106, 79, 8, -21, -178, 158, 0, 233, -92, -191, 82, 9, 46, -26, -35, -211, -11, 161, 65, 147, 107, -34, 170, -58, -13, 107, 92, -234, 113, -177, -4, -3, -90, -51, -168, -50, 237, 98, 69, 69, 44, -119, 249, -126, 53, -3, -5, -43, 77, 284, -36, -58, 77, -226, 87, -84, 4, 68, 128, 24, -188, 177, 37, -102, 21, 2, 14, -12, 196, 56, -98, 216, -235, -116, -347, 266, 21, -133, 57, -111]
4795a11K05j80J44J08j83k29K72jK01j02r8k09R7K04nL3j75n6J02o9R2J22k88
4818a26J57nJ36k54J17l39K72q0J13k07K75k44K01j75K41P1k28RJ28j02R8k92
4840b34L92j27J02j06k63L36j13j93K99K92m69J0j16K10K3%j62M35k13n3L6k00
4862a14l6M96l60mq7J92j37M7KL04l30m0l2J31j33n2J88j32M8J32q8K41k89n0
4886a03K74j87O2N3Jj21k43K28P7r6J15r6j38L08L4l0o0o3M0j03N8q6NJ71k08
4911a08L0J31m3j9L11j83m7j71O2k72L03o6J55j69L2N7j57L15n6k78P2J38n6j07
4935a26R4r6L47k60k0k05L93o7j41l7j03L42M1q0K1k96R7M93m52m2p9L24k2l64
4959b38L14j65j60J02M0P1q9L8k5J08R4p2j02L4n2l5o2K53j87m5L01j10l74P6
$$ y = [-111, 94, -86, 58, 166, -17, -246, 26, 25, 226, 124, 26, -183, -86, 118, 113, 146, -29, -85, 17, -52, 40, 162, -126, 31, 26, 162, -92, 25, -314, -42, -122, -9, -216, 59, -185, 16, -159, 82, 153, -75, -66, 62, -40, 58, -234, 158, 31, 133, 27, -236, 100, -13, -206, 93, 385, -84, -74, -190, 20, 43, 43, -119, 316, 103, 50, 86, -114, -150, 346, -14, -18, -105, 87, -50, -3, -1, 303, -27, -67, -99, 32, -101, -153, 35, -97, -49, 83, -5, 236, -53, -103, 171, -16, 46, 99, 100, -21, -264, -36, 41, -55, 60, -36, -174, 134, 168, 138, 78, 15, 55, -48, 10, -76, -71, 100, -108, -78, 53, 10, -9, 302, 119, 72, -99, -37, -309, -6, -72, 83, -86, -54, 3, -154, 161, 105, -173, -101, 37, -19, -126, -32, -128, 219, -41, -61, -266, 127, 60, -81, -118, -221, 121, 162, 82, 103, -193, -96, 397, -55, -97, -176, 148, 126, -238, 76, -89, -249, -147, -107, -36, -125, -87, -112, -4, 90, 18, -84, -50, -102, -137, -199, 54, -133, -178, 123, 13, -361, -285]
4983b85J24j35P7L20j23J59j58K43l59M7K36l43L97n2l17J35J86j56L8j30k7K29
5005A06j73P0K0k6P5j0j16j39L23q5J2l26K39k1J18K40k17K94k32j60k3J15k41
5028a57K02o2j87K44L6j79O2J00l3j62J15Q6M1k85K21R9j6k71K93l46K57k43O2
5051a23K39m51L86K52m57J3m4J74o6o3M38m60J35p5M64n00K43j52R4l4j3j15m3
5074a58K83l56K27j37J39j88K3J27J25j53L5R7m0J89k4j86j80M27l26J71O1l56
5096b00K96j36K65k37L7j27K10k18K47j98J18K66m35J13j83J20J52J49Q5k23j10
5117iJ7j16J75k3L07p36L88j71L0K14n0N0M8Pj07R4m39K46K26j30O9o2J63k96
5141a05N1J54j87P9M4k53K41rP8q8r6J15j61K31m5J8n0j39K17R5R9j71J3mj49
$$ y = [-285, -161, -296, -219, 101, -22, 137, -21, 222, -137, -90, 146, -197, 200, 148, -169, -34, 152, -4, 34, -96, -123, 106, -67, 3, 23, -3, 72, 62, -54, -193, 130, 45, 57, -269, -30, -51, 67, 307, 90, 384, 152, -8, -31, 84, -157, 45, -17, -204, 40, 76, -103, -41, 59, 26, -136, -21, 65, 106, -179, 42, 141, 125, -146, 147, -199, 58, -185, -123, 116, -335, 51, 303, -154, -141, -185, -11, -77, -140, 298, -162, -27, -102, 362, -138, 105, -47, 47, 13, 0, -115, -158, 125, -231, -4, -141, -2, -190, -167, -40, 85, -68, -33, 64, 24, 213, 189, 3, -177, 250, -76, 95, 156, -200, 96, -40, 225, -12, 25, -102, 108, -110, 137, -61, 57, 323, -112, 1, -182, -62, 90, 239, 324, 101, -9, 8, -108, 67, 44, 351, -385, 3, -168, -138, 76, 26, 76, 124, 131, 24, 118, -321, -75, 151, 21, 90, 28, 191, -105, -54, 100, -87, -8, 36, -217, 24, 15, 93, 5, -91, 24, -137, 94, 49, 67, 17, -122, 95, 190, 289, 118, 131, 127, -22]
5166b2l6J21K12j72o1j51L18K6k27K66m03K5J34K9L46j58j08j95j23K30k77J19
5188a07J39O2j86K35r3j16r5L99l07K10j47m1K4J58k52J61j64K0N1J70k6J9j67
5211e3l7j17K02P8M8r0J78m43L40N9k52j00J55K37j00l08L6R2K7m5n0M23n22M12
5235A70k55K82r3k20K46k40p8K91j60l3J65k29K52j81L87n43O02l44o1J92p2J28
5257B06j59J97o2K8n1k76l9L36k35J30j19J84k7q8J73j69P9q4K69j16k16K12m75
5280c02N31l45j0Q9NK35l1k88N2K48j70L3K7j47p9J67K0K2o8L4j17k29L56J66
5304A99n43K76J04%L8Jk9j67J72k71L42l72L59k84K46J05k24qJ43k6l3J5n4q8
5328i9j25K87K19l01o1m7K84p7J15j17m9p6J33j94L15l34l23N87j31J79k33j12
$$ y = [-22, -58, 63, 275, 103, 42, -109, 209, 235, 8, 274, -129, -104, 30, 59, 405, 247, 139, -56, -179, 51, -226, -107, 32, 94, -92, 143, 50, -66, -161, 238, -69, 141, -6, -47, -23, 135, -117, 44, -120, -100, -49, 121, 95, 114, -53, -90, -207, -5, 73, 121, 31, 209, -234, 106, 165, -87, -187, -32, 205, 105, -203, -167, -75, -48, -93, -143, 280, -242, 170, -85, 197, 104, -116, 130, -110, -188, 103, -57, -90, 75, -154, 98, -83, 304, -239, 363, 19, -42, 150, 78, 206, 47, 244, 182, 210, 159, -117, -156, 180, -55, 75, -44, 140, 113, 25, 198, 29, 108, 24, 293, 177, -39, 173, -302, 229, -116, -126, -37, -32, 203, 172, -116, -64, 184, 14, 47, 74, -73, -152, 15, 35, 57, -11, 23, -94, -323, 33, 199, -344, -68, 36, 36, 74, 75, 46, -121, 51, -220, 122, -250, 109, -175, 71, 176, -48, -56, 87, 61, 28, 43, -11, -99, -224, 63, 282, -19, -80, -127, 157, 80, 195, 78, 29, -47, 86, -108, 207, -127, -450, 137, 6, 185, -48, -160]
5350a60R2k88K04K62j44J49j37k1O9J71k28j53oJ03J21j18L8J42l7l10J01q2L75
5373A43R6l9j23R7k60K91k22k28Q6M8J22j01J66j22K31j25k57K86o1J24k50K62
5395A64k54O3k07J36K36o3k62M38j30r0K38m00J26NL4N7j46O1j59j6RK18N9k08
5419i1P0j28q1J45j60M82m82P7J53j30J96J45o1k36K61j93j98K58J11m02K36M0
5441A2lJ63j07j84N2K8J00J17k25Q7j14m4Q8O1j18N7j3J11j68K23P1l97K62q2
5465b3K78l10L11m24J73K54m64J78k5J03Kj61k3K40k07N6L92l57K75q9j69M1J06
5488A57j21J4J8R7k61l3L64j14j33M3j10N3K45j81p6j01o3K51q8K4J6j37oj9J18
5513d3Q8j57J29J1k43j32N32k10J43j10j28J22Q8J25k04N7k05j05M73r6j32Q4
$$ y = [-160, -68, -356, -152, 110, -34, 115, -22, -43, 26, 197, -31, -184, -190, -87, 34, -84, -46, 96, 59, -251, -150, -232, 143, 239, 200, 77, 174, -86, 205, -17, -245, -159, -111, 11, -90, 76, -46, 185, 60, -197, 89, 28, 152, -98, 164, -90, -27, -234, -98, 138, 75, -187, 251, 121, 31, 269, -131, -5, 0, 34, 91, -55, 6, -153, -169, -160, 58, 117, -91, -21, -149, -230, -85, -245, 237, -245, -168, -15, -145, 51, 196, 135, -101, 160, -33, -231, 27, 138, -264, -28, 12, 9, 172, 65, -119, -67, -39, 61, 178, -47, 40, -74, -118, -30, 31, -87, -30, -43, 68, -100, 123, 194, -203, 59, -23, 255, -55, 256, -168, 5, 259, -205, -27, -52, 51, 53, -108, -131, 109, -98, -42, 350, -7, 268, 179, 10, 51, 157, 36, 50, 68, 165, -96, -129, 235, 121, -12, 31, -79, -26, 219, 38, -38, -139, -202, 49, -39, -15, 1, -136, -142, -161, -43, 45, -112, 17, 28, -215, -347, 185, -25, 118, 8, -120, 2, 90, 215, 11, 68, -137, -242, 231, 135, 3, 87]
5535H7J77l20J1K86k60k74L08J3q0M7j04J61k72J96j50%M8JQ1J55k16mK73j6k07
5560e9K50L51m09oKl0j04J0L1l1q6Q2r5K75k90n4R8K6J80k62m1J29P6K5k14J82
5586C6no8K56m56K23j51L22j42k32K08L0J78m6p3PK05r6j99j51M73k81m7j09K03
5610H5j22m0J6j66L97j67j9K49l29N8L5O6J40j57N7m0l30N5J91J38Pk55J81p7
5634b7l5P2l6K10r7k38%K42l6J7k17J30o4j10J23N3j85j77K99J45P2j96J85k03
5658g3J5Q8QM0Q0j45k4J15l03J64J87l3J1k42N2K27q8K9k58K70j81r4L7o5m2J73
5684e2M16m02J88K4l90L61j31K4r1L2n7J89j30m9J54j75K15J16j37j1j99j03L38
5707A30j40r0N1m5L46k28l4O6KJ28n1k78K66m01K14P3N3j62O4J99k87M15k69J18
$$ y = [87, 264, -56, -45, 241, -19, -293, 15, 28, -52, -5, -109, 52, -220, -24, -174, -174, -126, -125, -44, 111, -105, -109, 164, 148, -59, 191, 542, 133, 127, 129, 99, -5, 5, 36, 5, -81, 1, -94, 181, -109, -163, -65, -39, 141, -121, -162, -33, 43, 68, -146, 36, 31, -37, 219, -237, -14, -165, 157, 15, -217, -9, 21, 199, 153, 80, 87, 292, 196, -3, -154, 319, 38, -9, -118, 85, -37, -77, -61, -227, 170, 3, -16, 233, -96, -38, -3, 63, 203, 46, 103, 63, -267, -212, -21, 117, 124, -131, 50, -27, -62, 10, -26, 184, 87, -151, -151, 91, 55, 72, -145, -15, -79, -189, -66, -13, -198, -375, -76, 69, 141, -55, 130, -73, -58, 30, 38, 78, 158, 13, -11, 104, -199, -35, 152, 119, 130, -112, -60, 167, 79, 108, -150, 120, -61, -155, -118, -183, -225, -52, 364, -38, 150, 174, -216, 145, 14, 38, -53, -21, -78, 111, -19, -68, 86, -89, 126, 242, 105, 94, -105, -208, 130, -10, -100, -49, -94, 252, 24, -10, 56, 58, 186, 135, -143, 123, -278, -64, 9, 62, -100, -36, 163, -124, 291, 22, 140]
5731A40j62J9P2j23J20J38M1r0k31L38k91J68l43N19j91o9J07o6l03K60q2J0J26
5754A07l39K61J9J01k83k04K87K02l73M2M7R1q9o3K66o5k04K69j59j02K85J94
5776B90l23k17K27K77l58L23l55K4L0K3j42Q6J06m8L8j33J39P8p9o7K13j38m0
5799d6r6K11j08J16j51J20j70J92J18n5q6j34J1N8O4l59J87j4M01k87R8k9J45
5822A86jlj10J6l41M30k68Q3pj22n3j22K57l39L52QP8j11R4J73r9n6r4M3L7r4
5848f3O1k58K39J47j87K91K1j02l46N9n8K40J17J72m66L97l55m1J75R0Rk76o3
5871a97K35J33k17K92k76J74j36J24K8m93K85l4K12j59j04J39K09k62J75lj81
5892e6lO5J13j48l2o2J97l06K97k03P4N4R0k77j1q9K16J76m9m2j33J77l18L60
$$ y = [140, -22, -3, 69, -54, 66, 204, 245, 155, -76, 262, -29, 139, -204, 315, 124, 55, 162, 96, -207, 53, -29, -19, 107, -232, 29, 48, 149, -134, -338, -51, 151, -222, -180, -133, -42, -131, -194, 72, 7, -197, 72, -87, -189, 96, 290, -33, -250, -23, 254, -104, 219, -136, -112, -82, -59, -201, -115, -9, -57, -19, -152, -13, 65, -14, -81, 132, -6, -46, -142, 69, -39, 77, -74, 46, -124, 68, 186, 131, 45, -89, -78, -20, 44, -315, -128, -142, 259, -28, 70, 41, 186, 185, 182, 72, 88, -253, 177, -91, -8, -15, -137, -190, -312, -55, -394, -42, -34, 44, -67, 27, 200, 101, 45, -49, -6, 31, -63, -2, -260, -21, 126, -61, 230, 251, 149, -197, -138, -196, 44, 161, 333, -133, 264, -91, -132, 43, 133, 142, -134, -197, 38, 171, -46, 246, -30, 144, 8, 132, 160, -333, -48, -82, 130, -29, -133, 6, 215, -47, 128, 125, -56, -59, 6, 119, -29, -61, -123, 74, -232, 65, -138, -64, -10, 80, -197, -208, -297, -81, 95, 46, 4, -129, 48, -270, 90]
5916I0l21M76l68J22P4j98J83k61j00M19j24r0J54k15L45L4l74J33O5j25K65j23
5938F1l6j55J12m4P7q5K78l03J26k7p0L32o01K99j47J04J56K4j17l49M19RL1j53
5962e9m4L4%p2J70P0j00L8j75J14k0J18K59n34J93J52k32R0j29P2L25k64P6j76
5986i4J96j33J45l95K58K38r4j15j32L34k88J23n6J37m0l15J90J15p0k84J7M05
6008A42k36n1L53n8k89J01K2K34j96m7k3N2j89n4K59kj87L24m40K64k75J92K57
6031A53k85pK98P9n09K09R3j6K69k75K4K31k23K5p4M1P6j26m1K98j65j67J20K47
6055B75k16o1L28l36L99n20K87j23j59J38J32k29K69L9j55j42J84j35J3j23O7
6076f8Q1o3r2m8K31j09L81j82k45j02K87k57M35l24K25l23P5r6J45n6P7J01l9
$$ y = [90, -231, 245, -123, -1, 73, -125, 58, -203, -303, 116, -8, -98, 56, -159, 186, 220, -154, -21, 44, -81, 184, 61, 25, -130, -18, -62, 15, -70, 208, -95, 31, 4, -66, 266, -335, -36, -183, -79, 77, 101, -16, -365, 54, 63, 94, -59, -103, -69, -69, -141, 29, 99, -1, 37, -138, -24, -44, 74, 333, -201, -8, 144, -88, 2, -127, -55, 270, 6, 82, -94, 102, -31, 114, -281, -23, 215, 121, 6, -126, 208, -80, 43, -13, 124, 84, -231, -41, 74, 4, -280, -263, 142, -94, -145, 208, 150, -139, -38, -16, 218, 22, -25, -48, 4, -185, -239, 20, 18, -169, 155, -285, -21, -296, -104, 153, -132, -139, 159, 238, -271, -62, 31, 15, 284, 9, 33, 264, 41, 66, -8, 33, 109, -17, -58, 240, 75, -92, 28, 275, 59, -2, 326, -10, 389, -131, 156, 33, -126, 12, 144, -85, 184, 223, 68, -74, 110, -25, -12, -135, -68, 13, -50, -142, -190, 41, -68, 313, 131, -114, -216, 71, -186, 249, -75, 150, -173, -98, -194, -49, -105, -28, 73, 34]
6099C4j3J9n8o5j70J93J48q4J9k9j30Q1O1j41J38N8P7m8P3j99J30k61K61k35K66
6124A25J30l36m2n1j4K09j43O9rO4J57p2n4P3N9r8k8J16j60mRJ5m0P2k56j22L94
6151F3j4l42M8Q0L16j11j04K58k40j0lN8J35m2j12q1J53J41j06r3L58n14K61k54
6175a55K4kj21M11j33j24J16j04O5J29J94k84k3k1K68l09K54k5j42P0j32K07m61
6198b98L52J69l69L33k72l4J70l49L62j52j76L22M4l56K9K49j42n7J81M7K4m0
6220C7o1L8j15L62j63l39K01J14k70M25m79K10M6J37k72N9K38l6j0j55k2K44j21
6243F8k02P8J47o7p3j85K23m4k31J24p2O8L57j66l3P5L9J05j00j08j09L26N1l23
6267e2R8L2l3J30l28L19j46P2k16K08k06K06J93k13j18K5J08j6k31J63l3j29J18
$$ y = [34, 21, 40, -18, -83, -253, -60, 88, 4, 23, -6, -136, -55, 6, -135, 3, 61, 138, 90, 163, -36, 94, -167, 94, -141, 125, 255, -81, -123, -174, -188, 21, -122, -53, -62, 2, 159, 87, 33, 106, 165, 67, 39, 155, -5, -9, 0, 15, -25, 47, -209, -331, 63, 49, -293, -245, -165, 151, 40, -64, 194, -46, -56, -59, -1, 134, 92, -20, -101, 52, 193, 87, -6, 352, -162, 99, -155, -131, -133, -254, 157, 24, -100, 16, -88, -23, 106, 300, 16, -7, -28, 240, -69, 185, 160, 18, 88, -44, 163, -298, 54, 223, -146, 187, -85, -119, 51, -298, 64, -88, -264, 58, 102, -254, -225, 24, -118, -175, 6, 53, 77, 37, -24, 14, -101, 261, 98, -241, -40, 74, -196, 229, -250, -40, 6, 143, -129, -70, 168, 132, 122, -33, -55, 189, 68, -134, -56, 91, 24, -49, -234, -11, -55, -286, -162, -234, -166, 191, 25, -8, 67, 106, 211, 111, 3, -106, 220, 271, -52, 46, 78, 45, 175, -153, 166, 20, 92, -124, 84, -122, 84, 277, 64, -54, -29, 79, 63, -168, -5, -38, -167, -49]
6290d9O0j88J39Q3k0LJ20n90N13k5k83K98q4P6J2Q9k8j86J34j16K6n3q5K9mJ55
6316B6J5j97J5O4J20Q7k56J81K40p8q9J16k72K82m33j1J32P7o4j50K01J2k31K22
6340IM1j4J17p2J60k99K02l66J78K4N5K78j98k13j17M62l34J61l06M23j40j43
6362i2K52j62Jj19J4J92k30n0R6J61j63j41J18l2J58M5j04j06K80k4k7j49j19
6385b01J86k31J26J42K45k63q6QJ36P4j4M0k44j03J65q3OL60m29K74j29j6J65
6408A28j24N7j91L44l12K23o9pq4k3o7Q2m3P0j8J2k64M79q3%j22k60K79Q5oj09
6434b3K3J9Qj36J71j00j45K2OJ72J0o0j24J33M5M6j23O3m5l3N2m9J37K1m0k8J41
6461A63l18PK08k4R1k00L43L7m48J51O7k2m8p7Q2qj31R6P1k1J84p0k67J52J9k7
$$ y = [-49, 11, -177, -38, 45, 25, 28, 148, -442, 71, 46, -237, 61, -23, 53, 65, 154, 126, -60, 74, -42, -16, -69, -154, -125, -129, 26, 41, -156, -141, -77, 43, 130, -126, 55, 295, 217, 128, 244, -28, 254, -179, -190, -58, 19, -45, -195, 6, 18, -213, 9, 50, 36, 153, 81, 241, -58, 144, -222, -44, -20, 35, 313, 115, -98, -215, 247, -87, 74, -232, 191, 51, -92, 160, -2, -1, -120, -106, 86, -144, -194, -98, 63, -100, -241, -123, -155, 3, 48, -56, -162, 118, 94, 67, -82, -201, -15, -246, -120, 22, 267, 4, -82, -74, 62, 136, 122, 162, -82, -185, -20, -103, -97, 263, -166, 108, -21, -37, 128, 4, 61, -130, 214, -98, 125, 56, 49, -35, -58, -125, -43, -86, -16, -34, -22, -286, 193, 110, 110, -12, -272, 7, 92, 86, -23, 0, 19, 27, -109, 62, -38, -183, -161, -155, 17, 27, -33, -157, -24, 21, 67, -56, 7, -38, -71, -19, -68, 69, 90, 50, 22, 163, -155, -148, 60, 36, 127, -73, 270, 307, -141, 10, 77, 55, 7, -70, 12, 4, -127, -31, 40, 19, 203, 133, -134, 18, 37, 10]
6487A0J44k81j4l9K45k3j8J7k73O7L5J33J00J1k84J18o1K3M3l1J57l5l1q7L2J71
6513A29l33M03j88O3J35j85K47P6k82l0j8l7j73J61J83j18oK31k68k6K3n4j12
6536a79k7K16P6K5M5l0k55K18L0j22J07m1m1m3J97k39j20K84m9j6k56L23l27J92
6560c2OJ4j30K52Q7r9O6j77J28k65L04j6j61j3P3k28J45j2P2P7Q8o11K54J08J73
6585A03J73m42K26J12k40L19k07j10M9j62J85J17Q3k57l7J59k43K88j56R1l2j19
6607a00J24J98j58K9o9mk23J94k1J78N8j17J0Lk6K63m18P2j5j60K81l44M7K35
6631C7J27k8j38J37k03k1M17k93L1O4J57k20N4j19J18k43L90k18J0L0j81J98k61
6654a55J87J21p9M5k01j0r8m1L67k84K06l1J06j53j39L0K43k65m0K15j96J00J82
$$ y = [10, 154, -127, -141, -180, 65, 42, 24, 41, -232, -165, -130, 3, 103, 114, -170, -52, -113, -90, -47, -78, 79, 44, 13, -74, -42, 129, -204, 199, 11, 74, 209, 24, 271, 347, 65, 35, 17, -20, -193, -32, 151, 33, 27, 258, -10, -36, -13, -67, -179, -206, 10, 86, 111, 156, 126, -129, 89, 119, -3, 104, 63, 22, -21, 176, -63, -183, 101, 52, 36, -220, 103, -224, -32, -26, -12, -142, 110, 197, 98, 164, -13, 115, -150, 154, 138, -23, -36, 37, -191, -46, -58, 14, 91, 179, -432, -178, -70, 103, 276, -166, 60, 172, -68, 251, 44, -66, -17, -179, 6, 123, 206, -51, -88, 71, -172, 116, -40, 51, 19, -100, 24, 222, 64, 93, 24, 20, -203, -9, -30, 148, 206, 89, 99, 102, 76, 339, -79, -7, -22, -182, 99, -245, -198, 37, 164, 136, -2, 135, -68, -89, 328, 35, 66, 130, 287, 67, 121, 2, 120, -123, 267, 49, 59, 89, -92, 106, -155, 32, 153, 74, 119, -82, -92, -190, -231, 136, -148, 58, 27, 133, -20, -159, -129, 114, -151, -191, 24, -172, -72, 110]
6677A10k03k39K99N5m0m7R4j3L64k40j79r9J17J41J13q4O0l47L66l7l25pO2L1
6701d8K22l23K37m3J73j80M1J62j08l12oL19Qo4j17J89k81L38m32J39R7M3m3J17
6725A28L8k84N6O3J6k21L56J03l97J80k10K25P6j8j13p0O4p6J18J30N8k11J35
6748A46K0j01Q1m5J79m75K07K66l55J66l62K62J06l27L86j84O2P7l39R4q8p1L42
6771D7k05N8J26m5Q2j94P0R8q2L29l17J61k71K35m8k30J45j48K31j61j31L39l11
6794b22L64K4M2j08J0R6L8l70N9J42k01K25l02Q1J4J94N1J0j51k00L43j47q9k9
6818a26p2J92k35M91k46J09k89K58k9k10J85k01J58j03J47j48L17m78Q4K83M1
6839A28j8k15J68j70l4J97L5K44k95k72K15lN8K71k02j2Mj69K9J18J76k76J05
$$ y = [110, -93, -332, -33, 22, -18, -65, 29, 16, 380, 140, -39, -138, -21, 120, 233, 149, 209, -138, 228, 191, -134, -141, -79, -48, 174, -149, 88, 45, 218, 38, 79, 241, 133, -179, -185, 134, 142, 78, -39, 150, -131, 207, -225, -86, 11, 54, 11, 128, 166, -118, -62, 1, 17, -204, 152, 255, -142, 38, -172, 53, 129, 111, -2, -72, -8, -84, 34, 164, 222, 11, 146, 166, 65, 146, 101, 280, -195, 12, 278, -77, 89, -273, -11, 95, -232, 154, -30, 32, 109, -230, -136, -224, -295, 47, -158, -100, 26, -19, 63, -131, -61, 37, -45, 284, -33, 128, -143, 92, 44, -186, -41, -189, 42, -119, -250, 89, -222, 142, 166, 208, 100, 110, 206, 244, -126, -67, 75, -126, 99, -203, -122, -108, 86, 137, 147, -4, -204, 139, -8, -97, -126, -198, -6, -241, 250, 4, 113, -176, 82, 53, -157, 28, -173, -15, -118, 29, -119, 198, -280, -196, 87, 128, 110, -105, 63, -107, -141, 56, 91, 335, 40, -232, -17, -20, 38, 309, 107, 95, 99, -70, -41, 77, 253, -23, 82]
6862H2j56J75Mr9m1k63L02nj10Q2j03K56l26K49JJ3p4pJ72l9k64m1J22m7j8Nm5
6889a75K78j53J87on3k41P6K05l61J99o3J70o8J90k5lk58J6J61j0K3J65k20j24
6913i0O2O0N2J27l26L02m22qK15J8J18Q0j15K6j45K83l92J64M5R8j45Q8j12J15
6937I8o3K4q8K2M1l69K44J97r4j04J43j3l4j94Oq6K74q3R5k6R7n0J82q7j57J5
6963a0J56q8k16Q2J1J3q5J38j37j18N05m94L52k96K60k18J48k2K44k88Q4K50k64
6986Gm3k87O02o1l13pK42r1k41m7r6O03l23L5J07q1J89j37m7m2K12j79Q9l14J53
7011g0O7m1N5Mj03K57k44Q6k41L72j90J1P6J38q0j23j7Q2m2J8KJ49r6O7o9k44
7037a76m2N7O8K04p9j66J28P5K28m39J71j4mj60L8L22j28j07m4R8R5j60M8j39
$$ y = [82, -74, 101, 105, 6, -35, -298, 4, -1, -111, -29, -132, 124, -202, 47, 48, 61, -13, -20, 152, 113, -151, -192, -70, -117, -135, -130, -175, 103, -50, 137, 131, 78, -163, -87, 118, -243, -44, -107, 63, -5, 185, 160, 157, -101, -85, 76, 66, 89, 254, 34, -90, -28, 32, 84, 211, -115, 187, -235, -243, -28, -10, 108, 188, 73, 99, -46, 237, -155, 9, 54, 152, 7, 95, -17, 98, 35, 59, -29, -7, 34, -335, -91, 106, 12, -92, 51, 38, 4, -190, -184, -270, 4, -79, 16, -10, 87, 37, 219, 132, -25, -10, 146, 58, -158, -76, -65, -52, -137, 1, -136, -254, 251, -243, 109, -187, 73, -145, 3, -19, 225, -63, 21, 271, 7, -36, -323, 279, 218, -95, -102, 140, 49, -192, -239, -335, 268, -55, -20, 87, 6, 195, 58, 11, -31, 181, 2, 91, -223, -70, -3, -44, 11, 15, -88, 169, -75, 11, -230, 142, -48, -37, 39, 177, 97, -26, -43, 39, -3, 15, 17, 166, 70, 137, 68, -176, -218, -161, -93, 111, 32, -134, -6, 69, 297, -142, 29, 15, 11, -149, -111, 211, 83, -24, -68, 30, 125, -35, 13, -126]
7061a26J01kQ7RP1k53K53n7R8k18k90N15k33K0j83J90J74q0n4J00M6m39K01J80
7085A10L3j24l3n0q2K30j78K26j47R4K08j46l09l2L00k04k47K95J89N8k27J50
7107A14j33O5M5p0q2j00p6J77R7l9j01J04p7J22L2l9mk7p1N7r1K37K1l05R4k8
7133g8J29K47o77M44p0j22K50j50M11m02l2J83Pk67k25M67j93K92k87K22lk11
7155f5J9K2L03n00K49q4K34l66K46k45K87j03j82K46R3l65J02L6q2J42J21l25
7177b17J94J12lj05Q9R8Ol48K27r7J21J6J02k27k47L21k01M4K63n7k18k22J77
7200a72L11Q6k23j28L56l01l8J47j98J54O1OQ7j08L6Q5k02o1K0j22P3K30k77l7
7224b15L72l72K7R1J80J1o7l09L42k21j55K84l2J10J18Q2r3l62K56J30k04k02
$$ y = [-126, -25, -27, 60, 69, 140, -113, 140, 83, 181, -37, -327, 188, -45, -25, -208, -18, 156, 76, 22, 122, 168, -271, -70, 110, 143, 19, -14, -64, -146, 84, -94, 132, -15, 79, 287, 141, -168, -200, 100, -104, -351, -56, 133, 191, -36, 114, -19, 46, 91, 21, -61, -161, -237, -60, 37, -2, -103, 1, -76, 46, 78, 39, 35, 8, -63, -6, -97, 140, 161, -144, -50, -78, 51, 298, -379, 65, -5, -127, 123, -27, 384, -18, -50, 133, 140, -127, -352, 115, -78, 214, -73, 149, 146, -65, -46, -24, 279, -221, 28, -56, 178, -188, 58, -187, 100, -3, -185, 61, 154, -211, -109, -73, -155, -13, 108, -217, -23, 89, 86, -19, 70, 168, 174, -174, 53, -44, 77, 93, 195, -32, -279, 42, -159, -115, 148, 91, -127, -349, -172, 139, 225, 2, -126, 230, -71, -109, 38, -160, -6, 55, 61, 148, 40, 76, 161, -41, -102, -82, -204, -131, 99, -178, -215, 157, -215, -188, -97, 83, 94, 27, -282, 60, -161, -316, -32, -64, 46, 164, 246, 153, -209, 47, 177, -27, -229]
7246b29N5K50l73N33p2l06R1m5J03j76M58l94k20M93l44J71J74j14j51j3rJ13
7268eJ24N1m48K99L15j08j39n9Pj91J58p0L3j28J10J61j77n1O2Q2O0R3j02m6O5
7293I6J18j02m36K02J96j37J09J20l52K74j46oL7J83j99l23K33j9J7L24k75J66
7315H0n8N7q9k51L50p0j49Q6l5J77r3j68L39j05N8j31j75J92j70L22j24kJ87n2
7339A76k00j34O3J67j46j13J33o3N9O7j04L07j21Jj40P2L7J22j19q5K05j07M2
7362A19J8Lj2J9n7k42m2J60QO6L8k28L8J37k49J87j08J20Ol4p5K28n3J0j40R3
7388A0q6o2K56p3M8p7P8l65K78J26j90J29N8n7j58K0M2J62j25k27K96J40k13n8
7412d8J25J05k31K91k13K8m0j53L3JJ06j46%L3J62k36r4L66j63J24n6j82L36Q0
$$ y = [-229, -174, 76, -297, 236, 164, -142, -51, -96, 7, -169, 289, -105, -325, 168, -176, -5, 169, 55, -96, -109, -118, -5, 119, 170, -278, 21, 336, 228, 89, 30, 37, -154, 4, -66, -33, -161, -51, 110, -67, -118, -56, 26, 86, 179, 77, 31, 96, 214, 112, -324, -122, 74, -63, 46, 166, -186, 88, -58, -64, -27, 156, -43, -366, -133, -152, -135, 189, -86, 80, 22, 79, -10, -261, 89, 19, -130, -44, -79, 98, 5, -163, 176, 71, 129, -2, -177, 15, -155, 167, 43, 41, 228, 176, -24, -158, -95, 72, -74, -187, -54, -117, -58, 9, -95, 212, 91, 92, -48, 24, 61, 183, 64, -21, 184, 77, 119, 137, 140, 128, 147, 90, -152, -194, -34, -26, 40, 78, -150, -112, 25, -224, -37, -145, -25, -19, -53, -128, 100, 47, 57, -83, 10, -76, -138, 118, 45, 93, 16, 94, -271, 7, 133, -57, 72, 130, 73, -85, -65, -23, 139, 14, -213, 83, 223, 10, -48, 77, 182, -49, 242, 29, 57, 17, -136, -103, -102, 4, -142, -142, -109, 53, -183, -277, 89, -74, 50, -6, -188, 148, 228]
7436B28k8Lk99J33j97L60j35K21k92l3j7O1K41m35L96l72J96J78j19k97M0L16
7458A49K3j23j25p4Q0K96m6p2l96J23K99j26P1k07J07o0j47L14o9j54Q9M9L3j41
7482a07J6J9Q5J8p3J12j00J67j08K74l51K02m0r2K8k53K99n3k18mJ57M2O9k32
7506a43k4J65j07K54Nj85j50L18m11M65l16K38o8l0n5J21Q8k76J10j67P4P1M5
7529B2J71k9l63N0K6q8J27J33j04P1p9L5J8k40K68K34j49k19L5L38ok16j39J46
7553D2k13L24k64J48P1Q3j07j67J5K93j78k1m2K7n1L52n54L45J13k49Q3P9j97
7576f8q9J67j9k32N1J13j60L77j60M3j37K57j99m0j28J80o6J28j30K41L7j46q3
7599f3j4K6J67j57n4L04k82J56k06J4J04J26Ol50L78k61O4K61k82lO4P8J2J84
$$ y = [228, 200, 203, -96, 37, -160, 200, 65, 286, -6, -39, -56, 5, 246, -189, 207, -165, 31, 209, 90, -207, -167, 149, 172, 49, -76, -150, -70, 226, 180, 108, -288, -165, 134, 8, 79, -128, -21, -81, -228, 86, 17, -137, -48, 1, 34, -107, -91, -72, 13, 31, -42, 70, -30, 137, 29, 303, -48, 154, 114, 22, 50, -203, 96, 43, -175, -179, -22, 20, 89, -143, -167, -2, -109, 145, 150, -35, -185, 133, -278, 187, -129, 109, 41, 11, -44, 77, 165, -111, -1, -168, -94, -23, 22, 193, 164, -199, -149, -123, -211, -84, 49, -55, 16, -63, -28, -10, -250, 18, 252, 103, -116, -81, 257, 251, 35, -104, 42, -171, 153, -111, 37, 108, 191, 84, -83, -68, 225, 47, 26, -16, 11, -40, 312, -242, 103, 216, -33, 50, 129, -68, -157, 10, -9, -241, -190, -77, -237, 140, -20, 23, -114, 143, -56, -96, -224, -44, -110, 18, -112, 129, 166, 20, -63, -77, -51, 116, -41, -95, 209, -73, 83, -123, -109, -5, 121, 127, -223, 155, -106, -42, 219, -63, -66, -2, 76, 88, 272]
7623B72m68K88k65M3J59k3M1r4l9l4k8P0J94j33M2J03N1j71M8j83J25K4J0p8K29
7648A83j84R3N3Jj5J30l78J67m2n8k56J36L37r6j63K05k36J07K31k33Q9j40Q0
7671A1k03K17N3k25K73n26K69KJ03o6K0J33J73m33j20L89o5j9l2J7j17M17k64
7694GoN2J02LL4j91M9Ol04M59j61m4j38J90L09o71M75j54q7L91k29j89L6JQ1J46
7720A67k08J2K49k85J40j30J4K47j73k9p3j51L13Q2k83k0K03L71m23L2m05M07
7742E7l3jk3J31m14L16M9j60N6r3p4K43Ok15J91O5j06j7o3K17j3q8O9o7J12j33
7768A2n0j02M9N5j36J00n2r9lJ27J06j14L69j06J58n91L92j77L46o2j60k06qJ16
7792c6J41M5j13j9k54K82oN5j83J45n2k3J20j77L95l50R4j58L24n4j93N4o2p6
$$ y = [272, -196, 92, -173, -130, 29, 6, 47, -47, -86, -120, -148, -78, 116, -17, 25, 128, 179, 8, 56, -127, -2, 22, 32, -46, 183, -1, 92, 145, 146, 131, 261, -117, 50, 8, -50, -306, -170, 167, 71, -92, 113, -123, -16, 215, -18, 71, -69, 11, -192, 25, 78, -147, 126, -400, -131, -129, -26, -92, -72, 61, 234, -199, -319, 70, 5, -14, -46, -29, -146, 271, 7, 1, 53, 155, 158, 192, 1, 50, 56, -248, 211, 50, 6, -132, 58, 367, -304, 171, 17, -70, 321, 92, -97, -61, -60, 21, 167, -41, -29, 220, -65, 75, -55, -41, 206, 33, 4, -69, -220, 93, 175, -108, -128, 75, 446, 23, 55, -350, 57, 24, 23, 0, 131, -283, 33, 82, -78, -22, -115, -189, 54, 60, -155, 36, 101, -5, -22, -85, 132, 119, 31, 100, 33, 145, 12, -38, -140, -91, -36, -172, -72, -124, -223, -226, -99, 7, -107, 262, 156, 314, -277, 115, -62, 284, 222, 62, -144, -152, -36, 105, 150, 37, 18, -236, 46, 40, 95, -88, 57, 5, -18, 102, -75, 320, -30, 64, -94, 230, 176, -17, 37, -25, -101]
7816a01K68j04q4J88l51K97k39L37p4l29L8J67j95K8K59j69J7J16j87K28M8k21
7838f3l63P87k02K6r9MJ59l69K96j51R3j85p4P2L49mn06J10K31j99J97Q9q2l63
7862b47K02o6j5K23j76k7l7p7K02j95J42Q9k42M21k09k27K38n8K78k57J89j89
7884c8J0N0j13N8j6q8J42j0R7l36NJ03k02Q3L32j30J42r8j1j26J53L6K20l01K67
7909B29j76j82k3J43j02J18L2R1N1k19l54L4N8K62j40J21P4j94M25k60j56J99
7931C1k1k13K67N9Ll21K94k6N4L2O5O9j61j01Nj35J26J30j29j14k0J34j10J99
7955A17q0j24%l6K07l46K66k22J25m7J68k04kJ45j99L23r1j54L16K10m46L8M4
7978HrP2m3m2J10j58K70m16J49J04p1p6O8jJ21l11O3J88J4l0o8M6q9J67k32J19
$$ y = [-101, 167, 63, -21, 167, -184, 113, -126, 211, 137, -192, -154, 13, -182, -154, 105, -64, -47, 69, -118, 110, 158, -63, -426, 361, 159, 185, 86, 90, 249, -120, 176, 25, 118, -67, -141, -69, 280, 276, -230, -120, 111, -88, 109, 198, 116, -247, -45, -111, -126, 97, -79, -106, -143, -220, -18, -213, -71, 18, -224, 197, -12, -239, -1, -59, 219, -38, 151, -38, -28, 22, -91, -33, -49, -137, 5, -5, 92, -244, -239, -136, -338, -255, 77, -53, 89, -9, -20, -146, 7, 43, 263, -38, 229, 53, -129, -152, -9, -111, 7, 39, 130, 181, -38, -392, -358, -300, -38, -178, -57, 17, -177, 248, -12, -168, 31, 10, -203, 64, 123, 126, -195, 99, 73, 127, 159, 224, 293, 132, 31, 36, -99, 27, 157, 28, -86, -106, 28, -82, 117, 37, -87, -87, -123, 84, -262, 4, -218, -93, -140, 28, -176, -178, -33, -232, 91, 0, -154, 162, 372, -74, -36, 8, -1, 71, 28, -14, 96, -62, 208, -208, -59, 45, -26, -102, -34, -35, 86, -225, -162, 26, 40, 10, -58, -12, -101, 66, -166, -47]
8004d7n2j04J01R5r4p5K67l5j94k1K80j04k90M14r7j3J89l81k6J65j4K59k44o
8028b7Q5J5L33l70j51K11j24J4J83l08R9j83J97J01k21J40J65j16l37P4L84m1
8050A23l3Pj96J69p1L4j41J83j03jm9j26K50k6j99K31l22K93k65M01M4j86n3l2
8074f8K02k00N4P2L4J1r0J42m24J76k3l7K87J1j01j05j94P5K42j77o2R9K71l33
8098a38K7M95k78k22J59p9J87m21L08j90R8L6m6K32k30p1J05J81k92J73k13J05
8120g4K7p3K7J86j9J10M8k89K7j56L51k38L28l19p2j18L37j44J45j00R7K8k86
8143a77L12j7J23j50n6o2j53M76j32oj41j58lJ04o9J36J51l03J95km6P9K7k61
8167a33J65q5n2K54j50O3J40q3p2k13L41l04L36k91K5j48L69l7j83RJ79l81K13
$$ y = [-47, -99, -203, -102, -7, -101, -176, 91, 56, -138, -159, 121, 17, -273, 141, 44, 31, 220, -161, -187, -22, -36, 223, -21, -27, 58, 73, 406, 36, -115, 96, -28, -14, 169, -139, -40, -223, -26, 75, -146, -6, 159, 43, -294, -220, 164, 123, 90, 97, -99, 70, -1, 33, -108, 75, -28, -29, -78, -204, 46, 20, -179, 52, -270, 23, -242, 159, 203, 17, -36, -68, 134, -66, -12, 60, 94, 105, 15, 157, -267, -91, -114, -151, 136, 147, 46, -59, -253, -178, 64, -113, -175, -76, 195, -138, -111, 384, 106, -116, 43, -36, 151, -270, 38, -152, -54, -18, -64, 168, -62, -133, -28, 153, -139, 34, -179, -74, -47, -120, -93, 93, 74, 184, 232, -57, -30, -186, 165, -73, 255, -64, -136, -254, 83, -61, 84, -16, 81, 109, -177, 135, 118, 241, 91, 35, -27, -180, 296, 164, 158, 17, -141, -144, -40, -109, 27, 178, -125, 70, 68, 22, 101, 128, -133, 32, -53, -105, 149, -1, 62, 202, 119, 47, -166, 175, -129, 207, -84, -59, -207, 162, 125, -58, -49, 130, -251, -38]
8190c8k18
$$ y = [-38, -256]
8191b56
$$ Imaginary data points
##PAGE= N=2
##DATA TABLE= (X++(I..I)), XYDATA
0@%%%%%%%%%%%%%qJ6j6J6j6K4l2L2m0M8n6O8p6Q8j04J20j36J56j79K04k31K58
35A36k92L29l68M10m56N09n67O29o94P67q47R34j032J137j250J377j517J673j847
54i69K041k259K509k798L133l531M010m597N339o311P645r593J2706j8456L2401
69B1270j25900j30296L21706j9078j89531J04334O9744j52653Q5386J33368j68824
80e0474q4875J78849p144j08550Q0512K5183r7170N9187M8700r6657K4728P6472
92D8761j13663j0819J68799n5358j48031J22728O5082j48050M3533J20942j40070
103d6146n0576J89799k5723j63890J02103Q3983j49404R784J37252q9684p9077
114h1579J17836k138q8316P6944K0556j21143M5888J06190r3364l8623J05094
$$ y = [0, 0, 0, 0, 0, 0, 0, 0, 0, 0, 0, 0, 0, 0, -8, 8, -8, 8, -8, 16, -16, 16, -24, 24, -32, 36, -40, 48, -56, 64, -72, 84, -95, 109, -122, 136, -156, 173, -195, 215, -241, 268, -299, 330, -364, 403, -444, 490, -542, 595, -655, 722, -795, 878, -969, 1072, -1187, 1322, -1476, 1657, -1874, 2136, -2461, 2878, -3433, 4212, -5381, 7325, -11131, 21270, -104630, -234926, 86780, 67702, -121829, -17495, 52249, -100404, -15018, 118350, -50474, -135349, 43500, 36356, -72194, 8318, 33501, -63669, -4482, 44218, -52439, -27711, 48761, -64902, -75721, 93078, 37720, -110311, 12417, 77499, -70551, -27018, 93924, -46146, -96722, 93077, 67354, -96536, 5567, 89550, -59854, -50070, 87182, -2502, -81579, 36257, 34119, -54197, 22747, 43303, -77840, -31952, 74238, -19126, -57749, 47345]
125D7345m3963o4198J18203J606j41319O1282J04933j01705j9733J16494p0530
136H415q9427J37434L4747j50297K1544R8678o6341j0117Q1892p4991o3667J25605
148E3475J9106j27258K9771P5180o4651P657P1923p8630l7884J18223j6110j12856
160f2054O8619O6170r9369L376R5374o5059n1431R7201j7230r3423P4430N1049
172F7653j03649O127R3959n5480m8676Q1113j5142p2432O8025L0272q8188K9758
184f660P3068p4822k5654R3302k9881p7266P0929K7683q3131L5555O2045q6885
196b1717j6985J02248l6404q3274O8287L1123p5965K9415N4244p6830j2130R0214
208E2226l4588o7786O3378J7668o4880L8050M1253p4324j617Q0135m0615n4432
$$ y = [47345, 3382, -60816, 57387, 58993, -82326, -21044, 83889, -17816, -37549, 78945, 8415, -81012, 56422, 91169, -59128, -37584, 61094, -5247, -15364, 66528, -8463, -72130, 53475, 72581, -54677, -24906, 50274, -14377, -6720, 65203, -13427, -51311, 66912, 50802, -62054, 6565, 72735, -26634, -23258, 72116, 7057, -44374, 52827, 35597, -57826, 16604, 67653, -35996, -29869, 64090, 8610, -40066, 41047, 25905, -46527, 21498, 51770, -36418, -6660, 66408, -8414, -34068, 59234, 29353, -47913, 23016, 50699, -32432, 3123, 65168, -21717, -38702, 63546, 27142, -56132, 12155, 43278, -32687, -3272, 50972, -25858, -37988, 52226, 17638, -50148, 13230, 30898, -33982, 4068, 45321, -29003, -30620, 49515, 8900, -45532]
220d5532O3636L146o1836M8594L3584q1721P237P9444m7134n1464O6069K203o0872
233d4646M7502L1290p7684J1703P6035m9845m4985O6653j060n7071M5807K6674
245C0373p0597J4506O4977n1449l3648O4912j2562n3187N1510J9835o9511J9015
257b5826N7892n2083k4296O2788k0060m8205N8171J4454p0634K5598N5566n3083
269a9718j8848N9536k2509m1810N6658Q755o7371K9220N0856n4503j4895N6080
281B1451k5094l4928N3872J320o0524L2637M4519n3844r557N3088k7911k8296
293c3267N4949n027n7219L7597L8704n2913m598M9443l0593k4532N5028r581n5796
306c7805L9904L3505n2979O65M4834l4124j9645N4065j2623n2258M0942K8831
$$ y = [-45532, 18104, 21250, -40586, 8008, 41592, -40129, -32892, 46552, -582, -52046, 14023, 16226, -44646, 2856, 34146, -43538, -31835, 44200, -5645, -50630, 16023, 14963, -42108, 3699, 30373, -40224, -25718, 39259, -12190, -45838, 19074, 6512, -46675, 4835, 24670, -44841, -25826, 32066, -20017, -44313, 18475, -1585, -49790, 8381, 22835, -47799, -22201, 33365, -19718, -38566, 20970, -1539, -43349, 13309, 22064, -45307, -16087, 34769, -19734, -34629, 21451, -3643, -38571, 15301, 16621, -43903, -11266, 33253, -20591, -30148, 22940, -4971, -33267, 21682, 16655, -40564, -2967, 35737, -17176, -21774, 27669, -2924, -27456, 27572, 17991, -37805, 2099, 35604, -17375, -16710, 28124, -6000, -25645, 28420, 15797, -36461, 4481, 33312]
318C3312n1927O603M2048l7491j4206N3480j6668m7428M1775K3008m9832J0436
330f890L7787l9723j0372N1916k1398m3185M2691J7053m7495J3295L3400l9270
342a2191o165M8879k3657l8987M4304J2819m5632J7860K8946l9461j052M6056
354C1719k6116l4500M3722Q832m3304K0396K5318m0899L016M4000k9521k9903
366b7240M3358M585m0526K2695K1211m0461O742M2094l2125k5621M4178R2l7717
379a8735K5327J7008l9637R903L9037l3263k2160M3156m082l5867K7711J2761
391B1159l9964J3920L5178l4434j8098M0681o480l1926K8572R083l8675J7072
403c912L2723l5999j3855L9558r252k7542K7978N789l6068J9171K8699l6487j0211
$$ y = [33312, -18615, -12012, 30036, -7455, -21661, 31819, 15151, -32277, 9498, 32506, -17326, -6890, 30897, -8826, -19198, 32718, 11320, -31865, 10826, 27879, -19616, -6321, 27079, -12191, -18356, 30523, 6866, -32121, 12183, 25002, -20630, -2770, 26176, -13285, -14337, 31719, 5603, -28897, 14825, 23657, -19647, 749, 26067, -14832, -11816, 32184, 2663, -27240, 16118, 20703, -19823, 2872, 24083, -16378, -9636, 32458, 333, -25288, 18890, 18982, -18735, 6592, 23600, -16037, -6134, 32903, -360, -22520, 20636, 16554, -19313, 8398, 21159, -18805, -4885, 30293, -4141, -22239, 18442, 11962, -19964, 8608, 17691, -20984, -3912, 28811, -7188, -21043, 18515, 9263, -18279, 9699, 15488, -20580, -1409, 27290, -9197, -19408]
416a9408L8281j2683k5138K9083K165l4412K0635K5246l5579o843L5667j5504
428A510k1613L0875j442l3786K3276K3012l5407l763L3011j6847j7465L0486o122
441E725l1975K7079K0231l7749j040L2329j7807j5032K8534p608k8600K8013J6314
454A8414l7373L004L2242k0244j3519K8771q772k4301K7225J1407l3576P352K8000
467A8630k2639r918L0231j1485k4277K7820R122l1291R220K2802k3300n336K9904
480A9483j4835k4313K8993R730l1077Q603K0302k2074j516K5864j7629j9123K9624
493A2032N187l0168J0765J8297k2923P00K3858j9909j5042K9897n97k8999J5324
506a578J6206k5301J832K4892k0264j4651K9688r82k7299J4995J3847k2782M635
$$ y = [-19408, 18873, 6190, -18948, 10135, 12300, -22112, -1477, 23769, -11810, -18653, 17014, 1510, -20103, 10772, 9330, -24456, -1180, 21832, -13575, -17338, 15673, -1174, -18639, 11847, 5725, -26250, 829, 21060, -16689, -17729, 14600, -3207, -18239, 10295, 2687, -25913, 2100, 18414, -18959, -15955, 16287, -3957, -17476, 11295, 2523, -21778, 5447, 16854, -16722, -9370, 18630, -4009, -13927, 16304, 4819, -19458, 8362, 17484, -13807, -4587, 18215, -5085, -10421, 19483, 4648, -19665, 9328, 19058, -12019, -3416, 16886, -5188, -6704, 19160, 1531, -17592, 12032, 17219, -12949, -2184, 16113, -6810, -6110, 17748, -2161, -17203, 12694, 12097, -16902, -1578, 14628, -10673, -8841, 16051, -4213, -18864, 10824, 9842, -17457, -2462, 11385, -11397, -6762]
519f762K1517k1566j1683K9504k495k5434J4414J0705j9633P947J5906k4074n118
532a6772L0513p958k5731J8405J0650k1629P620J6859k2967m188K8224r832k2085
545a8891K0628Q034k3329P897J8090j9014o449K2125q240j3834J8752k68k1763
558a6262J4331J6262k2946m319K2470r204j2557J9362l775k0757J9829J3299k8104
571a2371m29K6690j1593j6309J8939O35j7887J4536J0121k4302K442K3966j3415
584A023j4586J7765K19j4132J2954M852k1396P071K0159j7039r592J9523n670
597A151j4192J8638L854k4928Q098K1497j5925j0265J8411n115j3918J8563M168
610A0037k4200O520K0167j3572r031J4998m922j0126J5697R26j8630R792J3294
$$ y = [-6762, 14755, -6811, -18494, 11010, 8515, -16919, -2505, 8200, -11433, -3486, 12420, -11654, -16772, 13741, 5783, -19948, -1543, 9107, -12522, -4902, 11957, -11010, -15198, 13026, 3194, -18891, 1737, 9771, -13558, -5661, 12429, -6585, -13034, 9091, 851, -12983, 5769, 5501, -16262, -1931, 14331, -8615, -12934, 9536, 332, -12225, 7137, 3362, -17395, 2434, 15733, -12371, -12800, 13890, 2297, -14012, 4927, 5562, -12325, 2211, 12332, -11970, -9528, 14438, 1023, -13563, 4202, 4421, -9711, 3243, 8095, -13301, -6230, 13929, -3110, -12702, 6821, 1151, -13041, 5597, 9451, -15477, -7379, 14118, -1807, -12072, 6339, 1224, -12694, 5869, 10037, -14163, -7643, 12524, -1048, -10079, 4919, -3, -10129, 5568, 6494, -12136, -2344, 10950]
623A0950j6833j546J7727j0442j1778J8980J000j8722J0927J1275j9037J516K0793
636A4810j4057j4111K0974L780k0087P319J2207j3701j39J4422j1818q389J9098
649A0308r68j8479R698J0849j2791J057R521j1918j338J8448q110j8012J5598
662C863J0914j7744J233J2317j2138k884J8283p758j7168J4811R879j7025J016
675b401J2788j1506m170J5816n504j3437J2005N208j3322M747Q755j3705o72J6239
689A0841q234j2368J4051K768j4647P728Q848j5786jJ7126r539j2340J4991L059
703F497j5642P009R803j4239r51J5212p898r886J2371J016j1691P480O810j3770
717g879J584J3512q637q026J2161j409r883J0011L523j5202M640J4632j1102q369
$$ y = [10950, -5883, -7429, 10298, -144, -11922, 7058, 8058, -10664, 263, 11538, -7499, -5983, 14810, 753, -13358, 7616, 11396, -8691, -1372, 10835, -2866, -3005, 11417, -401, -8790, 10308, 9340, -9139, 559, 11408, -1383, -326, 9195, -2723, -4061, 14387, 6277, -11735, 3863, 14777, -2967, -1734, 10583, -1555, -4439, 13844, 6086, -11082, 3729, 13608, -3417, -2401, 10387, -1119, -5289, 10527, 5023, -8414, 3591, 8799, -4523, 224, 8979, -4726, -5398, 10841, 2607, -9761, 4290, 7058, -7589, 139, 8987, -6799, -6800, 10326, 787, -11553, 3438, 6497, -9145, -2136, 7667, -6572, -7523, 7689, -209, -10095, 2276, 3292, -8399, -919, 5891, -7879, -6295, 7217, -1420, -9446, 2715, 1306, -8577, 1434, 4957, -10245, -5605, 9027, -2075, -10444]
731a0444J3159o38j0678J0067K926j4541N264J4021j1419p885J3181k15j0415
744g617Q338K622j1967N675J0808j1645m756J2709k983q443R283R86j1830O957
758a863R639j2675k745J3012m962q222J0615K06j2070P798R169j2252k881J2375
772E144m946o830J0529r67j1862Q088Q401j1333j756R846n166m727J0137k238
786B320j1370Q743P336j1285j57R271o935l271J0996l287j1229R340O633j1573
800d468O69R534p636l045J0984l826j0421R512N473j0831J295Q506p113k776R924
815E781l869q448R581L673j0913K721P784p648j474R278n319p020R935K303j0838
830d473L538P418q010p09R451o755o517J0586K028j0476L678N848p534P81Q581
$$ y = [-10444, 2715, 2077, -8601, 1466, 4392, -10149, -4885, 9136, -2283, -10168, 3013, 2798, -7617, 721, 3343, -8624, -2949, 7859, -3786, -8542, 4167, 1184, -7259, 2024, 3010, -8820, -1863, 7776, -4899, -7644, 5368, 406, -7816, 2799, 3005, -9065, -1267, 7902, -4350, -7231, 5144, 198, -6632, 3897, 2930, -8932, -844, 7557, -3776, -5532, 4314, -852, -5579, 4558, 2320, -9050, -307, 7029, -4256, -4413, 4858, -2077, -5348, 5648, 2361, -8868, 472, 7105, -4468, -3799, 5735, -1901, -4946, 6038, 2212, -8209, 1303, 6776, -4055, -2760, 5746, -1367, -4143, 5781, 1912, -6536, 3045, 6718, -4195, -1474, 6310, -1338, -2812, 6466, 1147, -5873, 4062, 6365, -4473, -935, 6483, -1527, -2236, 7215, 460, -6057, 4529, 6557, -3919, -241, 5607, -1927, -1146, 7435]
845G435p232n682J0343R57r399M118M872p853K028P795p426n228R904N31q981
860c818M866M300q083K390P746p808m968J0266n89q258N469L047q329L079P508
875F818q068l632R409j463p706N893K539p956L523O341q432k241R350k880o738
890e243O315J267p533M432N833q468j889R341l159o328O336R61p370N031N264
905D790q898r81R296l643n293O271k85o485O135L594q658j26Q498l768m511O212
921B148p31n855N916L320q808Q37P957m351l964O438j513n668N854L407q081Q87
937b207O735m548k720O171k411n655P086K162q122J435O678m766k427N826k907
952C30m361O711J529q443K678O356n294k094N640k679m189O864M00p424L144N274
$$ y = [7435, 203, -5479, 4864, 5821, -3578, 540, 5412, -2441, -413, 7382, -44, -5272, 4632, 5163, -3818, 1048, 5348, -2735, -345, 7401, -407, -5375, 4891, 4302, -3956, 1513, 4560, -3769, -690, 6818, -1250, -4882, 4527, 3064, -4642, 1251, 3790, -4166, -643, 5698, -2734, -4975, 4375, 1495, -5243, 1072, 2339, -5194, -762, 5071, -3397, -5286, 4055, 896, -5432, 904, 1865, -5505, -474, 4790, -4108, -5089, 4207, 564, -4729, 1542, 1257, -5228, 907, 4501, -4157, -4283, 4215, 447, -4064, 2148, 1417, -4438, 1478, 4798, -4010, -3173, 4784, 433, -3531, 2907, 1394, -4274, 1580, 4987, -3094, -2207, 4528, -20, -2740, 3431, 1020, -4635, 2451, 4613, -3509, -2074, 4604, -162, -2589, 3237, 330, -4031, 2680, 4209, -4234, -1556, 4800, -494, -2588, 3052, 373, -3816, 3048, 3448, -3976, -832, 4442]
968D442n684r68N838l763l409O792K13p472L381M454n379J60N069m338l253P049
984C132r3o851L149M180n353N58M392m360k469O893p28o950M343L326m992L68
1000a455M423m499j927O633j859n612M437K938n752J412M650n219j402O315j647
1015A436n370M360K265n494K309M051n805q15O614j720n287M267J343m223K372
1030C03K561n369J39O482l055n005M646J699m805K827J938n467R26N951l627m472
1046d328N176J092m660K421K273m529M78M724l263l214M690j80m038L274K283
1061B199n272Q28M851l566k336M460j000l904M376J054n529J600N005l623k732
1076c589M325l58l230L521Q43n150K084M568l654k339M240p94k812L298J21m103
$$ y = [4442, -1242, -2210, 3628, -135, -3544, 3248, 3461, -4011, -630, 3824, -1555, -1395, 3674, -664, -3917, 3132, 3039, -3812, -663, 3517, -1836, -1278, 3114, -1246, -3715, 3178, 2450, -4500, -157, 3169, -1823, -1455, 2968, -1531, -3458, 3175, 1316, -4296, 141, 3079, -2673, -1261, 3389, -1830, -3232, 3083, 1436, -3934, 426, 2691, -2803, -494, 3557, -2248, -3063, 3551, 1831, -3456, 811, 2154, -2069, 303, 2864, -2505, -2366, 4116, 1061, -3944, 702, 2401, -2404, 423, 2361, -3106, -2180, 3771, 144, -4328, 848, 1940, -2720, -299, 1974, -2555, -2077, 2647, -616, -3830, 860, 680, -3358, -84, 2199, -3073, -2245, 2606, -960, -3296, 1164, 164, -3740, 636, 1690, -3839, -2239, 2766, -857, -3589, 736, 378, -2852, 669, 1512, -3638, -1554, 3014, -640, -2979, 1261, 467, -2345, 953, 1074, -3029]
1092c029K396L542m322o66L807j894k313M490l69m617K317L769l924j019L931
1107B099k206j674L867l86m352K351L796l557j376L235j155j226K963j306l635
1122b562L652K260m381J37L421j807j291L143j362l568L932J231m249Q11L508
1137B875k888j303L639o73l493K615J758l558P60K833l260n63L765j775l003K738
1153D67J634k888N67J782k699L99L616k336l312L676J241l307O61K126k724L20
1169g77L357k255k979L796Q90l530J241J724k302K66K537j993k115L273M22k947
1185a392J263J452k750J181K520k769j584L540P3l209J971Q71k635J038K775l150
1201h05j449L314Q9k941J713J015k231P79K131k404j365L526q18k457K092N67
$$ y = [-3029, -633, 2909, -1413, -2079, 1728, -166, -2479, 2011, 1642, -2975, -658, 3111, -813, -1832, 2099, -107, -1781, 2086, 1700, -2652, -301, 3495, -62, -1438, 1797, 642, -584, 2379, 1073, -2562, 1090, 3350, -1031, -894, 2527, 720, -571, 2572, 1210, -2358, 1574, 2805, -1444, -633, 2875, -13, -1316, 2323, 1650, -1843, 772, 2530, -1028, -268, 2565, -695, -1258, 2507, 732, -2271, 467, 2101, -787, -220, 1562, -1137, -738, 2878, 542, -2770, 906, 2147, -1160, -499, 1627, -1097, -777, 2580, 325, -2654, 1142, 2032, -1498, -257, 1467, -835, -569, 1968, -25, -2140, 1133, 1555, -1392, -129, 1323, -1427, -246, 2274, -495, -2079, 1461, 1534, -1675, 296, 1167, -1468, -430, 2345, -805, -2254, 1060, 1149, -1792, -79, 936, -1295, -516, 1615, -789, -2154, 1372, 554, -1903, 189, 756]
1217G56k481J381J665k296r11L288q78k351K425J94l022J666K233k576j103K868
1233H58r74j257K050r2k869J991J783k617q19K801r70j411J671k15j791J910J484
1250A533l070n10L159j258j403K143m25j912K153R63k723j95K799j269j431K354
1266I08r65j888K540P14k757K31K254j142j066K059n82j819K190N35k362K76K432
1283A558j767m91J716p17j512K204N07k632P34K062j700o98K078j283j460K690
1299A289l9k088P68J572j927N2J900j313j385K484K34k525O54J601j725J82J680
1316A414j302j030K254k19j897Q64J095j432R3J506j763p28K194k66j973J322
1332A32P33j385L17J537j719q48K133l97j577R11R33j641P86R53j410l51J868
$$ y = [756, -1725, -344, 1321, -975, -1886, 1402, 524, -1827, 598, 792, -2230, -564, 1669, -907, -2010, 858, -116, -1373, 677, 585, -2284, -293, 1490, -1127, -1946, 855, -115, -1526, 145, -70, -1861, 49, 1533, -1537, -2047, 1112, -146, -1549, 594, 169, -1743, 410, 1373, -1350, -1545, 1254, -15, -1446, 908, -57, -1945, 595, 1309, -1448, -1217, 1037, -105, -1171, 888, 306, -1513, 677, 1212, -1150, -874, 1558, -209, -700, 1016, 299, -1213, 991, 1498, -1134, -400, 1662, -38, -736, 1342, 59, -1401, 1289, 1250, -838, -70, 1502, -425, -373, 1527, 214, -1171, 1313, 1547, -978, -324, 1277, -448, -266, 1414, 112, -918, 1336, 1117, -780, 84, 1179, -253, -160, 1346, -417, -1145, 1049, 783, -1190, 132, 865, -520, -203, 1334, -385, -1233, 900, 503, -1074, -163, 770, -871, -85, 868, -542, -893, 975]
1349I75m90j716J339N98j461O55J433j985k82J833o74j374J447L15j383M83J195
1366I08j920J75J923p18j456J327K60j158Q77O85j466l36J736m55j464J390O7
1383C75j137R50P36j842K67J665o69j431J276K5j103J286o5j232K26J360p11o12
1401f36J015j08j287J248O23j507O2J312r54n01J099k79j026J253R2j498Q25J240
1419I73j021o61J166m32j033J531J48j693N95J435j312m64J256j40r96J221J1
1436E84j635J153Q41j312k95J178n49l14R93j47j275Q31J091j339J48O84p78j80
1454c21J167n86j151R10P50r34j83Q36m71k63J115l63j312R49Q10q94l59R58q10
1473a52m35J259j51j228Q92N41r32Q5Q55r07j98J424p27j011N90N56q37M53N54
$$ y = [975, 485, -1231, 108, 706, -755, -100, 1333, -652, -934, 899, 225, -1149, 298, 613, -770, -287, 908, -1012, -837, 1086, 368, -1088, 239, 499, -659, 218, 903, -563, -899, 837, 382, -1082, 308, 375, -762, 188, 924, -918, -651, 1014, 345, -1086, 190, 215, -888, 398, 333, -899, -673, 687, -24, -636, 379, 271, -1016, 232, 855, -652, -590, 722, -232, -733, 366, 87, -939, 314, 406, -1092, -267, 973, -48, -709, 457, 25, -1008, 523, 671, -1022, -427, 1008, -304, -768, 488, 348, -648, 573, 584, -1051, 102, 943, -369, -664, 514, -35, -349, 644, 497, -778, 53, 1144, -195, -47, 637, -141, -321, 846, 260, -891, 19, 769, -165, -348, 488, 17, -246, 869, 506, -806, 143, 953, 59, -300, 658, -152, -587, 672, 521, -707, 185, 726, -206, -121, 734, -173, -371, 1053, 326, -685, -95, 461, -376, 77, 631]
1492F31j006n5J439p52p55M05O00r36K03Q05j015J53R18o26j085J424L4p80K4
1511c74O39o65L77O05p78q53J072J70p78K89N44j084M57J182q09q94P93L47p32
1530d92P68M9r61N2J410j031o86R56p4o85L94K83l64J71P92p39o73J018Q6r08
1550f34N12J65o19K6J103n54p10J074j37q52P65J98p34M33N00n60m45P69m59K5
1570a34L29K6o74J77R19j070j30Q39n0n96O77P1r81Q31N04q58m38R62k40n58M97
1591A03k29j96L33L20l80k81P89n78j70M52J61p32K20O79n87m76P43j51q9N45
1611D76k34n25L87N08q72J25K71l01pM84l8o91O84L51q09Q8L24Jj54P3l2j80M96
1634D25p5n61L6Q45p13L1M45j44o63O40J07n70j07N62j10m56O67j49k09L10m4
$$ y = [631, -375, -430, 1009, 257, -498, -93, 507, -429, -226, 579, -436, -283, 635, 9, -1076, 348, 382, -398, -374, 265, -400, -23, 582, -196, -1049, 23, 193, -585, -296, 248, -836, -379, 803, -6, -900, -107, 240, -492, 276, 325, -636, -584, 826, -205, -891, 65, -9, -694, -300, -17, -381, -210, 582, -157, -830, 188, 274, -634, -122, 43, -576, -550, 553, -1, -711, 363, 226, -626, 139, 337, -397, 36, 536, -24, -469, 300, -159, -134, 195, 221, -453, -276, 643, -427, -557, 282, 232, -364, 313, 384, -597, 234, 738, -120, -558, 404, 164, -394, 103, -126, -322, 11, 331, -49, -330, 459, -119, -289, 163, 324, -408, -188, 491, -96, -572, 171, 20, -69, 476, 242, -283, 104, 612, -260, -135, 136, -165, -172, 312, 274, -417, 267, 618, -191, -103, 221, 222, 68, 141, 109, -71, 425, 350, -211, -175, 670, -43, -12, 433, 289, -374, 266, 373, -197, -304, 258, 148, -308, 359, 210, 1, 311, 267]
1655B67l14m4M44k58j33K79k05j32M87Pm44P1L46m75J31K01k94k04N63J30o92
1676b69J18M76m37J14M21m76l86L89m8o8M18k99k46K19J88j03l58M62k7j40p3
1697a25J06l39K19K04j93m4K96N6n20L44K05m49j24O15j55l10K08j36R1J10j31
1718g2M7j0Rl9j18J23O1m43M50K29n18K34J85k32l5N35l38j58K60R8n59K76J49
1741A34m51j85P68q9o22M02J57l58l6M73l45M3K51r1j54K53Q6k84K08K44o53K33
1763a6J67L7k10Q7J7j14N1Q7j15l45K61K14m01K89j79m8K46J23k89J26J24K8j42
1786bk86O46m72L55K49l73m08M50k08K8J61J01l58o4Q0J88k38J45J0k31L07lp0
1809Gk47N41n62N7J73K74l97L56j44k79M57k04L9N8L6j40j76L55j86j99K25l4
$$ y = [267, -47, -91, 353, 95, -38, 241, 36, -96, 391, 398, -46, 25, 371, -104, 27, 228, -66, -270, 293, 423, -269, -151, 325, -112, 2, 423, -53, -439, -50, -98, -166, 252, -47, -293, -74, 114, 11, -347, 115, 88, -52, -125, -19, -358, -139, 65, -128, -172, 124, 180, -340, 4, 209, -240, -364, 251, 96, -214, -6, -142, -51, 59, -72, -25, -35, -26, -65, -183, -60, 1, -442, 8, 237, -281, -47, 138, -94, -129, 406, 68, -90, 170, 268, -291, -15, 134, -317, -502, 266, 177, -445, -43, 114, -244, -280, 193, -152, -109, 142, 51, -103, 150, 236, -48, 160, 404, -249, -16, 151, 188, -22, 65, 82, -32, 19, 106, -9, -354, -93, 121, -280, 9, -170, -218, 28, 151, -138, -12, 112, 140, -2, -288, 358, -114, 241, 490, 117, -291, 159, -49, -21, 140, 241, -117, -181, -101, 87, -151, -6, 4, -227, 80, 77, 7, -240, 301, -261, -204, -31, 243, -154, 202, 58, -221, 236, 32, 71, 129, 165, 25, -151, 204, 18, -181, 44, 10]
1831A0J0j35M15m15K30k29L52j09o3J15p4K1M4J42k19k8J47m82L60K7n4k60J58
1854c7j0r3J90j64M0q8M05l54L38o9k55J01J94k10n1J18j21N0j47K02m6j59J45
1877b1K86k54j60J95k11M9L37l40K06j55M07n25L41j20j95j55M20K9l73K89K36
1898B86n31L87K10k75j04K6Q3n2J4k6l72K99N8j77J45K59m55J61k08K05j2m2J23
1921BN1j01K34k30l34K71l4L9rK47o3n5jn6k61M60k93qk0K00j35j3j0N5j58K01
1947b1L15n92L94k51N5LJ48k81o7K82Pk77O4M21k77J63m7j15M1J16L70n52m5N4
1971i2k0j55M08l16J13K66ll87K78O8j33j25K68k22J29L61j74k62J20J33m02L4
1993a13K67k49j69N47k35l69J59L66n49L40m2m8%J07N0m54M86L33m83j39N53q38
$$ y = [10, 20, -115, 300, -115, 115, -114, 238, 129, 66, 181, 107, 128, 172, 314, 95, 67, 214, -268, 92, 119, 65, -195, -37, -47, -140, 50, -114, -74, -162, 243, -111, 227, 158, -97, 4, 198, -12, -63, 55, -66, -16, -163, 39, -7, -166, -21, 265, 11, -149, 46, -165, -116, 221, -119, 87, -68, 339, -186, 155, 35, -160, -315, 105, 134, -239, 50, 286, -245, 142, 352, 77, -27, -1, 82, 30, 44, 18, -354, -55, 3, -174, -29, 230, -225, -64, -272, -67, -79, -121, 2, 53, -48, 186, -44, -378, -107, -141, -102, -111, 136, 73, 18, 17, -39, -300, 160, -133, -141, -161, 39, -96, -109, -119, -64, -222, -21, 294, -298, 96, -155, -100, -97, 51, -230, -297, -15, -8, -285, -221, 200, -77, 86, 39, -76, -35, 81, 451, -101, -146, -92, -112, -267, 141, -175, -62, 204, 201, -186, 92, 160, 27, -98, 170, -52, 77, 438, 264, 2, 122, 255, -147, -113, 154, -95, -264, 283, 48, -321, -162, 204, -345, -5, -47, -95, -95, 12, 62, -392, 94, 427, -56, -195, 358, -480]
2015d80O96q9j92m3L5K84k32J32K10k53j04M60j48n83M2N22k12J03m6j48M4K93
2037B91l96o0K43J85K5j99K4k73P9K07K19m36Q4K81m16L59j51k03j8J36L9l2M49
2060D37q8m89O9K61k67o8L50m5p22N70P7k12K12k91q7N9N49l33j83K19P4l44L19
2083F7k87K90l68N33j98l08J46K51k14Q0K55m40J58K93j96k84M88k77l25K53J13
2104C0m92M31J01n1j57K87j21k80K11L0n14N29L52p27L41l60R7L16R6j61k35P4
2126b03N75n03p9J89Q8k8K27k67j65J16L77k82k22L46j66j15K33j02l07J55N06
2147C73n50n8M62k60k09L47Q9m78K14K61k9l89O20l95j88K34o0k36L87j7m29J32
2169a79K49N8r6L38k24l34J30K87l00J35P0k51n5M42m15j22M37Q7k11K03k1k49
$$ y = [-480, 216, 127, -65, -108, -73, 211, -21, 111, 321, 68, -36, 424, 276, -307, -265, 257, 45, 148, 102, -46, -2, 291, -105, -165, 78, 263, 288, 89, 113, -160, -81, 126, 345, -91, -7, 274, -142, 217, 66, -137, -155, -19, 20, -12, 437, 349, -140, -71, 190, -77, -145, 205, 160, -562, 8, 85, -127, 85, -206, -293, -234, 315, -18, -201, 18, 92, -252, 67, -220, 70, -298, 235, 37, -271, -125, 126, -88, -8, 247, -193, -35, 258, 62, -222, 266, -11, -336, -83, 30, -462, -31, 70, 19, -138, 149, 28, -252, -41, -11, -525, 4, 356, -371, -30, -390, -293, 23, 119, -42, -277, -203, 372, -131, -210, -21, 67, 39, 266, -1, -166, -50, 327, 45, -177, 169, 3, -112, 121, 19, -288, -133, 373, -177, -235, 227, -33, -242, 105, 194, -284, -70, 191, 162, -227, 393, -2, -190, 44, -16, -252, 135, 118, -311, -179, 70, 128, 32, 370, 146, -188, -58, 229, -71, 64, 134, -117, -172, 270, -145, -267, 170, 257, 46, 249, 228, -21]
2191b1j09K77k59j80O60m05m4K62j75j14n2M22l78m1J73L04m68j2L55l95J87L62
2213C49k97j11J79l4m6J31j07k36kL41l41j0L18J52l21M7J79o09L29M12l63n39
2235e79J039l71k36J8L90o02L84R0p7k86L95O6m07J20L99q45L77O37o36l8L08
2256A46L7m20J81J68o69K76M79p02J39K13lj93L39l48K63MM97o56r6L52k98J73
2278a18J78m62J97J17J45k94jM44n56K31PK74m29N42k73k00l6N73l92q6K49J14
2300B24l41L40K70o28j40O17j98m8P9l29l8M66j29k95K26J32j87q8M76n62K30
2321G7J06m7j61K1L46l25j70L78l51n2L61j31j9j35K05m03m3N62l93MN40p1n45
2344b46K13J05N9j59L18l14M7J3L20o25L14M10o72J60L39n09Q6M90k44n77K18
$$ y = [-21, -130, 147, -112, -292, 368, -37, -81, 181, 6, -108, -160, 262, -116, -157, 16, 320, -148, -160, 195, -200, -13, 349, 52, -59, 120, 86, 40, 171, 64, -172, -174, 167, -174, -184, 134, 286, -35, 12, 191, -418, -89, 323, -40, -579, 460, 89, -147, -129, 261, -341, 43, 133, 56, -230, 165, 231, -176, -56, 343, -502, -125, 512, -124, -162, 146, 183, -237, -56, 112, -557, -281, 198, -504, -365, -152, -155, -348, -9, -357, -94, -90, 407, -249, -345, 7, -291, -118, 60, -402, -205, -88, 57, -237, -238, 206, -350, -119, -112, 162, -267, 275, 2, -198, -234, 339, -53, -139, 110, 224, -117, 223, 493, -135, -275, 342, 144, 96, 175, -154, -192, 274, 145, -150, 76, 208, 21, -67, 409, -153, 77, 183, 136, -25, -4, 342, 17, -153, 225, -126, -178, 183, 52, 33, -102, 103, -300, -343, 219, -174, -170, 370, 299, -246, -33, 72, 131, -28, 290, -24, 23, 36, 356, -269, 45, 455, -217, -57, 282, -227, -141, 349, 105, -472, -254]
2365b54N83k55oJ32o6m50P86k02o02L80r2K31R9N3o02q9L56j53j49J26L62k72
2387h4M6N15q16J4N05l1n17M30J53m58P8N46n69n0N48j95k75L15ok37N8J9l30
2410c41K86L16k14p3N2k5m03M42L20q71M56N33p96R9K59m27L14j41L59j28j82
2431a65L20l76K05R0k23m1M32j06k35KL12m38j51J47r0K78J47j16l15L73J67j89
2453B8k07J13j90R7K81o4m32J88O08m29m9N5j66q9K86Nj43M1J65k69q9K00n1K67
2477A56K60j57l88J87K30l64K27L66k90k95K28K31m34l6O2Rq2L01j1k54M23l21
2499D8l01K93J41k29J40Q1n8k41K67q3j72K68K45o66Q3M49k92j90M64k27k71N10
2521B59J66l38l8K1j74qL19j62j71K49K75n84J39J67l37M64J08l88l92M24J07
$$ y = [-254, 329, 74, 68, 200, 134, -316, 470, 268, -334, 46, -46, 185, 284, 337, -265, -354, 2, -151, -300, -174, 188, -84, -38, 477, -339, -325, 180, 149, -368, 62, 215, -243, -165, 381, -188, -238, 310, 115, -160, 155, 149, -88, -30, -11, -341, -55, 261, 47, -26, 26, 1, -402, 40, 360, -511, -55, 478, -318, -219, 40, -387, -73, -214, 145, 17, -165, 155, -221, -16, 74, -149, -190, 242, 136, -99, -97, 215, -223, -374, -227, -317, -39, 108, -8, -323, 50, 217, 28, -179, -66, -256, -159, 122, 58, -374, -186, 422, -7, -56, -1, -167, -256, 30, 35, -108, -67, 98, -171, -260, -60, -111, 156, 416, 259, -129, 58, 288, -76, 151, 517, 227, -68, 160, 391, -43, -79, -17, -8, -90, 211, 200, -54, 369, 48, -253, 40, 181, -48, 92, 173, 115, -126, 141, 58, -114, 154, 399, -267, -184, 265, -27, -217, 247, 20, -251, 259, 425, 87, 49, 70, -104, -112, 207, 45, -126, 123, 398, -186, -47, 120, -217, 247, 355, -33, -425, -1, 106]
2542A06n5k49K55k29K46j32o5k79M20L0nl4O8m33K03J72l50K57oK19j79m5J64
2565G9k38k6M30p44J80L94k35n0J85J53m53K53R6l98J16K84J80l31K5L11m60R8
2587a51J40j56m2J06J96m13K22K01k57J88J36n49J14O67j23l85N97n89l52N51
2607A01O4m06L2M32n45K10K40j90l07M92J5m55J65K15k00k4J77r9j6J73P5n34
2629c85O9K49J10r0L80l01m72M92L27n00K40%j44m4k1R4j52M28l21R5l27L77k40
2652a36N1K96j09p9K01J2m50K99Ko7j58K05k71Q8K46Q7k20R6J66l76L61J03l70
2675b3l01N04K97m10j25Q9k01N0L03j10j4J27j45j88L85p9j24k00L60k44J76K73
2697D00l12k28K17o5j57j16M17k09lK60N9l81K61K01m65J44O6l85J62K91j13j61
$$ y = [106, 51, -198, 57, -172, 74, -58, -123, -402, 18, 48, 43, 9, 77, -356, -153, 19, -331, -74, -80, 139, -40, -85, 79, -159, -185, 245, -499, -319, 75, -160, -210, -25, 128, -325, -72, 24, -374, -258, 26, 206, -125, -100, 211, -249, -151, -11, -167, -209, -103, 93, -320, -98, 103, -154, 34, 170, -379, -265, 402, 279, -106, 491, -98, -450, 101, 165, -241, -209, 223, -322, -112, 128, -62, -369, 123, 138, -317, -152, 63, -137, -161, 16, -83, -99, 74, 149, -385, -316, -67, 43, -47, 333, 32, -440, 52, 379, -121, 119, 119, -25, -69, -90, 4, -148, 280, -41, 54, -273, 104, -136, -85, 211, 102, 23, 224, 236, -214, 85, 87, 20, -138, 67, -204, -116, 130, 217, -3, 93, 259, -117, 244, 347, -23, -324, 180, 477, 67, -58, 31, -170, -120, 183, 73, 59, 186, 41, -147, 238, 159, 35, -165, 195, -49, 127, 400, 88, -140, 77, 12, -145, -261, 156, -53, -56, 204, 263, -118, 143, 344, -121, 23, 89, -296, -134, 157, 44, -117]
2719a17J56k98K16l6J72o02J91K98o5k91M41k29J61K31j49m32J86L42q4k37R8
2740d8q5m7K66k21p5p8M21m7j80N4J3q8K35n6k77j84M97j79K0j00q7M2P5L43n02
2765b88L40J28m31M23p6k12pL99p9l98L44K85o19l6M51j68n1K06O1l70J16L80
2787C98n52J59J12j09n1K62o6j26j76K38j18j34M72j50l4K72j66j90J97o0j38
2808D0K7K39m10j39L55K49m54K67r5j93K23j71K5J55Qj37J56J00n5l53oL93j64
2831F0j74K21L7l33J67J60j17J45J06j77N2L90n32k04L12L9m6j21P3l64K80J89
2853A63k36L3N8Lk41L44J6m87L87K34k59k37J59J66k15K11n9j97K63O1j06l33
2875b72M25k73Q2M8k21J31j0L76q20M68o4L24p62M64J48j65L20j95l90K24L96
$$ y = [-117, 39, -259, -43, -79, 93, -509, -318, -20, -85, -376, 65, -164, -3, 228, 79, -353, -167, 175, 91, -146, -48, -133, -180, 86, -135, -210, -288, 133, 86, -94, -40, -27, -115, 120, 64, -213, -397, 100, -79, -59, -159, -246, -204, -129, 214, -288, 52, 180, -251, 172, 96, -116, -123, 276, 197, -201, 143, 428, -191, -227, 224, 56, 5, 211, 272, -98, 18, 398, -154, 5, 117, 8, -43, 219, 153, 27, -149, 89, -29, -163, 309, 159, 125, 397, 231, 41, 238, 178, 40, 67, 306, -104, -243, 112, 361, -93, 174, 79, -114, 109, -62, -37, 118, 126, -11, 145, 245, 190, -163, -169, 224, 60, -114, 107, 144, -189, -22, 138, 21, 166, 272, 95, 147, 537, 5, -199, 113, 152, 106, -15, 58, -306, -26, 163, -73, -40, 18, 21, -220, 124, 140, -347, 40, 274, 15, -222, -63, 103, -112, 99, 40, -157, 106, 167, 61, -272, 153, -120, -38, 10, -211, -80, -90, 286, -534, -66, -130, 194, -568, -104, 44, -121, 199, 4, -386, -162, 234]
2896B34n34j00L03L02m47L51J89l43j56L33j15k04K18j22j97Q5J58k4o3K8j36
2917b40K3J72J22j94k7MP1j03K55p3l59O26j81l5l81L83j16j31J71j82J61K53
2939B19k62k56K87J24l21L29KJ3k00K74l08l6L12L4j27k92N48l37k33K91k78Q1
2961a36M45l4k80J50L28p98J50L79l86M3L78j61k38J17J38O1k72L24l84J53j21
2982a44L51k13K63l45K58pL33k97l35J5K31j70R0O9QK3j01m42K82L90j3l97K29
3005G8J43k58q4K20m31J73M03N5l12L3Q5l59K97P8j44L1j91J18J04l42M48k15
3027g0K05j26j63k77M47J27j85j44M05j0M4j09k56j60K38J66k53J0J32j65K17
3048G3P4k54j7J68K3l02K87k18RJ48L39l94k02N65j70j96k5K18l05J34J18m65
$$ y = [234, -300, -400, -97, 205, -242, 109, 298, -45, -201, 132, 17, -187, 31, -91, -288, -203, -45, -69, -132, -104, -240, -217, -45, 77, -117, -144, -140, -69, -172, 83, 10, -349, 277, 96, 61, -320, 63, -53, -184, -13, -195, -34, 219, -43, -299, -12, 112, -209, 120, 122, 135, -65, 209, -99, -135, 177, 211, 84, -208, 340, 3, -230, 61, -217, -136, 309, 275, -5, 145, 473, -325, -175, 204, -182, -139, 239, 78, -160, -43, 95, 156, -116, 208, -176, -23, -144, 207, -6, 257, -88, 170, 163, 496, 199, -136, -121, 110, -60, 30, 99, 107, 130, 29, -413, -131, 259, 246, -151, 78, 221, -37, -121, 99, -332, -159, 244, 299, -13, 20, 105, -254, 43, 121, -23, 8, -183, -65, 39, -303, 145, -70, 135, 9, -154, -431, 16, 143, -42, -186, 219, 209, 253, 144, -112, -272, -34, 132, -121, -111, 21, -144, 73, 147, -107, -124, 44, 67, -235, 52, -166, -157, -9, 330, -64, -266, 299, 129, -67, -92, 126, -179, -45, 73, -392]
3070c92K55q2J17j75K71k10j30L36R5k39J27J23l89K92N1l44K81n0K81l89j4L4
3092a51K41j41Q9k14K19Ln8l65L90K03l49J15N7mk29K50j53nJ30k3K64j88L06
3115C87l58j42L38j34l51N8L95l90K85K7j37j05M21m66j9Q8K95k8k3J82k32J7
3137A08J64l51j3K15N12p13J74j95J45j43L62l14J9J61j99K45k37Nj3J5K32o2
3159A17l01J63M27m19N9j24q3j58L40N4o6o5P1r6K33j11q7k6O6j15m8L82j64o9
3183b0L7j33K64l84N31l52k33L64Nn07M60J58l26Q5J89j56o0j78N9J4J52J06k20
3206a45O6K50l06O0PJ00k0R9k0j23j27J24Q6k3k9J08k04K4K6k37J76K19k06k79
3230c74J18K31O9j93k3O0L48k40j20k1K70N7o8l7o9l6J51J80l03l13L76J50k32
$$ y = [-392, -137, -219, -102, -277, -6, -216, -346, -10, 85, -154, -27, 96, -293, -1, 50, -294, -13, -63, 218, -171, -185, -151, 90, -51, 38, -176, 43, 46, -12, -377, 13, 216, -133, -18, 39, 35, -194, 56, -97, -102, 28, 5, 269, 81, 387, 29, -113, 225, 91, -260, -202, 193, -197, 88, 115, -22, -127, 294, -172, -191, -103, 192, 164, 141, 323, 91, 108, 272, -79, -92, 123, 635, -78, 96, -99, 46, -97, 265, -49, -30, 131, -68, 177, -60, -55, -68, -53, 179, 117, -184, -21, 406, -13, 46, -78, -161, -319, 21, 75, 9, -56, 15, -81, 152, 41, -46, -72, -6, -121, -169, 213, 49, -20, 17, -116, 148, -236, 295, -57, -290, 74, 79, -428, 32, 190, -136, -51, 138, -18, -78, -256, -197, -183, -31, 75, -145, -79, 171, -135, -75, -68, 32, 12, 111, 91, -32, -159, -35, 51, 28, -1, 107, -97, -73, -47, -284, -108, 111, -95, -374, -256, -25, 44, -149, -172, -112, 236, -4, -124, -145, 125, 182, 114, 77, 8, -28, 123, 303, 0, -313, 63, 213, -19]
3253a9J01j77k24K62J33j08n5j13L43Q0j83j16M1K29l9k92j2M0O1L24j16m25K42
3276b3L23o27N86l87Q2J87r8J49l52m3N1K72k37PK08O8l99K14J8P9O8J98n40K12
3300A6j0K02j85J27J5j61K85k89Q9j5Q6J05o7k50J47N5j6l1p9l6J13j09Q3r1P1
3325E5j95L65j30k79R9K02q5l9K14l87J54J03k2m49M49m4J3j43K30l76J71K54
3347A60k49j82M85k56n2J67O0p8k53J07M5J2q3r2j42L96j48j90J76J3Nr0R0J48
3371D9r4J73o8j61M0o3M10k39P9p3n9J70k01q1J13j98lK73j74O7l1J09K20l27
3395f9MK03l8k73L39m09M35j61j2k01J46J38l05J67p5R5j1J16K25m52J73J04j42
3418cj77J97j27j0j4J93q0J6J9J07j16K21k79r8K70r5m7N8J06o0j37J73r5r0k
$$ y = [-19, 82, -95, -319, -57, 76, -32, -87, -200, 143, 223, 40, -76, -35, 194, 155, -137, -149, -109, -48, 276, 160, -265, -23, 300, -327, 259, -128, -46, 141, 43, 192, -160, -203, -152, 120, -117, -110, 98, 166, -233, -19, -1, 78, 146, 344, -196, 16, 6, 208, 23, 150, 165, 4, 289, 0, 89, 74, 160, 265, 198, -52, 95, 150, 134, 103, 24, -12, 101, -8, 75, -16, 55, -140, 225, 95, -184, -85, 117, 32, -7, 207, -180, -26, 77, 55, -394, 55, 11, 24, -119, 111, -265, -94, 160, -89, -271, 214, -42, -94, 73, 133, 55, -198, -91, -46, -34, -117, -209, -351, 45, -103, -293, -117, -104, -99, -189, -99, 49, -45, 128, 60, -101, -61, -124, 286, 47, 126, 53, -6, 164, -37, -118, -5, -203, -206, 67, -107, -40, -71, 38, 258, -69, -65, 138, 100, -173, 166, -243, 192, 31, 19, -182, -36, 102, -203, -36, -111, -16, -27, 89, 314, -138, 35, 139, -3, -180, 17, -110, -120, -134, 59, -21, -5, 14, 121, 5, 226, -53, -151, 119, 24, -23, 35, 141, 81, -56, 117, 22, -68, -70]
3443g0J90n2p5N1Kk39J32Q6j39L04p4j81j42K92M7j4n3j02P3L0p6k03O6M6K61
3468A60j97J34N7j45K89k63j3N5m6r7J50l6k50j1L78l39J29M79k36l52L11k02
3490d5K3j45L65j41j31jK64k91L83k03j86K00M0j20J1j91L3N4J50q0K24k28k39
3513b54L86j52k01jJ80j0L5j93J37j02J09PM6J23k96J05L56m95Q4K49j03n8J74
3536A26k28k1K71j71j4K01k03Nj95L18j3m0k2j39P7J18k63L13K5J7k68J41P8n2
3560F1n3l6J17k37J91j78O1K12m0M8j76o7K23k01l9K7J47KJ06o4O3j35lR4j4j66
3586e7K25k00L01j29k19J6J77kl60J58j15J35J72k24j62J49j2J22KL56l51k7Q9
3609D4r5J80J04l44K89k90P9j67K44l9j79rJ58Q4N7m1j86k67N61r1j17J04J80
$$ y = [-70, 120, 68, -7, 44, 46, -193, -61, 25, -114, 190, 116, -65, -207, 85, 132, 118, 65, -37, 36, 66, -10, -213, -147, -101, 160, -37, 97, 154, 9, 298, 35, 22, 77, 31, -66, 84, 48, -202, -213, 165, -174, -45, 434, 198, -154, 157, -45, -22, -167, 198, 57, -74, -75, 189, -102, 281, 78, -108, 92, 132, 12, 23, -168, -135, -81, 69, -11, 213, -15, -254, 132, -20, -221, -222, -42, -52, -17, -210, -73, -175, -66, -59, -13, 110, -186, -81, 275, -220, -136, 113, 10, -48, 126, -102, -123, 148, -23, -37, 164, -39, -34, -229, 89, 76, 36, 14, -125, -48, 70, -193, 120, 145, 162, -106, 35, 113, 61, 8, -28, 89, -148, 43, -135, -74, 138, 98, 146, -30, -97, 126, -75, -114, -87, 60, 62, 168, 104, 167, 32, 29, 123, 109, -57, 168, -32, 269, 140, -79, -63, 114, 112, -248, -90, -205, -70, 102, -122, -284, -135, -147, -25, -23, 333, -18, -45, 44, -51, 129, 233, -111, 178, -112, -33, -200, 44, 5, -174, -183, -25, 59, 116, 75, -111, -378, 183, 92, -25, 79, 259]
3632B59j41j35K79l31P2J02K57m65l17P17k19m8j60M51l99J13J28k52j7K37J7
3653A48k80j4J06L0M5J07rk68r0L39J9n2j12k46R1L86j54j37K07j53j41m9J49
3676g8r9J18M4Nj48Q2J9o0L1L1nJ43n1J5j44J04R7j55J11j41N1j38J86k64P4J91
3702A9j58J72O6J08j20LJ12m42L03j95j9J97L4j24K63l65L19j22j70N8j47R4n3
3725a67J38O4k45L51k40k49L82J26j36j61O0L8K34R1l04m9R8J22l5MJ14j02j38
3748dmJ37m18K84O8j46J11R5O2l32K2J22m5o9L14j10j32M1n5J50L4M6n3j25j82
3773a89p8L83j22K04Q4j95j89M1O9N4J26k50K4K78j39j40J15K8lk36K61Nl88K05
3797e2k0j21j7l0K79j06M0Q9p7J29r0R1k12P3J2j21l0J04O2P3L6j04m9J83R7l29
$$ y = [259, 118, -17, 262, -69, 3, 105, 362, -103, -420, 297, 78, 30, -130, 321, -78, 35, 163, -89, -106, 131, 148, -132, -146, -40, -10, 35, 142, 133, -135, -225, 114, 133, 81, -31, -277, -186, 200, 46, -91, 116, -37, -178, -227, -78, -177, -59, -15, -10, -158, -76, -57, -117, -86, -55, -60, 83, 32, 47, -97, 7, 104, -51, 60, -81, -30, -168, 18, -246, -172, 19, -139, 33, 99, 207, 87, 90, 202, -240, 63, -132, -151, 46, 80, -44, 219, -146, 173, 51, -119, -61, -208, -114, -167, -29, 35, -210, 141, -99, -348, 34, 160, 24, -137, -77, -39, 195, 286, -18, -67, 31, 153, 118, 122, 236, 134, -4, -8, 129, -289, -5, 63, -83, 28, 123, 185, -147, -125, -3, -48, -117, 197, 87, -45, -4, -59, 91, 125, 171, 118, -7, -189, -267, 116, -6, 198, 282, 87, -102, -61, 8, 62, 188, -62, -38, 240, 101, -39, 76, 104, 101, -135, 126, 131, -257, -52, -72, -193, -210, -240, 39, -67, -27, 62, -15, 114, 24, 115, -97, -24, -12, -133, -163, -59, 3, 76, 112, 8, -41, 142, 239, -90]
3823i0K54M2m0J6j25m14L09m3Q9p4r0J7jK00j32J11n7p9l4R1K66l65m0J51j43
3848a81J82j65J5P9N5k2n3P2q7J4j44J22J85j43R5q3J25K4n3j03K08k56j18J84
3872d8K26l67rL82Q1j00l44J86j35K18k00K29N3l26K42r7K9k59j6J91J51m6m8
3895gK48l72Q4J93j64K35l18j06L42p6o0j59L10j57K78k00j28J77j0j13kl8J56
3918A13J59l59J1m7K11j04k6p5M18k43R4j19K01k46K81m27Q6K9R5k78K22J9n5
3941d0M80l75N1J2J07J62o06J94J10m0j39R6l3j41j57K03J13k50K11M7k11M46
3963B40m86J01N6K9J78j06j5j39J93mK6J91k52J12j40m6L0J53k50l5L40j63j53
3986a40J25q8l8Q7j07K9J44M3K1k00K54j67j9J20o9R4k0k69J65o0p7J20l2QK77
$$ y = [-90, 164, 206, 166, 182, 57, -357, -48, -91, -2, -76, -166, -149, -150, 50, -82, 29, -28, -107, -141, -50, 216, -149, -189, -38, -181, 1, -164, -149, -70, -15, -37, -90, -18, -105, -91, -235, -113, 72, -71, 24, -59, 66, 90, 37, -66, 142, -114, -232, -48, 178, -189, -198, 184, 265, 165, -179, 7, -128, 90, -110, 119, 172, -154, 88, -9, 20, -239, -255, -64, 87, 41, -7, 241, -131, -47, 146, -18, 217, -101, -207, 135, 59, -1, -160, 150, -7, 271, 71, -57, 120, 110, -3, -5, -43, 113, 272, -87, -76, -123, 88, -16, -42, -117, 301, 58, 152, 33, 234, -12, 269, -158, -72, -43, 52, -226, -4, 15, -40, 440, 65, 116, 128, 235, 397, -209, -15, 95, 55, -84, 12, -21, -162, -319, -116, -3, -253, -42, 5, -206, 240, -246, -145, -89, -60, 118, 12, -3, -142, 51, 47, 73, 264, 12, 124, -16, -62, -32, 121, -129, -164, 176, 13, -140, -15, -103, -141, -54, -161, -132, 12, 55, 76, -124, 130, -37, -56, 64, -5, 89, 69, -200, -35, -95, -172, -52, -84, -76, 201]
4011B01l27j5M19k38N7j96K23p8r2M54n24J12K17l39J62J1j66L23n5l13K25J3
4033G4j68n1L08l87K01o6J94l76K46J58l14K97j12J7J59j32j66L21k74L16q0j4
4055A51k9o7K58l18L14m77M8M42m86l2K45K71k53k1l53L46j10K22j76k71M18k43
4077a21N5K27j71R8m3j08K92l01R1K0j13l0J18k32K22k18J82mn1K38j61K40k33
4100ck93K27L82j02k53l24L47K3k7l7J20j84L35k60R2O6j85J23j4m3j88K13j34
4123a19J2K24j32J09k4j41M6K7QK28j24j74N0j08O2j82J61QJ06r1lJ53j04j31
4147a39J78j41L40j48m5J31k85K85m33N36n13Q6K50k54J19o4J96O8j00J4m02J90
4169a31J56O8j19n1K22l06K48j26j50o0L60o11M17L8J76j09J84k03n2O7j24j51
$$ y = [201, -126, -141, 278, 40, 97, -99, 124, 46, -46, 408, -116, -4, 213, -126, 36, 47, -119, 204, 149, -164, 61, 74, -94, -145, 163, -224, -23, -89, 105, -271, -25, 133, -181, 116, 4, 21, 180, 48, -118, 203, -71, 245, 165, 151, 122, 55, 313, -5, 309, -168, -120, 322, -164, -196, 49, 320, 67, 46, -307, 39, -71, 151, -25, -296, 122, -121, -66, 161, -10, 88, 45, -63, 229, -72, 19, 39, -74, -104, 14, -218, 4, -214, -32, -36, -87, 151, -10, 230, -3, -296, -69, 313, 211, -42, -366, -19, 4, -23, -60, 60, -124, 211, -49, 43, 109, -76, 47, 33, -10, -198, 15, -119, -107, 117, -15, 94, 70, -71, -25, 2, 10, 238, 114, -60, -10, -118, -56, -238, -77, -69, 37, -54, -57, 96, -8, -139, 39, -102, 238, 90, 45, 176, -109, 176, -257, 279, -234, -148, 102, -152, -33, -97, 99, 167, 67, 81, -321, -131, 25, 93, -26, -77, 145, -161, 87, -39, -189, -249, 111, -500, -83, -45, 131, 22, 206, 3, -49, 18, -106, -257]
4191b57K42R0k00L20r1P9j0l26J0J73J44j97K09o4l38J81j5N54o85J25p3k1l1
4214a81K56p2Q7O4l5k51j6R3j17K16j08L84o23j8N81k31o2j03%j70L64J35J51
4237C44n19K61M4M8k95J32r7J55K06l27p7J58k62K90M3L2J05k86J61j63J41j12
4259a8K34m59N4J42O6J39j38Mjo2K08j77J11j39r2J04K2J0j22K68k6j78l6L8k9
4284g7m3K66j98M0L02m32K95l56K43k54L54j57j41p8K39K35k47J10o0k81Q9o3
4306b14N8K08o4j33l31N20j01j81L68k84k41M18k47K05L7mm5O4n0j16K23j08k10
4329b28M14l31n7K22j37j7J33mo7M0k28nM47k93N4K11l79J33L88k43k33L24l48
4352b04L66l11J59q0L7l38N07l19K16j06K0nJ48op7K92j27j00j31k24L04P9k76
$$ y = [-257, -15, 75, -125, 195, 104, 183, 173, -153, -143, 30, 174, -23, 186, 122, -216, -35, -50, 504, -181, -56, -129, -150, -181, 75, 3, 90, 154, 119, -132, -148, -55, -172, 44, -64, 320, -303, -321, 260, 29, -33, -136, -136, -306, 58, 193, 344, -175, 86, 130, 178, -117, 15, -82, 73, 279, -48, -125, 33, -229, 61, 104, 136, 241, -45, 116, -47, 94, -18, 216, -243, -189, -47, 19, 158, 20, 24, 23, -39, 169, -8, 103, -36, -128, -24, -2, 8, -114, 154, 128, -50, -86, -48, -77, -120, 146, -52, -12, 290, -142, 153, -203, 40, -214, 140, -17, -158, -236, 3, 238, -9, 101, 41, -240, -151, -214, -156, 52, -12, -145, -476, 44, -57, -238, 130, -154, -395, 23, -224, -19, 18, 14, -31, 33, -17, -133, 90, -18, -228, 186, -145, -202, 20, -117, -134, -1, -5, -72, -32, -260, -265, 182, -111, -57, 154, -225, -92, 296, 53, -180, 144, -204, 162, -149, 10, -70, -33, -371, 136, -183, 33, -73, -53, -58, 90, 84, 7, 299, 172, 72, -59, -283, 21, 100, -176]
4375a76K63k54L39k12K67m19R8K11O0J0j75k25N5J59JJ64j78K34j19Q2l23o5O07
4398D04p16K72j41K80J14l13K6o5K13k09K57l15J25K82l60K60j34K3j82J93k06
4419a92l9L71j93K4n3l0R8O7RL0q1r5J18l5J01L4j53J17k22L34j6k38o6K50m76
4444c36K75K74j43pJ29o16L45K86j80j15j15K6L07J86m27L2J37L01q8k48j49M07
4466B81l29L77n76J91o4n4L67n9k43N4J08j72J76P0n2j81M9O9J72m93N31m42L67
4489A47r1j81m3J73p4J54j61L63k96M5j35J6K33j9k99P8N6j12J56o8lk0J74l27
4513b34M60n74K93J12q7Q5j06j86R5K77k41k1k5L22J46l17M0O3j90j47M82j81
4535F6k81J35J9J81j73J31j81m8L40j44J83j79j89J8K7L16j69k09M8J14J0Ko1
$$ y = [-176, 87, -167, 172, -40, 227, -192, -94, 117, 177, 187, 12, -213, -158, 1, 2, 166, -12, 222, 103, 185, -138, -203, 404, -312, -40, -181, 99, 213, -100, -74, -139, 74, -135, 122, -193, -68, 214, -146, 114, -20, 3, -179, 14, -192, -231, 140, -53, -29, -82, -112, -14, 53, 62, 92, 11, -84, 34, -1, 100, 134, -19, 98, -124, 210, 194, -44, -110, 140, -336, -61, 213, 70, 63, 192, -424, -79, 207, 27, -88, -203, -177, 130, 316, -111, -79, 58, 359, 271, 23, -126, 281, -48, 329, -247, -56, -120, -174, 193, 134, -109, -55, 53, -119, 57, 127, 75, -106, -57, 12, 184, -309, 222, -220, 147, 56, -125, -168, 5, -69, 85, -76, 287, -9, 36, -99, -83, 150, 131, -168, -90, -34, -146, 10, -58, -61, -81, 93, -234, 226, -348, -55, 57, -30, 55, -51, -237, -142, 135, -106, -127, -152, 170, 316, -1, 39, 102, -88, -235, 247, 66, -215, -80, -61, 120, -53, 78, -103, -151, 189, 45, 228, 49, -140, -122, -95, 221, 52, -157, -109, 5, 15, 17, -44]
4558d4J30k31K96k68J88o6N5J87j57k09J10J90j80r8J03Q5R4J17j43j78P6J41
4580A98r7o0m05O28j86pj50L69l93J31j45o0K23p7j05q5K98K54n76R4J84j78j03
4603b48Q7P6j00J83O7k44m7J19J03oj61j21K49K24j85J41k38N9j03L61l09j10
4625b03l0L10k8j5j94K25k32K7J59N7J52l43K63P7q3M8k1q5k23R8q7K64l63M30
4649B03k34K4L54j85m2j06k26L15j12j48J3R9j5p7m7j60K93L89k86j49l1P7K6
4672b5K56l04opj10J19J29Q4p7M6j02J32k50k8K28J03N8k99k3J97m02M89M8j48
4696A08j65j58K5J70J79J9J20l26P8l8k8J41l5k06L35P0l04P9r9L07j62k91J43
4719c8m4K32m4J5p9K5j61K7j24M7L78K04k46l7J32l72K28j91K88l55p2%J39M7
$$ y = [-44, 86, -145, 151, -117, 71, 5, 60, 247, 90, -119, -9, 181, 1, -97, 6, 91, 185, 302, 159, -19, 57, 198, 101, 41, -364, 264, 78, 71, -79, 290, -103, 28, -117, -177, 46, -31, -136, -221, 77, 331, -245, -151, 33, -145, -248, -161, -85, -185, -2, 65, -179, -226, -107, -4, -10, -171, -292, -43, 181, -4, 137, -101, -42, -145, 216, -93, -203, -233, 77, 49, 34, -160, 65, -167, -140, 19, 76, 228, -115, 148, 225, 142, 190, 169, 84, -139, -41, -128, 136, -227, 203, -31, -7, 347, 162, 120, 14, -212, 103, -9, -157, -144, -45, -60, -137, -184, -344, -51, 338, 52, -97, -128, -51, -25, 231, -73, -79, -86, -196, -77, 52, 136, 59, 105, 3, 135, -115, -143, 85, 188, 246, -53, -76, 121, -281, 208, 256, 108, -57, -215, -190, -20, 159, 178, 298, -28, 50, 12, -16, 125, 90, -116, 219, 289, -15, 64, -35, 272, 110, -181, -38, -82, 150, 106, 121, 42, 67, -94, -67, -191, -144, 234, 438, 192, 155, 287, -85, 143, -48, 240, -115, -187, -187, -48, -1]
4743ar9L7M2q0J17J4l38J65L58L9p5l58L73M0l94K08l62K47Pj05J72J4J19j73
4767c3OK0k73J71J88k11J42j58J91n5J44l07J20J02j01L3j1K06k29o2J46m62L83
4790e0K09m67L17J87j36j32P6m7M2J7l26K32M05n13K84l23L00k36j4K17k23Q8
4812i3j1j5J55k19J28J32m9k82o8N16n8k29mL60k82NmK13k57L4j46R2J91j26R5
4837G8k39K15J43k46K37o2j47O0k4j50K26j05J20O4j24j00L8Q8J04j41Pj50j41
4860b49L27K79k07P7l53K79k53o8j68L05k1l1k24N12l30r3K33l9j89L83M3K7k57
4883a7o4q7J64J7qo5J11J31q7k39O3M5r0K90q3j80J47N8j90K41k38L84j69O2j93
4908Ck35R5M8K41N3l02o0r6K42nj38K30r2N0R5L0j49j73o5L93j84j4R5k98L83
$$ y = [-1, -100, -63, -21, -101, 16, 30, -308, -143, 215, 254, 179, -179, 194, 234, -160, 48, -314, -67, -60, -165, 7, 21, 140, -33, -27, -7, -280, -109, 79, -132, 10, -148, 43, -12, 132, -175, -55, 47, -54, -21, -32, 174, -55, -117, 29, -433, -50, 159, -308, 9, 196, 60, -72, 4, -43, -1, 16, -310, -78, 327, -186, 98, -225, 75, -161, -175, 42, -181, -93, -104, -119, 36, -183, -55, 77, 28, -254, -322, 194, 136, -93, -97, 263, -19, -14, -18, 195, -62, -28, -174, -82, 109, -17, 78, -161, 54, 197, -49, 188, 126, -21, 39, 15, -135, 91, -14, 106, 170, 46, -54, -16, 72, 176, 35, 42, -108, -249, 78, 357, 150, 227, -126, 153, -100, -168, -336, -31, -52, -83, -307, 205, -125, -218, 15, -24, -213, 170, 213, 240, -17, -81, -168, -4, 13, 5, -60, 51, 182, 95, -144, -81, -36, -126, 164, 81, -99, 48, 106, -84, 157, -81, 303, 134, 196, 3, -232, -137, -89, 152, 205, -97, -157, -253, -11, -16, -154, 76, -16, 34, 129, 159, 10, -163, -228, 165, -19, -33, 62, -236, 147]
4933A47r7j72N5L32k73k39L21k4n5k33J19P6J74l24J53J15j6J44k92J8J25J9o
4956F7n7K34M7l72J68k26J50k09J18L33k98j62J90j78L70q0j69J16j45K45k34
4977i2J00k8p7L30M2j03m53K70j89P4Q6J77k72L26j24j6j80L55l69j17L63J06
4999B09j2j72k1j18J69r7P8rQ6k90K10J90k00K31r2j51K4Jl4j15K01K7m09L24
5023C0j58J11J58l58L79j43j79K6m0K69m1L8k4j8nj02K28mj54j58J19K23j88J44
5047A53J09k5j39l00K62k00j17K60M4n6Q8o5J45j61k12M7K94k94M03l20J5K68
5069A99p2r8J3L7j08P8Q4r8J21l29J33Q2m9q0P2j49K85j49J19N1m25L03j74J09
5093d5K15j40pJ84R5q4l15J86m04K97J42k56K91l24P1J14K5j13P4J12l9r4J5p1
$$ y = [147, 50, -122, -67, 265, -8, -247, 74, 50, -5, -238, -119, -43, 131, -193, -40, 75, 59, 203, -89, -71, 54, 73, 67, 10, 244, 291, -81, 87, -139, 11, -198, -80, 253, -45, -207, -17, -195, 175, 95, -74, 42, -103, 142, -92, 8, -20, -97, 233, 275, 172, -281, -11, -200, -126, -40, 137, -135, 191, 67, 51, -129, 226, -143, -260, 103, 209, 197, 25, 4, -114, 55, -42, 36, 27, 113, -177, 33, 223, 23, 254, 162, 11, 35, 36, 2, -113, 88, 115, -294, 30, -128, -17, 141, -217, 162, 19, -160, -134, -174, 95, 54, 92, 68, 50, 45, -57, 171, 167, 13, -145, -26, 197, 9, 153, 262, 237, 98, -202, 60, -140, -257, 3, 47, -9, 79, 14, 159, -2, -214, -167, 127, -167, 236, -84, -69, 199, 127, 29, 42, 79, -29, 49, 133, 35, 156, -173, -40, 42, -7, -87, -15, -164, 121, -28, 91, 142, -283, 20, -154, -45, 170, 30, 23, 207, 302, 218, -97, 89, -315, -18, 124, -132, 159, -165, -94, 20, 45, -68, 6, 118, 79, -15, 0, -71]
5117g1J93O5j3j78K03l09j03K08L6j72p7Q5J59K9j85kK47o8R7p6j30J24o9L17
5141C10j81m8K50m25j63L24KR6j08j62k2J48J44j86OJ27l5K8j19K55k47m3j53
5164b02j0J22K05j68J44j39J92J17l70j49M36l19K83j09O2l6K18j72k40M59l15
5185IK10j0j16r0j06J02L90k54j35j03L09j50Q3l2Q7J60m89J3J22J82m7k64j8
5208a47K39j67pJ15J56J65l49K72k69n0j45K48P7l36j89K81n0K49k15J57k61J32
5230i4R1l97M66J93j04j15l8J9J65M3k57J27j40N6p2O0j7kP1p3R0j83L02k60o9
5255a38J88r6K88k02k42J91n7P2J7J24K8j86L1o7J21K6k45L07l86K89m31M49p
5278G4N7k07K2J42R1j55l4K7o6J53L1J64l90p8J90Q7k7J16p4O7j91m1J0J84JL4
$$ y = [-71, 122, 187, 174, -4, 199, -110, -213, -5, 31, -141, -218, -133, 26, 55, -130, -132, 115, 47, 144, 68, -62, 62, -7, 310, 129, 81, 331, -94, -257, 67, 69, 165, 57, -105, -127, 21, 165, -21, -15, 112, 77, 105, -14, 241, -6, -49, -202, -212, -90, 115, -53, 91, -48, 144, 261, -109, -258, 178, -141, 142, 33, 95, 59, 277, 105, -135, 324, 9, 219, 209, 93, 3, -103, -1, 389, 135, 0, -103, 206, 56, 139, 107, 194, 354, -135, -122, 0, 182, 135, -129, -147, 92, -75, -82, 33, 189, 354, 5, 277, 8, -42, -187, 61, 138, -198, -387, -106, -156, 93, -122, 35, -226, -94, -3, -400, 66, 259, 155, 40, 2, 21, 186, 229, -28, 99, -41, 15, -57, 3, -14, -16, 55, -18, 72, -111, 191, -69, -138, 50, -46, 242, 40, -202, -11, -68, 4, 21, 145, 173, -13, 18, -49, 72, 98, -147, 160, -226, 63, -368, 81, 74, 131, -76, -54, 88, 179, 24, -10, 17, -49, 104, 135, 299, -91, -169, 21, 108, 81, 197, 123, 190, -1, -42, -32, 152, 153, 187]
5304A87r3N1k38l0O9Ll4K08j20k14L51J52k61n6j96J43L8q5K54j85j15l9L11J1
5328A12k78o2L43k23L33k32n3J08m1J86m00O8K14J04m8k37J38J18r7j29J84l02
5350a94K22j16Q0J1m6j67J41j38J29k8K26j57o7RK13J56k03q4q2m3J79j2R9o0
5374F8N5j37k4J28k23Q3L23l62J76N5l55k3J44L42l56l8K01k39O5R7j64J76Q4
5397G6j11J80l3Pl50J69q5j05K52j9j39J41K82j76j02k27K14m4j28L57j12j1m0
5420dj05K22j02KQ7k1k14J87k5Q8J98j96k7j40R6J10j21j01j05K25O1k64M3j40
5444b46L41j51L2k10M73r6J3k62J37O5j80p8K23K90j48k30%O5j19J98j27M8J31
5467A69l51R7K29n9j01m0M0l10L62J65j38n0R5M1q0j63L57k08K97j97j08j27l4
$$ y = [187, 94, 145, -93, -123, -54, -51, -85, 123, 3, -211, 140, 292, 31, -25, -221, -78, -40, -125, 129, -56, -171, -210, 101, 112, -166, -228, 115, -108, 225, -7, -60, 48, 7, 193, -207, -139, 75, 179, 131, -106, 32, 150, 53, -76, 108, -194, 28, -88, -8, 3, -43, -210, -69, -207, -78, -106, 120, -37, -104, -95, 118, 274, 71, -13, -95, -138, 41, 29, 128, 68, 123, -14, -38, 90, -133, -50, 273, -89, 87, 142, -213, -236, -92, 250, -106, -144, 57, -182, -117, -20, -184, -8, 76, -35, 145, 112, 119, -231, -62, -147, -252, 0, -19, -158, -17, 265, 89, -13, -240, -26, -70, -198, 159, 47, 36, -4, -109, 113, 11, 13, 100, 79, -135, 52, 27, 115, 313, 117, 90, -50, 46, 156, 35, -66, -171, 54, 115, -149, -106, -246, 95, -56, -24, -234, 239, 143, 156, -106, 31, 96, -84, -162, 61, 351, 203, -27, -27, 38, -81, 117, -10, 38, 169, -182, -85, 144, 85, -16, -56, -16, -326, 36, 201, 63, 13, 108, 149, 69, -94, 263, 55, 352, 155, 47, -80, -114]
5490a14o4M1K22q8M03l75R0j19J8N0k45K31m3J06j46R2L6k01Q6Q1m2l0j72M38
5514B55l55K82l82K21k44J69K08j92J60L7k23p8K54j05j7r2k09K46j30K05J4j49
5536a25J82j21J38P2j63J01n3Q6n0j06j76K93k15P8M1R0k01O3k8K77j71R5L5l70
5560b28K19q7N2J17l20K51j25K4M15n39K26K33k98R9Q9M8l5j24N4l8J75j23j48
5583f3LN9p7J25Q6j33R7j95L9R5q3p0j8J81R0k81L79l87L18k50%MK39n1j21J14
5609A00n7Q0j18j09O2J19j62K70j30R8r8o4j99J12N44m90J44K7j03Q8q5J48k41
5632f4L10p3k1p7l38K76k31J80K7j94J13qJ65j73J64j68J40Q8P2L6k23j50K70
5655A21k01P4Q1k31J97J85l80M27j11l05K56k37RM44l23J8K27l03N2J74k9m2n
$$ y = [-114, -178, -137, 85, -3, 400, 25, 115, -4, 14, 64, -181, 50, 7, 113, -33, 59, 95, -106, -20, 61, 19, -11, -183, 255, -100, 182, -200, 21, -223, -54, 154, -38, 122, 159, -64, -142, 112, 7, -10, -102, -311, -65, -195, 10, 24, -125, 57, -64, 74, 146, -17, 84, 31, 117, 67, -39, -215, 78, -137, -59, -18, 72, -129, -66, -94, 183, 12, 107, 142, -228, -9, -96, -44, 73, -247, 4, -121, -97, 318, -221, 5, 238, -60, 39, 128, 176, 141, 17, 71, 33, 208, 85, -63, -60, -1, -78, 47, 133, 0, 97, -98, -59, 36, -47, -117, -135, 46, 136, -145, 234, -153, 165, -85, -85, -81, 158, 107, -14, 100, 43, 123, 5, -104, -42, 77, -85, 185, 55, 153, 55, -9, -208, -96, 448, -42, 102, 129, 26, 114, 29, 177, -64, 246, 173, 152, 75, -263, 13, -218, -38, -11, -205, -92, -100, 65, -108, 56, -112, 28, 116, 188, 224, 1, -149, 121, -80, -6, 75, -156, 41, 226, -154, 273, 162, -143, 113, -124, -115, 329, 6, 24, 251, -52, 0, 174, 145, 103, 98]
5678I8K4k45J01J2N9j28j12K61o3l86L18K19m9p5L2q1o1o1J29m0N2Q9k70l5L94
5703A82m68K38N7m8J60r1j16J72j21J95o7P0K3j95J44L2j69j97K45o4j7K30Q9
5726B84l16J9L0J16J40l17n1j7K2J5m7L82k17L71l01j42K29r1l05J18Nn1K8l4
5750a30K27%o0J9j81M49m49rj7L00j94J08m8j1j52L43n9k85K34J9K33n40L63m81
$$ y = [98, 122, -123, -22, -10, 49, -79, -191, 70, 7, -379, -61, 158, 109, 34, 66, -15, -76, -137, -8, -48, 4, 93, -177, -212, 182, -286, -48, 9, -39, 121, 30, -86, 86, -35, 160, 93, 163, 186, -9, 135, 167, -2, -199, 46, -18, -35, 195, 284, -32, -13, 17, 133, 273, -44, -95, -112, -90, -75, -122, 260, 43, 414, 113, -29, 200, 109, -196, -78, -73, -124, -96, -130, 97, 97, 37, 56, -125, 324, -125, -134, -151, 149, -45, 63, 15, 4, -148, 195, 136, -149, 85, 104, 337, -203, 160, -321]
$$ [...]
8191a69
##END NTUPLES=NMR FID
##END=
