##TITLE=1H_Ser 5-3-V
 CDCl3, 8 sc, 
 1.9.2021
##JCAMPDX= 6.0         $$ Bruker NMR JCAMP-DX V2.0
##DATA TYPE= NMR FID
##DATA CLASS= NTUPLES
##ORIGIN= UXNMR, Bruker Analytische Messtechnik GmbH
##OWNER= root
$$ XWIN-NMR		Version 3.5
$$ Wed Sep  1 14:23:43 2021 Russian Standard Time (UT+4h)  she@DPX200
##.OBSERVE FREQUENCY= 200.1312
##.OBSERVE NUCLEUS= ^1H
##.DELAY= (6, 6)
##.ACQUISITION MODE= SIMULTANEOUS
##.ACQUISITION SCHEME= undefined
##.AVERAGES= 8
##.DIGITISER RES= 18
##SPECTROMETER/DATA SYSTEM= spect
##.PULSE SEQUENCE= zg30
##.SOLVENT NAME= CD2Cl2
##.SHIFT REFERENCE= (INTERNAL, CD2Cl2, 0, 15.7039)
##AUDIT TRAIL= $$ (NUMBER, WHEN, WHO, WHERE, WHAT)
$$ ##TITLE= Audit trail, XWIN-NMR		Version 3.5
$$ ##JCAMPDX= 5.01
$$ ##ORIGIN= Bruker BioSpin GmbH
$$ ##OWNER= she
$$ F:/spectra/data/she/nmr/H-F/1/audita.txt
$$ ##AUDIT TRAIL=  $$ (NUMBER, WHEN, WHO, WHERE, WHAT)
(   1,<2021-09-01 14:22:29.17 +0400>,<she>,<DPX200>,
      <created by zg, POWCHK disabled, PULCHK disabled
       configuration hash MD5:
       00 E9 B6 7A A2 85 ED C7 34 08 36 98 17 FE 4E 26
       data hash MD5: 16K
       15 98 EF F1 E6 D2 81 9C BF 0C C8 18 F2 2F 6F E6>)
$$ ##END=
$$ 
$$ hash MD5
$$ 77 FA 0A AF 84 12 9B CE 70 2E 06 8C EB C7 6C AB
##$RELAX= 
##$RELAX= 
##$RELAX= 
##$RELAX= 
##$RELAX= 
##$RELAX= 
$$ Bruker specific parameters
$$ --------------------------
##$DU= <F:/spectra>
##$EXPNO= 1
##$NAME= <H-F>
##$PROCNO= 1
##$TYPE= <nmr>
##$USER= <she>
##$AMP= (0..31)
100 100 100 100 100 100 100 100 100 100 100 100 100 100 100 100 100 100 
100 100 100 100 100 100 100 100 100 100 100 100 100 100 
##$AQSEQ= 0
##$AQ_mod= 1
##$AUNM= <au_zg>
##$AUTOPOS= <>
##$BF1= 200.13
##$BF2= 200.13
##$BF3= 200.13
##$BF4= 200.13
##$BF5= 200.13
##$BF6= 200.13
##$BF7= 200.13
##$BF8= 200.13
##$BYTORDA= 1
##$CFDGTYP= 0
##$CFRGTYP= 5
##$CHEMSTR= <none>
##$CNST= (0..31)
1 1 145 1 1 1 1 1 1 1 1 1 1 1 1 1 1 1 1 1 1 1 1 1 1 1 1 1 1 1 1 1 
##$CPDPRG= <>
##$CPDPRG1= <>
##$CPDPRG2= <>
##$CPDPRG3= <>
##$CPDPRG4= <mlev>
##$CPDPRG5= <mlev>
##$CPDPRG6= <mlev>
##$CPDPRG7= <mlev>
##$CPDPRG8= <mlev>
##$CPDPRGB= <>
##$CPDPRGT= <>
##$D= (0..31)
0 1.2 0 0 0 0 0 0 0 0.06 0 0.03 0 0 0 0 0.0002 0 0 0 0 0 0 0 0 0 0 0 0 
0 0 0 
##$DATE= 1630491748
##$DBL= (0..7)
120 120 120 120 120 120 120 120 
##$DBP= (0..7)
150 150 150 150 150 150 150 150 
##$DBP07= 0
##$DBPNAM0= <>
##$DBPNAM1= <>
##$DBPNAM2= <>
##$DBPNAM3= <>
##$DBPNAM4= <>
##$DBPNAM5= <>
##$DBPNAM6= <>
##$DBPNAM7= <>
##$DBPOAL= (0..7)
0.5 0.5 0.5 0.5 0.5 0.5 0.5 0.5 
##$DBPOFFS= (0..7)
0 0 0 0 0 0 0 0 
##$DE= 6
##$DECBNUC= <off>
##$DECIM= 32
##$DECNUC= <off>
##$DECSTAT= 4
##$DIGMOD= 1
##$DIGTYP= 9
##$DL= (0..7)
0 120 120 120 120 120 120 120 
##$DP= (0..7)
150 150 150 150 150 150 150 150 
##$DP07= 0
##$DPNAME0= <>
##$DPNAME1= <>
##$DPNAME2= <>
##$DPNAME3= <>
##$DPNAME4= <>
##$DPNAME5= <>
##$DPNAME6= <>
##$DPNAME7= <>
##$DPOAL= (0..7)
0.5 0.5 0.5 0.5 0.5 0.5 0.5 0.5 
##$DPOFFS= (0..7)
0 0 0 0 0 0 0 0 
##$DQDMODE= 0
##$DR= 18
##$DS= 0
##$DSLIST= <SSSSSSSSSSSSSSS>
$$ [...]
##$SUBNAM2= <"">
##$SUBNAM3= <"">
##$SUBNAM4= <"">
##$SUBNAM5= <"">
##$SUBNAM6= <"">
##$SUBNAM7= <"">
##$SUBNAM8= <"">
##$SUBNAM9= <"">
##$SW= 20.0189188712717
##$SWIBOX= (0..15)
0 0 2 0 0 0 0 0 0 0 0 0 0 0 0 0 
##$SW_h= 4006.41025641026
##$TD= 16384
##$TD0= 1
##$TE= 0
##$TE2= 300
##$TE3= 300
##$TEG= 300
##$TL= (0..7)
0 120 120 120 120 120 120 120 
##$TP= (0..7)
150 150 150 150 150 150 150 150 
##$TP07= 0
##$TPNAME0= <>
##$TPNAME1= <>
##$TPNAME2= <>
##$TPNAME3= <>
##$TPNAME4= <>
##$TPNAME5= <>
##$TPNAME6= <>
##$TPNAME7= <>
##$TPOAL= (0..7)
0.5 0.5 0.5 0.5 0.5 0.5 0.5 0.5 
##$TPOFFS= (0..7)
0 0 0 0 0 0 0 0 
##$TUNHIN= 0
##$TUNHOUT= 0
##$TUNXOUT= 0
##$USERA1= <user>
##$USERA2= <user>
##$USERA3= <user>
##$USERA4= <user>
##$USERA5= <user>
##$V9= 5
##$VALIST= <valist>
##$VCLIST= <CCCCCCCCCCCCCCC>
##$VD= 0
##$VDLIST= <DDDDDDDDDDDDDDD>
##$VPLIST= <PPPPPPPPPPPPPPP>
##$VTLIST= <TTTTTTTTTTTTTTT>
##$WBST= 1024
##$WBSW= 4
##$XGAIN= (0..3)
0 0 0 0 
##$XL= 0
##$YL= 0
##$YMAX_a= 205722
##$YMIN_a= -448016
##$ZGOPTNS= <>
##$ZL1= 120
##$ZL2= 120
##$ZL3= 120
##$ZL4= 120
##$ABSF1= 10
##$ABSF2= 0
##$ABSG= 5
##$ABSL= 3
##$ALPHA= 0
##$AQORDER= 0
##$ASSFAC= 0
##$ASSFACI= 0
##$ASSFACX= 0
##$ASSWID= 0
##$AUNMP= <proc_1d>
##$AZFE= 0.1
##$AZFW= 0.1
##$BCFW= 1
##$BC_mod= 2
##$BYTORDP= 1
##$COROFFS= 0
##$CY= 11.3945322036743
##$DATMOD= 1
##$DC= 2
##$DFILT= <>
##$DTYPP= 0
##$F1P= 2.36226072786647
##$F2P= -0.459571619588291
##$FCOR= 0.5
##$FTSIZE= 0
##$FT_mod= 4
##$GAMMA= 1
##$GB= 0.15
##$INTBC= 1
##$INTSCL= 1
##$ISEN= 128
##$LB= 0.24
##$LEV0= 0
##$LPBIN= 0
##$MAXI= 10000
##$MC2= 0
##$MEAN= 0
##$ME_mod= 0
##$MI= 1.114404
##$NCOEF= 0
##$NC_proc= 0
##$NLEV= 6
##$NOISF1= 3.799351
##$NOISF2= 2.8
##$NSP= 1
##$NTH_PI= 0
##$NZP= 0
##$OFFSET= 15.70392
##$PC= 1
##$PHC0= -13359.83
##$PHC1= 11.80097
##$PH_mod= 1
##$PKNL= yes
##$PPARMOD= 0
##$PSCAL= 0
##$PSIGN= 0
##$REVERSE= no
##$SF= 200.130013532006
##$SI= 16384
##$SIGF1= 3
##$SIGF2= 2
##$SINO= 400
##$SIOLD= 16384
##$SREGLST= <1H.CDCl3>
##$SSB= 0
##$STSI= 0
##$STSR= 0
##$SW_p= 3612.71676300578
##$SYMM= 0
##$S_DEV= 0
##$TDeff= 0
##$TDoff= 0
##$TI= <>
##$TILT= no
##$TM1= 0
##$TM2= 0
##$TOPLEV= 0
##$USERP1= <user>
##$USERP2= <user>
##$USERP3= <user>
##$USERP4= <user>
##$USERP5= <user>
##$WDW= 1
##$XDIM= 8192
##$YMAX_p= 0
##$YMIN_p= 0
$$ End of Bruker specific parameters
$$ ---------------------------------
##NTUPLES= NMR FID
##VAR_NAME=  TIME,          FID/REAL,        FID/IMAG
##SYMBOL=    X,             R,               I
##VAR_TYPE=  INDEPENDENT,   DEPENDENT,       DEPENDENT
##VAR_FORM=  AFFN,          ASDF,            ASDF
##VAR_DIM=   8192,          8192,            8192
##UNITS=     SECONDS,       ARBITRARY UNITS, ARBITRARY UNITS
##FACTOR=    0.0002496,     1,               1
##FIRST=     0,             0,               0
##LAST=      2.0444736,     0,               0
##MIN=       0,             -448016,         0
##MAX=       2.0444736,     205722,          0
$$ Real data points
##PAGE= N=1
##DATA TABLE= (X++(R..R)), XYDATA
$$ [...]
1867B51k42l59L31O7J2K75m71R0L25l90j48K57M1m0l21K22J11K98l54j84J22M01
1889B94K0l64J3k42M09M3m21L03P4j82K2MJ76q0O6j31k59L64l88J03j3K80j6l44
1913b69m4J06L34J53k09j85L95p1m6m9k46J77L07l94j99K29L42j74M1k93L21p0
1935A56l21j6J17J47K0r3k03L31p8N5n95M38L20l70Q2k17K18K5M2j68j9L35k19
1958a3j66R9K35Mn6j66J70L6K04o41J99M10r9k43mLJ15k35M3j84K00K87%m60N6
1983b06J74Nk0j64Q6K85n2j87k6Q9L26n52J92j77L20L2J8l77J7N44l79J03r2J6
2007b5K57k18k40L21j61k8Q9J78p2J44k53n5K3j53p3M20K8j4l03J32k89M29j82
2030d5J27j26k11N21k64j04K71j14k36K66j92J28m2L22m03O9n2K76j26j82J62
$$ y = [251, 9, -350, -19, 48, 60, 335, -136, -46, 279, -111, -259, -2, 39, -1, -322, -100, 11, 309, -45, -229, -107, 294, 314, -50, -37, -279, 130, 173, -248, 55, 129, -53, -31, -27, 149, 69, 135, 4, -255, 109, -279, -176, -189, 91, 75, -269, -313, -207, 127, 280, 71, -114, 281, 210, 164, 115, -131, 46, 353, -41, -240, -11, 331, 157, 198, -95, 226, 156, -165, -181, -64, 83, 103, 10, -193, 138, 60, 115, -480, -42, 278, -92, -10, -227, -9, 16, 58, -110, -129, 206, -13, -179, -80, 155, 159, 103, -63, 107, 143, 347, -294, -95, 315, 216, -27, -31, -28, 87, -148, -105, -289, -89, 198, 198, -262, -206, -32, -27, -47, -211, -125, 160, 108, -79, -105, -16, 310, -242, -50, -227, 93, 125, 143, -234, -217, 327, -52, 51, -41, -25, 232, 14, -226, 95, -66, -94, -5, 173, 101, 245, -8, -63, -40, -193, -266, 154, 182, 168, -135, -3, -292, 137, -45, 82, -44, -255, 266, 2, -102, 169, 55, -181, 85, -107, 21, -21, 301, -102, -33, -85, 191, 65, -117, 45]
2051D5R1R3n1L9k73J53k37K23j93J79J33k4l05K19Q3m2k63l75L40K51j94k65J96
2074a77L35mm62K53K0K2m0j71L70RJ60m10P1m1K11n3n6N4J27n8k31j25P1J19K50
2099B44m00j60L56l8q4j42J21R8J91l22L0J02M44k78l89M31O3j77J67m85L01p3
2121@N1j85L3K11oo8l94L42J19q0j79K24K51r8j42J95l18P5k13J17K34r1l4m5
2145aj21M9K3j84R9M6L51j22m0j91L0L69n34J84J22l37L55k17R9J94J6q2r1L2
2169D9j82O5R4m38L97M03m58m3O8Q2j10J41k47j09J86J31r9K07k32K68k57Q4q5
2192h5R4K56m44O5L47j89N1k80M39l08J19l70J16J09O5Mk03r7L38J46k00k22K71
2215B2j5R1k52LN6J42n0j53R2n0L64k15j45K5J78J5r9o8K65j69j24p4Q6J24n4
$$ y = [45, 136, 229, 178, 217, -56, 97, -140, 83, -110, 69, 202, 178, -127, 92, 175, 133, -130, -505, -165, 86, -108, -373, -177, 158, 154, -308, -55, -35, -13, -53, -224, 146, 155, 315, -95, -24, -65, 146, 93, 37, 91, 218, 160, -71, -196, -125, -6, 244, -156, -316, 40, 2, -82, -224, -103, -5, 186, -136, -106, -4, 440, 162, -227, 204, 267, 90, 257, -228, 73, 0, 51, -134, -101, 110, 104, 36, -358, -16, 103, 23, -156, 68, 319, 221, 79, 274, -44, 31, -182, -65, 169, 78, 44, -1, -122, -73, -50, -234, -135, -89, 262, 140, 100, -91, -61, 308, -226, -42, 80, -257, 98, -119, -20, 174, 190, 108, 17, 49, -133, -68, 26, -412, -15, 388, -70, -113, -45, 37, -73, 68, -179, -288, -102, 29, -70, 137, -95, 173, -84, 0, -85, 9, 265, -179, -114, 233, 44, 95, -185, 254, -54, 65, -305, -189, -80, -15, -11, -214, -311, 27, 173, -27, -249, 22, 7, 98, -154, -151, -95, 47, -3, -156, -64, -114, 250, 35, -110, -85, 93, 108, 9, -59, 206, 37, -87, -161, -75, 49, -5]
2240eK78j38N8j82m8j28J69Q6j22N2j44l3L15m0L8k70J77M1j59p0K1K27k22j15
2264b14M24n48L83J01j5k10q9J19K91k22M1J76j73L2nj4k65K6P9j3K16j91j54
2287b25J61M20l44j6p3J72l2l27J78k7L1n6J36JL2q6K74k92R8K7j13P8j78J86
2311B5J88l29j4K19k84J81j52O5r6K93j69LqM9j09m2J43J49k3k23L45k80J53J46
2335B30n49J99K85n58M53P5k98J13J49q1J2N1N3J27j85o0o9l7J25pJ95k4j43k79
2359b23K80o2L8n4j09K69m8M2M1j89L6K7M1K7n5j56R4M9K87m91J22j25J89j00
2383g0Q0J80k37R2l8Q4K3j66r8J11K43m38L16J96j85j17k24M61l77J43Nk0J05
2406F9J22j00r9N4K8J14M8l0j23M3p2j5j2m7M06l57o1J7M4p7JM7OJ47j80j08j89
$$ y = [-5, 273, 135, 193, 11, -37, -165, 4, 90, -32, 20, -124, -157, 158, 118, 156, -114, 63, 104, -55, -125, -104, 123, -99, -214, 210, -338, 45, 146, 131, -79, -168, -49, 242, 20, 61, 237, 64, 96, 91, 77, -188, -162, -83, -96, 120, -71, -225, -64, 356, 12, -4, -77, 95, 63, -264, -86, -113, -82, -138, -2, -1, 31, -55, 219, -73, 25, 52, -61, 17, -161, 25, 213, -116, -130, 89, -195, -14, -166, -101, -197, 96, -73, -70, -78, -29, -138, -180, -37, 112, 89, -134, 211, -69, 84, 230, -319, -120, 165, -393, 60, 135, -163, -50, 99, 18, 30, 81, 134, 261, 76, 16, -53, -90, 35, 28, 223, 199, 56, -223, 57, -5, 33, -21, -130, 139, 91, 133, 174, -15, 21, 48, 89, 116, 61, -95, -1, 48, 335, -156, -34, -159, 30, -70, 10, 190, -47, 45, 7, 91, 114, -52, -150, -39, 204, -234, 82, 278, 93, -24, -248, 213, -164, -21, -16, -36, 69, 191, 91, -8, 46, 74, 188, 236, 206, 83, 126, 54, 39, 27, -20, 386, 29, -32, -15, 29, -48, -47, 0, 6, 153, -27, -135, -324]
2433c24K58o9J4QL33p7q2J40j67M3j01M7j71J4N7K51pk88J91J19k70m3J77J07
2457A60o5L6K6j66K88l46k01M31j8q1j44m8P1L43k29j14j4R9O8k23J55j92J4L13
2481A63j32J29j00j70Km5N3J84J91m63M13n22K81N2k86L89m5L2K1j85J58j98J89
2504A11p1j39Q4j76R7o5M71k87q5q2j2K00J8o2k4l53M93m8m1j09J77p9n0j48J59
2529b1j12L8M5P4j04K50k85J42J43k74K33J13l7k24J04n3j8j29J53oj81j89L83
2552D5L7k29L94j26j27J18k28J94K71l66q3J67r6J1mj04j23L73J0l9j19j99K67
2575D4K07m5j61l9L22l02J66j85J34j77j51K02o6L0k21M23m49L15p2j97q8N37
2597B27m39L10K0j65L08j78j29K6j7Q8L47k22oL2J31l39J42k80K79N3j79p4r3
$$ y = [-324, -66, -135, -121, -113, 220, 143, 61, 201, 34, 77, -24, 23, -148, -134, -77, 174, 167, -121, 70, 189, -81, -124, 53, 160, 95, 131, 157, -9, 279, -67, -268, 163, 145, 64, -80, -128, -57, 286, 57, -57, -71, 28, 96, -127, 28, -164, -150, 163, 31, 160, 60, -110, -108, -153, -100, 84, 275, -188, 225, -297, -16, 36, -250, 139, 94, 126, 147, -38, 120, -78, 111, 40, -99, -15, -191, -94, -159, 312, 25, -60, -142, -154, 46, 64, 2, -22, -375, 118, 70, 29, -80, 97, 18, -32, -180, -21, -133, -95, -50, 24, -80, 170, -115, 27, 170, -104, 129, 242, 205, -19, 85, 32, 14, -115, 38, 32, -149, -338, 45, 82, -147, 247, 121, -6, 112, -116, 78, 349, -17, -100, 67, -29, -18, -22, -126, -249, 124, 134, 95, -24, -223, 44, 251, 206, 45, 6, 328, 26, 192, 7, 141, -36, -187, 15, -51, -21, -242, 181, -268, 47, -25, -222, -310, 227, -212, 98, 118, -47, 261, 83, -46, -20, -37, 51, 398, 176, 170, 202, 333, -6, 136, -144, 135, 188, 9, -65, -158]
2620a58K24N7j53l0LL5L5Q4L6k39J56q3J56m4r6Q3J9j02o0K10j51j37J05K47j38
2645E9j0P2j86oQ8j58L02o7r2j26K19p4M2j30J10J25l43M84J15m12O8K9j68l6
2669i5J26l9R2k12N3p2J03Q6l8j7J23Rl0k33J75r5J81m1k91K67J83k10P4Jk12
2694a12Q9Q3n6R5j8r1k72K98k44P8J00R8%K51m65R7R0L2O9Kj55P2j35R8q9K6j49
2721b08L97k89j46L30N6k41K22K13k68l3m2Q4O0K6p2j94q5K07R8j61l34N92l48
2744a36J72k56M06n8k77M34m56K36m0j52j16J85O1Q8j12K56j78J79j98j73K34
2765I9j14J8M8j08j49K67j86J71j90oP8Q5k55J27L6L09l6j4k30L04k97p5j77M45
2789A50j54L0l68M04N8j72l20O03j13k25K08j37K33j51Q5k09p7K17Q9l48R8K41
$$ y = [-158, 66, 123, -30, -60, -57, -22, 13, 97, 133, -106, 50, -33, 123, 79, -17, 66, 85, -17, -77, 133, -18, -155, -50, 197, 59, 49, 121, -65, -71, 17, -141, 161, 94, 2, -124, 95, 21, 63, -67, 43, 168, -175, 309, 424, 12, 80, 109, -59, -95, 31, -8, 84, -128, -75, -147, -44, 42, 4, -13, 110, 119, 89, -144, 31, -64, 117, 76, -215, 52, 235, 25, 99, 100, -112, -23, 60, 4, 99, 81, -10, -282, 16, -228, -150, -50, 48, 48, 299, -166, -69, 21, 53, 122, 124, -31, 41, -94, 4, -85, -59, -208, 189, -100, -246, 84, 140, -101, 121, 334, 66, 33, -9, 75, 135, 161, 89, -105, -190, 17, 115, -46, -380, 212, -136, 36, -220, 186, 128, -149, 285, -171, 65, 25, -127, -243, -58, 3, 91, -21, 235, 57, 236, 38, -135, 99, -15, 3, 51, -57, -206, 61, -125, 46, -144, -150, -72, 13, -242, -115, -79, 230, 194, 180, -50, 254, -43, -118, -295, 150, -4, 26, -342, 62, 120, -52, -372, 231, 118, -107, 101, -36, 197, 46, 131, -78, -155, 62, 151, -197, -99, 142]
2811A42k55Q7j9j98K74O0q2j3j7R8J39k60j27Q0J01J6R3k16K09L0j76K72l40K13
2835A11j3k43L46l10J50k55K0L02P4q7j45N5k59K34q9K52k01k8O2j31pN9J41J77
2859B15m78K96J13o5j64j3L20q9n5l42m3K01j9J44N4k67K24Jj23J23j15K6l96
2882d52L13L08k16J27m5j63J03O0j23RL41l39K14j18q9j0J74N8j96J54j77m1J74
2905F6j71J38k8K7r1J58J38j40j95Q9p0J18j93J9J82j33L27m07L07l30P8M5p1
2928a37K33k7m4j16M14n25L84k53r4J77J44n9j11M9j31O4R8k29J88K7l39L09l98
2951c76K67K47k26J36o4J07N6m3m6R3k43l2J50l0k18M8L8J3K63j77K26k62J20
2974D7J69m38K40m9J09n5k70K83o7k0N7J19m38K76j48K03J36k22%q7J03m9K80
$$ y = [142, -113, -26, -45, -243, 31, 91, 9, -4, -21, 77, 216, -44, -171, -91, 10, 26, 119, -97, 112, 142, -34, 238, -102, 111, 98, -145, 201, -109, 41, -214, -194, 108, 182, 95, -50, 5, -254, -20, -109, 143, -58, -86, -24, -155, -162, -103, 38, 215, -263, 33, 146, 81, -83, -96, 224, 135, 80, -262, -305, -104, -123, 21, 75, -192, 32, 33, -90, 33, -82, -56, -452, -139, 169, -47, 80, 35, -128, -25, 35, -88, -79, 262, -77, 137, 19, -70, -80, 94, 152, -44, 110, -67, -108, 66, -105, 33, 5, 32, -59, 99, 237, 97, -98, -9, -79, 39, -154, -135, 47, -86, 241, -166, 141, -189, -111, -66, -137, 96, 69, 25, -91, 323, -202, 182, -71, -165, 12, 156, 97, -14, 35, -96, -32, 66, -163, 25, 52, -287, 22, -376, -109, 138, -88, 48, -16, 91, 147, 104, 58, 151, -92, -124, 26, -4, -222, -174, -136, -123, 140, -37, 189, -73, 47, 216, -222, 18, -31, 78, 23, -247, 36, -31, -51, 6, 125, -313, -37, -185, 18, 154, -68, -68, -155, -52, -101, 179]
2997A79n4j07p8K9L47o7r0k29p8J95M0O9j77L74l69J89j85j1j36J38j69K92l99
3020b97K46J02J0j77p6J8j10J74L4j21O13m79M7K11K2n0k88K64k97J50j32O2k15
3043b89L24J86k52o0J29N3k69L5J84j6j06J3P7o8J20j12o7J26K11k7k26N1j52
3066a35K74j98P8P1k5m1L47n17q8J41J60K60J8l29M6m07M98k50j60L53O3M0m11
3089b12J69R0k86M89l73J36j02R8R4k85J13M36n02K56n1J63qO8k87j11K37k64
3111a32K03O5J9k09L38l43o0j19L90o64M83k76K31J97q0J50m82J10K71j46J0J69
3133A25L9j57n7qn4j40L55k35JK87j14J75k84J38k44L23k25K07n1k2k10K46k2
3156G3j45J10k62K51j8K78o5k70J29j01J21j45n9l9J38J35J42n26M68m4l84K21
$$ y = [179, 125, 18, -60, -31, 316, 249, 159, -70, -148, 47, 87, 156, -21, 353, -16, 173, -12, -23, -159, -21, -190, 102, -297, -51, 51, 61, -116, -192, -174, -284, -110, -76, -197, 416, -63, -16, 195, 217, 167, -121, 143, -154, -4, -136, -74, -289, 35, 221, -31, -91, 38, 91, -178, -143, 41, 25, -81, -68, 9, -59, 61, -51, -118, 8, 219, 192, -34, 17, -135, 139, -59, 19, 90, 65, 24, 371, -146, -234, -93, 67, 327, 345, 16, 62, -345, 153, -97, -257, 96, 159, 199, -212, -43, 47, -239, 250, -123, 13, -89, 9, 103, -182, -69, 367, -135, 121, 70, 233, 225, 293, 6, -105, 132, -132, 71, 136, 155, -54, 284, -59, -119, -238, 152, -512, -29, -305, -74, 123, 43, 193, -289, -179, 92, -54, -44, 125, 164, 7, -50, -58, -112, -252, 103, -132, -131, 156, 42, 217, -67, 71, -173, 150, -75, 132, 81, 59, -151, 95, 73, -72, 38, -224, 27, 9, 287, 222, -48, 81, -20, 101, -44, -103, -142, -4, 131, 273, -253, 215, 171, -213, 8]
3178HJ67j07p9qK33l50M5M9J18k24L85k48k88M54j05J12l7k30M1M4N3J7J47m55
3202b58L17j85K16j15J22k08J40k20J51o6L88j35k89Q0J13J18k07l16R6L88j99
3223f9jl1K72L3k66k7m5j4K09q4N4J21j26m9q4K68J41m50O1K52j63M1K24k54P6
3248H9J71k47L6k22N5L10j12m3p2K48n15J27J56j45L65k58J57j42JJ96k92J56
3270A9J77j68O4J10l36L93k86P9j03k54N61k35K4m6J37k01L9KR9l4jj62k23L87
3294D2J19k02J27k27k0r8R9J60J1l15M37k47m0J66j27K88k73J44j67J24J1P8J29
3317B19l74K22J81l67K23m1k66K03k5j57J77N6l33N01k30Rj2j90J51k24o3nK40
3340a05O3K89k89Q9k47K67k51M43k85k6J0l69L31L43l91j33j4R7J35q7L62l02
$$ y = [8, 175, 68, -11, -19, 214, -136, -91, -42, 76, -148, 237, -11, -299, 155, 50, 162, 125, -105, -64, -20, 33, 50, 197, -258, 59, -126, 90, -25, 97, -111, 29, -191, -40, -106, 282, 147, -142, -62, 51, 169, -38, -354, -258, 130, -69, -70, -101, 171, 204, -62, -89, -134, -148, 61, -23, 31, 152, 26, -23, -107, 161, 302, -148, -87, 165, 2, 43, 267, 13, 89, 260, 13, 49, -173, -118, 192, 80, 37, -35, 213, -302, -175, -19, -164, 201, -57, 100, -42, -41, 155, -137, 19, 196, 28, 92, 202, -134, 259, -27, 52, -51, -305, 256, 21, 45, -1, 136, -65, -26, -24, 75, 41, 40, -122, -345, 42, 161, -41, 86, -141, -161, -259, -160, 0, 11, -304, 133, -114, -154, 12, -115, 173, -100, 44, -123, 1, 12, 90, 219, -155, 67, 248, -119, 104, 63, -203, 0, -25, -182, -5, 51, -282, 219, -11, -2, -14, -204, -53, -277, -340, -345, -105, -42, 247, -42, 47, -200, 67, -184, 259, -26, -52, -42, -411, -80, 263, -128, -261, -275, -178, -43, -130, 232, -70]
3362g0o3N4J1J15j79JJ61k38J02K60k53j34R9j3L61m39N32j69r8K6j55K27j53
3385a5Q0K64n33K12N2m3j90L21m77J77J13r7K67l36M10j57O9p3j5m5j5r5J03l8
3409f1J98p7o0R0j84n3N0L19l76j00L55j62rJ50J29j26o6j71K03J51j11n8n0p6
3433i5L63p4j58J28R9l52J79l9k55J4n6J71k07L78n3J59k94p4O7J23J07k55K04
3456H0j27p5k3mL69k69N2J28L0J04j97J39l32J76j16K26k29J58k12J4p0J66j01
3479a13L6L30n7k74L05m14J92O5k12j39J45K41k12O7J15J0J0k00L54l23R8k59
3501b35K13r4o0K10Ooj62M0J88k62J29J04r0j88J45n0K40q6j59Q9O5o8J35r5m03
3526c94K87P1j41K04n2J29j4p3o7L15j33J17l80K70M4k41K4l0J82n2j94K25m0
$$ y = [-70, -133, -79, -68, 47, -132, -131, 30, -208, -106, 154, -99, -233, -134, -147, 214, -225, 307, 138, 40, 66, -89, 138, -15, 65, 329, -204, 8, 60, 17, -173, 148, -329, -152, -39, -136, 131, -205, 205, 48, 117, 44, 29, -16, -31, -126, -23, -61, 137, 60, 0, 90, -94, -147, -97, 222, -154, -254, 101, -61, -70, 80, 209, 83, 17, -154, 49, 200, 89, 31, -19, -95, 268, 194, 36, 164, 263, -89, 90, 51, -204, -190, -246, -75, -282, 96, 43, 202, -92, -166, -99, 24, 131, -124, 80, -47, -122, -145, -149, 220, -49, 3, 131, 161, 265, 68, 207, -125, 51, -65, 161, -68, 90, -122, -108, -178, -12, -113, -77, 253, 196, -78, 227, -187, 5, 70, -142, -281, -136, 105, -107, -40, 75, 85, 95, -105, 249, -74, 24, -235, -22, -116, -176, 34, 40, 34, -128, -88, 100, -162, -33, 71, -19, -207, -62, -112, 128, 42, -117, -28, 37, -31, 104, 9, -394, -107, -36, -177, 27, -25, 104, 90, 17, -50, 265, 132, 249, -131, 139, 183, -58, -34, -64, 118, 66, -128, 97, 57]
3549E7j82L4k02M06O2l76K96J02k98J17j10l0K5Q6r0o4N48k64j48J38k4M3k04
3572g8K09l94L29n9k73K17m8k3P2o1J53jL2j5L04k12j18O7K22l80J25k68J05L77
3596B82k24k04R8L18k91N3J63j02j98L00k05J74l51j14n9L74J51r8pp2J04j82
3618i0L58o39K79K03j46k7J0j30M24j85q4o2Pm5K21J3k50J62J01r1j01NJ13k00
3642a54k07N49o6RK65k87r6K3J87j49p5k17L08l3n1N2k6n9k18J58J78l64K10J22
3666E9j13Q9j7J71j47j97N9n2R4K58m3n2k19j28K11K06j04j4j75j35K07M6PJ1
3690B2k37R3J13P9j58L2l22K95J8j00R0K40o2j66J25j3j90n1R3j4j66L50m07K58
3714g8j71L05k9o3J16j18l9J09j39j30Q1J47q0J04p9J23j05l8J80k28N7J3K0p8
$$ y = [57, -125, -91, -293, 113, 175, -201, 95, 197, -101, 16, -94, -124, -99, -13, -103, -167, 381, 117, -31, 107, 83, 126, -78, 131, -263, 66, 7, -266, -49, -97, -120, -48, -109, 44, 43, 75, 60, 364, 152, 34, 101, 323, -57, 68, -200, -95, 282, 58, -146, -48, 270, -21, 32, 195, 93, -105, 195, -10, 164, -187, -301, -360, 14, 165, 67, 60, -12, 92, -90, 268, -371, -92, 111, -35, -62, -52, -182, 242, 57, -27, -89, -82, -127, 94, 107, -143, 19, 120, 29, -72, -67, 46, -154, -361, 188, 122, 131, 396, 109, 13, 36, 223, 74, -1, -218, 90, 57, 6, 58, 32, -27, -245, -87, 91, -273, -63, 59, -54, 35, 18, 189, 42, -155, -96, -148, -54, 204, 161, 109, -110, -238, -27, 179, 75, 61, -114, -249, -42, 4, 11, 22, -215, -122, -9, 70, -88, -56, -378, -83, -65, -165, -75, 165, 103, -63, 62, 49, -141, -192, -99, -113, -279, 71, -336, -78, -249, 56, 27, -36, 80, -38, -77, 32, -107, -237, -156, -9, -89, 15, -64, 59, -46, -84, 96, -132, -75, -62, -42, -120]
3738a20K96J2j62k06Q2K54l3%k77N0K4J03o2J46o4N6k8j20J75L13l68%O2L6j87
3763a8J40l76L85j72M1l9M3k80K20R6j55L12m08K49Q7m3k29K15j25lq6J56qp0
3787f8Q4j22L3l2J60L1j11k5l7j67L67k36J76l2l79L52J3k49L58k49R8K80k01
3810D4j29n3J09mL6l0J18k06Q9j05K79k86L7J09k08m9N39n29L62k55J38l6J68
3833A38j97J14O3k82k3J57k0J36l19QK84n0p6K30m7k89J37J43k64J12k20K58M3
3856C6n3o0r1L43l65L53k34j91Q9J69O5j62M32k83k03P2J72j89N9L7k82O08l89
3879f7Q5J05j09j9P3m6Lk33K59l3J1j3r2j3j18L72k08k22M26j54K20k49M4J7Q5
3904A24j45P9k3Mj66K04Q9j30k4mj5N9j53l2J52J41k03K70k59m3K71k76r9J53
$$ y = [-120, 176, 188, 26, -180, -98, 156, 123, 123, -154, -104, -80, 23, -39, 107, 43, 99, 71, -49, 126, 439, 71, 71, 133, 169, -18, 122, -254, 131, -41, 0, -39, 4, -276, -56, 40, -115, 197, -211, 38, 125, 82, -147, 68, -57, -60, -146, 10, 2, -68, 16, -106, -73, -105, 55, 86, -25, -50, -87, -254, 113, -123, 53, 21, -358, -6, 7, -242, 116, -133, -35, 245, 44, -85, -138, -29, -33, 3, -27, 91, -115, -26, -131, 148, -138, -101, 8, -200, -249, 290, -239, 123, -132, 6, -30, 138, -59, 55, 118, -164, -187, -30, -50, 86, -233, -225, 59, 9, -67, 163, 116, -173, -36, 107, -157, -45, -265, -7, 36, -17, -77, -168, 175, -190, 163, -71, -262, -173, -4, 61, -101, 331, 48, -155, -83, 89, -100, -41, -4, -286, 322, -67, 18, 123, 14, -5, 68, 22, 25, -208, 51, 18, 29, 16, -76, -89, -207, 165, -43, -265, 161, 7, 227, -22, 22, 39, 124, -21, 58, 35, 39, -127, 77, 166, 36, 12, 8, -7, 52, -101, -133, 19, 160, -43, 227, -32, -75, 196, -80, -179, -26]
3928b6M0k58K84j71K97j6l3k23K16k82J88n7J52l5m9j26K18o0q6J66q3k88J19
3951a13R3n7L17k02k54K43J8Q2k10K10j51J52l53K77jP1r2l19L70k54K67r2lq5
3975h6j8k0K96k17K17l9p6k36J4K49j3o1o0M8o6J66m9O3k6p7J40j07j45PJ40K80
4001C24j70k24m8J3o0L84k07j63P8m4N2P8r3J81N9k07M28m08k48J76L26k9j32
4024F6k80J13K86j89l19L25L0M2j17K47k04l5k31K96j37J85Q8j44k72M04R5k67
4046a8J32k31J81P9k11N3J24p3Q2k09J27J54j77L40k53l51L86p4j04J23j22Q0
4068C8m0K88p9p8j36j73L16r7m4n2J91r5m3J86K0l67K75l3p1j20J06n3J37q9J25
4093A12r1O8k65K10j77n9K03j77J54k2J17q5r2K09L6jK7m30J95l3J38k1L9Pk76
$$ y = [-26, 14, -244, 40, -131, 166, 150, 117, -106, 110, -172, 16, -41, 111, 76, 27, -99, 119, 59, -27, 139, 56, -232, -113, -20, -77, 240, 38, -216, 27, 45, 127, -83, 127, -24, 128, -225, 52, 51, 122, 30, -289, 81, -173, 94, 2, -1, -86, -104, -124, 172, -45, 172, 133, 57, -179, -165, 84, 71, 10, -50, -2, -68, 98, 49, 112, 86, 9, 149, 42, -103, -96, 44, 324, 154, -70, -118, -105, -165, 219, 12, -151, -73, -117, -65, 13, -80, 101, 160, -47, 381, -27, -275, -99, 227, 198, 66, -214, -101, 185, -4, -323, 2, 32, 74, -43, 204, 0, -35, -266, 30, -107, 78, 166, 22, -250, 154, 249, -18, 114, -117, 64, 143, -68, -15, 109, 36, 118, -91, 36, 190, 13, 353, 100, -251, 135, 61, -43, 80, -42, 38, -2, 286, 207, 129, -7, -180, 136, 39, -5, -57, 134, 39, -4, 182, 202, -165, 110, 77, 6, -114, -8, -61, 76, -13, 112, 21, 89, -176, 34, -143, -202, 1, -176, -22, -44, 73, -12, -104, 105, 141, 140, 167, -263, -68, -101, 37, 16, 55, 62, -214]
4118b14K79J5j25L6j60k3M30m89M28l6k13O7J5R5l26K11Q0P8l30K23O7k13J91
4141H6j70m3K33J49k03O1k15J07L6K7j52o3J49N3K20r0j24j49J8K38j12l16L84
4164A24J31k92Q5j56J38L47n50L34k27K37j92m5L64l24Q2j04L86n42M95k30l0
4185C1j01J27J03k06o5K84J06k19j34K21k00j47K68M3K9j0%L6r5K5O1k49J58j06
4209d0j32J81J23m4j36K22j30qj34j09K92k60L55L8J24j83l62K48K0k66K55j24
4231g0m5O0J09J26k49K04L5j42k5j46M67j85K24j79k56L8L07k02N6q7L36k73J11
4254B14n7l99L29k50Q3O0q3J39n9k9N4j59J33J48M5p8P6k85p6M86j09j49J54k4
4278A64j89K20O8q4l64J08nM11l29o3K39m01J08J41j03J95j15j89K00L8k51K61
$$ y = [-214, 65, 80, -45, -9, -169, -192, 238, -251, 177, 141, -72, -5, 10, 105, -221, -10, 70, 148, -182, 41, 108, -105, 86, -84, -127, 106, 255, 52, 113, -102, 5, 41, 68, -84, -147, 2, 55, 275, 185, 61, -88, -70, 168, 56, -260, 124, 255, -37, 48, -108, 30, 377, -173, 161, -66, 171, -21, -66, 298, -26, 56, -48, 338, -204, 291, 61, 31, -70, 57, 160, -46, -111, 173, 279, 60, -74, 147, -53, -200, 68, 111, 140, 130, 130, 166, 71, 96, 157, -92, 66, -40, -172, 9, 132, 88, -48, 174, 44, 36, -98, -207, 85, -175, 180, 218, 342, 159, -203, 45, 65, -201, 54, -70, -115, -55, 54, 180, -69, 135, 170, 28, 3, -143, 324, 139, 363, 184, -72, -34, 273, 71, 127, 40, 376, 103, 214, 157, -242, 87, -163, -80, -20, -103, 36, -23, -52, 2, -157, -24, 124, 169, 91, 167, -118, -194, 292, 183, 34, 188, 164, -25, 195, 263, 179, -185, -77, -82, 329, 0, -63, 176, -225, -117, 24, -79, 116, 1, -188, 12, 50, -201, 60]
4300F0j65L02N3m53k06M01k8J36q8r3j50L14J30k28L79m21N7J75j9j89K8m6l8
4323h9k9L14j22r0L7k83N62l61K40m05N73o03L53j15j12K09j19j09ppK8K66j24
4346GK80k72K60l55k12k1L70k93K58J5N2O2n7o6j44L58k34j93K07J66j31k28%
4369a71O5M41k55Q2l89K99rm8j8k27K99Q6l15J27j01M3J52Q7l28K94k03J66j51
4392g4o5Q3J06j9J63k03j8r6K12r4k16K13kK66k18r0K63j87p9j04j92K59R8L8
4416D4J44k33m0J02K81l96K01j83M2J77m72N08n6q6Ql26N13o04P0N26j88J29l77
4439b16L51k39K62j23n5M9q0L81n37K08L9K81k11j63o3K21j78j46K80k74J14J37
4461C8j84K43j6j50j29J56M5j3j13L50l14J78J67k58j84R8o8L31m47M93j78l0
$$ y = [60, -105, 197, 250, -203, -409, -8, -36, 100, 12, -81, -231, 83, 213, -15, 364, -57, 0, 175, 156, -33, -5, -51, -89, -118, 196, 74, -16, 21, -262, 300, -61, 179, -226, 347, -256, 97, -18, -130, 79, -40, -149, -156, -163, -135, 131, 7, 287, 15, 275, -80, -292, -313, 57, -236, 22, 37, 89, 151, 94, 28, -116, 242, 8, -185, 22, 188, 57, -171, -171, -106, 335, 80, 162, -227, 72, 63, 15, -3, -230, 69, 155, -160, -33, -134, -91, 61, 148, -180, 114, -89, 77, -74, -139, -56, 50, 31, 194, -9, -27, -123, 89, -5, -221, -8, -10, 256, 38, -52, 211, 24, -55, -159, -351, -92, 6, 44, 188, -45, -85, 17, 298, -98, 103, -80, -38, 139, -333, 175, 119, 33, 41, -285, 228, -376, -306, 220, 32, 161, -216, 135, -104, 158, 35, -20, 29, -51, 330, -207, 1, 40, 321, 110, -53, -116, 105, -73, -219, 61, -213, -99, 38, -146, 97, 81, -69, -198, -42, 3, -10, -123, 227, -87, 91, 258, 0, -184, -86, -154, 177, -270, 223, 45, 15]
4483A5K5j24L71l08m6k26L78J7l36K19j89L25j41K07L14m53P9j9j59K37j97NK87
4506B81m86K11N3k03q3J87K17n27L59k73M25j14k5N1l32K81l2p9kK96k07K00k75
4529g7M0K0O0O0k25M5J56k08J82Rk22J82%j13J88l60N24j34k7j6j72K27k09J35
4553F5k91L92k14j07j38MJ79l1J54J22p7j17l5O5J84j67j81P0O3M0J07j36J58
4576A09k18K5K35J43k28j73J46n8J08m08O2K70m4K6j3J4K3R8j59J52q8k06l3p
4600b24L99j01K35j82j35L0r5J38K48l39j55J7Q0K13l13K71k7k4K21k39jm8N5
4623B4k09J98Q2J6k05K14k23j68L17q3M3m6J96m63K06L0Q3n1l6K55l93J55o4J03
4647a9l0K27j61M3J27j48k15j75J10L74l38L96n1j47J96Pl83J33K55m8j26R5n5
$$ y = [15, 40, -84, 287, -21, -67, -293, 85, 102, -234, -15, -204, 121, -20, 187, 501, 48, 127, 108, -51, 186, -11, -6, 281, -205, 6, 59, -144, -227, -40, 177, -350, 9, -264, 161, 47, 22, 73, -259, 22, -10, -89, -91, 205, -2, 198, -77, -37, -17, 43, 103, -122, -77, 79, -129, 53, 62, -160, 22, 22, -91, 97, -263, 261, 127, 100, 84, -88, 139, -70, 65, -226, 166, -48, -155, -293, -289, -110, -141, 13, 135, 58, -59, -94, -29, 155, -12, -193, -123, -60, -20, 87, -49, 109, -109, -84, 151, 294, 66, -107, 39, -19, 89, -319, -257, 13, -31, -5, -18, -4, 19, 117, -42, 110, 22, -184, -217, -224, 175, 74, 309, 127, -8, 22, -73, 65, 313, -26, -181, -164, -84, 129, -184, 87, 60, 36, 257, 18, 17, -31, 24, -185, 13, 95, 111, -94, 120, -103, -271, 46, -37, 6, -40, 156, -307, -101, -71, 12, -39, -75, 180, -213, -58, -122, -19, -49, 178, 17, 60, 187, 39, -176, -351, -241, 133, -205, 191, 140, -7, 189, 196, -187, -54, 201, 153, 27, 122, 67]
4670F7k42J51p6P4k7J72q2j68K67j70Q4J16l59R4K09k61L88k45K07k86J50k3K63
4693C03j48J13m08O2J00j60Jj00M19p0k4p2L4jk4L8J0q7J11R2j83j21mR9j40K05
4719D5O3l88J94nJ10J75K2m32K44j03o4J93Pnml38L14q9p4J5L66k02m2j60P9R5
4745A6J49l04K79j53j56J08nM5J45j55J75j98j50j2J21K45j63m5M3p6M8P4q2p4
4769a25o3q1L2J65l5PK25j80J44j48k1Qj0rJ9%J40J69m29K08q4K58l05L9j71N1
4795a96K89N2j92j7O1K45j69k18K69Q0k27N8m1J61j24Q1o7L3l9j83L10l55M20
4818B31l39R8Nk0J12k58L17j48m3J14l8p9J15j26J01j43M05k31k21K23k28l1K32
4841D8j18O7k13m7K12P0k53K02J22j58K90k07j06m1J37m9J80N1k62J73K9J37k11
$$ y = [67, -175, -24, -100, -26, -53, 119, 37, -131, 136, -34, 50, 166, -193, -99, 110, -151, 237, -8, 199, -87, 63, 40, 303, 155, 268, -140, -78, 22, -138, -137, -237, 182, 112, 88, 16, 50, 49, 25, 63, 73, -14, 97, 189, 6, -115, -119, -20, -160, 45, 108, -280, -86, -91, 19, 194, 216, -216, 28, -75, -139, 54, 61, 56, 52, -286, 28, -61, -135, -120, 246, 44, 2, -158, -79, 16, 165, -139, 140, -13, -169, -61, -66, -21, 124, -31, 144, -54, -204, -216, -95, 150, -13, -58, -15, -91, -43, 31, -51, -125, -188, -269, -237, -72, -107, -100, 125, -55, 89, -59, -80, -72, -82, -91, -72, -72, 68, 237, -192, 16, -68, 190, -115, -76, -247, -196, 93, 145, -47, -64, -3, 242, 73, -145, 124, 204, -23, 35, -6, 155, 31, 112, 45, 78, 39, -144, 166, -189, 231, -108, -10, -5, -25, 87, -171, 146, -2, -45, 69, 31, -48, 67, -59, 42, -101, 304, 73, -148, 75, -153, -184, 48, -70, -3, -216, -263, -51, 19, -234, -32, 90, -68, 222, 15, -91, -132, 5, -44, 136, 187, -75, 98, 127, 264, 53]
4864E3O8j77K9J54j99J9QJj4J54k05K11j01j5mr7J40P1l21K31K18j94j65J35j88
4889a88Q2J43j6J09q7J29k44m8J6J37kj27K8P3J04J23k02p6O9J8j24J60j69N1
4913d1O2M5M9k5k10K61R6l00m5P2K33j52k49K27Pr2j9J39j63L27K9k74k44L55
4937H8J41l81K76J3l16K25j13J86n3p1J48j24J2j40J58l0k64L21j53q9J16j18
4959a68L54j68p4J8J9j37L10j38j14J78K8L9j29J07P0k72R1j1J47q1m4j64K31
4982I2p9n5R6K48l46n2K79l1k9l7p2J98k35O0J61p5R0j79L7Q9R5l62J50q6K19
5007A76J69k28n2j16j37K88j5k41J10j42M03l6k20K1k4n7J9K05j22J58l2N2J43
5030C22q5m22n4M22l53J48N9j06m1r5J42j43K55o1J69l39K82n4p0j81J75K84l86
$$ y = [53, 121, -56, -27, 127, -72, -53, -45, -44, -58, 96, -109, 102, 1, -14, -18, -115, 25, 96, -225, 6, 224, 30, -135, 0, -188, -106, 37, 21, 130, 43, 172, -72, -120, -104, 33, 31, -96, -68, 5, 109, 232, 30, -46, 23, 41, -83, 77, -92, -41, 21, 66, 115, 90, -120, 141, 237, -63, -108, -36, 197, 45, -204, 23, 30, -62, -81, 58, -105, 222, 251, -23, -267, 88, 229, -152, 124, 137, -179, 46, -67, 119, 66, -5, 143, 19, 31, -109, 49, 19, -245, 76, -77, -166, -50, -168, 186, 18, -56, -38, -19, -156, 154, 16, -98, 80, 108, 147, 18, 125, 195, -77, 14, 3, 150, 69, 25, -139, 92, 13, -42, 54, 302, -44, -96, 183, 152, 123, 86, 14, 212, -23, 37, 198, 123, 213, 34, 71, 160, 255, -107, 43, -43, 176, 345, 117, 65, -51, -188, 100, 85, -156, -46, -188, 215, 179, -41, -20, -44, -101, -82, 123, 1, 159, 127, 179, 322, 237, -185, -239, 183, -170, -22, 37, -69, -110, -205, -63, -206, 49, -12, 157, -182, 100, 46, -24, -205, -30, 254, -132]
5053a32J69O5j78j99K09K69K8j14l22K17n8J75j71N9k09N5K72j30J67j45j00k66
5075c39M12k9n5J73r7r9K76k38J49k59J11L3J19N1j20r8K02l14J37r1L37m4l42
5098a25L20M5j14k44K32m1l5m5j96J51J11q1J27M3j23K54m08J47j48K59p8j41
5120i0qL25j49j3j91j36K25o8K3J90Lj02J9N8j71rN9J66p7k69K52J27k41J00r1
5145f8J33Nj59J8O0K89k05m8K10j96J76k76K7J63J17j39j43K03m08J00L5K13q
5168I9j31J22j21j42K04l9q2o9j84K89O6M1M8j31P1N7k69J90M7N8L0j06L5j17
5192c4J8O0k36K41M5j41J32kl4PP1j2n7j84J28j1J05j9P1j69K4j06J3K62po0j50
5219d5j31L91k10r1j4J26k0j02N1j13k55L38K02m1K30j22l57J99ppJ80j37o8k1
$$ y = [-132, 37, 102, -76, -275, -66, 203, 231, 117, -205, 12, -46, 129, -42, 17, -192, -137, 135, 5, 172, 27, -73, -339, 73, 44, -11, 162, 65, -34, 242, 4, 153, -106, 5, 38, 157, 208, 88, -10, 192, -122, 15, -76, 261, 217, -125, 195, 240, 126, -118, 114, 73, 38, -7, -203, -52, 59, -22, 105, 148, 25, 279, -129, 18, -130, 129, 51, -90, -98, 227, 78, 65, -126, -262, -37, -105, -82, 108, 111, 9, 28, 86, -85, -94, -35, 131, 54, -215, 37, 164, -77, 23, -68, 65, 70, -89, -71, -11, 278, 73, 25, 235, 39, 215, -61, -34, 129, 246, 107, -36, 167, -241, -141, -106, 107, 99, -32, 90, -31, -173, 31, -8, -90, -159, -343, -54, 12, 53, 101, -30, 41, 98, -171, 19, 66, 124, 154, 48, 83, -34, -16, 44, -192, 49, 94, -47, 85, 83, 49, 56, 127, 115, 58, -126, 2, -9, 96, 77, 148, -21, 3, -103, -90, 172, 165, 105, -45, -176, 215, 5, -86, -100, 26, 6, -96, -45, -158, -413, -75, 127, 86, 316, 194, -163, 36, 29, 22, 202, 65, -3, -24]
5243b4L3j33J05l6K66l01J65j1Lj9r7O4L1K0m3o4J34q4L0K12k74j24J99j52l6
5268a36N3L48j31M8k69J99k2j57r0K60k42K55j24j76J85k01K46o2M1k9q8J36l54
5291c10M28j34p6J94q9J36j37P0q9J05j68jJ29r2J03j28n6J92J36k27j3L94l68
5314aJ72j54r5ML56n30M93k36j5L7j2q8L3j28K93l62K87l3j68K79j74m5L9J77
5338A29l2jj18L35j56j81J10M2j43j43J91j99K70j89N9K61k63R4j84J50l7m1p7
5361a23J20N0J06j32J17j33K21j49nj35J61j8j16K6j61M41k64M0l66N07l67L52
5383A72k58K92m2k91R7K06l66Q2J35j18p9j24J22M30j30k06M6O5j6L7O6p9J10
5406A51J5j27m7J43l38J87K91k54j93J27J78j23J82j00J3Q2j93O6k88K99pj51
$$ y = [-24, 9, -124, -19, -55, 211, -90, 75, 64, 67, 48, -49, 15, 46, 66, 23, -41, 93, 9, 39, 251, -23, -147, 52, -100, -136, -83, 265, 134, 182, -87, 112, 90, -67, -157, 103, -139, 116, -8, -184, 1, -200, 46, -16, 25, -4, -92, 44, -310, 118, -16, -92, 102, 13, 149, 12, 82, -7, 98, -70, -71, 58, -34, 69, -59, -115, 77, 213, -14, -27, 367, -1, 171, 17, -78, -74, 282, -248, 245, 9, -6, 31, 19, -69, -36, -164, 129, -233, 54, 21, -147, 132, -42, -87, -48, 129, 97, 96, -22, 313, 157, -24, 86, 128, -15, -158, 33, -166, 104, -85, -26, 235, -28, 66, -118, 32, -5, -46, -123, -3, 47, 153, 21, 138, 5, 226, 77, 72, -63, 98, 80, -36, -10, -171, 270, 6, 46, -320, 187, -180, 172, -86, 206, 164, -127, -30, 176, -190, -108, 27, -91, -170, -294, -172, 258, 128, -78, -32, 33, 17, 54, 120, 41, 151, 166, 39, -8, 135, -203, -16, 275, 21, -172, -45, 133, 10, 192, 92, 105, 187, -6, 60, -228, 71, 64, -87]
5428h7R1K74k62J11m5q7j20K73j12j17L91m44J78m8l8j76J70j30J07J29Olr9j82
5452b20R3J1J07nj8q4J28M1J36r8O2p2LP5j34K98m87J59j57K09k0j57K07k89J93
5477a9K51j04J00j96P6J07l77R1K29m06R1J70O9L2k32J67m32K85K85j10k00K82
5499A59l00K31j69J87j93j46J7K60o5OK77l87J7J82j2j01m9m3J93j85J87J76l76
5522a34J65P2q4j47j31j17M48l11J66J19j94R4J%K2Q5M7j16J73k4j24J45o1N9
5546A53K0K9n6j88J53l6q0k33J66q2J04K40j19j07j91K07L8L3j27j84M43k05K57
5569B35R1k63n1K8J74k79J92PM3N2q2l62L52j68j32K55k54J47K3p7J17N5k79J30
5593d6J55k10P5M5j08J93J4j75m2L00m59J76J26j07nj49J83M4j59J7J32rJ09k6
$$ y = [-87, 4, 278, 16, 127, 82, -5, -125, 148, 36, -81, 310, -134, 44, -4, -42, -218, -48, -178, -71, 58, 64, 61, -38, -220, -127, -116, -9, -14, -32, -116, 12, 53, 189, 91, 153, 81, 84, 159, 25, 323, -164, -5, -162, 47, 27, -130, 77, -212, -19, 232, 128, 228, 32, 108, 215, -162, -71, 158, -248, -157, 13, 82, 114, -118, 49, -383, -98, 187, 77, -123, 159, -141, 90, -79, 108, -85, -231, -214, 46, -19, -13, 264, -123, -106, 76, 64, -37, -86, -129, 64, -121, 66, 242, -134, 31, 103, 19, -128, -259, -376, 72, -239, -73, 46, -148, -54, -53, -53, -31, 54, 101, -15, 158, 134, 10, 155, 94, 153, 173, 202, 146, -42, 111, 75, -5, -238, -72, -154, -50, 190, 71, -36, -227, -20, 18, 51, -76, -260, 183, -22, 235, 326, 63, 12, 40, 214, -65, 127, 134, 177, 229, 147, -215, 137, -31, -163, 92, -162, -15, 8, -69, 48, 103, -176, -46, 109, -101, -26, 19, -89, 104, 118, -57, -99, 201, -258, -82, 44, -63, -68, -217, -34, 10, -149, -132, 0, -9, 100, 74]
5617G4k04K55k2O0j30k33k6R0L74k11qJ06k01R6k05L52j99j8J76j42j14J28j58
5640a60J65O2J93p3j5k47J88k74J74L7j86J50j63K19l99L78P5n6N6j48j74K7M42
5663B71k68L4M8n5k6p5L0R0j71M4l8O4Oo7L2J72j14R6oj58J20J47k26J03o5m1
5689e3P7K3j15J04k37R9L92k88K14r8r3L4m32L57q5j55M9K40p4j40L20k89L4K73
5713A57m93J29L56j99q2K00P%j82J4L8J1J03l8K1O7k05J40j21K86k90o7r7K09
5737c6K25k16M6j12k34K81k9M4p7K75k03J14kj20RK6R9j02p7L1J06J29j52k34
5761b09M26k88j34J14R9j40L4K91k82j20P2j25M39l06J32m3J25j41k06K24j55
5782a93L78k06j84J00P3J77k34RQ8m68K43K43l0k09K03M8o0L58k60r6j39J05o6
$$ y = [74, -130, 125, 103, 163, 33, -200, -226, -136, 238, 27, 19, 125, -76, 20, -185, 167, -32, -50, 126, -16, -130, -2, -160, 5, 67, 260, 187, 172, -75, 113, -161, 13, 50, -136, 14, -149, 70, -329, 49, 124, 68, 124, -24, -198, -171, 271, 3, 37, 85, 30, 4, -71, -41, 49, -122, -78, -116, -52, -46, -113, -81, 91, -23, 73, 67, -91, 29, 176, -50, 53, -12, -53, 24, 47, -68, 36, -201, -102, 290, 2, 216, 118, 25, 59, -373, -16, -101, -256, -207, 33, -41, -181, 139, -150, -116, 157, -336, -207, 149, -50, -132, 68, 75, 75, -107, -93, -55, -44, 59, 21, 42, 109, -96, 44, -77, 209, -81, -148, -245, -36, 189, -27, 19, -93, -327, -46, -75, -31, -108, 167, -36, 78, 76, -44, -35, -9, 90, -12, -89, -58, 48, 177, 25, -209, 217, -71, -205, -91, 8, -132, -98, 193, -89, -209, -137, -262, 177, -129, 3, -40, 85, -56, -262, -38, -193, 185, -21, -205, -105, -32, 145, -89, -80, 8, -460, -217, 26, -4, -213, -10, 38, -22, 336, 76, -20, -159, -54, -120]
5805a20J75j22N1p8J38K44k02j35N1p2J73k49j72K95j1O7N1j46J68J6k66L35k03
5828a2l4p1K64j20j03L56l05M3o6J7K87j94j03k5m3J13j83O9K24Mp6K27l02N2
5852A9k8L17l60J8o7J40rj30L16j59M4n4J1o0K53J19k76k00K19R5l34J09j34P
5876a44J25LJ01l6J5O4j30J54j69k2k55J08Mj4K19O6M5k28k14M21m0k1Rj0k06
5901a55J1J8j8K42l42L21j64j42L71ml58P3M2J33k14L54j93j8r1O5M3k39K54P6
5925F5rl94L24q6K41l02J75j91L01j17k32j16L96J39l8j99j29Q8K52k92K19q7
5947HPJ77j27j46J82J4k02L85m3q4k97j8K19l8j46K00qj8j07j0L45n40m2Q1K19
5972A1m21M92J25l10J13K1p3J07oLM0o8j56mK50k71M19o02M17n2j37m1K44j00
$$ y = [-120, 55, -67, -16, -94, 44, 288, 86, -49, 2, -70, 103, -146, -318, -23, -34, 33, 84, -62, 106, 122, -144, 191, -12, -46, -117, 147, 27, -76, 280, -25, 18, -48, -31, 256, 62, -41, -66, -109, 4, -179, -110, 114, 118, 42, 269, -33, 19, -9, 308, -52, -34, -101, 39, 30, -100, 216, 57, 101, 47, 58, -2, 251, 370, 94, -106, 113, 208, -126, -17, -151, -144, -19, -16, 85, 49, 64, 128, -2, 152, -17, -39, -294, -186, -182, -196, 23, 89, 134, -94, -308, 113, 73, 52, 61, 51, -155, -144, -126, -144, 98, -244, 77, -87, -229, 142, 138, -220, -147, -105, 28, -186, 168, -25, -43, -134, -69, -26, -265, -11, 65, 56, -338, -14, -100, 141, -161, 14, -177, 124, 7, -225, -341, 55, 194, 156, -43, -172, -84, 168, -124, 95, 8, 15, 192, 65, -81, 101, 115, -87, 298, 255, 171, -126, -144, 75, 37, -109, 91, 83, 65, -42, -52, 293, -247, -289, -208, 11, -410, 82, 207, -103, 10, 31, -42, 65, 59, 62, 102, 34, -122, -126, 124, -147, 272, -330, 87, 35, -102, -143, 101, 1]
5996AJ12o1r3J49r8k10N7J71p0J47p5k32L97k28J07l47N60k37OJ8m4l3r9j8R0
6021c0Q6k31N7L08j4j27Q8j26p5no7O5J8M8J2m71N19N8p1r0Q2j27L1L0L4L51l14
6048C9j59L21q4k11J46j57L53m16O0o1j01K74rM9j16J88j82J1l4O0MN9o6K6l9
6073d5jJ08r6Q4L7j77K2p2K53nr8j47o4L89q0k2P2k86K37j75J47l4k03L10o1r1
6099BO0r3j04K85k63O6Q1j49Nj86K85K25j59p1K27l37Kj2J76Kj74Oj07J43M04
6124C14j49p8l06K69O7k66K95Q2l49J69j10K53j10L0k7K7o6j92J05j8K46j45K26
6147B67j46l55nL88o0J19k78K07k01j06l5K53j09J37j66M47m97On6N3J65J4j20
6170g8K0R9k06K41m9J50P3r8l73K05J63j82L6Q4J04r3l20K19N5l6K97k17j50J88
$$ y = [1, 113, 52, -41, 108, 10, -200, -143, 28, -42, 105, 30, -202, 195, -33, 74, -273, 287, 50, 56, 74, 30, -3, -102, -120, -30, 56, -175, -118, 190, 176, 49, 137, 11, -64, -69, -136, -71, -53, -5, 7, -464, 55, 113, 42, -48, 34, -93, -62, -32, 2, 353, 39, -120, 201, 117, -94, 52, -105, 248, -168, -108, -169, -270, 4, -5, 44, -72, 116, -66, -55, -89, -29, -25, 34, -32, -6, -45, -46, 62, -34, 50, 87, -90, -68, -140, 113, 108, 10, -137, -201, 188, 108, 86, 158, -128, 109, -66, 81, 47, -156, 154, 93, 2, 62, -31, -135, 150, -113, -47, 34, -115, -110, -296, -11, 214, 55, -16, 211, -126, -124, -136, 40, 42, -132, -126, -233, -90, 314, 165, 87, -219, 50, 117, -149, 146, 228, -121, 48, -62, 191, 81, 111, 84, 111, 45, -147, -42, -60, 186, 41, 267, 121, -234, -239, 149, 89, 208, -70, 137, -64, -170, -205, 48, -61, 76, -90, 357, -140, -134, -190, -137, 28, 42, -78, -58, 41, -165, 76, 27, 177, 250, 152, -221, -16, 147, -35, 1, 85, 189, 96, -224, -5, 50, 14, 311, 94, -56, 132]
6194A32j81k86K94N2lO3Q9k29JK5MQ9j59K31N4k17J03J38j54%J16k00J90j42K9
6219C9j15k0j8O8J01n2k54L84nj17j04J54n2m6K21r2k00M0o5mK13K3j46N1o0j77
6245b33K91k90L34j60L2O1r5K71m14L20k82L09p4J26j80rk69J00J62O9j02O0k69
6268b42K18j25J60p3q1K23k69L65q5J84m72L30rJ7k44k9K87l78K55Q3j30j14K35
6291A06Q3k38R6J5j88j8K40j17J34l80M1J30J38q9J51k78N46k88l7p1J62j82p7
6314a21K08R6Qj13J04k02J00q1k8jK8l11N14j37k44L8J61O9k98K41nL6n1l6J22
6339I7J9P3q6Q7m6Nm16N93l34j4k51K65K7J51k87J5M35n63N32k84K45k89k12M3
6363a95M1M36k94J14k17j35K84j19L68k96k3J33J8J07j71j71J86o4o7J69P0j18
$$ y = [132, -49, -335, -41, 11, 8, 71, 160, -69, -68, -43, -39, 50, -109, 122, 176, -41, 62, 200, 46, 46, 162, -38, 152, 10, 39, -76, -96, -114, -46, 55, 3, -251, 133, 128, 11, -93, 61, 9, -37, 184, 92, -108, -68, -133, -137, 76, 99, -47, 4, -56, -233, 58, -232, 102, -58, -26, 35, -60, 211, -203, 117, -165, 144, 70, 196, 16, 7, -262, -162, 0, 69, -33, 27, -242, -24, -149, 11, -62, -143, 80, -189, 176, 91, 275, -197, 133, 124, 141, -103, -132, 155, -223, 32, 115, -15, -129, 106, 189, -49, 47, 62, -126, -144, 96, -21, 113, -267, -226, -96, 42, -47, 104, -174, 372, 84, 47, -24, 138, -44, -121, 87, 183, 191, 78, 182, -20, 80, -1, -29, -30, -2, -313, 201, 64, -180, -142, 19, 88, -210, 31, 26, 62, 11, -25, 97, 116, 189, 103, 190, 144, 149, -267, 326, -8, -22, -273, -8, 19, 170, -117, -102, 333, -230, 302, 18, 263, -26, -238, -195, -154, 282, -12, 102, -115, -250, 34, -85, 283, -13, -36, 97, 115, 222, 51, -120, 66, 2, -65, 104, 174, 56]
6385E6j27K53l86l2K29J85k79l9J45Lj2N6m07J87K60M2j37L61l02j17N9J75l31
6408a58J04K51k81k6j22O26m88J43K9p6J29l64K32J75q6O3k39J53LP6j81r9j2
6431a48N13k31j54M5l28N80j21l15K95n8j10o5N9j87p7J90K34j83J87j42j10n5
6453a81j08M33j9k05j67J09Q5J18k98J97k58L62k2r7l6K17k05J12J24j11L8j40
6475e2O5K46k5j80k32J38K47o2k32n3K84j53j40J72k6M0j3M0j36j59K32Lk25J66
6499e5J37o6j64n2K02k29L87k73n7K4n3k7J28n9R8Q7k34J7J89j79L34K7n56J45
6523b29L07j05QL31m35N7L43k72J8r3N5l23M12p8n5q4J43j9o3J44k3K11m14L07
6547A43n0m3q7J20K10l33L25l56J50j41j48J57J47j95r7L47q1j22l3J4K33k45
$$ y = [56, -71, 182, -204, -236, -7, 178, -101, -140, 5, 8, -4, 52, -355, -168, 92, 134, -3, 358, 56, -61, -2, 173, -158, -54, 197, -84, -110, -232, 394, -94, 49, 78, 2, 131, -233, -1, 174, 88, 151, -88, 65, 68, 144, -37, -136, -148, 365, 134, -20, 25, -303, 277, 156, -159, 136, 78, -32, -97, -38, -225, -302, -112, 122, -61, 126, -16, -126, -181, -289, 144, 125, -80, -247, -138, -53, 65, -233, -36, -294, 68, 46, -51, -87, 130, -75, 37, 161, 50, 88, -52, 13, 259, 234, 54, -178, -40, 207, 145, -87, -140, 144, -9, -149, 23, -3, 37, 24, 64, -72, -231, 1, 4, -221, -55, 82, 16, -148, -200, 2, -227, 160, -113, -170, -146, -199, -226, -98, -157, -59, 28, -206, -189, 0, -179, 155, 182, -374, -229, 78, -27, -19, 312, -123, -66, 277, 5, 23, -70, -15, -338, 74, -4, -59, -143, 0, -19, -82, 62, 39, 250, -164, 143, 93, 50, -37, 83, 293, -40, 285, -71, 79, -62, -210, -53, 94, -101, -198, 149, 68, -54, -87, -73, 160, -85]
6569h5J05j32L2J08R0K5k16j21K34j92J27k6R5o4Pj64J27k58J31L62l48P5J71
6592H3k07M1O5p5J29j5RnN7q7j3j73k9J34j3n6K09j81J63J64j16NJ36j28L0j99
6618g2J49k64J83J83k65J82k23J67j74Q5O8P2k57J90r4q5J26J10p2m9p8r6J82
6641c2J25l41K93O6j33nn7N4J04q2K60l47Q5k75K95L44p3l87K35j53j82L13k13
6664a06J40j72K59N4l44J92p9j11J65J31k10J13J25p0j43J38J20l70J13J36j2
6685F9rn0l0l9j78N36k50j45J14J28k35j21O52l30j92J39k2j23o1J10J69k20J42
6708E4j26L8K69j75m3j71J29J66N1l24J52J43l06J76J35k03p6n0O1J65O6j02j42
6731a13j3L51j31l09J21L1K2K8J1j00j09O5K44j41J3LJ9Mk15K52p2M07m29K20
$$ y = [-85, 20, -112, -80, 28, 118, 143, -73, -194, 40, -152, -25, -51, 44, -20, -13, -177, -50, -308, -177, 185, -163, -88, 83, -124, -83, -18, -93, 36, 21, 30, 25, 82, -5, -18, -191, -220, -86, -99, -155, 54, -127, 36, 200, 84, 89, 225, 97, 127, -72, 77, -187, -4, 179, -86, 96, -127, 40, -134, -49, 19, 91, -166, 24, -70, -155, -29, 81, 9, -40, -118, -214, -32, 93, -248, 45, 111, -22, -27, -84, -30, 74, -8, 252, -95, -10, -285, 10, 354, 281, -106, 129, -24, -206, 107, -106, 34, -138, 121, 175, -169, 23, -56, -167, -2, 129, -81, 32, 157, 87, -56, 82, 202, -168, -55, 81, 69, 60, 10, -20, -59, -237, 299, 49, -96, 18, 146, -89, -210, 442, 112, -80, 59, 37, -86, -147, -37, 132, -88, 54, -72, -34, 235, 60, 17, -154, -25, 141, 192, -132, 20, 163, -143, 33, 168, -35, -111, -161, -100, 65, 131, 29, -113, -126, 225, 94, -215, -94, -63, -41, -13, -2, -102, -211, -146, 98, -43, -30, -27, -8, -4, -219, 33, -39, 368, -61, 159]
6755A59L5k38J06j86L2J91P7k92l5J35K2pP0L3j04k0K95m03Q5J25p3Q0r0o6l8
6780a07rK52k44O8P9Q8k03j57Q1K54k75K66j81L17j64N6q9j06Q7J34l72J71J69
6803A15K04j06j94k35J65l9M3J03P0j30j25M27l03R1k5k61L25K3k08M9qp3M9J49
6827A06k3j98j14K34Rn7L3l5j13J64J7J7k49K25K6P1J17k73q4J52J5k66J89Q9
6851E2K7m3k4k55M04j98J55q9j27Q2J32N1l39J45j81J53o9J01J74k31J20K67k52
6874E5r3o7j35J64j99K77R0M0l28L32n0k04R2k30J90J13NN3j65J93k13j57L30
6897I3l80J78R6m9K08k95K91k43m5L6K53j41J00JK5r9j94ML82n3j27l43J68P9
6921e5k38M39r7m3J6O1K6n7j47pL23l39O5rK06k54J42J74N1q0k55J53j41J85m1
$$ y = [159, 194, -44, 62, -124, -92, 99, 176, -116, -151, -16, 6, -1, 69, 102, -2, -22, 273, -130, -45, 80, 7, 87, -3, -69, -107, -116, 136, -108, -40, 39, 127, -76, -233, -152, 102, -173, 93, -88, 229, 65, 121, 32, -74, 13, 147, -225, -54, 115, 319, 213, 19, -216, -51, -90, -47, 56, 126, -4, -129, 298, -5, 86, 61, -200, 125, 148, -60, -11, -19, -92, -43, 106, 83, -115, -229, 5, 14, -43, -10, -45, -158, 6, 23, 40, -209, 16, 42, 113, 230, -43, -127, 25, 40, -226, -37, 52, 79, 36, 12, -243, 161, -37, 118, 29, -98, -16, 116, 167, -172, -27, -208, -55, -124, -23, 151, -80, 40, 307, 55, -38, -105, -240, -76, -275, 2, 92, 132, -196, 136, 86, -118, -26, -256, -66, 47, 52, 105, -60, 133, -80, -237, 93, -287, -109, -13, -62, 146, -149, 142, -101, -146, -110, 143, 2, 102, 103, 128, 29, -165, -161, 221, 168, 41, -302, -134, -55, -293, 146, 49, 6, 22, 83, 109, 52, -95, -102, 221, -118, -53, -62, 144, -110, 32, 206, 257, 177, -78, 75, -66, 119, 78]
6946G8k72J92k29K71j96M62l61R4j90K59J36n50J66K40o5rj66J49r6K18o9K1n4
6969B9k1J03r1p6J72k8Rj84m1L6o3J90j49K76j27N8Jj88L0K75j75j04K49j68j61
6994a48K43l75M48k13L08k69K66m96OK88k06Q1N7n8J32Q9k07M7k10K44QN9j29
7017c5rj1o0J23k22L23j78M0n2k8K04n5q0M4R1l36K45j48M8K4J79j19P8q8J04
7042H2q6o2l0J18l9K91j44k62J09Pr3K08l2j71J63j06j32K28k66K79j03q5J17
7065iR1j41L5K33j29l5Lj46m1J99M0p5r6O5j34J10j00J39l8mn0L1r7j96N75k04
7091B6j32J11J75m22L83j47J30j41j37Jk2K11j01L6o0K05k64O3J37j96J38n6J13
7114E1L7k22J59%K63l60K57k06L0Pj39K50Nl07K74j33J20K8q8O2O6l6k29J54J80
$$ y = [78, -194, -2, -231, 40, -156, 306, -55, 39, -151, 108, 244, -306, -140, 100, 35, 26, -140, 9, -87, 131, 62, 83, 29, 8, 111, 20, -56, 116, 88, 97, -87, -128, -92, -155, 35, -114, 162, 35, 93, 94, -94, -64, 211, 36, -68, 181, 13, -148, 95, -280, 168, -45, 263, -6, 260, -236, -230, 58, -148, -67, -10, -68, 64, 153, -54, -7, -217, 27, 35, 94, -35, -44, -55, -115, 8, -214, 109, -69, -29, -81, -109, 95, 40, -40, 4, 95, -241, 4, -144, -96, -72, 107, -12, 66, -22, 82, -4, -66, -96, 22, -17, 274, 130, -132, -23, -16, -109, 99, 67, -104, 59, -47, -179, 49, -217, 62, -41, -126, -9, 82, -59, -24, 209, 80, 45, 48, -98, -139, 60, 100, 25, -71, -6, -140, -30, -130, 9, -29, -33, -83, -52, -149, -345, 230, 26, -106, 5, 180, -242, 141, -6, 124, -17, -154, -153, -175, 36, -65, -29, -89, 116, -148, -85, 52, -144, -6, -62, 51, 88, -134, 25, 25, 288, -72, 185, -21, 9, 16, -123, 127, 132, -175, 99, -34, 86, 114, 26, 88, 154, 118, -111, 43, 223]
7139B23k87p8j02K16J79m08l5K66P4q1P0k5L8kK7j58J44j94P3L33j64lq7N5j30
7164e6N2J04m9l61J94j4K58j46j18K05j40J09J82k39k8J9k47J01K77Ok43k4j59
7187c17K65L7o8K11m0k02K68j39J46k39j23j65K54LK06o0j61k42K94j88M70k79
7209f9K44J4j34r3K09l99K76n8j98L84o2q8k6K33j91J06l04K93m25J87J09L3K26
7232B67j88o6J3J50l18o4K36Ok22J93J7j02j00Q6K12l22L66k10J15j25kn2K04
7255I4o4j07J55j75J31M4j51L21l39m37K28R4j1L26j0kp8n3J81j87K79l64K51
7278A26j79K54k87J41q6m1j4o7L56j29J45m48M70m57l2K94k16K15p2j86J85Q9
7300F1k47L94j22p6o3J71j46K1J76k99L83k87k06K20pM9J28J64k72k59R4J95k77
$$ y = [223, -64, -142, -244, -28, 151, -257, -292, -26, 48, -33, 37, 12, 50, 48, 75, -83, 61, -133, -60, 273, 109, 106, 19, 74, -56, -4, 100, 51, -310, -116, -130, 128, -18, -136, 69, -71, 38, 220, -19, -47, -28, -275, -174, 103, 109, -134, -158, -317, -52, -15, -83, 128, 88, -114, 154, 15, 161, -78, -201, -366, -112, -109, 97, 37, -124, -366, -72, -260, 210, -69, 175, 189, 55, -38, 171, -228, 48, -10, -208, 176, 114, 26, 0, 233, 42, 148, -156, 137, -288, -101, 8, 41, 267, 79, 13, 26, 176, -142, -206, 30, 36, -186, 7, 24, -78, -178, -92, 120, -202, 164, -46, 69, -56, -58, -110, 94, 30, -77, 78, -97, 34, 78, -73, 248, -91, -528, -300, -206, -217, 109, 99, 97, 19, -34, 147, -40, 239, -125, 126, -53, 201, -86, 55, -31, -72, -86, -153, 203, 74, 219, -229, 241, -216, -248, 46, -170, 45, -27, -213, -28, 61, -186, 208, 86, 10, -53, 118, -28, -7, 169, -130, 253, -34, -240, -20, -27, 22, 150, 314, 42, -217, -123, 72, -205]
7323b05R0q1Q3QJ05o1j10K25j12K4j09L39ol35n2K20o8k18L94k05K3N9O5J12k37
7348e2K46r5J7o6J0k79J7K29Q4l13K34K23l22l9q6J53R4P4j85l5K2k7k85N03l56
7373b34J65kL9J68m44K49J87k88J02j05K59K16k47J22n9n6j73K3Q5J60Q4k59j64
7396a72L55k18j9n9J7K55j78L24l87n6L05j48L0L6j80M06k56J28r3k34L61j00
7418A17J73Nj17l40L78j34k47M9M5M0j90J92r0k0J44p6K81l09N2K55r2k14Q5L
7442a0k68J92L03l94L97j47j76J43K29j66m6mL8J17j33K51j96l30L88q3j33j85
7464b13J47l3p5J31J2j03o0K7L44n22M94j25L36l88k0n8m1K86p9j62K3J62m00
7487c17K35P6j47K14J0j22O8J00J4j91n0K9L21k92m7L7p0Q7m0J39k35L83l79R7
$$ y = [-205, -115, -196, -113, -105, 0, -61, -171, 54, -58, -34, -143, 196, 190, -145, -197, 23, -45, -263, 131, -74, -51, 8, 73, 185, -52, 194, 99, 116, 50, 60, -219, -202, 27, 111, -202, 32, 255, -67, -106, -192, -39, 55, 129, -56, -91, -69, -96, -381, 122, -234, -69, -71, -32, 136, -308, -59, 128, -160, -58, -163, 96, 312, 65, 187, 128, 72, -101, -78, 7, 167, 251, -8, -172, 183, -35, -54, -113, -96, 159, -19, 305, -82, -138, 167, 19, 49, 85, -95, 311, 55, 183, 90, -144, 217, 117, 290, 295, 178, -162, 216, 82, -165, -116, -71, -31, -221, -29, -119, -139, 5, -71, 210, -99, -47, 208, 116, -98, -13, -10, -278, -86, 217, -177, 220, 73, -103, 40, 269, 103, 57, 53, 91, 208, 75, 326, 130, -200, 188, 105, -28, -213, -66, -99, -174, -43, -31, -134, -194, -167, 177, -345, 149, 24, 360, -28, -48, -106, -147, 139, 60, -102, -79, 83, -317, -82, -6, -153, 61, 71, -51, 17, 117, 131, -60, -110, -81, 240, -52, -99, -62, -132, -45, -85, 54, -181, 202, -177, -80]
7511h0j11L07M4k48Q4J35N5j0j29k7M2j48P4K56j42N2P9p5k77J18j31K22j92n1
7535a53L07j80Mj31L9K00k80J42KK24m06L76j70J45P2r7j09p2J41J03p3j90K4
7558h2q6N8J1J82m0JJ4r4j58P8J11O6R3n09L16JL02k22k2j75K1J6K60k43j8J67
7584D8j16P7%lk96L63p1j75J07J82N4p7P4k80m7J91J14J84j62Pk17M03j53j38
7608F9l6l47K35J97o6J3P0o6k07K03k26j51J63L1J92j98K54j4rk54K22J79l96
7631a42R6J12j64J88j46J33j11N2k71K33q2R3p1J33j22j25K56o7j61j73N73k33
7653Aj14L77k1k15J59m35L80j91J58k99L57N0j81k29R6n4j1N7R6j30K4J54p9J67
7677A17j91J28k10L52m5J7j99J86j48j98K76k76K43M8j67J98q5j1j80M72l84L02
$$ y = [-80, -191, 116, 160, -88, -4, 131, 186, 176, 47, 20, 62, -86, -12, 244, 102, 154, 233, 158, -119, -1, -132, 90, -102, -153, 154, -26, -22, -153, -114, 86, -194, -52, -50, 174, -232, 144, -26, 119, 191, 94, -15, -87, 54, 157, 84, -106, -82, -168, -110, -99, 83, 43, 44, 58, -36, -194, -116, -5, 61, 154, -355, -39, -38, 264, 42, 20, -155, -134, -118, 142, -101, -119, 48, -68, 9, 9, 6, -290, 73, 2, -173, -66, 116, 170, 93, 167, -113, -160, 31, 145, 329, 167, 174, -43, 360, 207, 69, 33, -314, -79, 118, 52, 65, 135, 69, -138, 65, -161, -312, -149, -118, 74, -124, 130, 116, 107, -147, 75, 254, -142, -46, 66, -98, 90, -56, 77, -34, 18, -253, -20, -102, -9, -80, 53, -69, -194, 62, -5, -166, -339, 234, 1, -113, 264, 243, 28, 187, -248, 132, -59, 99, -200, 157, 207, 26, -203, -107, -161, -172, -115, -19, -149, -125, 29, -50, 117, -74, 54, -156, 196, 151, 168, -31, 155, 7, -191, 85, -191, 52, 100, -67, 131, 46, 35, -145, 327, -57, 245]
7699B45l25J7m3J6J51k80J66J55jl1j07N1o5J3P2K08j39j96K72j94j42m9M0j09
7723b75L26P2k27Q4j09J82k07K01n1L1m34N58m3P1p5L1l10M7L05l26J59J87k70
7746g3K61k54L3j48mJ72k1o1R5jk8k70K7K98P9K3n8l4J54j4l97K05J68j08J99
7771B43m30K48P2k22k0M5J52Ko0r7N6K53k92M8j16j1M01l61M07j82j44L21k06
7794A07k04K49jm8j91K2J50l43L7k0K80k32L05j79J27k20K32J20k40J21o4Q3k43
7817a52L64k76J11J19k09p7N2L41j02l89J50K08j09m8J03P9j50K18k03l07K39
7838c8M3K55k63k95K19K70l07J49m3j19K37k72k0m8M14k75j46Q0K6l2K07k59M51
7861B34k89%K29j48l41L33o4m2K01j26R2j30J26r0j84L30n7k37J35L7j51P7n8
$$ y = [245, -80, -63, -106, -90, 61, -219, -53, 102, 101, 70, -37, 14, -51, -38, 34, 242, 103, -93, 179, -15, -157, -206, -166, -275, 51, 123, -104, -20, -129, 53, -154, 47, -4, 27, -407, 151, 108, 179, 104, 135, -175, -128, 177, -149, 10, 197, -73, 188, -66, -33, -181, -185, -13, -34, -95, 0, -1, -29, -299, -272, 26, 105, 128, 70, 36, 190, 176, -221, -16, 152, 44, 243, -187, 61, 133, -89, -109, -64, 88, 90, 30, -67, -11, 242, -50, -2, -118, -129, 272, -89, 318, 136, -8, 313, 107, -97, 152, 151, 103, -88, -66, 84, -259, -222, -242, 38, -194, 111, -68, 59, -161, 71, 191, -49, 72, 8, 91, -152, 212, -64, 47, 166, -43, -120, -68, 273, 171, -218, -68, 140, 31, -17, 86, 165, 15, 233, 30, -277, -38, 5, 260, -3, -298, -79, 191, -116, 33, -10, -129, 108, -164, -184, -232, 182, -93, -239, -159, -133, -165, 42, -217, 234, -55, -55, 174, 26, -315, 18, -46, -88, 113, -13, 79, -51, 75, -15, -199, 131, 74, -163, -28, 9, -142, -65, -123]
7884a23K45j62j48J7J97j8j36R2J29l7j82L54l62L6n6K95k05pO2q0J33j4j38j46
7908b54K66J77m3k06k13L18l3k94J93J7j38N2J17L08k84J59j3r0J4J31K6o7n3
7931I0J71l91K14k2j24J40k61m7K99M2k55J5LQ6k36L39l4K9j93J89j42J5J78j35
7955c0Rq5K8L6J43Jk3q1lj99mM27k20L4J37k94K47l07j6J43j0J74l4Q0k22L95
7981C26k31o4l09N51l62j07N56l54j5K51p4k59K14o7j84J59j60J71j93L7mK76
8003A58j35J13q2J04j84L65l28k2J40k70K15l05K56k46L35j25J39j93J07J50o8
8024A24r4j26j49K58k62L83k44J88l09L92j00N8Kl4j8j13J45R6j07j98j2j3J14
8047a9j46L42l73O5Q7J57k5o9P6j92J38j04J55%J14k18n2J74k75J59r9J37j3k2
$$ y = [-123, 122, -40, -188, -171, 26, 8, -128, -36, 93, 56, -126, 228, -134, -98, -154, 141, -64, -71, -9, -89, 44, 30, -108, -254, 12, 189, 146, -60, -273, 45, 12, -282, -89, -72, -210, -158, -41, 267, -17, 142, 129, 39, 53, 184, 210, 143, 90, 261, -130, 84, 62, -62, 78, -183, -230, 69, 111, -144, -129, -126, -40, -276, 63, 29, 58, -135, 54, -88, -73, 105, -30, -21, -106, -78, -42, 101, 102, 79, -2, -5, -204, -208, 219, -1, 33, 170, -124, 123, -184, -200, -57, -67, 107, 73, 153, -69, 326, 95, 31, -278, 273, -89, -196, 360, 6, -9, 242, 168, -91, 123, 56, -128, 31, -129, 42, -151, -114, -118, 158, 23, 136, 54, 158, -26, 339, 11, -11, 129, -141, 74, -231, 25, -221, 114, -11, 128, -65, 42, 192, 124, 30, -96, -245, 13, -249, 134, -110, 78, -231, 161, 61, 119, 121, 87, 69, -44, 101, 197, 90, -108, -120, -133, -19, -165, 177, -196, -131, -44, 113, 88, 19, 95, -97, 41, -63, 92, 92, 206, -12, -64, 110, -165, -6, -105, 32, 19, -3]
8071cj70K06k24J17j2n3J08j2j10j6K59l14L57q6J18k99O3J30O8L8r9J65k41K07
8095A97Kl03J78k92L96l9k47J74l72L93j8k96K51r7K17j61Nk1N2K02k48J38J61
8118B72r4l77K33l09K40m2jJ49r9M9J78l40J48k78K85K81j06j50l3P5j09R0j20
8141e8J32n0m5rk9j93K11N4J63l64N0n9L47l03Q6O5J00j04J7j12Q6m8lr7Q6J05
8167B8P2k88J27oj8K19j68j03K3J03J42j96J59p3q5j01R3L49l16N4k07M39N0l23
$$ y = [-3, -173, 33, -191, -74, -86, -139, -31, -43, -153, -169, 90, -224, 133, 47, 165, -134, -71, 59, 127, 165, 66, 231, -10, 197, 199, -104, 74, -218, 178, 139, -108, 66, -306, 87, 69, -227, 24, -73, 144, -17, -12, -33, 19, 221, -27, 111, 272, 178, -199, 34, -275, -35, -77, -78, 71, -28, 21, 199, -141, 7, -271, 14, 295, 189, 39, 6, 81, -28, 62, -58, 74, 24, -21, -30, -59, -252, -41, 13, 176, -188, -138, -197, 150, -153, -67, -2, 98, -6, 11, -101, -15, -63, -66, -163, -77, 28, 100, -188, -61, -67, -85, 134, -34, -137, -114, -11, 131, -65, 94, 21, -64, -165, -72, 277, -39, 15, -192, 247, 297, -26]
8191b6
$$ Imaginary data points
##PAGE= N=2
##DATA TABLE= (X++(I..I)), XYDATA
0@%%%%%%%%%%%%Qj6J6j6K4l2L2m0N5o3P2q8J04j20J36j60J84k08K40k76L13l54
34a89M02m50N06n70O35p08P91q78R73j078J191j317J454j601J763j944K142k358
52a236K600k870L171l511L897m340M859n472O207p108Q244r728J1758j4717J9443
67A1197k8177M9545j97407k83174L83123J59697k00180j30903J19820R3279L9074
78A5894p4662j48932K6579K39341M8420j40118k98R6923m1449j4881O9425p6926
90f84j20335J44900J59960j36361j67924P8700J05768l0869n1321l5677r289J06794
102D3662P8398j21002j09282J05531R4912p4647n5186K2420k1762J2415Q0679
113E6138m5457j39490L7900J45998l3204j31344j739O5760L0657J8615l5801p6408
$$ y = [0, 0, 0, 0, 0, 0, 0, 0, 0, 0, 0, 0, 0, 8, -8, 8, -8, 16, -16, 16, -24, 31, -32, 40, -48, 56, -64, 72, -88, 96, -112, 128, -148, 165, -189, 213, -237, 269, -301, 334, -374, 417, -461, 512, -566, 625, -692, 762, -839, 924, -1020, 1122, -1236, 1364, -1506, 1665, -1846, 2051, -2289, 2570, -2902, 3305, -3803, 4441, -5287, 6471, -8246, 11197, -16980, 32565, -164842, -448016, -64893, 94804, -105376, -236279, -116459, -23180, 15894, -58768, -207700, -181121, 58220, 106640, -33478, -33776, 63147, 21698, 6817, 76242, -684, -121019, 23881, 183841, 47480, -120444, -41744, 64024, 33155, -18166, -53843, -63132, 43662, 122060, 1058, -108224, -2693, 92219, 17572, -37614, -15194, -36956, -24541, 56138, 10681, -128809, -90909, 55089, 21885, -109459, -111198, -45438, -14781, 3834, -31967, -108375]
125a08375M3412J23624l0775j28224J4933R9007J8857j8092k0100n2119J9824
136c8028J13984j4282j55354J234J64596L4782j16962m9191N3993M9967J319o2339
148a6281o0822O4045R7766n1268j00162L6718O8604m2538m0039M0662P868k9324
160b4771K9232L6537l1475l2928J8141K1809P960K7l0162p875N9808K1040p4819
173g476l9824O1687L5161m5299k3375K3492J2719L592M680k2280k4910K4007L3475
186C5649j6795k7971M240J5156J2895j195l5785l0099L4415M3628l6389n2692
198e4943K4818M9503q731m0133j1673J8328K7457Q411k9093j9513L4900L2717
210C2048k5681l6202J0400K6727J554j2555j1622R94K0894Q584k5627j8001K2568
$$ y = [-108375, -64963, 58661, 27886, -100338, -85405, 13602, 32459, 14367, -5733, -57852, -38028, 75956, 61674, -93680, -92446, 72150, 106932, -10030, -59221, -5228, 44739, 46058, -16281, -77103, -13058, 84708, 33440, -66722, -30004, 38600, -3938, -43977, -3315, 4553, -24771, 4461, 40998, 9523, -23405, -5264, 16545, 24505, 24532, -5630, -13505, 46303, 67343, -7476, -47300, 14387, 49548, 4249, -19126, 4366, 17085, 20677, 25357, 3077, -21833, 2174, 35649, 18854, -9117, -4877, 10279, 23174, 21979, -13806, -43905, -9490, 34138, -2251, -54943, -30125, 19378, 10647, -29486, -41159, -22831, 4626, 13037, -16056, -35569, -669, 32048, 6367, -29835, -19435, 7292, 8846, -3709, -15331, -14337, 6557, 15141, -10486, -28487, -5919]
223e919J8109j6028p545J6683O129r921j388N375k468o660j667L537R195j343
237F089j9568n670K0392O623k5457j3740K4403K1900j0145j7380K038J8981J1733
250B0199j0470j7212M784K4679Q401j9859j5354Q252J4453k170j9235j3793Q061
263i264K0060j532k5509j0973J9337J6240j3522k1384L762K2684R390j4551j6020
276b1282P921J8631k77j7905o805J3952J1025o747j0301K64O875L086m292l251
290i106K111N031K256k1K213j55m216J237O750L111p430n671O501R851k072j4489
306d099o513J2581J1276p838j7208J152J9322Q237j5812j5696Q335K1158K333
319A7228j8995j1091J4796J9795o223k3259n837J8504J4337j3170k0705K364K0102
$$ y = [-5919, 12190, -3838, -11383, 5300, 11429, 1508, 120, 5495, 3027, -3633, -5300, -1763, 7432, 6089, -13479, -19149, 1243, 7866, -17591, -31331, -6928, 14972, 4827, -12553, -10515, 8466, 20199, 9729, -7483, -2699, 21980, 30381, 10522, -4832, 3420, 17873, 15703, -3532, -17325, -9264, 10796, 9264, -16245, -27218, -7881, 8359, -5163, -26547, -22785, -101, 9289, -5262, -21282, -13361, 5270, 4993, -12912, -19717, -5765, 5260, -1487, -11788, -11524, -4649, -1563, -5855, -9106, -6995, -1964, 292, 271, 2484, 2329, -1887, -650, 6100, 9211, 1781, -3890, 2611, 12462, 10390, -4099, -10612, 1969, 13245, 5407, -11801, -10649, 8673, 16910, 1098, -14598, -6263, 14895, 17228, -1767, -12858, 1938, 21733, 15510, -7749, -13586, 4918, 19255, 6085, -14620, -12256, 7846]
332G846P063j7453j6050R251J8228O50j6176p630J3071J2769m063j3650k204J0582
346B234O611n748q423l71O654J726m396n037j186K259J318Q05j731l515j57M488
362d469M255k085p205o2Q999O655o105j0710K466J2864M226j1496j1560Q388J6010
377A0171O7j5279p216J3419J5345n716j6674j351J7460J1888j1601j5640L116
390b011J7869N232j5918j3531Q405J5919j178j7757q033J2221J2112o672j5198
403h540o54J3175O518q240q994L652R521J582o176m275K804N083K82k834l029
418a25p6K557K134q95l333k049K917L670k20m410k387K802L901J083n186m970
434d587K892P532R51q937o764P031J0660k288j3947l934J4055J0536j0041j6034
$$ y = [7846, 14909, -2544, -18594, -9343, 8885, 9535, -6641, -14271, -1200, 11569, 7506, -6144, -8348, 2234, 8845, 3097, -5326, -5697, 957, 2683, -1713, -6750, -7936, -5677, -4359, -3554, -5285, -8800, -8957, -4469, -214, -2299, -9504, -9566, -567, 6088, -17, -10727, -8261, 4603, 8829, -2667, -14227, -5839, 10171, 10238, -5041, -12257, 1162, 16507, 10791, -5883, -7234, 10226, 22114, 10513, -5127, -2011, 15858, 21090, 5172, -8359, 46, 15965, 14787, -2970, -11003, 1218, 13330, 6658, -8540, -9194, 3981, 10499, 2259, -6735, -3083, 6438, 8020, 1844, -2431, 373, 5456, 5738, 2904, -125, -201, 2356, 4490, 3595, 262, -1787, 1130, 4800, 4580, 170, -2217, 585, 4486, 5569, 383, -4587, -1695, 5837, 6788, -2149, -8913, -1882, 8778, 6490, -7457, -11391, 2664, 13200, 3159, -12875]
448a2875L454J8865K551j7156r182J1805J3675n441j4616k202J3026R032p722
461C214j0752L728J1554L567o216n778L643P491K691n743o846K953O810o94q432
476A190l494L554K375l144l724j149J250J317Q8o64m65k66K07L502L136m281n599
493f167M931P300m167r791J72O845K320n339o841N91P342M271o012o166M672R746
509C707K448n041m515L132J0671M594j0462j0605R278J4517o748j7959j219J4655
523F453M476j3589j0848N378J2972j88j4192l686J3521O831q929n598Q025N564
537F190l854l73L134r40j248J966J828j352k081r81K419M652j810p138J133Q717
553A0262m74p307q7N115k52j548N20l347l426M302L864o367o086K813N692M42
$$ y = [-12875, -9421, 9444, 11995, -5161, -14343, -2538, 11137, 5696, -8920, -11122, 1904, 10936, 3214, -7538, -3810, 7744, 11311, 5095, -683, 2960, 10451, 13142, 7399, 553, 3506, 10316, 9622, 1190, -2304, 1250, 3625, 481, -3243, -4392, -3142, -1825, -1737, -2401, -2866, -3132, -2925, 577, 3713, -568, -6167, -1236, 6064, 1897, -7894, -7722, -877, 1443, -3896, -10737, -10146, -2804, 1467, -4545, -10711, -6039, 3707, 6155, 1114, -3401, -269, 10402, 14996, 4534, -6071, 3207, 17724, 10976, -6983, -8202, 6453, 10929, -2660, -13508, -8130, 4842, 4654, -9538, -13224, 297, 7128, -1801, -7399, 626, 6190, 2336, 1963, 5097, 4157, 2909, 4875, 6703, 5351, 3270, 2289, 4708, 9360, 7550, 412, 1545, 10262, 9788, 2481, 2394, 7509, 7257, 5709, 6229, 2882, -544, 3758, 7622, 1255, -4831, -2018, 3674, 4116]
569D116n737n634L098J0110N14j1846l359J3379O540j0083p319N053P225o3m466
584A528n409Q04Q533K002r754n459P383P079l716o199q04N073O795j992j0471
599d607l78J2154K427j1944l301R739K719p213k485L856Q61j677j135J102J766
614A884M15l733O69O797q86r420J626J0949o21j1146m3Q988J231n708l701J347
630a352L817K776m121n704L677N680k115m262k42O53J051L296j810p773P37R184
646C492K58j0493l212Q519N421m873o043O50P122N154o068p094N015R881j934
661E795q252J59O242J109l218k816j202J915L512j855n298Q19N195j075l742P26
677a986J975j49M68J330q55M2R21r25n05K474j186m612J758N965k647p489J637
$$ y = [4116, -1621, -7255, -4157, 5953, 6467, -5379, -8738, 4641, 11181, 1098, -6221, -1168, 6057, 5994, 1528, -3881, -3077, 5456, 7458, -2296, -7755, -372, 6707, 2991, -3208, -4012, 1061, 7856, 5864, -4607, -4985, 7169, 9596, -2348, -5649, 4090, 6809, -404, -2889, 967, 1828, 151, -984, 118, 1884, 2299, -1434, -765, 6032, 5146, -4274, -2648, 8301, 7680, -3466, -3509, 5479, 6710, 1002, -2699, -1352, 2465, 5241, 1120, -4584, -907, 4773, 2658, -1604, -1846, -1193, -142, 3154, 1344, -6429, -5692, 3492, 3750, -6743, -9955, -1436, 3985, -888, -6931, -6281, 841, 5995, -73, -7167, -2152, 7729, 5795, -2457, -2298, 3944, 5053, 1835, -981, -2183, -268, 3244, 1389, -3909, -3090, 2105, 1030, -2712, -1986, -11, -160, 308, 1638, 783, 825, 1746, 821, 316, 2790, 1604, -3008, -1250, 4715, 2068, -5421, -3784]
694c784O572K96n272k177L802N172N84n990k604P404N151m846n616L409N293p07
710F687l171k724m95L005J763m139m816J973M908o00n114k477K611M056n08n115
726d156j746N125M630m030n218K545M809p15l715m5K726J000n18j053m15J523
742G47N35j238N27J387k90j730J278K691j599l377L91K930N23k344k258K73L358
759A804J356m235l624L517M680k014m794N8M526K048k171m355o0O190J945m505
775C66l755L734L926j329l807j268K710L122j164l802o89L420J963k830k886J071
791a218K557M26k061j307Q08J518j81j651r85J492O33q87k8P86m08q82N99R66
809A77j07j471j14J693J531j183k304l2L155R84k984k101K037L426o05l363j746
$$ y = [-3784, 2788, 3084, -2188, -4365, -563, 4609, 5193, -797, -3401, 4003, 9154, 4308, -1308, 2101, 7394, 6687, 3516, 792, 297, 3302, 5065, 926, -3890, -1917, 2991, 2391, -2723, -5200, -2589, 1467, 959, -4156, -5902, -777, 3853, -177, -5395, -2850, 1959, 1244, -2471, -2516, 210, 1210, 692, -361, -776, 747, 1282, 44, 571, 1958, 1668, -62, 1216, 3907, 2308, -1069, -678, 2252, 2775, 431, -1827, -1554, 1804, 3160, -1075, -4699, -1182, 3498, 1484, -3310, -3252, 1274, 3322, 1151, -3204, -3264, 2926, 4871, 366, -3389, 345, 4271, 2942, -865, -2133, 577, 3699, 2535, -1267, -1956, 1464, 3427, 597, -2289, -1218, 1339, 1765, -296, -1603, -795, 723, 542, -1109, -2094, -602, 31, -856, -884, -98, -506, -1388, -789, 177, 70, -1401, -1515, 178, 1709, 526, -1778, -1810, 1345, 2329, -655, -2756, -719, 2707, 2102, -1261, -3007]
826c007K865L142j444m091k50M404K151l484l784K114M080m2l972j426K428L584
842C268j034m236m60L329J612k392k463R91K740M12j745j580R11J958m71j474
858f34j29J137O42o02o71Q1M19m30N1l1L62q61n29R98N99o92j817R7K176N81j712
879i65j585J326K601q63k941p10K563K106j838k802J02L077J638k761k841J819
895b074L612M14l563j464K682K822p81l601l70L335J926k534k818J096K845n3
911A474k426j595J711K112p74j723J9J349J013j322r24Q19P74K70p20k01P0M40
929C66J2m03k11M54m57K2M53L69m43q86N71J227j60j246p82J599J637o95k729
948a302l24K398O20k374k068J560K338n06k587r71K383K257j174k414K64K812
$$ y = [-3007, -142, 3000, 1556, -2535, -2785, 1619, 3770, 286, -3498, -1384, 2696, 2654, -1318, -2744, -316, 3268, 2234, -2002, -2462, 867, 2479, 87, -2376, -1385, 1355, 1767, 22, -1558, -647, 1311, 840, -634, -763, 374, 1016, 414, -257, -176, 243, -187, -136, -167, 195, -666, -1195, -197, 402, -290, -2107, -2010, 166, 747, -965, -2550, -1224, 1377, 514, -2427, -3137, -574, 1532, -306, -3108, -3006, 71, 1709, -1052, -3893, -2074, 1538, 1952, -1611, -3075, -393, 2429, 1648, -1953, -2323, 1012, 2938, 404, -2414, -1318, 1527, 1474, -952, -2547, -836, 1276, 502, -1221, -1202, 147, 1160, -162, -1086, -267, 507, 777, 57, -144, -74, 366, 378, -25, -236, 218, -239, -217, 236, 605, 162, -724, -153, 1074, 914, -332, -1114, 485, 2122, 1427, -1302, -1626, 772, 1392, -982, -3050, -1490, 848, 342, -2245, -3216, -833, 1424, 250, -2164, -1900, 912]
964I12J451k060j689Q87K482K84k301j271J365J803k90k672o87K099J235j662
980a14j880Q01J889N4j378n38J099R98q61r01O28P16l37r56N63M79p10l08r9J276
1000D21k22j176l66J777Q16j088r50Q16J025K73j040r91O36J153m40j403q81P43
1018h97J607m81k195q28K076J905j794k390J161K457O85k552j270K099K533j254
1034H62k439j95K629N80j766j664J171J584m30j382k29J184P53p92m24l98R14
1051d2O37o93o87O41L04r8n52K9P7qn57r0N25P89o25o98J059J257p53j667P21
1072d31K006k66j671q41J572J564j458j747K21K208K5j890o33J259J477q53j232
1089f90j42N64J438j90j341n39Q29J471p70j883L45J290M62j332j450P03J686
$$ y = [912, 2363, 303, -1386, -499, 1983, 2267, -34, -1305, 60, 1863, 1573, -1099, -1786, 313, 1548, -114, -1994, -1193, 696, 750, -628, -1166, -67, 931, 70, -831, -203, 513, 176, -780, -217, 262, -448, -756, -855, 421, 199, -977, -1343, 434, 1250, 162, -788, 28, 1053, 1326, 286, -705, -69, 1084, 644, -759, -1640, -897, 710, 229, -1966, -2794, -718, 1187, -607, -2997, -1836, 621, 1306, -1246, -2516, -417, 2116, 862, -1577, -1772, 857, 1437, -329, -1993, -822, 762, 332, -1050, -1279, -95, 658, -134, -558, -956, -42, 595, -98, -785, -144, 160, 62, -490, -461, -384, -392, -949, -1039, -514, 275, -350, -1048, 11, 1268, 515, -1152, -431, 1575, 1309, -362, -1203, 369, 1933, 475, -1272, -1051, 1157, 1182, -708, -1341, -82, 1395, 542, -690, -832, -268, 1170, 980, -361, -900, -71, 1400, 630, -1253, -908, 382, 844, -488, -1938, -1235, 451]
1106D51K10k056m60J833R76j221o53O85J080Lq90l43J094K15q92p12J076M17j042
1125b29m93J138L59r46n66Q14N81k26n01n45R79M06R9j733o7J466K06j034j112
1144a404O33J255j69j270j160J450J657o16k074M47K216K28j237r03J174R44j1
1161A160j009r36J084R08p32j095K39P59K21m41l51n10M56R68r02p56K62J015
1179C40r4r05l39P08M08o31l16n93J361q0o92JJ071k29q62L28J292K9j251l3J154
1200F67O59p68j220O60R29L68j803p45J301J243j304j387M23J386M40j278r49
1217a378Q87J163k52j224k35R11J137l93j596K12J134M87q01r35N29J286J85j236
1235a19l48Q46N40o07p21L02N05R5k26l08j00K68M3l33l67N40k19m25K25M31k56
$$ y = [451, 661, -1395, -1855, -22, 954, -267, -920, -235, 845, 848, -42, -385, 709, 924, 32, -680, 396, 813, -229, -722, 416, 775, -171, -737, 77, 658, 432, -69, -614, 365, 771, 870, -863, -930, 536, 742, -292, -1404, -771, 484, 315, -955, -2115, -665, 992, 376, -1698, -1251, 965, 1193, -44, -947, 227, 1171, 1160, 151, -785, 299, 1207, 475, -620, -381, 378, 599, 158, -193, -703, -247, 721, -181, -937, -675, 340, 246, -659, -998, -290, 118, -513, -829, -1422, -61, -141, -833, -832, 239, 10, -852, -524, 768, 797, -454, -487, 667, 1326, 558, -662, -2, 927, 1295, -508, -1253, 48, 1291, -13, -1400, -977, 409, 849, -429, -1378, -491, 672, 420, -804, -1039, -128, 1009, 616, -980, -768, 366, 853, 52, -883, -354, 932, 1117, -119, -467, 379, 919, 312, -409, -107, 398, 493, 267, -41, -141, 127, 170, -163, -530, 10, -209, -634, -409, 22, -234]
1256b34m6k58L34R8J32n25Q0O47N35p90o07O09O09l5p80n42J150M79p71j084O24
1277c75J400p2j372o26J061J044n12j331J46J184M05r00r81O17Q75j58o46n54
1295g95Q34O13m97p88K40M96J53k23k24j0P11r0o84K73J73L98n00L56K6l58k09
1316a05k16M44J61l90r1q9L70K80n55j58J32Q40k42q90L6P97K09m65r51L34J016
1337D67K52j152m05P62O86k79r83j32R52L81m97p91K87J101n2o70n12R83N52n29
1357D21r11L26O41L16p74m77M70L40K2q57j71R16P0l04k31m5K56J64m74J21K37
1378E6QM6m64N30N9j18l12K97M75l94n16L21K51K97m11k54P9P56j03q89o4M25
1400G5M96p7j295K02N62N20l48r83K47Q39J90j068k29M82J135n60j013K06R35
$$ y = [-234, -280, -538, -204, -106, 26, -499, -419, 228, 763, -27, -634, -25, 584, 549, -231, -773, 377, 856, 85, -999, -375, 1025, 953, -419, -1045, 16, 1060, 548, -783, -637, 547, 952, 52, -929, -312, 563, 405, -241, -795, 39, 652, 155, -633, -393, 103, 256, 33, -191, -201, 510, 420, -264, 9, 182, 580, 80, 436, 462, 104, -105, -321, 123, 284, -106, -197, -286, 84, 364, -191, -349, -217, 623, 381, -509, -473, 324, 533, 68, -883, -549, 467, 719, -433, -838, -76, 610, 331, -652, -784, 168, 549, 52, -739, -452, 649, 597, -73, -585, 398, 950, 421, -490, -164, 477, 793, 19, -458, 12, 352, 374, -483, -654, 262, 332, 28, -203, -248, 8, 172, -302, -181, 56, 64, 110, -354, 176, 235, 117, -195, 102, 577, 183, -333, -12, 239, 536, 125, -129, -50, 706, 603, -286, -350, 75, 571, 494, -801, -599, -37, 483, 135, -848, -601, 238, 428, -640, -869, -387, 748, 188, -825, -619, 316]
1419C16M51p29m00K60P25j97k66m67N69K36Qo23J07K90J58o02mr5L31L09o30J1
1441b42P5j2N7j72K94j09l76p0M76J7R9l43J66N73L2n14k84N32L63k45m66R8Q33
1464G82J11n82p47L05O28Q9r61k63J97R31l81p21K7N90O20p67o47O84N17J55q51
1485b84n19P40J54J2n93K60L71J22k77n52M44K92m2k46J50N40l09j3j30L4L55
1506E09n11J5K07j25j30r5o4L15J31m29J81Q4K27l6p43L6L42M92l69l89K51M98
1528C97n8j79n17L05O00m18n60q2P45M97p29k39J17N68k51k95l41N68M71l79j91
1549B9k60N32J12l34j1j23j47M51m85j5J57L37k69n07K48L30l4j4j24R4Q5r0j72
1572b10K6L44k57j35N3M23j17m73nO32L29l45l90K33K75K39p30n05Q27J08o1m11
$$ y = [316, 767, 38, -362, -102, 623, 426, 160, -307, 262, 498, 506, -117, -10, 280, 438, -164, -168, -263, 68, 377, -253, -242, -167, -179, -122, -294, 0, -109, -485, -555, -79, -62, 37, -306, -140, 433, 465, -49, -333, 199, 562, 317, -149, -51, 782, 893, 311, -436, -131, 497, 586, -375, -638, -441, 490, 109, -612, -585, 5, 625, -142, -789, -105, 412, 567, -284, -803, -63, 91, 103, -490, -230, 141, 263, -14, -566, -122, 170, 128, -118, 32, 572, 263, 250, 120, 154, 509, -2, 13, 220, 95, -35, -130, -194, 121, 252, -177, 4, 88, 315, 279, -464, -428, -86, 406, 37, -352, -101, 397, 339, 160, -357, -52, 548, 130, -430, -512, 233, 730, 1, -238, -121, 447, 196, -99, -440, 128, 599, 220, 29, -231, 301, 413, 79, 68, -55, -202, 249, -236, -251, -94, 243, -26, -533, -285, 45, 11, -3, -127, -33, 52, -38, -210, -184, 160, -97, -232, -179, 244, 127, -346, -351, 281, 610, 265, -125, 108, 383, 622, -108, -613, 214, 322, 261, -150]
1594a50J45p7N69m23l56O9K45K30n78k83M91M86j37n12k89N39M74k20o90P7O73
1615B83Q7n99K02L26K9m83N0K79K70m15J72k73jK01k45m1L33nl28J0J78k31J24
1638g7j21k0K2K71l64ql2K36L0j6k60J88L86j04l28K34J31N68n14m17K6P04j2
1661E23o13k76N76R4j40m58RM28K45n48K1j09M69n6k43k53M84m1k46%k07M98K89
1684D46n50p9K6K46k18O2n4K81R8l43O1m9N26n47J69N2J27m5m67j5R2N53m68J10
1708A4k3o7M0k26J66m0N77n09n5mK01K81m22j40N1N01J2m21k28N13J92o6p71J98
1732b26N03J78n33r2O9J53M5k69J33J26J66l37k5L46r7l4j98j2P4K93l49j16L91
1755A89j11M7l15K04N9L05k96j60k0rn9o3O4L76K05m75n8K61P3k99j70L01J52
$$ y = [-150, -5, -82, 487, 64, -292, -223, 22, 252, -326, -609, -118, 368, 231, -281, -570, -31, 443, 223, -467, -390, 283, 370, -229, -27, 299, 328, -155, -105, 174, 444, 29, 201, -72, -73, 128, -117, -158, 175, 170, -158, -148, 30, -201, -77, -198, -218, -196, 75, -289, -297, -329, -93, -63, -79, -339, -151, 235, 131, -197, 37, 168, 736, 222, -195, -169, 535, 523, -90, -366, 210, 304, 164, -294, -285, 143, 388, -160, -139, -248, 221, 165, -78, -331, 153, 112, -134, -134, -341, 157, 446, -104, -183, -157, 89, -129, -67, -121, 160, 258, -85, -24, -73, 453, -94, 75, 127, 254, 209, -258, -273, -181, 372, -96, 14, -9, -76, -36, -262, -96, -136, 441, -68, -123, -127, 74, 355, -67, -207, -156, 345, 357, -64, -292, 221, 413, 347, -424, -226, 277, 455, -78, -170, -101, 52, 97, -172, -39, 87, 253, -84, -109, 237, 140, 106, -92, -104, -30, 263, -86, -202, 189, 78, 125, -190, 14, 73, 378, 82, -78, -98, -107, -166, -229, -165, 211, 416, -59, -117, 144, 217, -82, -252, 49, 201]
1778B01p7m25j41M09K32j1j98m25L85L84j09n34K67L39m01l7j27L61L45j20k95
1799B3k97L38R6k08l92M18K92j34k09P4J14Q7N8m88K65j29K91m73J63K99l3K43
1821C98m68j07K74l24O3J72j11J27k89L08k67M60l07j32K58J43J46j85m66M03
1841I6L16l01k86j32L51K15j42l63O8K19J33r2k98J77K25k74J7j90M18j0j71l69
1863c93J40L86r5L4l87J86Q9M4k25Q7K01M6k41J15N0R3l7K04l14J63K62j89j77
1886D2j37L66k80J7M7J1R9k42Kn2M8J20k74lK33J61k67l4L9K90m7l33O8L22L9
1911B35l78k41N21J68k46K2l81O21k87M7k29K4L88j91j57j21J59K46k51k27N88
1932C10k68K38l75L4J24l3J45l85P0K09j0K11l88M7K43m2k33P8j54K80j82J57
$$ y = [201, 124, -301, -442, -33, 199, 188, -10, -435, -50, 334, 225, -309, -42, 297, -104, -141, -268, 93, 438, 318, 23, -274, 64, 160, -48, -440, -22, 270, 136, -73, 1, 115, 202, 260, -228, 37, -92, 199, -274, -111, 188, 155, 398, -70, -177, 97, -227, -164, 8, -103, 24, -265, 43, -224, 236, -71, -203, 55, 198, 344, 159, -307, 96, 412, 111, -175, -307, 44, 259, 117, -246, -178, 41, 174, 82, -216, -39, 186, -88, -71, -261, 157, 147, -24, -393, -253, 133, 38, 72, -315, -129, -40, 4, -221, -134, 67, 113, -128, -13, 37, 130, 93, 297, -17, 146, 408, 219, 42, -95, 271, -9, 8, 55, 66, 165, -77, -75, -127, -79, 41, -233, -236, -3, 158, -109, -143, -104, 186, 139, -194, -126, 196, 235, -143, -384, 137, 305, 59, 81, -300, 321, 34, 81, -148, -124, 264, 73, -84, -205, -46, 200, -51, -278, 310, 42, 280, -95, -61, 63, 30, 175, -210, -140, 69, 59, 270, -118, -71, 172, 130, -103, -25, -179, 101, -81, 76]
1954G6J6J02j39j59P2J99m9k51p0R9M35m26R4j23L71rm04q4l4K43K4l9k70N50
1978B24r2m8l33J95j1M17n51j5K02K0K53o02K51R0m6rK62m00M02k31M9J45m4J17
2002B45J33o29J54L12R6k64k54L72J53k58o9J24j15K01m12N2J31J39j98j02r2
2023b81J92Q1p9k06M85rk77J2K57p6n6J24l80J79j81K52j0J59J58k34k63l0J17
2046f6l4K63l10L6K10P6n65M33j02J60j8k50O0J69j3N2l8j76J03J1j22l0K24q
2070F5J34l06K14K36j76j87o4J86K5J49k21j54J63j0j57J88J1j95J22k5p8J47
2092F7j0k36K00O3j92J8j96J91J32J51j35j91L58N9k42M1j47K83k06J31l76J75
2114f2M60k07L6k39j01J25j00j68P8M93k52l08L28J0mj72K4o7j6J34N2k23J08
$$ y = [76, 92, 194, 55, -104, -32, 167, 118, -133, -203, -104, 331, -95, -1, -124, 247, 238, -166, -250, -284, -41, -17, -56, -326, 224, 132, 84, -249, -54, -65, 352, -199, -214, -12, 8, 261, -341, -90, 0, -46, -55, 207, -193, 209, -22, 27, 172, 128, 245, 378, -251, -97, 215, 311, 47, -207, 165, 318, 60, -9, 115, 0, 201, -211, -159, -28, 111, -87, -189, -281, -89, -8, -87, -293, 192, 183, -94, -82, 175, 99, 43, 167, -213, -34, -215, 37, 27, 186, 344, 110, -153, -183, -66, -100, 163, -147, -111, 99, 175, -390, 43, -59, 101, 83, -167, -107, 62, 49, 101, 63, -113, -10, 1, -121, -151, 73, 65, 199, -107, 107, 343, 167, -20, -84, 102, 127, 276, 55, -99, 64, 54, -103, 85, 96, -99, 23, -2, -80, 67, 57, -179, 21, 84, -108, -90, -286, -95, 37, 188, 53, -138, 220, 279, 37, 78, -69, 214, 8, 139, -237, -62, 398, 191, 227, -12, -113, 12, -88, -256, -178, 315, 63, -245, 83, 93, 89, -83, -59, -126, -142, -8, 44, -179, -71]
2137g1J09p6K76k45r3J17J47k39K47L2k88K56j22j5L6J33j5j13J74l19Q9%p0L22
2161B72j40k09O3kL02l97k51L19K43l77J77k0J40K53l21l28L80k6j13j19J0J03
2183d1P6J76l22p5J98J92K1n51M54j50N6k55K76l8Q3k01L18k18K15l02J02o7M9
2206dr8mp1j74K25L12k27j45L49o9j39L6K67l72K23j65K31j67k3n0K57r3p2P6
2230A03k73p7N98m90J5j09M86j26lk82k13K68N1m2R9P2J59p2k66K57q1m7j04j6
2254i3k25L66R2J49m86J78n7J4k6j37K0O7OQ0O1P6J41r2m17J36L00l58P1Q0P8
2279B4j23m49M42J73R0j96k9J25k44J45l5j71M11P7l05K34j84J70l3K6J6m09K33
2302a2q5N2K46n4l5J7j65J05K9N3j80R7M9M6m09R0k19N12k48K59j42k9O0J24m22
$$ y = [-71, 38, -38, 238, -7, -100, 17, 164, -75, 172, 204, -84, 172, 50, 35, 71, 204, 189, 76, 250, -69, 20, 20, -50, 272, 132, -77, -14, -16, 286, -111, -362, -43, 200, -177, 0, -20, 120, 373, 52, -276, 104, 78, -35, -154, -144, -41, 35, 211, -111, -186, 12, 204, 225, -326, 128, -22, 34, -221, 55, 17, 100, -101, 217, -1, 214, -88, 14, -53, -4, -102, -106, -177, -351, -126, 186, -41, -186, 163, 94, -45, -9, 258, -114, 109, -56, 175, 8, -15, -65, 192, 99, 27, 103, -170, -247, 351, -139, -124, -233, 253, 127, 124, -158, -371, -103, -52, -94, 5, 77, 236, 164, -102, 155, 74, 27, -77, -93, -318, 48, 140, 289, -197, -19, -76, -62, -88, -225, -205, -138, -132, -52, 9, 85, 226, 134, -283, -147, 153, -205, -134, -54, 24, -99, -548, -106, 67, 157, -39, -68, 57, -187, -42, -77, -248, 163, 240, -65, 169, -15, 155, 122, 148, 164, -245, -12, -97, -45, 201, 147, 112, 129, -36, 69, 98, 151, -29, 68, 117, 163, -246, -156, -375, 137, -111, 148, 6, -23, 37, 161, -261]
2327b61J0J51o1M21m54J79oJ81k63q0M8L5J52rK4l15R5n7K70M7p8K16k98K4K76
2352B47l02kj67L91k80k06M92J3k54L98l98J17j31K02j32m5K18k97j83J24Q5K90
2374A80k69K30k19J93l17L60nk27R2oK32J6l52K94j45J12k98J16m1j05K52j13
2396b0K36k71N1P9n8J21j5l30L46Q9j42r9j7M7J19p5j99J70K8J86n6l41K70j08
2420A1K19m54M24j14k1K3k21N73m46J19n9r4J90M1k98K82j51p7j01J71k03M03
2442B17k43N7n7K9PL24m18j6J58K8K17l55N1r7j88M61r1J26j61m7j93K68L7k35
2466a21J6K03r8M1J13m93M58J68p3k20j70j3L62k43M5K9k04K32K41j91L9n2l5
2489C4r0PJ37K4k25P4J66j77j46K36q8M4J76K61m33L6j2J11j92q6LK46k30k6J0
$$ y = [-261, -251, -100, -161, 260, -194, -15, -21, 160, -103, -183, -135, -100, 52, 43, 67, -248, -153, -210, 60, 107, 29, 245, -53, -29, 247, -55, -57, -224, 167, -113, -319, 173, 186, -68, 330, -68, 49, -82, 120, -12, -57, 161, -136, -319, -195, -110, 180, -89, 141, -78, 115, -202, 158, 153, -74, 18, 12, 244, 260, -92, 202, 57, 169, -129, -13, -54, -159, 93, -20, 216, -55, -4, 75, 17, 138, 123, -207, 139, 228, 86, -13, -30, 17, 136, 61, -138, 32, 60, 246, 190, -151, 119, 11, 230, -224, 200, 86, 65, 88, -133, 440, -6, 113, 54, -40, 150, 191, -107, 175, 24, -53, -154, 17, -186, 217, -26, 31, -26, 3, 10, 334, -84, -100, 58, 86, 303, -52, -1, -98, -286, 175, 84, 210, 49, 2, -191, 77, 114, -121, -105, 98, 0, 41, 154, -339, 119, 287, 214, -6, -176, -189, 173, -70, -25, 4, -200, 32, 273, 82, 121, 69, 34, -56, -49, 88, 112, -113, -39, 127, -50, -196, 40, -48, -4, 172, 433, 0, 36, 24, 135, -57, -143, -140, 106, -124, -150, -140]
2514a40Q4P5l99M57j98JJ24j33K00o5K07k06J25q1l7k89K51j54J89p2m0J55KJ1
2538F7j41J66k52K15l12K66l09o6O34k08k89K31Rm0j24K30r1J39k42J83j81O3
2560e2J11k64J70j46J89K08p9r2m9R6J63j84j38J41J0J12k67m7J06L0m8M5N4j87
2584a18K30j94N7M0J03K8m4j75K7j29J99P0J26k04L6L4k31J13l6J62M5K0k85J9
2608a07N1J77j23j94j42J86L66k98J57j63K51m38M95m24P4J25p1k3L35j74J66
2629B26j44k2K73j99R1j43j37K53N0l27p9K51k57k04L37K05O7k91J11J03m98L51
2651A7M7j98J85P1q8l33K53j47L78j99J01M9j20n6P6o2J39j00K13l20J73j30R2
2674D1L7j22j09P0k1J47p3l3K25j08n9K0j14o5L9J47j30L51j49j78K1l5M14q2
$$ y = [-140, -56, 19, -380, 77, -121, -120, 4, -129, 71, 6, 213, 7, 132, 51, 14, -275, -24, -178, 11, -61, -101, 54, 56, 67, -74, 92, -160, 55, -257, 9, -300, -366, 268, 60, -229, 2, 11, -29, -153, 77, -14, 125, -117, 66, -115, -52, 59, -205, -35, -181, 8, 216, 137, 45, -4, 92, 255, 71, -67, 74, 84, 196, -71, -118, -12, 18, -30, 15, 69, -118, 112, -82, -25, 15, 118, 146, 102, -73, -46, -175, 24, 94, 220, 16, 52, 86, -145, -32, -68, 94, 139, 159, -126, -107, -56, 121, -2, -196, -338, -152, 214, -84, 73, -90, 161, -277, 218, -206, -132, -7, -78, -101, 234, 60, 226, 82, 60, 333, 134, 225, 82, -55, 198, 248, -79, -158, 93, -164, -368, -31, 174, 241, -50, 61, 164, -334, 17, 64, -134, 51, 122, 34, -299, -46, -193, 185, -14, 87, 136, 16, -40, 36, -26, 113, 13, 226, -94, 79, -51, 41, 78, -44, -153, -83, -104, 43, -30, -63, 162, 54, -5, 15, -99, -164, -125, 22, -108, 243, 94, -84, -63, -98, 316, 234]
2698B34j64P0m2j27K48l47q0J77J76k85N7J16m3K16k59L56l95O6J17l90K09J06
2720A6l8K24l11L94o4J1k32J12p8K9j01j4R7Q0q8j98K42K07l94j20K78m46J68
2743b26l4K68O5m4oj42K3K53k46J34Q7k01k2J5J09M9l37j07M66n9k41k0M45q9
2767A40k26J10J71j64J76m44J92o0J9P5J39l36K36J63k35K81j89k57L5J6K00J6
2789E8j71J35O9q2r6L9n5o2L32j59k20J22R6J61j83j50M72m14k9n3J58M1K03j46
2813F6k12R4J83J10j22r5k04N1j97K23KK11j94K88n1l68K90r6R0l1L4p7j93J21
2837g7O2j25L10j57o3mm7K9p7J64j25j37K10m4L84j45l19P7M2M20m47j29J04J88
2861I4m2k49M9K01j06M9j72L99k29k49J68M6J19j52J62Q3k56N5K49k45k20M63
$$ y = [234, 70, 140, 98, -29, 219, -128, -208, -31, 145, -140, -83, 33, -10, 206, -53, 303, -92, -26, 91, -299, -90, 16, -22, 202, -109, 285, 221, 232, 0, 112, 34, 63, -38, -52, 45, 125, 37, -161, 81, 288, -106, -226, 52, -394, -226, -260, 8, 73, 29, 23, -119, -96, 157, -89, 45, 132, -69, -91, -76, 33, 82, -255, -362, 104, 45, -196, -216, 229, 140, -86, 24, 195, 31, 207, -237, -45, -105, -86, -11, 128, -208, 28, 191, -44, 237, 48, -209, -174, -158, 42, 58, -113, 22, 91, 9, -87, -48, -103, -165, 167, 8, -212, -90, 6, 167, -16, -166, 306, -108, -137, -190, -32, 9, 212, 66, -146, -52, 131, 241, 119, 24, -180, -129, -326, -103, -101, 110, -84, 204, 153, -215, 75, -21, 69, 38, 72, -5, -198, -77, -15, -140, 170, 13, -50, -54, -101, -72, -149, 15, -110, -247, -37, -81, 303, 158, -161, -84, -42, 378, -69, -198, -94, 94, 52, -197, -148, 53, -53, -4, -176, 223, -6, -255, -87, -41, 78, -74, 88, 171, -85, -30, 219, -26, -246, 217]
2883B17k28L2j17R6J63p3o2J55Kj51j7j0K54k51n3O6O7l62M57j71j31J67Qj83
2907a25N2j82K23O6K13l38n4M14o11J33K64O9J05l21jk0J66l1q5J16Q3q4l67L72
2931E7L7qK3o2j36K45k36M4K71k45N2Oj43R7l0J66j86P3O4m47K33R4QK17J14k61
2957D7J06k3k36K71o4L2j41j59J32P2k2j31l5LJ95J95p7l95J80J33j9j67R8J65
2981A60j39M0k42K68m9j36K55p6jk07l7K0L78l66j59L16J5m9j82J98j48L46l84
3004a79J15O4O5j16K01k35K06J58m94J3K37M9j43K5j14R1K01l33j25J71L00k08
3026e1j02K06k36J00K81p9J9p3j90L26l38K25n2J43k54m3L59j03k36M5P7J47k09
3049c8J7R1K48l50O5n2j78J7J90k19K23K2j97J39Q2o7k53L55j62K7k31J44j20
$$ y = [217, -11, 21, -96, 0, 163, 90, 28, 183, 185, 34, 17, 7, 261, 10, -43, 23, 90, -272, 185, 14, -117, 50, 58, -125, -73, -255, -32, 34, 247, -91, -145, 269, -342, -209, 55, 124, 229, -92, -93, -113, 53, 22, -63, 53, 136, 52, -315, 57, 94, 86, 109, 47, -89, 156, -80, -36, 235, -10, 42, 48, -95, 2, -28, 138, -48, 25, 89, -358, -125, -31, -23, 194, 308, 47, 153, 130, -106, 165, 101, 133, -8, -167, -35, 37, 15, -116, -151, -148, 47, 242, 165, -230, -50, 83, 64, -103, -5, 160, 21, 61, -181, 87, 38, -98, 157, 81, 80, -127, -164, -144, 234, -132, -291, 25, 40, -9, -191, 7, -141, 205, -179, -64, 0, 65, -51, 150, -85, 121, 279, -215, -202, 35, 84, -59, -34, -148, -57, 144, -189, -314, -143, 157, -51, -153, 53, -183, -83, 198, 119, 138, 65, -125, 201, -137, 88, 36, 179, -75, -118, 241, 138, -98, -53, 24, 171, -38, -21, 70, 318, -32, 33, -19, -197, -180, 10, -209, 14, 36, -161, -22, 60, -7, -260, 95, -67, -40, -271, -127, -247]
3072b47K39P2j05K27l07M43m37Q5K9K16k71K77j04r3j33l7K26n5l2Q5J02r2R8
3095A86j26Q4j82R0Q6k81J13N4Q3j40K39k75K20m21N41k31jJ0n6J85j70P0j6j45
3119h3j7J74m4J12m8J72k90J60k97M17l57J55L8k7m4r4n6K3L06l56M45l39R3L8
3143H1Lj77P7k6j33M81l45k8Q1k10L19J5J46k9m09L6K05K95k74j06J89k24J62
3166A29j20j3j4p8k3K10K58k64j10P6j60m4K00L06m51J2K00k13j35K33J34ok59
3189a32M03l28o1J50j54L5L9l5M77l02j7j79J06j21K62m1l3J62l24O2k25L5K28
3212GK9k25k5J50N2J48l74L16k9P5q0J80j46j39M7J6O5o0R4j14P8J60l68j5J52
3237fj2j08JK8K14p6J00J20k82k01J01L13Q0l91J55R3J9j89J6r0J23j09O9j6q2
$$ y = [-247, -8, 64, -41, 186, -121, 322, -115, -30, -1, 215, -56, 221, 117, 24, -109, -146, 80, 25, -7, 78, 180, 88, 186, 60, 144, -38, 52, 138, -143, -30, 24, 107, -33, 206, -69, 151, -270, 271, 40, 39, 49, -7, 178, 8, 78, 62, -83, -100, 74, 30, 142, 94, 266, -24, 136, -161, 256, -101, 54, 92, 65, 21, -73, -129, -106, 200, -156, 289, -50, 43, 81, 84, -93, -16, -42, -175, 306, -39, -67, 14, -196, 123, 138, 284, 255, -154, -118, 87, 382, 108, 2, 191, -33, 129, 9, -4, -18, -96, -119, 91, 349, 85, -25, 51, -109, -153, 47, 353, -98, -86, 114, -99, -234, -1, 133, 127, -132, 271, -57, -118, 32, -122, -87, -48, -83, 394, 92, 75, -104, 2, -119, 143, 102, 69, 231, -93, -31, -256, -221, 7, 36, -189, -214, -64, -12, 136, -238, 78, 49, 124, 44, 224, 78, -61, -14, 2, 67, 7, 101, -13, 65, 225, -143, -158, -6, -18, -126, -125, -97, 117, 41, 141, 261, -21, -222, -121, 192, 272, -119, 36, 129, 148, -41, -25, -115, 8, -101, -32, -48, -130]
3262a30M40l65j39K93l5J98k6j33m2m6k2k02K8J75J30p3J44j88j69L3j08K6K22
3285A1MJ6K09l0m25Q8J1l1K2K19j49j1j00K10M7K2j75j88K69j11k9J75k60K57
3309E1Mn6Q7q4n8L7Q2r4k00J18j42M24j98j12J83K8J10k68J07j67L34j53j72J74
3333C5p8J43k61k7L0K46J10j70j18p9L56j83k00L81j30J92m91K64r4j09M82m92
3355a93J14P1nj8jp6K46j02j25rJ90P0k72R6N5j24j19M34k55J22o6j46J18J76
3379A81N0m19J73J4j09k28N06j05j07J57j78J06O7k90R1M7r3L01l8m2R1k30J99
3402A44l63K28j68J67OM0k2P6r3M4k26rrJ8J18j29K47r6O7P3j15j92K39k44J67
3427c2k99L46j0o0L3J1J03n5mj37j15J53j09J11L5LJ99r1m9o8p7P5Jlq6L24L2
$$ y = [-130, 310, -55, -194, 99, 64, 262, 236, 103, 61, 15, -7, -209, -181, -6, 124, 51, 195, 7, -162, -129, -237, -211, 11, 15, 31, 240, 210, -215, -127, -116, -147, -125, 94, -55, -66, -166, 44, 91, 113, -62, -250, 19, -92, -121, 54, -206, 51, 55, -1, 86, 2, -56, -19, 63, -31, -231, -113, -255, 169, -29, -141, 42, 70, 180, -88, 19, -148, 186, 33, -139, 35, -43, 100, -161, -188, -158, 88, 198, 28, -90, -169, 187, 4, -196, 185, 55, 247, -244, 20, -74, -183, 299, -193, -79, -8, -13, -31, -32, -108, 138, 36, -89, -98, 92, 162, -110, -14, 41, -83, -202, 232, -23, 99, 33, -113, 5, 181, 231, -188, -15, -1, -110, -338, 168, 63, -44, 113, -65, 41, 108, -182, -91, -44, -137, 164, 126, 84, 175, -55, 144, -219, 9, -159, 8, 14, 54, 32, 108, 15, 59, -167, -176, -185, -167, -49, -178, 69, -27, 40, 113, -2, -194, 45, -199, -32, -331, 15, 5, -55, -22, -11, 92, 37, 33, -104, -219, -66, -175, -64, -29, -26, 173, 82, 33, -35, -112, -37, -36, -39, -125, 199, 231]
3454B31j88L1j17K47k36J4k8k67K15L63k43%J57k09o3J53N1k28J15J32k76K07
3476F1j01L7k21L79p2n2K5k47r1J9M02j33m1K09j24j0J3J13j40j11j63K34M3K1
3500E0%K12k00j33K73k02j72J60%k34J35L7L93k11M7k37Q1J09r3j99J37j93J52
3523h8l0J25J7l6J32o6k32o8K32N7r8OJ00k24K8K05j55J63J7j41P5J2J82Pl80
3548a60J97j00J08j32P3l7j87L15N9j19K03l00K43j27k94L91k05N9m9RJ8O0L9
3571F4k03J37Pm5R9K8k18J52J03j74J01j36k0K06j93Q7J8j73L08K9j90j86L17
3594A18j1J28k63J15q1k29K61O9J3j02l2K19k0Q6k26j41n2O4Pl6J6J5m4P8k2j28
3620a98L8O3J49l7K38qj76J7j95K8k3J49K5r9J84k55LK46R5j6k33l0j39K20o1
$$ y = [231, 43, 74, -43, 204, -32, -18, -46, -313, -98, 265, 22, 22, 179, -30, -93, 60, 111, -117, -2, 130, -146, 61, -40, -3, -224, 155, 83, 31, 56, -191, -282, -263, 139, 6, -35, 174, 50, 40, 53, 166, 26, -85, -248, -14, 29, 50, 50, 262, 62, -71, 202, 0, -172, -12, -12, -246, -111, -74, 319, 108, 155, -82, -1, 108, 15, -184, -47, -240, -88, -118, 7, 24, -12, 120, 54, -178, -246, -14, 43, -55, -49, 51, -173, -145, 60, -95, 68, 85, -56, 19, 31, 213, 220, -160, 37, -63, 45, -87, -14, -51, -238, 77, 136, 17, 220, -80, 163, 36, -258, 133, -72, -13, -62, -53, -35, 25, 64, -139, -2, 5, -40, 59, 87, -131, 21, 124, -50, 51, -85, -105, 101, -92, -5, 13, -160, 148, 177, -13, -199, 118, 107, 235, -28, 87, 6, -223, 38, 107, 120, 18, -14, 205, 185, 271, 45, -96, -148, -84, -77, -113, -97, -82, -126, -48, -70, -198, -160, -97, 52, 15, 253, 245, 69, 86, -109, -81, -104, 45, 70, -29, 155, -100, -97, 149, 244, 228, -5, -35, -174, 46, -15]
3645a5M7q6J14n5m0j86K96j32j0J82N0j04N7r3o8L1J85J96m82J12J07M7O0K6l75
3670a36J54k97K52J49n3j28J27J17k1k78J48j33m6L86l07J54K24m89O2K68k86
3691a33K84l11J44m0k39J2J58K11o2l52J30K26o8O5m0J2J07p9J3kk04L31r9J16
3715A80l16K08n6L7j90M4J80j98J8j86J66L5j5J39m2n6l0q2k77N66q3J04nk38
3739i7o0r2L27k22J40j94M52k80J78j23J5j23Q6j65J43J04J53k14j20l6J24j2
3761a6k7j3R6j67L1J72j21oJ9j6J05j31P2Mj05J40J2m24M85j46J77j94j18K86
3785A15k05K94k40r9K23n6q3j56R0j02J10nK23P5j14N0j69j96P5M04j77M0q2K4
3809C9l2m9k21J56j20K15Q6k39J47k8p7K81O5j66k59K80J0p7j2j42K45Q9j06k83
$$ y = [-15, 32, -54, 60, 5, -35, -221, 75, -57, -67, 115, 165, 61, 118, 25, -43, -12, 173, 369, -113, -1, 106, 153, 213, 239, -136, 18, -279, -27, 122, 69, -59, 68, 185, 164, -114, 34, -99, -145, 241, -66, 88, 312, -177, -115, 153, -133, 151, -160, -16, -56, -295, -283, -125, 86, 24, -328, -198, 28, -40, 25, -15, -3, 104, 25, 38, 36, -168, 163, 64, 180, -136, 72, 16, 53, -137, -93, 87, -111, -93, -279, -113, -78, -93, 46, 4, -52, -82, -164, -441, 125, 42, 146, 141, -97, -157, -249, 78, -144, -4, -198, 254, -26, 152, 29, 44, -79, 7, -158, -15, 89, 242, 28, -92, -128, -4, -16, -43, -56, 40, -127, -96, 76, -45, -51, -32, -48, 57, -74, -2, 2, -103, 37, 49, -375, 110, -36, 141, -53, -171, 115, -90, 204, -36, -135, 88, 32, -51, -207, -117, -219, -109, -114, 109, 184, 70, 120, -49, -245, -170, 234, 57, 97, 15, 39, 7, -42, -263, -107, -227, -12, 74, -165, -18, -46, -123, 158, 223, 57, -202, 78, 88, 11, -1, -143, 102, 191, 85, -198]
3833a98L24k87K75rq3j13J67K32k03k22K73J56l57l76N64O4j6m07L21K5m6k05
3855a21k07L49l14K95j47R8N2p0J39j64O2N6Mj02m2M8j37K46p5J21M0j73J87r7
3879D8K90l84K58k14j03J23O1j11L8J32r3j1l5m8K56J11k44k0j73k7P7K07Q2J34
3903C54l56O7l35J80MN2j35K58j88L7l2j00K98k18K31j02J14j00p2K11k17J06
3925E7r4J34J15j18k19J73k9Kj21P5K44l8l18j11K80L2Q6n6J86l93k4j06K73J13
3949A43l06J82P9K31m26J33L7j95J83j77J25o2k5Q0L9k80L15rl8j54J61k07QJ54
3973ij33J87k78L10k1j01J6j13m2q2J39K13r7j92J18L10m92K07j7J58n4j72Q6
3996e9J24m7r5M4J63m28K67J27k43L67m22J63O6R5j29j8L2M0J49J1j71k17K62
$$ y = [-198, 126, -161, 114, 105, 22, -91, 76, 308, 105, -117, 156, 312, -45, -421, 143, 207, 191, -216, 105, 130, 84, -121, -328, 21, -293, 2, -145, -47, 5, -65, 74, -90, -28, 28, 32, -70, -112, -64, -201, 45, -30, 91, 131, -42, 145, 48, 338, -46, 212, -2, -105, 18, 79, -32, 6, 138, 45, 34, -1, -49, 207, 318, 74, 54, -119, -146, -69, 138, 220, 354, -2, 65, -270, -90, -86, -34, -169, 89, -99, -62, -94, -194, 104, -114, 117, 15, 129, 29, -43, 168, -49, 57, -37, 97, 212, 94, -125, 48, 19, 21, -100, -25, 219, 181, -137, -248, 32, 64, 150, 94, 280, -113, -137, -243, 30, 143, -163, 19, 98, 329, -97, 36, 73, -122, 61, -116, 9, -53, -78, 2, 41, -239, 76, 67, 29, -125, 36, -171, -163, -9, -142, 45, -233, 77, 56, -45, -29, -142, -184, -266, -127, 86, -11, -203, -85, 225, -267, -60, -77, 81, 27, -145, -59, 65, 18, -77, -33, 130, -298, -31, 96, -147, 220, -202, -39, 27, 122, -7, -25, 7, 47, 196, 207, 36, -181, 81]
4019H1J3M1m03N09m3l52oL28l11nP0P3j12J97lq4j57O2J17M0r7Q9k11Kk6J20J30
4046F2p6j35r9J53K57J39j66l01J92J48k32o7J08j16L97r2j30m4j46K39j34p7
4068a20K30k36K83no6K3k81K49j06M5O7k09J46J59k96J94J34k44j0J45N7k9j88
4091e8K01l0Ok46j16K02K9N4k57J98R5r7J05k59R7n9J45L8R7l74L33L9p1R2m06
4116b42M47q7J4j76j05J13q0rJ45k41L30j46J21K3k41j6M5k5p4N9L30k23j1K89
4140B40l65O5R7K35k13K30n27J81j4R9P1K01l20m0n8K02j08J33r3J2j89K73k71
4163a59L99p1k28r9K04l10K64J78l52J41j7K53j94j60J70P5K7J66j94Jr7j86K87
4186I8j52n7J11K14r8J0q9j98J30p3J91q1k9L5J0j19J79j33Q7J13j20j12L9k25
$$ y = [81, 94, 135, -268, 241, 198, -154, -160, 168, -143, -148, -78, -5, -117, 80, 77, -7, -164, -102, 15, 55, -42, 47, -164, -162, -188, -68, 62, -14, -149, -248, -95, 162, 301, 135, -166, 26, 174, -58, -125, -17, -133, 264, 172, 42, -2, -148, 91, -43, -120, 110, -126, 157, 152, 86, 109, -172, 77, -29, 16, 83, -126, 20, 179, -117, 77, 211, -33, -43, 102, 159, 130, -58, 143, 113, 119, -127, -243, -41, -12, 42, -215, -17, 78, -19, 86, -173, -76, -135, 10, 48, 145, -229, 104, 143, 72, 164, -242, 205, 118, 132, -44, -149, -36, -116, -125, 20, -221, 109, -37, 84, 107, -134, -150, -105, -130, -204, -145, 185, -38, -49, 240, -125, -60, 37, 272, 59, 289, -238, -57, -71, 28, 99, 300, -20, -60, -118, 84, -24, 109, 16, 28, -161, 112, -159, 240, 169, -59, -158, 46, -264, 0, 178, -174, -33, -50, 203, 9, -151, 19, 94, 121, 287, 93, 94, -3, -189, 98, -54, -111, 0, 214, 116, 126, 37, -161, -31, -104, 87, 6, -23, 12, 22, -97, 82, -51, 36, 149, 29, -83, -44, -269]
4210b69L17k95L37j03J58Mk09J89j75n2j73J02K37M1o6k56J23o1K5LJ80o9lm9
4234f4M4J93j19L57k69j22nJ44l21k8L03k90N23k78j0J19j28o6l5J54m78O40o35
4257c71M66l10L07o4q3R7KK0j49M12m07J08R6k01N7L50m13K06M8j3l7k40R0J82
4281A53J08k89N0P8j10J0p8j23L21n9J02j47j24K95j55J80k26pN6j72J68mo2J51
4305A16m63J92K69j50j78K23j08l2K50J6j84m1K08p6J0m1Q3j97j6K9M8R3M5p7
4329A9l8q1j7K2L13k17o1m4J87p2n2j52L12p9Q2L1p8J02j70J50j31j7qL7j48J39
4355B9o1j99K85o5J35l30M6K14j19J15k02m3J3K24K78l81J90m5O9n3j37J70q0
4378E3j14K02k34Q8n1r8K38J82j27m04K9L22J38m47K16l7M5j7o0N0K23l45M53
$$ y = [-269, 48, -247, 90, -13, 145, 149, -60, 129, -46, -98, -271, -169, 68, 109, 43, -213, -90, -151, -126, -123, 57, -12, -15, -64, -20, 173, 54, 411, 142, 20, 15, 159, -162, -190, 113, -177, 346, 68, 58, 177, 49, -17, -52, 102, -376, 264, -371, 95, -215, 92, 28, -55, 42, 44, 64, -85, 327, -80, 28, 124, -77, -20, 330, -83, 123, 171, 158, 121, -119, -29, 153, 261, -28, 22, 100, -10, 0, -78, -201, 120, 61, 163, 16, -108, 187, 32, 212, -14, -21, 35, -137, 31, 27, -35, 116, -347, -155, 114, -36, -214, 9, -99, -131, 119, 135, -49, -90, 118, 42, 52, 11, 94, -103, -119, -90, -42, 51, 96, 19, -19, -100, -117, -95, 218, 1, -60, -104, 83, 11, -41, -193, 119, 40, 122, 153, 75, 177, 7, 157, 26, 9, 1, 38, -110, 29, -32, -231, 54, -11, 124, -206, -160, 54, -65, 50, -152, -195, -182, 42, 320, -61, 129, 84, 153, 100, -37, 133, 53, -61, 141, -93, -5, -56, -154, 84, 266, 139, -265, -236, 86, 224, -223, -7, -44, 1, -16, -76, -26, 197, -148, 305]
4401C05j32k27J41r9K6m2r4m4K67j19q6R2j86K61q6r1J56j84M52l99P9l8k41K69
4425b0n7K13nm8J45j37n2M6p5J74l85K12k11L01j10O2J01k95K55j9l07L55r5l3
4449A5J44j73J27K29j30j72p5l13L61j91J64j56MJ05p6M36l39n9j0R7J41k39P4
4472c6j92K13L7j37J60k88L28J9o1J22N9m05K02M05n60J0J26k30K54k89R4K22
4494E3j36n7K66l4q6j64K15k66R8K0j01K36PK20m14M7L49m77Q1j63LJ45L77j33
4518H6J07m13N46k22j9J9k32K33q0o1J55j20J46o0k59K38o4lJ22K5j76k5j44n7
4542b58K54J62j50j35K07l05L11k55J78j00J8K08Kk22N%J9j1K2qJ2q4K36k69K02
4567C9L2j14L82l83M2Q2Rr2m16M77l4J71m55K25j10K01n2l7J23M8j64K45l18J83
$$ y = [305, 173, -54, 87, -12, 14, -28, -122, -166, 101, -18, -104, -12, -198, 63, -23, -114, 42, -142, 310, -89, -10, -48, -289, -20, -77, 136, 131, 83, 228, 91, 39, 85, 10, 184, -201, 11, -200, 101, -9, 53, 154, -141, 114, 95, -212, 143, 48, 15, 159, -14, 113, 342, 212, 40, -35, -348, 13, -178, -14, -170, -166, -61, -137, 299, -40, -99, -109, -12, 129, -110, -36, -228, -15, 22, -115, 45, -243, 85, 104, 43, 165, 224, -181, 21, 426, -134, -124, 2, -228, 26, -263, -169, 53, -83, -140, 126, 92, 6, -158, 57, -209, -111, -91, -192, 44, 51, 271, -143, -96, 253, -224, -143, -306, -303, -158, 219, 86, 193, -220, 326, 104, 85, 104, -128, 105, 25, -36, 119, -1, 145, 85, -174, 64, 0, -3, 119, 144, -32, -57, -201, -258, -4, 158, 8, -127, 80, -225, 86, -169, 9, -91, -73, 135, 137, -85, -80, -80, -61, -72, -50, -58, -46, -130, 106, -163, 39, 71, -43, 339, -44, -2, 80, 89, -3, -419, 58, 24, 195, -260, -35, -145, 56, 4, -33, 90, 138, -26, 219, -99, 84]
4591H4J18m27K19J9j0p8o7J69r3k11M28p0j34P6k01K6L53j7j59o8k0M0K30k21
4615a4j35J08M3J5k45J46k8K3k80M01J76k46m7J76j66J26k52J84k0O1q8M4j7j38
4639a73K12k71J64J48k69K22k43j16L08k39L75jM8k39QP5j04J56j31m5L6j5K65
4662A71j54n5q2K06j06Kq2KL07j56l3m2m5J04L0k20J81p7J69k55J72Q3j63J62
4686A19k65K89k87J42Q8L1K7k86K18k70J9mJ94k25j44J82J58J82m34M05l2j43
4708c6j1O6n2q0J79j73K37p5k03j4J34K0k36L44M7j27n4K84l85J27J50j96k6r4
4732a74PJ89J26O5j76q5r6K8p2K99k55K32j32J35l93L20j33K9J69p2r6J1J61L45
4756D32m59Q2M3l30JL53o6j47M3K51q2j59R2L3r9q0J41j15J65l62L21j65nq0K53
$$ y = [84, 202, -225, -6, 13, 3, -75, -142, 27, -66, -277, 151, 81, -53, 23, -178, -152, 201, 184, 25, -43, -63, -23, 207, -14, -149, -41, 2, 17, -228, -82, -110, -87, -367, 34, 210, -36, -83, 93, -73, 53, -199, -15, -35, 26, -62, -18, -35, -173, 39, -232, -68, 80, -189, 33, -210, -326, -18, -257, 118, 117, 165, -74, -66, 9, -95, 61, -70, -115, -79, -94, 171, 17, -38, -120, 86, -20, -18, -100, -98, 209, 53, 20, -22, -67, 37, 67, -153, 28, -49, 120, -135, 37, 120, -43, 119, -146, 143, -144, -2, 86, 117, 144, -142, 76, -194, -175, -179, 15, -210, -354, -172, -14, 168, -266, 139, 107, -36, -47, 19, -33, -113, 66, -107, 130, 55, -148, -162, -28, -8, -244, 100, 147, 20, -34, 250, -135, -8, 142, -54, -80, -174, -167, 22, 148, 213, 37, -48, -144, -116, -188, 111, -144, 88, -44, 91, -302, 18, -115, -86, 83, 11, -85, -74, 87, 432, -27, 55, 98, -232, -231, 122, 56, -91, -48, 203, 121, -38, 54, 87, -12, -92, 49, -66, 99, -263, 58, -107, -112, -192, 61]
4781F1J5m8n7n0J73O3r0j06J97l83K98j93K73j20j07J80l62L28J39k08K22k74
4803d9J78j68q4J80j20J63r6L72n29P7K07p3M2j85J63j59J14J37l05L03m4k13
4825h9K09q1N9L7j10l27K48j76K8Q3J76q9K35l44J66o1O1j02j9J1J93l04K59R9
4849A62j55K1O4O4k18j48K79j62J52j57J45p4r9K58k98J68J23j28J67j10L1K4
4871A09K8o7P1k8j70j5q1J11J7K2K26j85k36R7O9J24m76N51j34JJ89j63n8J2O2
4896G6j26J6M0o1J32k9k0n8r0K02J1j00Mm7m7J18K28j86l2N4L4j5n7O7r6n6O2
4923B4J89l18J76R6k27Q7p9J07k17j7L26q6j05j32N8J49K56j92j9PR8k25j03p8
4947b25L10L8j06k85K06J38q8k2j10PR3J0j29J35R0K3j40J22j46O3k49J72M2l5
$$ y = [61, 76, 28, -29, -79, 94, 157, 67, -39, 158, -225, 73, -120, 153, 33, -74, 106, -256, 72, 211, 3, 225, -49, 129, -39, -123, 57, -63, 100, 4, 376, -153, -76, 131, 58, 100, -85, 78, -81, 33, 170, -135, 168, 124, -89, 120, 39, 98, 135, 25, -302, -54, -230, -202, -119, 57, -32, 203, -141, 25, -36, 25, -77, -96, -85, 108, -196, 63, 162, 7, 28, 92, 156, -62, -210, 69, -93, 59, -98, 47, -27, -126, 132, -166, 2, 125, -3, 164, 54, 85, 109, 137, 70, 141, 113, -57, -72, -153, -42, -25, -3, 223, 38, -198, -101, -32, 92, -384, 167, 33, 34, 223, 60, 2, 14, 76, -50, -34, 6, -55, 77, 48, 28, -30, -120, 82, 93, -7, -3, -50, -97, 21, 249, 63, 31, 85, 119, 104, 47, 114, 18, -38, 24, 213, -105, 71, 167, -60, 27, -52, 55, -162, -179, 147, 61, -44, -176, -118, 31, 287, 95, 76, 83, 181, -44, -147, -225, 85, 123, 17, -268, -62, 76, -12, -34, -144, -137, -44, -34, -163, -28, 62, 85, -55, 67, -79, -16, -265, -93, -51, -86]
4971h6r3p5M0P4j90K86l16M47J7j88Q6j66K14j37j43K91j27J68j40J57k36Q0p7
4994a14K17k13M8o6Q2R1O8j36m8Mj32L06j18J31l27L44l6k30j89L75l00K82k08
5017a69oo7N8L28m18P7K41r6L9j68j85M14j14R0K3j9r7R1j31K31j33j90jn1J97
5042e6o7J6L90n16J32N7%J24m8j70j37M16l01n3K88j85M3J72p8K39o20K67L08
5065B21k22j04O1J89k7k18L18j02p2M3k76K75l21L75j33K75m07K1J02j07J71m6
5087A6O8n9K6k50K44m9K52k42l09L73k75R3Q5Q2j58L2J80j22l7N9q9P0M4j63k18
5112c47L76J09O2j77j40K28j3o5n7J64j85L26k90K01k32R8M3j17j65J63q7J82
5134G7q0JK2j36m0M0K35j92J66k23N1r8j25L34J41k01j94J47J5J56l45L21l15
$$ y = [-86, -179, -254, -214, -140, -330, -44, -360, 87, 104, -84, 2, -164, 50, -87, -230, 61, -66, 102, -38, 119, -117, -37, -114, 103, -110, -62, -128, -46, 45, 113, -23, -71, -67, -199, 107, -11, 120, -207, 137, 101, -129, -318, 57, -243, 39, -169, -175, -242, -184, 144, -274, -197, 44, -52, -13, -181, -366, 48, -66, 24, 47, 28, -69, 22, -109, 122, -11, -201, -202, -253, -56, -123, -107, 283, -233, -101, -44, -44, 80, 32, -138, -275, 141, -160, -213, 75, -110, -67, 105, 27, 266, -354, -87, 221, -1, -105, -44, 145, 118, -100, 218, 116, 44, 87, -189, 86, -235, 140, 7, 282, -125, -104, -2, -109, 62, 16, 84, 25, 51, -199, 45, -4, 248, 6, -303, 70, -205, -112, -27, 55, -103, -71, 109, -13, -50, 9, -80, -10, 34, -129, -347, 29, 138, 200, 23, -117, 111, 98, 33, -24, 140, -45, 281, -9, 192, -40, 58, 101, -16, -181, -18, -105, 77, -3, -2, 20, -116, -156, -116, 119, -73, 93, -130, -79, -177, -302, 32, 173, -28, -222, -75, -60, 96, -249, 72, -243]
5157b43K04J95l23l3L4J38J43j03j36L16m02N52m69j04R3J83Q5l69L66j09k7J67
5179A58J19j57qn8J42k47j7J03l5P0J58o0j50K15l80J72Rj62J72K1O2p6q9n2J79
5204H9L7j29K06j87k40L17l75K95O7L4r2j73M3l9M08j47k13%J77l5j3J6K7J2j22
5229c7j6K18k38K26k48L31k14O3K7j82m2N4J51q3J10j16N2j86J16N4j14J46k52
5252a80M18j26l1k01R1N7J06j6j63K8j18M43k61k22J64K87l55R3l5n1J81k21O7
5275d5k1K41l24K19o1j1j32K23j79K13m5p0L7l0J66o3j20K24l12L6K1j4J0J51
5299A14j26J03Pk4j07o1J46Rj6j80J38o4K04r7K77j77j50j05K57j21J32j60J09
5322A08j56J87l98J70J39j39r9K14J7N0J3j00j65j15K66m9J69l16K34J31k58J51
$$ y = [-243, -39, 156, -167, -200, -166, -28, 115, 12, -124, 192, -210, 342, -127, -231, -138, 45, 130, -239, 127, 18, -9, 158, 277, 120, 112, 54, 196, -51, -68, 35, 0, 70, 228, 168, 18, 233, -147, 25, 34, -128, 44, 65, 127, 51, -38, -90, 89, 126, -3, 203, 16, -224, 93, -282, 13, 80, 114, 22, -151, -108, -147, 261, 114, -99, -99, 78, 43, 30, 46, 73, 85, -37, -53, 165, -73, 153, -95, 236, 22, 85, 112, -70, -112, -58, 93, 10, 120, 4, 56, -130, -14, 40, -74, 72, -180, 238, 112, 81, -120, -29, 28, 134, 118, -45, -17, -135, 308, 47, -175, -11, 276, -79, 14, -21, -72, 109, -112, -45, -66, 175, -149, 70, 9, -2, -134, 89, -90, 123, 78, 8, 45, 15, 181, 118, -2, 222, -90, -54, -33, -47, -37, 114, -12, 91, 98, 74, -33, -94, 52, 61, 45, -135, 3, -61, 143, 46, 323, 146, -4, -109, 148, 27, 159, -1, 108, -48, 139, -259, -89, 50, -89, -188, 26, 43, 93, 106, 6, -159, -274, -8, -57, 112, -204, 30, 161, -97, 54]
5344E4k5n5j44J13L02k47k5J57j85J43m9k05R6N2j84J20K12k46J76j15N1K37j34
5367I9r8r9l3QlK46J91l64j8Q7J18j78k13L23L7k59R8J3R3RjP6j15J63o5l17J46
5394e6j33J14j01J46L00l23K36j15R9j61j99K32l73L90j70J15N6J6P3r1j0j83
5416a38J5M02k40M17m95L1k3J21pk10L19k39L10l86L33k99K5P2K2m0KJ20j42Q2
5440E2J08q8n9lP1l60M65J04j98k00p3K38j07K24l56j24L29J35j6k81J91k7Lq1
5464e3J76k07j86K01J69j77J61L4m7Nk04P3L91j28j73j22L21j34nj35K20k15j8
5487e3R9m80K60K3J89j54m7J44q8K19m3kj43J3k24J51P6K16k89K17j14J12K60
5510C42%m92K53p4p7J6l0K39r1j99R2J23j86J21on5k43L87j65J74M2k86J68l25
$$ y = [54, 29, -26, -170, -57, 245, -2, -27, 130, -55, 88, 39, -166, -70, -18, -202, -82, 130, -116, 60, -55, -4, 233, 99, 1, -98, -131, -123, -126, 120, 311, -53, -71, 16, 134, -44, -257, 66, 103, -156, -58, -45, 48, 57, 56, 132, 17, 180, 115, -202, -56, -189, -75, -176, -30, 270, -53, 183, 68, 167, 6, -193, 39, -334, 56, -114, 1, 57, 73, 146, 55, 45, -138, -123, 279, 39, 456, -39, -8, -31, 90, 83, -127, 192, -47, 263, -123, 210, -89, -64, 8, 30, -10, -8, 112, -30, 52, 160, 72, 13, 10, 81, -279, 186, 290, 92, -108, -181, 57, -50, 174, -182, -306, 23, 158, 142, -139, 52, 25, 28, -53, 123, -84, -270, -69, 100, -77, 84, 118, 71, 76, -128, -55, 336, 208, 35, -87, 234, 100, 95, -40, 180, -35, -53, 46, -434, -174, -151, 38, -116, -163, -19, -107, 112, 69, 67, -76, -63, -287, -136, -60, 156, -133, 84, -30, 82, 342, 342, -150, 103, 29, -48, -32, -62, 177, 86, -113, -21, 102, -84, 37, 31, -24, -267, 120, -45, 129, 171, -115, 53, -272]
5534b72L70j83O1q5L03R6l30p2K4Q9o6P6M4l6j61J13J73k20K7K16j68J8k94K30
5558d7J04j30r0K85j87l8k0M5L84j48l09K97j95K48m17N65m42J75M4q2r5N0p7
5581h0K54l99K75J54m81o1L58J90q9P9j51l3j34J88j34q7K83l39L75M8k00L1J15
5604A62M8m01jJ44Oj10K93k08J44J75n64J91K02Q4k03k8J44l55M51k14J88p7q9
5627a8ON3j62M9r3J80L1q5K12j46J6q5J83k86QR9j42p7K14J95r4m3M6j09j37L1
5653a54K46j8K19l17k5J43j55r8L6K05k11J03N5j98J18L01k23r0Q2j2j5p7r5J11
5677f9j63J67K46m08L20j46p9K90n62J22m2L85M8m1J21j57l0m7J06O2Q6l74P9
5700h6k5J11l61L23P1n5K3m3K24j32j1P7l05J98l6j52K36j52J91R0k28J52m2P0
$$ y = [-272, 98, -85, -24, -109, 194, 290, -40, -112, -88, 1, -65, 11, 55, 19, -142, -29, 144, -76, -49, 167, -1, 17, -277, -47, 57, -73, -163, 122, -65, -103, -123, -78, 306, 158, -151, 146, -49, 199, -218, 347, -95, 80, 124, 42, -53, -3, -80, 174, -225, 50, 204, -277, -338, 20, 210, 121, 200, 49, 16, -118, 70, -64, -151, 132, -207, 168, 216, 16, 47, 162, 210, -191, -192, -48, -42, -152, 141, -67, 77, 252, -312, -121, 81, 165, -38, -66, 78, -277, 174, -40, 148, 71, -18, -12, 41, -121, -72, -165, 15, 46, -39, 173, 27, 43, -42, 141, -145, -137, -38, -180, -257, -43, 152, 58, 15, 61, -48, -185, -154, 92, 74, 293, -24, -49, 94, -61, -159, -123, 82, -129, -26, 29, -169, -51, 250, 27, -63, 19, 7, -8, -85, -180, -69, -232, -65, 181, -227, 93, -53, -132, 158, -404, -282, -324, 61, 109, 68, 189, 32, 2, -45, 61, 123, 209, -165, -86, -111, 0, -361, -38, 33, -22, 1, -42, 182, 50, 39, 116, -189, 9, -27, -179, 57, -95, 96, 186, -42, 110, 68, 138]
5724A38P9k15j63J17O1k44K08o1O2L2k34L30J44n4j14j18K30m00M6J99r3K02l90
5747b38K15j91L66l83L50J29m77pR3K21o8q7J68o5L5K6J30m45J13N5MO5j06m5
5771a42N6m0oL67l61j45K20J60l53J73J94k17j95K42K90j52k11J62j63J47L3J34
5793A93j65j82K32j93K77j35k1K61k00K21n71M70j55o6P7j3l70p3M75J5m8j09
5815h0M42k92o4J86o6q3j55O5j30L68k43P1k49K91k20q8J73P7M3J9j25j8r4%N5
5840a17j42N68l12j1P2J4l1n2J84j63J12k18k9K64j3k16K77j91J4J19j10O7l79
5863b93K02K51k08P4R1j47L63n09K72k40O5L6N6k40J55J19J54k36J43j16j29L23
5885A86q5j54K71J35l32R0j20l7O5pP7n8K4l84K84J66k79J02OJ25n1l0oo5K15
$$ y = [138, 217, 2, -161, -44, 17, -227, -19, -80, -18, 14, -220, 110, 254, 200, 86, -32, 198, -202, -156, 43, -50, 152, -238, -23, -214, 152, -231, 119, 248, -229, -236, -143, 78, 10, -77, 91, 26, 61, 87, 217, -228, -115, -60, -56, 9, -97, -142, -86, -126, -132, 235, -126, -271, -51, 109, -244, -71, 123, -94, -289, -47, 243, 91, -120, 42, -121, 26, 59, 193, 28, -154, 78, -115, 162, 27, 6, 267, 67, 288, -283, 187, 32, -34, 43, 30, -340, -413, 62, 77, 29, -80, 362, 70, 6, 192, 126, 43, -112, -47, -177, 191, -52, 19, -230, 61, -159, -247, -74, 3, 46, 65, -60, -78, -172, -172, -117, -259, 309, -3, -14, 58, 72, 41, -11, 173, 10, 122, -96, -125, 139, 126, -90, 187, -4, 10, 129, 19, 86, -293, -91, 160, -48, 26, 117, -30, 333, -176, 96, -144, -79, -43, 13, -227, -72, 47, 201, -35, 108, -8, -137, 186, 101, -53, 218, 353, 21, 111, -9, -46, 19, 12, 89, 31, 55, -329, -45, 121, -158, -56, -50, 75, 24, -6, -12, -77, 138]
5910A38k9o4Q2k1R4k82MQ9q4K78k38K84l91J94j6o4%R1j15O1k04K28k45M41m92
5935b61L27R3k09M0J78r9l5l4P5J17r2R1k15O9o7J31P4p9j84J99Kl9j63M4k9J92
5961A26j73J24j12P5Q7o3Q4k91J74k64L80k62k8L08j85J31Rj28j8j73M33k59P8
5984E3j19p9J13p9K69p5r2M7J31k42P6P8K9k91K53q0r7M83j56j14j37j11K40l51
6008b51K82R1k4o7k22K05R8k21K2J60m6J18j04j35N9J85j49M5J49j76k93J39K71
6031A36n6O8l00L34j38r0j66J00K4j64J54m5J18J27k7k24J90J76r9j51J94Pk20
6054e2M2p7L4j46K55j19K16k03L5j42m9K84j66J51j47k6Q0K39l76J04j92L20r2
6077b7j99K66j56K13j78k85M79j87q9L00k6k08J29j29j16R4J09N9j13L01k31k
$$ y = [138, 109, 45, 127, 106, 200, -82, -78, 11, -73, 205, -33, 251, -140, 54, 38, -26, -26, 65, -50, 11, -193, 35, -210, 231, -261, 66, 159, -50, -10, 168, 69, 34, 0, 75, 192, 100, 191, -24, 45, -22, 109, 183, 104, -80, 119, 121, 82, -81, -37, -66, 126, -47, 77, -35, 40, 127, 64, 148, -143, 31, -233, 147, -115, -143, 165, -20, 111, 120, -8, -26, -199, 234, -25, 53, -66, -145, -32, -111, 158, 83, -9, 38, 169, -73, 3, 81, 110, -181, 72, -8, -105, 378, 222, 108, -29, -140, 100, -251, 31, 122, 98, 31, -191, 14, 112, -109, -87, 73, 27, 145, 41, -94, -35, 150, 1, 46, 195, 19, -274, -135, 136, 80, 148, -152, 182, 44, -46, -212, -112, -88, -252, -98, -143, -25, 102, 75, -149, 41, 217, 118, -33, 161, 168, -52, -10, -87, -53, -199, 56, -63, 153, -50, -15, -157, -206, 78, -88, 63, -84, -110, -30, 209, -167, -63, -255, 65, -27, -226, 40, -116, 97, -81, -366, 113, -74, -163, 137, 111, -97, 32, -97, -213, -119, -10, 49, -64, 237, 6, 4]
6099Dj68K13M7n1l3O4k58J15J60j58n6j98L76j30J01k06P6K0L7K92k94j7J05l7
6123DN3M1oj01J19j62J2L2J69K0l05J54k21K76l8j13L09k54k26J9M74l56P3j42
6147a69Q2L76k32k5O9j35r5O7N9M9M0n5p4n3k3L94k11l17K74k41L19k40K77J6
$$ y = [4, -164, 49, 96, 45, 12, 76, -182, -67, 93, -65, -121, -319, 57, -73, 28, -178, -102, -82, -45, 247, -47, -64, 41, 4, 57, 98, 92, -9, 110, -52, -40, -8, 161, 181, -124, 30, -191, 85, 47, -66, 243, -11, -237, -218, 256, -100, -27, -169, -87, 289, 57, 32, 101, -34, -129, -62, -3, 46, 86, 31, -43, -96, -119, 275, 64, -253, 21, -220, 99, -141, 136, 152]
$$ [...]
8191E1
##END NTUPLES=NMR FID
##END=
