##TITLE=1H_Ser 5-2
 CDCl3, 8 sc, 
 25.8.2020
##JCAMPDX= 6.0         $$ Bruker NMR JCAMP-DX V2.0
##DATA TYPE= NMR FID
##DATA CLASS= NTUPLES
##ORIGIN= UXNMR, Bruker Analytische Messtechnik GmbH
##OWNER= root
$$ XWIN-NMR		Version 3.5
$$ Tue Aug 25 12:04:32 2020 Russian Standard Time (UT+4h)  she@DPX200
##.OBSERVE FREQUENCY= 200.1314999998
##.OBSERVE NUCLEUS= ^1H
##.DELAY= (6, 6)
##.ACQUISITION MODE= SIMULTANEOUS
##.ACQUISITION SCHEME= undefined
##.AVERAGES= 8
##.DIGITISER RES= 18
##SPECTROMETER/DATA SYSTEM= spect
##.PULSE SEQUENCE= zg30
##.SOLVENT NAME= CDCl3
##.SHIFT REFERENCE= (INTERNAL, CDCl3, 0, 15.7039)
##AUDIT TRAIL= $$ (NUMBER, WHEN, WHO, WHERE, WHAT)
$$ ##TITLE= Audit trail, XWIN-NMR		Version 3.5
$$ ##JCAMPDX= 5.01
$$ ##ORIGIN= Bruker BioSpin GmbH
$$ ##OWNER= she
$$ F:/spectra/data/she/nmr/H-F/1/audita.txt
$$ ##AUDIT TRAIL=  $$ (NUMBER, WHEN, WHO, WHERE, WHAT)
(   1,<2020-08-25 12:03:05.25 +0400>,<she>,<DPX200>,
      <created by zg, POWCHK disabled, PULCHK disabled
       configuration hash MD5:
       00 E9 B6 7A A2 85 ED C7 34 08 36 98 17 FE 4E 26
       data hash MD5: 16K
       F5 AF 55 43 C1 24 B2 8D 2E 3A AA 34 C3 63 57 67>)
$$ ##END=
$$ 
$$ hash MD5
$$ 42 AA CB DB 53 9F 2D 25 A9 C8 1E B6 12 CD 8F 72
##$RELAX= 
##$RELAX= 
##$RELAX= 
##$RELAX= 
##$RELAX= 
##$RELAX= 
$$ Bruker specific parameters
$$ --------------------------
##$DU= <F:/spectra>
##$EXPNO= 1
##$NAME= <H-F>
##$PROCNO= 1
##$TYPE= <nmr>
##$USER= <she>
##$AMP= (0..31)
100 100 100 100 100 100 100 100 100 100 100 100 100 100 100 100 100 100 
100 100 100 100 100 100 100 100 100 100 100 100 100 100 
##$AQSEQ= 0
##$AQ_mod= 1
##$AUNM= <au_zg>
##$AUTOPOS= <>
##$BF1= 200.13
##$BF2= 200.13
##$BF3= 200.13
##$BF4= 200.13
##$BF5= 200.13
##$BF6= 200.13
##$BF7= 200.13
##$BF8= 200.13
##$BYTORDA= 1
##$CFDGTYP= 0
##$CFRGTYP= 5
##$CHEMSTR= <none>
##$CNST= (0..31)
1 1 145 1 1 1 1 1 1 1 1 1 1 1 1 1 1 1 1 1 1 1 1 1 1 1 1 1 1 1 1 1 
##$CPDPRG= <>
##$CPDPRG1= <>
##$CPDPRG2= <>
##$CPDPRG3= <>
##$CPDPRG4= <mlev>
##$CPDPRG5= <mlev>
##$CPDPRG6= <mlev>
##$CPDPRG7= <mlev>
##$CPDPRG8= <mlev>
##$CPDPRGB= <>
##$CPDPRGT= <>
##$D= (0..31)
0 1.2 0 0 0 0 0 0 0 0.06 0 0.03 0 0 0 0 0.0002 0 0 0 0 0 0 0 0 0 0 0 0 
0 0 0 
##$DATE= 1598342584
##$DBL= (0..7)
120 120 120 120 120 120 120 120 
##$DBP= (0..7)
150 150 150 150 150 150 150 150 
##$DBP07= 0
##$DBPNAM0= <>
##$DBPNAM1= <>
##$DBPNAM2= <>
##$DBPNAM3= <>
##$DBPNAM4= <>
##$DBPNAM5= <>
##$DBPNAM6= <>
##$DBPNAM7= <>
##$DBPOAL= (0..7)
0.5 0.5 0.5 0.5 0.5 0.5 0.5 0.5 
##$DBPOFFS= (0..7)
0 0 0 0 0 0 0 0 
##$DE= 6
##$DECBNUC= <off>
##$DECIM= 24
##$DECNUC= <off>
##$DECSTAT= 4
##$DIGMOD= 1
##$DIGTYP= 9
##$DL= (0..7)
0 120 120 120 120 120 120 120 
##$DP= (0..7)
150 150 150 150 150 150 150 150 
##$DP07= 0
##$DPNAME0= <>
##$DPNAME1= <>
##$DPNAME2= <>
##$DPNAME3= <>
##$DPNAME4= <>
##$DPNAME5= <>
##$DPNAME6= <>
##$DPNAME7= <>
##$DPOAL= (0..7)
0.5 0.5 0.5 0.5 0.5 0.5 0.5 0.5 
##$DPOFFS= (0..7)
0 0 0 0 0 0 0 0 
##$DQDMODE= 0
##$DR= 18
##$DS= 0
##$DSLIST= <SSSSSSSSSSSSSSS>
$$ [...]
##$SUBNAM2= <"">
##$SUBNAM3= <"">
##$SUBNAM4= <"">
##$SUBNAM5= <"">
##$SUBNAM6= <"">
##$SUBNAM7= <"">
##$SUBNAM8= <"">
##$SUBNAM9= <"">
##$SW= 24.9337058888022
##$SWIBOX= (0..15)
0 0 2 0 0 0 0 0 0 0 0 0 0 0 0 0 
##$SW_h= 4990.01996007984
##$TD= 16384
##$TD0= 1
##$TE= 0
##$TE2= 300
##$TE3= 300
##$TEG= 300
##$TL= (0..7)
0 120 120 120 120 120 120 120 
##$TP= (0..7)
150 150 150 150 150 150 150 150 
##$TP07= 0
##$TPNAME0= <>
##$TPNAME1= <>
##$TPNAME2= <>
##$TPNAME3= <>
##$TPNAME4= <>
##$TPNAME5= <>
##$TPNAME6= <>
##$TPNAME7= <>
##$TPOAL= (0..7)
0.5 0.5 0.5 0.5 0.5 0.5 0.5 0.5 
##$TPOFFS= (0..7)
0 0 0 0 0 0 0 0 
##$TUNHIN= 0
##$TUNHOUT= 0
##$TUNXOUT= 0
##$USERA1= <user>
##$USERA2= <user>
##$USERA3= <user>
##$USERA4= <user>
##$USERA5= <user>
##$V9= 5
##$VALIST= <valist>
##$VCLIST= <CCCCCCCCCCCCCCC>
##$VD= 0
##$VDLIST= <DDDDDDDDDDDDDDD>
##$VPLIST= <PPPPPPPPPPPPPPP>
##$VTLIST= <TTTTTTTTTTTTTTT>
##$WBST= 1024
##$WBSW= 4
##$XGAIN= (0..3)
0 0 0 0 
##$XL= 0
##$YL= 0
##$YMAX_a= 27624
##$YMIN_a= -50256
##$ZGOPTNS= <>
##$ZL1= 120
##$ZL2= 120
##$ZL3= 120
##$ZL4= 120
##$ABSF1= 10
##$ABSF2= 0
##$ABSG= 5
##$ABSL= 3
##$ALPHA= 0
##$AQORDER= 0
##$ASSFAC= 0
##$ASSFACI= 0
##$ASSFACX= 0
##$ASSWID= 0
##$AUNMP= <proc_1d>
##$AZFE= 0.1
##$AZFW= 0.1
##$BCFW= 1
##$BC_mod= 2
##$BYTORDP= 1
##$COROFFS= 0
##$CY= 11.3945322036743
##$DATMOD= 1
##$DC= 2
##$DFILT= <>
##$DTYPP= 0
##$F1P= 16.9975609425685
##$F2P= -3.02152046262296
##$FCOR= 0.5
##$FTSIZE= 0
##$FT_mod= 4
##$GAMMA= 1
##$GB= 0.15
##$INTBC= 1
##$INTSCL= 1
##$ISEN= 128
##$LB= 0.24
##$LEV0= 0
##$LPBIN= 0
##$MAXI= 10000
##$MC2= 0
##$MEAN= 0
##$ME_mod= 0
##$MI= 1.114404
##$NCOEF= 0
##$NC_proc= 0
##$NLEV= 6
##$NOISF1= 3.799351
##$NOISF2= 2.8
##$NSP= 1
##$NTH_PI= 0
##$NZP= 0
##$OFFSET= 15.70392
##$PC= 1
##$PHC0= -9952.828
##$PHC1= 7.400921
##$PH_mod= 1
##$PKNL= yes
##$PPARMOD= 0
##$PSCAL= 0
##$PSIGN= 0
##$REVERSE= no
##$SF= 200.130013532006
##$SI= 16384
##$SIGF1= 3
##$SIGF2= 2
##$SINO= 400
##$SIOLD= 16384
##$SREGLST= <1H.CDCl3>
##$SSB= 0
##$STSI= 0
##$STSR= 0
##$SW_p= 3612.71676300578
##$SYMM= 0
##$S_DEV= 0
##$TDeff= 0
##$TDoff= 0
##$TI= <>
##$TILT= no
##$TM1= 0
##$TM2= 0
##$TOPLEV= 0
##$USERP1= <user>
##$USERP2= <user>
##$USERP3= <user>
##$USERP4= <user>
##$USERP5= <user>
##$WDW= 1
##$XDIM= 8192
##$YMAX_p= 0
##$YMIN_p= 0
$$ End of Bruker specific parameters
$$ ---------------------------------
##NTUPLES= NMR FID
##VAR_NAME=  TIME,          FID/REAL,        FID/IMAG
##SYMBOL=    X,             R,               I
##VAR_TYPE=  INDEPENDENT,   DEPENDENT,       DEPENDENT
##VAR_FORM=  AFFN,          ASDF,            ASDF
##VAR_DIM=   8192,          8192,            8192
##UNITS=     SECONDS,       ARBITRARY UNITS, ARBITRARY UNITS
##FACTOR=    0.0002004,     1,               1
##FIRST=     0,             0,               0
##LAST=      1.6414764,     0,               0
##MIN=       0,             -50256,          0
##MAX=       1.6414764,     27624,           0
$$ Real data points
##PAGE= N=1
##DATA TABLE= (X++(R..R)), XYDATA
$$ [...]
1114d02J072j43r66k25R43N19r76q02O73J023l18j246j60J208P85r55j107K90
1132g87J343J4j230m66R45R44m99j175Q7J155N34r67r22N09Q13k19q51l9J094
1151B83M60r59r04N53J393j22j466n95J143R62m65j073N3J150K95j106p58Q58
1169b98J060m61j100p7R57N43o33p11L58R21k16j229j68J231P51q48j054K63J381
1188F70M06j195r27P08J041l87j004J15J116M37r00p06O13Q46j63j013j33J023
1206E47L87p07p43N35J101K1j103o42Q28J079m53j202k9J188M66r52o68O71Q38
1225A162l81j218j39J155O65r12p86M88R00k60r97k61P91O67o47j020J53J138
1243D98L02r76o92O81Q90l04j095l43J182P29q52j044N14J059j0r34l07O20L99
$$ plain form
1114 -402 670 527 -439 -664 279 798 -178 -980 -307 716 398 -848 -1008 200 985 30 -1077 -787
1132 -787 556 570 -660 -1126 -181 763 264 -911 -824 331 865 -102 -1024 -515 298 79 -772 -811 283
1151 283 743 -216 -1120 -567 826 704 -762 -1357 -214 748 283 -790 -737 413 708 -398 -1156 -298
1169 -298 762 301 -799 -876 81 624 -9 -720 -362 559 343 -886 -1054 177 928 80 -974 -711 670
1188 670 1076 -119 -1046 -338 703 316 -688 -573 543 980 80 -626 -13 833 670 -343 -476 547
1206 547 934 227 -516 19 1120 1141 38 -604 224 1303 850 -352 -381 807 1273 321 -347 324 1162
1225 1162 781 -437 -576 579 1244 332 -454 34 934 674 -323 -584 207 874 227 -793 -640 498
1243 498 800 -176 -868 -187 703 399 -696 -1039 143 872 20 -1024 -510 549 539 -395 -702 -82 317
1262C17n17o29M33R75L3j052m22P99P54m18j108j09J077P61p99j082K60J213K48
1281G34r17n40M27M56k67l81K37O29k61q15p5J135O04j001j286K08J382P30q80
1300A19j239J19J219M40p60p11K47N46q8l40J65M34k07n70N2R35K50j063p86N86
1320f52J301L20j181r52N99J266M78r96q16K34O91J27l15r2K31Q6k34O3M98Q3
1340G39q70n17Q33R24j62j190n87Q85J185p2j214o53M62Q08Q4m37k37j1O9o3J47
1361A23L80N3p65n68M85R33j48r96k01Q47N85m59q73O1P17J44o24l06M73M42j65
1382A38l11k59K54K54o3k99m3M80p0n07o2O22M87n75p64K38R21R6r55m23Q39O47
1404F45m87p67K45O32M8m65l38J98L66n1j65j35K96K10j99l47r7M17J92n13l62
$$ plain form
1262 317 -200 -829 -396 579 612 -440 -862 -63 691 273 -835 -944 133 894 95 -987 -727 486 734
1281 734 -183 -723 -296 160 -107 -488 -251 378 117 -698 -773 362 966 -35 -1321 -1113 269 999 119
1300 119 -1120 -1001 218 658 -102 -813 -566 -20 -108 -448 -283 151 -56 -626 -574 361 611 -452 -1238 -652
1320 -652 649 969 -212 -1164 -565 701 1179 183 -633 -399 292 419 104 12 243 329 95 158 656 739
1340 739 -131 -648 185 1109 947 -243 -830 55 1240 1168 -46 -699 -237 571 655 218 -19 -30 39 -24 123
1361 123 503 556 -209 -777 -292 641 493 -503 -704 143 728 269 -604 -543 174 318 -306 -612 -139 303 138
1382 138 -173 -432 -178 76 13 -286 -329 151 81 -426 -488 134 621 46 -718 -480 441 537 -418 -841 -2 645
1404 645 158 -609 -364 268 316 -149 -487 -289 77 26 -139 -274 22 232 33 -314 -411 6 198 -315 -677
1425f77Q20O29p39j045L18J350K64j074r07M62R44rn36n4L72q1k50J13L31o7k89
1446a25k53P5O72M29n06q58O1J095N27r07j015L35J138J65q80k96Q49K32p09k97
1466b68O88M20o37m64K69O57l2n23j55L89M86j81o00m59L06P87J56q40n65O92
1486A26R50n14j026K11P39rp64Q8Q57lr97l84R65Q43n22j129m7O84M55k29m65
1507a71j81K71M97j98n08m5N34J90p59l42O92O72o00p93L65J093k54j250k97J184
1527A00O71q61p23M41P02m1o70j26L81L17k21l88k23M05M49p9n30j19N70L14p97
1548d28m91P75Q63p57j045L98J273Q7j064m74O89O17n21n90L62N88j44m32o3L77
1568B0L72j21n34l77M42P13q2o80l11P43M31n49m69M57O15m77r86K90J210J39
$$ plain form
1425 -677 143 772 33 -1012 -694 656 920 -154 -1061 -599 345 336 -200 -254 118 37 -213 -100 231 164 -125
1446 -125 -378 -303 369 798 292 -566 -505 590 1117 210 -805 -470 668 833 -47 -343 506 738 29 -268
1466 -268 420 840 203 -261 8 665 633 110 -45 344 830 649 49 -410 -104 683 839 -1 -566 126
1486 126 1076 562 -464 -253 486 477 -287 -199 658 655 -342 -726 239 1082 560 -569 -616 68 523 294 -171
1507 -171 -352 -81 416 218 -290 -335 199 389 -370 -712 -20 652 52 -741 -376 717 463 -787 -1084 100
1527 100 771 -90 -813 -372 330 289 -381 -507 -126 191 -30 -418 -641 -236 213 134 -396 -515 55 369 -428
1548 -428 -919 -144 719 -38 -1083 -685 588 675 -389 -863 -174 443 -78 -668 -306 282 138 -294 -357 20
1568 20 392 271 -263 -640 -198 515 433 -247 -558 185 616 67 -402 55 670 193 -793 -503 707 846
1588H46r60n01P38O53m39o53mN65K89l95k99J68M49K6l89k13J88M13p6o98q8Q19
1610D39L98p04o12O15P94l54r47j1Q27L69q35m93N02P69q4o90j32L67R6k14k77
1631a77P7M08J13m54l70M02O48j61q89k94P92N88n24q68L18Q11k4q17o4P20K36
1652D71o84n18M10O84j03n27j52M06L40l04n10k4N15J50l29m23J97P22J0p27l01
1673f97O56M51m76n94K60O88j3o84k62P19M22m40n82J38O27k0m72j67L23N25p1
1694C31o18j19M05M05m71m57K40O46j2n18k27M50N49l86p11J83O98L3o28j63N38
1715A68L99l42n59Q7N81J81m66m28K83M74j6l58j51L78L70m55m79J56O01R7n57
1736c6k95N42M36l08n42K8O11J01n92l84M27O38j89o24P0L33K61l18l33J04L97
$$ plain form
1588 846 -114 -615 123 776 337 -316 -320 245 534 139 -160 8 457 483 94 -119 69 482 406 -292 -380 439
1610 439 837 133 -479 136 930 576 -371 -382 445 814 -21 -514 -12 757 673 -17 -149 218 314 100 -177
1631 -177 -100 308 421 -33 -403 -1 647 486 -403 -697 95 683 159 -709 -391 420 396 -421 -485 235 471
1652 471 -213 -731 -321 363 260 -267 -419 -13 327 23 -487 -511 4 154 -175 -598 -401 321 331 -396 -697
1673 -697 -41 410 -66 -660 -400 288 275 -409 -671 48 470 30 -552 -414 213 193 -279 -446 -123 402 331
1694 331 -287 -406 -1 404 -67 -524 -284 362 350 -168 -395 55 604 218 -493 -310 388 421 -207 -370 168
1715 168 567 225 -334 -247 334 515 49 -379 -96 378 362 4 -147 231 601 146 -333 -177 424 521 -36
1736 -36 -331 211 647 339 -203 -175 436 537 -55 -439 -12 626 437 -187 -117 216 477 159 -174 -70 327
1757C27k1n27j73O19L79m62m77N1M91K33n99l57L97N13j53n84M4N52J06m27l94
1778d62K37M26n7m66q7M62K64l41l75J22M19K5m47l33M26M37j83n81K7O18J61
1799B92m90l51K29M29q9l68j07L75L22l86k77K97L52k07m82j07M47M45k72n62
1819e10J79M98J62n33k69K69M78j68l76j34M69L48l14l86J08L84j84l02j7M56
1839A58J85m16m11M05O91o4p47l05M58M04k4m66p0M59K13k72l80J74L54j1m47
1860a12mL70Q6k93j09K11L98j06p02l9N51L76m03n75R4N90K42l81l89J14M10n2
1882B77l52j21L55J11j49k34K07K73k18m60K8N43K35n34m96K74O28P9n29k60J96
1903a47M31n8m26j18K59J45k08r2K33K10j55l95K9K94J50m27k53M13M97j61n80
$$ plain form
1757 327 306 -221 -394 225 604 142 -335 -284 207 440 -159 -516 -119 394 241 -343 -299 253 359 -68 -462
1778 -462 -225 201 144 -322 -409 53 317 -24 -399 -277 142 167 -280 -613 -187 250 67 -514 -487 131 292
1799 292 -198 -549 -320 109 20 -348 -455 -80 242 -144 -421 -124 228 21 -461 -568 -121 324 52 -510
1819 -510 -331 167 329 -204 -473 -204 274 106 -270 -404 65 413 99 -287 -179 205 21 -281 -298 158
1839 158 343 -73 -484 -79 612 548 -199 -504 -46 358 334 -132 -202 257 470 198 -182 -8 346 335 -112
1860 -112 -116 254 340 47 -62 149 547 441 -261 -300 251 627 224 -351 -257 333 575 194 -195 -81 329 277
1882 277 -75 -196 159 270 121 -113 94 367 149 -311 -283 260 495 -39 -535 -261 367 446 -83 -343 -147
1903 -147 284 226 -200 -318 -59 86 -122 -214 19 229 74 -321 -292 2 152 -275 -528 -115 382 221 -359
1924c59j69M29M27k52m74j26M30K08j66k10K06O4j03j56j9L47Ml85k29M20L92
1945B79k33m86nN00K93l76n12J06N26K08m38j96K99J68j03k04mJ24L4k33J37K24
1967A08J67k10m01J99M55J54m80m87K16O63J32o07k78M79L25k13k73Q9J81j28
1987I1j77Q5L03J15l51k07J91M12j10l76j56J89L27O3m71j34L41M26l42n60J76
2008a65M96N2l77j98L09K48l69j77L25L32l01n17l5N16K35k83l09O7L07R2j39
2029A09l23M0L02L2l34j91L42L44k82l82J69N28q2o84j37N54L27l88l28J92M03
2050B11j58l48K5K90J03l28k29J18L74J29j77l29l4M93R3m70l90L84M35j34m64
2071d06J30M74O8n38k94O36K40l78n48L29N82j77m40j1L77J90j84l42n4K46L98
$$ plain form
1924 -359 -528 -99 328 76 -398 -524 -94 114 -52 -262 -56 8 -95 -251 -270 77 81 -304 -533 -113 279
1945 279 46 -440 -445 55 348 -28 -540 -434 92 300 -138 -334 -35 133 30 -174 -178 -54 -20 -253 -116 108
1967 108 275 65 -336 -137 318 472 -8 -495 -279 384 516 -91 -369 110 435 222 -51 38 219 91
1987 91 -86 -1 302 417 66 -141 50 462 352 -24 -180 9 336 399 -72 -206 135 561 219 -341 -165
2008 -165 331 383 6 -192 117 365 -4 -181 144 476 175 -342 -377 139 374 91 -218 -151 156 248 109
2029 109 -214 -174 128 160 -174 -365 -23 321 39 -343 -174 354 272 -412 -549 5 332 -56 -384 -192 211
2050 211 53 -295 -270 20 123 -205 -434 -316 58 187 10 -319 -353 140 233 -237 -627 -243 192 58 -406
2071 -406 -276 198 266 -272 -566 70 310 -68 -616 -287 295 118 -322 -333 44 234 50 -292 -346 -100 298
2092B98o2m07k01L57L52k01k73J79J94j99n05K91P27K5q11j88O81L64l78n41L8
2113b60M46J96k12k07J35RN0R6j07m5R9j48k70P0O04J75n73m68L99O36r9o98j79
2136c51N80K80m72k75L84L60k94m15J85L18l7l02j22J48K24m2j75j34J11K93j6
2157B48m47k14M92L76m32n28K17O66J0o16k7L77P0n22q2M46L68k50n17L3M43J67
2179B78k91k76k1J72K20m0l24N3K20J73l18k10M06K29m61m94L90O39m4n91k53
2200e43M92L81m09k67J98K26k37j97J72K53J79k09k70j00L41K22k22l01N9L89
2220A57J69m43k14L44M31l80m17J28N63j11m28r3M96J81k32l18J97K15k2l44k0
2241a41L09J33j15k15j25K73L49j57m26j28M52J95l77k76L79M22l80l83J17N32
$$ plain form
2092 298 236 -171 -372 -15 337 136 -137 42 236 37 -468 -177 550 575 -236 -424 257 621 243 -298 -260
2113 -260 186 382 170 -37 98 107 157 253 146 101 200 52 -218 -148 456 631 58 -410 -11 625 526 -172 -351
2136 -351 229 509 37 -238 146 506 212 -203 -18 300 263 -39 -161 -13 211 169 -6 -140 -29 264 248
2157 248 -199 -413 79 455 23 -505 -288 378 388 -228 -255 122 192 -330 -412 34 402 152 -365 -332 111 278
2179 278 -13 -289 -310 -138 82 42 -282 -229 -9 164 -154 -364 42 271 -190 -684 -294 345 301 -290 -543
2200 -543 -51 330 -79 -346 -148 78 -159 -356 -184 69 248 39 -231 -331 10 232 10 -291 -232 157
2220 157 326 -117 -331 13 444 64 -353 -225 338 227 -201 -294 202 383 151 -167 30 245 223 -121 -141
2241 -141 168 301 186 -29 -154 119 468 311 -115 -243 209 404 27 -249 130 552 172 -211 -94 438
2261D38n7n29j08M15L25l06k81qK98J58j42k35k4J47L7k27oK35L13l31l42k8M30
2284A72K23m51l44K10N03j54l89O2M61j13m03j90L33L28j22l80k4K87R7j24j64
2305a82N4K05K1l11j98K47L81j55m26J0M20J68m35k79K79K82p2l97O8L79J45m25
2327b21k36M12J38l4l11j02K31K97j50l29M2L09J85l26k22J16L31j3m24J3M52
2348A58J76l78l19L90K58j95l41k7L90J62k14k52J48L46r2k99j66K52K77j28k82
2369a36l9L68J78k28k92J80M28k23m09m2L54K78l17k60K14M19j16m59p9L71J63
2390C53k98j31J6K64J45k05k34O1L84q2m28k2L85J34k71k85J62L95qm22r8K86
2412A01K27l94j64J85L79j4l68j43K30K34j11l99J0K42J51j73j84Q9L19m0l25
$$ plain form
2261 438 381 -148 -256 159 484 178 -103 -111 187 345 203 -32 -56 91 128 -99 -105 130 443 112 -230 -258 172
2284 172 395 -56 -400 -190 313 159 -230 -168 293 180 -223 -413 -80 248 126 -254 -278 9 106 -18 -182
2305 -182 -128 77 98 -213 -411 -164 217 62 -364 -354 66 234 -201 -480 -201 81 9 -388 -320 59 204 -221
2327 -221 -457 -45 93 59 -252 -354 -123 174 24 -305 -263 46 231 -95 -317 -201 130 117 -307 -294 158
2348 158 334 -44 -363 27 285 90 -251 -278 112 274 60 -192 -44 302 210 -89 -255 -3 274 146 -136
2369 -136 -175 193 371 143 -149 31 459 236 -173 -215 139 417 100 -160 54 473 357 -102 -181 190 353
2390 353 55 -76 -60 204 349 144 -90 -29 355 273 -155 -177 208 342 71 -214 -52 343 335 -87 -185 101
2412 101 328 -66 -230 -45 334 320 -48 -191 39 273 162 -237 -227 15 166 -7 -191 -102 217 177 -148
2433a48j44K87K57l06l08J84M29r4l17j49K83L37k31m17J0M37O8j84k42J73K56
2454A81q6l61o8L62J79k75k84J16M44k2l14q1K48J28j85k68M5L95P5l57j91L02
2476a7L20j36l65p3L66J41l53j76L09K24p7k43p5K09K69j99l09O9K80Q5l00j12
2498a63K95L01k24m54N0M09J58k69k92J87L53p7k68j25K75J34k38k21J77K83P
2519B98l21j13L76J74k17l83R0L55J02m07k08K02L45J02m57j01K96J40j30l33
2539a90J41K89m2k80r2K75J89k18l33J00L24L4l87j69K70L86j67l77n5L56J42
2560A96k24l02J66K09l4j87p4K33J97j95k66O6K88l1k72r1J43L57j07l09n6L50
2582E7J70l80k73K08K94j2k21j22K70J45j54k74J13L17r9l29j09L72K78j97l18
$$ plain form
2433 -148 -292 -5 252 -54 -362 -178 251 157 -160 -309 -26 311 80 -337 -327 110 178 -6 -248 -75 181
2454 181 95 -266 -334 28 207 -68 -352 -236 208 186 -128 -209 39 167 -18 -286 -241 154 229 -128 -319 -17
2476 -17 303 167 -198 -271 95 236 -117 -293 16 240 163 -80 -155 54 323 124 -185 -116 164 249 -51 -163
2498 -163 132 433 209 -245 -195 214 372 103 -189 -2 351 274 6 -119 156 290 52 -169 8 291 298
2519 298 -23 -136 240 414 197 -186 -96 259 361 -46 -254 -52 293 395 -62 -163 133 273 143 -190
2539 -190 -49 240 198 -82 -174 101 290 72 -261 -161 163 197 -190 -359 -89 297 130 -247 -302 54 196
2560 196 -28 -330 -164 45 11 -176 -250 -17 180 -15 -281 -215 73 42 -230 -321 -178 179 72 -237 -293 57
2582 57 227 -153 -426 -218 76 64 -157 -279 -9 136 -18 -292 -179 138 39 -290 -399 -27 251 54 -264
2603b64J04K67M9l37k29K75K66jl32p1L30J82j88k73K7L71J1l31l5J46L65k68
2625F4k09J07K56L8m11m5K02L29k24l29J42L00J96l21k46K8L12R1l56r1L21K23
2647C77j62k49L3K83k2k76k23K78L45k32l72O9L98P4l72j27J78K91n7l92j04L28
2669F6J80j06k39k4K71k3j66k13K13J32j03k64M3M58L2m08k28K44L37j52l70J5
2691c05L80J36k17k94O0L26j3k21r4J77R2j08j84P1K45P8l12j67K53K55j52l36
2713c30o7M66J47l49l23J95M12Pm23k0K20J24j0k43R5K03r3k24j9K47R0j87j87
2736b69RL65J79k78l34J33M05K5m18r7L09J60j30j78M9L26n3k38j57K71J55k04
2758C0j86P0K66J34k70k30J44M06j08l12j39K89K24j98k75J51L26lk91k20K71
$$ plain form
2603 -264 -160 107 156 -181 -410 -135 131 130 -202 -273 57 239 51 -222 -195 176 187 -144 -179 -33 332 64
2625 64 -145 -38 218 256 -155 -200 2 331 107 -222 -80 220 416 95 -151 -123 189 280 -76 -167 154 377
2647 377 215 -34 -1 282 260 -16 -239 39 384 152 -220 -151 247 321 -51 -178 0 291 234 -158 -262 66
2669 66 246 140 -99 -123 148 125 -41 -254 -41 91 -12 -276 -233 225 257 -151 -379 -135 202 50 -320 -305
2691 -305 75 211 -6 -300 -240 86 73 -148 -242 -65 27 -81 -265 -194 51 129 -183 -350 -97 158 6 -330
2713 -330 -397 69 216 -133 -456 -261 151 158 -265 -285 -65 59 49 -194 -99 104 11 -213 -232 15 105 -82 -269
2736 -269 -260 105 284 6 -328 -195 210 235 -183 -280 29 189 59 -119 -70 256 203 -35 -192 79 234 30
2758 30 -156 -86 180 314 44 -186 -42 364 256 -56 -195 94 318 120 -155 -4 322 319 28 -192 79
2779G9J25j56j85J32K96j77k42kL09J54j41k94j63L06K36j52j89P8J38J1k10j04
2801a51K40J12j10l93J87K53O9l00o8K22J33j06k76%K56O3k26p4J56J38k6k01
2823a02j43J98J76j06k99L0L12J17l61k5K07J14k03l00J24K81L9j85k43K79J42
2844E2n2j36j43J67Q3q5j25KL01K2k63p2K61K59k12l35m9L30K13k33j87K28J51
2867A77j76j90J46K22p2k68j09K11K27M0j21j82J43J42p0k05N5J28L0j05j45J17
2889eK95r0k79l1K89N7k69j79K13K18p3k03M6J55M6k02n8J18N8K2q6j04L9K50
2913B27Q3k75l9J03J02j93k04J92K90o8l30n3L98J20l17k46K48K28j58j20R5P4
2935A57J3j00j11J28O7k6j23k16J17K81k5j86j58J53K51k00k80J68K62j97k63
$$ plain form
2779 79 204 48 -137 -5 291 114 -128 -130 179 333 192 -102 -265 41 277 125 -64 14 152 163 -47 -151
2801 -151 89 201 91 -302 -115 138 207 -93 -161 61 194 88 -188 -188 68 131 -95 -169 -13 125 99 -102
2823 -102 -245 -47 129 23 -276 -246 66 183 -178 -203 4 118 -85 -385 -261 20 59 -126 -369 -90 52
2844 52 0 -136 -279 -112 -29 -114 -239 -237 64 86 -177 -249 12 271 59 -276 -325 5 218 -15 -202 26 177
2867 177 1 -189 -43 179 107 -161 -270 -59 168 208 87 -95 48 190 120 -85 -30 98 128 23 -122 -5
2889 -5 290 200 -79 -110 179 236 -33 -212 1 219 146 -57 -11 144 190 -12 -70 48 106 128 42 -62 -23 227
2913 227 310 35 -4 99 201 8 -196 -4 286 218 -112 -165 233 353 36 -210 38 266 108 -12 83 157
2935 157 170 70 -41 87 154 128 5 -211 -94 187 162 -24 -182 -29 222 22 -258 -90 172 -25 -288
2956b88R2K72J48l09j98K06J69j47j91P7N7Q1j2l0o7M7J55m2k40J8K07m0j92j08
2980c35L08K24k46j68K4K87q2k49j8L95J4k69j39K01K24r1j58n2Q4J3O3j20O9
3003b1N4QJ4j27L8J31Q1k97j69L35K43j80k31P3L01o6k74l3K12N0j19j78J74J93
3027B12q1j94k6J00P3q1j2j38J41J35q5j02m3K36Nj27k25K07J53j36j95N9K95
3050A71Mk24j55K60Q1j38j00J5J71nj96L2R0P1l6o1q0K9R9O0j76p4K12M0j58j30
3076a98J94J63j65k45K4K70L2j71j01J00J33j20p0M9N4m5k8j01J14R7m1p1j35
3099b61J76L6qk08L0K29P8k67r2J48J97o7k46K6J29J17j89oJ07J03n6m4n0M8L8
3124c2r2o7J05Q1L2j13j15J47J90q6j28n7J72J36j28j56J46J16k0r1p3J39K8j06
$$ plain form
2956 -288 -196 76 224 -85 -283 -77 92 -55 -246 -169 -112 -31 -43 -73 -140 -93 62 20 -220 -202 5 -35 -227 -335
2980 -335 -27 197 -49 -217 -193 94 12 -237 -255 140 154 -115 -254 -53 171 80 -78 -130 -46 -33 30 -90 -21
3003 -21 33 41 55 -72 -34 97 178 -119 -288 47 290 110 -121 -48 253 187 -87 -120 92 142 23 -155 19 212
3027 212 131 -63 -89 11 84 3 -9 -147 -6 129 44 -58 -101 135 140 13 -212 -5 148 12 -183 -124 171
3050 171 175 -49 -204 56 137 -1 -101 -86 85 80 -116 -84 6 77 41 -20 -100 -71 28 88 -88 -162 50 90 -68 -198
3076 -198 -4 159 -6 -251 -227 43 75 -96 -197 -97 36 -84 -154 -105 -51 -96 -124 -225 -111 -14 -55 -126 -261
3099 -261 -85 -49 -57 -265 -235 -6 72 -195 -287 -139 58 -9 -255 -229 -100 17 -172 -178 -71 32 -24 -68 -118 -70 -32
3124 -32 -124 -191 -86 -5 27 -86 -201 -54 136 50 -78 -135 37 173 45 -111 35 151 131 40 -33 106 134 28
3148B8j90J74J13j3j48J6J77R2j92j48P6J67Oj82p2O8K28l3j47QM7O4j06q6N9
3173FN4M0j25P8P4op0j04R4M4M8j50m9J57J78j94j09OJ02P8j42k6J0J07m8r9K
3200d4J95m0j78m7N9J63p1j49m2K51N6j46j40J5J72M4k11j4K3J40kj09k9J69l8
3225B7j34l0R7P4q5j70N9J44J12r0k01N8J45Kj90m5J36J02j2j02n2J35J01j31
3249e0j46J82J2o7m3n5J34J16j47m5L5K26p5j31p1J55J24n9j87LJ99N7j52p5K8
3274c2J33o5l4k5O9Q7j49k8R9J99r0k34K5N8O4jj07R1R5N5j57q6J34R6j20q9O8
3301E6M3rL1r5J02O9j25j28mJ92M2j50j24J02J26m4p8m2N1R4lj61p2K29Pj02q3
3328g6J10J6K4j50k3J55O0r4j36J18J17p2q5r8R2J32p7j96J3K32j2j40n1J08M5
$$ plain form
3148 28 -162 12 125 112 -36 -20 157 249 57 -91 -15 152 158 -24 -96 -28 200 167 20 28 75 139 33 -53 6
3173 6 60 100 -25 53 127 121 51 -53 41 85 133 -17 -66 91 269 75 -34 -28 74 152 10 -16 -6 101 53 -46 -44
3200 -44 151 111 -67 -114 -55 108 37 -112 -154 97 153 7 -133 -118 54 98 -113 -127 -104 36 34 -75 -104 65 27
3225 27 -107 -137 -40 34 -51 -221 -162 -18 94 4 -197 -139 6 8 -182 -227 -91 11 -1 -103 -155 -20 81 -50
3249 -50 -196 -14 -2 -69 -112 -167 -33 83 -64 -109 -74 152 77 -54 -125 30 154 95 -92 -89 110 167 15 -60 -32
3274 -32 101 36 2 -23 46 133 -16 -44 55 254 164 -70 -45 13 77 76 -31 60 155 210 53 -33 101 197 77 -12 56
3301 56 99 90 121 26 128 197 72 -56 -60 132 174 24 -100 2 128 84 6 -36 15 109 106 -55 -127 102 109 7 -76
3328 -76 34 50 74 -76 -99 56 116 22 -114 4 121 49 -36 -134 -42 90 13 -183 -170 62 50 -90 -141 -33 12
3353A2m3p4m7J50M8j40j17J93P2r4q2LN9R2k6k28R2K09m0q2j13J14N0n1j30P1
3379a02N6J16j55m9P5Q6J8j25k4R7P0j11j53J52J17M0j35m0R3N3N8k06JJ43J1
3404H6j60k4J32J82j14k31K9K49K7j30j49J11J47j7j24l7J33N6j51lP1K8nm9r4
3429c7J66J04q3j12o2J21M0q5j02JJ83L6k27QJ52R9k32j10J60J07j08p7k4J50
3453F8Qk9n0j1J3K9j18j6J12lO0j04q9J49J49j48j37R9P3l0j65k6K20O8k02k9
3479a09K4J90r6j83n8J79J35j24l7j7M4N8m8q1j7P2M6j70L9J66J06j71k45R5K92
3504I0ll00k7J75J72j67j80K16Q7o3j89j5K05Nl0j04J1Q3Q5L9j09q9R6O8j48q7
3530a79J82J89r7k58J01K59j4j87r4J29J23j56j71K38J34j66o9O3J04l2o2Rn6
$$ plain form
3353 12 -31 -105 -152 -2 46 -94 -211 -18 54 -40 -122 -119 -60 32 6 -222 -130 79 39 -43 -156 -42 8 -43 -173 -102
3379 -102 -46 70 -85 -134 -59 27 45 -80 -104 -7 63 -48 -201 -49 68 108 -27 -67 26 79 137 -69 -68 75 86
3404 86 -74 -98 34 216 102 -129 -100 149 176 46 -103 8 155 138 14 -23 110 166 15 12 83 111 106 57 -37
3429 -37 129 233 150 38 -24 97 137 52 -50 -49 134 170 -57 -49 103 202 -30 -140 20 127 19 -58 -82 68
3453 68 76 47 -3 -14 -1 28 -90 -106 6 3 63 -41 -130 19 168 20 -117 -18 55 25 -140 -166 54 122 -80 -109
3479 -109 -85 105 9 -174 -232 -53 82 -42 -79 -96 -52 6 -42 -123 -140 -68 -22 -192 -153 13 119 -52 -297 -202 90
3504 90 87 -213 -240 -65 107 -60 -240 -24 63 0 -189 -204 1 6 -24 -128 -117 -34 51 90 -19 -108 -12 56 -92 -179
3530 -179 3 192 95 -163 -62 197 183 -4 -98 31 154 -2 -173 65 199 33 -36 27 131 99 37 46 -10
3553a0P8O1rj29l3J16J02j06k01J62J20o4k46R6L39o1l40J1K07J06j16o4n5Q7
3577E1m6q0J0J22J4r6q8K0L4J54m0j17r2K24Q2j56j36J24J27j1k55K2K56l0j74
3602h1j42K17J93j97p9M1P9l0j54J06L7L5k6p1m2RK50p3k05j47K24J66r5j46M0
3627i1K65o2k70J4K46o3j60mJ31J76j30j84P0O8Pj9o7P7lK3J3j12Q3Q9L1k02q3
3654a57K20J43q0k77R2K16qj26l8J46J36l45l2J13J65k8j40K8O3J60r0j39k7R0
3678H5J09j7k09nK45%k05n8J49J71j20k09JK65L1j93n5J60N2q8j26R2L6K5j46
3703a0O7L1M2M1j40p9R9J55p5k43j0J85L7j44l1J39J45j34k66R2K16K0k25l4J40
3728A8L2p3n8L5N1l3j10n7J58N6J9q9j03J08J32j24o6j2Q8R1j90l9J07J89j42
$$ plain form
3553 -10 68 129 120 -9 -42 74 176 70 -131 31 151 87 -159 -63 276 215 -125 -114 93 199 83 19 -36 51
3577 51 5 -75 -65 57 71 -25 -113 -93 -59 95 55 -62 -154 70 152 -4 -140 -16 111 100 -155 -133 123 93 -81
3602 -81 -223 -6 187 -10 -89 -48 31 1 -153 -47 -10 25 -1 -72 -114 -105 145 72 -133 -280 -56 110 15 -131 -91
3627 -91 174 112 -158 -144 102 39 -121 -125 6 182 52 -132 -62 6 13 -6 -73 4 1 24 37 -75 8 97 128 -74 -157
3654 -157 63 206 126 -151 -59 157 149 23 -15 131 267 -78 -110 3 168 140 0 28 91 251 161 22 -5 85
3678 85 194 177 -32 -37 208 208 3 -55 94 265 145 -64 -63 202 233 40 -15 145 197 109 -17 75 111 136 -10
3703 -10 57 88 130 171 31 -48 51 206 131 -112 -122 63 100 -44 -75 64 209 75 -191 -99 117 137 -88 -122 18
3728 18 50 -23 -81 -46 5 -28 -138 -195 -37 19 38 -51 -154 -46 86 -38 -104 -116 -28 63 -127 -166 -59 130 -12
3753a2j79J75J02p0j63j3L5J65k6n6l3J1J29j20m6r2K18l0j07l4Q2J56q7j19J4
3778a00K32L7l25K9P8J31m7j66K1J99Q8j82j28N4K17q9j01m9O7J38o6l5m8J04
3802E9O7j85l8P9J70l2j61oJ34J39j68j51lK39k3j88L0R5P2o0q9P2R9l3r2j43
3828a17J14Q2j8j07OJ34O2r1j88J02J42n7j54p3K61J9j34o3RJ37Kj71K0J17P5
3853A09j23j05R2J01rj31j19J26J01l1j17j4J06L5nj46O5J38J2j87j09K02Q2j25
3877e2n1K7J19J6q9p4Q9O9j20o9qJ48M2l4j33K8J40qj10j18J81M6q1j04L5J38
3903B7M8n7j15M8Q1m3q1L0J27J9j18n8R1P6p3o4m5J25R0r1j01OK21l1j04n2P3
3930B9N5J4j76N4O8J35j65n5J85lq1o2l6J82mq9n4J3J85K3k53qJ07J60j49j22
$$ plain form
3753 -12 -191 -16 86 16 -147 -160 -125 40 14 -42 -75 -64 65 -55 -101 -193 25 -5 -112 -146 -64 92 5 -114 -100
3778 -100 132 169 -156 -127 -49 82 35 -131 -110 89 177 -5 -133 -79 138 49 -52 -101 -34 104 38 3 -45 59
3802 59 126 -59 -97 -18 152 120 -41 -47 87 226 58 -93 -96 143 120 -68 -38 57 129 69 -20 52 151 118 26 -117
3828 -117 -3 79 61 -46 -40 94 156 65 -123 -21 121 64 -90 -163 98 117 -17 -80 -71 66 68 -103 -83 34 109
3853 109 -14 -119 -27 74 65 -66 -185 -59 42 11 -106 -120 -14 21 16 -130 -65 73 85 -102 -211 -9 73 -52
3877 -52 -103 -76 43 59 -30 -104 -15 54 -66 -135 -143 5 47 13 -120 -92 48 40 -70 -188 -7 39 -42 -146 -111 27
3903 27 75 18 -97 -49 32 -11 -92 -62 65 84 -34 -92 -1 75 2 -62 -107 18 108 17 -84 -78 143 112 8 -44 29
3930 29 84 98 -78 -24 44 179 14 -41 144 141 60 -2 -38 144 140 51 -3 10 195 218 -35 -43 64 224 75 -47
3956d7MK04o3r9M5N7k9n5n5j9J08M1j01L4l6J67o7j18OO6m8Qk3l0J36J4l4j54
3984h8Q4Q5q9m6rR3J5p8j4j7J54rk27N1J15p0m8n4N9R9K6p6m4NN2k3q6j5J78o6
4014d3l8m7L5J34j2j28o4J80M9j29m2L9J06l4p1OO1N3l2j54N2O0M2o4k7J1P8K4
4042D5j19j4J75Lp9p5kJ87l5n8p0N4Q9L8k17M0J48Jj79Q0R4N4r6j22M9J16l4N2
4070A25j51M7P5qn2k9R0QKj50LN1J05j45L6N2M6n2l3L8oN0j80O1K8J19o1j09J6
4099b4O5N9q0p9J8Q9j3k9k9L1J57j23j14%J35oj28l3R3J38j59j01J71O9j59rM9
4126a2n6R9q2L1l6M7j5K3l8l5J6M7j00k5R1P3N3j69j5J86lj71m8J12M9k7r1P4
4154b2M5M1j12q5J54J9j8j13RL7M1JJ4k6J5M7l4j10R0K5N4j72J24M3L2m5k23J48
$$ plain form
3956 -47 -43 161 98 -1 44 101 72 17 -38 -57 51 92 -9 25 -11 156 89 -29 -23 43 -5 3 -20 -50 86 100 66 -88
3984 -88 -4 81 -8 -54 -63 30 45 -33 -47 -64 90 81 -146 -95 20 -50 -98 -152 -93 6 32 -44 -88 -83 -31 -54 -140 -155 23 -43
4014 -43 -81 -128 -93 41 29 -99 -163 17 66 -63 -105 -66 40 6 -65 -59 2 55 23 -131 -79 -19 23 -41 -68 -57 21 45
4042 45 -74 -88 87 90 11 -64 -66 121 86 28 -42 12 101 139 -78 -38 110 111 -68 12 106 160 64 -58 -9 107 73 125
4070 125 -26 21 96 88 36 7 97 105 107 -43 -40 11 116 -29 7 59 105 53 20 58 52 102 -78 -17 11 130 69 -40 -24
4099 -24 41 100 20 -59 -41 48 35 6 -23 8 165 42 -72 -72 63 57 -71 -104 -11 127 -32 -133 38 107 -52 -61 -12
4126 -12 -68 31 -51 -20 -56 -9 -24 -1 -39 -74 -58 -11 -111 -136 -45 28 81 -88 -103 83 80 -91 -139 -27 22 -5 -96 -22
4154 -22 23 64 -48 -133 21 40 22 -91 -82 -45 -4 -3 11 -15 0 47 13 -97 -7 18 72 -100 24 67 99 54 -169 -21
4182b1O2k1r0O4J34r5m8O0lK4kq2l3J15Qk4k3p0N2J07qp2pJ10n9j09J2P6M7j52
4212d8J8L6J07J0j06lP7m3l9l0J26j2r4N2l0o9J85p8j01r8J46P2n0p8L9M4n0k1
4240c8K9nJ03j41n4M7J15Nr8m5L0qK4O8j26JJ14j01K1P0k3Qj02J5O3K2m3j05M5
4269a09L2P2n6n3P4M9q2k5M4L0J1k1RM3j1pm9k2J6J3N9p4oR7jo9k0J4J47q2j75
4300a52J5J47J6m2n2P2L1m2J0J3N9p6o7jJ25J6k2j4l7l4J29pr6j0P1L1r0K2N0
4329F5J07r7j13R2k0L4n0k5N7l4J13l0m4jo5J7m3J02Q0m9o4j2M7N3J2j43l8R0
4357D1L2q1M6L3j13J18o7J8Q3j25m9M2k1M1J00j14Jm4P7Mj16M0R4l3j35L4K3J84
4385A13k3j96LJ11rq5L6%O9q1l7R3qnk1m3n6Q3K4k1j7N2p0J07q3qM5M1p6m5J00
$$ plain form
4182 -21 41 20 -70 -6 128 33 -15 45 42 66 64 -18 -51 64 72 48 25 -45 7 114 106 34 27 137 78 -31 -19 57 104 -48
4212 -48 -30 6 113 123 17 14 91 48 9 -21 105 93 -1 51 21 -48 137 59 -42 -140 6 78 28 -50 -11 33 -17 -38
4240 -38 -9 -14 89 -52 -106 -59 56 61 -37 -82 -52 -60 -36 32 -94 -93 21 -80 -59 11 -12 -4 -106 -91 -28 -6 -49 -154 -109
4269 -109 -77 -5 -61 -114 -40 9 -73 -98 -54 -24 -13 -34 -25 18 7 0 -49 -71 -55 -42 17 -57 -63 34 33 -36 -56 -42 105 23 -152
4300 -152 -137 10 26 -16 -68 4 35 -7 3 16 75 -1 -68 -69 56 72 50 36 -1 -35 94 87 -9 -19 52 83 -7 15 65
4329 65 172 75 -38 54 34 68 18 -7 50 16 129 99 55 54 -11 6 -37 65 145 96 32 20 67 120 132 -11 -49 41
4357 41 73 -8 38 71 -42 76 9 27 110 -15 -64 -22 -43 -2 98 -16 -15 -59 18 22 -94 -54 40 7 -128 -94 -71 113
4385 113 90 -106 -103 8 -1 -86 -50 -50 19 -62 -99 -6 -14 -19 -40 -83 -139 -56 -32 -53 -70 -18 -88 19 -64 -72 -27 14 -62 -107 -7
4416gR2j00r1P8Q7n3M0m0l7L6n1K6M3L5j08J0O8p2nJ02j03k1KJ01Mq6K4pJ07k9
4446D5r4K9M3J2r8J8J04P5j39l0J12l7N3r8L5M8n2O0k9L8ok3Nk4j8O4lj03j8P2
4476D1R2j17j6K8P4n0q6M2N3k1l9p9J60nj2p9J5L6O1j12l1J1K0M8m3q7O0J43n8
4505D9j22n6J48j5n7J6K3N9lj22L4Q2m1l8k9K0P0K3p3n4P8Nm0J8Nn3K0N8o1PK
4536d7N9m6l0Q6l0mq5N2Q5l4j09R2J8M8j44L4mN3l9o5O4KN8Jk4Ok6rk3k0M7P5
4568D1k9o2J1P4N2o7r6L2N9l0k9L9P4J9m6j9l7O8kmq9J18o3NM4n5R7pm2l4k7J27
4600A22n3r8K2P8K1j04L3m0O9j5m7o0Q2J00j30lqK7MJ9l2m1R9k5o2J7Q1lK1j14
4630d0qJ14m8o1n2P8R4p3j24J53o7JP8r5LJ06p7k5l2J17rj3l8pL8o4k6RK6K2O
$$ plain form
4416 -7 85 -15 -106 -28 59 6 46 6 -31 5 -46 -20 23 58 -50 -40 28 -44 -49 53 -50 -71 -69 32 36 -50 -26 -33 74 45
4446 45 -49 -20 23 35 -63 -45 59 134 -5 -35 77 40 93 -5 30 78 26 86 57 95 89 66 71 47 29 93 90 -13 -31 41
4476 41 133 16 0 28 102 52 -34 8 61 40 1 -78 82 77 65 -14 1 37 98 -14 -45 -34 -14 34 -9 -96 -36 107 49
4505 49 -73 -129 19 4 -53 -37 -14 45 42 -80 -46 36 -5 -43 -72 -52 18 41 -32 -86 -8 -3 -43 -25 -20 -73 -53 5 -56 -49 -47
4536 -47 12 -34 -64 22 -8 -12 -97 -45 40 6 -103 -11 7 55 -89 -55 -59 -6 -45 -110 -46 -44 14 15 -9 -3 -29 -38 -61 -81 -34 41
4568 41 12 -50 -39 35 87 20 -76 -44 15 -15 -44 -5 69 88 42 23 -14 54 52 48 -41 77 14 19 63 8 105 98 56 22 -5 122
4600 122 69 -29 -7 71 92 -12 21 -19 50 35 -12 -72 10 110 -20 -23 -31 -4 0 19 -13 -54 45 20 -42 -25 56 53 74 -40
4630 -40 -48 66 18 -43 -95 -17 77 4 -120 33 -34 -33 45 -50 -47 59 -18 -43 -75 42 33 20 -18 -25 13 -51 -77 -68 -42 -20 -14
4661a4n9L6R8o8q5L5%Q7k0n1n6J03L9o8m9M5K6l0j8k9M6L0k2k6K1L7Lq7PL1L5
4692cl5K5QPN3q6o9O2R8l2o5K1Q2o9N2p2K7Q9m4m1J0j7M2np7L8N9lrp4P7K7Qj33
4726d9K2R7J4m2k6M4L8J8r9o7R6P3p2n0M5K6k%n9QJ9m7l5J6J05k2n2n0N5Qn0J7
4758b1j2N3K2o3j11J56P7k8o9m7M1j4j1j7K0K9m0k6M9k0P7j28%k9Q3L0j02J4R7
4787A0j1J1rq3J07k4l2q8N6K6J8p3O2O2k0m5n3MR5j3o0j6L6L7O7j69O8N6n4O7
4817C2p3J6P7k8l7K1j8L3l8m6N4j5K7k4L8J0O0rp2l5M5M9r9k2R0oL4o6mN0M4k
4849H6o1%J0M3p1j12J31P4K0j19k8N3N1j01K1j4L4L5j4o2R2K4q0P3r7N7Nr4pP4
4879B3N2j9l8K2j7L1j01jJ3J51q1o0o7J12LLq4LN8m9M8l8m1J02k1j12J17Rl6q0
$$ plain form
4661 -14 -73 -37 61 -7 -92 -57 -57 30 10 -41 -97 6 45 -23 -72 -27 -1 -31 -49 -78 -32 -2 -24 -50 -29 8 11 -76 -69 -38 -3
4692 -3 -38 -13 -5 2 55 -31 -100 -38 60 28 -37 -16 66 -3 49 -23 4 93 49 8 18 1 43 38 -39 -1 58 55 46 -28 49 76 84 -49
4726 -49 -27 70 84 42 16 60 98 116 17 -50 46 119 47 -3 42 68 66 66 7 15 34 -13 -48 -32 73 51 -1 -51 4 12 -38 -21
4758 -21 -33 20 42 -21 -132 24 101 73 4 -43 -2 -16 -27 -44 -24 5 -35 -61 -12 -32 45 -83 -83 -112 -29 1 -101 -87 10
4787 10 -1 10 1 -82 25 1 -31 -119 -63 -37 -19 -92 -30 32 12 -33 -86 -82 13 0 -60 -76 -40 -3 64 -105 -37 19 -35 32
4817 32 -41 -25 52 24 -13 8 -10 23 -15 -61 -7 -22 5 -19 19 29 89 80 8 -27 18 67 -32 -54 36 30 64 -2 -6 44 88 86
4849 86 25 25 35 78 7 -105 26 100 120 1 -27 26 77 -24 -3 -17 17 52 38 -24 68 92 12 85 -12 45 50 -44 -51 23
4879 23 75 56 18 40 23 54 -47 -48 -35 116 35 -25 -92 20 23 26 -58 -55 3 -46 2 -36 -77 25 4 -108 9 18 -18 -98
4909i8l6J69L7q4l1l1O6K3q3M7j3J6l1m8J2P2K9m6l2m9R7J02j41r7J10Q0p3j9
4937e2JJ14po2o9L1J12l1p7N0K9j0k0Jnk7N8k1k5j0J51m6j06mO6R2o8j57J00M4
4967E2k5m0J3M3J7p9m9R0K5m6m9N4l6L0MN3m3J8K8k3l8K8k8R9r9o0O7J06o8j65
4997a21J37N1K5o2n3J3P2j24M7Q9N2l6j06J0J7O7p9j9pO1J2k2o3K8O8j4n0l6N6
5026A3O2l6j28Q2N9q7m0L8M2k1p7jJ07M6l0n1k8J2L9L7r4m7M7J17o4n3nN3K2o4
5056e0o9J46J0j6j43O0Q0nj4j1K4N7p4m8L6L2Qj14J8Q0k9N9q4k6R0M3l4m6k0L9
5086aO8p2k4M2Q4j03o1L7O6N9r8O3k3N9p3l3l1L1M7j8j2k5L2P1m7j3l0R9k9j35
5116g0K6M8J11m7j38Q9Q8l7p5L8L3M9j11J4M5N0n6Pm6n0R4q1KK9M1kl8q0N9K0
$$ plain form
4909 -98 -134 35 72 -12 -43 -74 -8 15 -68 -21 -34 -18 -49 -97 -85 -13 16 -30 -62 -111 -14 88 -53 -150 -40 40 -33 -52
4937 -52 -51 63 56 -6 -75 -44 68 37 -40 10 39 29 9 10 5 -22 36 15 -10 -20 131 85 -21 -25 41 133 65 -92 8 52
4967 52 27 -13 0 43 60 -19 -68 22 47 1 -48 6 -30 0 4 57 14 32 60 37 -1 27 -1 98 -1 -61 6 112 44 -121
4997 -121 16 67 92 30 -23 -10 62 -62 -15 74 126 90 -16 -6 11 78 -1 -20 -27 34 46 24 -39 -11 57 43 -7 -43 13
5026 13 75 39 -89 -7 52 -35 -75 -37 5 -16 -93 -94 13 59 29 -22 -50 -38 1 38 -56 -103 -56 61 -3 -56 -61 -8 14 -50
5056 -50 -119 27 37 21 -122 -62 18 13 -1 -12 12 69 -5 -53 -17 15 23 -91 -73 7 -22 37 -47 -73 17 60 26 -20 -40 -1
5086 -1 67 -5 -29 13 97 -6 -67 -30 36 95 -3 60 37 96 23 -10 -41 -10 37 19 7 -18 14 85 38 25 -5 94 65 -70
5116 -70 -44 4 115 68 -70 19 107 70 -5 33 66 115 4 18 63 113 57 64 18 -32 62 -19 -17 12 53 51 13 -67 -8 12
5146A2j1p0K5P5Mm8n3%J28m8j02N6J10n8o4o9J23L5k8l7q3N2M1j8M3j27M2M6m0
5175f4l6PR5K3o7r3J02L6p3j7NJ55m6p2n2J53oq8j9M1m8l8J5M1RLO6m5k9N6L0
5206D4p0L0%m4O2j9k3M1O2p6n9O7jlo3O3j2N5ml0k7kjJ2K7k2L2j2J1J5L8o0N5
5239H6j15lJ11nJ3r4M6K1Rq9KO3M9m8m4M1KJ2m1rK1Pl8P8j26J29o4K9m6L3l6L5
5271B9n3j5J14l2Kj29N3L6M9r0J8M7prj17J13N6l9j7p5L6k8L4Rk6J7mk6j6OL1
5302c3M2o1J0K0K2Rn0K3K0K3m2r6R9prL6j3l2N8n4j6m6J00j0j4p4R3kk8J0KO7
5334D7o9rOQ1m3j0rm0P4J9mj51R2P1o2Nk9O3L7o6k7K9%Q7r0k3M8N1q1M6j7L6o1
5367Aj04J03L0N0l6j9MK3Jjk0l8%M4n2K1m7J60p1l6KK9l6M0m0n3P8m9J4K1%K5
$$ plain form
5146 12 1 -69 -44 31 35 -13 -66 -66 62 14 -88 -32 78 20 -44 -113 10 45 17 -20 -103 -51 -10 -28 15 -112 -70 -24 -64
5175 -64 -100 -93 2 25 -42 -135 -33 3 -70 -87 -82 73 27 -45 -97 56 50 -38 -57 -16 -64 -102 -87 -46 -37 -34 32 -13 -42 14 44
5206 44 -26 4 4 -40 22 3 -20 21 83 7 -52 15 14 11 -52 11 -1 54 50 20 -7 -9 -10 2 29 7 39 27 38 53 91 31 86
5239 86 -29 -32 79 74 87 -7 39 60 69 -20 -18 45 94 46 2 43 45 57 16 7 28 35 -3 75 -51 78 14 43 -3 30 -6 29
5271 29 -24 -39 75 43 45 -84 -31 5 54 -36 -18 29 22 13 -104 9 65 26 9 -66 -30 -58 -24 -15 -41 -24 -28 -54 -70 -64 -33
5302 -33 9 -52 -42 -22 0 9 -41 -18 2 25 -17 -113 -14 -21 -30 6 -7 -39 19 -35 -51 -97 3 -7 -21 -95 -2 -4 -32 -22 -20 47
5334 47 -22 -31 -25 56 13 3 -6 -46 28 47 43 -108 -16 55 -7 -2 -31 32 69 3 -24 5 5 92 2 -21 27 78 -3 43 26 62 1
5367 1 -103 0 30 80 44 25 29 52 53 52 32 -6 -6 38 -14 7 -40 120 49 13 15 44 8 48 8 -45 33 -16 -2 19 19 44
5399D4M2j29N2k6M0o8J7K2N2o1M0n1P0oq1l3O3M1rm5j8O9lRm5Lo5K1PJ3KJ6r8
5432a15O7N4K1K8r6n8Q1PRo7nM5K9n6J3K4J9n8j0k8J12Mm8k5R7q3N1l6J0k1J5
5463b0m8l0J03l4J3J5J2J7K2n5k4j7L0M4l2l7O8P1p0j3k8N4L6o7l1N7R9j18J3
5492C0n9Q0j3J4Qj4O8k0l3Mj0p1Q3l4o4N3N3k0j01J06J0m0p2R2q4k2Q6p0J19m
5522G5k1njLn6M6l3J1J8km0K4p4L4N6Kk7Mj4p1L7M7L4l5o0J3M2L3l1o9N1Q2j02
5555b9ok1R1k0nm6N6m2m4P0l0j5K9M6k2o9O6J1N0j66j5J5K9M3n2L9R6n6k8lLn
5587c0l6K0N2m0lN3j6j8K8p9M4k9KJ03r8J2O2N9qj12OM7mj17J21j6K8o0qK7L3
5618B3K7j4mp2L8lJ6K0l5l8J75j03o6J39j30L5l9PJ20p8jp4P3N4o8O2k8M5r0q
$$ plain form
5399 44 86 -43 9 -17 23 -45 -28 -6 46 -15 25 -26 44 38 -43 -76 -13 28 19 -26 -44 25 22 31 -14 -11 -76 -55 -48 -35 -33 -17 -115
5432 -115 -48 6 27 55 -41 -99 -18 -11 -2 -69 -74 -29 0 -56 -43 -19 0 -58 -68 -96 16 20 -28 -53 44 -39 12 -24 -14 -35 -20
5463 -20 -68 -98 5 -29 -16 -1 11 28 50 -5 -29 -46 -16 28 -4 -41 27 98 28 15 -13 41 77 10 -21 36 135 17 30
5492 30 -29 51 38 52 60 46 114 94 61 65 55 -16 67 33 -31 22 75 55 -46 60 70 30 -42 50 -34 -56 30 -40 79 75
5522 75 54 49 48 51 -5 41 8 19 37 35 -5 19 -55 -21 35 37 10 14 0 -71 -34 13 47 12 -48 -35 7 40 9 -60 -9 73 -29
5555 -29 -35 -56 35 15 10 -36 20 -22 -66 4 -26 -41 -12 34 12 -57 9 20 70 -96 -111 -96 -67 -24 -76 -37 59 3 -25 -28 -25 -30
5587 -30 -66 -46 6 -34 -37 16 0 -18 10 -69 -25 -54 -52 51 -47 -35 27 86 78 -34 -28 19 15 -102 19 3 31 -29 -37 -10 23
5618 23 50 36 32 -40 -2 -5 11 31 -4 -42 133 30 -36 103 -27 8 -31 -24 96 18 17 -57 16 70 2 64 36 81 -9 -17
5648a7M7J6l7mJ8M1l6k9M1K5l8M0rl3kl0MRM3k6K4lj32K2R4J2n3q1J25r8j0qK4
5681f1J05r3J6K8J12r4Mn7ol3J4KJ7M9j1l3Qj2M3j0k4k3j0Q8n4K2k4JO6k4o3J01
5713D4m6l1l9R6k4M0o3m3l0O3P4p6N2j09K0Q2rk7j3R6j6k7l1J10l4r2M1nK2p3
5743d8Q0K8p9j6L6L1n5L5L3o7K7RN1j4o8j1Q3L7l2p2R5m1k9K0M2Qn7k8J4J11p9
5774D4n6MM0J9RL0m3m0Pp0P7j2J3M3o4k6N2J1L6p8m2R8j8mm4K3rRJ2l0l4O7o5
5807d1qm0J10Qj3K3l8J0o2K4om4J13m3q1M2O0Mm1qPK0oOn0N8r4Q3k5J11n1r2M3
5840b1p4OR5Rj9n5N6P1j12L0m3M7l5oOJ00q6nl1Q6M5n8k4k1M3q%L5n0N3jl9kk4
5874c2N9K1j9p2O6N8l0L0m9L1n5RN8p0L7m2M9N1Mr5nPL8n1K9n4M1kJ3J0m0M4m5
$$ plain form
5648 -17 30 46 9 5 23 64 28 -1 40 65 27 67 58 25 23 -7 -3 6 49 23 47 44 -88 -66 28 40 -13 -94 31 -67 -77 -85 -61
5681 -61 44 -49 -33 -5 107 13 17 -40 -46 -79 -65 -63 -46 3 -8 -41 -33 -45 -2 -12 -36 -59 -69 19 -35 -13 -37 -36 30 6 -57 44
5713 44 -2 -33 -72 24 0 40 -23 -66 -96 -33 41 -35 17 -92 -72 10 1 -26 -39 57 41 14 -17 93 59 -33 8 3 25 -48
5743 -48 32 60 -19 -35 1 32 -23 12 45 -22 5 14 65 51 -17 -28 55 92 60 -12 83 42 13 33 75 83 26 -2 12 123 44
5774 44 -12 -8 32 51 60 90 47 7 14 -56 21 9 22 65 1 -25 27 38 74 -4 -46 52 34 30 -14 9 0 9 21 -9 -43 24 -41
5807 -41 -49 -89 21 29 16 39 1 11 -51 -27 -33 -77 36 -7 -88 -46 14 18 -23 -31 -24 -4 -10 -4 -54 4 -90 -7 -32 79 28 -64 -21
5840 -21 -95 -89 6 15 -4 -59 -3 68 -44 -14 -57 -10 -45 -51 -45 55 -31 -36 -67 19 64 6 -18 -39 4 -4 -4 31 -19 34 33 -6 -8 -32
5874 -32 27 48 29 -43 23 81 51 81 32 63 8 17 75 5 42 0 49 100 104 9 4 11 49 -2 27 -27 14 12 25 35 -5 39 -6
5907fL3M1o5nM5k7n9P2R1n1j08M3N0k3l2k5Q4n3J6K9p1L1M6Jq6j7N5L1o1pJ9J8
5939Ik4lK1k5O7q3qKN9Nm7J1J9LO3j41%J07n9J6j4%M4Plp8m5P1L4k7rkl7P4m7
5974d0JK7K1o8L6K0o6m6J05o5N7K4lPK3m8K2Okl0N7l3M9o3M0K5j14O3k1J2MJ00
6006A00m8K3o0lk1N2M0o0j1K2jnk2J2L0k4Prj7O8m6k7k7O5L1K5l9l2M1k9n3l2
6038e0kR1M4p9j1Q4l6n6N0J9o4L7n1mK8O4n5J1l0K5J0m0PJ2n4N7m3L2J2Jj04L5
6070f0j1P9l7qO7Mm8%j7jjkq1J8J40k7m8j4J9L2N6j12j6R5p2k4j4J5K9M1J3p8
6102f3N5P0o3Nn5K0O6p3J4PL4k0L2r1L9L7K4j24J04j6K1qJ1n9N9k7Rl2N7l5L2
6133C0n0K0K4L4k5m6K8lMl3M3k7LM3QK2p1O3j23j1Q0O9k1n4qP5l8m6M1o1R5J2
$$ plain form
5907 -6 27 68 3 -2 43 16 -43 29 120 69 -39 4 54 31 -1 -26 58 5 21 50 -21 10 56 57 -29 -46 9 40 -21 -28 -9 9
5939 9 -15 -18 3 -22 45 -38 -46 -44 15 20 -27 -16 3 6 69 -72 -72 35 -24 -8 -22 -22 22 29 26 -52 -97 -26 8 -19 -28 -30 -67 7 -40
5974 -40 -39 -12 9 -59 -23 -3 -69 -115 -10 -75 -18 6 3 10 33 -15 7 13 11 -19 38 5 54 -9 31 56 -58 5 -16 -4 0 100
6006 100 52 75 15 12 -9 43 83 23 12 34 33 28 6 18 48 24 31 22 5 73 27 0 -27 38 69 94 55 23 64 35 -18 -50
6038 -50 -52 39 83 4 -7 77 41 -15 35 54 -10 27 -24 -28 0 64 9 20 -10 15 25 -15 -8 4 -50 7 -36 -4 8 9 -95 -60
6070 -60 -71 8 -29 -37 30 34 -14 -14 -31 -32 -33 -35 -116 -98 42 15 -33 -47 -28 4 60 -52 -68 27 -45 -69 -83 -68 -39 2 15 -63
6102 -63 -8 62 -1 4 -51 -31 35 -38 -24 -17 17 -3 29 -62 -23 14 38 -86 18 2 23 15 26 -33 26 -1 8 -24 33 -2 30
6133 30 -20 0 24 58 33 -13 15 12 16 -17 26 -1 2 45 53 75 4 67 -56 -67 13 82 61 7 -1 74 36 -10 31 -30 65 77
6165G7r4L1J7M6m1p6K7N1o4PL1j6jl3Q1k4K4nj1L1l7l5N3n2QN0o1J8m3Q0%n7j2
6198c0O%N1l0l6N8l1k3kj8PLK0l1mJ7M2K1l1m5M8K0o1k7N5k5m0J0M7L0j3n4O4
6231b%Jk5K2r9R0P6j16M0J5K5p6M4l8j7J23o0K8j01J24n5o8P5M3K5p9k3L6J2k0
6261@j5K5J2nk6k9O8j5k7J08q5J7Q5m3l0n1k5P2p0N5k3lO1j5k4l5R0m3o1N5K1
6292D4m6J9JJ9K9q5N2l3J1J00l8k4n1M7n7N9q2J0K6J5q1J6J24m2m2qO6N0p0p9
6322e0R5pl2K0m6NM7m2p3P2o2J01p2o5Q2Qm4l1R2rk2j7PJ1K7lq4O6QJ7J8l8r3
6355a14J39k3pkK1N3q0p4P2j08J22ok1P2k5lo3M6LK1j3k4j7L5N2j47R4K8n1L3
6385A3k0L3k2QK6k6K2k5n8J02n4J7M3q3O2q8J12m2J2Km4ONJ8JP7p4m3KQ2K9r8
$$ plain form
6165 77 -17 14 31 77 36 -40 -13 38 -26 -19 12 -4 -5 -38 43 19 43 38 27 58 21 -14 39 -13 -5 45 -16 2 -41 39 39 -18 -30
6198 -30 -24 -24 27 -3 -39 19 -12 -35 -37 -55 -48 -45 -25 -56 -60 -43 -1 20 -11 -56 -8 12 -49 -76 -21 -46 -86 -76 -29 1 -12 -66 -2
6231 -2 -2 -1 -26 -4 -103 -13 63 -53 -13 2 27 -49 -5 -43 -60 63 3 31 -70 54 -1 -69 6 49 74 -5 -28 8 20 0
6261 0 -15 10 22 17 -9 -38 30 15 -12 96 11 28 113 70 40 -11 -36 36 -34 21 -2 -5 56 41 17 -18 72 29 -32 23 44
6292 44 -2 17 18 37 66 -19 33 0 11 111 73 49 -2 45 -12 47 -35 -25 1 16 -65 -49 75 33 -9 -17 49 99 29 -50
6322 -50 45 38 6 26 -20 -15 32 -10 -83 -11 -73 28 -44 -109 -27 -19 -63 -94 -2 -11 -33 -50 -43 -32 -5 -8 -92 -26 -18 -1 17 -21 -114
6355 -114 25 2 -5 -7 14 67 -13 -87 -15 -123 -1 -7 -28 44 19 16 -47 -1 2 23 10 -14 -31 4 56 -91 3 31 -20 13
6385 13 -7 26 4 12 38 12 34 9 -49 53 -1 16 59 -24 38 -50 62 20 32 34 -10 -4 1 19 20 97 23 -20 -18 64 93 -5
6417eN6j22P3M9K1l2J4l1m2Q0r8O0J5l6N8q4M9Mj9J2j3K7m1k2j5N3j9j1j1J24
6447I4q6L6m7J2p1j9J31n4mJ3J5On8J9L0n0nL3RJ7k6Lm9L1QK5j41J10mNmk6N4
6480GJ7q7R8n4M5l3J0l5K7P3j03J7n1J11o5n2R7Nl5pJ6QM7k9K1n0k8M9l4K2j0
6511cJ6j2M8q1L3l4N6rq1P8K6n1k6N1L7m4L0k0PM5m0J4ll3P6n7MqP5q9J1k5J1
6544BM5m2K6K3o1K2J9k4j2M1l2k6l1L9K7J6k5m0M7k8J6j0qQm8L2K5L4K2j1p9j0
6576d3O5k7k5j7n2J02K5o8P3L3o6l4L7J0M9q7L4m3k2M4JJ0kl1L1Pn5M6J0L9j10
6607f6K7MM4k4nK0k9j5K3J6L5o6QQM7o9lK3L3Jk4ro4R2K3l6L6p9L9N6q5L0j9J4
6641a4K7n7qK3J7M9jl1P3m4Qm6R5n6kj7jN6q3L3qK0j0pk8Q1m7q6J01j00P9K7j7
$$ plain form
6417 -5 51 -71 2 51 72 40 54 23 -19 61 -37 23 38 2 60 -24 25 29 10 22 9 36 -5 -27 -42 11 -8 -19 -30 94
6447 94 8 44 -3 9 -62 -81 50 -4 -8 5 20 26 -32 -13 17 -33 -38 -5 4 21 -5 -2 -51 -20 -12 13 -128 -18 -22 -17 -21 -47 7
6480 7 24 -63 35 -19 26 -7 3 -32 -5 68 -35 -18 -69 42 -23 -75 22 27 -8 -15 1 9 56 27 48 -2 -30 19 -15 7 -3
6511 -3 13 1 49 -32 1 -33 23 14 -67 11 37 -14 -40 11 48 4 34 14 21 66 26 40 37 4 80 23 27 19 94 5 16 -9 2
6544 2 47 5 31 54 -7 15 34 10 -2 39 7 -19 -50 -11 16 32 7 -33 14 -14 2 -8 -16 -8 -56 -24 1 35 57 46 -33 -43
6576 -43 22 -5 -30 -47 -99 3 28 -40 33 66 0 -34 3 13 62 -25 9 -34 -56 -12 -11 -1 -3 -34 -3 4 -51 -5 5 44 -66
6607 -66 -39 -35 9 -15 -20 0 -29 -44 -21 -5 30 -36 -28 -20 27 -42 -45 -22 11 12 -12 -21 -85 7 30 -6 30 -49 -10 46 -39 -9 -28 -14
6641 -14 13 -44 -52 -29 -12 37 36 5 78 34 42 -4 91 35 33 16 15 71 -12 21 13 33 23 16 -12 69 22 -64 37 -63 16 43 26
6674B6j4k4R5n4K9n7KJ07o1k6L7k4n1K2pR6n6j1Nq4L1%J2M2k6k5P5q9M0n6N1L
6706Hl5O9k8n8J11j04K8M5j7k4j1L6o0rkP5j02N0k1O0J6lkn9MK3k1O9n9N1J5l4
6738A1m8N5k7m3P0p9P8n8L5Pj4L5n2J%O3lk4L8m0o0P1rj00L8O7J6q1M4LO2j09
6770e3M0k8L0K5K6j3k1J9Kr2R2J8o3K6Qn8J4N9k1N5m7J5P2j33N7k4m6OR4p4k5
6801d0Q9p4L6L1K4n8pM3k9m1P0ol0K7n1MN2r5P8n8rN1L5o9M7n5O0mn0K1k2L3M8
6834E1k1PJ1n6p0N6KK5J3POj03J47n9m3L7oJ4J2m0K0jl8K8q1O6o9N9N7l8K6l8
6866a9P4o8K8K6m7j9qN7k7k5J8q4N3rJ2O5l3J9K5j07K0rK2J0O4l3m2K4L8PRk5
6898A6Jl0M0K2m0LN7l0o2P2r0N5Nql0J5L4K1o9qM6M4k6Jk8J3k0j0l1M2j7k9P4
$$ plain form
6674 26 12 -12 83 29 58 1 3 110 49 23 60 36 -15 7 0 96 40 29 34 -50 -19 -19 -7 35 9 -16 59 -30 10 -46 5 8
6706 8 -27 42 14 -44 67 -37 -9 36 19 -5 -16 20 -40 -49 -51 24 -78 -28 -49 11 27 24 22 -37 -33 -10 -31 38 -21 30 45 11
6738 11 -37 18 -9 -52 18 -61 17 -41 -6 1 -13 22 -30 -29 -29 34 31 7 45 5 -55 16 7 -93 -55 12 28 -53 -9 -6 56 -53
6770 -53 -13 -41 -11 14 40 27 6 25 27 -65 27 45 -18 8 16 -42 -28 31 10 65 18 33 105 -28 29 5 -41 -35 59 -15 -40
6801 -40 49 -25 11 42 66 8 1 44 15 -26 44 38 8 35 -16 -12 40 -55 23 -35 -44 7 42 -27 20 -35 25 21 -29 -8 -30 3 51
6834 51 30 37 48 -8 -78 -22 -20 5 18 25 31 -72 75 16 -27 10 4 18 30 -10 10 9 -29 -1 -82 -16 -85 -26 31 -7 19 -19
6866 -19 55 -13 15 41 -6 -25 -33 24 -3 -28 -10 -94 -41 -50 -38 27 -6 13 38 -69 -49 -58 -36 -26 38 5 -37 -13 25 32 41 16
6898 16 17 -13 27 49 9 12 69 39 -23 49 -41 14 19 11 -19 -4 30 51 -18 -26 20 64 38 39 11 24 4 -6 -37 5 -12 -41 33
6931C3l4NJ4Oj0j7M8l3J6k8K1K0j1o0M0o8P0O3m8j2m6N2k1JK8L1j1ll2K5rJ2q
6964C4Pn7rJ3nK5Ojm0J3rPKJN4n8M4j4m3P9l1l9P3j02M1P5q8L5l4j9N4j9j3k4
6998d2M9Lp3P2L2J1j01P8l5k6K2Q8p4k9J01o5kJ5n5K1k7R3p7M5N1o4M7J3n6n6
7028d1J5mP9k1m8llJ1l5M8Kk5L8m7NM0m1L2Qm4L8l0N1Nl2k2P0qn1N5K5l8k2M6
7062E3o2J03n3j8K1j0O1q8m1Q2m1l1J6K2L9j2m6O2m9J5p0Q9l3KL3J8j2k3J4l7
7092DR1o9L2p7Jk5Q0m1P4p8O0q2k0O1pO4r0O6j10L2J03j00J0Pj9JL4L4n5k0L8
7123am1J06l4Kn2j6k8j1N7oJM2K5l8m9rP6l4N3p6l2NP5m0PN0o0M6Lk1J4K4l2J0
7157A6NL1j3m4k0L7mRo8PN1J5o4P0k2m7NJ4M6m7J0K7j2K3Lj3J9k0n2R2Rm7j2K7
$$ plain form
6931 33 -1 4 18 24 14 -3 45 12 28 0 21 41 30 -30 10 -58 12 75 27 15 -31 21 0 1 29 60 49 46 14 39 30 42 34
6964 34 41 -16 -25 -12 -17 8 14 13 -27 -14 -23 -16 -14 -13 41 -17 27 13 -30 49 18 -21 52 -50 -9 66 -22 13 -21 -40 14 -5 -18 -42
6998 -42 7 10 -63 9 41 52 -49 29 -6 -32 -10 78 4 -25 76 11 9 24 -31 -10 -37 56 -21 24 75 11 58 71 15 -41
7028 -41 -26 -30 49 28 -20 -23 -26 -15 -50 -2 0 -25 13 -34 -29 11 -30 2 10 -34 4 -26 25 30 -2 -24 46 38 -13 42 67 29 7 53
7062 53 -9 94 41 23 44 34 95 7 -34 48 7 -24 -8 14 53 41 -5 57 8 23 -47 42 9 11 44 62 50 27 41 4
7092 4 95 26 58 -19 -18 -43 37 -4 70 -8 52 -30 -50 11 4 68 -22 44 -66 -34 69 -31 -21 -14 -33 -32 2 36 -19 -39 -1
7123 -1 -42 64 30 32 -20 -36 -64 -75 -18 -24 -23 19 44 6 -43 -52 24 -10 43 -33 -65 -60 15 -25 -18 32 -28 18 21 0 14 38 6 16
7157 16 21 52 39 -5 -25 12 8 17 -51 -44 7 22 -42 28 6 -41 -36 -22 24 -23 -13 14 2 25 28 15 34 14 -38 54 63 16 4 31
7191C1n4K1Nk5ON5k8K5l8qj6lR0l3k1l2OP0k6K4n0L2Qj0k1m8L0N1l5m8N1m4J9
7224a6m7R2nnj00L1J03m7m0j1L3k4J3j5k3N4K3l0m4M7L6j00L6NpK9Q0m4m0J7n7
7255e6L2L1K8n4k6M2J3j8J2K7l2Lk1J0k7M5K3j1n4m4N0J0Q7m0l3J4L9l6pq8J07
7286B6Pm5J5n3K3J8Rm2Q0k7k8K2k0O0m9m3J8L0k3N6O2j07OoN3j8JJ5n5N7Ln0K6
7319B1M6p4K2k5P5n0M5m8j2k3N1k4m1N0L1n2j8oJ3j8J7N1m6J4J4o7R1k5k9k3l
7350d3J3L0M8l4o2J12l8J4r8L6M5n7j7L0M3k2L8j26O5J5J0j2n0M6K9rl4pP0m3
7380hL2p2nL8P3o8K9j7N8l7kOn5j0J4L9m2J1J5j6%K6L0j3m1l8O6j6k5K4nMpO3
7414E1l2k4k9M1k7Ok3k7L6O6l5K5L8o5l2L4lrK9m0N2pM0j3m4j9oK8k6K6Nj2J6
$$ plain form
7191 31 -23 -2 3 -22 -16 39 11 36 -2 -10 -26 -29 61 28 7 -25 -19 51 25 49 -1 31 39 29 8 -40 -10 41 6 -42 9 -35 -16
7224 -16 -63 29 24 19 -81 -50 53 6 -34 -45 -12 -36 -23 -38 -61 -7 16 -14 -58 -11 25 -75 -39 -34 -41 -12 68 24 -16 1 -56
7255 -56 -24 7 35 -19 -45 -3 10 -8 4 31 -1 2 -19 -9 -36 9 32 21 -33 -77 -27 -17 70 30 -3 11 50 14 7 -81 26
7286 26 33 -12 3 -50 -27 -9 0 -42 38 11 -17 5 -15 45 -4 -47 -29 1 -22 34 96 -11 -5 -11 42 24 25 40 -15 42 45 -5 21
7319 21 67 -7 15 -10 65 15 60 12 0 -23 28 4 -37 13 44 -8 -26 -32 -19 -37 -20 31 -15 -1 13 -54 37 12 -17 -40 -43
7350 -43 -30 0 48 14 -48 64 26 40 -58 -22 23 -34 -51 -21 22 0 38 -88 -23 -8 2 -10 -60 -14 15 6 -28 -35 35 -8
7380 -8 24 -48 -53 -15 58 -10 19 2 60 23 21 27 -28 -38 -24 15 -27 -16 -1 -17 -17 9 39 26 -15 -53 13 -3 -28 -4 -9 -5 -12 51
7414 51 19 -5 -34 7 -20 -14 -37 -64 -28 38 3 28 66 1 -31 3 0 -9 20 -20 32 25 65 52 8 -11 -17 11 -15 11 16 4 20
7447B0L0m8J6k5L0rM9m5kN6l3m1K2m0O5L5q0J8j1K2ln3L4J1p9j2J32J3j24N2k7
7478b7J6K4J9q1N8l4N6p8J9K7O2l6q4O8J9K1m4j4K7J3n9jN1nk1m1L0M4n7P2j28
7509h4Q8n7K2R3p7n2MJ23m4J0m9K2n9K7MlM5oJn6L2JL0j1mLJn0L7rj7J7o9M0O9
7544B2%no2l0R8k2L8r4N6k1o3J28n4L0k0K7l7j7L3qJ2kj6Lk8N3m7Q0q1J13k2Q
7576G2k7n1j0k%J6N7o8lL4l1m5R6l8N2k9n8O2K8Kk3J0ONl1j5pJ6j5L2k1k2K2K
7610A6Lnkl6L0j6J6N8j4q6K5J4k2k2QK4J1rn5R3qp9Q4l6q8J61j04rJ1J2m5L9K2
7643ij5O7j13L6k3M4j9L0l4J0K4J9K5m0m6L2QrNk4M5q4P2J4K1k3k5pL9n0J08j16
7675c8N2O8oj33P8J0k1knON8k7jm8J04j00L6p6R9rk7n6J0M7k9L9j8l6k9M1K4K9
$$ plain form
7447 20 50 2 18 -7 23 14 63 18 16 72 39 -2 20 -20 45 80 0 18 7 29 26 -27 7 18 -61 -73 59 72 -52 0 -27
7478 -27 -11 13 32 -49 9 -25 31 -47 -28 -1 61 25 -59 9 28 49 5 -9 18 31 -28 -29 22 17 -4 -45 -15 29 -28 44 -84
7509 -84 4 -53 -31 62 -15 -67 -63 60 16 26 -23 -1 -60 -33 -29 -32 13 7 8 -48 -16 -15 15 4 0 3 4 -46 -9 -18 -35 -18 -87 -47 22
7544 22 22 17 -45 -75 23 1 39 -55 1 -20 -83 45 -9 21 1 28 -9 -26 7 -1 11 9 -7 -4 -32 21 -26 54 -27 86 64 72
7576 72 45 -6 -16 -18 -18 -2 55 -13 -16 18 -13 -58 38 0 52 23 -35 27 55 57 34 44 50 55 24 9 2 18 3 35 14 -8 14 16
7610 16 19 14 12 -24 6 -10 6 64 50 -36 -11 3 -19 -41 -33 -9 2 -7 -62 31 23 -56 28 -8 -96 65 -39 -48 -37 -25 -70 -31 -9
7643 -9 -24 43 -70 -34 -57 -13 -32 -2 -36 -26 -2 17 42 2 -44 -12 -4 -13 -8 -32 13 -71 1 15 36 13 -12 -19 20 -30 78 -38
7675 -38 14 82 76 -57 21 31 10 8 3 9 67 40 39 -9 95 -5 31 -45 54 45 18 -38 -28 19 -10 29 11 -25 -54 -13 11 40
7707D0l4k9m7Q1J3J3j7k9j3Q3M7o7mj10J14j3nJ0ml8J9ok0J8M2n0l9M5Kn0L3L0
7739A5K0n5N9J8p8l9R0L1j02oJ07m1j9m5L2O1p1j8j7P9ll2p5R7j1p8N2j5Q5K4
7769F5j47Q4O2j04M6ll8L6mL8r2M1k5pN4m8M3L8k1nr8J07n4J0m0J9M8j3K4q0K
7800f2k2M6jOJ15j00j8N3j13O8J7K4pJ6kl2L6pL0j22L8P0n8O1j5M1r3O5j5j4j1
7831fLrJ3K4o1J00j24J21j01J08m1L1q8j3P0o0L0j7K7Knk8O9j27N0P6l3L9q8O9
7861C1kp7J21k5m8K3j6l7m7O8M2p7N8L3q5jP9o0J1J8J1jo4K9M0j01L4K3N5l4N1
7892E2j36O1L8o3N1Jm9J6k8j1K6J6K0k6M5m6j0M9RPn4K9k9P0o2J2J07j02Rj5L0
7923A7l0J1PK4n8Q5p6M5nl4m1L0J3k3J1M8n2L7K3n3k3M2K9n4j3J6K3m9Q3j9l3
$$ plain form
7707 40 6 -23 -70 11 24 37 20 -9 -22 61 108 41 37 -73 41 28 23 33 29 -9 10 4 -16 2 44 -6 -45 0 2 -48 -15 15
7739 15 35 -20 39 57 -21 -60 30 61 -41 -47 60 19 0 -45 -13 48 -23 -41 -58 21 18 -14 -89 8 -3 -81 -29 -44 41 65
7769 65 -82 2 64 -40 6 3 -35 1 -3 35 -57 -16 -41 -48 6 -42 1 39 18 13 -85 22 -32 -22 -62 -43 5 -8 16 -64 -62
7800 -62 -84 -38 -39 -33 82 -18 -36 17 -96 -28 -11 13 6 22 20 -12 24 17 47 -75 -37 33 -25 36 21 62 -31 34 19 5 -6
7831 -6 -3 -12 1 25 -36 64 -60 61 -40 68 27 58 -30 -43 27 -33 -3 -20 7 9 4 -24 45 -82 -32 44 11 50 -38 31
7861 31 29 -48 73 48 0 23 7 -30 -77 -9 33 -44 14 47 -38 -39 40 -20 -9 9 20 19 -45 -16 24 -77 -43 -20 35 1 52
7892 52 -84 -23 15 -48 3 4 -45 -29 -57 -68 -42 -26 -6 -32 13 -33 -43 6 15 22 -32 -3 -32 38 -24 -12 95 -7 2 -13 17
7923 17 -13 -2 5 29 -29 56 -20 25 20 -14 -55 -25 -12 -35 -24 24 -28 9 32 -21 -44 -2 27 -27 -40 -24 -1 -50 33 14 -19
7954a9PL2N2r8M2l3J5j3mL8MK6l7N1l9M9l9J1k4j7N9p7N8%r2PP1m0k8N1j8qj7
7987c0l9R6m4QRK8j6n8M7K5J5o3J6Po2M5K8o4O4o0N6Lj8o4L6K9p6R5m8k7Q6kK1
8020D3j9rL5o9N0j7J1n6L6O1j21M2n6Q9J1o4M9l9NL6J5k4p7N9K9m0l8M9PPk3r
8052b7K5k3j4N1n1K6M2l6J1k6M8k5J8k6o8P0K4J7n8K4L4j5j06J02k5m9N5O8l1
8081C5m9lO3%Ln0M8l0J1q3P9kl8J4j3pOKL0jJ8M0j9l0p0O3j3N4r6N4m5qN1l5M7
8116B6J4n7L1j9m0L7M6l6p0R1j4O6q2lK4j8k1L9Ol3K3l6M8P6j17L4m9N9p4K7r
8147c1N5J6J3l1k1No4Q6l6L1kj6Po9Q3q9mQ2m0Rk9l5L0J4ML2n1L8j7l3J03m2o
8180hM8k2l2J6J8n4L9n9K3k2N6
$$ plain form
7954 -19 -12 20 72 -26 16 -17 -2 -15 -19 19 23 49 12 63 24 73 34 45 21 4 63 -14 44 44 -48 -41 30 -10 -38 13 -5 -13 -30
7987 -30 -69 27 -17 -9 0 28 12 -46 1 26 41 -22 -6 1 -61 -16 12 -52 12 -48 8 11 -7 -71 -35 -6 -82 13 -35 -62 24 22 43
8020 43 24 15 50 -19 31 14 25 -31 5 66 -55 -13 -69 20 31 -33 16 -23 -18 18 33 9 -68 -9 20 -20 -58 -9 -2 5 -18 -27
8052 -27 -2 -25 -39 12 -39 -13 29 -7 4 -22 26 1 19 -7 -75 -5 19 36 -22 2 36 21 -85 17 -8 -57 -2 66 35
8081 35 -14 -17 46 46 49 -1 47 17 28 -55 24 22 -16 -2 -15 -22 -16 -14 16 15 33 73 54 24 -46 17 4 58 -38 16 -29 -37 14 -21 26
8116 26 40 -17 14 -5 -45 -8 38 2 -68 23 9 75 -7 -10 14 -4 -25 14 20 -13 10 -26 22 98 -19 15 -34 25 -49 -22 -31
8147 -31 24 40 53 22 1 6 -58 28 -8 23 21 5 12 -57 26 -63 -67 15 -25 -16 -45 -80 -50 -36 -32 0 -51 -13 -30 -63 40 -2 -8
8180 -8 40 18 -14 2 20 -34 5 -54 -31 -53 3
8191C
$$ Imaginary data points
##PAGE= N=2
##DATA TABLE= (X++(I..I)), XYDATA
0@%%%%%%%%%%%%%%pJ5j6J6j6J6j7K5l2L2l9M7m9N7o5P3q2R0j04J19j32J46j63
37h6J81j99K21k45K71l01L33l69M08m52N03n61O31p13Q08r24J071j263J522j896
57a060K484l556O138k3587l0675L8240K8156m122k6695p075R954J1702P74o4l79
72B35j963n736r86N304Q055R04o607o486M468R812R95j0425l164J1618Q666j1250
88C440j6252K315J7469O607j2106j2685J925P792J517j548K287O54p037o137N633
103f126J1516K097j1234j1636J753J2869P986o545j1908j087J0932P156n748q138
117h113L196Q556j254r113j231P893K004p461k755P842N863n309p331K562Q729
132D078K144n921m293L269M963j52m252k155L421M818j082n529l32P832M906n266
$$ plain form
0 0 0 0 0 0 0 0 0 0 0 0 0 0 0 0 -7 8 -8 8 -8 8 -9 16 -16 16 -23 24 -25 32 -33 40 -42 48 -56 63 -69 77 -86
37 -86 95 -104 117 -128 143 -158 175 -194 214 -238 265 -296 335 -378 430 -494 577 -686 836 -1060
57 -1060 1424 -2132 4006 -19581 -50256 -12016 16140 12018 -14677 -21752 -11798 -96 678 614 235
72 235 -1728 -7464 -8450 -3146 4909 5813 -794 -7280 -2812 7000 7995 -2430 -5594 6024 14690 3440
88 3440 -12812 -10497 6972 13579 1473 -11212 -9287 -1495 22 -1526 761 1415 -5622 -11759 -6126
103 -6126 5390 7487 -3747 -15383 -13630 -761 7225 680 -11228 -12315 -1383 5773 25 -8113
117 -8113 -4917 3639 2385 -6728 -7959 -66 1938 -5523 -8278 -436 5427 118 -7213 -4651 4078
132 4078 6222 301 -3992 -723 4240 4088 -164 -2319 1102 5920 4838 -691 -1023 6809 11715 6449
148F449o854J816N731o92n496k90N269M78o573l134O213O034l502p172j81N375
164C471J860m315l848J725L906k80m475k225L873M698j205n831k342M556N102
179D670j241m392k08K485j363l477K022N911k99p758m089O197Q243o74p515l356
195d844M041M451p20l130r72J087K67j155l08K625L185o68l646o55L619J637l170
212A644k673K887L877k252n847k79O828L795m907o444Q79N874K387k849l091j33
228c04P15m54m72J841J702k163m286p64M504M245j367m810j775L740L426k132
244A646m121O78L765M5l854j305L730L422j678l881j87K984Q95k132n65K331Q31
261B604l010k750J755M351J225l601l444J524M342Q13k978j907K212K077j367
$$ plain form
148 6449 -405 1411 7142 6450 954 664 5933 6411 -162 -3296 2917 8951 5449 -1723 -1904 3471
164 3471 5331 1016 -2832 -1107 2799 2519 -1956 -4181 -308 4390 3185 -2646 -4988 -432 4670
179 4670 3429 -963 -1171 1314 -49 -3526 -1504 4407 4108 -3650 -7739 -1542 6701 6027 -1488 -4844
195 -4844 -803 3648 2928 -202 -1174 -87 180 -975 -1283 1342 4527 3859 213 -442 3177 4814 1644
212 1644 -1029 1858 5735 3483 -2364 -2643 4185 7980 3073 -3371 -2492 3382 5769 2920 -171 -304
228 -304 411 -43 -515 1326 3028 865 -3421 -4185 319 4564 3197 -1613 -3388 352 3778 1646
244 1646 -2475 -1797 1968 2013 -1841 -3146 584 4006 2328 -1553 -1740 1244 2139 7 -558 1773 2604
261 2604 -406 -3156 -1401 2950 4175 574 -2870 -1346 2996 3809 831 -1076 1136 3213 1846
276A846k595O16L043J98l388j747L050L024j342k840N17K771J40l463k169K338
292aL376r61l954q99L052J980j637k066O93J999k96k708r13K638K214j929l360
309b772K68L289J386k339k152J279K353q96k794L95L551J143l197k946J258K860
325F86K28k456q60J884J448j646j773J482K666l52l049j634K032K716m95k782
341a905p61K379J474j671j446J653K327j083l192n97K961K245j840k648P70K586
357A252j13k423o12K262J566j630k202O57K844P98k532j979J403K204m58k214
373a177k82K297J298j808k003J189K900q4k958r87K191J586j755k084R53K849
389B125K71k593j376J961K048j301k289K20K159Q30j714j522J059K013l01k554
$$ plain form
276 1846 -749 -133 2910 3108 -280 -2027 1023 4047 2705 -135 382 3153 3293 -170 -2339 -1
292 -1 3375 2414 -1540 -2439 613 2593 956 -1110 -417 1582 1286 -1422 -2335 303 2517 588 -2772
309 -2772 -2504 785 2171 -168 -2320 -1041 1312 416 -2378 -1983 1568 2711 -486 -3432 -2174 686
325 686 914 -1542 -2402 -518 930 -716 -2489 -1007 1659 1307 -1742 -3376 -1344 1372 877 -1905
341 -1905 -2666 -287 1187 -484 -1930 -277 2050 967 -2225 -2822 139 2384 544 -2104 -1334 1252
357 1252 1139 -1284 -1896 366 1932 302 -1900 -1243 1601 2399 -133 -2112 -709 1495 1037 -1177
373 -1177 -1459 838 2136 328 -1675 -486 2414 2330 -628 -1615 576 2162 407 -1677 -724 2125
389 2125 2396 -197 -1573 388 2436 1135 -1154 -934 1225 2055 341 -1181 -122 1891 1590 -964
405i64p18K321J558j492k130O67K389K91k370j293K126K002j584k700L91K619
421A113O64k016j023J471J954r51k471j42K180J125j765j794J083K240J84k058
437b06j103J512J768j166k203M31K550L47k280j452J765J979p99k461j24K347
453I05P33k190j785J698K327m76k437p74J751J240j233j882L19K034K60j817o57
470a984J323J509r29k245j9K144J022j987j687J647K282p23k604j78K522J478
486A571j761k216O34K311L76j692n48J413R41r84j191N37J482J85j654q70J607
503A41K095o85k488l01K375J264j888k302P73K995N27k456j473J692J647p92j501
520c77L88J184n38j498J55J747R79j654j982P24K453N64k221k061P04K568P80
$$ plain form
405 -964 -1682 639 2197 705 -1425 -758 1631 1922 -448 -1741 385 2387 803 -1897 -1506 1113
421 1113 1777 -239 -1262 209 2163 1212 -1259 -1401 779 1904 139 -1655 -572 1668 1852 -206
437 -206 -1309 203 1971 805 -1398 -967 1583 1930 -350 -1802 -37 1942 1143 -1318 -1442 905
453 905 1638 -552 -2337 -639 1688 1212 -1225 -1999 -248 992 -241 -2123 -1804 230 490 -1327 -1984
470 -1984 -661 848 -81 -2326 -2345 -201 821 -1166 -2853 -1206 1076 353 -2251 -2429 93 1571
486 1571 -190 -2406 -1772 539 915 -777 -1325 88 1029 45 -1146 -609 873 1058 -596 -1466 141
503 141 2236 1551 -937 -1238 1137 2401 513 -1789 -1016 1979 2506 50 -1423 269 1916 1124 -377
520 -377 11 1195 657 -841 -686 1061 2040 386 -1596 -872 1581 2145 -76 -2137 -1433 1135 1915
537A915k151j728J391K091n76k155j76J597K92j348k84J619Q85j810j767J417
553g88K642k84k778j183J850K054l67j941q90J562J595m79j843l68J393P44j052
570a33r21R06J267p35j570N53K183r5k974j113K596K217j256k719j08K232J026
587A356j503j478N19J363j78j173l86Q30R21m85j179j17J617O63j861j552J483
604a160K099o57k457O8K753J002k394j987J685K372o97k443J6K251R95j413j352
621a319N87J487L48j181r76P14J350Jj260j80J509P89j594j693J556K700o30l507
639a299p25L244K346j924k598O62K348K39k055r52J411J263m82j186P5R00K26
656A493p72o64N66J320m99k122n32K602J946k055l255P08L712J013l198k560J780
$$ plain form
537 1915 -236 -1964 -573 1518 942 -1213 -1389 208 500 -848 -1132 487 1372 -438 -2205 -788
553 -788 1854 1570 -1208 -2391 -541 1513 1146 -795 -1685 -123 1472 993 -850 -1218 175 919 -133
570 -133 -1054 -148 1119 384 -1186 -633 1550 1455 -1519 -2632 -36 2181 925 -1794 -1902 330 1356
587 1356 -147 -1625 -1106 257 79 -1094 -1480 -650 271 -214 -1393 -1510 107 770 -1091 -2643 -1160
604 -1160 939 282 -2175 -2107 646 1648 -746 -2733 -1048 1324 627 -1816 -1800 451 1446 33 -1319
621 -1319 -732 755 1103 -78 -1054 -340 1010 1011 -249 -429 1080 1869 275 -1418 138 2838 2208 -1299
639 -1299 -2024 1220 3566 1642 -956 -294 2054 2293 238 -714 697 1960 1478 292 367 1267 1493
656 1493 721 57 623 1943 1444 -678 -1210 1392 3338 1283 -1972 -1264 2448 3461 263 -2297 -517
673e17K933l30k221l06J369L66o57j77P90J33j137r45P87K103P41j900k283N59
691f92K969J138k563k661J149L219K43k897j219K179J440j350j497Q35J068o39
707G22j337L62J516Q8j461p06J318J259p30j941p11J606K136l43k705j344K145
724a26K474q38k501n01J493N87j002k28J256L33j725r76J678J657r41k086q0J651
742A25R73r01j264l4J388R40p32j296J62J033K74j048m82J417J008r72j667N11
760e65J838J6j680l23J224M66j110n71R76J125o05j512j87J267O52p79j031J76
778f23R73M54o77r42L58J301R0j419q34R74J033m20q15L52Q13k63r72K94J274
797I51j18j850n59J653J731o16k017p48J237J670R1j421j121N28R79K92m84q2
$$ plain form
673 -517 2416 2086 -135 -441 928 1294 637 460 1250 1383 246 -699 88 2191 2932 1032 -1251 -692
691 -692 2277 3415 852 -1809 -660 2559 2802 -95 -1314 865 2305 955 -542 293 1361 722
707 722 -615 -253 1263 1351 -110 -816 502 1761 1031 -910 -1621 -15 2121 1778 -927 -2271 -126
724 -126 2348 1510 -991 -1492 1 588 -414 -642 614 947 -778 -1754 -76 1581 640 -1446 -1526 125
742 125 1098 197 -1067 -1101 287 1227 495 -801 -639 394 668 -380 -862 555 1563 591 -1076 -565
760 -565 1273 1289 -391 -714 510 976 -134 -705 271 1396 791 -721 -908 359 1011 232 -799 -623
778 -623 350 804 127 -815 -457 844 934 -485 -1319 -345 688 268 -547 -195 618 355 -617 -323 951
797 951 833 -1017 -1576 77 1808 1192 -825 -1573 -336 1334 1425 4 -1117 -589 390 682 198 116
815A16J59l13l78L63J040k35j845p13J930J809j144k333k89K058J425r92j933
832a275o28J063J002P2m43l78k88k50K86Q24N18p55j692k03J846J683j123k435
850b176j88K273J475j239j873rJ267N98o38j25L81Qn86p7P49L15o55q82K50J293
870A61N88j013j423N21K002N23j778j641P14K030N66j523r94O49Q41k22j70P05
888E36J09j196r12P82J761K70j453j455O76J766N65j307j193L47R88J55p65l1
906c57J025L83j328j010R68J604k93j618k36J176N37p33n81Q88Q82o63j385p9
924h20J510O96q30j288J42J164P19p28r41L99R74l83j220k7J328P16j065j162
942h16O50J275m7j609k71J269N98r98q90P01J104k13j193l19R62Q49p72j226o3
$$ plain form
815 116 275 -38 -416 -53 987 752 -1093 -1806 124 1933 789 -1544 -1833 225 1650 658 -1275
832 -1275 -1903 -840 162 234 -209 -587 -875 -1125 -839 -15 503 -252 -1944 -2147 -301 1382 259 -2176
850 -2176 -2364 -91 1384 145 -1728 -1737 -470 128 -510 -635 -254 -246 -832 -909 -160 155 -500 -1382 -1132 161
870 161 749 -264 -1687 -1166 836 1359 -419 -2060 -1346 684 1250 -273 -1267 -618 223 1 -169 536
888 536 645 -551 -1463 -681 1080 1350 -103 -1558 -882 884 1449 142 -1051 -704 284 439 -326 -357
906 -357 668 1051 -277 -1287 -319 1285 992 -626 -862 314 851 118 -463 425 1307 644 -741 -820
924 -820 690 1386 556 -732 -590 574 1293 565 -376 23 997 614 -606 -633 695 1411 346 -816
942 -816 -166 1109 1062 -547 -818 451 1049 51 -839 -138 966 753 -440 -759 203 1052 280 -946 -1009
961a009J378N40p77r82K36J134J31j055n11Q91M30j078p26J155J480n79j778m10
979a530J420J124p66j359O7J052L17p73l61P07O30n58j050MJ176P23r14j109L79
998h21J320m8j015j79R95O11j230j256P61J767K44j525q20R87J036l94q22n3P11
1017B69K20q93l83R59J133n81j421j76J288Q59p79j277K79J233K46j235l78J194
1035E57Q23q81j276K15J370L54j103q18Q80J077l79j006n9J086J75j010q17P20
1053i2J326j6j358o68J243J038p84j248J10J236K20j103o47R32R55n30j152J03
1071d35J296J85j141p89O99J110k03j156k99J169P88r39j213L59J243J79j104
1088b51o88Q76J027l78j244l5J100K66j070o63Q22J032n61j120K9J220O68j095
$$ plain form
961 -1009 369 909 132 -850 -614 520 651 -404 -915 -24 406 -672 -1398 -243 1237 658 -1120 -1530
979 -1530 -110 1014 248 -1111 -1044 8 325 -448 -809 -102 528 -30 -1080 -1076 100 823 -91 -1200 -821
998 -821 499 451 -564 -743 252 863 -367 -1623 -862 905 1149 -376 -1196 -209 827 433 -389 -442 269
1017 269 489 -404 -787 172 1305 724 -697 -873 415 1274 495 -782 -503 730 976 -259 -637 557
1035 557 1380 499 -777 -562 808 1162 59 -759 121 1198 819 -187 -246 840 1015 5 -812 -92
1053 -92 1234 1218 -140 -808 435 1473 689 -559 -449 787 1007 -96 -743 189 1144 614 -538 -435
1071 -435 861 1046 -95 -884 -185 925 722 -434 -733 436 1224 285 -928 -569 674 853 -251
1088 -251 -939 -63 964 586 -658 -693 407 673 -397 -1060 -238 794 233 -887 -858 362 1030 -65
1106f5j167N91J218q5j228m99R42R59l90j069jR90K36j002n82Q28Q46m06j073
1125i57qJ255M90j008j091O61J175j14j311k06J133P66p67j090K63J243K69j134
1143d31p40P14Q38j46q85J98R83K12r86p16P28J230l95j452k07J411R47q43j059
1162e99J99J177Q7j092m81J038R20p26j042J78J085L37q45o09M99O99k69j042
1180d86J06J167M33r83r74N37J303p5j295o50Q38J037n26j009L01J003J25j091
1198b39n29O52Q33l17j014j8J019K82p96o52P03Q89l21j146l59J116P91o26j180
1217i12K79J166L14j085o26P57Q15n65j023J11J214M43r85p03O27Q49n41q61L6
1236f90Q30N21p71q72M83J123pj107m72P69P55m99j078N6J115N05r94r08O58J023
$$ plain form
1106 -65 -1232 -641 577 492 -736 -1235 -293 666 276 -793 -794 196 432 -570 -1152 -324 522 116 -957
1125 -957 -965 290 780 -228 -1319 -658 517 403 -908 -1114 19 785 18 -1072 -809 434 703 -431
1143 -431 -1171 -457 381 235 -650 -452 531 743 -243 -959 -231 999 604 -848 -1055 356 1303 460 -599
1162 -599 -400 777 864 -228 -709 329 1249 523 -519 -341 744 1081 236 -373 126 825 556 -486
1180 -486 -380 787 1220 237 -737 -200 1103 1028 -267 -917 -79 958 432 -577 -276 727 852 -239
1198 -239 -768 -116 717 400 -614 -632 387 669 -127 -779 -76 813 492 -654 -1013 103 894 268 -912
1217 -912 -633 533 847 -238 -864 -107 708 143 -880 -769 445 888 -97 -800 -173 676 135 -726 -690
1236 -690 140 661 -110 -982 -499 624 617 -490 -962 -193 562 63 -1015 -959 156 661 -333 -1241 -583 440
1256D40k36j027k31Q27L06n20n73N43Q37k70r84k26Q82P65o89j007K52J157M80
1275G26r39r96N37J310j14j011m82P28O04k83m06K87N18j90q39K70R61L05j162
1294a76q60O21J419L35j204j017M59J314J49j100n69M43N97m4m20R9K41q1n12
1313c06J08P31Q2j021n75Q42J096j97j291n89Q38J145j7j238p05O31P94N0n26
1332a48j18K41P4j74o1M42r4o91k86Q88Q80o78j136o3J113Q76n97j201l15Q52
1352a96P99j25o27k00J59K44qL0J17r1n24l11O60P20k49r77j18R10M52o80p93
1373h08J86P37J54o41l13N20M91l21m69j16K84K95j88l56J43L22rm63L8O69J68
1394C23o04o42M11Q95p5r22k57R65O26p15o79L39O89L8o05j49L56L23n9j74o8
$$ plain form
1256 440 204 -823 -1054 -227 79 -441 -1014 -471 366 96 -888 -1114 -232 533 -156 -1163 -911 246 726
1275 726 -213 -1209 -672 638 524 -487 -969 -241 363 80 -326 -39 479 289 -550 -280 681 986 -176
1294 -176 -1036 -415 1004 1339 135 -882 -423 891 1040 -60 -629 -186 411 367 -53 46 287 206 -306
1313 -306 -198 533 615 -406 -981 -139 957 760 -531 -1120 -282 863 846 -392 -1097 -466 328 378 -148
1332 -148 -266 -25 49 -125 -186 256 162 -529 -815 73 953 275 -861 -924 189 1065 468 -733 -1048 -196
1352 -196 603 478 -149 -349 -190 54 46 76 193 102 -422 -733 -73 647 398 -579 -697 213 665 -15 -808
1373 -808 -622 115 269 -372 -685 -165 326 5 -464 -580 -296 -1 -189 -545 -402 -80 -89 -552 -514 155 323
1394 323 -281 -923 -512 383 308 -614 -871 94 720 5 -674 -335 354 392 -213 -362 -6 317 258 84 16
1415A6K17K03k51l28J9M86J65m67j68N99M47p01r14O04J228p9j286o66Q51R94
1435I69j69o94j43L80m1k35J88J95j46l44p3K70M26J76o09o78K45J050K24j029
1455c8q94P09J159j52j051j39Q22K30p60l10P00L56o17n42M92O15j40o14j22M89
1475A93L68l45o81j22N60O88r0r01l99Q73O99o35r66K85R24o9q16R8P88m9j010
1496f07j44J037O06q94j056K76J004L23m71m75q5L46L70j76n18k5N02R7n66k43
1516f99P52N03o19p78M94Q81l36j123j1J284M70r82o68O00P08k72o16o6N72J71
1536B65k82l83Q0M32L56j86n81J4N71J43p21l27P75P02p07r62O37J141j38j173
1556c44m32R09O49o28n22M12M99j51n57Q4M95J47l89m58j6N14N39j92p60j55Q01
$$ plain form
1415 16 233 436 185 -143 -124 362 527 60 -108 491 938 237 -677 -73 1155 1076 -210 -876 -25 969
1435 969 800 106 -37 343 302 67 255 450 304 -40 -113 157 583 759 150 -528 -283 767 991 -38
1455 -38 -932 -223 936 784 -267 -406 416 646 -114 -424 276 632 15 -527 -35 580 440 -174 -296 193
1475 193 561 216 -465 -587 -27 661 571 -330 -729 144 843 208 -758 -473 451 382 -434 -336 452 403 -607
1496 -607 -751 286 892 -2 -1058 -782 222 545 74 -401 -486 -140 230 54 -464 -489 13 110 -456 -699
1516 -699 53 556 -63 -841 -347 534 198 -925 -936 348 818 -164 -832 -232 476 204 -412 -478 94 265
1536 265 -17 -400 -320 112 468 282 -299 -285 286 429 -292 -619 156 858 151 -811 -174 967 829 -344
1556 -344 -776 133 782 154 -368 44 543 392 -165 -81 414 561 172 -286 -302 212 751 559 -201 -356 445
1577D45K85o19n33N10N99n19q81M37J201m9j099m31Q51N38n15p49K69O45J24n21
1597a2k59K40L97j40l04k35K59L54j04o23N8O92L40q60n35O11P47m79r37J97R18
1618C25K08r12m34O95P29l43q50J7M83J40k59k22K09L03jm45k32N50L69l22p34
1639g26l7Q94M16o51p21M38P62j29q30m9P32K05o80l53N56O17k90n12j48N53K78
1660C25l87m72J31M78J69l50l56K97O12j56p63j46P58L82n77m87L67P88k29o77
1680b93j14N96L99n08m97K91N71p9m47j65M08M47k39n62p8M67K87l94l86L64N23
1701E91o7n97k03N80L70m43o10K46P27kp14m8M72L46m64n27K13N43J22n57l46
1722c68M49M02p9m15j20L75K12m03n25K62N99n0n47k45O64L53m41n66J74N45K1
$$ plain form
1577 445 730 111 -422 88 687 168 -713 -276 925 876 -223 -654 197 735 220 -529 -260 385 509 -12
1597 -12 -271 -31 366 226 -78 -313 -54 300 196 -427 -369 323 663 -197 -732 -121 626 147 -790 -593 325
1618 325 533 -379 -813 -118 611 268 -582 -565 -82 58 -201 -423 -214 89 88 -357 -589 -39 330 8 -726
1639 -726 -763 131 547 -104 -825 -387 375 246 -584 -633 99 304 -376 -729 -173 444 154 -358 -506 47 325
1660 325 -62 -534 -403 75 244 -106 -462 -165 447 291 -472 -618 140 522 -55 -542 -175 613 384 -293
1680 -293 -407 189 588 80 -417 -126 445 366 -81 -246 162 609 370 -192 -270 197 484 90 -296 68 591
1701 591 524 -73 -276 304 674 231 -379 -133 594 592 -122 -170 302 648 184 -343 -130 413 535 -22 -368
1722 -368 81 483 404 -11 -131 244 456 53 -472 -210 389 339 -208 -453 211 564 123 -443 -269 276 297
1743B97n84k60O20M40l45n64M9L96J71m00k80J88L72m0m65L5M74K12m23m74K01
1764c80O16Pn92k03L78O19k92o29J48N05jm61k48L37L96q0m70QM62K12m85k55
1786d08J86M57j40m52l4M26L67k90n06J22N24Q8n05l47L95L82J0n10MM38K26m41
1808hk64L28L20k45l94O0N25K30l51n13J19O14J2n30k15L56M35k10m26J0M41K47
1830E41l34m20K14L46j07l52L1M56ml66j99L46N38k50o58k41O04M81l80m57J15
1851i6L62J70l04m12L00K95j26m32O0M00P1l56j36L25K64k30o18P9O40J82n32
1872i4m30K72N85J45n32m74K72N12k28l92j6L92J32k71j37J91J02j56l56J79M33
1893A29Q9m80l68M57N26o3o41k67L56N20j80m22p5L60K00k95r0K36J54k92k33
$$ plain form
1743 297 -287 -547 73 513 168 -396 -347 49 220 -180 -460 -272 100 60 -405 -370 104 316 -107 -581 -380
1764 -380 236 243 -349 -552 -174 445 153 -476 -328 177 176 -285 -533 -196 200 120 -350 -342 120 332 -153 -408
1786 -408 -222 235 95 -357 -391 35 402 112 -394 -272 252 340 -165 -512 -117 265 275 -235 -231 207 433 -8
1808 -8 -272 56 376 131 -263 -203 322 552 201 -312 -193 421 433 -97 -312 44 479 269 -157 -147 294 541
1830 541 207 -213 1 347 240 -112 -81 375 371 5 -194 152 690 440 -218 -459 145 626 246 -211 -96
1851 -96 266 436 132 -280 20 315 189 -243 -183 217 288 -68 -204 121 385 155 -463 -384 256 438 -94
1872 -94 -524 -252 333 478 -54 -528 -256 256 28 -364 -380 12 144 -127 -264 -73 29 -127 -483 -304 129
1893 129 218 -262 -630 -173 353 290 -351 -618 -262 258 78 -344 -419 -59 141 -154 -244 -8 146 -146 -379
1914c79Q0L11Q6l96r3M59L81l89n15qN02L47k99n25O9M88J99k69j71R4J24m8j51
1937a03O7K47j3k90j62M17L89k99n03N4N78J28n68k68K42N45J0m62j69K92K48
1958C80j22k69l9K32r0o4Q0J94j1k24k86K22N08j2n74l45M35N20%o28k03M60L84
1981E48m04l43J30K63j28j78J65K23n8l24j22K25L46j83m30p0L82L32j59m20n2
2002b57L72L22m25m61K05M88L0m28k03L15K47k93j63K85K65l92m00P8N52J47l76
2023i2k45J07K35J34l03k20J33L05o9k63j15L29K87l24l83J82N36j47n59j23O40
2044D5K82m66l14L26L36j34l14J0K99%k27j94K90L35J4k42k65M0M17P6m49k82
2066d17M02N14k38m45N7M99j48m01j07N04K22m58m13M38N05k56m21kM35J01k61
$$ plain form
1914 -379 -299 12 98 -298 -391 68 449 60 -455 -463 39 386 87 -438 -369 119 318 49 -122 -28 96 48 -103
1937 -103 -36 211 198 -92 -254 163 552 253 -250 -196 382 510 -58 -326 -84 461 471 9 -160 132 380
1958 380 258 -11 -50 182 92 28 108 302 291 67 -219 3 511 499 -75 -420 15 535 535 -93 -296 164 548
1981 548 144 -199 -69 194 66 -112 53 276 218 -106 -228 -3 343 160 -270 -340 42 374 215 -205 -257
2002 -257 115 437 12 -449 -244 244 274 -154 -357 -42 205 -88 -251 34 299 -93 -493 -415 137 284 -92
2023 -92 -337 -230 5 139 -164 -384 -251 54 -15 -278 -393 -64 223 -101 -484 -302 234 87 -472 -595 45
2044 45 327 -139 -453 -127 209 75 -239 -229 70 70 -157 -351 -61 274 288 46 -219 -179 238 314 -135 -417
2066 -417 -15 499 261 -184 -127 372 224 -177 -284 220 442 -16 -429 9 514 258 -163 -165 270 371 110
2087A10l13K0L95L56k96l69k1L25K42j94m35K03L66k22m65L49O21k04p10k64Q00
2108B94L62n51n24K33N15L7l29k29J90J49j6q8N1j76P6q4j16J47M56K3n68m00
2130e48M45P08m31o28n8O92K21n77k00M09K99l32m35K43L28j07l21L3J54J71l3
2151C3j65j59J41K31j46l30l6M50L49m41n93L32O96j23n37j95M88J80n38l0M83
2172I0K90l84m81J92M22Q3l00k99J74J91K10o0l33L7L10L4l38q1L29J70l83l36
2194d63M77N53j98o96r4O15L10m50l48K60J80l4k18K00L44o8l79k01J11L02J22
2215C25j47l79J27M27O4l92k13L57L21l79m58K36N91k01m50l5N10R3l51l13K22
2236d5L74k18k65j5L59J05j48k82PK69J95k32l65m9N00R1l16k20L41K44l69k95
$$ plain form
2087 110 -203 -183 212 568 272 -97 -118 207 449 255 -180 23 389 167 -298 51 672 468 -242 -506 294
2108 294 656 105 -419 -186 329 366 37 -192 -2 147 131 43 94 -82 -6 -90 -206 -59 397 420 -148 -548
2130 -548 -103 605 174 -454 -512 180 401 -176 -376 33 332 0 -435 -192 136 29 -292 -259 -105 66 33
2151 33 -132 -291 -150 81 -65 -395 -431 19 368 -73 -666 -334 362 239 -298 -493 -5 175 -363 -393 90
2172 90 380 -4 -485 -293 129 212 -88 -387 -213 -22 188 128 -205 -168 142 176 -162 -243 86 256 -127 -463
2194 -463 14 567 369 -327 -421 194 504 54 -294 -34 146 112 -106 94 438 370 -9 -210 -99 203 325
2215 325 178 -201 -74 353 417 25 -188 169 490 111 -347 -111 480 279 -171 -206 304 397 46 -267 -45
2236 -45 329 111 -154 -169 190 295 147 -135 -128 141 336 104 -261 -310 190 281 -35 -255 86 330 -39 -334
2258c34J35M83j49m44r1O09K27n16l57K09L27O8k61k11K1K14M4j77K5J91J79l18
2280a26l82J46N26O4m17m14M25M44k75l59J63L40j25m19o4L41L01k25l11M4K56
2301f7J27j08k14L7K49l1k59r1K79L42k04m07M2N31M1n07j88L28M19k23m19J93
2323a30L96m7l75q6K73K53k12k52P9K55J94j63l40L7M23M6l70k34K42L24j00l77
2345a64M4M92M9m08l07L83L73l02l72R9L63O0k54k04K44K35p4l57l0L02K00j77
2367A95k64J7L08J62k99l03J76M29k59l68N6M38R1l45k41K35L39k13l93K5L59
2388A45J90l17k36Q5L63O1l77j71J69K53j69k67R4L32J37l22l47L04L29p9m42
2409b65j38M58J15l03j84J79M24q2m11p4K85J82k54k71K5M15K9j57k07J19K31
$$ plain form
2258 -334 -199 284 135 -309 -400 209 436 -80 -437 -228 99 167 -94 -305 -284 -70 -26 -203 -178 13 192 -126
2280 -126 -508 -362 164 228 -189 -603 -178 266 -9 -368 -205 135 10 -409 -473 -132 169 -56 -367 -323 -67
2301 -67 60 -48 -262 -225 24 -7 -266 -357 -78 264 60 -347 -305 226 267 -240 -428 -100 319 96 -323 -130
2323 -130 266 219 -156 -242 31 284 72 -180 -101 154 348 185 -155 -118 305 351 -19 -253 -11 313 213 -164
2345 -164 -120 372 421 13 -294 89 462 160 -212 -113 250 310 56 -148 96 331 257 -100 -130 172 372 195
2367 195 -69 -52 256 418 119 -184 -8 421 162 -206 -150 288 379 34 -207 28 367 154 -239 -214 145
2388 145 335 18 -218 -133 230 291 -86 -257 -88 165 -4 -271 -177 155 292 -30 -377 -73 256 177 -265
2409 -265 -403 55 170 -133 -317 -138 286 204 -207 -281 4 186 -68 -339 -314 101 130 -27 -234 -115 116
2430A16q0l36k3M29J00k64l11K91L30r8l75r8L31L04k68l65Q9M39L9k62k23L03
2452F8J96j00l70L5L46R4k74k28K49K60j0l58l8J95K56k54k92J61L86Rl52j15
2474a36K88K63k40k58j6L28R7k37k48K70L09j46l59j8L59N4j75k69J05K85K6k90
2496hn5L44O8k24l51R3L93O2l17k76K01L92j05l15j01K98N0j66k40K73J34m6k26
2519a22j27L95J27l38l28J91L88k7m31q8L27K49j17l45n8L03J68k98k27J50L10
2540A02Lk82p5K48J82k88k12J86K70l9l70l8K86K91k03l71p1L97J94l32k24J51
2562a95L00%k90l1L19Jk69k12K00K90L3l03m9L19J13k16k53N6L07Q6k99k10K67
2585c6L35r3k54j60K06K47k16k11J37K77k3l29k7L39J60k30k64J49J86O0k96j30
$$ plain form
2430 116 36 -300 -323 106 206 -58 -369 -78 252 154 -221 -319 12 316 48 -317 -228 211 250 -12 -235 68
2452 68 264 164 -206 -171 175 269 -5 -233 16 276 266 -92 -130 65 321 67 -225 -64 322 331 -21 -136
2474 -136 152 415 175 -83 -99 229 326 89 -159 111 420 274 -85 -103 256 310 135 -134 -29 256 282 -8
2496 -8 -63 281 349 125 -226 -133 260 322 5 -271 -70 322 217 -98 -199 99 149 -17 -257 16 150 104 -122
2519 -122 -249 146 273 -65 -393 -202 186 159 -272 -360 -33 216 99 -246 -304 -1 167 -131 -358 -208 102
2540 102 105 -177 -252 -4 178 -110 -322 -136 134 95 -275 -313 -27 264 61 -310 -381 16 210 -122 -346 -195
2562 -195 105 105 -185 -216 103 104 -165 -377 -177 113 146 -157 -206 113 226 10 -243 -187 120 206 -93 -303 -36
2585 -36 299 206 -48 -208 -2 245 29 -182 -45 232 209 -120 -147 192 352 122 -142 7 193 253 -43 -173
2607a73L08K38r7k82l6L18J11k74k95J62L18k9k66r1L30J29k61k66J15L14j6l88
2629a31k7L35J58j78l32J03K91J02l50k12J20L15L7l71k4K51J44j98k92J72K64
2650A77q3l54o7L79J77k17l43K28L00k1l43j63L04K00j22l24j5L41J54j50l17
2671b59M9J85J42k91p3K29K07k12k47J46L28k3m53p4K71K67j77l91J07L72J71
2692B74l78k25J46L18p4k82O8J02J63r6j75Q5K21L2k94j66K97K25k03l23P8M25
2714B18L4k43k93K47L27j41l66m3L82R7p0k37J24J84p3j94m3K67P1k15j67J12
2736b2K63Q6k12l09K37K89l0m27r9L89J85k10k08J23K69q1l50o3L30J15k49j46
2758a20O4L26j28j83j83K91K36l5m56m7L44J73k54k20K04K47m5l04j30J96K27
$$ plain form
2607 -173 135 373 276 -6 -42 276 387 113 -182 -20 298 269 3 -88 242 371 110 -156 -41 273 257 -131
2629 -131 -158 177 335 157 -175 -72 219 321 -29 -241 -121 194 231 -140 -164 87 231 33 -259 -87 177
2650 177 94 -260 -327 52 229 12 -331 -103 197 176 -167 -330 -26 174 52 -272 -287 54 208 58 -259
2671 -259 -210 -25 117 -174 -247 -18 189 -23 -270 -124 204 181 -272 -346 -75 192 15 -376 -269 103 274
2692 274 -104 -329 -183 135 61 -221 -153 -51 112 16 -159 -74 147 179 -115 -281 16 241 38 -285 -207 218
2714 218 252 9 -284 -37 290 149 -217 -260 122 219 149 -88 36 220 147 -47 -90 177 248 33 -134 -22
2736 -22 241 327 115 -194 43 332 302 -125 -224 165 350 140 -68 55 324 243 -107 -170 160 275 26 -120
2758 -120 -56 270 142 -41 -224 67 303 268 -188 -235 109 282 28 -192 12 259 214 -90 -220 -24 203
2779B03k29j67J93K20j23k82K5K35J59k43l09j3L65J50j70k17P0K06k8k34o1K40
2801a0J64k99k13J82L86q3k78j09K70J57k21j90nL62j0k18j15K63J09q8k78l3
2823b57K44J80k31j98J44L00K3l04q3K37J26k14k37J74K85K2k68p6J69J36q5k12
2845a25P3J24Q3j06j80J58J94Jk84o5K80J32k48k46J41K79J92l26j90K50Q6j56
2867F7j67J87K12j18k75l9K65K86j44k71o1K11Q1j44o4J3J15P6j55j06J41K13
2889C23j53l49J47L38l2k84j29K64K60j53k09KJ28L3k29n1K44M4j16r0j30J31
2911a1J80k7k07j51J96J29k06r5J38K46j14m06J31K59J18l61j84K79J22o7j66
2932a97R8P3J1j53N8RJ3l5j19L3J23J31J4k51q7K43J79k30k45J53K63r4k29P7
$$ plain form
2779 203 -26 -193 0 220 97 -185 -160 75 234 -9 -318 -331 34 184 14 -203 -133 73 45 -189 -250 -10
2801 -10 154 -145 -358 -176 210 127 -151 -260 10 167 -54 -244 -249 113 103 -115 -230 33 142 54 -224 -257
2823 -257 -13 167 -64 -262 -118 182 205 -99 -182 55 181 -33 -270 -96 189 211 -57 -133 36 172 87 -125
2845 -125 -52 72 155 49 -131 27 221 222 -62 -127 153 285 37 -209 -68 211 403 77 -113 137 223 67
2867 67 -100 87 299 181 -94 -133 132 418 274 3 -58 153 234 90 26 39 154 230 75 -31 110 323
2889 323 170 -179 -32 306 274 -10 -139 125 385 232 23 25 153 186 -43 -94 150 194 78 -12 -142 -11
2911 -11 169 142 -65 -216 -20 109 -97 -192 -54 192 78 -328 -197 62 180 -181 -365 -86 36 -31 -197
2932 -197 -99 -26 -15 -168 -110 -101 -88 -123 -242 -209 -86 45 59 -192 -279 -36 143 -87 -332 -179 84 -10 -239 -162
2956a62L23O7l35j83K52J21o4k17N5K32P5j30p2M0m9K7n3k7M2J41Ok38m9K29J82
2981B13j38l08P6K70J3l18P4L33k7l19r0K09K01j66j75K9R4J51o2n5N0PP6j20
3005A8q6K7J02N1j95j06K45K46k13k42J28K43r9k73Q4J38Q7j91j4J28J48j41j53
3028f8k7J16O6n2p9n6Q4J72q3j74JJ61M6j69j83K32J19j48j76R8L32j21l07l5
3052b51J89J19j46j51J09J48j00l9j0OJ44p2j70OP7J18K1j36k6J82M9j95r6K05
3076a9J72l04j31J11L05m3k12q0K27O3j40l7mJ50Oj22M0M6J31m9j01q3Q5J27j62
3101b4p2K2K65k5j53r7J66N5n8j72o0K95K5k66J1J08J69j22k2l6R6k0j26L7P9
3126G5O2j9j47PJ69Q3j17k01K7J77R4j23j19J21J02n0j49M9P8M1j56n4J24R1j8
$$ plain form
2956 -162 161 228 -107 -290 -38 83 19 -198 -143 89 164 34 -38 2 -47 -20 -73 -100 -58 83 89 -149 -198 31 213
2981 213 75 -233 -157 113 126 -192 -118 215 188 -131 -221 -12 189 23 -152 -123 -29 122 60 5 55 62 138 18
3005 18 -68 -41 61 112 -83 -189 56 302 89 -153 -25 218 119 -154 -70 68 155 -36 -50 78 226 85 -68
3028 -68 -95 21 87 35 -44 -100 -16 156 73 -101 -100 61 107 -62 -245 -13 106 -42 -218 -120 212 91 -216 -251
3052 -251 -62 57 -89 -240 -131 17 -83 -122 -132 -126 18 -54 -224 -218 -141 -23 -2 -138 -164 18 67 -128 -224 -19
3076 -19 153 -151 -282 -171 134 91 -121 -201 26 89 -51 -88 -92 58 64 -58 -18 28 159 110 9 -74 11 138 -24
3101 -24 -96 -74 191 166 13 -84 82 137 79 -93 -153 142 167 -99 -88 20 189 67 45 9 105 85 -41 -4 75
3126 75 137 118 -29 -22 147 230 113 -88 -61 116 210 87 -32 89 191 141 -8 41 119 160 4 -50 74 165 147
3151A47j64O4J07L4j27j27P6J37J1j67q2J42J18k8k11j5J85rj78o1K30m1M5j80
3175i4O6J38k4j60j13J01K5K7j46J3J10J10r6j14LJ28Oj16k4M6O0o4j8k1J60O
3201Ik05N4rJ85l7j73l6K21J04j73j98J07J67L9j39r5N4K01rj17m0R9L6j80j4
3226a49J32N5q9q5N8J23J18k18p8P5J48m5k13J03P9J07o1j16oQ6J10j50o8J01
3250A7P8p7oK2J42j01n8r4P4J62p5j28N2J19O3j09j47P6J73lj75p9Q0J19m2l9
3276D4l3J56l7j25j4M3Q1m0j37K5J76m6j51NJ07J05m9j39j06J25J58j12j10%J31
3301E7K6q1n3K3O5j45n7K2K45j6k19K7M4J07p9j53l1J88Q3j50p8L2J73k5p8j8
3327i1M5Q8j36l9j9J66L6j62l3P7J76j59j36jJ72J49j99j04L1K38l7j32k7Q5K2
$$ plain form
3151 147 -17 47 154 188 61 -66 10 147 158 -9 -91 51 169 141 -70 -85 100 91 -87 -148 82 41 86 -94
3175 -94 -28 110 86 -74 -187 -86 -61 -34 -180 -167 -57 53 -43 -157 -154 -26 -20 -136 -160 -114 -54 -118 -136 -157 3 9
3201 9 -196 -142 -151 34 -3 -176 -212 9 113 -60 -258 -151 16 55 -84 -179 -125 76 67 -50 -90 9 45 -135 -149
3226 -149 -17 38 -51 -136 -78 45 163 -55 -133 -58 90 45 -168 -65 14 121 60 -56 -62 24 134 -16 -84 17
3250 17 95 18 12 34 176 75 17 -77 -3 159 84 -44 8 127 190 81 -66 10 183 180 5 -74 6 125 83 44
3276 44 11 167 130 5 -9 34 115 75 -62 -37 139 93 -58 -53 54 159 110 -29 -135 -10 148 36 -74 -74 57
3301 57 83 2 -51 -28 37 -108 -165 -143 102 86 -133 -106 -62 45 -34 -187 -218 -30 53 -97 -175 -143 30 5 -73 -91
3327 -91 -46 42 -94 -133 -152 14 50 -112 -145 -68 108 -51 -187 -188 -16 133 -66 -170 -139 99 62 -70 -97 -12 10
3352A0n2j08L2J52oj03k2J03J19k21m1O9J59kj90k8Q6J87K4j60k3P7M5q4j10L8
3378d9J14Q0q5o6Q4J58j66j29J03R0nj00r8J65R1l8j49l1J91n5pj61P6P3L2o7
3404E1r9J03J10q9j98J38P1K4j33k8J35J53j74q3k2J21rj03m9M7P0m7J9n9J05
3429E4O1r9j04k6J76k2o8r9J41J60j46j31KJ16M2j26j03J60P7r6j21j7K30m7m1
3454b7j34N7P6J6q7m2J40M%k03M3J24P6j15j09K0K16j33j32O3J45O2j67j11J70
3479d8R8r4j30nK23N0j86K1J6J9R5q0r3N3P0O3j80O3J71P6j88j88J06J67O3k34
3505g2n8K44K6j29qN8P6o6j62N7J02O0j42lnJ40m6k2k3m4Q8N7j67k7J64J80k11
3532F7k14O1K75k1k97j1J76R1j24r2J50J06q1j70PJ63j06K8m0o4P7J37m7j19k4
$$ plain form
3352 10 -42 -150 -118 34 28 -75 -97 6 125 -96 -137 -68 91 89 -101 -129 -43 144 168 8 -15 62 107 23 -87 -49
3378 -49 65 145 60 -6 78 236 70 -59 44 134 129 29 -69 96 187 149 0 -31 160 105 98 -63 13 86 118 51
3404 51 -48 55 165 76 -122 16 87 111 -22 -50 85 238 64 -19 -41 80 71 -32 -81 -34 36 -11 8 -51 54
3429 54 115 16 -88 -114 62 40 -28 -127 14 174 28 -103 -101 15 57 -69 -172 -12 65 -31 -152 -169 61 14 -27
3454 -27 -161 -104 -28 -12 -99 -141 -1 3 3 -200 -157 -33 43 -72 -181 -161 55 -78 -210 -147 -2 60 -107 -218 -48
3479 -48 50 -44 -174 -179 44 94 -92 -71 -55 -36 59 -21 -114 -61 9 72 -108 -45 126 202 14 -174 -68 99 162 -72
3505 -72 -130 114 140 11 3 61 137 71 -91 -34 68 128 -14 -17 -22 118 72 50 27 -17 71 128 -39 -66 98 278 67
3532 67 -147 -86 189 168 -129 -140 36 127 3 -89 61 167 86 -84 -77 86 -20 8 -32 -96 -19 118 71 -48 -72
3557g2J58O0j99j34J39J53j33j04Q3K33j09k17o3J91J30j63n6M7J27q7j05N9J35
3580G3j3q9j34P7L2R9l1j08r8K15J34k38j31O2K03j57j09J08K00pl00p0K61J67
3604A46k50r1K0K24j0j25L3O3nk4Km8J8J45j06q8J9J50J89k77j63J43K25p0k28
3629a08mK77l7k13j8J87J90k32j08L6J53lj82O1j9J18N1j22P7j14J02R1k40J0
3653d7J48J60k18k08J69J99j5k60J5J81K4j74r8J49J18j00j81J28J65r8J0j01
3675c4j13J43J38q4j31J2J70k8j52mJ04R1j33k30J12K95k0k68o5K76k8p0j12Q5
3699d6O1o3p0kJ38N1o8j44o8J27J33n3j47nJ66M6j73p6K29l1n2j70Q1K27m3j92
3725a44m9J98O6j76k3N2P5j4p0j13J53R6J4j24l6J21Q0j04j37OK24j7j54j4R2
$$ plain form
3557 -72 86 146 -53 -187 -48 105 -28 -132 -49 184 75 -142 -205 -14 116 -47 -103 -56 71 -16 -121 -62 73
3580 73 60 -29 -163 -86 -54 45 14 -94 -192 23 157 -81 -212 -150 53 -104 -213 -105 95 88 -212 -282 -21 146
3604 146 -104 -195 -175 49 39 -86 -53 10 5 -19 -17 -65 -47 98 -8 -96 -77 73 262 -15 -178 -35 190 120 -108
3629 -108 -112 165 128 -85 -103 84 274 42 -66 -30 123 120 -62 -1 -20 98 149 27 104 -10 92 183 -57 -47
3653 -47 101 261 43 -165 4 203 188 -72 -57 124 148 -26 -124 25 143 43 -138 -10 155 57 67 -34
3675 -34 -147 -4 134 50 -81 -69 101 73 -79 -83 21 112 -21 -251 -139 156 136 -132 -197 79 51 -19 -131 -46
3699 -46 15 -48 -118 -120 18 69 1 -143 -211 -84 49 -4 -151 -156 10 56 -117 -193 36 5 -47 -217 -136 91 48 -144
3725 -144 -193 5 71 -105 -128 -76 -1 -15 -85 -198 -45 51 65 -59 -95 26 106 2 -135 -129 95 78 -76 -90 2
3750BJ60r2j17M0J35Nk38j8J67R8o1j35J3J05P2q4J5m8Q2O5k07L4N3J92r3k08
3776f3R3J38oj86j00K21J31j22j70J02P2K7j31r2Q0J61l7j70J4J46L5l8j47J3
3800b9J99n3j16m3N5J09K0j60m0K09O8k22j88K27J29q2j33J4J07K6m2j23O2P6
3824G0k7j42m0J87Jl5j14jJ48M1j67j29J79J22%k22M4P6J04r9j25Q8Q0m9j96L9
3850a67J85L4p7n8oJ23j8j22q8J62P7K2j03l1P3N8p1j33J10J38j30j60J9J84J37
3875A58j57j27O0J61j9j28o5R5J31m4j78J0K08J1q1p9P9M9K4j20p3J39N0j06m4
3900d6Q6J50n2j94j6R5P8n5m0j4J50j0j24q4J49J13j40n9kR9J4n1q5O6J66o1j26
3927Gk7K2J86j30j36M1J27J2n7q3P4R4j16o0l3J41kpj45P9R6l6j32l4R5O7J7j38
$$ plain form
3750 2 162 70 -47 -7 128 133 -105 -123 44 142 81 -54 -41 64 136 52 67 19 101 166 -41 -7 46 238 145 -63
3776 -63 30 168 162 -24 -124 97 228 106 -64 38 110 137 6 -86 -6 155 118 -52 -38 108 143 105 -42 -29
3800 -29 170 117 1 -42 13 122 142 -18 -58 151 219 -3 -191 36 165 83 -50 -36 71 97 55 -68 -6 70
3824 70 43 -99 -139 48 49 14 -100 -101 47 88 -79 -208 -29 93 93 -129 -85 -9 95 -4 -129 -41 39 -10 -206 -167
3850 -167 18 52 -25 -83 -89 34 16 -106 -194 -32 45 67 -36 -67 6 64 -7 -140 -30 108 -22 -182 -163 21 158
3875 158 1 -126 -66 95 76 -52 -117 -22 109 65 -113 -103 105 116 35 -44 35 84 108 -12 -85 54 104 -2 -46
3900 -46 40 190 138 -56 -72 23 101 46 6 -8 142 132 8 -76 73 186 46 -13 -15 84 98 47 -38 28 194 133 7
3927 7 -20 2 188 58 -78 -37 90 102 45 -38 36 130 14 -46 -79 62 60 53 -92 -13 83 47 -85 -119 -24 43 60 -78
3955g8j6J54j1j20k9L5J10p6r5N0P0L1o6k0j4J40m7j63k4J74O7q2j00M7Q2J3q0
3982d8q8J04J08n3j40Q4N4N3q7q7J01R7j05j22N5J48l0q5p0M2J13Jo2r3J33K9
4008E2o6r4J8J30N0j18m6Q7J8L4j52OQ3Q3q1j27J05J76r3m0p9J29L6n9j03L5R7
4035H1L7j05K6J3R1n4k1q8Q0M6j06j5O0Q7l0j27K0J43M5j43o0K5J14jn8q1J20
4062I9L6j22k7m5R2L3p8n0O1Q4p1j3k1Q1l2oj11K3J08j5q9n1J56j9l5j25J02Q0
4090D5l1r8l6K7J36j6j33K9R2r2M0r4N6N3K0r1MO8R3n5j39O2N1k7j5o0J36N2r2
4119a5q4P1N4j4r0j9M2j5R2o2j2O6K6n3m2%P0Mr0q0J24J51p0j37k4J57L3j65q5
4148a67J39J09rj19P1M3j8q3NN9Q1j13m1M0Q3nL7m1j03M1J18j02p3P0N0J4r0O2
$$ plain form
3955 -78 -94 60 49 -71 -100 -65 45 -31 -126 -76 -6 25 -41 -61 -75 65 18 -145 -169 5 72 -10 -110 -63 19 32 -48
3982 -48 -136 -32 76 23 -117 -33 21 74 -13 -100 1 98 -7 -129 -74 74 44 -41 -111 -69 44 45 -17 -110 23 52
4008 52 -14 -108 -90 40 90 -28 -74 13 31 65 -87 -81 2 85 4 -123 -18 158 65 25 -54 75 111 52 -51 -16 81
4035 81 118 13 39 52 143 89 68 -20 60 106 0 -15 45 132 102 -25 -5 138 183 40 -20 5 119 118 60 -21 99
4062 99 135 13 -14 -59 33 66 -12 -62 -1 83 12 -1 -22 59 27 21 -90 -67 41 26 -63 -114 42 23 -12 -137 -35 45
4090 45 14 -84 -120 -93 43 27 -106 -77 15 -77 -37 -131 -75 -22 -2 -93 -89 -21 72 17 -122 -60 -9 -36 -51 -111 25 77 -15
4119 -15 -99 -28 26 12 -78 -97 -55 -70 22 -40 -52 14 40 -13 -55 -55 15 19 -71 -151 -27 124 54 -83 -107 50 83 -82 -167
4148 -167 -28 81 72 -47 24 67 49 -34 -29 30 111 -2 -43 -3 80 75 112 71 -32 9 127 25 -48 22 72 86 -4 58
4176E8N8R2k25q1J88K7p7j05M9J44o4k8q7R8N0j13K6o9N4O0j3n1k8N7L0m3n7J3
4204c7J5K4n5m7J20J06j85J7M8J02q2r9J3J12or1n7P0K8Rl3l9k6M2J03j27l7Q7
4232b5Q6q6r3M6N3o1l2k9J39J8n8p6P4Q6Mj10oL3N7q6j5j3P5O9p1J0l1JJ1m6J
4263g5P3Pj6o4L4R9Qj12RL8M8l5k3L5M5L7p3o2J00n6j2MK1jM7j1k6J0L2mp9LO4
4296F5M6r7k2L2J78j13n2m8L4K2K7m4K9k3k3J9NO3K5K1j79nR4M5k1k3n4J11q8
4325B4J2l6L3J4m3p2%J51j06Q0n2rL7M1o5k1J6k2j7k4N8k0N9n1n3J3P1L8j47m4
4355a35K15j16j07J01P8j2j01l2M7P8pj10kR5k1%n5N3J6l3K6k8p4R5j2m1M9nN9
4384B1j7j19P5L0M0n8j2M5ll4J7P2Moq3k9K9MP7l5nK6m9Q4K3j21J3O9j16QJ08
$$ plain form
4176 58 116 208 -17 -98 90 117 40 -65 -16 128 64 36 -51 47 97 -16 10 -59 -5 55 42 -9 -37 20 50 7 -50 -37
4204 -37 -22 2 -53 -100 20 126 -59 -42 6 108 26 -73 -60 52 46 -45 -102 -32 -4 5 -28 -67 -93 -51 52 -75 -112 -25
4232 -25 61 -25 -118 -72 -19 -80 -112 -141 -2 16 -42 -118 -44 42 46 -64 -70 -37 20 -66 -81 -94 -19 50 -21 -11 -42 -41 -30 -76 -75
4263 -75 -2 5 -11 -75 -41 58 66 -46 -37 1 49 14 -9 26 71 108 35 -27 73 17 5 9 30 29 76 65 39 49 81 77 -2 1 65
4296 65 111 14 -8 24 202 89 37 -11 23 45 72 28 57 34 11 30 35 98 123 144 -35 -40 54 99 78 55 1 112 24
4325 24 36 0 33 47 4 -68 -68 83 -23 57 5 -4 33 74 9 -12 4 -18 -35 -59 -1 -21 38 -13 -66 -53 18 56 -91 -135
4355 -135 80 -36 -143 -42 36 24 -77 -109 -62 16 9 -101 -103 -8 -29 -29 -84 -31 -15 -48 -22 -50 -124 -29 -41 -82 -33 -38 21
4384 21 4 -115 -40 -10 30 -28 -40 5 2 -32 -15 57 61 55 -28 -57 -28 -24 53 18 13 39 -10 74 97 -24 -11 58 -58 -50 58
4415E8R4p1j21j6J30O1j44M3p2Q8n0j1R1k8Np8j3P9no5N3J7m0MR9r9jM4M9j16
4445a5m3P0J00j7j95Q3J34L9j96K4Q1m2m5K3k1K8L1o5M4j5N1p4l3Jk1J10m4n4
4473f1kN0N9p4n3M8M2m8m3M5Q3J0j19m8J42j5n7m5lP5J3m2j9K9m1O2k6j7K5Q5
4503E5r9m9J2J8Q7m3m4J7M2O1j06K4Qm5N6j03J01K4l9n3KL5pK9K2k7M7k9nqjM9
4535C1N1o6j02P3K0j19J28mL3M0kj16J81p3j30rO9L1jj2J1Q1m3q0J9k3J8M8k3
4564C1k8N4pL7q0MJ32n8o8r3Q8M0j2n1K6L2P6j23m4N4j5P3j35M0L6M3l6o1J2%
4594c3K1J5r7J06J8L3n3m9L9K8j8r4O9Oq6Q7Nq0R3n8m2N6N9j26N9Rn4M2RL4o5
4625f7M8N5j43K0J7R8q1mj5N3O7j1r4MO5J4m6q5N3K5O5o6n1Q9N1o5j01L8P6j8
$$ plain form
4415 58 152 81 -40 -56 74 135 -9 34 -38 50 0 -11 80 52 57 -21 -34 45 40 -25 28 45 5 9 108 9 8 52 101 -15
4445 -15 -58 12 112 95 -100 -17 117 156 -40 -16 65 23 -22 1 -20 8 39 -26 18 3 54 -20 -53 -52 -73 37 -7 -61
4473 -61 -63 -13 46 -28 -81 -33 9 -39 -82 -37 46 56 -63 -111 31 16 -41 -86 -89 -14 -1 -43 -62 -33 -74 -12 -38 -55 -30 55
4503 55 -44 -93 -81 -63 24 -19 -63 -46 -4 57 -49 -25 -17 -62 -6 -109 -8 16 -23 -76 -74 -39 -46 -17 5 -22 25 -4 -9 -17 -18 31
4535 31 82 16 -86 -13 7 -112 16 12 45 85 83 -33 148 75 -55 -64 5 36 35 23 34 115 72 -8 11 -12 6 54 31
4564 31 3 57 50 87 7 11 143 85 17 -76 12 52 40 -11 15 47 123 0 -44 10 -5 68 -67 -27 9 52 16 -45 -33 -33
4594 -33 -12 3 -94 12 30 63 10 -39 0 28 10 -84 -15 -9 -95 -8 -3 -83 10 -48 -90 -34 25 -101 -42 -33 -87 -45 -36 -2 -67
4625 -67 -19 36 -107 -87 -70 28 -53 -57 -72 -19 48 37 -57 -53 12 26 -20 -105 -52 -27 38 -28 -79 10 61 -4 -105 -67 9 -9
4655ik1p0N7J26j03o9J20l2L6k4r0Q5K1j3j3j5M4J6k9p2O8P1j02m8Q7P0kn1j02
4684f4J24K2M1r4k8P0J1pk8KJ0K8l7o7k9P4K5o2L8J8M3m1n0l4J10m0q7j3L6M9
4714B0K2n0l6K9M0j6pN7J6k0j08J9R1K1j08J6K6J3m3m4l2N0J18j00k2L8O0k7r7
4743g4K1N6O6r9q7J58oRj24J1O9kl9j6j8P4J3l5o6O6RN1j28M5L1K5m1n5m2J71
4773D3j9j06M2nRL6qn7Q8o1J8k6lJ01p8j8j5j4J09l4m9k9J50n8l5O0N7l8q4l5
4803e9O4O7K4m9n7O8JK2m3J0k6L8l2l0M1K3N1p7n6O2L1k4m7M6j2N6l1p6O9O6m3
4834G7r7l2J24np5jj0R2r7J8K1L4J0l2r0N7N5k2m7o1J67p7j8k9J9N1l1Om2J8O5
4865D8k6%olK3p9m5O5R3n1o0J3L3Pm8J6j9P3m0k7Lk%j1LNJ00n9oq6N8L2K5m3p0
$$ plain form
4655 -9 -30 -100 -43 83 -20 -89 31 -1 35 11 -79 6 27 14 1 -14 30 46 17 -55 13 84 -18 -66 21 91 89 38 -64
4684 -64 60 82 123 29 1 71 82 75 47 49 59 87 50 -17 -46 28 53 -9 29 47 90 49 -1 -35 75 35 -52 -65 -29 20
4714 20 42 -8 -44 -15 25 9 2 59 75 55 -53 -34 57 78 -30 -14 12 25 -18 -62 -94 -44 74 -26 -48 -10 50 23 -74
4743 -74 -53 3 69 -30 -117 41 35 44 -80 -69 0 -2 -41 -57 -75 -1 12 -23 -89 -23 -14 37 -91 -46 -15 10 -31 -86 -128 43
4773 43 24 -82 -40 -45 -36 0 -8 -65 23 -38 -20 -46 -49 52 -26 -44 -59 -73 36 2 -47 -76 74 16 -19 41 98 60 -24 -59
4803 -59 5 72 96 47 -10 58 59 81 38 48 22 60 28 -2 39 62 113 36 -20 42 73 49 2 48 36 92 61 -15 54 120 77
4834 77 -20 -52 72 67 -8 -9 -19 73 -24 -6 15 49 59 27 -63 -6 49 27 -20 -81 86 9 -9 -38 -19 32 1 7 -35 -17 48
4865 48 22 22 16 13 36 -43 -88 -23 70 19 -41 -28 5 12 -36 -20 -39 34 -6 -33 -30 -32 -32 -43 -40 -35 65 6 0 -86 -28 4 29 -14 -84
4900h4P5j7J3j24PJ40K0n4n9Q6K3kj08N4k2R1l0j3q9J10M1r6K7O4M5r1m8j0M4
4929gJ31j13j21R2K3L7rm3L7O3j55lJ23M4o0o6K6R0ql6m6l6O5m0ONJJ19o3o2K6
4960B0Q4k5p8o5L8J37m2q7M4NM3q6J1L5j4M3r9L4k5J19q5N7j4Or6M0q3M4Q8K2
4990G1r8o3J74Qj17q0J14L2m5n2k6J06M0j31K6lJ39j33m9m3J29l6N9p5M4n9O1
5017gK2q8J1Q9k2j46qJ54P1n9j72N8J40m2j03kQ1K9k1r3J15L1p5nKP2Mm5j06J02
5047a3L2l0L5n7K6M0L9p0j33J30K4m8o4O8J10j6o2l7K5N3p0l1J33J0q7LP2m9M4
5076G7n7K8p6O9j1R2j56j8J17Pp4l0O4Rk6n6j0J99l9j45O1M1M5p3m2j3L7l4K4
5105A0N7n2L3%m2j5j1O6P5j02o0M9O9k1j30Q6O9r8k7m9J14Lr9J1P5M5l7q5L8J
$$ plain form
4900 -84 -9 -26 -13 -137 -130 10 30 -24 -83 3 26 24 -84 -30 -52 39 9 -4 -93 17 58 -38 -11 53 98 7 -41 -51 -7
4929 -7 124 11 -110 -18 5 42 33 -10 27 90 -65 -68 55 99 39 -27 -1 89 81 45 -1 -37 28 -12 -6 -1 0 119 56 -6 20
4960 20 104 79 1 -64 -26 111 69 -18 26 31 74 -12 -1 34 20 63 -36 -2 -27 92 7 64 50 56 -40 0 -83 -39 49 71
4990 71 -27 -90 84 92 -25 -105 9 41 -4 -56 -82 24 64 -67 -41 -44 95 -38 -87 -130 -1 -37 22 -53 -9 -68 -7
5017 -7 15 -73 -62 27 5 -141 -149 5 76 17 -155 -97 43 1 -102 -104 -23 6 -15 -108 7 38 -37 -42 -40 32 36 -9 -115 -13
5047 -13 19 -11 24 -33 -7 33 72 2 -131 -1 23 -25 -89 -21 89 73 11 -26 -1 52 -18 -49 84 94 7 10 82 33 77
5076 77 20 48 -28 41 30 122 -34 -52 65 72 -2 -32 32 41 15 -41 -51 148 109 -36 25 66 111 38 -4 -17 20 -14 10
5105 10 67 15 48 48 6 -9 -20 46 121 19 -41 8 77 56 -74 12 81 -17 -44 -93 21 24 -75 -64 11 56 19 -66 -28 -27
5135b7QK6m6n8N1M0k0l4L4K6n8n3J8M2R0r4m6P0Q1p1p6N7P2j6r2j5J30m6%j16
5165a23O6N8j1J2j12M5j5J03n7jJ1J8N9j13M0N1j0p0n7P4R5l8j4m6O2Pl6p8N8
5194b2P7j3l1n1L3J06L8j29J4M7l1J5r6J2R0L8q2p7J23M6n0r7nJ42j2r0J7l9J38
5223A11p8Oj2JQo7K4L5j0K0l9J8MJ22j43k0j0J11j2j29J2N3K3M8o2o8J29n2p0
5252d7n1J06m6%j1J4j5L1N0j30L7N0l1%jNM5k6m1P1o1P8m9j6j0J9K0p1O2J2l7
5283d3L9o7kL9Mj5l6O7K8m8k4O0m9J05j37k3O1J8n8j8P9J9Ln6k8O9k5O8m4j2L5
5314IK8l0q0J05m2P5j08N6l4O1k8o9M6N9Lp1n8J03PKrl2N2K7mn6L6K2rn7M7k2
5346B9J8l1K7j5O0o9n4NJ2M9kRo2P8L2m1o0N6R2j06m8m8J18m1l6J1j8O2lol4j8
$$ plain form
5135 -27 -19 7 -39 -97 -46 -6 -26 -60 -26 0 -58 -111 -93 -51 39 -55 -101 -31 50 -21 -97 -40 32 16 -76 -91 39 -7 -7 -123
5165 -123 -57 1 -10 2 -110 -65 -80 23 -34 -35 -24 -6 53 -60 -20 31 21 -49 -106 -32 63 25 11 -35 27 34 -2 -80 -22
5194 -22 55 42 11 -40 -7 99 137 8 22 69 38 53 -43 -31 59 97 15 -62 61 107 57 -40 -45 97 85 -5 12 -27 111
5223 111 33 39 27 28 36 -31 -7 28 18 38 -1 17 21 143 0 -20 -30 81 69 -60 -48 5 28 76 14 -54 75 23 -47
5252 -47 -98 8 -38 -38 -49 -35 -50 -19 31 -99 -62 -12 -43 -43 -44 -39 6 -20 -61 10 -51 27 -22 -38 -48 -29 -9 -80 -18 -6 -43
5283 -43 -4 -71 -73 -34 -30 -45 -81 -14 14 -34 -58 2 -47 58 -79 -102 -41 -23 -81 -99 -20 -1 2 -54 -82 -13 -38 30 -14 -26 9
5314 9 37 7 -73 32 -10 65 -43 13 -21 40 12 -57 -11 48 51 -20 -78 25 32 34 25 -7 45 72 68 12 48 70 61 4 51 29
5346 29 47 16 43 28 88 19 -35 -30 -18 31 29 38 -24 54 86 45 -15 41 133 27 -21 -69 49 8 -28 -17 -35 27 24 18 -16 -34
5378c4J03p4k9n9O2P1q4N1K8k8q7L1Qk0P2K4p8J6N1J9j00R1p4j4Rj9j1M5M7Kj13
5409i4Q1j3M3p9j2O8K4l5K1o6P9k1o8L0m4Q8p8l5P3j2M6j1k7L4mk7o0Q4Kj9K1
5440a1m5J8P8k2J9p0O8l7j1qk4P5N2o0rm7N0j6pJ9J7L2n0Qk7J03l9j08Q9K2n5
5471DL1o4N9k1M9m8K0J5klm0NP1p2M2p1M8KL6n1j7O7l2j8lN4j6m2K1n7L4kK7m1
5505a5l6O9n2K9J8n7N6OJ1m7J0L2Ln0j2N0M1q8j6J06r7o5M4%O5l7mJ9l3O2Ll9
5537b4k3j9M6Nj09J05O5k6p7n0N2ML7j01R3O1j03K1J5K6k7N2n1JkL9Mk9n8J23
5567E0l4l2o8J09J8Jn4jNK8l0k4L4j3P1j05R9m5J6k6n9J27jj23Q3Rk7K5jk9M0
5598D3K0k7J4m9j7J28q2n0OM7Ln5K3M5Ok1o1M5K1k3M6o9kM0NpJ0m0QO7q7J7o0
$$ plain form
5378 -34 69 -5 -34 -93 -31 40 -44 7 35 7 -80 -49 -41 -61 11 35 -43 -27 24 43 -57 34 -40 -54 -45 -64 -75 -30 17 19 -94
5409 -94 -13 -26 17 -62 -74 -6 18 -17 4 -62 17 -4 -72 -42 -86 2 -76 -111 -38 -50 -4 -15 -42 -8 -12 -39 -99 -15 -13 -32 -11
5440 -11 -56 -38 40 18 37 -33 35 -2 -13 -21 -45 30 82 22 13 -34 16 0 -7 12 29 61 11 19 -8 95 56 -52 37 59 4
5471 4 35 -29 30 9 58 10 30 45 43 40 0 5 76 4 46 -25 23 25 61 10 -7 60 28 10 7 61 45 3 24 -33 1 -1 26 -15
5505 -15 -51 18 -34 -5 13 -44 12 18 29 -18 -8 24 27 -23 -35 15 56 -32 -48 58 -39 -104 -60 -60 5 -32 -36 -17 -50 12 15 -24
5537 -24 -47 -66 -20 -15 -124 -19 46 20 -57 -107 -55 -51 -14 -115 -22 39 -64 -43 -28 -2 -29 23 -28 -27 -29 10 14 -15 -73 50
5567 50 16 -16 -84 25 43 44 -10 -11 -6 22 -8 -32 2 -11 60 -45 54 9 25 -1 -60 67 66 -57 26 35 8 33 32 3 43
5598 43 63 36 50 1 -16 112 30 -20 -14 33 36 -19 4 49 55 34 -27 18 39 16 62 -7 -9 31 36 29 39 -1 7 74 -13 4 -56
5631e6P8o0MN0M5J2m2m3L9J4n6m0K2P5j29M2R8Pk8j17Q3J4p9J6k0Q9q0K1j3P9
5661B5n2J2l0j4J6PN8r9j7oP3%l0K8J2j4J5l3P1K6q4l7J06J0k0m9j8P5o3J2lN
5693a8Oj6J3L2p2P5l3L9p0M8L9rk5l4P1j9q4N8MN1p2K5j1L9J1j6l5k3O6Ln8M5
5725C0m9M9LJ4k8l4Q4j0r9O1mM4n9K3MK2m8j4ML8L5o2K1l8M0j2Q1q3OQmll5K5
5759A0j3L0rk0J1nk5N2j8l6nqP2r7P3n9Q9k1j9N6p6K3j1k6lN5j2j2N9j04M3O7
5791F1m0j08j8P8P5l2l8%J3K3m5M1n3O3n3j7M1l8O5k9Rq8M8K0j7K9M5Pm0kQpm6
5824d5M0j3Rj9K8n6M4J1k1M5K9om2K9k2n4nR8n2J5m4K5N2k7mJ1m3K9J1j7N8Qj19
5857d7M3P3Pk7p9O1K7m7NN8o3Rj1K3m6M6L0j8n0O1m8R7j10K8M6q5L7n6jQ3N0n8
$$ plain form
5631 -56 22 -38 -34 16 61 73 31 -12 27 41 -15 -55 -33 42 -87 -45 53 60 32 -85 -2 12 -67 -51 -71 18 -62 -41 -54 25
5661 25 -27 -15 -45 -59 -43 -36 22 -77 -94 -100 -27 -27 -57 -29 -17 -31 -16 -49 22 48 -36 -73 33 43 23 -26 -44 31 -32 -20 -23 -18
5693 -18 -12 -28 -15 17 -55 20 -13 26 -44 4 43 34 9 -25 46 27 -57 1 5 56 -16 9 -2 37 48 32 -3 -26 40 43 -15 30
5725 30 -19 30 33 47 19 -15 69 59 -40 21 17 61 2 25 29 51 3 -11 -7 31 66 4 25 -13 27 15 96 13 19 27 23 20 -15 10
5759 10 -3 27 18 -2 9 4 -21 31 13 -23 -28 -36 36 -61 12 -47 42 21 2 58 -18 5 -6 -32 -35 20 8 -4 55 -49 -6 61
5791 61 21 -87 -105 -27 48 16 -22 -22 -9 14 -31 10 -43 20 -33 -50 -9 -47 18 -11 -2 -90 -42 -22 -39 -10 35 42 2 0 8 1 -45
5824 -45 -5 -18 -9 -28 0 -56 -12 -1 -22 23 52 46 4 33 11 -43 -48 50 -2 13 -31 -6 46 19 15 26 -17 12 23 6 64 72 -47
5857 -47 -4 69 76 49 -30 31 58 11 16 74 11 20 9 32 -14 32 62 44 -6 55 7 104 -6 22 68 -17 20 -36 -37 46 96 38
5889C8qJ0j3J8p7L2O5j0q7K7QN8o8O5o3J0Qj8j04J32J4q4Q0m6o4J53q3p3M6lj9
5920e6N0k9N0Kj08O5k6QL5J1k2p1O8nj3N3m7L9K3r6J0O8O4r9OK3L4p9n5O6j2N6
5952A3K0o8rk3P8m4J1L9l1Qk5N9pJ0l1l6j6Q7j9%j7k7Q1l7o1nP0J6n3M7k8M1k2
5985B1oK6n3M4j7l2R1o6m6O5k2O2Pl0Jn2N2Jj0pK3KK9j09M8lmK5m3j2R3n5qk7
6019a2J1j8R0j36N6L9j2L4J1o3n0N8k5O6o2k3k0O3pk0N4o0qL5K9m6OJ2qK2j6l5
6051c5MP4rn1n7J01N8q8l0L0rL3n4k3J09n9Pl8j5P4k9l0O9m9O0m9kl1L9N4p3L4
6083A5J9k7m2O2j17N7Pl8N0QR0n5kQrJk3j0KM4o4N5qkL2p8R7pn1m0M2k7J0L8l4
6118CKL5M4j3j0j03OJ47p1k0J6L3j6m8K3kK2mn3k8L1O7l5k7QJ6M2m8o2M1N4o5
$$ plain form
5889 38 30 40 27 45 -32 0 65 55 -32 -5 3 61 -7 58 -5 5 13 -5 -109 23 37 -47 33 -13 -77 76 -7 -80 -34 -37 -56
5920 -56 -6 -35 15 17 -91 -26 -52 -44 -9 2 -20 -91 -23 -28 -41 12 -35 4 27 -69 -59 9 73 -26 -20 3 37 -42 -97 -31 -43 13
5952 13 33 -35 -44 -67 11 -33 -22 17 -14 -6 -31 28 21 31 0 -36 -52 35 16 16 -1 -28 53 16 -45 -50 20 36 -17 30 2 43 21
5985 21 15 41 -12 32 15 -17 74 8 -38 27 5 67 74 44 45 -7 45 46 36 29 52 54 83 -26 22 19 15 40 -3 -15 78 23 15 -12
6019 -12 -1 -19 71 -65 -9 30 18 52 63 0 -50 8 -17 49 -13 -36 -56 7 0 -20 34 -26 -34 1 30 -16 -10 2 -6 16 0 -35
6051 -35 -31 43 34 -17 -74 27 85 -3 -33 -3 -12 21 -33 -56 53 -6 1 -37 -52 22 -7 -37 32 -17 43 -6 -8 -39 0 54 -19 15
6083 15 34 7 -35 27 -90 -33 -26 -64 -14 -6 84 29 27 35 26 27 4 -6 -4 40 -24 31 23 21 53 -25 72 65 14 -26 16 -11 -1 37 3
6118 3 5 40 84 71 61 -42 -36 111 40 20 36 69 53 5 28 26 48 44 -9 -37 -6 61 26 -1 7 23 65 17 -45 -4 50 -15
6150a5K3J6J1%K8j40O2N9j2l0J8k2K9j3q6O1nQ2m7j1Jj9ok2kL2K0m0rK1M7j7k7
6183a3J2l2L4M0p5n2J30l3JOmk7m3P2m4JK2Op2R0Qp1J6Jj6O9l5J7rPL9n6QJ3L1
6218D1m9m9QR5j2J9p1K3L9Pj27O0P5m6M3k5n8P5k3J9l5k4J2j5J4J7k6M6m3m1R7
6249D6j9L6r4Q2n5P8p2JrK9L3k7o5L7Pl2mj2Q1j9L6p7QM1o9N3M7m7j8n3K8J7Q1
6282F9lj20J2K5j4j5L3o7R1j9k4O2jm4Om1j0JQ6p0J9K0J7l1l3m7R1oL4l9l7N1
6314dp2K2L5kpJ2K3q5P3m8m2L1N0j4o7P7K3l3ljpj4N1P2j52P4Jo5L7N1k1k2K1
6347f%L9M3m3j6l6n5J37r2lLO2K8l7j1m0K4k2J0Kj0K2O0jn3J02jj19K0l6K1L6
6379B8o2N4l1L7qr9R0K7Pkn9j5Q3n5K7o6N0J0%j2QM4k7m7K1ml5Q3j9n5L3M7k7
$$ plain form
6150 -15 8 24 35 35 63 -77 -15 44 32 2 20 -2 27 14 -72 -11 -16 66 19 8 9 -10 -16 -38 -40 -8 12 -28 -37 -16 31 14 -13
6183 -13 -1 -33 1 41 -34 -86 44 11 12 18 14 -13 -56 16 -28 -27 -5 1 -71 19 27 -44 -28 -27 -43 26 -9 8 -1 6 45 -11 -3 10 41
6218 41 -8 -57 -49 46 34 53 -18 5 44 51 -76 -16 59 13 56 31 -27 48 25 44 9 -15 -3 -18 -4 13 -13 33 -10 -51 46
6249 46 27 63 -31 51 -4 74 2 3 -6 23 56 29 -36 1 8 -24 -28 -40 41 22 58 -19 -11 30 -39 14 61 14 -4 -57 -29 -12 69
6282 69 66 -54 -42 -17 -31 -46 -13 -80 11 -8 -32 30 29 -15 -9 -50 -60 -59 27 -43 -24 -4 13 -18 -51 -98 -7 -13 21 -18 -55 -4
6314 -4 -76 -54 -19 -21 -28 -16 7 -78 -5 -53 -95 -64 -14 -28 -95 -18 5 -28 -31 -32 -39 -53 -2 70 -82 -8 -7 -72 -35 16 -5 -27 -6
6347 -6 -6 33 76 33 17 -19 -74 63 -29 -32 -29 33 61 24 13 -27 -3 -25 -15 -13 -23 -1 59 58 5 107 106 -13 7 -29 -8 28
6379 28 -34 20 -11 26 18 -81 9 36 43 41 -18 -33 50 -5 22 -44 6 16 16 4 12 56 29 -18 3 -1 -36 47 28 -27 6 53 26
6412B6j02J0J00r8M3O3l2j2J9n7nL0o4N1j0k0J7R8j54JJ46j5k4j11M6J8qn0R6
6441Bj3m3J00j05P7k3l3lK4k6L1L7j27L5RO3j1l1j0j6K4j9P4k5J3m0o0O8M3M2
6471E7j06L7QN2Jk5k8K0J3o3J5pL5k3k7L8O0k1n9k2M0K1L5o7P2p5N4k5J9n5O9
6502D3K9p2ok4O3k9n2P9m2NL9nNj1Kj7j00J37j0p5k8J30K7q0L5p5O2p2K6L0j6
6533bJ5l1O0o5NL6j3m1m9M9N6K7n3qN7p5rJ4M2K1m6j6Jj8N3No0N8m5L7n0P9l6
6566bk4O1j8o4R5o0j4l4K0K3M8n0%j0N5j0p4Q7j2k8K4j7L5k8m0kM5K1k4N7m7o
6598Gp1J3K0J2M8k7j3j5m4P8m3M5j1%l8J0k8O4J1p0J8K6nN6l6J8l7R4r7L4J8j6
6630B1J05j42O4m4L2L1m1%J2l4J5jk3K7K5o9JJ0M7J9K6p3L6l2n0J2K2Ql4Q2n9
$$ plain form
6412 26 -76 -66 34 -64 -21 42 10 -2 17 -40 -45 -15 -79 -28 -38 -58 -41 57 -97 -96 50 35 11 -100 -54 -36 -44 -94 2
6441 2 -11 -54 46 -59 18 -5 -38 -41 -17 -43 -12 25 -102 -67 -58 5 -6 -37 -47 -63 -39 -58 16 -9 4 -36 -96 -28 15 57
6471 57 -49 -12 -4 48 49 24 -4 16 29 -34 -19 -26 9 -14 -41 -3 57 36 -23 -45 -5 16 51 -16 56 -19 35 10 29 -26 43
6502 43 72 0 -6 -30 33 4 -48 31 -11 -6 33 28 33 22 24 7 -93 44 34 -41 -69 61 88 8 43 -32 30 -42 -16 14 -2
6533 -2 13 -18 42 -23 -18 18 5 -36 -85 -36 20 47 -6 -14 43 -32 -41 -27 15 36 -10 -26 -25 -43 10 15 -45 13 -32 5 -45 34 -2
6566 -2 -26 35 17 -47 48 -12 -26 -60 -40 -17 31 -19 -19 -29 26 16 -58 29 17 -11 13 -4 31 3 -37 -39 6 27 3 60 13 7
6598 7 -64 -51 -31 -19 29 2 -11 -26 -70 8 -35 10 -1 -1 -39 -29 -57 7 18 -52 -34 -8 -13 43 7 25 -12 82 -15 19 37 21
6630 21 126 -16 48 4 36 67 26 26 38 4 19 18 -5 22 47 -22 -21 -11 36 55 81 8 44 12 -38 -26 -4 4 -30 52 -7
6661goM1LJ9o4L0l8KrL1KK6l6l2J8qP4n3o9Q9n1N1j4n0Q3kp9kQ1n9L0m1N6n4N1
$$ plain form
6661 -7 -13 28 31 50 -14 16 -22 -20 -29 2 4 30 -6 -38 -20 -28 46 -7 -76 13 -38 13 -1 -51 32 30 -49 -51 30 -29 1 -40 16 -38 13
$$ [...]
8191C2
##END NTUPLES=NMR FID
##END=
