##TITLE=1H_Ser 5-2-V
 CDCl3, 8 sc, 
 23.9.2020
##JCAMPDX= 6.0         $$ Bruker NMR JCAMP-DX V2.0
##DATA TYPE= NMR FID
##DATA CLASS= NTUPLES
##ORIGIN= UXNMR, Bruker Analytische Messtechnik GmbH
##OWNER= root
$$ XWIN-NMR		Version 3.5
$$ Wed Sep 23 08:46:52 2020 Russian Standard Time (UT+4h)  she@DPX200
##.OBSERVE FREQUENCY= 200.1315066352
##.OBSERVE NUCLEUS= ^1H
##.DELAY= (6, 6)
##.ACQUISITION MODE= SIMULTANEOUS
##.ACQUISITION SCHEME= undefined
##.AVERAGES= 8
##.DIGITISER RES= 18
##SPECTROMETER/DATA SYSTEM= spect
##.PULSE SEQUENCE= zg30
##.SOLVENT NAME= CDCl3
##.SHIFT REFERENCE= (INTERNAL, CDCl3, 0, 15.7039)
##AUDIT TRAIL= $$ (NUMBER, WHEN, WHO, WHERE, WHAT)
$$ ##TITLE= Audit trail, XWIN-NMR		Version 3.5
$$ ##JCAMPDX= 5.01
$$ ##ORIGIN= Bruker BioSpin GmbH
$$ ##OWNER= she
$$ F:/spectra/data/she/nmr/H-F/1/audita.txt
$$ ##AUDIT TRAIL=  $$ (NUMBER, WHEN, WHO, WHERE, WHAT)
(   1,<2020-09-23 08:45:54.29 +0400>,<she>,<DPX200>,
      <created by zg, POWCHK disabled, PULCHK disabled
       configuration hash MD5:
       00 E9 B6 7A A2 85 ED C7 34 08 36 98 17 FE 4E 26
       data hash MD5: 16K
       59 12 9C AA 52 08 45 4B 22 AA 02 66 E2 BF 11 DD>)
$$ ##END=
$$ 
$$ hash MD5
$$ F1 DC 48 F5 E9 AA C9 95 A5 76 D2 7A AC 8C AE 51
##$RELAX= 
##$RELAX= 
##$RELAX= 
##$RELAX= 
##$RELAX= 
##$RELAX= 
$$ Bruker specific parameters
$$ --------------------------
##$DU= <F:/spectra>
##$EXPNO= 1
##$NAME= <H-F>
##$PROCNO= 1
##$TYPE= <nmr>
##$USER= <she>
##$AMP= (0..31)
100 100 100 100 100 100 100 100 100 100 100 100 100 100 100 100 100 100 
100 100 100 100 100 100 100 100 100 100 100 100 100 100 
##$AQSEQ= 0
##$AQ_mod= 1
##$AUNM= <au_zg>
##$AUTOPOS= <>
##$BF1= 200.13
##$BF2= 200.13
##$BF3= 200.13
##$BF4= 200.13
##$BF5= 200.13
##$BF6= 200.13
##$BF7= 200.13
##$BF8= 200.13
##$BYTORDA= 1
##$CFDGTYP= 0
##$CFRGTYP= 5
##$CHEMSTR= <none>
##$CNST= (0..31)
1 1 145 1 1 1 1 1 1 1 1 1 1 1 1 1 1 1 1 1 1 1 1 1 1 1 1 1 1 1 1 1 
##$CPDPRG= <>
##$CPDPRG1= <>
##$CPDPRG2= <>
##$CPDPRG3= <>
##$CPDPRG4= <mlev>
##$CPDPRG5= <mlev>
##$CPDPRG6= <mlev>
##$CPDPRG7= <mlev>
##$CPDPRG8= <mlev>
##$CPDPRGB= <>
##$CPDPRGT= <>
##$D= (0..31)
0 1.2 0 0 0 0 0 0 0 0.06 0 0.03 0 0 0 0 0.0002 0 0 0 0 0 0 0 0 0 0 0 0 
0 0 0 
##$DATE= 1600836353
##$DBL= (0..7)
120 120 120 120 120 120 120 120 
##$DBP= (0..7)
150 150 150 150 150 150 150 150 
##$DBP07= 0
##$DBPNAM0= <>
##$DBPNAM1= <>
##$DBPNAM2= <>
##$DBPNAM3= <>
##$DBPNAM4= <>
##$DBPNAM5= <>
##$DBPNAM6= <>
##$DBPNAM7= <>
##$DBPOAL= (0..7)
0.5 0.5 0.5 0.5 0.5 0.5 0.5 0.5 
##$DBPOFFS= (0..7)
0 0 0 0 0 0 0 0 
##$DE= 6
##$DECBNUC= <off>
##$DECIM= 32
##$DECNUC= <off>
##$DECSTAT= 4
##$DIGMOD= 1
##$DIGTYP= 9
##$DL= (0..7)
0 120 120 120 120 120 120 120 
##$DP= (0..7)
150 150 150 150 150 150 150 150 
##$DP07= 0
##$DPNAME0= <>
##$DPNAME1= <>
##$DPNAME2= <>
##$DPNAME3= <>
##$DPNAME4= <>
##$DPNAME5= <>
##$DPNAME6= <>
##$DPNAME7= <>
##$DPOAL= (0..7)
0.5 0.5 0.5 0.5 0.5 0.5 0.5 0.5 
##$DPOFFS= (0..7)
0 0 0 0 0 0 0 0 
##$DQDMODE= 0
##$DR= 18
##$DS= 0
##$DSLIST= <SSSSSSSSSSSSSSS>
$$ [...]
##$SUBNAM2= <"">
##$SUBNAM3= <"">
##$SUBNAM4= <"">
##$SUBNAM5= <"">
##$SUBNAM6= <"">
##$SUBNAM7= <"">
##$SUBNAM8= <"">
##$SUBNAM9= <"">
##$SW= 16.880792210976
##$SWIBOX= (0..15)
0 0 2 0 0 0 0 0 0 0 0 0 0 0 0 0 
##$SW_h= 3378.37837837838
##$TD= 16384
##$TD0= 1
##$TE= 0
##$TE2= 300
##$TE3= 300
##$TEG= 300
##$TL= (0..7)
0 120 120 120 120 120 120 120 
##$TP= (0..7)
150 150 150 150 150 150 150 150 
##$TP07= 0
##$TPNAME0= <>
##$TPNAME1= <>
##$TPNAME2= <>
##$TPNAME3= <>
##$TPNAME4= <>
##$TPNAME5= <>
##$TPNAME6= <>
##$TPNAME7= <>
##$TPOAL= (0..7)
0.5 0.5 0.5 0.5 0.5 0.5 0.5 0.5 
##$TPOFFS= (0..7)
0 0 0 0 0 0 0 0 
##$TUNHIN= 0
##$TUNHOUT= 0
##$TUNXOUT= 0
##$USERA1= <user>
##$USERA2= <user>
##$USERA3= <user>
##$USERA4= <user>
##$USERA5= <user>
##$V9= 5
##$VALIST= <valist>
##$VCLIST= <CCCCCCCCCCCCCCC>
##$VD= 0
##$VDLIST= <DDDDDDDDDDDDDDD>
##$VPLIST= <PPPPPPPPPPPPPPP>
##$VTLIST= <TTTTTTTTTTTTTTT>
##$WBST= 1024
##$WBSW= 4
##$XGAIN= (0..3)
0 0 0 0 
##$XL= 0
##$YL= 0
##$YMAX_a= 66379
##$YMIN_a= -37686
##$ZGOPTNS= <>
##$ZL1= 120
##$ZL2= 120
##$ZL3= 120
##$ZL4= 120
##$ABSF1= 10
##$ABSF2= 0
##$ABSG= 5
##$ABSL= 3
##$ALPHA= 0
##$AQORDER= 0
##$ASSFAC= 0
##$ASSFACI= 0
##$ASSFACX= 0
##$ASSWID= 0
##$AUNMP= <proc_1d>
##$AZFE= 0.1
##$AZFW= 0.1
##$BCFW= 1
##$BC_mod= 2
##$BYTORDP= 1
##$COROFFS= 0
##$CY= 11.3945322036743
##$DATMOD= 1
##$DC= 2
##$DFILT= <>
##$DTYPP= 0
##$F1P= 16.9975609425685
##$F2P= -3.02152046262296
##$FCOR= 0.5
##$FTSIZE= 0
##$FT_mod= 4
##$GAMMA= 1
##$GB= 0.15
##$INTBC= 1
##$INTSCL= 1
##$ISEN= 128
##$LB= 0.24
##$LEV0= 0
##$LPBIN= 0
##$MAXI= 10000
##$MC2= 0
##$MEAN= 0
##$ME_mod= 0
##$MI= 1.114404
##$NCOEF= 0
##$NC_proc= 0
##$NLEV= 6
##$NOISF1= 3.799351
##$NOISF2= 2.8
##$NSP= 1
##$NTH_PI= 0
##$NZP= 0
##$OFFSET= 15.70392
##$PC= 1
##$PHC0= -9969.884
##$PHC1= 11.6009
##$PH_mod= 1
##$PKNL= yes
##$PPARMOD= 0
##$PSCAL= 0
##$PSIGN= 0
##$REVERSE= no
##$SF= 200.130013532006
##$SI= 16384
##$SIGF1= 3
##$SIGF2= 2
##$SINO= 400
##$SIOLD= 16384
##$SREGLST= <1H.CDCl3>
##$SSB= 0
##$STSI= 0
##$STSR= 0
##$SW_p= 3612.71676300578
##$SYMM= 0
##$S_DEV= 0
##$TDeff= 0
##$TDoff= 0
##$TI= <>
##$TILT= no
##$TM1= 0
##$TM2= 0
##$TOPLEV= 0
##$USERP1= <user>
##$USERP2= <user>
##$USERP3= <user>
##$USERP4= <user>
##$USERP5= <user>
##$WDW= 1
##$XDIM= 8192
##$YMAX_p= 0
##$YMIN_p= 0
$$ End of Bruker specific parameters
$$ ---------------------------------
##NTUPLES= NMR FID
##VAR_NAME=  TIME,          FID/REAL,        FID/IMAG
##SYMBOL=    X,             R,               I
##VAR_TYPE=  INDEPENDENT,   DEPENDENT,       DEPENDENT
##VAR_FORM=  AFFN,          ASDF,            ASDF
##VAR_DIM=   8192,          8192,            8192
##UNITS=     SECONDS,       ARBITRARY UNITS, ARBITRARY UNITS
##FACTOR=    0.000296,      1,               1
##FIRST=     0,             0,               0
##LAST=      2.424536,      0,               0
##MIN=       0,             -37686,          0
##MAX=       2.424536,      66379,           0
$$ Real data points
##PAGE= N=1
##DATA TABLE= (X++(R..R)), XYDATA
$$ [...]
1731B79o08L87L39k06L78q73m2L34M93o70J21J20L1L07q78K09J94O12m76j62j32
$$ 279 -329 58 397 191 569 -304 -346 -12 481 -189 -68 52 83 390 -488 -279 -85 527 51 -111 -243
1752b43O6L21j57m36K23M24k26k59m3k57L59M50l87q48P92j14m6k8l28M12K74
$$ -243 -177 144 -13 -449 -226 198 -28 -287 -330 -587 -228 222 -165 -1013 -221 -335 -381 -409 -737 -325 -51
1773e1k30n31J77M60Q6K98o72J44K42L09p50M65K02K10k16l30l5Q0P50m23n9k33
$$ -51 -281 -812 -635 -175 -89 209 -463 -319 -77 232 -518 -53 149 359 143 -187 -222 -142 608 185 126 -107
1795a07J06J3L67k86l89J004k09m61m69M65M44o8j80n91O96O1j82k34j7M98m1
$$ -107 -1 12 379 93 -296 708 499 38 -431 34 478 410 230 -361 335 396 214 -20 -37 461 420
1816D20N7q44K30M15R9l13j15K66j8M94q51M8J15L03k47k85k29J24O54j49n06
$$ 420 477 -367 -137 278 377 64 -51 215 197 691 -160 -112 3 306 59 -226 -455 -331 323 174 -332
1837c32n6O90k73l13q1k84J008k56j72n22L06J52J40M3o51N58L06p6o38M67J09
$$ -332 -388 302 29 -284 -365 -649 359 103 -69 -591 -285 -133 7 50 -601 -43 263 187 -451 16 125
1858A25K8j35m12L68J32J76n33M71l5k08K82m78rK60P15n36k0J2r5M58l51l6k99
$$ 125 153 18 -394 -26 106 282 -251 220 185 -23 259 -219 -228 32 747 211 191 203 108 566 215 179 -120
1881a20R50l05o63K87l66O50M10o37n52P12n8m28PK73P4R7K9p11N61j12J0Q5l07
$$ -120 830 525 -138 149 -217 433 843 206 -346 366 308 -120 -113 160 234 331 360 -351 210 98 108 193 -114
1904a14k14L14L98p97L6J52M65m05m33J34P7O61k88k97J62kj8L9q6j76O79k77
$$ -114 -328 -14 384 -413 -377 -225 240 -165 -598 -464 -387 274 -14 -311 -149 -151 -169 -130 -216 -392 287 10
1926A0l39p3j02N02J80m80k4J20N7Rj10L37J03J03n5o28K63L37M6j6J67j55l68
$$ 10 -329 -402 -504 -2 178 -302 -326 -206 -149 -140 -250 87 190 293 238 -390 -127 210 256 240 407 252 -116
1949a16N10k62k20L1O58m68k56J12k05P73N1n91k84Q83m74m10L00j03O61k60l76
$$ -116 394 132 -88 -57 601 133 -123 -11 -216 557 608 17 -267 616 142 -268 32 -71 590 330 -46
1970d6l59J90J06K98k49l44M44K0k12k02J99J38OQ3l06J7K73J22o55L48k6R6l29
$$ -46 -405 -215 -109 189 -60 -404 40 60 -152 -354 -155 -17 -11 72 -234 -217 56 178 -477 -129 -155 -59 -388
1993c88k27K84K06O40o16m67L08Q8J6m0J57j78N74l46k56J09k62N16J50l7p66
$$ -388 -615 -331 -125 515 -101 -568 -260 -172 -156 -196 -39 -217 357 11 -245 -136 -398 118 268 231 -535
2014e35O44n8K27m61K74J76m1J48p47K64K27N7m4j87K80j08K44k25p8M6P0J92
$$ -535 109 51 278 -183 91 267 226 374 -373 -109 118 175 131 -56 224 116 360 135 57 103 173 365
2036C65n12J01J22J07nk76M1r0J57N3k10r9O74n00mk18K91K74l33J66m41K39J09
$$ 365 -147 -46 76 183 178 -98 -57 -147 10 63 -147 -246 428 -72 -76 -294 -3 271 -62 104 -337 -98 11
2059A1k12l21K21L4J82L0l58j52N02K94l41k92J03K54J37n38J93J83L65l57j51
$$ 11 -201 -522 -301 -267 -85 -55 -413 -565 -63 231 -110 -402 -299 -45 92 -446 -253 -70 295 -62 -213
2080b13M9J5N11j59j8k73L06j00L3p0l4R3m8J5l07K17L15l31J22k34M25J93m1
$$ -213 -164 -149 362 203 185 -88 218 118 151 81 47 140 92 107 -200 17 332 1 123 -111 314 507 466
2103D66p09L93L14k37K6k65M05j55P5r5j7k70l8N19o31L81n1N91m84k43l0j35
$$ 466 -243 150 464 227 253 -12 393 238 313 218 201 -69 -107 412 -219 162 111 702 218 -25 -55 -190
2125a90L50j23o8j74M99m31J32k18R8L0J1J66p73O00n4j75K46Qm1J31O9m91k2
$$ -190 160 37 -31 -205 294 -137 -5 -223 -125 -95 -84 82 -691 -91 -145 -320 -74 -66 -107 24 93 -398 -420
2148d20J79L55j97j79p3Q2N41l52l6k8K31j4l70R8l5L82L4k32j14L26l50J68k5
$$ -420 -241 114 -83 -262 -335 -253 288 -64 -100 -128 103 89 -281 -183 -218 164 198 -34 -148 178 -172 -4 -29
2171b9N9J39O1j98k15N21k84j5P2k57N15Qm13j12O9K96j61P5m35L0L91L76m92
$$ -29 30 169 230 32 -183 338 54 39 111 -146 369 377 -36 -148 -79 217 56 131 -304 -274 117 493 1
2194AQ0m09L00K5r1J74l2J50k61j24q1K84K1j54k9j32L93j83k13L3K31J27r7k27
$$ 1 81 -328 -28 -3 -94 80 48 198 -63 -187 -268 16 37 -117 -146 -278 115 -68 -281 -248 -17 110 13 -214
2218b14j91L38k14M8J84l36J71J08j32l6K92K6K63l70J42r1r3L60k70J8P5J94
$$ -214 -405 -67 -281 -233 -49 -385 -214 -106 -238 -274 18 44 307 -63 79 -12 -105 255 -15 3 78 272
2240B72l99O2k84M44M52m44k11O0K52Q1k51p3J32R3k07M1K1L22j07Q5l63K04J17
$$ 272 -127 -65 -349 95 547 103 -108 -48 204 285 34 -39 93 186 -21 20 41 363 256 341 -22 182 299
2263B99r1j4l86K91J21l05L2j20P4N2K01m31Q4Q2J60Kl50J5K01L64n40M2o6K34
$$ 299 208 194 -192 99 220 -85 -53 -173 -99 -47 154 -277 -193 -111 49 51 -299 -284 -83 281 -259 -217 -283 -49
2287d9K52k6n77J55M61j75k59L1l4K82L2k32l79N07R4j61j8K2j2j58M02m36L88
$$ -49 203 177 -400 -245 216 41 -218 -187 -221 61 93 -139 -518 -11 83 -78 -96 -74 -86 -244 158 -278 110
2310A10N4Q2j96Q9n10N40K24l68J25n7O9j87j48J51K83J33l23R0J10j80J27M1
$$ 110 164 246 50 139 -371 169 393 25 150 93 162 -25 -173 -22 261 394 71 161 271 91 218 259
2332B59o2l16L69k72j45Q5N09l67j13L01o85N31l29L32k10K6K13k71K78n07M68
$$ 259 197 -119 250 -22 -167 -82 427 60 -53 248 -437 94 -235 97 -113 -87 126 -145 133 -374 94
2353I4m7R2j80k33l6M20j19J18l55K24k5K6k79j45N37J74l53k8q2L49j76j32K42
$$ 94 47 139 -41 -274 -310 110 -9 109 -246 -22 -47 -21 -300 -445 92 266 -87 -115 -197 152 -24 -156 86
2376H6n13Q06l49o2k60L92j24k4K28n60M03J66J22m81L69j02k6L6j23K76J6L6
$$ 86 -427 379 30 -32 -292 100 -24 -48 180 -380 23 189 311 -170 199 97 71 107 -16 260 276 312
2398C12k91j3J96KM8k8k65J38J75k07k0J2R5Q1k17r8j40J09K96j98k08J91K30
$$ 312 21 8 204 206 254 226 -39 99 274 67 47 59 154 235 18 -80 -220 -111 185 -13 -221 -30 200
2421B00l54q7j15K53K34k72K08l51K16J03j64r7K14J23j08l01J96J14m10N41k00
$$ 200 -154 -241 -356 -103 131 -141 67 -284 -68 35 -129 -226 -12 111 3 -298 -102 12 -398 143 -57
2442e7O3L2j35j84J81Oj11L69k41K2j54L52j73Q4oj85L13j89N7j31K74l38N72
$$ -57 6 38 -97 -281 -100 -94 -205 164 -77 -55 -209 143 -30 54 48 -137 176 -13 44 -87 187 -151 421
2465D21m14m1L4KL49m91N2L68q9j75J47J22Qj47m43J76K19j22M45n87J66L63j44
$$ 421 7 -34 0 2 351 -140 -88 280 191 16 163 285 293 146 -297 -121 98 -24 421 -166 0 363 219
2488B19n49M56j17P7R5j17O5j75J93j43j25N5J61j73Mm2j80K37O8M9k42j33K98
$$ 219 -330 126 9 86 181 64 129 -46 147 4 -121 -66 95 -78 -74 -116 -296 -59 9 58 -184 -317 -19
2511a9j09j18Q9K24j11j71P1r2K25n3J84k13J37J58l7K8m31K54KJ25k3k43O6K94
$$ -19 -128 -246 -157 67 -44 -215 -144 -236 -11 -64 120 -93 44 202 165 193 -238 16 18 143 120 -123 -57 237
2535B37j22nR1r8K76n86K26J17r5m5J96k63J73L9o5k33Q1J16L0J20M6m97J35M66
$$ 237 115 110 201 103 379 -207 19 136 41 -4 192 -71 102 141 76 -157 -76 40 70 190 236 -261 -126 340
2559C40l41k68L20k0O2K16n36K21k8J49k16j2J4J68J0j03j16k66L78N7N5j41P3
$$ 340 -1 -269 51 31 93 309 -227 -6 -34 115 -101 -113 -99 69 79 -24 -140 -406 -28 29 84 -57 16
2582A6J07n6k69p0K99K5k19J9J60j67J53mn7m1J9L06l11j6J98k3P9m16K94MN3
$$ 16 123 67 -202 -272 27 52 -167 -148 12 -155 -2 -6 -63 -104 -85 221 -90 -106 92 69 148 -268 26 30 83
2607H3k47j05L19J9J64j38j41N0J68q9k71j3M07k34J20J55j47J55m08K65q9k46
$$ 83 -164 -269 50 69 233 95 -46 4 172 83 -188 -201 206 -28 92 247 100 255 -153 112 23 -223
2629b23K73o4P2j08J12k60K09n1k07M79k10o2j37L42k40j5M0K03k98K02kJ21l26
$$ -223 50 -14 58 -50 62 -198 11 -40 -247 232 22 -40 -177 165 -75 -90 -50 153 -145 57 55 176 -150
2652a50k24L81Rk76K87m1k23L24l39M3m8K94l2j21J81Q2l66J40q7R7K44Nn7j78
$$ -150 -374 7 16 -260 27 -14 -237 87 -252 -209 -257 37 5 -116 65 147 -219 -79 -166 -69 175 180 123 -55
2676e5J3J13L8n3l96N18m5k11l5K82J0J42L2m24r9J29J88l1j07J15l9l5k37LJ39
$$ -55 -42 71 109 56 -340 178 133 -78 -113 169 179 321 353 -71 -170 -41 147 116 9 124 85 50 -187 -184 -45
2701d5J35M5o6J0q3r0N1R4l2L16l55k06J33J27j8k1J28j44J16q1j20p3J40j22
$$ -45 90 135 69 79 -4 -94 -43 51 19 335 -20 -226 -93 34 16 -5 123 -21 95 14 -106 -179 -39 -161
2725a61m1N18m10r5J60j20N1J23P1p6J7r6q8J24j54L31k24N4M1Q1k31K08P1j37
$$ -161 -202 316 -94 -189 -29 -149 -98 25 96 20 37 -59 -147 -23 -177 154 -70 -16 25 106 -125 83 154 17
2749A7r3m5O9J7p0J74n5k4n5J3J42m0j89M71l07O9k56L57k62K38m2k64J70n4j19
$$ 17 -76 -121 -52 -35 -105 69 14 -10 -65 -52 90 50 -139 332 25 94 -162 195 -67 171 129 -135 35 -19 -138
2774a38J51P1M8J03Q4l90K28M4P0l03M8k8k16J22N8J19j19jm3J06j93L1K51r0
$$ -138 13 84 132 235 319 -71 157 201 271 -32 16 -12 -228 -106 -48 71 -48 -49 -92 14 -179 -148 103 13
2798A3j60P9Rj7m7j51J59K72l8O1k71j16J01J77r2K46l28R4J13m50J82J77j28
$$ 13 -147 -68 -59 -76 -123 -274 -115 157 119 180 -91 -207 -106 71 -21 225 -103 -9 104 -346 -164 13 -115
2821a15N1K10k29j01L30m90M28j11p3R8J1J35k28K31M3Nj87r7J56j14M05m08R6
$$ -115 -64 146 -83 -184 146 -344 84 -27 -100 -2 9 144 -84 147 190 195 8 -89 67 -47 358 -50 46
2844D6p0J91k42K51L2l12K70k25P1m8p9k27J98Q4n5k2KJ78j17P4J11J17l18P8
$$ 46 -24 167 -75 176 208 -104 166 -59 12 -36 -115 -342 -144 -60 -115 -137 -135 43 -74 0 111 228 -90 -12
2868a2L8j25l27K57L09l83J78j00m9K3L94j00l72K05j41J02R1q2P4J56j6k01j53
$$ -12 26 -99 -426 -169 140 -243 -65 -165 -214 -191 203 103 -269 -64 -205 -103 -12 -94 -20 136 120 -81 -234
2891b34J26J8O0k25J59k5K19j98O4K08j38m8L89m82J80nj14J7L4j42K2J05J0j0
$$ -234 -108 -90 -30 -255 -96 -121 98 -100 -36 172 34 -14 375 -107 73 68 -46 -29 5 -137 -115 -10 0 -10
2915a0Q6M7k35L64k60J53j25J5j99K21J18k5k34P6p6L20rl89L29l36K44n1k02
$$ -10 76 123 -112 252 -8 145 20 35 -164 57 175 150 -84 -8 -84 236 227 -162 167 -169 75 24 -178
2938a78K07k58L81k67J36p9J52m0j01j14J67Q9k18j73J62N03m67J32l41J30L38
$$ -178 29 -229 152 -115 21 -58 94 54 -47 -161 6 95 -123 -296 -134 369 -98 34 -307 -177 161
2959A61k30J46Q2j89J43K13j25k14L10q6k10L0MO7Q9o5k76P3N0%O0j67qJ74l9
$$ 161 -69 77 159 -30 113 326 201 -13 297 211 1 31 35 102 191 126 -150 -77 -27 -27 33 -134 -142 32 -7
2984gk75M75j12P9j43K9J05k07K17j27o7l3J3J24o6j88J58K4P0k07K69k4l36J41
$$ -7 -282 193 81 160 17 46 151 -56 161 34 -33 -66 -53 71 5 -183 -25 -1 69 -138 131 107 -229 -88
3008h8q8L41j96omnO1j70j57J44M1K0PMl58N58j3j0r8j54J75q8J90r7j39r0O8
$$ -88 -176 165 -31 -37 -41 -46 15 -155 -312 -168 -127 -107 -100 -96 -454 104 91 81 -17 -171 4 -84 106 9 -130 -220 -152
3035a52K04j36R3j12K01j2k10J93Q0k22J47J14k45k08J76K26q1Kl6P2l36J65k17
$$ -152 52 -84 9 -103 98 86 -124 69 149 -73 74 188 -57 -265 -89 137 56 58 22 94 -242 -77 -294
3058b94N58l58K29n5r1j16K32o7k46J94rj29L06k26J0J17j95J68k55L15J7j36
$$ -294 264 -94 135 80 -11 -127 105 38 -208 -14 -23 -152 154 -72 -62 55 -140 28 -227 88 105 -31
3080c1K08j02j37J18j81N6R4QQ3m32L69M7N8o0j6o6j90L36m27K25J99j24J21j61
$$ -31 177 75 -62 56 -125 -69 25 33 116 -316 53 100 158 98 82 16 -174 162 -265 -40 159 35 156 -5
3104en5J45n6k56L29j93K17j91J82p6O5k07J67j40J62j8LJ37m2k50N2j84L42j0
$$ -5 -60 85 29 -227 102 -91 126 -65 117 41 106 -101 66 -74 88 70 73 210 168 -82 -30 -214 128 118
3128A18j12L1j09r5J21J68l3Q2j33j65J35L28J5l06N8R1J8j15j64K61j85L0r9
$$ 118 6 37 -72 -167 -46 122 89 171 38 -127 8 336 351 45 103 194 212 97 -67 194 9 39 -60
3151f0lO3k8L97l16j40K6O9K4jJ64k56L3j15o2J64J51k14K0n2J1J25l47K30j80
$$ -60 -63 0 -28 369 53 -87 -61 8 32 31 195 -61 -28 -143 -205 -41 110 -104 -84 -136 -125 0 -347 -117 -297
3176b97J12J08J07J5j60K0N5Q0j16L2J41k23j46J49J75L48l28L3R3l52j35K63
$$ -297 -185 -77 30 45 -115 -95 -40 40 -76 -44 97 -126 -272 -123 52 400 72 105 198 -154 -289 -26
3198b6J56k68P5K50j27K81l37r2O1j93K71j77K85l21N17l56M5L2J7Mj48q3L12
$$ -26 130 -138 -63 187 60 341 4 -88 -27 -220 51 -126 159 -162 355 -1 44 76 93 97 -51 -134 178
3221A78k4n0k80P0P3K09l19K08l6k5j30J27l1J30J48J2ql62N7o3K8j83J26J31
$$ 178 154 104 -176 -106 -33 176 -143 65 29 4 -126 1 -30 100 248 260 252 -110 -53 -116 -88 -271 -145 -14
3245a4m9qj96P8J82N4P6k35J00j02R7K58n7K0k79j70L08J02j84K52l44L19j31
$$ -14 -63 -71 -267 -189 -7 47 123 -112 -12 -114 -17 241 184 204 -75 -245 63 165 -19 233 -111 208 77
3268G7j1J38k55K02p0O9j00j69K99j21J23j95Q2K77k20j13M5j22r3M28k12J50
$$ 77 66 204 -51 151 81 150 50 -119 180 59 182 -13 69 346 126 13 58 -64 -157 271 59 209
3290B09k00J0j74J72J80k07K1l5L5n5J47k18J48O1j26j95L01o7JJ03k8j72n9J37
$$ 209 9 19 -155 17 197 -10 11 -24 11 -44 103 -115 33 94 -32 -227 74 7 8 111 83 -89 -148 -11
3314a1J3M4j20J59l06J28J37L2m21R4K08J35l66K58J00m2r3R6J18j1j52O3j11
$$ -11 2 46 -74 85 -221 -93 44 76 -345 -251 -43 92 -274 -16 84 42 -51 45 163 152 0 63 -48
3337d8j09J82P8j52J39m9k6j1rL1Q5l6j7K5l1j56L31m68K63J43k7k05L22j11k47
$$ -48 -157 25 103 -49 90 41 15 4 -5 26 111 75 58 83 52 -104 227 -241 22 165 138 -67 255 144 -103
3362a03J52K31l14k5pM0J25r5j1j03J12Q5M4j41j13K28k46R7R1q1J01r1j4k48
$$ -103 49 280 -34 -59 -66 -26 99 4 -7 -110 2 87 131 -10 -123 105 -141 -44 47 -34 67 -24 -38 -286
3386b86K60N9J20j68l4j94J3K1%K4L46j90J49k89P2Ol3%M0J75j9j25L7L7J02k08
$$ -286 -26 33 153 -15 -49 -243 -230 -209 -209 -185 161 -29 120 -169 -97 -91 -124 -124 -84 91 72 -53 -16 21 123 -85
3412h5j7n7J39J79k1L1M1j53J65l19J38O5J83l72J94r2J17j23J90j04m9J97j00
$$ -85 -102 -159 -20 159 138 169 210 57 222 -97 41 106 289 -83 111 19 136 13 203 99 50 247 147
3435A47p6j36N6q7j34N43l33M07n40K83l5qj4k34L00p8j77K55k97n8K57M3k26
$$ 147 71 -65 -9 -96 -230 313 -20 387 -153 130 95 87 73 -161 139 61 -116 139 -158 -216 41 84 -142
3458a42L12n64P04l05j05L48k37n0j33J63j24l8r4J70Q9O3n0n7J57j15J39j23
$$ -142 170 -394 310 5 -100 248 11 -39 -172 -9 -133 -171 -265 -95 -6 57 7 -50 107 -8 131 8
3480HP4k81K55l02K37j61L84Jm64M10P7l07K58k1j95L5j8N0l57M58Or0RK94k25
$$ 8 82 -199 56 -246 -9 -170 214 215 -249 161 238 -69 189 168 -27 8 -10 40 -317 141 147 57 66 360 135
3505A35j7J74l64J05o1J63l55K19j4J22J7k6L3j47L8j27n2l5K17o0K6K8n0O1j64
$$ 135 118 292 -72 33 -28 135 -220 -1 -15 107 124 98 131 -16 22 -105 -157 -192 25 -35 -9 19 -31 30 -134
3530a34R0k03J05J2L21k38n2l4J01J2j8N3j61j05J04J3J52j47K48K0j52p9M7J52
$$ -134 -44 -247 -142 -130 191 -47 -99 -133 -32 -20 -38 15 -146 -251 -147 -134 18 -129 119 139 -13 -92 -45 107
3554A07k2Om46K62K85k19q9j1J98j67J88j64J0J81o7j82J44R4K8k40L34j58p1
$$ 107 85 91 -355 -93 192 -27 -116 -127 71 -96 92 -72 -62 119 52 -130 14 108 136 -104 230 72 1
3577AJ83j22J62k90k11M08k2j24K83k51j9o7r3J31M2K00j60k64J66L6R1k63K46
$$ 1 184 62 224 -66 -277 131 109 -15 268 17 -2 -69 -162 -31 11 211 51 -213 -47 -11 80 -183 63
3600F3m33J65J95j29K17k10J34j56K50r4j27j33M94J2k63J28Qk85J13L5P4m08
$$ 63 -370 -205 -10 -139 78 -132 2 -154 96 2 -125 -258 236 248 -15 113 121 -164 -51 -16 58 -350
3622c50O24p6m56L00p4J40k52K66j58K11j12J65k68M5j8O1n6J96j26J66o2k51
$$ -350 274 198 -258 42 -32 108 -144 122 -36 175 63 228 -40 5 -13 48 -8 188 62 228 166 -85
3644h5K04j15K79k67j36J14J16r9J43k77L77m24K10j92N5K12l30J18J17J90j64
$$ -85 119 4 283 16 -120 -6 110 11 154 -123 254 -170 40 -152 -97 115 -215 -97 20 210 46
3665D6r4J01RK8j49kj03K16J25j85m5K44p5j58P0n3N6J11k95K56k52j29K53M0
$$ 46 -48 53 62 90 -59 -61 -164 52 177 -8 -53 191 116 -42 28 -25 31 142 -153 103 -149 -278 -25 15
3689A5k6k72J48K03j0Q6k82j9L97l57J10j81J74p0m7m4J14k8J03k6j46K87j1q1
$$ 15 -11 -283 -135 68 58 144 -138 -157 240 -117 -7 -188 -14 -84 -131 -175 -61 -89 14 -12 -158 129 118 37
3713C7J72J5l34M00k08k81K9N13l52J59R2k03J06o0j28L8qJ99j13l8k45J37L48
$$ 37 209 224 -110 290 82 -199 -170 343 -9 150 242 39 145 85 -43 -5 -13 186 73 35 -210 -73 275
3736B75l26j45M67k36j68r2K90p8J96k21r4j05K80Q8k58M0J88k57M91k25l55K18
$$ 275 -51 -196 271 35 -133 -225 65 -13 183 -38 -132 -237 43 131 -127 -87 101 -156 335 110 -245 -27
3758b7NN6K70l28Q3j20q3L09k1j39J5r7o3L50l26L46j42k69L23j57n9M2J93j54
$$ -27 -22 34 304 -24 59 -61 -144 165 144 5 20 -77 -140 210 -116 230 88 -181 142 -15 -74 -32 161 7
3782GO7n3J96r5k7J62l85K1L34m21J83m1J26rQ9J44j33k72J66k2r0j74L47j83
$$ 7 74 21 217 122 95 257 -128 -107 227 -194 -11 -52 74 65 154 298 165 -107 59 37 -53 -227 120 -63
3806f3Q8J2j22L9j7rp0J03J6L54l89j5R9j26j8J07r9J03q0J10L7l2k26Q7l5J2
$$ -63 25 37 -85 -46 -63 -72 -142 -39 -23 331 -58 -73 26 -100 -118 -11 -110 -7 -87 23 60 28 -198 -111 -146 -134
3832a34K14j34L64k27L6k40p5N01j13l84L9K51l90M25l74J19L90q4n6j97R5M5
$$ -134 80 -54 310 83 119 -121 -196 305 192 -192 -153 98 -292 133 -241 -122 268 184 128 -69 26 71
3854G1J48j19k58K02j20K27l00p6M18j18K4r6o0J26K0j57K35K01k09j47M0j06
$$ 71 219 100 -158 44 -76 151 -149 -225 193 75 99 3 -57 69 89 -68 167 368 159 12 52 -54
3876e4j14L38j45r2K5J58p5k14%L01k37M10l38j64J41J90k79J87q3p8l0j33K86
$$ -54 -168 170 25 -67 -42 116 41 -173 -173 128 -109 301 -37 -201 -60 130 -149 38 -45 -123 -153 -286 0
3899@%j9J20K9j1r2k58M39j80pk21J22M8J46k75J87n2r4J37l90L59R9j21P5j13
$$ 0 0 -19 101 130 119 27 -231 208 28 21 -200 -78 -30 116 -159 28 -24 -118 19 -371 -12 87 -34 41 -72
3924g2Q1l6K26K9k63j48K32j42K09j57p6L02L6k03J88k47K36j15J89j14j85M3
$$ -72 9 -27 199 228 -35 -183 49 -93 116 -41 -117 185 221 18 206 -41 195 80 269 155 -30 13
3946A3k9K38k01R3k26J83j34m4J48J44j23k80K16O9K4j4n6R1J04m32K03K5m0J72
$$ 13 -16 222 21 114 -112 71 -63 -107 41 185 62 -218 -2 67 91 77 21 112 216 -216 -13 12 -28 144
3970A44Q8k17j35Q2J81j43%j54K43j16q5M2OM3l5r3L32j0j57l24L14J10j01j01
$$ 144 232 15 -120 -38 143 0 0 -154 89 -27 -112 -70 -64 -21 -56 -149 183 173 16 -308 6 116 15 -86
3994h6j65K60j9K0j31K48%N4k24M7o7L45l71J53k77J61K2j30K39l6n4j07K72M6
$$ -86 -251 9 -10 10 -121 127 127 181 -43 4 -63 282 -89 64 -213 -52 -30 -160 79 43 -11 -118 154 200
4018B00k71J27j02P9p7J98k59J34r8Q0r6P7J34j15j31L31k77J0K81j76O0q5J83
$$ 200 -71 56 -46 33 -44 154 -105 29 -69 11 -85 -8 126 11 -120 211 -66 -56 225 49 109 24 207
4041B07k63m7J73j21N0m3P0J72k37J6q4o5J53k30K03j85J88l8KN6J3K1j79K21
$$ 207 -56 -103 70 -51 -1 -44 26 198 -39 -23 -107 -172 -19 -249 -46 -231 -43 -81 -79 -23 -10 11 -168 53
4065E3j24J07j56N6J33k41K36M7M2k52Q3o4j02P3O5J2J21p3J74l73L88k82K13
$$ 53 -71 36 -120 -64 69 -172 64 111 153 -99 -16 -80 -182 -109 -44 -32 89 16 190 -183 205 -77 136
4088A36m9j88L0K89j15j71J50j56O9K50l16N0O2J53j77k1l2j34P5q8o7L65j66
$$ 136 87 -101 -71 218 103 -68 82 -74 -5 245 -71 -21 41 194 17 -4 -36 -170 -95 -183 -250 115 -51
4111e1onJ53k27J72j07K46l27J61m6j41L46r1r6Q0q3k11L16r3N2R2j71q3n4j02
$$ -51 -57 -62 91 -136 36 -71 175 -152 9 -37 -178 168 77 -19 61 -22 -233 83 -10 42 134 -37 -120 -174 -276
4136b76R0J52J93j72P8m1J43k26j85J91Q8l7%J0o8K73j27L02l34RJ99k21O8k2
$$ -276 -186 -34 159 -13 65 24 167 -59 -244 -53 35 -2 -2 8 -60 213 86 388 54 63 262 41 109 87
4160H7q4P5k15K42j16K72j28P3k96M5j5R5m0m2k21JM19O2k77L5m9K52k62n9O4
$$ 87 3 78 -137 105 -11 261 133 206 -90 -45 -60 35 -5 -47 -268 -267 152 214 -63 -28 -77 175 -87 -146 -82
4185h2J63o7m8R7l21K52j4j36m3K63j18N5p6o6k29L01K32k31R3j01q3K83k73k
$$ -82 81 14 -34 63 -258 -6 -20 -156 -199 64 -54 1 -75 -141 -370 -69 163 -68 25 -76 -159 124 -149 -151
4209a51P7M1j30L6O0K19J05k14K7K2J57j65j38jK18k09J80j8k06oP1j6L6q6K30
$$ -151 -74 -33 -163 -127 -67 152 257 43 70 92 249 84 -54 -55 163 -46 134 116 -90 -96 -25 -41 -5 -91 139
4234A39n3j65J20lj56K19j08k48M03k52L29k04n9j52L56k66L51l69L89k96j12
$$ 139 86 -79 41 38 -118 101 -7 -255 148 -104 225 21 -38 -190 166 -100 251 -118 271 -25 -137
4255a37J38j85K06j00J67k69L18p9n0M5j76J51P5J53l83Q9m7o4J96j10j27JM69
$$ -137 1 -184 22 -78 89 -180 138 59 9 54 -122 29 104 257 -126 -37 -84 -148 48 -62 -189 -188 281
4278B81m12M1K96k47j3J66j03j83Q6M5P8J5q4J8J9j13K20j49P3j59J03J32j82
$$ 281 -131 -90 206 -41 -54 112 9 -174 -88 -43 35 50 -34 -16 3 -110 110 -39 34 -125 -22 110 -72
4301g2j89J83K20r5l1J76n7r0r9J83j72k32N61k17J79k21j11P6K25J2rJ62m31
$$ -72 -261 -78 142 47 16 192 135 45 -54 129 -43 -275 286 69 248 27 -84 -8 217 229 220 382 -49
4324d9P1k54K82J74j66l3Q9N7j48k52L75n1k5r2J22J9r0l0K37j51k01K22k05J39
$$ -49 22 -232 50 224 58 25 114 171 23 -229 146 95 70 -22 100 119 29 -1 236 85 -116 106 -99 40
4348D0o4k44L42k03K66k82O2J08K9o2j36K98n0j86j34L09m6j81K03m3p0K0j21
$$ 40 -24 -268 74 -129 137 -145 -83 25 54 -8 -144 154 104 -82 -216 93 47 -134 69 26 -44 -24 -145
4371a45J4N60n18P9J22j3k31n7K04P3j60L6J65m9j37lP9N6J00j8J5l90J53J87
$$ -145 -131 429 -89 -10 112 99 -132 -189 15 88 -72 -36 129 80 -57 -60 19 75 175 157 172 -218 -65 122
4395A22j08J30PK51l42j23N7J71n3k05J65J05m24M23l35q0J71K03m81K38O8j36
$$ 122 14 144 151 402 60 -63 -6 165 112 -93 72 177 -247 176 -159 -239 -68 135 -346 -108 -40 -176
4417a76K15k76K33k00J14l7K57r9J42k9M0j88j19P5Q0k83L98J28l16j66JK31n1
$$ -176 39 -237 -4 -204 -90 -127 130 31 173 144 184 -4 -123 -48 32 -251 147 275 -41 -207 -206 25 -26
4440b6J12j2Q3k39j31K45p3j18O3J05N8l0KM2k3j0j45K10l5l5Q7q8p5K06j25J2
$$ -26 86 74 157 -82 -213 32 -41 -159 -96 9 67 37 39 81 58 48 -97 113 78 43 130 42 -33 173 48 60
4466F0r4J21J88k50j24j60J98P4r2j86L39l20K67r8k7Q9j5J53j79j96L66j3j44
$$ 60 -34 87 275 25 -99 -259 -61 13 -79 -265 74 -246 21 -77 -104 -15 -30 123 -56 -252 114 101 -43
4489d3J72j11kL4k3j06L6R0N5j00J39r7k7j66J46k6J67o3j69L46m88M24m28K3
$$ -43 129 18 16 50 27 -79 -43 47 102 2 141 44 17 -149 -3 -29 138 75 -94 252 -236 188 -240 -217
4513b17K07k9K8j98K13Oj35K01R3q1j22K53j14J4m3j40K4m1J05M3O4k95K96j50
$$ -217 -10 -39 -11 -209 4 10 -125 76 169 88 -34 219 105 119 76 -64 -40 -81 24 67 131 -164 132 -18
4537a8m6J89qk0j42j29O6L05p8l54L47r0N4J7j02J7k23K77j25j05J74j30N0J0
$$ -18 -64 125 117 97 -45 -174 -108 197 119 -235 112 22 76 93 -9 8 -215 62 -63 -168 6 -124 -74 -64
4561f4j3R1J17j13j16P9p2M8M2J13j05J01k00kL28q4j48j34J48o3JJ91l9o0j37
$$ -64 -77 14 131 18 -98 -19 -91 -43 -1 112 7 108 -92 -94 234 150 2 -132 16 -47 -46 145 106 46 -91
4586i1K9J75k49%o8L22j81k4k6J60M2J94l39R2rK20k18p4J78N1j94N3k08Q0J18
$$ -91 -62 113 -136 -136 -204 118 -63 -87 -113 47 89 283 -56 36 27 247 29 -45 133 184 -10 43 -165 -85 33
4611C3l31K78m7O8kK00l27L71l19J40j29JN5j4M8n6J04K21l12j9m7N1k01K80P2
$$ 33 -298 -20 -67 1 -1 199 -128 243 -76 64 -65 -64 -9 -23 25 -31 73 294 -18 -37 -84 -33 -234 46 118
4636A18q5l1q4K11l07j07L39p9P4k9J76k00k1l3L17k41j74Np2J17o9K2L01j68
$$ 118 33 2 -82 129 -178 -285 54 -25 49 20 196 -4 -25 -58 259 18 -156 -151 -223 -106 -175 -153 148 -20
4660b0J42k43J91k18J47J05j6J82k01P0R3k37J40j28J47%m4n4j36N9jJ67k81J36
$$ -20 122 -121 70 -148 -1 104 88 270 69 139 232 -5 135 7 154 154 110 56 -80 -21 -22 145 -136 0
4684@j72K31n1K11l02R2k07J77K43j40%j36J19r2J48k62L08q7j76J86j06j09O7
$$ 0 -172 59 8 219 -83 9 -198 -21 222 82 82 -54 65 -27 121 -141 167 80 -96 90 -16 -125 -58
4707e8L6p0J64j65K9j2K54J96n31L28j01J92m79J32K33j70J29Q6k36J64j41j13
$$ -58 -22 -92 72 -93 -64 -76 178 374 -157 171 70 262 -217 -85 148 -22 107 193 -43 121 -20 -133
4729a33L34n8k11k16L49k21J24N6L8j7Lj81J90Q0n1j7j39J35J40j35J6J46k05
$$ -133 201 143 -68 -284 65 -156 -32 24 62 45 48 -133 57 137 86 69 -70 65 205 70 86 232 27
4752B7j65P7k9KJ55O1j37r2P8pK5r0J7K38p4p5q7L5j69K36M1J37R2l12q2J13n9
$$ 27 -138 -61 -90 -88 67 128 -9 -101 -23 -30 -5 -95 -78 160 86 11 -76 -41 -210 26 67 204 296 -16 -98 15 -44
4779d4j2l5L4J08k0j52Q9O8j13J44J59l07j09J53k0L61k99O2j93J56o0K11l41
$$ -44 -56 -91 -57 51 31 -121 -32 36 -77 67 226 -81 -190 -37 -57 304 5 67 -126 30 -30 181 -160
4802a60J25Q6p2M3K66K6l66k03K82J90n7j25K64m38L75l67J66K8N4k1r7j25J14
$$ -160 -35 51 -21 22 288 314 -52 -255 27 217 160 35 299 -139 236 -131 35 63 117 96 -1 -126 -12
4825a2n2N9j01P3J14n8r2J69j53M4m3j36J12M0OJ63j45O5J5o3Mk1j58L03k66n9
$$ -12 -64 -5 -106 -33 81 23 -69 100 -53 -9 -52 -188 -76 -36 -30 133 -12 53 68 5 9 -12 -170 133 -133 -192
4851a92L16J02r8l23L48k68R5k13L58k67M3J18o0P2j71K07p3J7j76P6l07K19K25
$$ -192 124 226 128 -195 153 -115 -20 -233 125 -142 -99 19 -41 31 -140 67 -6 11 -165 -89 -396 -177 48
4874D8pj24J30Mj2R2l76K90p9K27l28J30J4n5J4L7K07k59J20n9J04k20L15j50
$$ 48 41 -83 47 51 39 131 -245 45 -34 193 -135 -5 9 -46 -32 5 212 -47 73 14 118 -102 213 63
4898F3j94J12j62no4L17Jl7n6m9L20k32l14K60J54j80q8L06n15M75Jj33J42j41
$$ 63 -131 -19 -181 -186 -250 67 68 31 -25 -74 246 14 -300 -40 114 -66 -154 152 -363 112 113 -20 122 -19
4922a9lL5l20M58l52J94Pk71J23J21j69P1K15K0j57JK9q3L6J2n9M3K69k40J18
$$ -19 -22 13 -307 151 -201 -7 0 -271 -148 -27 -196 -125 90 110 -47 -46 -17 -100 -64 -52 -111 -68 201 -39 79
4947G9j43k1n2o7L74l32L44k35l6J64n4P4M5M3k22j6jj76Q7R2K19j28k0K12n05
$$ 79 -64 -85 -137 -204 170 -162 182 -53 -89 75 21 95 140 183 -39 -55 -56 -232 -145 -53 166 38 18 230 -275
4972b75K60o5L8k18J14J7J07J70m15J44P1Q9j55K36k17K2L00k64j67K11Kp5J88
$$ -275 -15 -80 -42 -260 -146 -129 -22 148 -267 -123 -52 37 -118 118 -99 -77 223 -41 -208 3 5 -70 118
4995A18j00J7k61K07o2J57l4k53K79n6J82k74J42R3m34L16j98L9M1mK00k3j15
$$ 118 18 35 -226 -19 -81 76 42 -211 68 12 194 -80 62 155 -279 37 -161 -122 -81 -85 115 92 -23
5018b3JL2O2J69j63j98kP3K55l90L50r7j63J44j44Lk9L48j79j12N9M6j04j7J37
$$ -23 -22 10 72 241 78 -120 -122 -49 206 -184 166 69 -94 50 -94 -91 -120 228 49 -63 -4 42 -62 -79 58
5043E8j20J0K35l27K74n7M8J64k59J46k52m7J38J03q6M4K28l37j38L20l35K41
$$ 58 -62 -52 183 -144 130 73 121 285 26 172 -80 -127 11 114 28 72 300 -37 -175 145 -190 51
5065E1j22l1K4J06K50l68J84Jr9J31Q3j87j30j38J33J02q1J12q7L20j16k72J58
$$ 51 -71 -102 -78 28 278 -90 94 95 -4 127 210 23 -107 -245 -112 -10 -91 21 -66 254 138 -134 24
5088B4J8j23K76k01l8J27l13L38q8K60j48k00J7K27r0P7j92J37q4j81J96q6J83
$$ 24 42 -81 195 -6 -44 83 -230 108 20 280 132 -68 -51 176 86 163 -29 108 24 -157 39 -47 136
5111A36q3o4k5L71l26n3j83J2K03r2Q9O6L9o4j4J18k43Q2K00j71N3L6k45K47l1
$$ 136 53 -11 -36 335 9 -44 -227 -215 -12 -104 -15 51 90 26 12 130 -113 -31 169 -2 51 87 -158 89 58
5136E8K4p1j57M3R4J12r1j25L05j94o1j09J77j7MJ18j86k5J09J35k64K00J18M3
$$ 58 82 11 -146 -103 -9 103 12 -113 192 -2 -63 -172 5 -12 -8 110 -76 -101 8 143 -121 79 197 240
5160B40l98L19m89L79J12k76p0L25k77K5R2M1j69J88k5j37J1M1J19K9k55J92J1
$$ 240 -158 161 -328 51 163 -113 -183 142 -135 -110 -18 23 -146 42 17 -120 -109 -68 51 80 -175 17 28
5183B8j55J64p5M6p6j17O5j1J79J1L7j0J40j00J52k35K0j84J35k55L57l7lm8o
$$ 28 -127 37 -38 8 -68 -185 -120 -131 48 59 96 86 226 126 278 43 63 -121 14 -241 116 79 76 28 22
5208B2R5l35K25K42k59Kj23J08m7m4J13q8N1Q2j90p9K1J23k2j60J79M5K5o1J27
$$ 22 117 -218 7 249 -10 -8 -131 -23 -70 -114 -1 -89 -38 44 -146 -225 -204 -81 -103 -263 -84 -39 -14 -75 52
5233E2Mj81K44k22J98p8j47J36K60k58R0P4j25j92R1j27R2K33j03o3j01Q0O9j11
$$ 52 56 -125 119 -103 95 17 -130 6 266 8 98 172 47 -145 -54 -181 -89 144 41 -22 -123 -43 26 -85
5257h5LJ92j16J28j29P0q3r4n2R0j4K23k16J07j56J35J85k30n8J11Q8k8q6L49
$$ -85 -82 110 -6 122 -7 63 -20 -114 -166 -76 -90 133 -83 24 -132 3 188 -42 -100 11 99 71 -15 334
5281C34l39N3j98L43l43j0K93k68P2kk0K43o6l75L15k85P4J24rJ92r8kj35M5K38
$$ 334 -5 48 -150 193 -150 -160 133 -135 -63 -65 -85 158 92 -283 32 -253 -179 -55 -64 128 30 28 -107 -62 176
5306A76P5k16j96Q5P7K1J02j89J07l30L1J55j5p1J12K88k98N9pJ01q1Q2j25k1
$$ 176 251 35 -161 -76 1 22 124 -65 42 -288 -257 -102 -117 -188 -76 212 -86 -27 -34 67 -14 68 -57 -78
5330g8J00J08j96R4K29k83J15j3j73J63Q4M4j87k58J95J83J4k89K41l54L77j76
$$ -78 22 130 -66 28 257 -26 89 76 -97 66 150 194 7 -251 -56 127 141 -148 93 -261 116 -60
5352f0n5L84l34J15l5R2r1q0j04L62l61J70l89L88O9k84M20m60L84j19J2n4RN8
$$ -60 -115 269 -65 50 15 107 16 -64 -168 194 -167 3 -386 2 71 -213 207 -253 131 12 24 -30 -21 37
5376C7j06L07m70k6K18j9L4j76j19K3L95j01M5j25m9L2P5L00k69j07q8J35pK02
$$ 37 -69 238 -232 -258 -40 -59 -25 -201 -320 -297 98 -3 42 -83 -132 -100 -25 275 6 -101 -189 -54 -61 141
5400A41n0k09J22O5q5j01J60n5j97J53M6K12k32j36J58J4l5J2k12J26L4J83J0
$$ 141 91 -118 4 69 -16 -117 43 -12 -209 -56 -10 202 -30 -166 -8 6 -29 -17 -229 -103 -69 114 124
5423A24j21J43m5k4j14J18j03l5K34k53O4J46j43l06O15j55j62l6r8J49m2K7q
$$ 124 3 146 101 77 -37 81 -22 -57 177 -76 -12 134 -9 -315 300 145 -17 -53 -151 -2 -44 -17 -25
5446b5J77l64K27q0r7J39p6q5J79J91j20P0k43n8J31k90L73J09j70j91l7L75O9
$$ -25 152 -212 15 -65 -162 -23 -99 -184 -5 186 66 136 -107 -165 -34 -324 49 158 -12 -203 -240 135 204
5469B04k88J27J32j21j03o5Q3M4k48K25n0K26k67K89o5l18K27j21L5L6k69J44
$$ 204 -84 43 175 54 -49 -114 -31 13 -235 -10 -60 166 -101 188 123 -195 32 -89 -54 -18 -287 -143
5491a43L68k95j59L42j51J13k90M17j43n5J9J27n4N9k08L50n57J61J21J52j24
$$ -143 225 -70 -229 113 -38 75 -215 202 59 4 23 150 96 155 -53 297 -260 -99 22 174 50
5512E0k57K98j39L37j63p3N8R8k46O6j94J86j05k3J18j19Q2j6j13M12l62K65l55
$$ 50 -207 91 -48 289 126 53 111 209 -37 29 -165 21 -84 -107 11 -108 -26 -42 -155 257 -105 160 -195
5535a95P0o7L01k23L2m9K04p8l86M64k35QK22Rk15M40l55l7j11J27jJ91j61M4
$$ -195 -125 -192 109 -114 -82 -131 73 -5 -391 73 -162 -154 68 77 -138 302 -53 -90 -201 -74 -75 116 -45 -1
5559aOJ4M6j65K3QR1L50l13k24K70m9K98l79L42m95K4K44O0N8M8j54k20k05K81
$$ -1 5 19 65 -100 -77 -69 22 372 59 -165 105 56 354 -25 317 -178 -154 90 150 208 256 102 -118 -323 -42
5584d2J42j66N5n5K12k4j95K13k24l49M83N1M6k05O0l6J35j72n1R2J03j19R6M7
$$ -42 100 -66 -11 -66 146 122 -73 140 -84 -433 50 101 147 -58 2 -34 101 -71 -122 -30 73 -46 50 97
5608I7p1N5k14J15k5J42o5k2L99l99k6j33L14j21P3j83K01k82K16k03J19K10j23
$$ 97 26 81 -133 -18 -43 99 34 12 411 12 -14 -147 167 46 119 -64 137 -145 71 -132 -13 197 74
5631G4K93m61l8L81l37L54k61l74M16k45K73J24j06k08J39j73K22p6J01j18j21
$$ 74 367 -94 -132 249 -88 266 5 -369 47 -198 75 199 93 -115 24 -149 73 -3 98 -20 -141
5652a41Q4J04j70J91j60kK19n9J10k22K15n7k04O8J30r7J12Q2l20K38k82J36J00
$$ -141 -57 47 -123 68 -92 -94 125 66 176 -46 169 112 -92 -24 106 9 121 203 -117 121 -161 -25 75
5675G5m33M53j36OJ48L8k8l45K90k49L64j02Qk25O6K58l44k4M56k37j35m4J40
$$ 75 -358 95 -41 -35 113 151 123 -222 68 -181 183 81 89 -136 -70 188 -156 -180 276 39 -96 -140 0
5698@O2M7l5o1j7O0j77j49K14K4p6M0J83J72l19J39n2j03P0l17L88O4j76j66L01
$$ 0 62 109 74 13 -4 56 -121 -270 -56 -32 -108 -68 115 287 -32 107 55 -48 22 -295 93 157 -19 -185 116
5723A16j27J55k1n6o6Q7J3M0J12m78K95l23K43L1l13K09O3j52J85K52k82Jj11
$$ 116 -11 144 123 67 1 88 101 141 253 -225 70 -253 -10 21 -292 -83 -20 -172 13 265 -17 -16 -127
5746a27L55m12p0J75l6K49l07K72l37J63J44o5j62R0J02J69k72K37j38P3k1k03
$$ -127 228 -184 -254 -79 -115 134 -173 99 -238 -75 69 4 -158 -68 34 203 -69 168 30 103 82 -121
5768a21J87r8J1rJ0J56Rk79J15M7J02j82N8m4N7p4L04k21j76J17M6j36kJ08j30
$$ -121 66 -32 -21 -30 -20 136 145 -134 -19 28 130 -52 6 -38 19 -55 249 28 -148 -31 15 -121 -123 -15 -145
5793a45K87j56Q6J19m66K5L21N7n4p7K2j3r8L21k01QO9l65L09J26j38J69k53K6
$$ -145 142 -14 72 191 -275 -250 71 128 74 -3 19 6 -92 229 28 36 105 -260 49 175 37 206 -47 -21
5817b1O9k4N6k77M00l13j40R2nK1O3k6j71J96q7K30j72M3r0K53l39K36J55r4p2
$$ -21 48 24 80 -197 203 -110 -250 -158 -163 -142 -79 -105 -276 -80 -167 63 -109 -66 -156 97 -242 -6 149 55 -17
5842a7K43j76n5m2p4Q2LJ61j55J52k66K44p5p7K60j18k06J67m1l7K94k80kK26
$$ -17 226 50 -5 -47 -121 -39 -36 125 -30 122 -144 100 25 -52 208 90 -116 51 10 -27 267 -13 -15 211
5866B11k21kQ0J01m6q1O0K0r6L2J53r9K4k93K41l15L73k42JJ62Jk1j44j53J68
$$ 211 -10 -12 68 169 123 42 102 122 26 58 211 112 136 -157 84 -231 142 -100 -99 63 64 43 -101 -254 -86
5891h6J34q9L8M5j74M7m4J66K7k83K39J63j48K86o58K84L4J01r5M2j39p1J44K10
$$ -86 48 -41 -3 42 -132 -85 -129 37 64 -219 20 183 35 321 -337 -53 -19 82 -13 29 -110 -181 -37 173
5915A73J3m97N9R0r2O41l54J21k0k29NJ80j54K28r9j09m0R3O0j91m7K16okN9J29
$$ 173 186 -311 -252 -162 -254 387 33 154 134 -95 -90 90 -64 164 65 -44 -84 9 69 -122 -169 47 41 39 98 227
5941B27j01j62J43Q3j50k38L37n89K88J52O9J6m1o2q0j28O3RM44l96M7L4k06J34
$$ 227 126 -36 107 190 40 -198 139 -450 -162 -10 59 75 34 -28 -108 -236 -173 -164 280 -116 -69 -35 -241 -107
5965a07J19K16j12nj16NJ95j62oL2k38K76k02K74m40K10K09k28K67k01l09K73
$$ -107 12 228 116 111 -5 0 195 33 27 59 -179 97 -105 169 -271 -61 148 -80 187 -14 -323 -50
5987e0l3j01L06Q5p9j96K32m1R3k88j21K70l5n0J70l76J64O1P2MN5j52NR5k68
$$ -50 -83 -184 122 207 128 -68 164 123 216 -72 -193 77 42 -8 162 -214 -50 11 83 87 142 -10 -5 90 -178
6012a78J07j01L53m2J9k59K44l45L9L56k02r4N0J17m6n0J30J5j81N0m4K13q8j70
$$ -178 -71 -172 181 139 158 -101 143 -202 -163 193 -9 -103 -53 64 18 -32 98 113 -68 -18 -62 151 63 -107
6036a07k0K76j41Qq4K83n33K84l9M5N6Jp5J07k41J28j23k1n9J59Nr0K89k3m7j84
$$ -107 -127 149 8 16 -68 215 -318 -34 -73 -28 28 29 -46 61 -180 -52 -175 -196 -255 -96 -91 -181 108 85 38 -146
6062a46kJ33O8l50K52K6K14k35j19K95k35P7J41r1j18k0K14p7j40J08N2m06L14
$$ -146 -148 -15 53 -297 -45 -19 195 -40 -159 136 -99 -22 119 28 -90 -110 104 27 -113 -5 47 -359 -45
6085d5J35J20j95J08j89J58j01K21k41J62pj36j22L11R0l38Q1j08K28j97J63m8
$$ -45 90 210 15 123 -66 92 -9 212 -29 133 126 -10 -132 179 269 -69 12 -96 132 -65 98 50
6107E0m2r0J6O8k00J65N7j41j32K60k7QQ4o6j1J23q6Qj25J45l92J44J10J15k2
$$ 50 8 -82 -66 2 -198 -33 24 -117 -249 11 -16 -8 76 10 -1 122 36 44 -81 64 -328 -184 -74 41 19
6132A9j3l04M54j35J06n1o9j29J2K03j06k0K76l52J00M9O4j62J71n7j60K10k9
$$ 19 6 -298 156 21 127 76 7 -122 -110 93 -13 -33 243 -109 -9 40 104 -58 113 56 -104 106 77
6155G7j70K44R9j92N1r2q5N9J34k48p5K63L7J55j45j06j31L06l26J76j59K5L1
$$ 77 -93 151 250 58 109 17 -68 -9 125 -123 -198 65 102 257 112 6 -125 181 -145 31 -128 -103 -72
6178g2Q1R4P6p7j90LJ29j72k04J14J57K22j80J95Lk78K51J4l96L13q7M5j17m7
$$ -72 9 103 179 102 -88 -85 44 -128 -332 -218 -61 161 -19 176 179 -99 152 166 -230 83 -4 41 -76 -123
6202a23Q1K25j39K8j62K03k63J44Kj15L07q9o6j62N3J24j49o8J68q4K26m5M9k99
$$ -123 -42 183 44 72 -90 113 -150 -6 -4 -119 188 99 33 -129 -76 48 -101 -169 -1 -85 141 96 145 -154
6226a54R5o3J82pr6L80k50k61J00j98K05J64M4k52j52K19J3O4p1Lk62M15j99N43
$$ -154 -59 -122 60 53 -43 337 87 -174 -74 -272 -67 97 141 -111 -263 -44 -31 33 -38 -35 -297 118 -81 462
6250D62m87L0j10Q8j02l5Q8K51n0k82K53k52K33k2l38L73j52l46M09L3j61P2L24
$$ 462 -25 5 -105 -17 -119 -154 -66 185 135 -147 106 -146 87 65 -273 100 -52 -398 11 44 -117 -45 279
6273B79k00q3K1j04j6N1J16k33K09j7K7r0j26J80lL58l24j55K78p0k17L19m00
$$ 279 79 -4 17 -87 -103 -52 64 -169 40 23 50 -40 -166 14 11 369 45 -110 168 98 -119 200 -200
6296b00M40k64l5J9O4L7J4m2q3J74j15J22j50K80l87j65L18L65l24j16J88j88
$$ -200 240 -24 -59 -40 24 61 75 33 -50 124 9 131 -19 261 -126 -291 27 392 68 -48 140 -48
6318d8J11O1m49L19ro6K45l84M02l11J8R1M12k40r3k29K06J60J55j60k15J62l78
$$ -48 63 124 -325 -6 -15 -81 164 -220 182 -129 -111 -20 392 152 59 -170 36 196 351 191 -24 138 -240
6341b40K89M4Qo1j62J78M3q6J46K5l54rK79j95J05q7j04K25j5O6M9N7k34L5j89
$$ -240 49 93 101 40 -122 56 99 13 159 184 -170 -179 100 -95 10 -77 -181 44 29 95 144 201 -33 2 -187
6366a87O7j12J99j36K75k27R6j11M07j44l00q4K15qJ42O9j01k47K05J47l11K73
$$ -187 -120 -232 -33 -169 106 -121 -25 -136 271 127 -173 -257 -42 -50 92 161 60 -187 18 165 -146 127
6388A27N6L4m03M10k21P4j31L13l07J39r3J58l66J15K15j30Q1k69J29J63k3o4
$$ 127 183 217 -186 224 3 77 -54 259 -48 91 -2 156 -210 -95 120 -10 71 -198 -69 94 71 7
6410GJ12j24r7N6J03j69J13Q7N9k07N9n4P1k44K32q6o3K8K01o0j06O9N9j11j5
$$ 7 119 -5 -102 -46 57 -112 1 88 147 -60 -1 -55 16 -228 4 -82 -145 -117 84 24 -82 -13 46 -65 -80
6435h0J27j50P5N3j21R4j74J1L67k65K87l93J42j09k9OpJ79j2L43k85K02j23j79
$$ -80 47 -103 -28 25 -96 -2 -176 -165 202 -63 224 -169 -27 -136 -165 -159 -166 13 1 344 59 261 138 -41
6459d1J59j82J54J02m8n4n3j00O9J67k04QQ6J11k27p9J15J15nQ3k66K47n9K9j69
$$ -41 118 -64 90 192 144 90 37 -63 6 173 -31 -23 63 174 -53 -132 -17 98 93 176 -90 157 98 127 -42
6484d2j9L6o0J4kj7n1R0n1o2K74mk01J31k09J92l3k66J97K36j77R6j67L99l05
$$ -42 -61 -25 -85 -71 -73 -90 -141 -51 -102 -164 110 106 -95 36 -173 19 -14 -280 -83 153 -24 72 -95 304 -1
6509al1k12J05J10j03j96L81n9N9kj67J06J52j46p4J32N2m2k6P4k43L67q2q6p8
$$ -1 -32 -244 -139 -29 -132 -328 53 -6 53 51 -116 -10 142 -4 -78 54 106 64 38 112 -131 236 154 68 -10
6534a0K4J28kj74J54j67J06n2j59J39J20r1o5O0J1O2l1m12J71P1K12r5j9K52j38
$$ -10 14 142 140 -34 120 -47 59 7 -152 -13 107 16 -49 11 22 84 53 -359 -188 -117 95 0 -19 233 95
6559I5m1Mk90K34M9q1j63K80O0K40l72p2P4J10k40j78L98M6j06N4m3j4n10M33
$$ 95 54 58 -232 2 51 -30 -193 87 147 387 15 -57 17 127 -113 -291 107 153 47 101 58 44 -466 -33
6583c3l1j36K16j1N1r7j14k0R2J61jj78R6j63J98J90k88L2j5P7qrR6j99K10k4
$$ -33 -64 -200 16 5 56 -41 -155 -175 -83 78 77 -101 -5 -168 30 220 -68 -36 -51 26 18 9 105 -94 116 92
6609I2l9r8m3K45j34j42j21K24Q7j79J97N1lj3J46l62K63q3k07R0k8K39m39M53
$$ 92 53 -45 -88 157 23 -119 -240 -16 71 -108 89 140 137 124 270 -92 171 88 -119 -29 -57 182 -257 196
6633A96L2j09j83M5J46j01j24L23k29j18l6L79k56J49j20p8j25J81k3j39K88j71
$$ 196 228 119 -64 -19 127 26 -98 225 -4 -122 -158 221 -35 114 -6 -84 -209 -28 -51 -190 98 -73
6655g3P7k11L71j31J9p7Q2j39J29j03j79J78K93k34j4K61m27K11j47J79MQ9k99
$$ -73 4 -207 164 33 52 -25 57 -82 47 -56 -235 -57 236 2 -12 249 -178 33 -114 65 69 158 -141
6678a41P3J38q1M2j52j75L30oK75m94J4L33k35M4Q5M1O9R2n9j53k19J17K9l0R8
$$ -141 -68 70 -11 31 -121 -296 34 28 303 -191 -177 156 -79 -35 50 91 160 252 193 40 -179 -62 -33 -63 35
6703C5j48J27k1m6k7R3j44K41k56kJ30j94K36k44J58P0j52K09o3J6n5QL5k11L19
$$ 35 -113 14 -7 -53 -80 13 -131 110 -146 -148 -18 -212 24 -220 -62 8 -144 65 2 18 -37 -29 6 -205 114
6728A14ok01J59L9K8k03j00K19j23JN2j9L63m83J64J15l42L39j19j73K76j43J66
$$ 114 108 -93 66 105 133 -70 -170 49 -74 -73 -21 -40 323 -160 4 119 -223 116 -3 -176 100 -43 123
6751A23r1O4k28O2O4j56J49O2j26r3M44k35Q0Q7j17n5J8l91K36J26M4jj91J88
$$ 123 32 96 -132 -70 -6 -162 -13 49 -77 -170 274 39 119 206 89 34 52 -339 -103 23 67 66 -125 63
6775F3k16J41Q4l9k3J52j44j94J25j8J72j74K73o4k17K51m9j91J9R3J73k87K63
$$ 63 -153 -12 72 33 10 162 18 -176 -51 -69 103 -71 202 138 -79 172 123 -68 -49 44 217 -70 193
6798A93l06J42j5j78J05J2qK64r1j72j68j90M61k67J41J45Q0l91J21J86k33J34
$$ 193 -113 29 14 -164 -59 -47 -55 209 118 -54 -222 -412 49 -218 -77 68 148 -243 -122 64 -169 -35
6820c5J04L6k37L09k45p7J92j81K30l75L46o7j06q5K12j24J6k34M71j93M2L53
$$ -35 69 105 -132 177 -68 -145 47 -134 96 -279 67 0 -106 -191 21 -103 -87 -321 150 -43 -1 352
6842C52k69k30L29k08K49m2k5Nk42K70o8k4j15p4J92o9J43m7o8N8j29L21l35m8
$$ 352 83 -147 182 -26 223 181 156 161 -81 189 121 97 -18 -92 100 31 174 127 59 117 -12 309 -26 -74
6866g4J60j20K22k98j9K04j31j61K31KJ8m06L45L24m85J03J81k05P8O2r8J69k67
$$ -74 86 -34 188 -110 -129 75 -56 -217 14 16 34 -372 -27 297 -188 -85 96 -109 -31 31 -67 102 -165
6889a65M5K80J0k74J98J02k92J1k77M10k62L54j87k15L84k8m8M0l3pp5j27J54
$$ -165 -120 160 170 -104 94 196 -96 -85 -362 48 -214 140 -47 -262 122 94 46 86 53 46 -29 -156 -2
6912bJ84j81K6k03L49m17L07l0p5J43RJ1k17nK8J61k21K39R3j06l5k33q4L26k0
$$ -2 182 1 27 -176 173 -244 63 33 -42 101 110 121 -96 -101 -73 88 -133 106 199 93 58 -175 -259 67 47
6937D7k6m8J63m5j96pM43l46j67o1K25m0k3K03j21j91K86k79R6J6O5J22k45M9
$$ 47 21 -27 136 91 -105 -112 331 -15 -182 -243 -18 -58 -81 122 1 -190 96 -183 -87 -71 -6 116 -129 -80
6961h0k1J9J78k7j00q9J10j80J88J79k88L71l17M5K34l36J17m3o0p5N5K06j66
$$ -80 -101 -82 96 69 -31 -120 -10 -190 -2 177 -111 260 -57 -12 222 -114 3 -40 -100 -175 -120 86 -80
6984h0K51j53m6R4k6n4J87k10O6r4L23N7m04K13K0o3l8j3J06l11J03l8K46n0j12
$$ -80 171 18 -28 66 40 -14 173 -37 29 -65 258 315 -89 124 144 81 43 30 136 -175 -72 -110 136 86 -26
7009b6J80k3kk45N7J78p3j37J89j19L12n44J36J17p1jQ5k25j5J86p0J70L46k94
$$ -26 154 131 129 -116 -59 119 46 -91 98 -21 291 -253 -117 0 -71 -72 13 -212 -227 -41 -111 59 405 111
7033A11j82N3j51J85Q0k4k11K2K7Q9J55n1m1m3J90k08L10k02j34Lo4L4R6O6r6
$$ 111 -71 -18 -169 16 96 72 -139 -117 -90 -1 154 103 62 19 209 1 311 109 -25 -22 -86 -52 44 110 14
7058A4J35m7n0k9k34K16J83j11L8k02o5K26k50Q9N2L7m1j43M04M3j60kl7j79J34
$$ 14 149 102 52 23 -211 5 188 77 115 -87 -152 74 -176 -87 -35 2 -39 -182 222 265 105 103 66 -113 21
7083B1J15k61J49j10j36r5M05R7l55J32K18l19J1K88M7k40q3LJ54j34R9Q2j3k05
$$ 21 136 -125 24 -86 -222 -317 88 185 -170 -38 180 -139 -128 160 207 -33 -116 -113 41 -93 6 88 75 -130
7107a30j24K84J56j1j42J42r7j9q2J90k72J13j26K87j71J02r7l86K96J57l4K5
$$ -130 -254 30 186 175 33 175 78 59 -23 167 -105 8 -118 169 -2 100 3 -383 -87 70 36 61
7129F1k06J29J25M2m70L00rk6k84L56k6J63KJ2j5k40K07J05k10J02j74j81J40
$$ 61 -145 -16 109 151 -319 -19 -28 -54 -338 18 -8 155 157 169 154 -86 121 226 16 118 -56 -237 -97
7152i7k7O1J63Nk75L15l22J42J18j84qJ36j50L25%n40L02J31n6j24j6mN7Q5j8
$$ -97 -124 -63 100 105 -170 145 -177 -35 83 -101 -109 27 -123 202 202 -338 -36 95 39 -85 -101 -105 -48 37 19
7177A9j8j89K30j6N1j92J95j60J39o7kJ28K6k20q0L5j3J36K47kk95LR9Nk6k09
$$ 19 1 -188 42 26 77 -115 80 -80 59 -8 -10 118 144 -76 -156 -121 -134 2 249 247 -48 -45 54 59 33 -176
7203a76K12P6l44K98j87PO3K25k1P5m02m5L30lj82j29K41p7Q8m7k23J44J01j66
$$ -176 36 112 -232 66 -121 -114 -51 174 153 228 -174 -219 111 108 -74 -203 38 -39 49 2 -221 -77 24 -142
7227a42k7J13o0j4q9K08J64k90Q2K21l74K36j36K82mp8q7j97K27nj41o7K69j14
$$ -142 -169 -56 -116 -130 -219 -11 153 -137 -55 166 -208 28 -108 174 170 92 5 -192 35 30 -111 -178 91 -23
7251b3P7j04J06m8Q3j0n8p1O4J5J51k10J79j58j97K19P6j29p6J03k0J77k19m0
$$ -23 54 -50 56 8 91 81 23 -48 16 31 182 -28 151 -7 -204 15 91 -38 -114 -11 -31 146 -73 -113
7275a13K71p1N9k56o3L74l92L98k05r6J95K6j41P3l81L64j25N3p5JK33q4j13J52
$$ -113 158 87 146 -110 -173 201 -191 207 2 -94 101 127 -14 59 -322 42 -83 -30 -105 -104 129 45 -68 84
7299H4J9j8l11J44J25j39L7J32l4k21K80m1k43K22P2k39J07Jq4n0K08k11J77q4
$$ 84 103 85 -226 -82 43 -96 -59 73 39 -182 98 57 -186 36 108 -131 -24 -23 -107 -157 51 -160 17 -67
7323f7J42j5r9J25m4o0p2L03k87M7j08J72k28L15j19j25L76j80j6k4J4j90K67
$$ -67 75 60 -39 86 42 -18 -90 213 -74 -27 -135 37 -191 124 5 -120 256 76 60 36 50 -140 127
7346A27j21P1L2j23J06Jj73K65k58k2o4J39j48j9P5K10no4o4O1j26K73k11J28
$$ 127 6 77 109 -14 92 93 -80 185 -73 -95 -159 -20 -168 -187 -112 98 93 29 -35 26 -100 173 -38 90
7370I0k18J98j19J64R1l93J2L00j61L5mJ35J3Q0p2k54K25j45j32J29l5j07N0m2
$$ 90 -128 70 -49 115 206 -187 -175 125 -36 -1 -5 130 143 223 151 -103 122 -23 -155 -26 -61 -168 -118 -160
7394a60m1K70J49p8r6J72m32K60pj32L9j47L39k0j06Q6LJ11nl39M28o3j77j35
$$ -160 -201 69 218 140 44 216 -216 44 37 -95 -56 -203 136 116 10 96 99 210 205 -134 294 231 54 -81
7418h1n7K11J0j39J85N2m1ok21N3k28J32J28J89j04j42J5O7O2m30L08Q7m1pj74
$$ -81 -138 73 83 -56 129 181 140 134 -87 -34 -262 -130 -2 187 83 -59 -44 23 85 -345 -37 50 9 2 -172
7443a72J77j33k8j10L34k18N8L25l44J91j65L4O2R7ok01N4k5M3O8k5L1J19k45
$$ -172 5 -128 -156 -266 68 -150 -92 233 -111 80 -85 -51 11 108 102 -99 -45 -70 -27 41 16 47 166 -79
7467g9J90l5N9k31j25J08Q9J25j45j3R1j25J26J31j66j7p4K6Q8j65L35j22N8j27
$$ -79 111 76 135 -96 -221 -113 -24 101 -44 -57 34 -91 35 166 0 -17 -91 -65 23 -142 193 71 129 2
7491Br5J45n0R5r9j28K33j09K2q4K0K07k01K9M7K69m70J34N5j68O9NO1k4r9J16
$$ 2 -93 52 2 97 -2 -130 103 -6 16 -68 -48 159 -42 -13 34 303 -167 -33 22 -146 -77 -72 -11 -35 -134 -18
7517a8R7J7j16j54J09J55j12L8J02j86m0J15m8R3l21L05P5k81R9P0j82K39p8j29
$$ -18 79 96 -20 -174 -65 90 -22 16 118 -68 -108 7 -41 52 -269 36 111 -170 -71 -1 -183 56 -22 -151
7541a51J12Q2O1j35l1J40q8M0J22M2p5L0k25j71N50l97r6K29l8M8l0j81L33j78
$$ -151 -39 43 104 -31 -62 78 -10 30 152 194 119 149 -76 -247 303 -94 -190 39 1 49 19 -162 171 -7
7565gR9k13J12K14j89N6j95K35k61J78K48l61L3J76j35L0k21K61k22J2J50j3q0
$$ -7 92 -121 -9 205 16 72 -123 112 -149 29 277 -84 -51 125 -10 20 -201 60 -162 -150 0 -13 -93
7588i3J4o9J44j38J57J08k21K50k7J4j12l7k2L1R7j84L8P7Q2k25p3L34r2L43n16
$$ -93 -79 -148 -4 -142 15 123 -98 152 125 139 27 -10 -32 -1 96 -88 -50 27 109 -116 -189 145 53 396 -120
7613a20M25m57K49k87L5L01j9J6K5r3j32K4m0M09k60p6m4r2K42L3Pj26nN3j23
$$ -120 305 -152 97 -190 -155 146 127 143 168 75 -57 -33 -73 336 76 0 -44 -136 106 139 146 20 15 68 -55
7638e5R4q1j27J17j95J28J54J6K8n7n7o1K39r8j90J48K54P8l52l3K04j70O0j18
$$ -55 39 -42 -169 -52 -247 -119 35 51 79 22 -35 -96 143 45 -145 3 257 335 -17 -50 154 -16 44 -74
7662g4m4L72k61q2j48J19J42j0K1j44j47L04j28J78o9L1k40J69J5O8j26J46J26
$$ -74 -118 254 -7 -89 -237 -118 24 14 35 -109 -256 48 -80 98 29 60 -180 -11 4 72 -54 92 218
7685B18m88J95O6R4j22Q7j88j58J64J90J27j64k68K86J68l5k76l7J07P7j81K58
$$ 218 -270 -75 -9 85 -37 50 -138 -296 -132 58 185 21 -247 39 207 172 -104 -141 -34 43 -138 120
7707A20P3k42J47k67J03QJ28k66J16J98j34J32j42L4K07j86J7j8k77K34J68K0
$$ 120 193 -49 98 -169 -66 -58 70 -196 -80 118 -16 116 -26 8 215 29 46 28 -249 -15 153 173
7729A73j51J41k39K80l13q2K04J12M0l70L72r3j3M7j83QJ23k34K7R8J84k66K70
$$ 173 22 163 -76 204 -109 -191 13 125 165 -205 167 74 61 108 -75 -67 56 -178 -151 -53 131 -135 135
7752A35k00j28J24j16L06o9q6J05q7k61J9M68j53m7J37j15k4M0R4j02j33L0N5
$$ 135 -65 -193 -69 -185 121 52 -34 71 -16 -277 -258 210 57 10 147 32 8 48 142 40 -93 -63 -8
7775hJ57j43J7j91J99J87m19K5M61m6l38J66k70J48J19Q6j05l5P0l96L20k68L90
$$ -8 149 6 23 -168 31 218 -201 -176 285 239 -99 67 -203 -55 64 150 45 10 80 -316 4 -264 126
7798A26j88K9m1%L8J45j84J40n1l4J76k23J04k26L57k48L3j64P2L2K31m9P5n0
$$ 126 -62 -33 -74 -74 -36 109 -75 65 14 -20 156 -67 37 -189 168 -80 -47 -211 -139 -107 124 75 150 100
7822A00o6Q4j66P1l7l1K58m2p9j6j09K0J65j07q0k2J12j48L3K83r1R9k74NL2J71
$$ 100 34 118 -48 23 -14 -45 213 171 92 76 -33 -13 152 45 -35 -57 55 -93 -60 223 132 231 -43 -38 -6 165
7848A65j89M6j94J94J04m1m1M5r4p5J65m6L4k24J41j23O2p1J04r6K31J96n18L25
$$ 165 -24 22 -172 22 126 85 44 89 -5 -80 85 39 73 -151 -10 -133 -71 -142 -38 -134 97 293 -225 100
7872A00j45p4j1m0J78o5n8J77N1k79J2J34N6j43Q6K05k53P7O8k4n3n1J14J23j77
$$ 100 -45 -119 -130 -170 8 -57 -115 62 113 -166 -154 -20 36 -107 -21 184 -69 8 76 52 -1 -52 62 185 8
7897HJ4J56j1k68K74k44KJ4K29q8j48L3n7J1n0R6j10Q7L45m50R7P4J03k84pJ47
$$ 8 22 178 167 -101 173 -71 -69 -55 174 86 -62 -29 -86 -75 -125 -29 -139 -52 293 -157 -60 14 117 -167 -174 -27
7923b7m9J93j34J04n8l35L29L7Q3k7m9k20K05K3j65K03l84N24m99J25L17q2m20
$$ -27 -76 117 -17 87 29 -306 23 60 143 116 67 -153 52 75 -90 113 -271 253 -246 -121 196 114 -306
7946c06K32k95K17j7L57k21O5j11j95M02j40J65P6l95L12J54l89L05k44J90l62
$$ -306 -74 -369 -152 -169 188 -33 32 -79 -274 128 -12 153 229 -166 146 300 -89 216 -28 162 -200
7967b00M41k49J1J00j66K51j83m9q3JM0K55j38o6j28K12j66J77j79q5Q0K6m3O1
$$ -200 241 -8 3 103 -63 188 5 -44 -127 -126 -86 169 31 -35 -163 49 -117 60 -119 -204 -124 -98 -141 -80
7991h0K40l41Q1K73j00k29Q1qk9K64j66M5O9j20J21J31k87k96K89n8J16M4j27
$$ -80 160 -181 -100 173 73 -156 -75 -83 -112 152 -14 31 100 -20 101 232 -55 -351 -62 -120 -4 40 -87
8014h7J55J6Ro1J66r0l58L7J96J64j93J11n2j95k0J27O5J31J21m69J70R4o1R3
$$ -87 68 84 93 32 198 108 -250 -213 -17 147 -46 65 13 -182 -202 -75 -10 121 242 -227 -57 37 -24 69
8038F9k05K08k64L10j08l12L36j23jJ88k15j2J92K5P7k39J57o3j57J42K9o4K90
$$ 69 -136 72 -192 118 10 -302 34 -89 -90 98 -117 -129 63 88 165 -74 83 20 -137 5 34 -30 260
8061B60l63J80J2O3l42K55l13J71j22J48J91j59J75j27m3K14m50K22o1J08L1k76
$$ 260 -103 77 89 152 -190 65 -248 -77 -199 -51 140 -19 156 29 -14 200 -250 -28 -89 19 50 -226
8083b26L12j07K5q0j55J66K10k48J38n2j03J97p4j78Rl3K08M8j52J24J47j73k06
$$ -226 86 -21 4 -76 -231 -65 145 -103 35 -17 -120 77 3 -175 -166 -199 9 57 -95 29 176 3 -203
8106b03L11k06p0L11k60Kj7K13J0j48M73l81k56J95j09J73J98l8j48n6J34j97
$$ -203 108 -98 -168 143 -117 -115 -132 81 91 -57 416 35 -221 -26 -135 38 236 198 50 -6 128 -69
8128f9J47k4j45O8m7J41k04J0L9K8O4j42J57Mj76P6K51o3j67j96K76l9J7l2L12
$$ -69 78 54 -91 -23 -70 71 -133 -123 -84 -56 8 -134 23 27 -149 -73 178 115 -52 -248 28 -11 6 -26 286
8153B86j76k6k29L39k10j42K96k86J89j53J96k04K67m7k46L94j86j3j81J66l57
$$ 286 110 84 -145 194 -16 -158 138 -148 41 -112 84 -120 147 100 -146 248 62 49 -132 34 -323
8174c23L3K17kP1q5q6J79L9m08L87Q4O7l2k35J26r9k6
$$ -323 -290 -73 -75 -4 -89 -175 4 43 -365 22 106 173 141 -94 32 -67 -93
8191i3
$$ Imaginary data points
##PAGE= N=2
##DATA TABLE= (X++(I..I)), XYDATA
0@%%%%%%%%%%%%%%%Mj2J6j6J6j6K4l2L2m0M8n6O4p2Q7r7J06j21J39j57J78k02
$$ 0 0 0 0 0 0 0 0 0 0 0 0 0 0 0 0 4 -8 8 -8 8 -8 16 -16 16 -24 24 -32 32 -40 47 -50 56 -65 74 -83 95 -107
37a07K26k52K80l12L50l87M28m76N24n78O38p02P74q53R38j033J140j259J392
$$ -107 119 -133 147 -165 185 -202 226 -250 274 -304 334 -368 406 -447 491 -542 598 -661 731
56G31j543J717j918K154k435K778l206L756m495N546p175J0049j6623N9262J7781
$$ 731 -812 905 -1013 1141 -1294 1484 -1722 2034 -2461 3085 -4090 5959 -10664 48598 66379
71F6379q7772K4027L0372J1684k6977j8271k431L6743j0376k5263k653J6961M247
$$ 66379 -21393 2634 33006 44690 17713 -558 -2989 33754 23378 -1885 -4538 12423 16670
84A6670J821n803l7065K0646L5191k5516k4450J7263J5102m827j764k1901J5197
$$ 16670 18491 12688 -24377 -3731 31460 5944 -18506 -1243 13859 9032 7268 -14633 564
97E64J9856q138j3756M859L700m097J7591r868j5674J2125J5730j9609r488R100
$$ 564 20420 12282 -1474 3385 7085 2988 20579 10711 -4963 7162 22892 3283 -6205 2895
111B895l841J6605r109j7802O967J5132p649o229L020p631Q301J196j0938j0462
$$ 2895 -946 15659 6550 -11252 -4285 10847 3198 -3031 -11 -7642 659 1855 -9083 -19545
125a9545J8380N144j1805O431p121K877R452j774j2118J0736L768p677N193p180
$$ -19545 -1165 3979 -7826 -1395 -8516 -5639 3813 2039 -10079 657 4425 -3252 1941 -5239
139e239K042Q013P165j2524l8O502o199N565K294n568m432J4009p052o739K404
$$ -5239 -3197 4816 11981 -543 -581 5921 -278 5287 7581 2013 -2419 11590 4538 -2201 203
154B03l761R853J415j1329r250J4183n89o577K448j165K008K367M37j6817O204
$$ 203 -3558 6295 7710 -3619 -12869 1314 725 -5852 -3404 -4569 -2561 -194 243 -16574 -10370
169a0370J0707j041l658r458J266J1861O206k1092M482J5807p65j0270o820N300
$$ -10370 337 -704 -4362 -13820 -12554 -693 5513 -15579 -11097 4710 3945 -6325 -13145 -7845
183g845M501Q374j2271l943P982K293l907j965R98j794J3668p565j1620L524Q227
$$ -7845 -3344 5030 -7241 -11184 -3202 -909 -4816 -6781 -5783 -7577 6091 -1474 -13094 -9570 -1343
198a343N65k442M55o981R253J575o427l142P162M259k013N76j1431P174J0122
$$ -1343 -778 -3220 -2765 -9746 -493 1082 -5345 -8487 -1325 2934 921 1497 -9934 -2760 7362
213G362l044r230M137M577l363K858q806K393Q898K921r908j968M750j389P054
$$ 7362 4318 -4912 -775 3802 439 3297 -5509 -3116 5782 8703 -1205 -3173 1577 188 7242
228G242n490m796L044P618q147m751O350p60N739k821o095k220R250k054m711
$$ 7242 1752 -3044 0 7618 -529 -5280 1070 310 6049 3228 -2867 -5087 4163 2109 -2602
243b602M289l799K565J125j705p505P075M322m044L69o015L32N024M681j0897
$$ -2602 1687 -2112 453 1578 -127 -7632 -557 3765 -279 90 -5925 -5593 -569 4112 -6785
258f785J973O521l068j005l632R11L346P228r788k739N017N4J750o34o96l309
$$ -6785 -4812 1709 -1359 -2364 -5996 -5085 -1739 5489 -4299 -7038 -2021 -1967 -217 -851 -1547 -4856
274d856R176l660o107K519K401L524O39k224r115J0144L145n432q81K497L251
$$ -4856 4320 660 -5447 -2928 -527 2997 3636 1412 -7703 2441 5586 154 -727 1770 5021
289E021j144n11r080P619P355l114n300M58K000r77N376p525O77N985J59n377
$$ 5021 3877 3366 -5714 1905 9260 6146 846 1304 3304 2327 7703 178 855 6840 6999 1622
305A622j479J344n9Q349n592n766J866N116k791l323K278k396P441k972p513r71
$$ 1622 143 1487 1428 9777 4185 -1581 285 5401 2610 -713 1565 -831 6610 3638 -3875 -4846
321d846P803M21l024J213o367M903K545l226m290N544L091k807N52o967K913O552
$$ -4846 2957 3378 354 1567 -4800 103 2648 -578 -4868 676 3767 960 1512 -5455 -2542 4010
337D010J233q403J577M412k924K086m195J08M629M229q233k638M270j121M461
$$ 4010 5243 -3160 -1583 2829 -95 1991 -2204 -2096 2533 6762 -1471 -4109 161 -960 3501
352C501k289l132j071P256l421m325K864K71L830J41l867o233R122L173m933k65
$$ 3501 1212 -1920 -2991 4265 844 -3481 -617 -346 3484 3625 -242 -6475 2647 5820 887 622
368F22q35L764R67k426o572Q131M809n297k164n49J363K93M600o275p48L905r72
$$ 622 -213 3551 4518 2092 -4480 3651 8460 3163 999 450 1813 2106 6706 431 -317 3588 2616
385B616j679k257k54J782P006q028m979M097K355p95k254M25k187N792k610n158
$$ 2616 937 -1320 -1574 208 7214 -814 -5793 -1696 659 -136 -2390 -1965 -4152 1640 -970 -6128
401f128J76N170J638k399j388n491O968K277m838j165L708J020k853J479n135
$$ -6128 -5952 -782 856 -1543 -2931 -8422 -1454 823 -4015 -5180 -1472 -452 -3305 -1826 -6961
416f961L598M348M8m917j214K958N1L110n121p3N263J619o746m74L892n06M993
$$ -6961 -3363 985 1033 -3884 -5098 -2140 -2089 1021 -4100 -4173 1090 2709 -4037 -4511 -619 -1125 3868
433C868l740k298L79L427n64k065J325l91M442j502m557k614P818J538m162K73
$$ 3868 128 -2170 -1791 1636 1072 -993 332 -59 4383 2881 -1676 -4290 3528 5066 904 1177
449A177k955L769Q74k391l252M947K004l321r77k483K862R30K313m533j32K513
$$ 1177 -1778 1991 2865 474 -2778 2169 4173 852 -125 -2608 254 1184 3497 -1036 -1168 1345
465A345k098J701j369j179J414O238o155l981K797K882K102m023r90p6M812l352
$$ 1345 -753 948 -421 -1600 -186 6052 -103 -4084 -1287 1595 3697 -326 -1316 -1392 3420 68
481F8m036K838K268o3j382k07n778N667K772m022j349J077K019j097q83l482M641
$$ 68 -3968 -1130 1138 1075 -307 -514 -6292 -625 2147 -1875 -3224 -2147 -128 -1225 -2108 -5590 -949
498i49K519j774k373L92J576r57N593l553l167M156L360l806k455K903J442L727
$$ -949 1570 -204 -2577 -2185 -609 -1566 4027 474 -2693 1463 4823 1017 -1438 1465 2907 6634
514F634n230k142K744K598j952j242K812l137J285J280k693l856N146K963m208
$$ 6634 1404 -738 2006 4604 2652 1410 4222 1085 2370 3650 957 -2899 2247 5210 1002
529A002j463l143N191J292l002k654L899J268m065O97p96P93P57L878m849k431
$$ 1002 -461 -3604 1587 2879 -123 -2777 1122 2390 -1675 -978 -1774 -981 -224 3654 -1195 -3626
545c626L386q4K003k718r54K171L586n519k638L661J387J925l646j280p07M458
$$ -3626 -240 -324 1679 -1039 -1993 178 3764 -1755 -4393 -732 655 2580 -1066 -2346 -3053 1405
561A405j276l928K515J840o36k034j8j904L768O03j754O30k642P55J958J632m840
$$ 1405 129 -3799 -1284 556 -80 -2114 -2132 -4036 -268 335 -1419 -789 -3431 -2676 -718 914 -3926
578c926J672M577r98l119j502L536J008L113m859p50L361k94l78o04L06J09M409
$$ -3926 -2254 2323 1325 -1794 -3296 240 1248 4361 -498 -1248 2113 1819 1441 837 1143 1252 5661
595E661m181l708K233L598J3l531Q17j311K860j456k632J095K285m68j179L85
$$ 5661 1480 -2228 5 3603 3616 85 902 -409 2451 995 -1637 -542 1743 1275 96 481
611D81m949L868L169j589l034O33K246r84L4l291K593L063j167l738K53J707j007
$$ 481 -4468 -600 2569 980 -2054 -1421 825 -159 -125 -3416 -823 2240 1073 -2665 -2412 -705 -1712
628a712L808l099k363J870K752l026k025J951L98L468l836l084J111N083j810
$$ -1712 2096 -1003 -3366 -1496 1256 -1770 -3795 -1844 -1446 2022 -1814 -4898 -3787 1296 -514
643e14k297K151j387J660J58j735j457L867J500k560J29k435K581K693m14m274
$$ -514 -2811 -660 -2047 -387 -229 -1964 -3421 446 1946 -614 -485 -2920 -339 2354 1940 -2334
659b334K439K840k228o15j702J812K694P85n384n7L582j020L46j050M4M37K476
$$ -2334 105 2945 717 102 -1600 212 2906 3691 -1693 -1750 1832 812 1158 108 152 589 3065
676C065l562j423K654N17J172j243j837k429N139J74l071J22P82J384o56j558
$$ 3065 -497 -1920 734 1251 2423 1180 -657 -3086 2053 2227 -844 -722 60 1444 788 -770
692g70l394N157K394l551k296N56K220k90K39l653K861K562k065k699J15J892
$$ -770 -4164 993 3387 -164 -2460 -1904 316 26 265 -3388 -527 2035 -30 -2729 -2614 -722
708g22N67K432m441q56K471J115j683r34J499j28K847k947k879K036L307p19j804
$$ -722 -155 2277 -2164 -3020 -549 566 -1117 -2051 -552 -680 2167 -780 -3659 -1623 1684 965 -839
725h39N31j749L481j17k734j62L326P47j906j28k552L254K631j355l470J893K043
$$ -839 -308 -2057 1424 1307 -1427 -1589 1737 2484 578 450 -2102 1152 3783 2428 -1042 851 2894
742B894j330K98k259J761L000k94m900J53L146n09R12k513j63J295J493l194r36
$$ 2894 1564 1862 -397 1364 4364 4070 -830 -677 2469 1960 2872 359 196 1491 2984 -210 -1146
759a146K632k71J354j855k218k33M155r64k407Q58m92K086j032j653j696M355
$$ -1146 1486 1215 2569 714 -1504 -1737 2418 1454 -953 -95 -587 1499 467 -1186 -2882 1473
775A473J379l939m61J70J993J55j21l145K364J675k337k91m26J166N21J984m192
$$ 1473 2852 -1087 -1548 -1378 615 770 649 -2496 -132 1543 -794 -1085 -1511 -345 176 2160 -2032
792b032o74K570N18j47j553K26L33K867l434k017K975K147m28k042l29j001M112
$$ -2032 -2706 -136 382 235 -1318 -1092 -759 2108 -1326 -3343 -368 1779 1351 -691 -1020 -2021 2091
809B091m64l015Q91K309J45j719o3j650L503J364k252j532O51J304p66J227l082
$$ 2091 1627 -1388 -497 1812 1957 238 175 -1475 2028 3392 1140 -392 259 1563 797 2024 -1058
826a058J586K485j613l289M97K589j33O21k907m26J741Q84k143m27J789j021J965
$$ -1058 528 3013 1400 -1889 -1392 1197 1064 1685 -1222 -1648 93 977 -1166 -1593 196 -825 1140
843A140j709k509P33M065j017k551K85J4K217j134j757k16L659l84l167N51p61
$$ 1140 -569 -3078 -2345 1720 703 -1848 -1563 -1549 668 -466 -2223 -2439 1220 836 -2331 -1780 -2541
860b541K005J100j029k919K177J729k453L30m74J456P98K56l295M25K469n12R18
$$ -2541 -536 564 -465 -3384 -1207 522 -1931 -1601 -2075 -619 179 435 -2860 -2435 34 -478 440
877D40j788J24N54K879k658k230L524J005l74k106l33K79L710j951j752J794O0
$$ 440 -1348 -1224 -670 2209 -449 -2679 845 1850 1476 -630 -963 -684 3026 1075 -677 1117 1177
894A177r7n73j15j723L254O34k673p28O04R90q8P15l071J681K081k012j460L91
$$ 1177 1080 507 392 -1331 1923 2557 -116 -844 -240 750 662 1377 -1694 -13 2068 56 -1404 -1013
912a013J602K99R29l777q2K788P65k209k35J666j034J386j731j247J659J966j369
$$ -1013 589 888 1817 -1960 -2042 746 1511 -698 -933 733 -301 1085 -646 -1893 -234 1732 363
929C63j193K10j433L086k24k526J57K526k10k765R28p83K306L79j424j668J861
$$ 363 -830 -620 -2053 1033 809 -1717 -1560 966 756 -2009 -1081 -1864 442 821 -603 -2271 -410
946d10M80q94J587j911Q61J904m96k620M76K630J13L36k342J82J400J603k428
$$ -410 70 -824 763 -1148 -287 1617 1121 -1499 -1023 1607 1720 2056 -286 -104 1296 2899 471
963D71n31K252p89O59j332j147O76K932j507j965J192n21Q07r33j47l44J778m2
$$ 471 -60 2192 1403 2062 730 -417 259 3191 1684 -281 911 390 1197 264 117 -227 1551 1509
981A509k047K50l14J286P74k32k995J890J598j665k05n33J372N56N5k877K46K322
$$ 1509 -538 -288 -602 684 1458 1226 -1769 121 1719 54 -151 -684 688 1244 1299 -1578 -1332 990
999I90Pj050p13P33r79J691j982q26K321O8r01r56K32r05K848n06j614K67P31
$$ 990 997 -53 -766 -33 -1012 679 -1303 -2129 192 260 -641 -1597 -1365 -2270 578 72 -1542 -1275 -544
1018e44O58j358M44p42K632M05k252q31J800L29n06J333k057Q81J054n68q98m41
$$ -544 114 -1244 -800 -1542 1090 1495 -757 -1588 212 541 35 1368 -689 192 1246 678 -220 -661
1036f61J654L45M19k554k73K101J053k254l38J872j002M20j218l45J081J213r92
$$ -661 993 1338 1757 -797 -1070 1031 2084 -170 -508 1364 362 782 -436 -781 300 1513 521
1053E21r33K91n94J551k56n05j018J752K47k198M82j66J174M25o56k143J339J199
$$ 521 -412 -121 -715 836 580 75 -943 809 1056 -1142 -660 -826 348 773 117 -2026 -687 512
1071E12j326O85j377J211L78j4k284L53K534q86l50o80N5l00J576j351l79J596
$$ 512 -814 -129 -1506 -295 83 69 -2215 -1862 672 -214 -564 -1244 -1189 -1489 87 -1264 -1643 -47
1089d7n77M58q66l38K5K271j96j845M60M17O33o15K61q95K038N25k374m5O86J208
$$ -47 -624 -166 -1032 -1370 -1345 926 730 -1115 -655 -238 395 -220 41 -854 1184 1709 -665 -710 -24 1184
1109A184l46N83j964Q39R99r38l72k64J538n02P45k182lJ602O87r52j107J115
$$ 1184 838 1421 -543 296 1295 357 -15 -279 1259 757 1502 -680 -683 919 1606 654 -453 662
1127F62n35R10j334m33J442O78q66j214P44o10J182K66j338j20R12K3r07O93j214
$$ 662 127 1037 -297 -730 712 1390 524 -690 54 -556 626 892 -446 -566 346 369 -538 155 -1059
1146a059J477O91j530j335J265J226j122J90o16N03N10k36j436O39J582j113N29
$$ -1059 418 1109 -421 -1756 -491 735 -387 -197 -813 -310 200 -36 -1472 -833 749 -364 165
1163A65j107l8M80J419j016r02J388m59N25j009k29M16K175r25j797M98N32R34
$$ 165 -942 -980 -500 919 -97 -999 389 -70 455 -554 -783 -367 1808 883 -914 -416 116 1050
1181A050m92k75o62J748P5k107P38P14N92k36k96j403P20J291p18o8k75M92l80
$$ 1050 558 283 -379 1369 1444 -663 75 789 1381 1145 849 -554 166 1457 739 671 396 888 508
1200E08Q31k043j30J670L25l84j193L42l05J449j183n83J413L09p60j207O67l25
$$ 508 1339 -704 -834 836 1161 777 -416 -74 -379 1070 -113 -696 717 1026 266 -941 -274 -599
1218e99J577n44j531K80Q52p4p90P75p97J151J46j435k37O71J265q74J40j176
$$ -599 978 434 -1097 -817 35 -39 -829 -54 -851 300 446 -989 -1226 -555 710 -164 -24 -1200
1236a200M76J023o21r45P15R63q80N47j071N0Q82Q48p67r14J007n20P99o86k79
$$ -1200 -724 299 -322 -1267 -552 411 -469 78 -993 -943 -61 787 20 -894 113 -407 392 -294 -573
1255e73N79J558p03j990J165k16J262k67o86l63J232j18j514R41k38R62j16n43
$$ -573 6 1564 861 -1129 36 -180 1082 815 129 -234 998 880 -634 307 69 1031 915 372
1273C72j119N99R49p38J50k69j56N6O34j461J73J440p19L05j086k88N50J495j228
$$ 372 -747 -148 801 63 213 -56 -212 -156 478 -983 -810 630 -89 216 -870 -1158 -608 887 -341
1292c41q72J467k25n09m68L74k15J319m44j487P01J61M40k91K9r85R71N16j268
$$ -341 -1213 254 29 -480 -948 -574 -789 530 86 -1401 -700 -539 -99 -390 -361 -1346 -375 141 -1127
1311a127j46M50J049o06M55j611O62J051n98l41L9P80r4M58j353J98J513J22o94
$$ -1127 -1273 -823 226 -380 75 -1536 -874 177 -421 -762 -723 57 -37 421 -932 -734 779 901 207
1330B07m53N57l91J130o77n83O34O72l03j337P79j85J237m09r92r3R85q4p98Q81
$$ 207 -246 311 -80 1050 373 -210 424 1096 793 -544 235 50 1287 878 -114 -207 778 694 -104 777
1350G77q06O23J41l99j137P76J036k90o4j265J22J049J85j163N9J541r35O4p63
$$ 777 -29 594 735 336 -801 -25 1011 721 657 -608 -486 563 748 -415 -356 1185 250 314 -449
1369d49l0R20O19j025p84R10j82L81p57j05K26J281r44j169P84k82O87M3j40q09
$$ -449 -479 441 1060 35 -749 161 -21 360 -397 -502 -276 1005 61 -1108 -324 -606 81 124 -16 -825
1389h25P31O58q87M1l5J099k46j71j245O04J554r40l57J05N83k78M47j059K14
$$ -825 -94 564 -323 -282 -317 782 536 365 -880 -276 1278 338 -19 86 669 391 838 -221 -7
1408gJ272k83k17q32P9M23Q45n09j118Q26J46Oo65L10m01J472o68j240k5P31M75
$$ -7 1265 982 765 -67 12 435 1280 771 -347 479 625 631 -34 276 -125 1347 679 -561 -586 145 620
1429F20n00Q0o86R20K54r03m18O46P04p23K55j141K10R51p4p00j68Q17m93M43
$$ 620 120 200 -486 434 688 -215 -633 13 717 -6 249 -892 -682 269 195 -505 -673 144 -349 94
1449I4j107q5J155K07q46n20O41j67P10n79l31J52R94o93j069R27j02R65j28r89
$$ 94 -1013 -1098 57 264 -582 -1102 -461 -628 82 -497 -828 -676 318 -375 -1444 -517 -619 346 218 -771
1469g71m08J370J61p47M45m87Q30J89p31j186J237J528j234j26l04K87J91J16
$$ -771 -1179 191 352 -395 50 -437 393 582 -149 -1335 -98 1430 196 70 -234 53 244 360
1487C60q07K08J106m48j19o66K74M55O13n70j176P76M41K0p96N3J36J065m83j551
$$ 360 -447 -239 867 419 300 -366 -92 363 976 406 -770 6 447 467 -329 -276 -140 925 442 -1109
1507a109R50N24K11l03n14o46J231K44j013J82Q1N73m27j2j115O77J063p10m50
$$ -1109 -159 365 576 273 -241 -887 344 588 -425 -243 -162 411 -16 -28 -1143 -466 597 -113 -563
1526e63j22P27j72K21j247M65J065k3r46o23P94R5O76l08p72N30R04p69m89O38
$$ -563 -685 42 -130 91 -1156 -691 374 351 -595 -1218 -424 -329 347 39 -733 -203 701 -68 -557 81
1546H1k99J085k55j326L73P37J01n50J75k69P99J47q03n07R07P93q39j90m31M21
$$ 81 -218 867 612 -714 -341 396 497 -53 122 -147 652 799 -4 -511 396 1189 350 160 -271 150
1566A50O98l03o63L53N63o71J07m32L07M31R2o73p73J090n1L49n51m09K32O49
$$ 150 848 545 -118 235 798 127 234 -198 109 540 632 -41 -814 276 225 574 23 -386 -154 495
1586D95l98j166J148K2L58o30m11k16R35P4r49L29L49J05l10J00p44M69Q45m56
$$ 495 97 -1069 79 101 459 -171 -582 -798 137 211 -738 -409 -60 45 -265 -165 -909 -440 405 -51
1606e1k63l32M24L76J96j249O84O33k30o46k17N85R3Q89o82q30O05J24j89q6M26
$$ -51 -314 -646 -222 154 350 -899 -215 418 188 -458 -675 -90 3 892 210 -620 -15 109 -80 -166 260
1627B60o4K73J01r03L72M56L55o51L13m71O14J98r90J44P28J83o82M04q57O46
$$ 260 196 469 570 -333 39 495 850 199 512 41 655 853 -137 7 735 918 236 640 -217 429
1647D29K81k04m26nN09p06M04n42L00M71p2m65o62P45j51L27m94k45M87L79l83
$$ 429 710 506 80 75 584 -122 282 -260 40 511 439 -26 -688 57 -94 233 -261 -506 -19 360 -23
1668b3o95Q23m90P02n18l00j5N94L36q43L76m11M35j88j81j40K59M91m52j14m46
$$ -23 -718 105 -385 317 -201 -501 -516 78 414 -429 -53 -464 -29 -217 -398 -538 -279 212 -240 -354 -800
1689h00L73N81N8q57M91M03o27L3j33N92K10N15r91l71Q67m0n3k27K71j14K55
$$ -800 -427 154 212 -645 -154 249 -378 -345 -478 114 324 839 -152 -523 344 304 251 24 295 181 436
1710D36m12m21M55L7N46l77k36o62O19N55q20K92K04J30l16j22p11Q45N05n42
$$ 436 24 -397 58 95 641 264 28 -634 -15 540 -280 12 216 346 30 -92 -803 42 547 5
1730En82L90J50r8K71m50L9M01l2o45m1N22N7L60o23k38K3Q43n52n69Q19o7K32
$$ 5 -577 -187 -37 -135 136 -314 -275 126 94 -551 -592 -70 -13 347 -276 -514 -491 352 -200 -769 50 -17 215
1753B15n33n82J64O13K88o52O55n95J98L66j21m98O35K57n48j84k43M54N64j33
$$ 215 -318 -900 -736 -123 165 -487 168 -427 -229 137 16 -482 153 410 -138 -322 -565 -111 453 320
1773C20k43j29P99n67J96l14L02J47L87p60l33Q16j14M9m93N0K36K59k95l83K56
$$ 320 77 -52 747 180 376 62 364 511 898 138 -195 621 507 556 63 113 349 608 313 -70 186
1794A86J80J96n88N6j83M93N91r40k7j00L96Pl78j94N40N09o58j08j25L48j11
$$ 186 366 562 -26 30 -153 340 931 -9 -36 -136 260 267 -111 -305 235 744 86 -22 -147 201 90
1815I0J94m22kL15l10j33N7K7J9M81p83l30P91M0j04n52M43m29O37k70m43M71
$$ 90 284 -138 -140 175 -135 -268 -211 -184 -165 316 -467 -797 -6 34 -70 -622 -179 -608 29 -241 -684 -213
1837b13L67N8o03L4j07N90K49l66O0K09J59m70J34m62M63O02n22l12OO48m65K34
$$ -213 154 212 -391 -357 -464 126 375 9 69 278 437 -33 101 -361 102 704 182 -130 -124 524 59 293
1859B93k22M5K67O4m40m48O50k72P25m31m75K69J31N7m96L17j79M38k70m93L21
$$ 293 71 116 383 447 7 -441 209 -63 662 231 -244 25 156 213 -283 34 -145 293 23 -470 -149
1880a49O36k47m68lK13j01j73Q2j53N40J11p01O8J93Jq5K67l84M1L81k77j98O6
$$ -149 487 240 -228 -231 -18 -119 -292 -210 -363 177 288 -413 -345 -152 -151 -236 31 -353 -312 69 -208 -406 -340
1903c40J08J6O24n74l10L36K43k85j68L81J4J7j35j54L0N58j06n09K95l97L73
$$ -340 -232 -216 408 -166 -476 -140 103 -182 -350 31 45 62 -73 -227 -197 361 255 -254 41 -356 17
1924A7M68p65M83MK5k36P2k00N58L1l49k90j31O29l66M39l92J05K97j96m88N6
$$ 17 485 -280 203 207 232 -4 68 -132 426 457 108 -182 -313 316 -50 389 -3 102 399 203 -285 -229
1946b29L00J38Q1l60l39M85P5K15m67K80k9k7j40m46J56M37L25r07J79k56M41
$$ -229 71 209 290 -70 -409 76 151 366 -101 179 150 123 -17 -463 -307 130 455 -452 -273 -529 -88
1967h8K81n70K7J93L26n30n8J6M47J52k54l35n1P83n29K24j12j34K53K85q07K06
$$ -88 193 -377 -350 -157 169 -361 -419 -403 44 196 -58 -393 -444 339 -190 34 -78 -212 41 326 -481 -275
1989b75K18J72p7k25J32J8M98m71k99N98K25m25Nj62J20L01m7l92L07m51M75Q7
$$ -275 -57 115 38 -187 -55 -37 461 -10 -309 289 514 89 94 -68 52 353 306 -86 221 -230 245 332
2011C32j74k14K77L20l43k90P3K76k1po05N08J20M8l64j39M17j84J9l03J03K33
$$ 332 158 -56 221 541 198 -92 -19 257 236 229 -376 132 252 300 -64 -203 214 30 49 -254 -151 82
2033H2K18l34j73K91j82K75k81k28J81M06k12l39L14m88O41J17k99l38J26M41
$$ 82 300 -34 -207 84 -98 177 -104 -332 -151 255 43 -296 18 -470 171 288 -11 -349 -223 218
2053B18l25n9n7J81rQ1k42J62R8k44K83j62m8N17j61m75j25N85M0j56J05m09J74
$$ 218 -107 -166 -223 -42 -51 30 -212 -50 48 -196 87 -75 -123 394 233 -242 -367 218 258 102 207 -202 -28
2076b8L78j0n09M17L3j71J38k02J01L38q3m03k6j40O05Nj42n79N55k09k55J94
$$ -28 350 340 -169 248 281 110 248 46 147 485 402 -1 -27 -167 438 443 301 -278 277 68 -187 7
2098Gk10N97j04k44l80K65P2q8J32m0p0j23K72l21j3L42k29N3k94K26j43K47p8
$$ 7 -203 394 290 46 -334 -69 3 -85 47 7 -63 -186 86 -235 -248 94 -135 -82 -376 -150 -293 -46 -124
2121a24j19N2K03o4l81J75j08L49K99o62J23M2K96l70K77k65K33K27k48k55L12
$$ -124 -243 -191 12 -52 -433 -258 -366 -17 282 -380 -257 -215 81 -289 -12 -277 -44 183 -65 -320 -8
2142hK65l15K55m69K07J25OJ5j44N8J48K96n97q1K42K93j81q2N5k14M85m31J60
$$ -8 257 -58 197 -272 -65 60 66 81 -63 -5 143 439 -158 -239 3 296 115 33 88 -126 359 -72 88
2165H8k15L39L38n07j37p6K78J8Rm31O31n6m94L6j2L90J2q2l49J07O4K7j48J17
$$ 88 -127 212 550 43 -94 -170 108 126 135 -296 335 279 -215 -179 -191 199 211 129 -220 -113 -49 -22 -170 -53
2189e3j11J08J67n17N5K83j54K24k49K17k04L01j13k32J47R1J40l78K81k34L20
$$ -53 -164 -56 111 -406 -351 -68 -222 2 -247 -30 -234 67 -46 -278 -131 -40 100 -278 3 -231 89
2210H9J75m77L19k70L63k21J55k27K72K70p07L73j70J36J22Jl10j15O66k31k67
$$ 89 264 -213 106 -164 199 -22 133 -94 178 448 -259 114 -56 80 202 203 -107 -222 444 213 -54
2231e4J22J80j02M07m01m82N88j91M5j09K31k81J55k82k21M78l6M6k71K16k56
$$ -54 68 248 146 553 152 -330 258 67 112 3 234 -47 108 -174 -395 83 47 93 -178 38 -218
2252b18K20J72j88K7k14M81l72Q8l72N92j0l00k80K93J74k35r3n7J54k9J78j86
$$ -218 2 174 -14 13 -201 280 -92 -4 -376 216 206 -94 -374 -81 93 -142 -235 -292 -138 -167 11 -175
2274a75J6M82m74R2k86M3N3M52j53l78K21l1N16o59j3K25M23j38m72K10l72M82
$$ -175 -159 323 -151 -59 -345 -302 -249 203 50 -328 -107 -138 378 -281 -294 -69 354 216 -256 -46 -418 64
2296F4j52j0J79J46J43n03J11J09J01P0j50m29N05J03j06R3m94L84k91M68n08
$$ 64 -88 -98 81 227 370 -133 -22 87 188 258 108 -321 184 287 181 274 -220 164 -127 341 -167
2317a67j87O29r0k24O8n2k80M85O1m97J57K18j29L9M2j07j20L08k47k14L82k91
$$ -167 -354 275 185 -39 29 -23 -303 182 243 -254 -97 121 -8 31 73 -34 -154 154 -93 -307 75 -216
2339b16K31k18N9K44k15R7L8r0O5q3J4j55J57Or1O2p1N18p15M84l64pK67L41k01
$$ -216 15 -203 -144 100 -115 -18 20 -70 -5 -88 -74 -229 -72 -66 -157 -95 -166 352 -363 121 -243 -250 17 358 157
2364A57j35P6l30N09j05l89M30J85k81n24M67k00M72p3k76p1M5K78l88N51l62
$$ 157 22 98 -232 277 172 -217 213 398 117 -407 60 -140 332 259 -17 -88 -43 235 -153 398 36
2385C6Q1Ol44Q7J60M1j07m7J24K7J11J55o70M07Q9j39j4j44K69k83J29k01J87
$$ 36 117 123 -221 -134 26 67 -40 -87 37 64 175 330 -340 67 156 17 3 -141 128 -155 -26 -227 -40
2408d0N3j23o1m4J70J14M2k7k53j71J12K56kN4l74L53J87n47J52n7L92j34j62
$$ -40 13 -110 -171 -215 -45 69 111 84 -169 -340 -228 28 26 80 -294 59 246 -301 -149 -206 186 52 -110
2431a10o6M47k48N8k66R7M54l19J66k98o0L74R1m59J33M0j65M10j05k77K23J32
$$ -110 -176 271 23 81 -185 -88 366 47 213 -85 -145 229 320 -139 -6 34 -131 279 174 -103 120 252
2453B52j19j49j7J91J18n1k53j08K15j53Q4q7K79m6K4l94J50o0L64j77L8k48J46
$$ 252 133 -16 -33 158 276 225 -28 -136 79 -74 10 -77 202 156 180 -214 -64 -124 240 63 101 -147 -1
2476aK8k98L4K91Kj02p9N9J7O7Q2J1qj29k81M67j24k58J79M7L2j92N8o8K41j79
$$ -1 27 -271 -237 54 56 -46 -125 -66 -49 18 100 111 103 -26 -307 160 36 -222 -43 4 36 -156 -98 -166 75 -104
2502a04j00K3k2L20k58M6O6L14l49M1jJ54J29l01K38o1r8J2j8l5Q4K79k17q6j78
$$ -104 -204 -181 -203 117 -141 -95 -29 285 -64 -23 -24 130 259 -42 196 135 37 49 31 -4 80 359 142 56 -122
2527a22O2P8q4j83L44J17j96l42K61K76p8nj44q1j26J43K26o0o9M6r4j79r5J44
$$ -122 -60 18 -66 -249 95 212 16 -326 -65 211 133 128 -16 -97 -223 -80 146 86 17 63 -31 -210 -305 -161
2551a61J12J30m27M07qq0J25j54k05N6J24J40R1l98p7M44j9k58q2J37l30P11j63
$$ -161 -49 81 -346 61 53 -27 98 -56 -261 -205 -81 59 150 -248 -325 119 100 -158 -240 -103 -433 278 115
2574A15j90J27LN5l38j21L69L06k07r8J8P5M0j38J97m42N56k32j66j64M67J48
$$ 115 -75 52 55 110 -228 -349 20 326 119 21 39 114 154 16 213 -229 327 95 -71 -235 232 380
2596C80k01k26J78k57LM01j26j73Q7j11J77j26k45M20j17P1k26L19l16P1K3Q8
$$ 380 179 -47 131 -126 -123 278 152 -21 66 -45 132 6 -239 181 64 135 -91 228 -88 -17 6 94
2618I4K40q3l01k58L36j58L91l92j7Q5M7K37m02K04p6K01j40J02j13j73K95l27
$$ 94 334 251 -50 -308 28 -130 261 -131 -148 -63 -16 221 -181 23 -53 148 8 110 -3 -176 119 -208
2640b08L25l89L05N5k03r9j4J06K27l00J73o8J03O5j34L4J07J36l76M7J01k1k37
$$ -208 117 -272 33 88 -115 -214 -228 -122 105 -195 -22 -90 13 78 -56 -22 85 221 -155 -108 -7 -28 -265
2663b65M11o5k64J40K74k24L14l66J67r6J20k49L29M0j06k71n9K93j33n6R1j39
$$ -265 146 81 -183 -43 231 7 321 -45 122 26 146 -103 226 266 160 -111 -170 123 -10 -66 25 -114
2685a14p2M33k86j29K70J8J00l88j89K31J08J05j04j28r2K48j85m1J70j7K55k03
$$ -114 -186 247 -39 -168 102 120 220 -168 -357 -126 -18 87 -17 -145 -237 11 -174 -215 -45 -62 193 -10
2707a0k65kJ25L51k56n1j74J87r0K59l21J79L82l62k39K41J58k87L29l47L51K7
$$ -10 -275 -277 -152 199 -57 -108 -282 -95 -185 74 -247 -68 314 -48 -287 -46 112 -175 154 -193 158 185
2729A85J3k9l86J3M07j20j07q7j11K68k5k79K06J18o6l3m6j39J24O8J88r7k10
$$ 185 198 169 -217 -204 203 83 -24 -111 -222 46 21 -258 -52 66 0 -33 -79 -218 -94 -26 162 65 -145
2752a45K40m7j84QL12m9j14j34J53J5j2k7J7k70p6L92jq6J73o3P7j20j79j07K44
$$ -145 95 48 -136 -128 184 135 21 -113 40 55 43 16 33 -237 -313 79 78 -8 165 102 179 59 -120 -227 17
2777A7n8j59J46J24Mj58K9j67K67J5j11j07j63L58k00L02o9M6J0j81r6OL21P2
$$ 17 -41 -200 -54 70 74 -84 -55 -222 45 60 -51 -158 -321 37 -163 139 70 116 126 -55 -151 -145 176 248
2801B48n8j37o7P7j84P6J8j98K42l92J83k1J88j03K02j37Q7K46l81P0K36j56L4
$$ 248 190 53 -14 63 -121 -45 -27 -225 17 -375 -192 -213 -25 -128 74 -63 24 270 -111 -41 195 39 73
2824G3J9Oj4J05j29K99l76k6k48K13J04n7O2N9K71m02j92K08k7J81j51j85K24
$$ 73 92 98 84 189 60 359 -17 -43 -291 -78 26 -31 31 90 361 -41 -233 -25 -52 129 -22 -207 17
2847A7k30J80J42r8k41K59j33j35k6N5O3J22j73K84K4r8j4k4j4J46k21J06J78
$$ 17 -213 -33 109 11 -230 29 -104 -239 -265 -210 -147 -25 -198 86 110 12 -2 -26 -40 106 -115 -9 169
2870A69j17L3k2j13J7R4L8L8j46J75j39J35j80J94p8R0q0j38p1K3J55K8J30k27
$$ 169 52 85 63 -50 -33 61 99 137 -9 166 27 162 -18 176 98 188 108 -30 -101 -78 77 105 235 8
2894HK43k76K35l08J99j14k67K85J35k82K30O4k59n6o5J34K39j9k90p5L38L5k58
$$ 8 251 -25 210 -98 101 -13 -280 5 140 -142 88 152 -107 -163 -228 -94 145 126 -164 -239 99 134 -124
2917a24J29p1O6j71N1J30j97K70j52LR1j42J58j43K14j00K73n67J50J87J5k35
$$ -124 5 -66 0 -171 -120 10 -187 83 -69 -66 25 -117 41 -102 112 12 285 -282 -132 55 70 -165
2939a65J21K9q3L26j53k2L6J24k04J86k47m8J50J54O4j72k37J41P4j17j27nK48
$$ -165 -44 -15 -98 228 75 53 89 213 9 195 -52 -100 50 204 268 96 -141 0 74 -43 -170 -175 73
2962G3rK6j89j29L43N9l4j91j09L18l40Q2J57k4K43k85J06k10K76l9J73l23j15
$$ 73 64 90 -99 -228 115 174 140 -51 -160 158 -182 -100 57 33 276 -9 97 -113 163 124 297 -26 -141
2985a41K71j38k12r0K09R0Q2K6j98PJ98o1p2j3J28q7j24K33k90J09P3m5m5j15
$$ -141 130 -8 -220 -310 -101 -11 71 97 -101 -94 104 43 -29 -42 86 -1 -125 108 -182 -73 0 -45 -90 -205
3009b05Q3J87J44l54R2QlP8j23K7R9j81K74k36L0l2K38j22j4L2j5P1q6K14J4q4
$$ -205 -122 65 209 -145 -53 -45 -48 30 -93 -66 33 -148 126 -110 -80 -112 126 4 -10 22 7 78 -8 206 220 136
3035A36j34J17l7J15j23ok4lJ39j87j00M7K32K4j15o2l03M83l22K59K5R9J87n22
$$ 136 2 119 82 197 74 68 44 41 180 -7 -107 -60 172 196 81 19 -284 199 -123 136 161 260 447 -75
3059g5J83j61J99j63J23P3l41M47j68j25k12N8N0J04n0k80L20r4P8m8K94l59k1
$$ -75 108 -53 146 -17 106 179 -162 285 117 -8 -220 -162 -112 -8 -58 -338 -18 -112 -34 -82 212 -147 -168
3082a68L6J92J67j41j25j37K35j81K03j17j47j82L37J13l28K18j33N2K97j76j20
$$ -168 -132 60 227 86 -39 -176 59 -122 81 -36 -183 -365 -28 85 -243 -25 -158 -106 191 15 -105
3103a05j93J95K84k20K2J88l9Q5q6k41L33m28K52K98m32O6J14j72K54k34J09j08
$$ -105 -298 -103 181 -39 -17 171 132 217 131 -110 223 -205 47 345 -87 -21 93 -79 175 -59 50 -58
3125e8j2R5Q5O9j54k45J83j11oJ32l5J5P4l17K19J84n8K03l17L03j95l80L00k4
$$ -58 -70 25 110 179 25 -220 -37 -148 -154 -22 -57 -42 32 -285 -66 118 60 263 -54 249 54 -326 -26 -50
3149e0J48k10p1q3K78r4JK8l2J3L7J4RPr0J99P1k21L78m74L02j54n6J67J56k18
$$ -50 98 -112 -183 -266 12 -82 -81 -53 -85 -72 -35 -21 -12 -5 -95 104 175 -46 332 -142 160 6 -50 117 273 55
3175E5j32K73l6r3j99J58R7j67NK81k89K9j55K56P3P7j41J36m4L54m41Ol1j56
$$ 55 -77 196 160 67 -132 26 123 -44 -39 242 -47 -18 -173 83 156 233 92 228 184 538 97 103 72 -84
3199h4JJ91R8o5j02m9j28J85j15J01N6j16J5n2K25l24M5M77m78J70j10J5K79k98
$$ -84 -83 108 206 141 39 -10 -138 47 -68 33 89 -27 -12 -64 161 -163 -118 359 -119 51 -59 -44 235 -63
3223f3L06m15J88N8k02J51J02p0k14M7O8M9k13L15N5r0J51m72J20J88J28l17P9
$$ -63 243 -172 16 74 -128 23 125 55 -159 -112 -44 5 -208 107 162 72 223 -249 -129 59 187 -130 -51
3246e1J74m70L29j56K43j01J8K06Mk59J33k7q9M2j44K48j75J05p2j50M28o5m75
$$ -51 123 -347 -18 -174 69 -32 -14 192 196 -63 70 43 -46 -4 -148 100 -75 30 -42 -192 236 171 -304
3269c04J9L22mJ73k0j71M33l46J17k79j8J94k69R7o1J55Kko7J20n2j51Q8N4p0
$$ -304 -285 37 33 206 186 15 448 102 219 -60 -78 116 -153 -56 -117 38 40 38 -29 91 39 -112 -24 30 -40
3294d0j81R5N3n1J57j10J08m09M45k10J73K71k54j83K28j8m4L0o1Nm9o6J16L9
$$ -40 -221 -126 -73 -124 33 -77 31 -378 67 -143 30 301 47 -136 92 74 30 60 -1 4 -45 -111 5 44
3318D4j98K95O4j28P8k67L28j31k46K42k36l1j10M25j0k08M4q1J89J01oj45k3
$$ 44 -154 141 205 77 155 -112 216 85 -161 81 -155 -186 -296 129 119 -89 -45 -126 63 164 158 13 -10
3341a0j3Q3r8j28J79K4j9p2K95l1k37J9r5J9K31n4j29P9qpJ71l9k37Q7k06M03
$$ -10 -23 60 -38 -166 13 37 18 -54 241 210 -27 -8 -103 -84 147 93 -36 43 35 28 199 160 -77 10 -196 207
3367B07k23k29K87l2j64P7J77j04k29K42L4j74p6K47L9j00J39j3p3n4K02l98K29
$$ 207 -16 -245 42 10 -154 -77 100 -4 -233 9 43 -131 -207 40 79 -21 118 105 32 -22 180 -218 11
3390A1n7KK37j26J42k12J72l43M23j60j75L28k85J19j60J84m4l16J96o2K8J58
$$ 11 -46 -44 193 67 209 -3 169 -174 249 89 -86 242 -43 76 -84 100 56 -260 -64 -126 -98 60
3412F0M2k18P1j31K27r4K78m9j70O2j96K29K7j21m7j4L47k30jk9R1j60K27j11
$$ 60 102 -116 -45 -176 51 -43 235 186 16 78 -118 111 138 17 -30 -44 303 73 72 43 134 -26 201 90
3436I0J45m43J40Nj35J83L3j56J87j36P5j10J56j71J06r7j05R8R3j8q8J30q3p
$$ 90 235 -208 -68 -63 -198 -15 18 -138 49 -87 -12 -122 34 -137 -31 -128 -233 -135 -42 -60 -148 -18 -101 -108
3460a08J20J71j5n2j95RJ32L4j03J7j3K43j40jj47j48K21r6j69j30M91J7j30N1
$$ -108 12 183 168 116 -79 -70 62 96 -7 10 -3 240 100 99 -48 -196 25 -71 -240 -370 121 138 8 59
3484E9k55N98l88j07J16q2J83K15k87Q5j29J21J8r4nj68M56l04J34j83K43k15
$$ 59 -196 402 14 -93 23 -59 124 339 52 137 8 129 147 53 48 -120 336 32 166 -17 226 11
3506A1n5m2k2m7K41j15O4O0j19K23k08j16K04o3m12K65J40k86K59j12p9J83O7
$$ 11 -44 -86 -108 -155 86 -29 35 95 -24 199 -9 -125 79 16 -396 -131 9 -277 -18 -130 -209 -26 41
3529D1J2j53O2j95J93j10L8nK69J9p2m6l16J67q2J89Q8p3j3L15m01j0Q5Q8j03
$$ 41 53 -100 -38 -233 -40 -150 -112 -117 152 171 99 53 -263 -96 -178 11 99 26 13 328 -73 -83 2 90 -13
3554a3j9Kj3J74k04J29M9m0J25j76j34J31L22k59p2j73L17m7k10L58j80j53L89
$$ -13 -32 -30 -43 131 -73 56 105 65 190 14 -120 11 333 74 2 -171 146 99 -111 247 67 -86 303
3577C03p4j02m8j07J32k31K38k26P3Pq1j08O5r2J92R7j10J41L4k55L20k07r5K17
$$ 303 229 127 79 -28 104 -127 111 -115 -42 -35 -116 -224 -159 -251 -59 38 -72 69 103 -152 168 -39 -134 83
3601H3j80L4n7J19K17m13N9J10k0OJ26k39J64O0M6rk1q7P5J55m57K47L4K00j70
$$ 83 -97 -63 -120 -1 216 -197 -138 -28 -48 -42 84 -155 9 69 115 106 85 -2 73 228 -229 18 52 252 82
3626H2j30J76J50l51J57M2q1k05M33l75J44j21KL49k97J3O5LP4j45J79J4j7k63
$$ 82 -48 128 278 -73 84 126 45 -160 273 -102 42 -79 -77 272 -25 -12 53 56 130 -15 164 178 161 -102
3650a02L4QR1k37k2K61j43q3J92k7j20P5L5K5q2K40l70L01j70k5L5K03k92K7J86
$$ -102 -68 -60 31 -206 -228 33 -110 -193 -1 -28 -148 -73 -38 -13 -95 145 -225 76 -94 -119 -84 119 -173 -146 40
3675D0l0j07QJ53k25J81O8k48L07k44K88L1j59m6k6J14k55R3j11J31j4J21k77
$$ 40 10 -97 -89 64 -161 20 88 -160 147 -97 191 222 63 17 -9 105 -150 -57 -168 -37 -51 70 -207
3698b07K75J48k47K8K42k29J45k27J82K4l62L40j01p8N6Q4J41j38J75j94j6R3
$$ -207 68 216 -31 -3 239 10 155 -72 110 134 -228 112 11 -67 -11 73 214 76 251 57 41 134
3720A34p3J1k92J91J73j01l3Q1k65K10l39K98J7j00J1K35n9k91J06K07k04m9n2
$$ 134 61 72 -220 -29 144 43 10 91 -174 36 -303 -5 12 -88 -77 158 99 -192 -86 121 -83 -132 -184
3743a84L56m04j57M49j94J47j02O8k17L59j93L30k65Q0k48Q5J76j42m4N7J01K35
$$ -184 172 -232 -389 60 -134 13 -89 -21 -238 121 -72 258 -7 73 -175 -90 86 -56 -100 -43 58 293
3765B93k63k14J81j4j25L8K27k57L34j65l8r8K56j28J63o3k06L13l17K8J82k68
$$ 293 30 -184 -3 -17 -142 -104 123 -134 200 35 -3 -101 155 27 190 127 -79 234 -83 -55 127 -141
3787a41R8R7j06K71j19j36N2l2j15K11k90J69j23J09k1J45j40J2J36Kj34P5p8
$$ -141 -43 54 -52 219 100 -36 16 -16 -131 80 -210 -41 -164 -55 -76 69 -71 -59 77 79 -55 20 -58
3810e8j3K03k02K56k07O1j83j23L68j91J55L6o8R0k01j5O4J48j65J67k97K75k83
$$ -58 -71 132 -70 186 -21 40 -143 -266 102 -89 66 102 34 124 -77 -92 -28 120 -45 122 -175 100 -183
3833a83J11J90j51J2Q6j26q2K59k9J02J3K7j36j16q6n5J58J1J35j14kP8j20k83
$$ -183 -72 118 -33 -21 65 -61 -143 116 87 189 202 229 93 -23 -109 -164 -6 5 140 26 24 102 -18 -301
3857c01J84K95j75J47m1k23L01j46K6n5o1P7j75K04J00j16q7K05J34j74pk41l1
$$ -301 -117 178 3 150 109 -114 187 41 67 12 -49 28 -147 57 157 41 -46 159 293 119 112 -129 -160
3880a60O1J97k52J20Qj53K44j89L21k22J42k60J77N7J18k71J56l09J72M7p6K10
$$ -160 -99 98 -154 -34 -26 -179 65 -124 197 -25 117 -143 34 91 209 -62 94 -215 -43 4 -72 138
3902A38l62J09K16p2Q2L2q0j44R8j93j38J67L24l19J89k9J05j14r3K65k82J46
$$ 138 -224 -115 101 29 111 143 63 -81 17 -176 -314 -147 177 -142 47 18 123 9 -84 181 -101 45
3924D5j34J08J77l08J78k6J59k30K5K9J0O6O7j85j30K49r2k07J75n9mj10J18R
$$ 45 -89 19 196 -112 66 40 199 -31 -6 23 33 99 166 -19 -149 100 8 -199 -24 -83 -87 -197 -79 -70
3948g0K2O4p9R2j29j60L26j63O5J34n1k54J15J59Qj24Q4j28N5p2O6O2k50L05J7
$$ -70 -48 16 -63 29 -100 -260 66 -97 -32 102 51 -203 -88 71 79 -45 39 -89 -34 -106 -40 22 -228 77 94
3973I4m4k6N4k49K20o1rO0K82k33m5m5J22r9j55m6L6J77L27n11K21M9j03l3j20
$$ 94 50 24 78 -171 49 -12 -21 39 321 88 43 -2 120 21 -134 -180 -144 33 360 -151 70 119 16 -17 -137
3998a37KJ81n9J44k60J82O8n8R0k27R2L4N0K6j34K5Q5j28k30K04KK39j17m3M6
$$ -137 -135 46 -13 131 -129 53 121 63 153 -74 18 52 102 128 -6 19 104 -24 -254 -50 -48 191 74 31 77
4023G7j84K73l10J01k01l9M74l36R3n3k1P7J65p6N2q2J93l23J6K30k4k0jj48P5
$$ 77 -107 166 -144 -43 -244 -283 191 -145 -52 -105 -126 -49 116 40 92 10 203 -120 -104 126 102 82 81 -67 8
4048Hj45J64l0O3J37k47K79l67J76l6j38Mj1J84J28Mo3q2j04K33p9m1J77k9l39
$$ 8 -137 27 -3 60 197 -50 229 -138 38 2 -136 -132 -143 41 169 173 110 28 -76 157 78 37 214 185 -154
4073a54L53P7l1l02J78j3j84L0J40m4J1J8j02o3J1J2r6L13k30o6K84k19O7Q5j67
$$ -154 199 276 245 -57 121 108 -76 -46 94 50 61 79 -23 -86 -75 -63 -159 154 -76 -142 142 -77 -10 75 -92
4098i2j94K79L05m27P8j23o5J77m1J06j51j38L86J41m14j53J78K91j24J11R6k99
$$ -92 -286 -7 298 -129 -51 -174 -239 -62 -103 3 -148 -286 100 241 -173 -326 -148 143 19 130 226 -73
4120g3j52n6K55K5k67L11l1N6J58l00j29K12P7L3p1R8k02J45j71r5K23l2K91k12
$$ -73 -225 -281 -26 -1 -268 43 12 68 226 -74 -203 9 86 119 48 146 -56 89 -82 -177 46 14 305 93
4144I3k26K28j32r0J25J63j63N7R1p7P9k49p8J87J18k29L35k69kL7j40K08j47
$$ 93 -133 95 -37 -127 -2 161 -2 55 146 69 148 -101 -179 8 126 -103 232 -37 -39 -2 -142 66 -81
4167h1k27L27K72l62K05N6J4l01J77n3N9k48n1J98Q7j20J24L6k4m9N1n0j03R4
$$ -81 -308 19 291 -71 134 190 204 -97 80 27 86 -162 -213 -15 72 -48 76 112 88 39 90 40 -63 31
4191C1l0j59J96J29j81j47p9K73J69j14m7J48r7k97K71j71K67l02L61P9n55L79
$$ 31 1 -158 38 167 -14 -161 -240 33 202 88 41 189 92 -205 66 -105 162 -140 221 300 -255 124
4213A24k27K48j92J24k53K92k21MM36k80J58j46J78k80K39l08J13J24l21L77k08
$$ 124 -103 145 -47 77 -176 116 -105 -101 335 55 213 67 245 -35 204 -104 9 133 -188 189 -19
4234a9q2Q0L8Ql0J44r1j64L7Kj3j4J71p1J1j65J69j19J01P6j51J27j05J72l27
$$ -19 -101 -21 17 25 -5 139 48 -116 -79 -77 -90 -104 67 -4 7 -158 11 -108 -7 69 -82 45 -60 112 -215
4259b15P9m8K81j57p1p5J39Q6k64K68O1N9r5j22r7K27j58L96m19M5L09k51m6R6
$$ -215 -136 -184 97 -60 -131 -206 -67 19 -245 23 84 143 48 -74 -171 56 -102 294 -125 -80 229 -22 -68 28
4283B8p8J34j85J81j32J02J19j57j78J22J33L6k59J09L67l82RJ25j16J41j28O8
$$ 28 -50 84 -101 80 -52 50 169 12 -166 -44 89 125 -134 -25 342 -40 -31 94 -22 119 -9 59
4305E9j56M2j18NR9j09j4J07K4K1l3j42J68J64o1k02J05o9J02k1j03j84J41L39
$$ 59 -97 -55 -173 -168 -69 -178 -192 -85 -61 -40 -73 -215 -47 117 56 -146 -41 -110 -8 -29 -132 -316 -175 164
4329A64L4l30J86K43j55n6j77K09q0k6k78K62j1J51r2j59J85K2k2j41J95o1m5
$$ 164 198 -132 54 297 142 86 -91 118 38 12 -266 -4 -15 136 44 -115 70 92 70 -71 124 63 18
4352A8O8qk21P6k2J78P3q4j46J78j71K39j60k03L49j72K09l78J94o8j61K05m4
$$ 18 86 78 -143 -67 -89 89 162 78 -68 110 -61 178 18 -185 164 -8 201 -177 17 -51 -212 -7 -51
4375e1K7nn0k6J99j37O6J83k46q1K01J09j62N3J59k35R5O3k90J55M3r6Rj64L35
$$ -51 -24 -29 -79 -105 94 -43 23 206 -40 -121 80 189 27 80 239 4 99 162 -128 27 70 -26 -17 -181 154
4400A54j82o6P8q7J19J09j17j2R7j33M0l6K9o6Q6J8j13J03k89M85k69j64J85l2
$$ 154 -28 -94 -16 -103 16 125 8 -4 93 -40 0 -36 -7 -73 13 31 -82 21 -268 217 -52 -216 -31 -63
4424f3L1M0j25j52J45J5J11j58L26j40p2N6L64l13k57p2L79m1J81r7q6J33k30
$$ -63 -32 8 -117 -269 -124 -109 2 -156 170 30 -42 14 378 65 -192 -264 115 74 255 158 72 205 -25
4447b5j6K82j48mj21J18K9M3k17n0J95r6J69l23Q9O9j32M9K2Oj6J77j36N7R1l82
$$ -25 -41 241 93 89 -32 86 115 158 -59 -109 86 -10 159 -164 -75 -6 -138 -89 -67 -61 -77 100 -36 21 112 -270
4473b70k0J78J40q3j05jJ94j55r3M54l43MJ63k00K8Q4O0j94K10m8l44M27r8j24
$$ -270 -290 -112 28 -55 -160 -161 33 -122 -215 239 -104 -100 63 -137 -109 -25 35 -159 51 3 -341 86 -12 -136
4497a36J75J35k15J34q4K0j84P9K43j01j4J10l22J91o6J23j39L35j94j55j5Q8
$$ -136 39 174 -41 93 9 29 -155 -76 167 66 52 162 -160 31 -35 88 -51 284 90 -65 -80 8
4519HR0j35N6J74j26k25J37j72J39J32q8K04l09J10o0K55j18k75L9K64j10M1p9
$$ 8 98 -37 19 193 67 -158 -21 -193 -54 78 -10 194 -115 -5 -65 190 72 -203 -164 100 -10 31 -48
4542d8J12K9j37M9m7O3j78J48k46J08O0j21K81j73P8K08j30L7Q3m27M45j02j15
$$ -48 64 93 -44 5 -42 21 -157 -9 -255 -147 -87 -208 73 -100 -22 186 56 93 176 -251 194 92 -23
4565b3J14J37j40k84K45n1P0j53N4o7K12k0l9J31k69J56n3J24m2j77P5j0O9o0
$$ -23 91 228 88 -196 49 -2 68 -85 -31 -98 114 94 55 186 -83 73 20 144 102 -75 0 -10 59 -1
4589aK08k04J44j47K18q0Oj12J79k12r4J31O7j13J05l76K23K09k0o7n1o9J46m31
$$ -1 207 3 147 0 218 138 144 32 211 -1 -95 36 103 -10 95 -281 -58 151 131 64 13 -56 90 -341
4613c41N35J0j42j63j46K19j36K72j94J15j19K20l2p8K6J38j07j51J68p3P2j79
$$ -341 194 204 62 -101 -247 -28 -164 108 -86 29 -90 130 98 20 46 184 77 -74 94 21 93 -86
4635h6J39j8j41M39m55K91k64j8j09N37l45j74K77J30r7K1oJ07j17P1q0J58j20
$$ -86 53 35 -106 333 -122 169 -95 -113 -222 315 -30 -204 73 203 106 127 121 228 111 182 102 260 140
4658A40k44J40n6m0j04K68k39K62J34l30L9Q5j04j57J45r2K32j69j3k9j38L50
$$ 140 -104 36 -20 -60 -164 104 -135 127 261 -69 -30 55 -49 -206 -61 -153 79 -90 -103 -132 -270 80
4680H0k32J26Q0k24J59j7N1L45n85J71J39j19N5K7k63O6K22k73j3J89O9o0L3j29
$$ 80 -152 -26 54 -170 -11 -28 23 368 -217 -46 93 -26 29 56 -207 -141 81 -192 -205 -16 53 -7 26 -103
4704a03K49j0j37j41K03K2k12K9J88j34R9K1P9j01M3j3j27K35m62L22m9J04l17
$$ -103 146 136 -1 -142 61 83 -129 -100 88 -46 53 74 153 52 95 82 -45 190 -272 50 1 105 -212
4727b12L78j39k9j48K11OJ51j30o5j31J40J4J36Q1j92J69j66j34J30j67J69j35
$$ -212 166 27 -2 -150 61 67 218 88 23 -108 32 46 182 263 71 240 74 -60 70 -97 72 -63
4749f3O1K57n9j81J47k41R4j83K30n9j08K32o7m92L64J56k2j96J59k28Q3K62O8
$$ -63 -2 255 196 15 162 -79 15 -168 62 3 -105 127 60 -432 -68 88 66 -130 29 -199 -116 146 214
4772B14k19n7m2J48j55p1k72L59J91k71L09k34P6K6N9k14J17o8J32k4J0k03J47
$$ 214 -5 -62 -104 44 -111 -182 -454 -95 96 -175 134 -100 -24 2 61 -153 -36 -104 28 4 14 -189 -42
4795d2M1J39j29L0k35K46l3j49L33j22k4K2j67J08r0J18R6j28M9j32r6K68j0P4
$$ -42 -1 138 9 39 -196 50 17 -132 201 79 55 77 -90 18 -72 46 142 14 63 -69 -165 103 93 167
4819A67j70j24M86l91j32K96j01J56l62L42n8Pj17J75j64k19K45l17J78R5o2O9
$$ 167 -3 -127 359 -32 -164 132 31 187 -175 167 109 116 -1 174 10 -209 36 -281 -103 -8 -70 -1
4841aJ2J41l35K75j41P6k67K63ll7j09Q1l13N1J54J89J20j31k58L58L1J9Qj20
$$ -1 11 152 -183 92 -49 27 -240 23 20 -17 -126 -45 -358 -307 -153 36 156 25 -233 125 156 175 183 63
4865F3j9j8M3K14m63K29p3K01N3k58K23j28J63l30L59l31l4J97l19K05K22l32
$$ 63 44 26 69 283 -180 49 -24 177 230 -28 195 67 230 -100 259 -72 -106 91 -228 -23 199 -133
4887a33L26l50J44J29j25J50j89J8R0M2j00R5j92J78Jj97K28j83L5j32J11k67
$$ -133 193 -157 -13 116 -9 141 -48 -30 60 102 2 97 -95 83 84 -113 115 -68 -33 -165 -54 -321
4909c21J74L05k07J99j58K39j98q8R7k72J64j44J30j4k18K90K7K46k70j62r3K96
$$ -321 -147 158 -49 150 -8 231 33 -55 42 -230 -66 -210 -80 -94 -312 -22 5 251 -19 -181 -274 22
4931B2o6N2j84L73k48QK41k60K77k73P5O3j24k4K90k40o3R6o0M0r9M11k79R1j39
$$ 22 -44 8 -176 197 -51 -43 198 -62 215 -58 17 80 -44 -68 222 -18 -81 15 -45 -5 -104 307 28 119 -20
4956b0j05K47k33M04k56J75j98M9m1k34J18K26l6k24O1R5O5j6o3L7j88L4K17j11
$$ -20 -125 122 -111 293 37 212 14 63 22 -212 -94 132 96 -128 -67 28 93 77 14 51 -137 -103 114 3
4980CK9J2k3j30L02l65K74n7J2k52o3K57j01j63J33M14k50J10K6m42K48j35J28
$$ 3 32 44 21 -109 193 -172 102 45 57 -195 -258 -1 -102 -265 -132 282 32 142 168 -274 -26 -161 -33
5003c3j79J58lJ6j32Q8J04J7J37k55J10r0K40k56J96n5J03k81L05j56n2J48j43
$$ -33 -212 -54 -57 -41 -173 -85 19 36 173 -82 28 -62 178 -78 118 63 166 -115 190 34 -18 130 -13
5026a3R8j72J99j48J75k75J77Q8%o7J28k03L0oKJ7k5j32J96k12J83J33q2o0j15
$$ -13 85 -87 112 -36 139 -136 41 129 129 62 190 -13 17 11 13 30 5 -127 69 -143 40 173 91 31 -84
5051h4K9p7J02J43k65j60L08%j82J60K25k31p2J32J32j23M4k22k2K72K6j12r5
$$ -84 -55 -132 -30 113 -152 -312 -4 -4 -186 -26 199 -32 -104 28 160 37 81 -141 -163 109 135 23 -72
5074g2j63R3k7M00l80K34m18M86k17J90l45L83j60j21L66j36j23M0Q0l0Kr9k17
$$ -72 -235 -142 -169 231 -149 85 -333 153 -64 126 -219 164 4 -117 249 113 -10 30 110 80 82 -17 -234
5097b34K49k2R2o0M2n6o7K58m7j07N5j73K4%L3j13L8M9N7o7j17M7R8L3j5J47k27
$$ -234 15 -7 85 25 67 11 -56 202 155 48 103 -70 -46 -46 -13 -126 -88 -39 18 -49 -166 -119 -21 12 -3 144 -83
5124h3J60j04K14m19J98j65L38l69L59k5Q1l35K40k67L47m55L79q2m0J34mk46
$$ -83 77 -27 187 -232 -34 -199 139 -230 129 104 185 -150 90 -177 170 -285 94 12 -28 106 102 -144
5146a44J6J15Q4n2j20J55l3j81J38L8q6J6m9K60r2k91K63r2K08k1j47J60j1j94
$$ -144 -128 -13 71 19 -101 54 21 -160 -22 16 -70 -54 -103 157 65 -226 37 -55 153 132 -15 145 134 -60
5170f0l42M83K6O3J10l54R4j02J59k2Q9r5j06j49K50j8J62k93J17J72k22J17j03
$$ -60 -402 81 107 170 280 -74 20 -82 77 55 144 49 -57 -206 44 26 188 -105 12 184 -38 79 -24
5193b4j66K41l98M50j38R3J64l24J56o9L9k39K24J1m8k99M09J08j41j17OP0k62
$$ -24 -190 51 -347 103 -35 58 222 -102 54 -15 24 -215 9 20 -28 -327 82 190 49 -68 -62 8 -254
5216b54K28p8J09j53L18j29q3P9K6P6j76o1J83j28R6j15R0k07J44P2Q1l63K0K00
$$ -254 -26 -104 5 -148 170 41 -42 37 63 139 -37 -98 85 -43 53 -62 28 -179 -35 37 118 -245 -225 -25
5240b5k14K69J85l6j95r3J59j9l2M1K33j81J09K4q9q2O6k03K08L2r1j45k8LQ4
$$ -25 -239 30 215 179 -16 -109 50 31 -1 40 273 92 201 225 136 54 120 -83 125 157 66 -79 -107 -104 -20
5265b0J86n0rmj99N7K69q1k37R9O2j62O5J02P4k33K22l68J75K5j0r0O4p9L89l22
$$ -20 166 116 107 103 -96 -39 230 149 -88 11 73 -89 -24 78 152 -81 141 -227 -52 -27 -37 -127 -63 -142 247 -75
5291g5k3J27m3Q0j31n4J19j48R5J29k72K77j98P6m3J63k26qK9J05J06L0K2r1N6
$$ -75 -98 29 -14 66 -65 -119 0 -148 -53 76 -196 81 -117 -41 -84 79 -147 -155 -126 -21 85 115 137 46 102
5316A02k1R3j89k24L21j02L86l65R8n6k5J38m3L5k61J56m7N9K04j58n7O9j90P4
$$ 102 81 174 -15 -239 82 -20 366 1 99 43 18 156 113 148 -113 43 -4 55 259 101 44 113 -77 -3
5340ck81L98q0J24l67J60K70j10j49j69j6N6J32o8j54J79ok28K40j81J29L12k58
$$ -3 -284 114 34 158 -209 -49 221 111 -38 -207 -223 -167 -35 -103 -257 -78 -84 -312 -72 -253 -124 188 -70
5363g0J18l07L30k60L09j46j1J33l8J1K0J8p4j80K70K4k62p6K64k44J73j04J72
$$ -70 48 -259 71 -189 120 -26 -37 96 58 69 89 107 33 -147 123 147 -115 -191 73 -171 2 -102 70
5386G0j07MM2J33l0j82J54M9j46j55N14m71L84l05j01J16k15J15O3N3L87m76K19
$$ 70 -37 -33 9 142 112 -70 84 133 -13 -168 346 -125 259 -46 -147 -31 -246 -131 -68 -15 372 -104 115
5409A15k94L97j56J7k3k04M07l72r2O6R5N8M8k8r2K24j1k45j39K40J65J50l87
$$ 115 -179 218 62 79 56 -148 259 -113 -205 -139 -44 14 62 34 -58 166 155 -90 -229 11 176 326 -61
5432f1J90P9j63Lj82R1J04q0J3q3J4j53J25J30O4j74J74j87P9Q7j82J86R2j60
$$ -61 129 208 45 48 -134 -43 61 -19 -6 -89 -75 -228 -103 27 91 -83 91 -96 -17 70 -112 74 166 6
5456Fn7pJ09N0o4j54K10J14l19J93j61K00l63M46k81J83O5l0k14O8J1n4J20Q1
$$ 6 -51 -58 51 101 37 -117 93 207 -112 81 -80 120 -243 203 -78 105 170 140 -74 -6 5 -49 71 152
5480A52p3r6m8j77J07J33N7p6N6j91K12k69P1k4K05j3o3J3J75k51K09k04P7j42
$$ 152 79 -17 -65 -242 -135 -2 55 -21 35 -156 56 -213 -142 -166 39 26 -37 -24 151 -100 109 -95 -18 -160
5504a60P9K55q6k67R4J11r8K2k7J62k34P1K4J64j01O8k35J02K91k83j56L65k80
$$ -160 -81 174 88 -179 -85 26 -72 -50 -77 85 -149 -78 -54 110 9 77 -158 -56 235 -48 -204 161 -119
5527a19K5J44k83M53k76K29l2k2j22J52q4q8K28l17J28k8N4J73r5P2O5m45L12
$$ -119 -94 50 -233 220 -56 173 141 119 -3 149 65 -23 205 -112 16 -12 42 215 120 192 257 -188 124
5550A24Q9j66L7j29K10qk45J46j25J94l7K1p3r2k33J30P9J76K18j87j44J77j01
$$ 124 213 47 84 -45 165 157 -88 58 -67 127 90 111 38 -54 -287 -157 -78 98 316 129 -15 162 61
5573F1J8N7k67M1pj03J84J06j03P4M4k34J85j57Q2j3j08K2J26p1J95k27J90pj94
$$ 61 79 136 -131 -90 -97 -200 -16 90 -13 61 105 -129 56 -101 -19 -32 -140 -118 8 -63 132 -95 95 88 -106
5598a06M90o47K23Rj63M28m39M00J93m94Q9J92l47k2J47Q3j36jJ67n8m2J22j09
$$ -106 384 -263 -40 -31 -194 234 -205 195 388 -106 -17 175 -172 -194 -47 36 -100 -101 66 8 -34 88 -21
5621b1J14r9j29K24j7j72Q5j25J47J64k97J17K15q4k56L10j99j4O0l60M73k43
$$ -21 93 -6 -135 89 72 -100 -15 -140 7 171 -126 -9 206 122 -134 176 -23 -37 23 -337 136 -107
5643a07J23k36K10K41n73L96l9q3p3L40j68l44J65J30M3j3k2N7k6O7m6L3l1J64
$$ -107 16 -220 -10 231 -342 54 15 -68 -141 199 31 -313 -148 -18 25 12 -10 47 21 88 42 75 44 208
5667B08j97k17J42o0J47J86k46J02m0j65J82NQ6l03J28K42J2j86j48KL8J32p0
$$ 208 11 -206 -64 -124 23 209 -37 65 25 -140 42 47 133 -170 -42 200 212 26 -122 -120 -82 50 -20
5690b0R3j47L02k37L1K0K62k17k7j31K7L52m23j9L8o1K27j03J29rO3j07K4j23
$$ -20 73 -74 228 -9 22 42 304 87 60 -71 -44 308 -115 -134 -96 -157 70 -33 96 87 150 43 67 -56
5714e6K06l00L27p0J76o0k26M1j86K61j05K02j40q9j31L71l24n1K32j56l5Mj3
$$ -56 150 -150 177 107 283 223 -3 38 -148 113 8 210 70 -19 -150 221 -103 -154 78 -78 -113 -109 -122
5737a22J30j06N2j5K26k04mM5J96r4L1j27K5k15L35k20J49r9N0r3L5J18k08J38
$$ -122 8 -98 -46 -61 165 -39 -43 2 198 104 135 8 33 -182 153 -67 82 -17 33 -60 -25 93 -115 23
5761B3J19q9J27l4j14K14M9j78q7k17K89l4o3K2J31j13k2J52o8j5j97K33n3j26
$$ 23 142 53 180 146 32 246 295 117 30 -187 102 68 5 27 158 45 23 175 107 92 -105 128 75 -51
5785e1Q9r1k8J53k97J94N4r9K1p8K53j74J63r2k2j36J01P1q3q6J04j02K18o3J74
$$ -51 38 -53 -81 72 -225 -31 23 -76 -55 -133 120 -54 109 17 -5 -141 -40 31 -52 -138 -34 -136 82 19 193
5810A93j27M3j35j47J10j4J51m11M29j74J06j02o5J50j68k8J30K17l09J50q5J50
$$ 193 66 109 -26 -173 -63 -77 74 -337 92 -82 24 -78 -143 7 -161 -189 -59 158 -151 -1 -86 64
5832F4n8m1J44O5k72l6J48P1J6r0j14L14k32j94K50l6J52L6M5k79K74p7o7N8q
$$ 64 6 -35 109 174 -98 -134 14 85 101 11 -103 211 -21 -215 35 -1 151 187 232 -47 227 150 83 141 133
5857A33j45J10j41l0R8J67nj83K58l48Q5J28j67M1j8J33k59K36l28J47L6J23r3
$$ 133 -12 98 -43 -73 25 192 187 4 262 -86 -1 127 -40 1 -17 116 -143 93 -235 -88 -52 71 -22
5880b2k11K03k08L00j22J66k22K20j38k2K29j01O2k31p1K68j41n6J78k86L07j22
$$ -22 -233 -30 -238 62 -60 106 -116 104 -34 -56 173 72 134 -97 -168 100 -41 -97 81 -205 102 -20
5902b0J1k6j12l9L25j54j80OP8J90l91M06j34J07j34J47l63M44k1m6j02P5K22
$$ -20 -9 -35 -147 -186 139 -15 -195 -189 -111 79 -312 94 -40 67 -67 80 -283 161 140 94 -8 67 289
5925B89l94j38K80p2J68Q0j66j1m6J6p5J0k7J86k73k3m0K97R4J03l92R7O6p6K57
$$ 289 -105 -243 37 -35 133 213 47 36 -10 6 -69 -59 -86 100 -173 -196 -236 61 155 258 -134 -37 29 -47 210
5950B10m48K07r1N9O0J12J05k94L3K5PK51p6jm5j76Q5Q6K05l81J10R2l15K42R9
$$ 210 -238 -31 -122 -63 -3 109 214 -80 -47 -22 -15 236 160 159 114 -62 23 109 314 -67 43 135 -180 62 161
5975A61k20P0k2q8K08n7P4J17j03k16K81j35M1j23p5j32L19J96j28j04j72L16
$$ 161 -59 11 -11 -99 109 52 126 243 140 -76 205 70 111 -12 -87 -219 100 296 168 64 -108 208
5997B08J17l80J87k67K17q5k5J9NJ34j32P6q0k7j22L81k66Jr4L47j30j69k1n4
$$ 208 325 -55 132 -135 82 -3 -28 -9 -4 130 -2 74 -6 -33 -155 226 -40 -39 -133 214 84 -85 -106 -160
6021a60M1j06L09l04J25L70n27L49j17LJ8J60j66j9J1Lj74J30j95K90n1l8n4J82
$$ -160 -119 -225 84 -220 -95 275 -252 97 -20 -17 1 161 -5 -24 -13 -10 -184 -54 -249 41 -10 -48 -102 80
6045H0l2r7J69j92j59K28q3K15k42L7L79l15oO3n7q4J80j48mNP2l8N5k20M72l01
$$ 80 48 -49 120 -72 -231 -3 -86 129 -113 -76 303 -12 -18 45 -12 -96 84 -64 -68 -63 9 -29 26 -194 278 -23
$$ [...]
8191D4
##END NTUPLES=NMR FID
##END=
