##TITLE=1H_Ser 5-2-V-OH
 CDCl3
 8 sc, 
 27.09.2022
##JCAMPDX= 6.0         $$ Bruker NMR JCAMP-DX V2.0
##DATA TYPE= NMR FID
##DATA CLASS= NTUPLES
##ORIGIN= UXNMR, Bruker Analytische Messtechnik GmbH
##OWNER= root
$$ XWIN-NMR		Version 3.5
$$ Tue Sep 27 15:23:55 2022 Russian Standard Time (UT+4h)  she@DPX200
##.OBSERVE FREQUENCY= 200.1313499994
##.OBSERVE NUCLEUS= ^1H
##.DELAY= (6, 6)
##.ACQUISITION MODE= SIMULTANEOUS
##.ACQUISITION SCHEME= undefined
##.AVERAGES= 8
##.DIGITISER RES= 18
##SPECTROMETER/DATA SYSTEM= spect
##.PULSE SEQUENCE= zg30
##.SOLVENT NAME= CDCl3
##.SHIFT REFERENCE= (INTERNAL, CDCl3, 0, 15.7039)
##AUDIT TRAIL= $$ (NUMBER, WHEN, WHO, WHERE, WHAT)
$$ ##TITLE= Audit trail, XWIN-NMR		Version 3.5
$$ ##JCAMPDX= 5.01
$$ ##ORIGIN= Bruker BioSpin GmbH
$$ ##OWNER= she
$$ F:/spectra/data/she/nmr/H-F/1/audita.txt
$$ ##AUDIT TRAIL=  $$ (NUMBER, WHEN, WHO, WHERE, WHAT)
(   1,<2022-09-27 15:23:01.25 +0400>,<she>,<DPX200>,
      <created by zg, POWCHK disabled, PULCHK disabled
       configuration hash MD5:
       00 E9 B6 7A A2 85 ED C7 34 08 36 98 17 FE 4E 26
       data hash MD5: 16K
       F1 E0 02 3D C5 50 26 B8 66 64 53 CE F3 9C 6C BD>)
$$ ##END=
$$ 
$$ hash MD5
$$ 4F 4F 68 EC ED 44 06 F9 89 E5 BF 45 C6 96 44 4C
##$RELAX= 
##$RELAX= 
##$RELAX= 
##$RELAX= 
##$RELAX= 
##$RELAX= 
$$ Bruker specific parameters
$$ --------------------------
##$DU= <F:/spectra>
##$EXPNO= 1
##$NAME= <H-F>
##$PROCNO= 1
##$TYPE= <nmr>
##$USER= <she>
##$AMP= (0..31)
100 100 100 100 100 100 100 100 100 100 100 100 100 100 100 100 100 100 
100 100 100 100 100 100 100 100 100 100 100 100 100 100 
##$AQSEQ= 0
##$AQ_mod= 1
##$AUNM= <au_zg>
##$AUTOPOS= <>
##$BF1= 200.13
##$BF2= 200.13
##$BF3= 200.13
##$BF4= 200.13
##$BF5= 200.13
##$BF6= 200.13
##$BF7= 200.13
##$BF8= 200.13
##$BYTORDA= 1
##$CFDGTYP= 0
##$CFRGTYP= 5
##$CHEMSTR= <none>
##$CNST= (0..31)
1 1 145 1 1 1 1 1 1 1 1 1 1 1 1 1 1 1 1 1 1 1 1 1 1 1 1 1 1 1 1 1 
##$CPDPRG= <>
##$CPDPRG1= <>
##$CPDPRG2= <>
##$CPDPRG3= <>
##$CPDPRG4= <mlev>
##$CPDPRG5= <mlev>
##$CPDPRG6= <mlev>
##$CPDPRG7= <mlev>
##$CPDPRG8= <mlev>
##$CPDPRGB= <>
##$CPDPRGT= <>
##$D= (0..31)
0 1.2 0 0 0 0 0 0 0 0.06 0 0.03 0 0 0 0 0.0002 0 0 0 0 0 0 0 0 0 0 0 0 
0 0 0 
##$DATE= 1664277780
##$DBL= (0..7)
120 120 120 120 120 120 120 120 
##$DBP= (0..7)
150 150 150 150 150 150 150 150 
##$DBP07= 0
##$DBPNAM0= <>
##$DBPNAM1= <>
##$DBPNAM2= <>
##$DBPNAM3= <>
##$DBPNAM4= <>
##$DBPNAM5= <>
##$DBPNAM6= <>
##$DBPNAM7= <>
##$DBPOAL= (0..7)
0.5 0.5 0.5 0.5 0.5 0.5 0.5 0.5 
##$DBPOFFS= (0..7)
0 0 0 0 0 0 0 0 
##$DE= 6
##$DECBNUC= <off>
##$DECIM= 32
##$DECNUC= <off>
##$DECSTAT= 4
##$DIGMOD= 1
##$DIGTYP= 9
##$DL= (0..7)
0 120 120 120 120 120 120 120 
##$DP= (0..7)
150 150 150 150 150 150 150 150 
##$DP07= 0
##$DPNAME0= <>
##$DPNAME1= <>
##$DPNAME2= <>
##$DPNAME3= <>
##$DPNAME4= <>
##$DPNAME5= <>
##$DPNAME6= <>
##$DPNAME7= <>
##$DPOAL= (0..7)
0.5 0.5 0.5 0.5 0.5 0.5 0.5 0.5 
##$DPOFFS= (0..7)
0 0 0 0 0 0 0 0 
##$DQDMODE= 0
##$DR= 18
##$DS= 0
$$ [...]
##$SUBNAM2= <"">
##$SUBNAM3= <"">
##$SUBNAM4= <"">
##$SUBNAM5= <"">
##$SUBNAM6= <"">
##$SUBNAM7= <"">
##$SUBNAM8= <"">
##$SUBNAM9= <"">
##$SW= 18.0517283424941
##$SWIBOX= (0..15)
0 0 2 0 0 0 0 0 0 0 0 0 0 0 0 0 
##$SW_h= 3612.71676300578
##$TD= 16384
##$TD0= 1
##$TE= 0
##$TE2= 300
##$TE3= 300
##$TEG= 300
##$TL= (0..7)
0 120 120 120 120 120 120 120 
##$TP= (0..7)
150 150 150 150 150 150 150 150 
##$TP07= 0
##$TPNAME0= <>
##$TPNAME1= <>
##$TPNAME2= <>
##$TPNAME3= <>
##$TPNAME4= <>
##$TPNAME5= <>
##$TPNAME6= <>
##$TPNAME7= <>
##$TPOAL= (0..7)
0.5 0.5 0.5 0.5 0.5 0.5 0.5 0.5 
##$TPOFFS= (0..7)
0 0 0 0 0 0 0 0 
##$TUNHIN= 0
##$TUNHOUT= 0
##$TUNXOUT= 0
##$USERA1= <user>
##$USERA2= <user>
##$USERA3= <user>
##$USERA4= <user>
##$USERA5= <user>
##$V9= 5
##$VALIST= <valist>
##$VCLIST= <CCCCCCCCCCCCCCC>
##$VD= 0
##$VDLIST= <DDDDDDDDDDDDDDD>
##$VPLIST= <PPPPPPPPPPPPPPP>
##$VTLIST= <TTTTTTTTTTTTTTT>
##$WBST= 1024
##$WBSW= 4
##$XGAIN= (0..3)
0 0 0 0 
##$XL= 0
##$YL= 0
##$YMAX_a= 110712
##$YMIN_a= -214913
##$ZGOPTNS= <>
##$ZL1= 120
##$ZL2= 120
##$ZL3= 120
##$ZL4= 120
##$ABSF1= 10
##$ABSF2= 0
##$ABSG= 5
##$ABSL= 3
##$ALPHA= 0
##$AQORDER= 0
##$ASSFAC= 0
##$ASSFACI= 0
##$ASSFACX= 0
##$ASSWID= 0
##$AUNMP= <proc_1d>
##$AZFE= 0.1
##$AZFW= 0.1
##$BCFW= 1
##$BC_mod= 2
##$BYTORDP= 1
##$COROFFS= 0
##$CY= 11.3945322036743
##$DATMOD= 1
##$DC= 2
##$DFILT= <>
##$DTYPP= 0
##$F1P= 2.36226072786647
##$F2P= -0.459571619588291
##$FCOR= 0.5
##$FTSIZE= 0
##$FT_mod= 4
##$GAMMA= 1
##$GB= 0.15
##$INTBC= 1
##$INTSCL= 1
##$ISEN= 128
##$LB= 0.24
##$LEV0= 0
##$LPBIN= 0
##$MAXI= 10000
##$MC2= 0
##$MEAN= 0
##$ME_mod= 0
##$MI= 1.114404
##$NCOEF= 0
##$NC_proc= 0
##$NLEV= 6
##$NOISF1= 3.799351
##$NOISF2= 2.8
##$NSP= 1
##$NTH_PI= 0
##$NZP= 0
##$OFFSET= 15.70392
##$PC= 1
##$PHC0= -18032.64
##$PHC1= 9.200689
##$PH_mod= 1
##$PKNL= yes
##$PPARMOD= 0
##$PSCAL= 0
##$PSIGN= 0
##$REVERSE= no
##$SF= 200.130013532006
##$SI= 16384
##$SIGF1= 3
##$SIGF2= 2
##$SINO= 400
##$SIOLD= 16384
##$SREGLST= <1H.CDCl3>
##$SSB= 0
##$STSI= 0
##$STSR= 0
##$SW_p= 3612.71676300578
##$SYMM= 0
##$S_DEV= 0
##$TDeff= 0
##$TDoff= 0
##$TI= <>
##$TILT= no
##$TM1= 0
##$TM2= 0
##$TOPLEV= 0
##$USERP1= <user>
##$USERP2= <user>
##$USERP3= <user>
##$USERP4= <user>
##$USERP5= <user>
##$WDW= 1
##$XDIM= 8192
##$YMAX_p= 0
##$YMIN_p= 0
$$ End of Bruker specific parameters
$$ ---------------------------------
##NTUPLES= NMR FID
##VAR_NAME=  TIME,          FID/REAL,        FID/IMAG
##SYMBOL=    X,             R,               I
##VAR_TYPE=  INDEPENDENT,   DEPENDENT,       DEPENDENT
##VAR_FORM=  AFFN,          ASDF,            ASDF
##VAR_DIM=   8192,          8192,            8192
##UNITS=     SECONDS,       ARBITRARY UNITS, ARBITRARY UNITS
##FACTOR=    0.0002768,     1,               1
##FIRST=     0,             0,               0
##LAST=      2.2672688,     0,               0
##MIN=       0,             -214913,         0
##MAX=       2.2672688,     110712,          0
$$ Real data points
##PAGE= N=1
##DATA TABLE= (X++(R..R)), XYDATA
$$ [...]
$$ plain form
1851 -34 826 811 690 -40 -682 -416 426 385 211 -477 -1312 -894 374 -130 -1013 -557 -510 -819 -192 504 -322
1872 -322 -864 14 411 20 207 188 -396 -561 39 199 197 -63 -813 -624 6 359 -291 -439 -813 -1183 -570
1893 -570 313 256 -1208 -1753 -1169 -88 858 130 -971 -1477 -512 95 730 664 -563 -1413 -540 738 803
1912 803 484 -405 -1147 -541 723 702 -29 -769 -784 -471 227 670 -170 -763 -815 -892 -581 120 0 -915 -1100
1933 -1100 -66 -128 79 263 31 -187 -86 408 333 173 193 -335 -267 434 655 -21 -81 -207 -379 393 760
1954 760 -254 -972 -384 -321 79 141 -134 -1162 -625 297 100 197 -198 -758 -748 843 1460 -24 -465 -413
1974 -413 -296 777 1558 680 -663 -545 -91 847 1165 473 -1076 -735 39 206 409 366 -738 -1134 -113
1993 -113 744 243 -115 -326 -630 -385 564 895 328 -6 -379 -437 838 1575 314 -53 79 42 368 948
$$ packed form
1851c4Q60j5j21p30o42K66Q42m1j74o88q35M18J268n04q83M56M7l09O27O96q26
1872c22n42Q78L97l91J87j9n84j65O00J60kk60p50J89O30L53o50j48l74l70O13
1893e70Q83n7j464n45N84J081R46p28j101n06R65O07O35o6j227q50Q73J278O5
1912H03l19q89p42O06J264k1p31p40j5L13O98M43q40n93n2p7L11P01j20r15j85
1933a100J034o2K07J84k32k18J01M94p5j60K0n28O8P01K21o76o0j26j72P72L67
1954G60j014p18N88O3M00O2k75j028N37R22j97R7l95n60J0J591O17j484m41N2
1974d13J17J073P81q78j343J18M54R38L18o92j549L41P74J67K03m3j104l96J021
1993a13Q57n01l58k11l04K45R49L31n67l34l73n8J275P37j261l67J32l7L26N80
$$ plain form
2013 948 574 -522 -410 28 372 260 130 -578 -911 343 291 -20 -204 -371 -728 -5 1031 -47 -489
2032 -489 -216 -203 230 947 518 -452 -333 596 977 731 590 -348 -611 630 741 -78 301 26 -878 -288
2052 -288 1027 306 -445 -311 -572 -782 613 739 -256 -217 -219 -355 199 1069 257 -557 -442 204 221 778 868
2073 868 -591 -765 274 933 737 701 -336 -1222 -277 1062 207 -26 -220 -1064 -529 861 654 -934
2091 -934 -538 -255 -228 640 1010 -485 -864 76 577 515 737 -12 -380 475 1269 377 -100 124 -375 44
2111 44 933 580 -845 -609 -26 42 586 563 -590 -1170 -127 86 -267 418 -24 -824 -485 460 267 70
2131 70 250 -132 -666 514 707 272 365 310 -523 69 1193 630 5 -280 -502 -478 499 828 -117 -941 -630
2152 -630 -552 -13 640 229 -639 -509 -53 544 644 389 -770 -301 379 319 409 404 -247 -416 561 993 139
$$ packed form
2013I48l74j096J12M38L44j12j30p08l33J254n2l11j84j67l57P23J036j078m42
2032d89K73J3M33P17m29r70J19R29L81k46j41r38k63J241J11q19L79k75r04N90
2052b88J315p21p51J34k61k10J395J26r95L9kj36N54Q70q12q14J15O46J7N57R0
2073H68j459j74J039O59j96l6j037q86R45J339q55k33j94q44N35J390k07j588
2091i34L96K83K7Q68L70j495l79R40N01o2K22p49l68Q55P94q92m77K24m99M19
2111D4Q89l53j425K36N83O8N44k3j153n80J043K13l53O85m42q00L39R45j93j97
2131G0J80l82n34J180J93m35R3n5q33N92J124n63o25k85k22K4R77L29r45q24L11
2152f30P8N39O53m11q68J30M56N97J00k55j159M69O80o0R0no51j69R77M32q54
$$ plain form
2173 139 -145 -179 -196 279 528 245 -515 -324 159 -39 238 104 -706 -504 180 -132 119 -14 -465 -267 180
2194 180 376 138 356 -63 -90 574 1164 644 -6 -41 -146 317 850 554 -7 -758 -347 107 340 325 -161
2215 -161 -1028 -220 324 656 228 -274 -675 -618 406 879 231 -65 -340 -355 762 593 268 -253 -336 82
2235 82 459 568 183 18 61 -196 425 150 45 -288 -415 -13 -160 -219 -183 -486 -337 -229 -18 255 -117
2256 -117 -235 -66 121 224 512 388 20 -83 169 435 434 237 -164 -108 46 463 205 -94 -553 -240 -113
2277 -113 549 159 -549 -615 -296 69 438 383 -376 -792 -165 124 607 516 -467 -520 323 834 700 204 -205
2298 -205 -283 -65 753 510 -16 -351 -450 -189 166 370 36 -639 -430 -296 -6 254 98 -593 -443 -249 272
2319 272 204 153 -47 -508 -203 190 236 272 -136 -103 -220 335 361 395 -58 -44 -78 152 456 301 -412 -257 52
$$ packed form
2173A39k84l4j7M75K49k83p60J91M83j98K77j34q10K02O84l12K51j33m51J98M47
2194A80J96k38K18m19k7O64N90n20o50l5j05M63N33k96n61p51M11M54K33j5m86
2215a61q67Q08N44L32m28n02m01N7J024M73o48k96k75j5J117j69l25n21q3M18
2235H2L77J09l85j65M3k57O21k75j05l33j27M02j47n9L6l03J49J08K11K73l72
2256a17j18J69J87J03K88j24l68j03K52K66jj97m01N6J54M17k58k99m59L13J27
2277a13O62l90p08o6L19L65L69n5p59m16O27K89M83r1r83n3Q43N11j34m96m09
2298b05p8K18Q18k43n26l35r9K61L55K04l34o75K09J34K90K60j56o91J50J94N21
2319B72o8n1k00m61L05L93M6L6m08L3j17N55K6L4m53J4l4K30L04j55p13J55L09
$$ plain form
2342 52 31 -106 -419 -739 -620 10 170 -66 -599 -571 -393 380 339 -19 -207 -380 -160 339 912 -128 -287
2363 -287 -350 96 259 417 185 -374 -362 -224 270 210 -32 -427 -623 -224 296 173 21 -305 -593 -430 50
2384 50 93 109 -71 -148 -145 30 261 32 -57 -338 -196 187 508 372 -490 -256 68 118 237 92 -393 -633 66
2407 66 86 16 -180 -530 -423 26 217 56 -399 -132 -213 69 413 157 -323 -351 353 361 308 114 -84 -107 414
2430 414 627 51 30 -10 -135 -113 463 157 -337 -163 -145 -297 -7 295 -62 -536 -263 -45 206 272 252 -499
2452 -499 -275 149 2 462 434 -349 -456 267 429 535 340 16 -344 112 410 437 -199 -423 -156 -15 279
2473 279 364 -704 -574 -295 52 64 367 -281 -678 24 195 271 225 -23 -265 44 543 323 -39 140 -125
2494 -125 207 473 471 -183 -141 280 5 45 282 -116 -598 -214 36 -94 -47 -215 -485 -530 15 79 -105 144
$$ packed form
2342E2k1j37l13l20J19O30J60k36n33K8J78P73m1l58j88j73K20M99N73j040j59
2363b87o3M46J63J58k32n59J2J38M94o0k42l95j96L99N20j23j52l26k88J63M80
2384E0M3J6j80p7LJ75K31k29q9k81J42L83L21j36q62K34L24N0J19j45m85k40O99
2407F6K0p0j96l50J07M49J91j61m55K67q1K82L44k56m80k8P04Qn3j94j98k3N21
2430D14K13n76k1m0j25K2N76l06m94J74J8j52K90L02l57m74K73K18K51O6k0p51
2452d99K24M24j47M60k8p83j07P23J62J06j95l24l60M56K98K7o36k24K67J41K94
2473B79Q5j068J30K79L47J2L03o48l97P02J71P6m6k48k42L09M99k20l62J79k65
2494a25L32K66ko54M2M21k75M0K37l98m82L84K50j30M7j68k70m5N45O4j84K49
$$ plain form
2516 144 -177 -465 129 939 238 138 173 -56 215 575 344 119 -116 -217 225 387 406 -55 -529 -178 -201
2537 -201 197 373 -344 -739 -231 -121 57 -105 -160 -247 -195 390 96 -226 -14 -133 89 185 271 89 -244 -168
2559 -168 163 -21 554 97 -433 -6 54 -77 -289 -249 -470 -183 -92 82 -144 22 -89 -449 -3 25 -40 -399
2581 -399 -282 -378 179 314 497 158 -159 -45 317 587 384 -278 -122 -63 157 331 123 -105 -738 -389 133
2602 133 160 -172 -350 -648 -314 325 455 136 109 -376 -19 236 262 51 -167 -129 97 225 305 -22 -58 103
2624 103 176 79 378 357 -59 -91 270 -189 -173 208 -47 -67 -326 171 -106 141 78 -359 -149 125 109 -21 -205
2647 -205 23 175 313 556 -14 255 -105 180 262 551 -6 -485 -331 259 448 189 -44 -769 -107 338
2667 338 139 -147 -135 -207 -284 325 565 40 -336 -293 -261 495 476 195 -288 -132 -26 423 554 41 -304 -246
$$ packed form
2516A44l21k88N94Q10p01j00L5k29K71L60k31k25k35j01M42J62J9m61m74L51k3
2537b01L98J76p17l95N08J10J78j62n5q7N2N85k94l22K12j19K22R6Q6j82l33P6
2559a68L31j84N75m57n30M27O0j31k12M0k21K87R1J74k26J66j11l60M46K8o5l59
2581c99J17r6N57J35J83l39l17J14L62K70k03o62J56N9K20J74k08k28o33L49N22
2602A33K7l32j78k98L34O39J30l19k7m85L57K55K6k11k18L8K26J28Q0l27l6J61
2624A03P3r7K99k1m16l2L61m59J6L81k55k0k59M97k77K47o3m37K10K74j6j30j84
2647b05K28J52J38K43n70K69l60K85Q2K89n57m79J54N90J89k59k33p25O62M45
2667C38j99k86J2p2p7O09K40n25l76M3L2P56j9k81m83J56J06M49J31n13l45N8
$$ plain form
2689 -246 252 301 146 177 -234 -319 151 164 -120 132 -259 -338 -232 130 118 -201 -166 -498 -101 -50 356 -258 -187
2712 -187 83 24 185 455 -103 -88 93 434 167 205 -64 -181 106 40 128 -37 -254 -502 -263 82 69 -297
2734 -297 -369 -176 -134 139 288 -129 -149 -33 94 154 465 162 -321 -121 219 179 252 223 -34 -293 29 260
2756 260 157 359 -199 -380 165 76 404 -31 7 -10 -572 -95 366 -57 -293 -91 -274 141 471 97 -408
2777 -408 -146 4 398 444 399 148 -247 404 216 -66 180 -325 -295 -94 606 -185 -312 -19 -159 54 159
2798 159 -163 -238 -250 213 -38 -40 -50 -185 -110 272 349 -36 -93 -14 -347 196 461 196 79 -89 -26 206 257 207
2822 207 -71 -140 -122 -333 241 92 -227 -138 -476 -279 -28 224 29 -350 -469 172 209 428 160 -47 -380
2843 -380 297 601 146 536 181 -153 -42 258 -17 -77 -353 -330 40 235 131 -245 -517 -78 -42 275 -214
$$ packed form
2689b46M98M9j55L1m11q5M70J3k84K52l91p9J06L62j2l19L5l32L97N1M06o14P1
2712a87K70n9J61K70n58J5J81L41k67L8k69j17K87o6Q8j65k17k48K39L45j3l66
2734b97p2J93M2K73J49m17k0J16J27O0L11l03m83K00L40m0P3k9k57k59L22K31
2756B60j03K02n58j81N45q9L28m35L8j7n62M77M61m23k36K02j83M15L30l74n05
2777d08K62J50L94M6m5k51l95O51j88k82K46n05L0K01P00p91j27K93j40K13J05
2798A59l22p5j2M63k51kj0j35P5L82P7l85n7P9l33N43K65k65j17j68O3K32N1n0
2822B07k78o9J8k11N74j49l19Q9l38J97K51K52j95l79j19O41L7K19k68k07l33
2843c80O77L04m55L90l55l34J11L00k75o0k76K3L70J95j04l76k72M39L6L17m89
$$ plain form
2864 -214 -202 -472 -41 65 151 103 -140 -251 -227 259 154 6 192 225 133 297 271 -70 -116 -109 -116 447 -87 -13
2888 -13 -337 -204 72 1 -117 -139 -136 -283 119 258 -49 -217 -274 -448 -1 375 53 58 -30 -375 111 482 310
2911 310 -106 -239 38 192 439 189 -5 -215 -91 79 160 285 -102 -713 -346 219 -92 -9 -130 -330 -144
2932 -144 85 -57 -187 -264 123 139 101 94 -61 -143 306 298 278 344 76 -215 7 267 -9 23 54 115 -139 -190 -48
2957 -48 -143 132 12 -376 -63 39 10 -277 24 -314 242 33 176 162 -377 106 71 174 331 9 -159 -164
2979 -164 447 132 44 -87 -414 -179 191 45 8 -198 -289 -223 255 388 -58 -152 -134 -160 138 -96 -254 6
3001 6 -290 144 228 179 229 64 -93 211 137 393 -122 19 220 64 -155 23 -162 100 -190 -175 99 67 -301
3024 -301 -217 -137 59 56 -258 -198 -137 -256 -98 41 145 -257 34 -146 225 193 278 59 -70 269 304 355 -96
$$ packed form
2864b14J2k70M31J06Q6m8k43j11K4M86j05j48J86L3r2J64k6l41m6PpN63n34P4
2888a3l24J33K76p1j18k2Lj47M02J39l07j68n7j74M47L76l22Nq8l45M86L71j72
2911C10m16j33K77J54K47k50j94k10J24J70Q1J25l87o11L67N65l11Q3j21k00J86
2932a44K29j42j30p7L87J6l8pj55q2M49qk0O6k68k91K22K60k76L2L1O1k54n1J42
2957d8r5K75j20l88L13J02k9k87L01l38N56k09J43j4n39M83l5J03J57l22j68n
2979a64O11l15q8j31l27K35L70j46l7k06r1O6M78J33m46r4J8k6K98k34j58K60
3001Fk96M34Q4m9N0j65j57L04p4K56n15J41K01j56k19J78j85K62k90J5K74l2l68
3024c01Q4Q0J96ll14O0O1j19J58J39J04m02K91j80L71l2Q5k19j29L39L5N1m51
$$ plain form
3047 -96 -357 -125 -140 148 201 78 -297 -159 -24 75 242 -29 -217 -303 142 -1 95 165 -406 -262 18 158
3069 158 332 -270 -120 -160 -69 92 74 -29 140 54 242 220 169 103 -110 -207 -13 -17 -293 36 -229 19 -196
3092 -196 135 214 -85 -34 -145 -25 28 414 131 40 -32 342 63 -29 131 59 100 32 19 -184 -72 -261 129
3115 129 -59 292 -2 -45 -287 -236 -128 -38 10 -238 -263 87 -142 -83 -165 -92 -140 -144 106 173 65 29 -46 -106 164
3140 164 69 -121 -171 -17 -135 226 318 -100 -216 104 -381 -7 281 -288 -126 -177 -152 51 45 -59 -368 -138
3162 -138 120 259 -135 37 -53 91 222 90 2 58 257 -47 211 383 -270 -108 -96 -255 140 -29 -329
3183 -329 -423 -142 131 -35 -1 -136 -351 -94 35 28 -361 243 -20 -177 110 62 127 -37 118 115 208 76 187
3206 187 -269 -312 60 25 -186 188 -134 -208 181 -48 -353 173 26 -449 -317 110 50 -6 264 -210 -46 74
$$ packed form
3047i6k61K32j5K88N3j23l75J38J35R9J67k71j88q6M45j43R6P0n71J44K80J40
3069A58J74o02J50m0R1J61j8j03J69q6J88k2n1o6k13r7J94mk76L29k65K48k15
3092a96L31P9k99N1j11J20N3L86k83r1p2L74k79r2J60p2M1o8j3k03J12j89L90
3115A29j88L51k94m3k42N1J08R0M8k48k5L50k29N9q2P3m8mK50O7j08l6p5o0K70
3140A64r5j90n0J54j18L61R2m18j16L20m85L74K88n69J62n1K5K03oj04l09K30
3162a38K58J39l94J72r0J44J31j32q8N6J99l04K58J72o53J62J2j59L95j69l00
3183c29r4K81K73j66L4j35k15K57J29pl89O04k63j57K87m8O5j64J55lR3j32J11
3206A87m56m3L72l5k11L74l22p4L89k29l05N26j47m75J32M27o0n6K70m74J64J20
$$ plain form
3228 74 159 -30 61 102 -361 184 351 168 -28 103 103 51 240 358 -81 -387 145 8 -28 -31 -198 -257 -120 257
3252 257 -127 -522 217 -296 -355 81 -87 30 237 196 -6 180 236 -32 314 2 78 -113 70 100 74 39
3274 39 -48 -76 -15 10 -196 -312 157 -61 19 57 -297 -213 -62 203 -55 -272 -226 -191 190 400 49 -329 -19
3297 -19 -54 -39 223 373 -113 -348 -57 115 207 89 -137 -168 -13 125 -52 -187 87 -150 -199 127 249 53
3319 53 -18 22 72 -256 135 -128 -228 165 -4 37 -32 -121 190 21 -78 -89 191 41 -117 35 -20 -18 -175 38
3343 38 -236 -40 117 -103 -42 -358 -105 -88 121 87 286 -241 148 -145 317 189 225 99 -191 82 121 224
3365 224 251 112 -69 87 204 300 33 -26 -14 -19 -223 137 -50 -248 -51 -161 -220 66 -132 -112 -83 -28 -213
3388 -213 -153 355 67 -194 158 183 -50 455 163 -100 -94 -60 -96 4 -161 -131 -141 13 116 69 -317 -28 -405
$$ packed form
3228G4Q5j89R1M1m63N45J67j83j96J31%n2J89J18m39l06N32j37l6lj67n9J37L77
3252B57l84l95P39n13n9M36j68J17K07m1k02J86N6k68L46l12P6j91J83L0k6l5
3274C9q7k8O1K5k06j16M69k18Q0L8l54Q4J51K65k58k17M6L5L81K10l51l78L10
3297a9l5J5K62J50m86k35K91J72R2j18k26l1J55J38j77j35K74k37m9L26J22j96
3319E3p1M0N0l28L91k63j00L93j69M1o9q9L11j69r9j1K80j50j58J52n5Kj57K13
3343C8k74J96J57k20O1l16K53J7K09l4J99n27L89k93M62j28L6j26k90K73L9J03
3365B24K7j39j81J56J17R6k67n9J2nk04L60j87j98J97j10n9K86j98K0K9N5j85
3388b13O0N08k88k61L52K5k33N05k92k63OL4l6J00j65L0j0J54J03m7l86K89l77
$$ plain form
3411 -405 -283 -29 105 -368 -87 277 79 -59 -196 -176 30 98 182 184 -291 5 221 39 230 -90 -175 -49
3433 -49 43 257 -14 180 -244 -330 42 284 -82 -310 -225 -246 172 -11 -232 -150 -13 -375 -16 157 161 -95 36
3456 36 93 252 -35 260 501 187 -3 389 -27 103 288 245 -228 -267 -260 -100 67 -112 -39 -233 -34 -153
3478 -153 -166 -205 -228 -156 -109 100 1 -121 -145 293 96 169 146 32 -49 336 215 264 132 -88 86 309 400 31
3502 31 -263 -4 261 159 228 -227 -58 22 104 34 -1 -152 55 -272 65 75 -57 109 51 -155 21 458 30
3525 30 257 135 -132 127 200 8 -195 -281 -150 122 -9 158 -25 -132 -134 -112 -130 113 -115 -304 -406 -6
3547 -6 24 -151 37 -237 18 83 255 43 254 206 48 105 248 172 -85 -110 -135 148 -8 -189 81 -222 -131
3570 -131 83 -123 -127 125 -121 -179 299 -258 -8 -71 -132 -156 120 -13 -140 299 -42 160 222 238 -116 -155 -29
$$ packed form
3411d05J22K54J34m73K81L64j98j38j37K0K06O8Q4Km75K96K16j82J91l20q5J26
3433d9R2K14k71J94m24q6L72K42l66k28Q5k1M18j83k21Q2J37l62L59J73Mk56J31
3456C6N7J59k87K95K41l14j90L92m16J30J85m3m73l9PJ60J67j79P3j94J99j19
3478a53j3l9k3P2M7K09r9j22k4M38j97P3k3j14q1L85j21M9j32k20J74K23R1l69
3502C1k94K59K65j02O9m55J69Q0Q2p0l5j51K07l27L37J0j32J66n8k06J76M37m28
3525C0K27j22k67K59P3j92k03q6J31K72j31J67j83j07kK2j8K43k28j89j02M00
3547fL0j75J88k74K55O5J72k12K11m8j58N7J43p6k57k5k5K83j56j81K70l03R1
3570a31K14k06mK52k46n8M78n57K50o3o1k4K76j33j27M39l41K02O2J6l54l9J26
$$ plain form
3593 -29 -226 124 91 -71 -146 -239 -29 70 139 -130 -56 -670 89 262 -220 -22 -212 -107 63 106 -125 164 66
3616 66 34 -117 227 222 -144 -239 123 286 134 239 -307 -278 -23 326 -12 230 -91 -77 -119 138 -66 -199 -189
3639 -189 -185 -98 194 -81 -395 31 15 224 99 224 -66 33 -94 237 42 259 366 -53 -24 -11 244 -90
3661 -90 11 63 -4 287 16 -71 -205 -196 -216 -49 114 72 -161 -184 -92 -160 66 33 40 -26 283 59 287 151 235
3686 235 -177 235 397 -25 -117 103 -146 -3 -138 29 87 -124 -244 -265 110 -318 44 -101 -120 -170 -85 117
3708 117 12 -313 47 158 -42 221 200 -50 311 137 345 41 259 197 -92 122 5 133 -8 135 -76
3729 -76 60 252 96 -104 -361 86 -88 -153 129 -164 -337 -104 105 -40 -111 -125 -343 -78 -40 85 5 120
3751 120 -182 -155 321 -11 36 -312 -23 16 -12 39 -9 -22 104 -188 -106 -36 81 -299 120 50 -141 -62 -58 -94 -109
$$ packed form
3593b9j97L50l3j62p5r3K10R9O9k69P4o14P59J73m82J98j90J05J70M3k31K89r8
3616F6l2j51L44nl66r5L62J63j52J05n46K9K55L49l38K42l21J4m2K57k04j33J0
3639a89MQ7K92k75l14M26j6K09j25J25k90R9j27L31j95K17J07m19K9J3K55l34
3661i0J01N2o7K91k71q7j34Rk0J67J63m2k33k3R2o8K26l3Po6L09k24K28j36Q4
3686B35m12M12J62m22r2K20k49J43j35J67N8k11j20k1L75m28L62j45j9n0Q5K02
3708A17j05l25L60J11k00K63k1k50L61j74K08l04K18o2k89K14j17J28j41J43k11
3729g6J36J92j56k00k57M47j74o5K82k93j73K33K09j45p1j4k18K65L8J25q0J15
3751A20l02K7M76l32M7l48K89L9k8N1m8j3J26k92Q2P0J17l80M19p0j91P9Ml6j5
$$ plain form
3776 -109 -153 41 288 81 33 -41 275 94 -183 -107 123 156 -21 51 -142 -208 -75 157 -59 187 -108 -254
3798 -254 -233 66 -100 -66 -89 -124 -45 -48 340 -32 -47 -45 -29 345 364 192 -240 288 151 233 -80 174 150 76 78 257
3824 257 -114 243 15 -185 0 35 192 -37 12 132 -304 11 -83 -38 6 -77 -134 -37 158 153 41 -210 -46
3847 -46 9 122 385 -85 153 -62 16 95 -89 -187 -357 -25 35 -16 113 -199 -88 -2 -42 1 33 -243 97 -102
3871 -102 104 -16 38 -135 31 17 401 176 -203 -89 -150 314 89 19 72 -135 -181 9 -3 189 -34 130
3893 130 -421 135 -29 227 -50 -201 42 116 185 -20 -29 -86 -93 -69 -133 199 -84 -101 -89 -6 57 92 -10 -78 -169
3918 -169 55 25 149 -8 111 10 167 125 70 67 -75 -44 -161 -137 162 57 -8 -49 111 284 -2 -97 93
3941 93 -38 267 113 116 -24 -59 101 30 294 -61 8 116 -181 25 -51 -148 -40 -59 74 -55 -67 103 -225
$$ packed form
3776a09m4J94K47k07m8p4L16j81k77P6K30L3j77P2j93o6J33K32k16K46k95j46
3798b54K1K99j66L4k3l5P9lL88l72j5KJ6L74J9j72m32N28j37Q2l13K54k4p4KJ79
3824B57l71L57k28k00J85L5J57k29M9J20m36L15r4M5M4q3n7R7J95nj12k51J64
3847d6N5J13K63m70K38k15P8P9j84r8j70L32O0n1J29l12J11Q6m0M3L2k76L40j99
3871a02K06j20N4j73J66j4L84k25l79J14o1M64k25p0N3k07m6J90j2J92k23J64
3893A30n51N56j64K56k77j51K43P4O9k05rn7pK4o4L32k83j7J2Q3O3L5j02o8r1
3918a69K24l0J24j57J19j01J57m2n5lj42L1j17K4K99j05o5m1J60J73k86r5J90
3941I3j31L05j54Lj40l5J60p1K64l55O9J08k97K06p6r7J08j9J33j29j2J70l28
$$ plain form
3964 -225 -48 22 -117 -90 0 84 193 163 186 270 97 -323 7 40 259 110 -179 31 -129 84 273 171 39
3987 39 -305 -341 198 -13 -70 12 -13 -98 77 8 -129 -135 97 -357 78 246 100 105 147 100 49 24 111 72 124 134
4013 134 -179 -14 65 34 2 -208 241 -242 -34 -24 -106 -40 73 134 -171 -81 -13 -61 -137 -18 -577 -38 166 165
4037 165 -212 292 190 26 169 287 42 -34 55 36 -191 340 166 111 -86 -96 -88 73 175 -16 -39 -42 13 155
4061 155 56 -310 91 -149 -56 -177 83 113 95 -190 54 286 50 340 -30 -211 2 149 45 -147 62
4082 62 -354 -117 105 316 18 -271 141 -191 -173 113 -68 -160 -108 67 176 242 19 120 12 201 15 136
4104 136 115 28 79 35 -85 43 -44 58 208 -85 247 -83 -118 -67 -142 -55 -27 -95 -310 -220 -59 29 241 -269
4128 -269 -175 -244 103 86 -32 -172 -312 -176 76 -9 45 -125 77 81 124 85 99 -269 236 70 -242 -80 -5 203
$$ packed form
3964b25J77P0j39K7R0Q4J09l0K3Q4j73m20L30L3K19j49k89K10j60K13J89j02j32
3987C9l44l6N39k11n7Q2k5q5J75o9j37oK32m54M35J68j46NM2m7n1k5Q7l9N2J0
4013A34l13J65P9l1l2k10M49m83K08J0q2O6J13O1l05R0O8m8p6J19n59N39K04j
4037A65l77N04j02j64J43J18k45p6Q9j9k27N31j74n5j97j0QJ61J02j91k3lN5J42
4061A55r9l66M01k40R3j21K60L0j8k85K44K32k36K90l70j81K13J47j04j92K09
4082F2m16K37K22K11k98k89M12l32J8K86j81r2N2J75J09O6k23J01j08J89j86J21
4104A36k1q7N1m4j20J28q7J02J50k93L32l30l5N1p5Q7K8o8k15R0J61Q8K12n10
4128b69R4o9L47j7j18j40j40J36K52q5N4j70K02MM3l9J4l68N05j66l12J62P5K08
$$ plain form
4152 203 -58 185 66 -138 -81 -46 -45 -215 157 -121 365 193 48 -93 291 16 -28 14 530 184 -85 419
4174 419 142 -132 76 -90 17 73 118 -179 0 -32 109 142 -198 62 -168 13 -165 -53 -233 -80 34
4195 34 12 56 11 85 -187 -44 265 90 87 -53 43 -80 94 95 27 80 -238 -5 -183 -7 19 -190 -435 -142
4219 -142 -58 16 181 -74 -89 -7 -81 -164 133 -47 37 -95 233 7 52 -11 -27 123 35 121 13 -152 -62 -62 198
4244 198 242 168 209 11 213 -38 -119 -131 -57 292 13 79 -363 66 -109 120 -23 183 -27 -117 13 -82 -53
4267 -53 54 68 -90 -16 144 205 -27 -111 -60 10 -149 -126 87 -281 -105 -327 -113 -112 -182 -36 81 -85 164 190
4291 190 -18 179 -43 39 -238 -98 434 97 -124 -200 108 113 111 86 70 -132 -56 75 113 36 -118 -40 81 190
4315 190 78 90 -71 19 -106 46 131 -234 -206 -147 65 41 -37 189 99 293 125 57 -30 -57 35 181 268 -82
$$ packed form
4152B03k61K43j19k04N7L5Jj70L72k78M86j72j45j41L84k75m4M2N16l46k69N04
4174D19k77k74K08j66J07N6M5k97J79l2J41L3l40K60k30J81j78J12j80J53J14
4195C4k2M4m5P4k72J43L09j75lj40R6j23J74Jo8N3l18K33j78J76K6k09k45K93
4219a42Q4P4J65k55j5Q2p4q3K97j80Q4j32L28k26M5o3j6J50q8Q6j08j65R0%K60
4244A98M4p4M1j98K02k51q1j2P4L49k79O6m42M29j75K29j43K06k10r0J30r5K9
4267e3J07J4j58P4J60O1k32q4N1P0j59K3K13l68J76k22K14Jp0J46J17j66K49K6
4291A90k08J97k22Q2k77J40N32l37k21p6L08Nkk5j6k02P6J31L8p7j54P8J21J09
4315A90j12J2j61R0j25J52Q5l65K8N9K12k4p8K26r0J94j68o8q7k7R2J46Q7l50
$$ plain form
4339 -82 -58 -119 -27 298 61 1 46 -45 -42 -86 86 -36 50 -101 -119 43 25 61 2 78 45 -49 117 99 62 152 85
4366 85 63 78 156 78 -212 -74 -161 256 108 160 -354 -147 -31 167 -153 -140 62 90 150 159 -80 172 65 51
4390 51 42 -11 407 32 35 289 55 149 -96 28 -45 31 23 -191 131 93 64 -78 -233 4 -64 -21 -189 -153 -53
4415 -53 5 63 -136 -49 -15 -64 147 -182 77 18 87 234 112 46 -33 -200 -290 132 86 43 48 -98 -174 -101 36 312
4441 312 -8 -207 -125 -22 32 -179 -51 -123 -137 -54 -126 -259 -198 40 39 237 -136 94 -14 107 280 98 390
4464 390 -160 52 -8 108 82 312 -278 -118 24 91 72 -217 101 -58 -168 99 207 -164 107 -158 263
4485 263 136 25 47 80 -12 -16 -36 57 -68 299 51 -179 -194 -21 147 -48 13 133 145 111 -47 -57 -49 -125 -95
4510 -95 -202 52 -181 -356 169 -178 99 86 -213 -150 6 82 122 -332 95 62 -224 -86 9 -20 -100 121 90
$$ packed form
4339h2K4o1R2L25k37o0M5r1Lm4J72j22Q6j51j8J62j8L6n9P6l3r4J66j8l7R0o7
4366H5k2J5P8p8k90J38q7M17j48N2n14K07J16J98l20J3K02K8O0Rk39K52j07j4
4390E1rn3M18l75LK54k34R4k45J24p3P6qk14L22l8k9j42j55K37o8M3j68L6J00
4415e3N8N8j99Q7L4m9K11l29K59n9O9J47j22o6p9j67r0M22m6m3Nj46p6P3J37K76
4441C12l20j99Q2J03N4k11J28p2j4Q3p2j33O1K38jJ98l73K30j08J21J73j82K92
4464C90n50K12o0J16k6K30n90J60J42O7j9k89L18j59j10K67J08l71K71k65M21
4485B63j27j11K2L3r2mk0R3j25L67k48k30j5J73J68j95O1J20J2l4j58j0Qp6L0
4510i5j07K54k33j75N25l47K77j3k99O3J56P6M0m54M27l3k86J38R5k9q0K21l1
$$ plain form
4533 90 -13 -52 -40 65 -65 -91 -37 -163 -100 -346 -155 35 -203 148 142 18 -14 -184 176 -124 -55 -127 61 126
4557 126 -76 -143 -104 115 17 157 54 90 44 -4 32 -58 -59 -4 106 186 267 32 48 -248 -3 82 48 90 17 -17
4583 -17 -209 40 44 181 -79 38 98 57 20 -142 47 151 -147 262 -196 -169 -120 60 247 -70 -78 53 -65
4606 -65 200 -111 -188 -83 326 -55 -18 -141 -304 293 372 88 31 16 96 -230 56 95 14 224 49 182 161
4629 161 43 -151 -105 140 152 -75 187 -8 110 69 97 -19 -120 -159 116 -144 -21 10 222 -33 0 -42 25
4652 25 107 135 -108 -48 248 -30 177 -123 -139 -57 65 178 -77 59 -302 73 40 -11 60 -188 127 -446 109
4675 109 -98 -83 150 -18 258 191 145 221 -252 -173 -23 53 -17 107 -21 -44 149 -70 -101 -30 -203 -284 -183 23
4699 23 6 26 265 -125 159 -14 34 30 -221 26 -92 100 -230 -96 4 228 168 257 202 90 -42 90 33
$$ packed form
4533I0j03l9J2J05j30k6N4j26O3k46J91J90k38L51oj24l2j70L60l00O9p2J88O5
4557A26k02o7L9K19r8J40j03L6m6m8L6r0jN5J10Q0Q1k35J6k96K45Q5l4M2p3l4
4583a7j92K49MJ37k60J17O0m1l7j62J89J04k98M09m58K7M9J80J87l17qJ31j18
4606f5K65l11p7J05M09l81L7j23j63N97P9k84n7j5Q0l26K86L9q1K10j75J33k1
4629A61j18j94M6K45J2k27K62j95J18m1K8j16j01l9K75k60J23L1K12k55L3m2O7
4652B5Q2K8k43O0K96k78K07l00j6Q2J22J13k55J36l61L75l3n1P1k48L15n73N55
4675A09k07J5K33j68K76o7m6P6m73P9J50P6p0J24j28k3J93k19l1P1j73q1J01K06
4699B3j7K0K39l90K84j73M8mk51K47j18J92l30J34J00K24o0Q9n5j12j32J32n7
$$ plain form
4722 33 167 190 34 255 295 -141 131 36 -258 20 133 -88 55 -344 -80 -35 137 -66 320 70 -40 -173
4744 -173 87 55 -127 13 27 -46 110 -72 125 -203 5 -33 -24 -16 6 229 3 171 48 -173 -37 3 -293
4767 -293 -293 123 -133 48 52 -27 109 -80 -156 -2 -99 361 156 45 152 -59 76 72 20 155 79 -39 57 94
4791 94 217 182 81 -147 5 -114 172 -169 -268 21 -27 -135 227 -209 12 105 92 -206 236 84 -74 -98
4813 -98 174 -78 41 -234 85 -276 -174 120 108 -164 184 275 142 74 -78 197 -117 -62 -282 55 -120 207
4835 207 -151 23 -174 65 -6 22 -73 29 34 -58 -96 10 111 -93 -14 93 -177 50 23 87 -3 -94 -295 119
4859 119 59 -121 -186 -36 13 -41 152 186 43 184 -131 -239 167 -219 -159 169 85 45 -193 -125 137 96 72 229
4883 229 117 -23 98 342 -97 -119 -66 -258 -212 40 18 -25 -45 276 -100 49 39 -114 7 -23 -238 3 -121
$$ packed form
4722C3J34K3j56K21M0m36K72r5k94K78J13k21J43l99K64M5J72k03L86k50j10j33
4744a73K60l2j82J40J4p3J56j82J97l28K08l8RQK2K23k26J68j23k21J36M0k96
4767b93%M16k56J81Mp9J36j89p6J54r7M60k05j11J07k11J35mn2J35p6j18R6L7
4791I4J23l5j01k28J52j19K86l41r9K89m8j08L62m36K21R3j3k98M42j52j58k4
4813i8K72k52J19k75L19l61J02K94j2k72L48R1j33o8j52K75l14N5k20L37j75L27
4835B07l58J74j97K39p1K8r5J02Nr2l8J06J01k04P9J07k70K27k7O4r0r1k01M14
4859A19o0j80o5J50M9n4J93L4j43J41l15j08M06l86O0L28q4m0k38O8K62m1k4J57
4883B29j12j40J21K44m39k2N3j92M6K52k2m3k0L21l76J49j0j53J21l0k15K41j24
$$ plain form
4906 -121 10 -157 -55 36 191 -180 -92 -3 89 106 205 -18 21 463 -5 -183 -205 159 54 -433 -204 -105 -9
4929 -9 -50 -13 -122 77 167 -31 129 -83 56 333 47 -127 -204 175 174 61 30 170 -3 175 22 74 177
4952 177 128 -23 146 -71 -33 68 8 -47 -6 103 -253 186 -63 151 -72 -80 251 146 64 74 -130 37 -33
4975 -33 155 -105 -126 -20 -198 115 77 129 -98 -2 -159 -83 44 -143 82 -12 96 -89 13 117 -181 -25
4997 -25 -190 108 8 127 -176 -601 -87 -26 15 -8 142 79 -131 -93 22 89 133 192 93 -179 -58 31 -85 -147
5021 -147 148 -45 -78 -43 131 -294 142 187 -152 -62 -210 422 -140 18 63 241 -87 -30 341 -11 91 271
5043 271 54 145 -181 156 148 -48 -64 152 156 100 139 -253 -251 -30 112 11 114 -149 -70 -79 -128 82 41 48 -198 -16
5069 -16 -143 70 140 3 208 -148 -21 308 244 -104 77 75 338 -12 -270 9 -37 111 76 63 233 -201 -141
$$ packed form
4906a21J31j67J02R1J55l71Q8Q9R2J7R9k23L9M42m68j78k2L64j05m87K29R9R6
4929im1L7j09J99R0j98J60k12J39K77k86j74p7L79jj13l1J40j73J78j53N2J03
4952A77m9j51J69k17L8J01o0n5M1J09l56M39k49K14k23qL31j05q2J0k04J67p0
4975c3J88k60k1J06j78L13l8N2k27R6j57P6J27j87K25r4J08j85J02J04k98J56
4997b5j65K98j00J19l03m25N14O1M1k3J50o3k10L8J15O7M4N9r9k72J21Q9j16o2
5021a47K95j93l3L5J74m25M36M5l39R0j48O32n62J58M5J78l28N7L71l52J02J80
5043B71k17R1l26L37qj96j6K16Mn6L9l92KK21J42j01J03k63P9rm9K10m1Pk46J82
5069a6j27K13P0j37K05l56J27L29o4l48J81kK63l50k58K79m6J48l5j3J70m34O0
$$ plain form
5092 -141 138 -51 -192 204 -78 -119 -33 193 -257 -41 -257 -219 -184 118 -13 49 226 -49 -106 -105 -98 -74 -128 -49
5116 -49 98 -3 308 32 125 68 179 -155 -73 13 -135 -17 -115 148 -169 170 -75 -66 12 17 -108 60 -109 -154
5140 -154 57 -196 1 -84 -22 -61 51 -120 -67 88 88 -241 -26 -1 -53 -215 116 -122 -169 -34 -108 76 -336
5163 -336 35 -5 -229 -88 136 161 1 -67 52 235 4 -283 112 -132 209 5 -116 37 -5 196 -120
5184 -120 223 -57 -216 71 -144 0 -64 -1 -32 -147 277 -33 -176 46 -119 -134 294 -53 34 -53 223 -172
5206 -172 196 15 102 -142 170 116 1 123 24 -231 -180 -135 -172 83 19 -40 -250 90 -104 -236 -77 -195 167
5229 167 169 -84 18 150 140 73 6 49 239 -74 114 -11 -104 87 154 171 -28 90 -36 149 -13 144 -77
5252 -77 77 -100 -125 96 -6 -36 53 -47 -410 -79 -97 -185 20 127 -125 106 -167 -91 -190 25 149 28 176
$$ packed form
5092a41K79j89j41L96k82m1Q6K26m50K16k16L8L5L02j31O2J77k75n7JPK4n4P9
5116d9J47j01L11k76R3n7J11l34Q2Q6j48J18r8K63l17L39k45RP8Nj25J68j69m5
5140a54K11k53J97q5O2l9J12j71N3J55%l29K15K5n2j62L31k38m7J35p4J84m12
5163c36L71m0k24J41K24K5j60o8J19J83k31k87L95k44L41k04j21J53m2K01l16
5184a20L43k80j59K87k15J44o4O3l1j15M24l10j43K22j65j5M28l47Q7q7K76l95
5206a72L68j81Q7k44L12n4j15J22r9k55N1M5l7K55o4n9k10L40j94j32J59j18L62
5229A67Kk53J02J32j0o7o7M3J90l13J88j25r3J91O7J7j99J18j26J85j62J57k21
5252g7J54j77k5K21j02l0Q9j00l63L31j8q8K05J07k52K31k73P6r9K15J24j21J48
$$ plain form
5275 176 -80 259 -127 -98 131 142 -140 1 -53 -55 -139 121 86 71 -134 -52 49 -8 -150 -106 -222 -115 -263 -34
5299 -34 180 131 -97 -5 -152 -124 26 60 18 157 106 -66 -339 121 237 -73 -268 252 64 -182 356 -85
5321 -85 -50 -123 243 -320 -35 -167 -206 85 227 21 -125 -55 156 110 -216 19 244 13 -213 -32 -148 -150 -117
5344 -117 35 185 -125 -131 186 -46 -5 -99 -139 86 -32 55 25 -189 78 -45 23 118 104 -76 -111 -114 -25 92 -142
5369 -142 85 -64 118 383 125 -225 -9 58 188 32 -31 136 155 -157 -71 59 53 -110 -147 282 -34 19 271
5392 271 48 -17 5 82 88 -28 55 -197 -3 1 -12 165 59 -142 -49 -161 -47 -117 92 -98 110 59 102 75 -65
5417 -65 -138 59 296 -110 -87 -77 -147 80 -124 -236 248 -154 -55 -89 97 -165 -7 -73 207 191 84 -118 138
5440 138 -80 108 61 -44 -32 46 109 -111 -19 110 -181 -56 94 -63 39 96 -33 -279 13 233 94 -65
$$ packed form
5275A76k56L39l86K9K29J1k82J41n4kq4K60l5j5k05Q2J01n7j42M4j16J07j48K29
5299c4K14m9k28R2j47K8J50L4m2J39n1j72k73M60J16l10j95N20j88k46N38m41
5321h5L5p3L66n63K85j32l9K91J42k06j46P0K11m6l26K35K25k31k26J81j16kL3
5344a17J52J50l10oL17k32M1r4m0K25j18Q7l0k14K67j23O8R5j4j80l5lQ9J17k34
5369a42K27j49J82K65k58l50K16O7J30j56o3J67J9l12Q6J30oj63l7M29l16N3K52
5392B71k23o5K2P7Oj16Q3k52J94Mj3J77j06k01R3j12J14p0K09j90K08n1M3k7j40
5417f5p3J97K37m06K3J0p0K27k04j12M84m02R9l4J86k62J58o6K80j6j07k02K56
5440A38k18J88m7j05J2P8O3k20R2J29k91J25J50j57J02N7j29k46K92K20j39j59
$$ plain form
5462 -65 133 -355 213 21 77 -69 -306 -140 -56 41 -72 11 -47 99 42 44 153 -173 100 -159 -105 -9 -239 -140
5486 -140 87 -171 -57 -34 -90 -16 177 -22 -124 45 -65 14 -95 25 -29 -7 185 190 127 -206 -4 -160 -277
5509 -277 -18 50 -74 30 111 -67 -116 -102 -260 -40 188 -37 -39 -135 181 1 188 68 -49 45 -54 -85 2 96
5533 96 15 166 -347 -40 57 71 -199 -17 211 -75 71 119 143 9 7 142 112 57 -141 57 32 109 -61 178
5557 178 3 -123 98 -100 164 222 57 6 82 63 250 33 36 65 -2 33 -125 55 90 45 -106 55 -107 -180
5581 -180 -116 -147 31 50 -31 9 129 230 -230 51 170 86 28 129 -160 -48 165 147 -217 82 -192 88 134
5604 134 78 -187 -84 -89 -77 109 -73 76 -318 60 199 -52 -22 94 -34 108 -10 191 -51 39 53 -47
5626 -47 282 -87 -37 -51 -177 -46 -161 132 28 53 225 -40 46 57 -181 60 59 -53 -159 -305 42 266 197
$$ packed form
5462f5J98m88N68j92N6j46k37J66Q4R7j13Q3n8J46n7KJ09l26K73k59N4R6k30R9
5486a40K27k58J14K3n6P4J93j99j02J69j10P9j09J20n4K2J92No3l33K02j56j17
5509b77K59O8j24J04Q1j78m9J4j58K20K28k25kr6L16j80J87j20j17R4r9l1Q7R4
5533I6q1J51n13L07R7J4k70J82K28k86J46M8K4j34kJ35l0n5j98J98k5P7j70K39
5557A78j75j26K21j98K64N8j65n1P6j9J87k17LK9o7L5j58J80L5m5j51J61j62p3
5581a80O4l1J78J9q1M0J20J01m60K81J19q4n8J01k89J12K13j8l64K99k74K80M6
5604A34n6k65J03nJ2J86j82J49l94L78J39k51L0J16j28J42j18K01k42R0J4j00
5626d7L29l69N0j4j26J31j15K93j04K5J72k65Q6J1k38K41jj12j06j46L47K24o9
$$ plain form
5649 197 -121 -116 239 174 -50 53 245 -14 187 -136 269 265 -24 -21 125 15 277 -23 146 -202 -64 -210
5671 -210 -48 213 213 104 162 -109 62 12 280 130 274 199 22 -258 -18 -85 146 128 -225 -52 358 31
5693 31 -95 166 127 20 -82 138 -62 55 59 -115 238 -139 -35 108 104 15 -156 66 252 349 109 -83 29
5716 29 125 -70 131 -80 191 -165 178 56 -99 -111 226 152 278 -211 -206 58 53 -60 91 -57 -291 -163 -142
5739 -142 -207 -139 -5 -35 -93 61 28 -56 154 95 178 -20 209 -100 66 -2 186 105 13 -88 -50 80 -13 -41 -200
5764 -200 -33 -143 7 261 188 -110 73 36 -195 115 53 -60 112 471 -17 -71 52 -118 -72 215 -50 68
5786 68 -130 -57 -39 250 -139 35 -10 -69 66 139 92 -59 -73 111 -189 -100 145 76 308 -128 -238 -117 -48 3
5810 3 -42 128 224 -253 45 -21 65 139 73 -130 8 -58 63 -445 250 212 -152 21 80 44 -78 -95 -174 -83 -209
$$ packed form
5649A97l18NL55o5k24J03J92k59K01l23M05mk89LJ46j10K62l00J69l48J38j46
5671b10J62K61%j09N8k71J71n0K68j50J44p5j77k80K40o7K31j8l53J73M10l27
5693C1j26K61l9j07j02K20k00J17Mj74L53l77J04J43mq9j71K22J86R7k40j92J12
5716B9R6j95K01k11K71l56L43j22j55j2L37p4J26m89NK64nj13J51j48k34J28K1
5739a42o5O8J34l0n8J54l3q4K10n9Q3j98K29l09J66o8J88q1r2j01L8J30r3k8j59
5764b00J67j10J50K54p3k98J83l7k31L10o2j13J72L59m88n4J23j70M6K87k65J18
5786F8j98P3J8K89l89J74m5n9J35P3m7j51j4J84l00Q9K45o9K32m36j10J21O9N1
5810Cm5J70R6m77K98o6Q6P4o6k03J38o6J21n08O95l8l64J73N9l6j22j7p9R1j26
$$ plain form
5835 -209 -160 -155 137 -98 13 115 37 143 181 -16 -90 81 -91 -41 -91 -179 168 -30 -157 144 32 -58 -19 -26
5859 -26 -74 70 30 97 -206 -31 36 -83 -64 -194 -152 1 -138 166 -115 18 105 -220 121 22 -3 44 23 -5
5883 -5 91 272 177 125 152 -123 32 -9 -76 -171 -74 46 -373 368 50 65 -28 -304 -104 -59 32 36 -356 27 88 145
5909 145 -76 -192 -166 -115 -107 180 229 257 17 80 72 171 69 51 46 -25 -172 58 81 99 86 61 -109 232 280 -190
5935 -190 -50 10 -68 125 -71 121 -125 -45 207 151 131 -86 107 -120 255 16 203 -66 91 104 103 186 -89
5958 -89 -87 -255 86 124 106 -31 -209 8 -181 21 0 -207 -54 129 -51 -23 208 -166 -99 -16 -40 5 -58 -55 -73
5983 -73 -193 238 95 -247 -155 -113 -116 184 28 43 -137 115 83 144 208 113 -122 -70 69 42 -39 -123 -141 9 -51
6008 -51 27 -92 48 96 -76 2 233 -107 -25 -71 135 -299 137 56 -126 33 -114 55 -76 -99 43 123 50
$$ packed form
5835b09M9NK92k35J11J02p8J06L8j97p4J71j72N0n0q8L47j98j27L01j12r0L9p
5859b6m8J44m0O7l03J75O7j19J9j30M2J53j39L04k81J33Q7l25L41r9k5M7k1k8
5883eR6J81r5n2K7k75J55m1o7r5R7J20m19P41l18J5r3k76K00M5R1Ml92L83O1N7
5909A45k21j16K6N1QK87M9K8k40O3qR9j02j8np1j47K30K3J8j3k5j70L41M8m70
5935a90J40O0p8J93j96J92k46Q0K52n6k0k17J93k27L75k39J87k69J57J3jQ3k75
5958h9Kj68L41L8j8j37j78K17j89K02k1k07J53J83j80K8K31l74O7Q3k4M5o3Lj8
5983g3j20M31j43l42R2M2lL00j56J5j80K52l2O1O4r5k35N2J39k7q1q4j8J50o0
6008e1P8j19J40M8j72P8K31l40Q2m6K06m34M36q1j82J59j47J69j31k3J42Q0p3
$$ plain form
6031 50 -10 90 34 0 -187 -134 0 -86 -228 66 -18 -38 430 -19 67 202 -25 -83 -192 38 235 4 14 -130
6055 -130 -125 -112 -2 72 284 12 247 -162 -65 16 19 58 57 206 -131 79 -65 -164 -158 106 -17 -26 251 -133 -19
6080 -19 -309 31 -199 -162 9 -117 98 18 -33 97 -59 -17 -50 -85 79 -236 -9 -73 46 -243 -53 185 -124
6103 -124 -128 -241 78 318 -69 -159 -194 -4 -73 51 1 -237 172 -3 0 133 -21 -207 -18 -239 62 67 -64
6126 -64 48 -50 -37 -4 206 -46 67 190 41 -102 -20 -88 319 44 -235 -205 -77 -49 -53 -137 82 -165 -115 91
6150 91 125 140 -52 -148 20 24 -6 -21 -27 48 -139 -116 61 138 -59 -60 107 -147 119 125 -65 -6 151 149 -57 68 122
6177 122 -118 -60 -70 -93 108 -42 -120 -33 231 1 -145 36 283 65 -263 48 151 -108 -92 -64 -353 -80
6199 -80 51 23 58 -137 27 292 -193 -269 165 -30 -187 -41 109 66 -63 147 173 58 -223 -215 147 -316 -16
$$ packed form
6031E0o0J00n6l4j87N3J34q6j42K94q4k0M68m49Q6J35k27n8j09K30J97k31J0j44
6055a30NJ3J10P4K12k72K35m09R7Q1LL9jJ49l37K10j44r9OK64j23rK77l84J14
6080a9k90L40k30L7J71j26K15q0n1J30j56M2l3l5J64l15K27o4J19k89J90K38l09
6103a24mj13L19K40l87r0l5J90o9J24n0k38M09j75LJ33j54j86J89k21L01Nj31
6126f4J12r8J3L3K10k52J13J23j49j43Q2o8M07k75k79L0J28K8mq4K19k47N0K06
6150I1L4J5j92r6J68Ml0j5oP5j87K3J77P7j97jJ67k54K66Oj90N9J57kk06J25N4
6177A22k40N8j0k3K01j50p8Q7K64k30j46J81K47k18l28L11J03k59J6K8k89K73
6199h0J31k8L5j95J64K65m85p6M34j95j57J46J50m3j29K10K6j15k81QL62m63L00
$$ plain form
6222 -16 56 -35 80 101 -108 186 -168 -15 -165 135 -105 74 -206 -122 19 -129 127 5 -31 -93 -225 154
6244 154 43 183 92 82 66 18 146 44 13 -269 -115 188 -174 258 20 -97 98 19 -234 -48 -160 53
6266 53 -136 -125 168 60 1 212 -3 140 -25 -213 -237 116 204 -36 212 -40 -127 -166 -126 -102 -41 -314 -34
6289 -34 -78 -201 -2 40 -22 -329 -19 64 -144 131 -245 149 -216 -148 100 61 284 191 -87 -33 -167 142 -100
6312 -100 -284 -35 -372 -25 158 151 -155 -163 37 16 48 -192 -280 20 66 -102 -228 145 -8 -119 -135 -95 25
6335 25 82 -80 -106 51 -95 135 -79 -115 -281 100 -207 -94 131 74 -87 -132 28 -271 70 -234 -23 140
6357 140 5 -98 14 104 -112 6 22 284 23 26 -154 -75 173 -88 158 -46 -52 -41 103 -231 25 110 87
6380 87 66 -70 373 -63 -102 -67 -42 -204 -43 5 165 9 5 -79 -83 59 219 -129 240 119 -95 -220 11 -303
$$ packed form
6222a6P2r1J15K1k09K94l54J53j50L00k40J79k80Q4J41j48K56j22l6o2j32L79
6244A54j11J40r1j0j6m8J28j02l1k82J54L03l62M32k38j17J95p9k53J86j12K13
6266E3j89J1K93j08n9K11k15J43j65j88k4L53Q8k40K48k52q7l9M0K4O1k73K80
6289c4m4j23J99M2o2l07L10Q3k08K75l76L94l65O8K48l9K23r3k78N4j34L09k42
6312a00j84K49l37L47J83pl06qK00k1L2k40q8L00M6j68j26L73j53j11j6M0J20
6335B5N7j62k6J57j46K30k14l6j66L81l07J13K25n7j61m5J60k99L41l04K11J63
6357A40j35j03J12R0k16J18J6K62k61Lj80P9K48k61K46k04oJ1J44l34K56Q5k3
6380H7k1j36M43m36l9L5K5j62J61M8J60j56mq4mJ42J60l48L69j21k14j25K31l14
$$ plain form
6404 -303 -344 176 29 -81 54 34 63 348 -123 -67 -118 -304 39 -130 195 -69 -28 -191 171 -35 75 -42
6426 -42 -15 -128 91 -40 -388 103 20 75 -42 62 55 5 -130 -143 151 144 23 -80 20 32 -242 -8 -78 -28
6450 -28 -202 81 -250 94 133 -127 -204 -46 -177 22 67 62 129 155 25 216 23 -45 -107 64 -132 -5 75 -16
6474 -16 241 -161 203 -93 -166 -40 -46 -195 -26 293 -23 -30 -140 227 55 -198 41 -213 -58 77 137 54 50
6497 50 31 -47 -74 42 45 24 292 19 199 -6 -27 30 -164 -53 108 16 -136 -149 25 80 -29 -149 -315 165
6521 165 -293 30 42 -76 32 117 -195 -221 -34 -128 147 -69 19 223 199 98 -101 -148 84 -140 58 233
6543 233 -66 61 -136 -204 -60 -80 -47 273 -169 -136 -301 96 96 205 -15 37 30 179 88 14 185 -38 60 -214
6567 -214 -152 126 -102 113 -155 -176 -80 -53 -63 -238 -258 150 -93 -447 -118 109 -155 242 -74 53 97 -19
$$ packed form
6404c03m1N20j47j10J35k0K9K85m71N6n1j86L43j69L25k64M1j63L62k06J10j17
6426d2K7j13K19j31l48M91q3N5j17J04pn0j35j3K94pj21j03J00J2k74K34p0N0
6450b8j74K83l31L44L9k60p7J58j31J99M5nO7K6j30J91j93o8o2J71j96J27Q0r1
6474a6K57m02L64k96p3J26oj49J69L19l16pj10L67j72k53K39k54J55J35O0q3m
6497E0j9p8k7J16Lk1K68k73J80k05k1N7j94J11J61r2j52j3J74N5j09j20j66M80
6521A65m58L23J2j18J08Q5l12k6J87r4K75k16Q8K04k4j01j99m7K32k24J98J75
6543B33k99J27j97o8J44k0L3L20m42L3j65L97%J09k20N2pJ49r1p4J71k23R8k74
6567b14O2K78k28K15k68k1R6K7j0j75k0M08k43l54L29K27k64L97l16J27M4j16
$$ plain form
6589 -19 -175 -46 127 -22 232 -104 85 -100 -93 -89 222 -205 21 -107 -302 -89 -219 107 10 -202 -120 156
6611 156 -67 -62 118 -37 41 35 156 -38 -103 73 39 7 -151 -24 -29 13 159 49 392 49 70 108 140 231 250
6636 250 -7 -132 -81 -96 -129 145 72 -120 128 5 49 102 80 206 9 180 -11 19 239 60 -7 216 108
6659 108 57 198 -83 -51 124 -59 33 -172 116 266 -34 -7 76 -101 20 77 -176 20 188 -128 41 -78
6681 -78 -139 -31 -242 -74 110 -31 61 -234 -272 34 -120 57 18 64 -15 -63 -224 191 44 76 -284 -146 65
6704 65 53 133 -230 0 39 72 46 10 -153 -7 -230 -16 -149 -198 165 -331 -139 120 44 -106 1 -31 22 -268
6728 -268 -22 25 -83 104 224 91 -98 8 -43 -113 -91 -127 -132 2 -53 34 48 -76 22 33 70 7 73 145 115 251
6754 251 192 -18 -32 271 73 91 -233 315 38 -195 -87 122 -12 -7 -48 30 86 -179 87 -119 61 -83 -18
$$ packed form
6589a9j56J29J73j49K54l36J89j85PML11m27K26j28j95K13j30L26r7k12Q2K76
6611A56k23NJ80j55P8oJ21j94o5J76l4l2j58J27nM2J46j10L43l43K1L8L2R1J9
6636B50k57j25N1j5l3K74p3j92K48j23M4N3k2J26j97J71j91L0K20j79o7K23j08
6659A08n1J41k81L2J75j83R2k05K88J50l00K7Q3j77J21N7k53J96J68l16J69j19
6681g8o1J08k11J68J84j41R2k95l8L06j54J77l9M6p9m8j61M15j47L2l60J38K11
6704F5j2Q0l63K30L9L3k6l6j63J46k23K14j33m9L63m96J92K59p6j50J07l2N3k90
6728b68K46M7j08J87J20j33j89J06n1p0K2l6nJ34n5Q7J4j24R8J1L7o3O6P2l0J36
6754B51n9k10j4L03j98J8l24N48k77k33J08K09j34Nm1P8N6k65K66k06J80j44O5
$$ plain form
6777 -18 121 99 -121 -227 -18 -106 -122 31 -16 -41 -101 -76 93 85 77 166 -121 -97 -141 -277 -89 123 -100 -115 -283
6802 -283 -129 -19 73 -3 74 -8 8 53 361 309 -106 5 251 73 -121 30 -67 50 -111 -58 -101 215 46
6825 46 -71 155 -65 -179 -50 -3 -129 141 58 217 -102 -223 -160 -131 -87 -134 -106 -139 281 -26 -37 147 44
6848 44 -87 90 -106 22 -85 -18 152 -217 214 121 67 55 189 242 -108 -65 31 -247 -185 162 -7 98 -252
6871 -252 -84 -174 -108 30 -19 -132 20 132 298 -3 -122 5 -242 139 -21 60 -48 -19 22 73 -22 -87 -76
6894 -76 -104 -150 -54 181 56 131 -118 42 -2 89 115 -63 -70 -50 -185 13 -116 116 55 -160 283 -55 -131 23
6918 23 145 47 161 -410 -72 -7 -163 -41 145 37 -10 -52 321 95 -8 194 -143 8 -47 -26 61 59 -133
6941 -133 -4 -107 138 155 182 -151 -26 2 161 94 184 -106 131 8 -502 -10 -118 10 -24 -70 24 -60 152
$$ packed form
6777a8J39k2k20j06K09q8j6J53m7k5o0K5J69qqQ9k87K4m4j36J88K12k23j5j68
6802b83J54J10R2p6P7q2J6M5L08n2m15J11K46j78j94J51r7J17j61N3m3L16j69
6825D6j17K26k20j14J29M7j26K70q3J59l19j21O3K9M4m7K8l3M20l07j1J84j03
6848D4j31J77j96J28j07O7J70l69M31r3n4j2J34N3l50M3R6k78O2L47j69J05l50
6871b52J68r0O6J38m9j13J52J12J66l01j19J27k47L81j60Q1j08K9M1N1r5o5J1
6894g6k8m6R6K35j25P5k49J60m4R1K6j78pK0j35J98j29K32o1k15M43l38p6J54
6918B3J22r8J14n71L38O5j56J22J86j08m7m2L73k26j03K02l37J51n5K1Q7kj92
6941a33J29j03K45J7K7l33J25K8J59o7R0k90K37j23n10M92j08J28l4m6R4q4K12
$$ plain form
6964 152 235 188 -96 -46 137 -132 236 -143 53 -84 -5 186 -20 -103 91 44 4 -120 -49 -66 41 -101 132
6987 132 -16 -123 7 -266 -130 47 -5 73 -180 19 -213 30 -86 -222 -181 -90 -60 -296 24 -196 -26 282
7009 282 -277 14 -191 -41 181 26 -138 -31 84 247 -51 -64 197 -184 182 73 8 -18 53 129 334 110
7031 110 -224 104 44 217 -133 -15 54 -185 -77 -54 84 210 -86 99 163 -29 -55 18 -183 196 -34 31
7053 31 1 17 -45 -139 30 -196 -114 -343 148 62 7 98 93 -59 47 126 -128 -136 -58 -143 143 139 126 -43 113 71 -39
7080 -39 -104 100 209 -154 -54 40 49 -151 43 209 -29 -35 102 -273 -152 -118 57 61 72 -129 61 -278 -116 102
7104 102 -10 -242 -243 14 89 200 35 50 177 -332 173 135 -190 23 76 -30 217 20 -82 81 -13 -111 -166
7127 -166 153 -312 -145 -82 68 228 -57 100 30 -28 115 38 2 31 44 -225 207 -118 18 99 21 48 130 49
$$ packed form
6964A52Q3m7k84N0J83k69L68l79J96j37P9J91k06q3J94m7m0j24P1j7J07j42K33
6987A32j48j07J30k73J36J77n2P8k53J99k32K43j16j36M1R1L0k36L20k20J70L08
7009B82n59K91k05J50K22j55j64J07J15J63k98j3K61l81L66j09o5k6P1P6K05k24
7031A10l34L28o0J73l50J18O9k39J08K3J38J26k96J85O4j92k6P3k01L79k30O5
7053C1l0J6o2r4J69k26Q2k29M91q6n5R1nj52J06P9k54qP8q5K86mj3j69J56m2j10
7080c9o5K04J09l63J00R4Rk00J94J66k38oJ37l75J21L4J75MJ1k01J90l39J62K18
7104A02j12k32jK57P5J11j65J5J27n09N05l8l25K13N3j06K47j97j02J63r4r8n5
7127a66L19m65J67O3J50J60k85J57p0n8J43p7l6K9J3k69M32l25J36Q1p8K7Q2q1
$$ plain form
7151 49 75 36 -29 55 -11 230 299 -123 56 -22 122 46 97 -195 -40 -78 -119 287 69 51 -7 -55 -35 101 8 138
7177 138 114 90 25 23 353 -182 90 114 187 -58 -1 -44 -45 47 -221 -95 54 -87 63 120 -100 -150 -147 -100 -48 131
7203 131 209 -240 69 -124 127 177 242 46 149 -27 -160 31 -64 173 125 138 -20 -46 200 -115 -76 197 -35
7226 -35 94 -143 -119 -129 -41 -119 27 -123 -258 212 108 117 -30 192 -80 230 14 -38 345 -67 -155 -159 301 65
7250 65 26 -188 -199 1 6 175 118 -21 242 95 -70 -65 -5 -311 62 104 -222 115 101 -69 93 -74 -39 -83
7274 -83 41 35 91 -168 26 16 -82 81 55 98 183 153 121 188 105 -266 11 -109 289 76 58 14 -94 115 -65
7299 -65 115 91 -24 200 -99 78 93 190 -138 61 -18 58 -54 -161 33 -124 -39 -168 -149 56 32 -188 7
7322 7 85 -2 20 -64 53 41 -44 -11 -71 -22 -44 -47 -23 51 -247 -78 -11 263 132 141 -33 -73 -94 67 9 36 249 159
$$ packed form
7151D9K6l9o5Q4o6K41O9m22J79p8J44p6N1k92J55l8m1M06k18j8n8m8K0J36r3J30
7177A38k4k4o5kL30n35K72K4P3k45N7m3jR2k68J26J49j41J50N7k20n0LM7N2J79
7203A31P8m49L09j93K51N0O5j96J03j76j33J91r5K37m8J3j58k6K46l15L9K73k32
7226c5J29k37K4j0Q8p8J46j50j35M70j04Rj47K22k72L10k16n2L83m12q8mM60k36
7250F5l9k14j1K00NJ69n7j39K63j47j65NO0l06L73M2l26L37j4j70J62j67L5m4
7274h3J24oN6k59J94j0r8J63k6M3Q5l0l2O7q3l71K77j20L98k13j8m4j08K09j80
7299f5J80k4j15K24k99J77J5R7l28J99p9P6j12j07J94j57Q5j29J9K05k4k20J95
7322GP8q7K2q4J17j2q5L3o0M9k2lK4P4k98J69O7K74j31Rj74m0k1J61n8K7K13r0
$$ plain form
7350 159 -18 110 73 278 16 147 -186 124 -15 97 162 -53 -57 6 148 -92 132 86 -128 -96 100 -18
7372 -18 -19 28 -44 -120 19 -222 -66 255 204 -76 -9 -55 -269 -66 46 98 68 2 -144 -131 32 -10 115 79 -33
7397 -33 10 140 124 -179 -21 -186 66 123 -147 -67 27 29 43 -129 -36 192 77 -6 56 -161 82 0 -24 146 43
7422 43 -36 99 -62 190 33 -93 -33 182 12 -23 6 48 -260 163 -28 -120 197 -62 -120 188 92 -21 79
7445 79 95 57 -86 23 35 138 -66 177 21 28 144 -127 -249 -165 143 -17 27 -208 72 293 -92 21 29
7468 29 1 -95 9 375 128 47 -92 73 95 53 81 -64 -149 -240 28 69 42 -155 -282 -160 108 1 11 -41
7492 -41 99 174 -3 1 -74 -81 77 -282 -154 162 87 -65 26 -91 106 -35 76 -16 -65 82 -22 177 -151 194
7516 194 114 -77 39 -54 -62 -344 175 -73 -167 -203 3 -4 154 -212 73 149 -138 288 -85 51 66 21 -40 -42 18
$$ packed form
7350A59j77J28l7K05k62J31l33L10j39J12O5k15mO3J42k40K24m6k14L2J96j18
7372a8jM7p2p6J39k41J56L21n1k80O7m6k14K03J12N2l0o6j46J3J63m2J25l6j12
7397c3M3J30j6l03J58j65K52N7k70Q0R4KJ4j72R3K28j15q3O2k17K43q2k4J70j03
7422D3p9J35j61K52j57j26O0K15j70l5K9M2l08M23j91r2L17k59n8L08r6j13J00
7445G9J6l8j43J09J2J03k04K43j56PJ16k71j22Q4L08j60M4k35K80K21l85J13Q
7468B9k8r6J04L66k47q1j39J65K2m2K8j45q5r1K68M1k7j97j27J22K68j07J0n2
7492d1J40P5j77Mp5pJ58l59J28L16p5j52R1j17J97j41J11r2m9J47j04J99l28L45
7516A94q0j91J16r3qk82N19k48r4l6K06pJ58l66K85P6k87M26l73J36J5m5o1kO0
$$ plain form
7541 18 132 -85 97 -14 31 6 -77 -199 -311 116 19 -60 -107 17 -3 302 50 -36 166 88 158 96 -116 -79
7565 -79 -204 61 -108 75 62 152 134 112 102 68 88 -46 -71 -7 113 -88 50 103 -112 106 -105 -166 36 132
7589 132 -17 11 28 178 262 309 -230 -143 -10 131 -204 42 90 -102 54 68 -237 197 -151 185 45 -210
7611 -210 62 -1 312 81 89 123 -23 -130 -66 167 -27 139 -132 185 109 -49 -190 -83 -108 -211 9 -142
7633 -142 -82 -165 -130 -94 -75 35 -83 -256 115 -115 -310 215 113 -137 -14 62 -151 99 -135 -185 152 105 -81
7656 -81 -63 -202 -19 -71 109 -33 1 117 134 188 20 25 82 -99 -119 -192 3 32 10 -57 188 122 -52 88 77
7681 77 -204 -293 100 65 -75 149 -32 -57 -262 -75 -164 238 181 62 20 -180 -60 -91 -145 -29 62 184 274 -51
7705 -51 -86 -67 55 81 12 227 221 180 -32 -28 -28 -5 165 -94 25 49 -64 -137 -78 -224 -13 -268 -1 -23 205 -38
$$ packed form
7541A8J14k17J82j11M5k5q3j22j12M27r7p9m7J24k0L05k52q6K02p8P0o2k12L7
7565g9j25K65j69J83j3R0j8k2j0l4K0j34k5O4J20k01J38N3k15K18k11o1K02R6
7589A32j49K8J7J50Q4M7n39Q7J33J41l35K46M8j92J56J4l05M34l48L36j40k55
7611b10K72o3L13k31QL4j46j07O4K33j94J66k71L17p6j58j41J07k5j03K20j51
7633a42O0q3L5L6J9J10j18j73L71k30j95N25j02k50J23P6k13K50k34n0L37m7j86
7656h1J8j39J83n2J80j42L4J16J7N4j68NN7j81k0p3J95K9k2o7K45o6j74J40j1
7681G7k81q9L93l5j40K24j81k5k05J87q9M02n7j19m2k00J20l1n4J16R1J22R0l25
7705e1l5J9J22K6o9K15om1k12M%K3J70k59J19K4j13p3N9j46K11k55K67k2K28k43
$$ plain form
7731 -38 -50 -52 129 232 90 170 156 181 -109 -75 109 84 196 -141 8 248 32 5 -211 -101 -12 83 -58 -37
7755 -37 -26 -101 175 48 116 -47 -198 197 40 -33 -116 241 65 -17 -1 -35 39 88 -27 255 37 -11 -15 192 -23
7780 -23 -89 34 95 45 -19 94 101 57 119 59 22 137 -47 50 95 -37 126 -32 -300 -55 92 -99 202 -77
7804 -77 -79 14 -59 72 -31 -113 -17 120 -18 46 -136 -61 -66 242 -276 -32 165 -259 198 11 51 -209 -35 -7
7828 -7 -26 159 130 38 -257 -133 -50 -46 52 -108 57 41 4 -68 -165 188 -53 -53 -46 -125 -74 -72 167 -157 -110 -42 36 -26
7856 -26 -11 39 114 42 -88 -21 -121 15 8 58 31 103 41 5 -30 -340 -80 18 63 -273 -41 361 126 96 -28 -186
7882 -186 -61 -157 -62 27 144 -32 -160 -52 78 -76 294 31 186 105 -114 -185 -69 -167 5 70 -11 401 156
7905 156 -119 -30 -162 174 66 122 55 -88 -66 25 36 -172 -113 -39 -79 48 71 206 124 5 -143 -90 -89 108 -130
$$ packed form
7731c8j2kJ81J03j42Q0j4K5k90L4J84k5J12l37J49K40k16k7k16J10Q9R5j41K1
7755c7J1p5K76j27O8j63j51L95j57p3q3L57j76q2J6l4P4M9j15K82k18m8mK07k15
7780b3o6J23O1n0o4J13Pm4O2o0l7J15j84R7M5j32J63j58k68K45J47j91L01k79
7804g7kR3p3J31j03q2R6J37j38O4j82P5nL08n18K44J97m24M57j87M0k60J74K8
7828gj9J85k9r2k95J24Q3MR8j60J65j6l7p2r7L53k41%Pp9N1KK39l24M7O8P8o2
7856b6J5N0P5p2j30O7j00J36pN0k7P2o2l6l5l10K60R8M5l36K32M02k35l0j24j58
7882a86J25r6R5Q9J17j76j28J08J30j54L70k63J55q1k19p1J16r8J72O5q1M12k45
7905A56k75Q9j32L36j08N6o7j43K2R1J1k08N9P4m0J27K3J35q2j19j48N3JJ97k38
$$ plain form
7930 -130 -99 376 -56 -159 -11 138 31 35 75 -141 204 -40 40 -146 -10 24 29 -175 79 63 30 -64 111 23
7954 23 87 36 178 89 127 6 125 -80 -28 -200 -24 -76 129 -38 8 21 -198 93 -34 -71 213 -237 104
7977 104 -263 -34 -165 26 200 -261 8 -60 333 95 83 -24 -105 46 -60 113 -46 -130 -124 11 -42 30 -98
8000 -98 -193 -2 145 57 194 190 186 -156 157 13 2 -45 256 404 -20 -100 154 -262 -43 -39 355 45 65 146 149
8025 149 67 255 133 -133 -132 -28 -163 -3 -89 67 -53 11 72 -252 -180 74 172 -4 -31 63 113 121 481 134
8049 134 -128 191 199 240 87 289 46 -115 -104 26 -59 3 -84 -37 25 -112 83 -140 -275 20 -10 -50 -58 -123 -155
8074 -155 -124 -118 -234 384 -145 36 22 -60 226 131 -196 93 44 37 12 -196 -233 -185 -7 -160 4 13 196 -32 -89
8099 -89 -116 142 -16 270 31 -45 -65 90 -95 220 17 -272 -149 -67 6 -18 299 -228 -213 102 334 -80 25
$$ packed form
7930a30L1M75m32j03J48J49j07MM0k16L45k44Q0j86J36L4Nk04K54j6l3r4J75q8
7954B3O4n1J42q9L8j21J19k05N2j72J76n2K05j67M6J3k19K91j27l7K84m50L41
7977A04l67K29j31J91J74m61K69o8L93k38j2j07q1J51j06J73j59q4OJ35n3P2j28
8000i8r5J91J47q8J37mml42L13j44j1m7L01J48m24q0K54m16K19ML94l10K0Q1L
8025A49q2J88j22k66JJ04j35J60q6J56j20O4O1l24P2K54R8j76k7R4N0QL60l47
8049A34k62L19QM1j53K02k43j61J1J30q5O2q7M7O2j37J95k23j35K95l0m0qo5l2
8074a55L1Oj16O18n29J81j4q2K86r5l27K89m9pk5k08l7M8J78j53J64RJ83k28n7
8099h9k7K58j58K86k39p6k0J55j85L15k03k89J23Q2P3k4L17n27J5L15K32m14J05
$$ plain form
8122 25 29 80 -72 -328 49 -16 -99 -82 76 -35 55 -315 -172 -5 -1 149 124 118 -244 182 143 171 -47 -147 -237
8147 -237 94 17 -110 132 62 -24 1 27 146 98 17 12 208 57 -64 110 113 140 -29 328 30 -94 -118 -49 37
8172 37 -7 86 -131 199 111 -147 -157 -12 187 42 -221 286 54 -176 -38 -12 -196 -107 -166
$$ packed form
8122B5MN1j52k56L77o5q3J7J58j11R0l70J43J67MJ50k5ol62M26l9K8k18j00r0
8147b37L31p7j27K42p0q6K5K6J19m8q1nJ96j51j21J74LK7j69L57k98j24k4O9Q6
8172C7m4R3k17L30q8k58j0J45J99j45k63N07k32k30J38K6j84Q9n9
8191a66
$$ Imaginary data points
##PAGE= N=2
##DATA TABLE= (X++(I..I)), XYDATA
$$ plain form
0 0 0 0 0 0 0 0 0 0 0 0 0 0 0 0 0 -8 8 -8 8 -8 12 -16 16 -20 24 -26 32 -38 40 -48 56 -64 72 -81 91 -102 115
37 115 -127 143 -160 177 -197 218 -241 267 -292 324 -358 394 -434 476 -527 580 -642 709 -785
56 -785 872 -975 1093 -1235 1406 -1620 1892 -2256 2763 -3526 4803 -7315 14151 -72458 -214913
71 -214913 -53889 73803 71538 24108 -9940 -34138 23906 84620 67098 9352 -29273 -55554
83 -55554 -29771 13861 4445 -18765 1106 -8535 -38249 8675 74133 28271 -51512 -47369 -3252
96 -3252 15311 26716 18481 -15132 -15909 23710 45502 41358 22091 -14250 -16551 29790 38039 -4839
110 -4839 -13673 5290 2611 18164 49979 28406 -8777 6268 26149 18760 23760 25272 345
123 345 -3576 16694 15435 10923 18915 3891 -15950 -428 15003 4378 696 1125 -9498 2314
$$ packed form
0@%%%%%%%%%%%%%%%qJ6j6J6j6K0k8L2l6M4n0N8p0P8q8J04j20J36j53J72j93K17
37A15k42K70l03L37l74M15m59N08n59O16o82P52q28R10j003J107j222J351j494
56g85J657j847K068k328K641l026L512m148N019o289Q329j2118K1466q6609j42455
71b14913J61024J27692k265m7430l4048k4198N8044O0714j7522n7746l8625k6281
83e5554K5783M3632r416k3210J9871r641k9714M6924O5458m5862p9783M143M4117
96c252J8563J1405q235l3613p77L9619K1792m144j9267l6341k301M6341Q249m2878
110d839q834J8963k679J5553L1815k1573l7183J5045J9881p389N000J512k4927
123C45l921K0270j259m512P992j5024j9841J5522J5431j0625l682M29j0623J1812
$$ plain form
137 2314 31759 27507 4046 4679 10384 5714 17609 32588 17425 1045 6784 10822 13397 26934
151 26934 21602 -5915 -13097 75 3349 1669 -2892 -19175 -18415 5699 8354 -5691 5834 17562
165 17562 -170 -7697 10524 19234 16201 10058 -10312 -20749 5333 30318 17432 -6103 -13910
178 -13910 -7143 13428 24757 4694 -14246 -4921 4573 652 5421 8961 -8239 -17204 445
191 445 14635 11145 4890 -5531 -12663 941 19491 14405 -4308 -16605 -17239 -2038 18335 11634
205 11634 -12005 -12897 4500 15081 22717 22427 -256 -16428 843 22205 19211 3306 -12257
218 -12257 -19698 -6373 14330 16202 3131 -8767 -16780 -9941 12912 20079 455 -13798 -9920
231 -9920 -2593 8144 19476 10508 -11063 -12426 6599 19745 19234 6179 -11225 -10766 10497 21265
$$ packed form
137B314K9445m252k3461O33N705m670J1895J4979j5163j6380N739M038K575J3537
151B6934n332k7517p182J3172L274j680m561j6283P60K4114K655j4045J1525J1728
165A7562j7732p527J8221Q710l033o143k0370j0437K6082K4985j2886k3535p807
178a3910O767K0571J1329k0063j8940R325R494l921M769L540j7200q965J7649
191D45J4190l490o255j0421p132J3604J8550n086j8713j2297o34J5201K0373o701
205A1634k3639q92J7397J0581P636k90k2683j6172J7271K1362k994j5905j5563
218a2257p441J3325K0703J872j3071j1898q013O839K2853P167j9624j4253L878
231i920P327J0737J1332q968k1571j363J9025J3146n11j3055j7404M59K1263J0768
$$ plain form
245 21265 12921 89 -10139 -12023 4494 18125 5918 -10093 -8630 -2533 3251 13198 11324
258 11324 -6651 -12446 409 11589 13229 4617 -12496 -15548 5714 20426 12226 337 -5014
271 -5014 -5305 6781 20726 13191 -3088 -4941 285 4674 12506 12338 -2617 -10467 -90 9085
285 9085 10027 6360 -4548 -11423 -287 11978 8552 3379 1711 -4785 -4739 7305 12055 4337 1805
300 1805 399 -3482 3521 14260 10635 2995 3056 2966 3298 10739 11071 918 -2729 502 928 5191
316 5191 10611 1975 -8438 -3322 4688 5222 6135 4613 -5077 -7062 2749 6965 3975 3920 -53 -4019
332 -4019 3317 10129 4875 1160 4300 2934 3083 9192 6575 -2655 -2116 2571 1410 2955 5435 -2715
348 -2715 -8672 -2223 4109 4034 3343 -2405 -8743 -2836 7994 4972 -2434 -3610 -5678 -4359 6257
$$ packed form
245B1265q344j2832j0228j884J6517J3631j2207j6011J463O097N784R947j874
258A1324j7975n795J2855J1180J640q612j7113l052K1262J4712q200j1889n351
271e014k91J2086J3945p535j6279j853N226M389P832j68j4955p850J0377R175
285I085R42l667j0908o875J1136J2265l426n173j668o496M6J2044M750p718k532
300A805j406l881P003J0739l625p640O1r0L32P441L32j0153l647L231M26M263
316E191N420q636j0413N116Q010N34R13j522r690j985R811M216k990n5l973l966
332d019P336O812n254l715L140j366J49O109k617r230N39M687j161J545K480q150
348b715n957O449O332p5o91n748o338N907J0830l022p406j176k068J319J0616
$$ plain form
363 6257 10076 -746 -9078 -6850 -974 9259 14908 2479 -12677 -9896 2328 10156 13096 3745
377 3745 -13989 -14893 3412 13355 7475 -2262 -11448 -12552 1964 14027 5038 -10165 -14843 -10371
391 -10371 1758 11625 3584 -12487 -12055 -1589 5650 11239 11799 -1258 -10272 426 11792 9830
405 9830 2506 -5394 -9869 -2057 8346 4835 -3797 -5971 -5547 -751 9193 8049 -6112 -10193 -3666
420 -3666 -1373 1674 6637 -324 -10455 -5742 5756 8986 7197 1583 -6130 -3093 7341 6888 174
435 174 -3186 -7209 -7004 6063 13292 1399 -7360 -2394 1891 4966 10533 5301 -6698 -8494 -1968
450 -1968 1031 3429 1358 -9252 -11998 -2074 2407 507 203 -4516 -10148 -540 10969 4350 -5366
465 -5366 -4011 -1897 -167 5351 4264 -3102 -3411 -407 -2365 124 4059 -1708 -6585 -3244 -4166 -8511
$$ packed form
363F257L819j0822q332K228N876J0233N649j2429j5156K781J2224P828K940r351
377C745j7734r04J8305R943n880r737r186j104J4516J2063q989j5203m678M472
391a0371J2129R867q041j6071M32J0466P239N589N60j3057r014J0698J1366j962
405I830p324p900m475P812J0403l511q632k174M24M796R944j144j4161m081O527
420c666K293L047M963o961j0131M713J1498L230j789n614p713L037J0434m53o714
435A74l360m023K05J3067P229j1893q759M966M285L075N567n232j1999j796O526
450a968K999K398k071j0610k746R924M481j900l04m719n632R608J1509o619r716
465e366J355K114J730N518j087p366l09L004j958K489L935n767m877L341r22m345
$$ plain form
481 -8511 -3679 -1389 -8787 -10059 -4308 -4569 -5746 -1888 -4646 -9205 -3404 1736 -1985 -2985 -2753 -7701
497 -7701 -6368 1578 440 -5383 -3732 -4871 -8804 -2517 4652 -1881 -9275 -8458 -7442 -2633 2697
512 2697 -6416 -19365 -13778 -1235 601 -1511 -6677 -14893 -11174 4178 7535 -3262 -9706 -11111
526 -11111 -10311 -2503 2214 -4641 -9480 -7345 -6842 -2974 7337 6149 -6319 -7893 -1115 751 3227
541 3227 4402 -6638 -17312 -9406 3450 5800 -331 -11176 -15458 -3828 7104 2571 -4979 -6485
555 -6485 -8297 -5270 6230 6718 -6005 -8384 1383 5565 5185 4857 298 -3752 -964 4253 6707
570 6707 4810 -3861 -10377 -2498 7772 4370 -1592 -2558 -4814 -4438 5892 11445 201 -10775 -6803
585 -6803 3957 10195 5847 -3913 -7970 -1994 4940 7946 7610 953 -6630 -2167 9235 10267 3469
$$ packed form
481h511M832K290p398j272N751k61j177L858k758m559N801N140l721j000K32m948
497g701J333P946j138n823J651j139l933O287P169o533p394Q17J016M809N330
512B697r113j2949N587J2543J836k112n166q216L719J5352L357j0797o444j405
526a1111Q00P808M717o855m839K135N03L868J0311j188j2468j574O778J866K476
541C227J175j1040j0674P906J2856K350o131j0845m282J1630J0932m533p550j506
555f485j812L027J1500M88j2723k379R767M182l80l28m559m050K788N217K454
570F707j897q671o516P879J0270l402n962r66k256L76J0330N553j1244j0976L972
585f803J0760O238m348r760m057N976O934L006l36o657p583M463J1402J032o798
$$ plain form
600 3469 201 -215 -887 2690 6358 3640 -1858 -3290 -1206 2558 4231 941 -1123 198 -725 -2219
616 -2219 2555 6146 726 -6062 -4944 -415 4052 5317 1750 -3004 -2629 2305 6301 6922 2375 -2961
632 -2961 -1913 3361 4816 1224 -1550 -1864 -1164 39 2237 1392 -2083 -4004 -2915 -859 630 -160
648 -160 -3359 -5212 -3643 -330 2262 2189 -1462 -3991 -102 5570 4956 60 -2765 -1762 1202 3269
664 3269 2908 -930 -4669 -3966 -104 3570 3298 -1636 -5309 -4550 -1167 1681 2091 24 -4579 -7016
680 -7016 -2844 2955 3575 138 -3614 -5648 -2560 4978 6991 540 -5500 -5277 1294 7875 7247 -1500
696 -1500 -6197 -3039 2142 5212 5387 -87 -6653 -5130 2037 5250 2227 -2410 -6019 -4495 2128
711 2128 5249 749 -4216 -4952 -1646 3993 6765 952 -4476 -2308 2337 4667 5778 3321 -2476
$$ packed form
600C469l268m16o72L577L668k718n498j432K084L764J673l290k064J321r23j494
616b219M774L591n420o788J118M529M467J265l567m754L75M934L996O21m547n336
632b961J048N274J455l592k774l14P00J203K198q45l475j921J089K056J489p90
648a60l199j853J569L313K592p3l651k529L889N672o14m896k825J003K964K067
664C269l61l838l739P03L862L674k72m934l673P59L383K848M10k067m603k437
680g016M172N799O20l437l752k034L088P538K013o451o040K23O571O581o28q747
696a500m697L158N181L070J75n474o566J523P167L213l023m637l609J524O623
711B128L121m500m965p36L306N639K772n813n428K168M645K330J111k457n797
$$ plain form
726 -2476 -2955 2839 6049 4328 1289 -2571 -3187 1739 5149 1709 -1686 -2878 -3520 895 6295 3616
742 3616 -3301 -4303 -1331 1521 5757 4937 -1426 -4850 -1400 3478 6194 6374 702 -4482 -558 5790
758 5790 6896 4318 -170 -4657 -1858 6350 7406 1208 -2908 -3012 -799 4252 6783 1674 -3538
773 -3538 -3375 -1064 1907 4730 2286 -3340 -3179 1756 3040 3250 2580 -94 -33 3734 4495 1627 1438
790 1438 2153 424 1105 4026 2889 508 579 76 24 2478 3166 -711 -1173 207 -230 -382 2010 299
808 299 -2051 -266 1471 1148 1745 1480 -1777 -1533 3268 5438 3234 878 -1585 -1468 3431 6869 3129
825 3129 -827 -2221 -2587 995 5427 3461 -3100 -4387 -1054 1830 3340 2136 -2935 -5120 -1222
840 -1222 2372 2763 1744 -2115 -5309 -1406 4543 4633 1785 -718 -3022 -2198 3296 4881 1017 -2037
$$ packed form
726b476m79N794L210j721l039l860o16M926L410l440l395j192o42M415N400k679
742C616o917j002K972K852M236q20o363l424L450M878K716J80n672n184L924O348
758E790J106k578m488m487K799Q208J056o198m116j04K213N051K531n109n212
773c538J63K311K971K823k444n626J61M935J284K10o70k674O1L767P61k868j89
790A438P15j729O81K921j137k381P1n03n2K454O88l877m62J380m37j52K392j711
808B99k350J785J737l23N97k65l257K44M801K170k204k356k463J17M899L438l740
825C129l956j394l66L582M432j966o561j287L333K884J510j204n071k185L898
840a222L594L91j019l859l194L903N949R0k848k503k304Q24N494J585l864l054
$$ plain form
856 -2037 -2004 -953 1732 4036 2031 -1753 -1493 3 1361 3113 1187 -4578 -5253 -390 2180 600
872 600 -877 -3078 -4319 -841 3661 2727 -136 -2175 -2616 439 4933 3159 -2430 -2694 191 2752
888 2752 5137 4218 -2233 -4197 1075 5293 3985 613 -3700 -5829 -1686 3377 3052 -574 -3668 -4942
904 -4942 -1266 5564 5097 -1693 -3906 -866 1729 3886 4277 12 -4129 -1215 3164 4746 3968 596
920 596 -3022 -1555 2601 2979 2400 1664 -1514 -3708 141 3403 1482 150 -753 -2608 -1614 3076 3077
937 3077 -1088 -2913 -1982 749 3593 1969 -3082 -3692 422 1301 818 1833 103 -2328 -551 2612
953 2612 1628 413 595 -1014 -1446 1211 1369 -611 -1872 -2710 -2739 569 1559 -2624 -4921 -2872 -1181
970 -1181 -540 740 -1358 -4927 -4032 -107 586 -376 -1062 -2292 -1615 873 632 -541 684 140 -2865
$$ packed form
856b037L3J051K685K304k005l784K60J496J358J752j926n765o75M863K570j580
872F00j477k201j241L478M502r34k863k039m41L055M494j774n589k64K885K561
888B752K385r19o451j964N272M218j308l372m313k129M143N063l25l626l094j274
904d942L676O830m67o790k213L040K595K157L91m265m141K914M379J582p78l372
920E96l618J467M156L78n79p36l178k194L849L262j921j332r03j855R94M690J
937C077m165j825R31K731K844j624n051o10M114Q79m83J015j730k431J777L163
953B612r84j215J82j609m32K657J58j980j261q38k9L308R90m183k297K049J691
970a181O41J280k098l569Q95L925O93r62o86j230O77K488k41j173J225n44l005
$$ plain form
987 -2865 -2165 1010 38 -2358 -3458 -3971 -3704 -154 1235 -1617 -4182 -4308 -2566 430 2337 -1155
1003 -1155 -4943 -3845 -1167 -34 1319 226 -3548 -4412 -205 2845 1590 -1270 -3650 -3144 963
1018 963 3229 1587 -1818 -3718 -2950 1581 5106 1676 -3926 -4226 311 2110 1135 -1032 -3217 -3689
1034 -3689 -673 1717 980 -1707 -3623 -2518 1731 3264 1452 -596 -1788 -1749 1397 5179 4157 -954
1050 -954 -3494 -611 3345 3637 1736 -1028 -2022 -1722 383 2947 2191 -2043 -4202 -1893 1525 2847
1066 2847 862 -1282 -3020 -2347 1103 4426 3050 -1294 -3565 -570 2853 3705 2105 -58 -2109
1081 -2109 -1021 1863 2688 1107 -1551 -1410 393 1861 690 -794 -861 -1100 -1465 229 1595 -159
1097 -159 -2679 -2110 -403 548 661 -228 -1594 -1379 -316 648 1011 425 -1281 -1007 1519 1928 29 -389
$$ packed form
987b865P00L175r72k396j100n13K67L550J389k852k565j26J742K996J907l492
1003a155l788J098K678J133J353j093l774q64M207L050j255k860k380N06M107
1018I63K266j642l405j900P68M531L525l430n602l00M537J799r75k167k185m72
1034c689L016K390p37k687j916J105M249J533j812k048j192L9L146L782j022n111
1050i54k540K883L956K92j901k764r94L00K105K564p56m234k159K309L418J322
1066B847j985k144j738O73L450L323j376m344k271K995L423Q52j600k163k051
1081b109J088K884Q25j581k658J41J803J468j171j484o7k39l65J694J366j754
1097a59k520N69J707R51J13q89j366K15J063R64L63n86j706K74K526M09j899m18
$$ plain form
1115 -389 72 -454 270 1839 742 -1134 -1694 -1406 -648 802 422 -1722 -2653 -2340 -1899 573 2055 -1653
1133 -1653 -4198 -1633 1306 1968 705 -1199 -3003 -796 2763 3214 1078 -1371 -2551 -1432 2968
1148 2968 4009 242 -2178 -2104 -1122 896 2802 405 -3200 -2474 -174 358 894 340 -2036 -2250 198
1165 198 1124 566 686 -1095 -2124 349 2811 1106 -153 587 -647 -636 2188 2420 518 -99 178
1182 178 -348 1347 2513 13 -1612 69 158 288 1723 231 -2887 -1894 1193 1287 500 -252 -2540
1199 -2540 -2296 1471 3526 1582 -34 -1236 -1396 2335 5160 1783 -1757 -923 986 2088 3882 1947
1215 1947 -2373 -2564 1078 2631 2304 691 -2826 -3506 282 2726 1052 -266 -1196 -2595 -379 2965
1231 2965 1891 -339 -278 -314 95 2125 2449 -138 -897 439 893 1836 2507 560 -1502 10 1576
$$ packed form
1115c89M61n26P24J569j097j876n60K88P58J450l80k144r31L13M41K472J482l708
1133a653k545K565K939O62j263j904j804K207L559M51k136k449j180J119M400
1148B968J041l767k420P4R82K018J906k397l605P26K300N32N36n54k376k14K448
1165A98R26n58J20j781j029K473K462j705j259P40j234J1K824K32j902o17K77
1182A78n26J695J166k500j625J681Q9J30J435j492l118R93L087R4p87p52k288
1199b540K44L767K055j944j616j202j60L731K825l377l540Q34J909J102J794j935
1215A947m320j91L642J553l27j613l517o80L788K444j674j318r30j399K216L344
1231B965j074k230O1l6M09K030L24k587p59J336M54R43O71j947k062J512J566
$$ plain form
1248 1576 1315 1186 724 -1629 -1460 997 1413 -179 -216 -1133 -1656 241 1835 -235 -1804 -650 4
1265 4 1158 2506 570 -2043 -1190 1094 2105 2572 1460 -1615 -1764 1710 3214 1670 421 -956
1281 -956 -1562 528 2223 742 -1332 -1762 -1415 -549 1511 780 -2219 -2110 -797 -413 969 2022 -168
1298 -168 -2253 -811 772 1558 1884 1294 -791 -932 559 1753 1615 1323 -462 -1496 -210 1392 430
1315 430 -322 -940 -1912 -1565 1088 1423 -968 -2099 -1734 -951 822 1688 -505 -2142 -1322 93 1176
1332 1176 1213 -351 -1766 96 2130 1313 148 -316 -506 -232 1999 2110 -393 -1838 -1132 246 1659
1349 1659 1485 -898 -2580 -1428 460 853 1118 -446 -2555 -1547 930 1574 103 -667 -1166 -1053 929
1366 929 2844 1415 -109 -538 -307 1095 3124 2440 46 -873 -990 5 2320 2969 -292 -2336 -1524
$$ packed form
1248A576k61j29m62k353J69K457M16j592l7r17n23J897J594k070j569J154O54
1265DJ154J348j936k613Q53K284J011M67j112l075j49L474J504j544j249j377
1281i56o06K090J695j481k074m30L47Q66K060p31k999J09J313L84J382J053k190
1298a68k085J442J583P86L26n90k085j41J491J194j38k92j785j034J286J602r62
1315D30p52o18r72L47K653L35k391j131L65P83J773Q66k193j637Q20J415J083
1332A176L7j564j415J862K034q17j165m64j90K74K231J11k503j445P06J378J413
1349A659j74k383j682J152J888L93K65j564k109J008K477O44j471p70m99J13J982
1366I29J915j429j524m29K31J402K029o84k394r19j17R95K315O49l261k044Q12
$$ plain form
1383 -1524 662 1586 1247 -555 -2246 -994 999 1437 664 -452 -1637 -688 2066 2890 986 -389
1399 -389 116 239 1653 2999 1372 -484 -466 492 1320 1735 450 -1203 -756 1077 1088 743 -48 -1236
1417 -1236 -1299 967 1777 -198 -1423 -1415 -292 549 904 216 -1042 -803 -151 429 1021 545 -573 -581 351
1436 351 642 859 1047 -180 -1879 -1044 753 1342 505 -1092 -2224 -1675 -200 778 34 -1574 -2839
1453 -2839 -2683 -456 1319 -36 -2035 -2044 -1030 -54 992 1134 -1026 -1795 -836 1112 1345 391 -1403
1470 -1403 -2171 -631 728 625 -163 -1081 -2009 -1166 398 49 -1297 -1559 -1436 -1210 -856 130 -333 -1133
1488 -1133 -1576 -602 448 523 -517 -1250 -896 47 658 306 243 -817 -1308 -71 1610 894 -943 -1091
1506 -1091 -597 255 1152 721 -936 -1868 -1352 320 1130 443 -1684 -2719 -651 865 1166 468 -1266
$$ packed form
1383a524K186R24l39j802j691J252J993M38p73j116j185R49K754Q24j904j375
1399c89N05J23J414J346j627j856J8R58Q28M15j285j653M47J833J1l45p91j188
1417a236o3K266Q10j975j225QJ123Q41L55o88j258K39O52N80N92m76j118qR32
1436C51K91K17J88j227j699Q35J797N89q37j597j132N49J475R78p44j608j265
1453b839J56K227J775j355j999rJ014R76J046J42k160p69R59J948K33r54j794
1470a403p68J540J359j03p88r18r28Q43J564l49j346k62J23K26L54R86m63q00
1488a133m43R74J050P5j040p33L54R43O11l52o3j060m91J237J681p16j837j48
1506a091M94Q52Q97m31j657r32N16J672Q10o87k127j035K068J516L01o98j734
$$ plain form
1523 -1266 -2280 -1273 2151 2438 190 -1421 -1244 175 1820 1924 352 -896 -462 190 1531 1344
1539 1344 63 -1905 -761 1001 384 -186 -482 -1149 -1547 -320 543 -256 -780 -1016 -1041 170 1059 -30
1557 -30 -122 264 189 -315 1275 1340 -460 -311 639 495 160 618 87 -1063 -206 210 120 162 -266 -1612 -1127
1578 -1127 854 472 -444 -552 -1363 -1480 616 1679 -431 -1884 -1002 -46 1082 1746 -121 -2022 -900
1595 -900 510 1300 1533 870 -1836 -1808 1216 1595 507 123 -1146 -1764 -170 1204 285 -599 -1124 -1720
1613 -1720 -639 1548 523 -1589 -935 -314 -303 618 1664 -444 -1431 253 735 597 1721 990 -886
1630 -886 -670 890 795 660 1005 -644 -1118 744 1057 -493 -521 -164 -933 -138 1336 -271 -1560 -626
1648 -626 -35 65 1048 512 -1606 -832 878 611 790 908 -674 -1108 1008 1796 480 -4 277 -636
$$ packed form
1523a266j014J007L424K87k248j611J77J419J645J04j572j248M34O52J341j87
1539A344j281j968J144J762o17n70k96o67l98J227Q63p99n24k36k5J211Q89j089
1557c0r2L86p5n04J590O5j800J49R50j44l35M58n31j150Q57M16r0M2m28j346M85
1578a127J981l82r16j08q11j17K096J063k110j453Q82R56J128O64j867j901J122
1595i00J410P90K33o63k706K8L024L79j088l84j269o18J594J374r19q84n25n96
1613a720J081K187j025k112O54O21J1R21J046k108r87J684M82j38J124p31j876
1630h86K16J560r5j35L45j649m74J862L13j550k8L57p69P95J474j607j289R34
1648f26N91J00R83n36k118P74J710k67J79J18j582m34K116P88j316m84K81r13
$$ plain form
1666 -636 441 1970 957 -973 -615 -397 -339 1091 847 -854 -1258 -220 -265 -70 1215 -6 -1628
1683 -1628 -901 477 392 891 991 -723 -1031 982 1264 1022 755 -634 -911 757 2039 874 -83 -383
1701 -383 -1072 -342 1470 1222 -741 -1353 -519 -175 676 866 -845 -1579 -161 881 657 536 -637 -1362
1719 -1362 253 1865 829 -181 -389 -379 301 2014 1541 -495 -577 371 447 911 842 -449 -1375 55
1737 55 798 421 261 -689 -1369 -309 938 465 -214 -430 -839 -835 661 1596 484 -324 -185 -496 316 1750
1757 1750 895 -222 -598 -137 554 1100 922 -313 -1022 -401 206 765 880 -351 -1568 -1137 543 847
1775 847 245 -542 -1414 -983 661 1142 5 -449 -385 -404 446 1266 115 -630 -317 330 774 505 -91 -784
1795 -784 -159 529 561 96 -268 -877 -689 25 558 -121 -491 -327 -608 -712 438 6 -1081 -853 37 237
$$ packed form
1666f36J077J529j013j930L58K18N8J430k44j701m04J038m5J95J285j221j622
1683a628P27J378q5M99J00j714l08K013K82k42k67j389k77J668J282j165r57l00
1701c83o89P30J812k48j963o12Q34L44Q51J90j711p34J418J042k24j21j173p25
1719a362J615J612j036j010k08J0O80J713m73k036q2R48P6M64o9j291r26J430
1737E5P43l77j60r50o80J060J247m73o79k16m09MJ496R35j112q08J39l11Q12J434
1757A750q55j117l76M61O91N46j78j235p09O21O07N59J15j231j217M31J680L04
1775H47o02p87q72M31J644M81j137m54O4j9Q50Q20j151p45L13O47M44k69n96o93
1795g84O25O88L2m65l64o09J88P14N33o79l70J64k81j04J150m32j087K28Q90K00
$$ plain form
1815 237 820 599 -326 -356 369 726 1050 1232 16 -1152 -526 1105 1392 606 9 -821 -846 547 1460
1834 1460 527 -557 -713 -607 544 1256 185 -954 -658 40 684 1270 802 -582 -722 547 1223 826
1852 826 460 -22 -129 -5 1158 1100 469 34 -213 346 1240 488 -391 -143 167 64 365 128 -254 -868
1872 -868 156 424 -26 178 178 -533 3 753 535 834 308 -387 128 954 1051 568 218 85 -146 666 1245
1893 1245 466 -1012 -883 93 583 715 178 -1183 -1577 -327 753 574 -83 -821 -1248 -168 970 522
1911 522 -17 -713 -747 -517 799 973 -529 -798 -586 413 637 799 -135 -887 -171 -30 146 522 -246 -978
1931 -978 -875 -157 70 -255 -149 -1031 -693 -509 -23 -346 -119 -501 -771 -159 535 364 -482 -448 -182 131
1951 131 121 583 51 -652 -197 230 207 149 -396 -934 -379 253 152 -418 -671 -1165 -785 633 713 -834 -1738
$$ packed form
1815B37N83k21r25l0P25L57L24J82j216j168O26J631K87p86n97q30k5J393R13
1834A460r33j084j56J06J151P12j071j139K96O98O44N86m68j384j40J269O76l97
1852H26l66m82j07J24J163n8o31m35k47N59Q94p52q79K48L10j03L01k37l82o14
1872h68J024K68m50K04%p11N36P50k18K99n26o95N15Q26R7m83l50j33k31Q12N79
1893A245p79j478J29R76M90J32n37j361l94J250J080j79o57p38m27J080J138m48
1911E22n39o96l4K30J316J74j502k69K12R99K24J62r34p52P16J41J76L76p68p32
1931i78J03P18K27l25J06q82L38J84M86l23K27l82k70O12O94j71q46L4K66L13
1951A31j0M62n32p03M55M27k3n8n45n38N55O32j01n70k53m94L80J418Q0j547r04
$$ plain form
1972 -1738 -691 -120 232 520 -247 -1179 -745 381 1033 600 -95 -816 -129 966 577 388 221 -494 -974
1991 -974 251 831 -52 -545 -701 -898 -447 225 8 -371 -843 -731 -777 439 641 -484 -904 -32 -51 2
2011 2 648 528 -673 -403 716 1063 297 124 -266 -413 520 779 124 -295 -475 -785 14 814 -427 -1299
2031 -1299 -454 32 -135 36 387 -909 -689 159 496 -119 -156 -768 -305 799 1211 -77 -275 26 -165
2050 -165 179 1285 427 -406 -438 -121 -111 557 362 -425 -677 -253 146 -28 621 -402 -1174 -596 -40 95
2070 95 43 262 -743 -926 587 991 357 257 -446 -800 371 1077 570 -163 -74 -462 -60 1018 678 -800
2090 -800 -874 10 237 106 232 -945 -1186 202 259 8 -158 -833 -873 4 1090 4 -563 -141 50 297
2110 297 849 605 -431 -303 433 378 241 271 -494 -796 507 351 -176 -271 -209 -845 -459 601 -8 -448
$$ packed form
1972a738J047N71L52K88p67r32M34J126O52m33o95p21O87J095l89j89j67p15m80
1991i74J225N80q83m93j56j97M51O72k17l79m72J12m6J216K02j125m20Q72j9N3
2011BO46j20j201K70J119L47p66j73l90j47R33K59o55m19j80l10P99Q00j241q72
2031a299Q45M86j67J71L51j296K20Q48L37o15l7o12M63J104M12j288j98L01j91
2050a65L44J106q58q33l2L17J0O68j95p87k52M24L99j74O49j023p72N78N56J35
2070I5n2K19j005j83J513M04o34j00p03l54J171P06n07p33Q9l88M02J078l40j478
2090h00p4Q84K27j31J26j177k41J388N7k51j66o75m0Q77J086j086n67M22J91K47
2110B97N52k44j036J28P36n5j37L0p65l02J303j56n27r5O2o36L86J060o09m40
$$ plain form
2130 -448 -113 -647 -743 58 566 -130 -236 -204 -233 297 906 437 -438 -223 163 54 1085 935 -385 -715
2150 -715 -100 304 395 486 -368 -1064 -409 83 138 144 -505 -882 -534 582 138 -242 -349 -346 -310 363 817 37
2172 37 -158 66 291 299 723 158 -402 101 302 690 357 174 -402 -90 365 536 -130 -460 -188 -477 86
2193 86 166 -217 -639 -574 -366 113 590 257 -463 -501 10 426 1008 645 -466 -509 316 679 702 387 -336 -755
2215 -755 -259 844 780 -372 -390 -470 -266 520 572 -308 -861 -609 8 294 351 -163 -383 -308 139 429 333 16
2237 16 -366 -141 399 475 187 114 28 312 498 641 310 170 -96 199 -123 189 131 -212 -307 -307 -94 -68 27
2260 27 -310 -470 -132 276 377 61 91 -10 -23 581 407 529 56 -162 82 442 879 260 -602 -378 -267
2281 -267 578 395 -216 -719 -1142 2 470 245 -3 -483 -663 187 368 386 290 -547 -411 45 797 634
$$ packed form
2130d48L35n34r6Q01N08o96j06L2k9N30O09m69q75K15L86j09J031j50j320l30
2150g15O15M04R1R1q54o96O55M92N5Oo49l77L48J116m44l80j07LL6O73M54p80
2172C7j95K24K25QM24n65n60N03K01L88l33j83n76L12M55J71o66l30K72k89N63
2193H6Q0l83m22O5K08M79M77l33p20l8N11M16N82l63j111m3Q25L63K3l15p23m19
2215g55M96J103o4j152j8q0K04P86N2q80n53K52O17K86N7n14k20P5M47K90r6l17
2237A6l82K25N40P6k88p3q6K84J86J43l31j40k66K95l22L12n8l43r5%K13K6R5
2260B7l37j60L38M08J01l16L0j01j3O04j74J22m73k18K44L60M37o19q62K24J11
2281b67Q45j83o11n03m23J144M68k25k48m80j80Q50J81J8r6q37J36M56P52j63
$$ plain form
2301 634 48 -310 158 481 603 590 267 -300 170 70 585 541 -67 -71 -40 -72 232 16 183 -86 -472 236
2323 236 256 395 -44 -235 -454 -58 367 352 -363 -171 47 204 610 666 -142 -350 470 711 629 193 -214
2344 -214 -410 134 702 453 -115 -441 -333 -85 462 271 -506 -440 -517 -281 522 572 -241 -644 -21 358 671
2365 671 105 188 -380 -52 525 255 510 78 -392 -118 401 558 83 -99 -187 -215 -301 319 409 -161 -529 -423
2387 -423 -484 107 287 -165 -645 -467 -187 122 66 197 -335 -270 398 433 351 291 -240 -190 203 675 -29 -316
2409 -316 -328 -218 288 370 -382 -579 -173 -97 -71 25 -171 -741 -414 133 298 -63 -210 -420 -109 -56 351 130
2431 130 -387 -111 -160 193 477 286 -275 -66 -101 -80 405 -26 -341 -533 -311 78 212 226 -514 -524 -661 -179
2453 -179 187 377 -62 -710 -625 339 613 135 40 -234 -185 244 561 421 -114 -284 -98 252 495 143 -426
$$ packed form
2301F34n86l58M68L23J22j3l23n67M70j00N15m4o08mL1l2L04k16J67k69l86P08
2323B36K0J39m39j91k19L96M25j5p15J92K18J57M06N6q08k08Q20K41q2m36m07
2344b14j96N44N68k49n68l26J08K48N47j91p77O6p7K36Q03N0q13m03O23L79L13
2365F71n66Q3n68L28N77k70K55m32m70K74N19J57m75j82q8k8q6O20R0n70l68J06
2387d23o1N91J80m52m80J78K80L09n6J31n32O5O68L5q2o0n31N0L93M72p04k87
2409c16j2J10N06Q2p52j97M06P6K6R6j96n70L27N47J65l61j47k10L11N3M07k21
2431A30n17K76m9L53K84j91n61K09l5K1M85m31l15j92K22L89J34J4p40j0j37M82
2453a79L66J90m39o48Q5R64K74m78r5k74M9M29L17j40n35j70J86L50K43l52n69
$$ plain form
2474 -426 -443 6 283 -10 111 -120 -418 -235 114 -133 -176 -626 -491 -167 167 -74 -494 -214 138 311 259
2495 259 273 -247 -66 180 287 240 231 10 -144 41 419 351 272 22 -537 -240 233 210 97 -267 -216 -519 -230
2518 -230 210 -50 -421 -261 -424 -5 319 484 -126 -255 138 225 705 501 -214 -469 437 419 405 298 -83
2539 -83 -403 -141 225 69 -256 5 -326 -184 248 137 -454 -390 -144 -238 73 128 -134 -508 176 220 231 199
2561 199 378 -184 -102 399 18 159 -78 12 -55 182 422 125 70 -209 -226 -174 268 -109 -260 -296 -434 -131
2583 -131 10 132 -586 -431 127 103 346 269 -274 -312 171 512 304 -64 -233 -166 84 390 171 150 -382 -384
2605 -384 -89 486 296 2 -421 -269 -5 -3 94 -483 -261 -141 -155 15 21 -74 -364 -1 161 -217 184 161 18
2628 18 -127 49 43 187 357 346 -386 -202 147 277 -217 -133 -345 -491 -47 -259 -118 -275 -318 -313 23 -36 -31 -251
$$ packed form
2474d26j7M49K77k93J21k31k98J83L49k47m3m50J35L24L34k41m20K80L52J73n2
2495B59J4n20J81K46J07m7rk21j54J85L78o8p9k50n59K97M73k3j13l64N1l03K89
2518b30M40k60l71J60j63M19L24J65o10j29L93Q7M80k04p15k55R06j8j4j07l81
2539h3l20K62L66j56l25K61l31J42M32j11n91O4K46r4L11N5k62l74O84M4J1l2
2561A99J79n62Q2N01l81J41k37R0o7K37K40k97n5k79j7N2M42l77j51l6j38L03
2583a31J41J22p18J55N58k4K43p7n43l8M83L41k08l68j69O7K50L06k19k1n32k
2605c84K95N75j90k94m23J52K64KR7n77K22J20j4J70Or5k90L63J62l78M01k3j43
2628A8j45J76oJ44J70j1p32J84L49J30m94Q4k12j46M44k12J41j57m3NL36n9Nk20
$$ plain form
2652 -251 111 199 268 62 100 -420 194 644 786 302 -198 -279 272 496 478 -166 -277 -198 -133 420 236 -355
2674 -355 -600 -260 -103 59 299 -205 -475 -337 -148 584 130 -15 -119 5 436 269 185 -12 -106 -54 273
2695 273 211 128 48 125 -108 299 305 -173 205 -265 -76 -13 -118 -26 -440 -183 -41 -240 52 13 -425 -165 -141
2718 -141 151 -87 -62 -65 63 302 410 357 122 36 66 82 686 419 -168 -125 -194 84 -17 120 -307 -406 -139
2741 -139 68 -105 184 -288 -692 -264 162 325 -76 124 -67 -330 558 540 357 -67 172 -153 -12 336
2761 336 150 -83 211 -189 9 379 141 -359 -327 -244 -15 34 240 34 -516 -435 -59 97 178 15 -420 -117
2783 -117 17 441 202 52 9 175 413 455 -122 -129 330 263 224 15 65 -475 -46 95 214 -68 -394 -402 -83
2806 -83 329 52 -330 -272 -38 -119 183 99 124 -64 -38 126 339 284 161 -28 -7 -14 141 97 399 -41 -195 23
$$ packed form
2652b51L62Q8O9k06L8n20O14M50J42m84n00q1N51K24j8o44j11P9O5N53j84n91
2674c55k45L40J57J62K40n04k70J38J89P32m54j45j04J24M31j67q4j97r4N2L27
2695B73o2q3q0P7k33M07Om78L78m70J89O3j05R2m14K57J42j99K92l9m38K60K4
2718a41K92k38K5lJ28K39J08n3k35q6L0J6O04k67n87M3o9K78j01J37m27r9K67
2741a39K07j73K89m72m04M28M26J63m01K00j91k63Q88j8j83m24K39l25J41L48
2761C36j86k33K94m00J98L70k38n00L2Q3K29M9K06k06n50Q1L76J56Q1j63m35L03
2783a17J34M24k39j50m3J66K38M2n77pM59o7l9k09N0n40M29J41J19k82l26qL19
2806h3M12k77l82N8K34q1L02q4K5j88K6J64K13n5j23j89K1pJ55m4L02m40j54K18
$$ plain form
2830 23 165 41 220 -204 -300 -356 -84 286 -16 -209 -525 -171 68 331 -74 -331 -313 -215 -148 242 71 -58
2852 -58 -202 232 317 157 168 -116 -17 95 273 -51 14 -224 -254 340 -62 -233 -266 -187 -252 -203 -41 224 -188
2875 -188 -286 51 -20 -1 -76 -108 -115 -6 142 371 375 260 65 16 266 283 126 74 219 -435 23 60 218 5
2899 5 -267 -359 150 431 158 -397 -205 -263 -130 163 139 -486 -425 133 321 371 239 -169 -68 -13 169 217 -140
2922 -140 -108 -174 70 194 454 -196 -323 -194 -2 29 131 -442 -248 -199 -5 -113 -65 -45 -451 -71 -112 -113 21
2945 21 134 -7 -77 216 121 138 -110 363 104 105 377 262 34 188 188 -140 207 -21 -271 -254 -68 114 289
2968 289 95 -89 -348 -126 189 209 68 -204 -224 176 364 270 -91 -167 -305 -111 338 119 54 82 54 189
2990 189 162 171 -64 -215 -173 -59 107 166 -52 -83 -34 153 76 -204 97 17 -194 12 -84 -10 -40 172 147 4
$$ packed form
2830B3J42j24J79m24r6n6K72L70l02j93l16L54K39K63m05k57J8R8O7L90j71j29
2852e8j44M34Q5j60J1k84R9J12J78l24O5k38l0N94m02j71l3P9o5M9J62K65m12
2875a88r8L37p1J9p5l2pJ09J48K29Mj15j95m9K50J7j57n2J45o54M58L7J58k13
2899Ek72r2N09K81k73n55J92n8J33K93k4o25O1N58J88N0j32m08J01N5J82M8l57
2922a40L2o6K44J24K60o50j27J29J92L1J02n73J94M9J94j08M8K0m06L80m1jJ34
2945B1J13j41p0K93r5J7k48M73k59JK72j15k28J54%l28L47k28k50J7J86J82J75
2968B89j94j84k59K22L15K0j41k72k0M00J88r4l61p6j38J94M49k19o5K8k8J35
2990A89k7Rk35j51M2J14J66N9k18l1M9J87p7k80L01q0k11K06r6P4l0K12k5j43
$$ plain form
3014 4 216 454 -68 168 -12 221 201 291 364 -242 -357 253 -151 105 -248 -303 -138 -118 -89 -83 -273 -242 94 -81
3038 -81 91 -185 124 -34 104 292 293 138 -127 247 305 219 259 44 -135 11 108 96 284 -161 -398 -198 31
3061 31 249 54 -90 -398 -240 64 -79 -353 -219 -460 132 10 290 83 -18 28 58 -79 52 -18 -91 -96
3083 -96 -1 8 152 115 45 98 -110 6 83 -83 0 -229 -72 175 -3 67 -170 -216 -134 81 290 -84 -90 -170 -75
3108 -75 -53 -15 -98 -29 82 219 293 20 -256 -92 -34 176 206 -14 198 -215 56 18 15 107 -45 -325 -111 -77
3132 -77 215 123 129 12 -72 140 307 286 166 24 11 69 450 304 18 -317 218 -160 152 375 47 -185 -87
3155 -87 -88 -37 26 -317 -126 -250 65 98 -253 -154 -255 40 214 137 -148 73 -128 235 354 324 -198 -41 284
3178 284 293 80 112 -186 -439 -42 193 127 -78 -107 -147 114 161 -181 -430 -48 -101 -100 129 28 -73 -150 -61 19
$$ packed form
3014DK12K38n22K36j80K33k0R0P3o06j15O10m04K56l53n5J65K0K9Oj90L1L36j75
3038h1J72k76L09j58J38J88Jj55k65L74N8q6M0k15j79J46R7j2J88m45k37K00K29
3061C1K18j95j44l08J58L04j43k74J34k41N92j22K80k07j01M6L0j37J31p0p3n
3083i6R5RJ44l7p0N3k08J16P7j66Q3k29J57K47j78P0k37m6Q2K15K09l74oq0R5
3108g5K2L8q3O9J11J37P4k73k76J64N8K10L0k20K12m13K71l8lR2j52k80K14L4
3132g7K92r2Oj17q4K12J67k1j20j42j3N8L81j46k86l35N35l78L12K23l28k32R8
3155h7jN1O3l43J91j24L15L3l51R9j01K95J74p7k85K21k01L63J19l0n22J57L25
3178B84Rk13L2k98k53L97K35o6k05k9m0K61M7l42k49L82n3JK29j01j01p7Q9Q0
$$ plain form
3202 19 61 147 259 4 29 185 79 431 464 40 -35 75 101 -58 57 -34 -373 -48 377 133 -91 145 -386
3225 -386 -348 127 486 -275 -278 -289 -60 -87 426 -39 -348 -118 -80 157 104 202 -36 77 83 338 240 -64 44 -17
3249 -17 103 237 -57 -104 -137 -108 268 272 -11 -99 -95 -42 -130 -71 198 71 5 212 339 18 21 -66 -19 -151 138 -11
3275 -11 -62 60 -347 -103 199 79 -12 104 -213 5 117 -71 -164 -6 -89 -72 193 263 39 -418 -138 89
3297 89 195 -207 159 -119 50 126 546 48 7 198 11 123 329 88 -148 219 15 87 82 218 -225 -81
3319 -81 206 -192 -41 -67 -188 -3 -32 -83 -124 -407 -255 14 -58 -51 -116 148 213 35 85 -86 542 285 45 -151
3343 -151 75 -65 245 191 -327 -275 85 7 116 -132 58 -313 -204 335 -91 -191 -148 -126 -1 195 39 -304
3365 -304 -306 -162 101 185 185 218 59 -75 165 350 150 -6 -88 60 300 62 135 109 91 -203 103 -146 125
$$ packed form
3202A9M2Q6J12k55K5J56j06L52L3m24p5J10K6j59J15r1l39L25M25k44k24K36n31
3225c86L8M75L59p61lj1K29k7N13m65l09K30L8K37n3R8k38J13OK55r8l04J08o1
3249a7J20J34k94m7l3K9L76Mk83q8MN3q8N9K69j27o6K07J27l21Lq7M7j32K89j49
3275a1n1J22m07K44L02j20r1J16l17K18J12j88r3J58q3J7K65P0k24m57K80K27
3297H9J06m02L66k78J69P6M20m98m1J91j87J12K06k41k36L67k04P2nJ36m43J44
3319h1K87l98J51k6j21J85k9n1m1k83J52K69p2Po5K64O5j78N0j71O28k57k40j96
3343a51K26j40L10n4n18N2L60p8J09k48J90l71J09N39m26j00M3K2J25J96j56l43
3365c04kJ44K63Q4%L3j59j34K40J85k00j56q2J48K40k38P3k6j8k94L06k49K71
$$ plain form
3388 125 -405 -92 -62 -206 228 145 2 -105 217 -176 112 359 270 141 92 46 -2 56 -210 -39 172 0
3410 0 -82 153 -213 -336 -385 101 -32 -22 -255 225 10 -15 214 -84 -227 -336 55 42 -144 -207 66 -156 195
3433 195 317 143 -255 -247 38 212 171 133 -194 -54 -182 -258 148 -49 -223 -178 -257 212 185 -126 -131 -37 -75 -43
3457 -43 -147 -24 286 -100 68 246 166 -2 73 -20 29 326 222 129 240 -256 107 34 295 151 21 -28 88
3480 88 191 259 138 -143 -195 -186 12 14 -104 -107 -1 -67 93 162 -72 -336 -1 83 403 116 -45 -19 213 15
3504 15 182 -142 9 -56 -185 93 9 -85 -267 80 52 -32 97 -101 -54 142 138 138 133 -14 -50 33 -64 165 157 57
3530 57 103 -62 11 228 206 72 -118 -341 -137 127 276 -40 160 100 -61 35 -87 -47 -148 -375 -197 115
3552 115 20 -158 130 96 -78 17 109 253 -62 -32 340 -170 -49 58 -146 168 194 212 42 86 326 100 147
$$ packed form
3388A25n30L13L0j44M34q3j43j07L22l93K88K47q9j29m9m6m8N8k66J71K11j72
3410@q2K35l66j23m9M86j33J0k33M80k15k5K29k98j43j09L91j3j86o3K73k22L51
3433A95J22j74l98QK85J74m1l8l27J40j28p6M06j97j74M5p9M69k7l11nR4l8L2
3457d3j04J23L10l86J68J78q0j68P5r3M9K97j04r3J11m96L63p3K61j44j30m9J16
3480H8J03O8j21k81n2RJ98Kj18lJ06o6J60O9k34k64L35Q4L20k87j61K6K32j98
3504A5J67l24J51o5j29K78q4r4j82L47k8q4J29j98M7J96m%nj47l6Q3r7K29qj00
3530E7M6j65P3K17k2j34j90k23K04K64J49l16K00o0j61R6j22M0j01k27J78L12
3552A15r5j78K88l4j74R5R2J44l15L0L72n10J21J07k04L14K6J8j70M4K40k26M7
$$ plain form
3575 147 -198 -76 -15 -73 43 -87 14 208 -236 76 115 -30 119 27 -24 13 -169 -87 215 -29 -134 228
3597 228 204 26 186 81 -15 -131 -182 383 278 -17 -282 -65 140 -114 340 -29 -278 -110 267 214 122 -273
3619 -273 -192 -23 -35 -94 70 156 182 68 288 263 -22 -50 94 -225 -161 -38 210 -177 4 20 122 -93 38
3642 38 -135 139 17 0 -49 105 -184 -524 223 28 -76 8 43 -80 63 185 39 75 11 -5 -37 320 329 -72
3666 -72 185 27 -149 80 -151 -26 -332 -43 57 120 229 -105 -288 -193 -71 -76 88 350 -174 -423 212 94
3688 94 54 -269 -135 81 0 -66 -102 110 26 19 -107 -13 75 55 -201 95 -138 -131 268 117 -213 201 -103 22
3712 22 -143 -97 -89 -206 -51 99 -59 -126 -126 -213 115 -18 15 3 -54 75 110 103 57 -65 -163 -122 71 -47 -50 -106 -103
3739 -103 16 207 -469 -116 -203 -77 105 34 -22 -77 -314 -366 178 10 -51 52 -66 263 19 14 205 -319 -32
$$ packed form
3575A47l45J22O1n8J16j30J01J94m44L12L9j45J49r2n1L7j82Q2L02k44j05L62
3597B28k4j78J60j05r6j16n1N65j05k95k65K17K05k54M54l69k49J68L77n3r2l95
3619b73Q1J69j2n9J64Q6K6j14K20k5k85k8J44l19O4J23K48l87J81J6J02k15J31
3642C8j73K74j22j7m9J54k89l40P47j95j04Q4L5j23J43J22j46L6o4j6l2L57Rm01
3666g2K57j58j76K29k31J25l06K89J00O3J09l34j83R5J22nJ64K62n24k49O35j18
3688I4m0l23J34K16q1o6l6K12q4pj26R4Q8k0k56K96k33PL99j51l30M14l04J25
3712B2j65M6Qj17J55J50j58o7%q7L28j33L3j2n7J29L5pm6j22r8M1J93j18ln6L
3739a03J19J91o76L53q7J26J82p1n6n5k37n2N44j68o1J03j18L29k44nJ91n24K87
$$ plain form
3762 -32 343 -23 83 -95 105 115 70 53 131 -53 -71 65 4 6 -54 -284 -13 87 -205 -263 -57 112 109 25 23
3787 23 -152 -143 37 -422 -26 13 298 216 152 -37 105 -196 256 -118 -35 139 147 -227 -25 170 173 -140 -218 20
3811 20 24 70 14 34 111 87 239 101 -108 160 -161 187 17 -213 64 53 -144 -12 5 202 -170 -46 -229
3834 -229 168 112 -185 -38 7 -141 -45 194 21 -117 -62 -50 47 240 117 65 187 -49 38 184 111 29 59 -99
3858 -99 -103 0 62 -243 -32 -10 288 121 65 -83 65 -109 -78 -78 -231 -27 115 52 12 -151 -210 -26 177 25
3882 25 264 -19 -265 76 -239 100 70 175 67 197 -13 250 55 -79 75 5 -48 67 201 -147 -35
3903 -35 -130 -265 -167 -18 -243 259 125 -92 170 -104 0 108 237 6 -14 174 159 -92 90 -25 -194 233
3925 233 -51 -22 28 -134 112 46 -213 -141 -65 -15 -77 -80 -148 -218 -7 85 -6 7 -377 76 109 49 -102 93 242
$$ packed form
3762c2L75l66J06j78K00J0m5j7P8j84j8J36o1Ko0k30K71J00k92n8K06J69lq4k
3787B3j75RJ80m59L96L9K85q2o4j89J42l01M52l74Q3J74Ql74K02J95Ll13p8K38
3811B0MM6n6K0P7k4J52j38k09K68l21L48j70k30K77j1j97J32J7J97l72J24j83
3834b29L97n6k97J47M5j48R6K39j73j38N5J2R7J93j23n2J22k36Q7J46p3q2L0j58
3858i9mJ03O2l05K11K2K98j67n6j48J48j74L1%j53K04J42o3m0j63n9J84K03j52
3882B5K39k83k46L41l15L39l0J05j08J30k10K63j95j34J54p0n3J15J34l48J12
3903c5r5j35R8J49k25N02j34k17K62k74J04J08J29k31k0J88j5k51J82j15j69M27
3925B33k84K9N0j62K46o6k59P2P6N0o2lo8p0K11R2r1J3l84M53L3o0j51J95J49
$$ plain form
3950 242 -150 55 71 176 28 85 63 127 57 59 105 169 -14 -152 32 -38 -210 -111 128 15 127 178 -22 -207
3974 -207 -181 -93 45 61 -64 198 -87 -29 151 253 91 -117 2 77 267 88 35 -149 -12 -104 124 -76
3996 -76 29 -113 -45 29 362 -28 -336 -170 -3 -31 44 88 -101 57 5 94 -46 17 64 216 -67 252 26
4019 26 126 179 -16 51 -282 12 139 -82 -59 265 26 21 -220 54 -104 34 167 291 41 -86 -94 -57 49
4042 49 -92 -76 101 194 114 -313 146 227 -27 -41 187 -115 135 80 -153 62 -137 -1 0 191 16 -19 158
4065 158 -117 -89 -55 89 -408 181 132 -29 192 157 285 215 199 -234 -138 98 -64 -48 52 58 -298 -134 -166 -111
4089 -111 11 170 95 38 -32 30 21 -204 -342 77 -6 -55 189 27 -243 -86 -224 34 273 -126 -25 120 -13
4112 -13 -96 -79 -209 -103 -92 147 -259 124 -14 -202 -159 -44 98 -79 -77 -239 -238 50 86 32 -54 -87 -71 -232 46
$$ packed form
3950B42l92K05J6J05j48N7k2O4p0KM6O4j83j38J84p0j72R9K39j13J12N1k00j85
3974b07K6Q8J38J6j25K62k85N8J80J02j62k08J19P5J90j79n3j84J37r2K28k00
3996g6J05j42O8P4L33l90l08J66J67k8P5M4j89J58n2Q9j40O3M7J52k83L19k26
4019B6J00N3j95O7l33K94J27k21K3L24k39nk41K74j58J38J33J24k50j27qL7J06
4042D9j41J6J77R3q0m27M59Q1k54j4K28l02K50n5k33K15j99J36JJ91j75l5J77
4065A58k75K8L4J44m97N89m9j61K21l5J28p0j6m33R6K36j62J6J00Ol56J64l2N5
4089a11J22J59p5n7p0O2rk25j38M19q3m9K44j62k70J57j38K58K39l99J01J45j33
4112a3q3J7j30J06J1K39m06L83j38j88M3J15J42j77Kj62JK88L6n4q6l3J6j61K78
$$ plain form
4137 46 -33 -188 11 -6 96 26 193 -46 174 -141 163 -9 -130 -30 -39 -270 109 76 -215 12 6 -278 -161
4160 -161 24 -106 57 67 -77 150 31 -155 -318 41 -1 11 208 91 -105 -75 -39 -166 47 30 245 -205
4182 -205 134 -8 191 140 -89 -267 167 51 -6 -345 -25 115 68 106 39 -133 -40 151 219 -154 -277 272
4204 272 -38 66 182 29 131 110 -79 96 148 210 -104 -27 -22 -172 170 138 -33 -6 -263 -172 -179 -124 119 -94
4228 -94 4 285 -59 39 -159 -109 38 90 111 131 103 -88 -323 133 242 47 274 51 -38 43 9 63 -65 14
4252 14 -84 57 65 -60 2 -13 173 -190 -104 22 21 -162 -99 255 -163 -188 -92 -59 245 -90 414 90 60 147 257
4277 257 -3 -26 152 224 -98 -2 43 39 133 -176 105 -75 138 50 -70 11 -141 -230 125 -2 -3 -108 -190 -50
4301 -50 -23 67 75 -19 -61 35 302 151 144 -3 -118 -112 8 -180 -73 82 -66 -25 106 -130 -99 10 57 -9 94
$$ packed form
4137D6p9j55J99j7J02p0J67k39K20l15L04j72j21J00rk31L79l3k91K27ok84J17
4160a61J85j30J63J0j44K27j19j86j63L59m2J2J97j17j96L0L6j27K13j7K15m50
4182b05L39j42J99n1k29j78M34j16n7l39L20J40m7L8o7j72R3J91O8l73j23N49
4204B72l10J04J16j53J02k1j89J75N2O2l14P7Nj50L42l2j71K7k57R1pN5K43k13
4228i4R8K81l44R8j98N0J47N2K1K0k8j91k35M56J09j95K27k23q9Q1l4N4j28P9
4252A4r8J41Qj25O2j5J86l63Q6J26jj83O3L54m18k5R6L3L04l35N04l24l0Q7J10
4277B57k60k3J78P2l22R6M5mR4l09K81j80K13q8j20Q1j52q9L55j27jj05q2J40
4301e0K7R0Qr4m2R6K67j51pj47j15OJ20j88J07J55j48M1J31k36L1J09M7o6J03
$$ plain form
4326 94 -14 17 -53 -73 -130 44 105 210 49 -79 141 -50 -35 -141 108 -19 -70 -148 -119 54 -258 -1 54 89
4350 89 128 -238 39 -239 -35 -76 140 -61 -304 256 -142 -105 -46 -113 -184 -233 -70 -25 -85 -83 231 -12 66 389
4374 389 164 213 37 246 281 143 -54 151 124 -65 129 -126 -10 -85 -150 -40 -4 -156 -24 166 -85 6
4396 6 -143 -303 -137 119 202 30 90 14 142 190 307 -90 -186 66 -81 27 302 129 46 13 -92 -1 166
4419 166 127 -33 9 -85 -2 57 87 77 12 -13 45 25 268 194 -124 -234 -236 186 -170 210 -4 -154 124 -202 14
4444 14 68 100 0 186 139 -35 -35 -188 94 -48 164 66 -137 -87 51 312 80 217 -142 219 166 -116 22
4467 22 19 -16 16 96 -66 -25 -116 91 -256 70 -59 67 -187 130 -1 -99 143 30 198 -112 -319 -99 -18
4490 -18 53 107 -133 -52 48 -163 118 228 128 -116 -204 -30 243 -181 -141 122 178 208 109 -32 219 172 73 31
$$ packed form
4326I4j08L1p0k0n7J74O1J05j61j28K20j91J5j06K49j27n1p8K9J73l12K57N5L5
4350H9L9l66K77k78K04m1K16k01k43N60l98L7N9o7p1m9J63M5o0KL14k43P8L23
4374C89k25M9j76K09L5j38j97K05k7j89J94k55J16p5o5J10L6j52J32J90k51R1
4396Fj49j60J66K56Q3j72O0p6J28M8J17l97r6K52j47J08K75j73q3l3j05R1J67
4419A66l9j60M2r4Q3N9L0j0o5k5N8k0K43p4l18j10kM22l56L80k14j50K78l26K16
4444A4N4L2j00J86m7j74%j53K82j42K12r8k03N0J38K61k32J37l59L61n3k82J38
4467B2ll5L2Q0j62M1r1K07l47L26j29J26k54L17j31r8K42j13J68l10k07K20Q1
4490a8P1N4k40Q1J00k11K81J10j00k44q8J74K73m24M0K63N6L0r9j41K51m7r9m2
$$ plain form
4514 31 1 -30 -126 300 -217 8 -38 -103 -56 -173 -60 -58 68 33 -139 84 -45 -124 167 -129 39 122 80 -84
4538 -84 96 194 241 -83 -49 -183 -70 63 -41 -75 -362 132 78 274 -359 41 -49 -77 12 119 -170 -225 0
4561 0 -128 39 -54 73 -216 38 95 -97 -39 -182 -127 -14 -27 -97 51 46 -5 134 -65 -74 -30 -61 -183 -113 -166 33
4587 33 -40 -246 -32 -50 -12 -237 2 -18 -214 200 -16 -114 109 -70 197 62 128 64 20 -214 15 69 -18 92
4611 92 -188 -87 175 33 -187 -142 -184 -54 90 105 14 -18 -134 -79 112 -43 186 304 87 -13 -159 2
4633 2 100 -37 122 190 27 -19 -102 128 -79 100 100 -238 359 -103 -69 -35 247 -99 -139 -148 -105 -147 -41 -332 12
4658 12 52 59 225 -341 39 51 243 11 -88 200 -157 92 144 190 -61 -67 213 3 -277 -342 -24 -129 -203 92
4682 92 -99 -171 75 -10 167 -38 48 35 -319 -55 -29 -18 -119 8 -73 283 49 69 -97 187 22 -22 194
$$ packed form
4514C1l0l1r6M26n17K25m6o5M7j17J13KJ26l5j72K23j29p9K91k96J68Q3m2j64
4538h4J80R8M7l24L4j34J13J33j04l4k87M94n4J96o33M00r0k8Q9J07k89n5K25
4561@j28J67r3J27k89K54N7j92N8j43N5J13j3p0J48nn1J39j99rM4l1j22P0n3J99
4587C3p3k06K14j8L8k25K39k0j96M14k16r8K23j79K67j35O6o4m4k34K29N4q7J10
4611I2k80J01K62j42k20M5m2J30J44J5r1l2j16N5J91j55K29J18k17j00j46J61
4633BR8j37J59O8j63m6q3K30k07J79%l38N97m62L4L4K82l46m0rM3m2J06k91L44
4658A2M0PJ66n66L80J2J92k32r9K88l57K49N2M6k51oK80k10k80o5L18j05p4K95
4682I2j91p2K46q5J77k05Q6j3l54K64K6J1j01J27q1L56k34K0j66K84j65m4K16
$$ plain form
4705 194 -33 10 -77 39 -199 13 -187 -64 -57 -24 3 -131 -100 40 299 -113 -100 20 -35 55 141 -61 -11 163
4729 163 -24 -15 191 -66 -77 -43 209 -109 375 -16 -234 15 19 -67 140 104 -46 256 -21 -119 106 145 -167
4752 -167 -177 88 284 4 123 190 9 29 226 89 203 241 88 61 29 87 -194 -40 257 -58 -253 -205 36
4775 36 -104 -14 1 124 -189 -155 3 102 62 194 92 -51 -95 173 154 42 -110 74 -381 34 -151 -22 236
4798 236 -20 6 -212 -18 32 83 48 29 115 145 -85 168 226 -91 -137 -182 112 -290 -63 22 16 168 19 86 -116
4823 -116 -47 -157 40 133 147 90 -19 -85 112 75 75 -78 -99 -186 -62 -6 -145 26 -203 4 227 -47 -15 110
4847 110 75 -36 9 -245 -213 96 -162 -163 181 71 -141 -87 63 -104 -33 -105 -60 43 -186 -152 -56 44 11 -271
4871 -271 23 -64 24 -75 152 -35 -184 78 43 217 -19 29 -132 3 6 -53 -123 185 236 219 -166 3 -203 -52
$$ packed form
4705A94k27M3q7J16k38K12k00J23PL3K7j34L1J40K59m12J3J20n5R0Q6k02N0J74
4729A63j87RK06k57j1L4K52l18M84l91k18K49Mq6K07l6j50L02k77r8K25L9l12
4752a67j0K65J96k80J19O7j81K0J97j37J14L8j53k7l2N8k81J54K97l15j95M8K41
4775C6j40R0J5J23l13L4J58R9m0J32j02j43m4K68j9j12j52J84m55M15j85J29K58
4798B36k56K6k18J94N0N1l5j9Q6L0k30K53N8l17m6m5K94m02K27Q5oJ52j49O7k02
4823a16O9j10J97R3J4n7j09o6J97l7%j53k1q7J24N6j39J71k29K07K23k74L2J25
4847A10l5j11M5k54L2L09k58jL44j10k12N4J50j67P1p2M5J03k29L4R6J00l3k82
4871b71K94q7Q8r9K27j87j49K62l5J74k36M8j61J35Ln9p0L08N1j7l85J69k06J51
$$ plain form
4895 -52 98 -12 64 54 -132 -75 -38 -68 -198 77 -177 0 157 -25 -142 -338 -99 -83 6 4 30 45 39 38 -148
4920 -148 257 64 115 -95 -49 57 183 129 -59 135 12 232 13 105 -58 -2 285 137 128 10 137 -20
4942 -20 -4 250 70 41 -256 -17 -15 10 -56 -248 -10 -107 191 46 -51 343 123 32 372 89 78 -15 -204 153
4966 153 -43 89 -194 -8 55 188 305 -136 -53 67 -195 -233 -94 -86 46 71 -147 73 136 25 148 68 273
4989 273 52 -149 -55 228 19 -89 66 21 -222 34 11 90 62 -246 57 -41 -2 -150 188 -19 -85 -76 187
5012 187 38 -23 50 36 376 -43 -120 239 154 -11 50 -7 195 225 -25 14 -98 177 211 -9 -85 143 167 142
5036 142 179 185 -70 -92 -5 228 -5 -169 5 -151 -303 49 5 -53 100 -12 217 -49 153 3 -20 -97 63
5059 63 -11 -160 -100 -112 416 -81 -242 -104 -297 14 -75 290 51 30 -105 90 -118 -133 -60 28 -183 -233 -152 -104
$$ packed form
4895e2J50j10P6j0j86N7L7l0j30K75k54J77J57j82j17j96K39J6Q9kK6J5ojj86
4920a48M05j93N1k10M6J06J26n4j88J94j23K20k19R2j63N6K87j48rj18J27j57
4942b0J6K54j80k9k97K39KK5o6j92K38r7K98j45r7L94k20r1L40k83j1r3j89L57
4966A53j96J32k83J86O3J33J17m41Q3J20k62l8J39QJ32K5k18K20O3j11J23q0K05
4989B73k21k01R4K83k09j08J55m5k43K56k3P9k8l08L03r8L9j48L38k07o6RK63
5012A87j49o1P3j4L40m19p7L59q5j65O1n7K02L0k50L9j12K75L4k20p6K28K4k5
5036A42L7Ok55k2Q7K33k33j64J74j56j52L52m4n8J53j12K29k66K02j50k3p7J60
5059F3p4j49O0j2N28m97j61J38j93L11q9L65k39k1j35J95k08j5P3Q8k11n0Q1M8
$$ plain form
5083 -104 -215 -56 -122 -25 -82 -87 22 -3 -48 -4 -164 -187 -38 -200 6 97 -285 71 112 163 185 -70 220 -105
5107 -105 -260 230 174 -64 24 261 -100 103 147 -35 201 -193 -161 -46 -117 -110 88 -16 -2 -96 161 14 48
5130 48 217 -191 -11 227 -121 -88 -72 -60 191 -34 8 8 64 30 -64 -1 -22 20 60 -241 -122 -103 -85 -125 29 183
5156 183 -14 19 26 -73 86 82 -109 84 79 65 -181 -83 -70 9 133 -99 -44 251 49 115 -43 -105 -36 -15 169 -77
5182 -77 63 -177 118 -15 185 -52 15 -286 -119 -41 -14 -122 99 -78 -124 153 -228 -3 -229 -41 -9 -54
5204 -54 -92 -125 -250 -253 75 -79 130 118 -114 -212 184 436 168 39 -321 103 124 240 -44 -110 88 13 1 210
5228 210 51 -2 160 -91 -75 63 -87 -129 115 139 98 -357 -66 398 -111 219 69 13 -76 157 -73 135
5250 135 -102 -408 43 162 -154 -226 -256 -106 -201 -201 184 -76 91 -13 26 22 -79 -87 153 -27 -88 68 -121 -111
$$ packed form
5083a04j11J59o6R7n7nJ09k5m5M4j60k3J49j62K06R1l82L56M1N1K2k55K90l25
5107a05j55M90n6k38Q8K37l61K03M4j82K36l94L2J15p1PJ98j04J4r4K57j47L4
5130D8J69m08J80K38l48L3J6J2K51k25M2%N6l4r4O3k1M2M0l01J19J9J8m0J54J54
5156A83j97L3Pr9J59mj91J93nj4k46R8J3P9J24k32N5K95k02O6j58o2O9K1J84k46
5182g7J40k40K95j33K00k37O7l01J67P8K7j08K21j77m6K77l81K25k26J88L2m5
5204e4l8l3j25lL28j54K09j2k32r8L96K52k68j29l60M24K1J16k84o6J98p5j2K09
5228B10j59n3J62k51J6J38j50m2K44K4m1m55K91M64n09L30j50n6q9K33k30K08
5250A35k37l06M51J19l16p2l0J50r5%L85k60J67j04L9mj01qK40j80o1J56j89J0
$$ plain form
5274 -111 -32 -107 190 61 54 60 -2 73 148 46 -11 -166 -209 -162 77 -109 -186 -39 -94 120 -53 -27 183 -321 -95
5299 -95 -106 110 -89 -23 -126 34 -62 247 16 -136 101 59 154 -136 256 -276 -144 -27 109 180 -170 62
5321 62 -2 -120 -6 227 145 -200 -224 32 -90 -71 -149 74 117 -80 35 -107 -159 -78 -82 121 44 -45 72 -80
5345 -80 22 152 -144 156 191 225 85 -313 -93 -37 -122 -16 134 285 42 132 -202 -410 6 4 -256 63 76
5368 76 75 -63 131 -25 -25 -78 301 111 -107 178 -209 77 317 114 74 -14 -222 -11 -29 -47 153 -35 39 -225
5392 -225 -42 -7 -75 -66 -254 244 80 89 35 -236 -185 -33 95 120 46 -35 -119 -90 79 50 -175 -131 -12 -27 -196
5417 -196 -17 105 131 6 68 -190 10 -22 -46 34 156 -32 -89 -20 11 306 49 23 336 472 -51 135 221
5440 221 -41 83 240 -126 356 -70 184 -120 -68 1 9 -81 -86 -28 61 67 61 153 246 70 -176 17 -87 40 -156
$$ packed form
5274a11P9p5K97j29pOo2P5P5j02n7j55m3M7K39j86p7J47n5K14j73K6K10n04K26
5299i5j1K16j99O6j03J60r6L09k31j52K37m2R5k90L92n32J32J17J36P1l50K32
5321F2o4j18J14K33q2l45k4K56j22J9p8K23M3j97J15j42n2Q1mK03p7q9J17j52
5345h0J02J30k96L00L5L4j40l98K20N6q5J06J50J51k43R0l34k08M16kk60L19J3
5368G6jj38J94j56%n3L79j90k18K85l87K86K40k03m0q8k08K11j8j8K00j88P4k64
5392b25J83L5o8Rj88M98j64Rn4k71N1J52J28K5p4q1q4K9J69k9k25M4J19j5j69
5417a96J79J22K6j25O2k58K00l2k4Q0J22j88n7O9L1K95k57k6L13J36n23J86Q6
5440B21k62J24J57l66M82m26K54l04N2O9Qr0nN8Q9OoR2R3j76k46J93j04J27j96
$$ plain form
5465 -156 75 -170 -247 3 -63 198 77 -41 74 -146 13 179 -252 144 -88 50 -26 -176 -26 -129 108
5486 108 3 -40 122 -42 -172 -71 -46 109 -11 53 41 -49 3 169 16 32 61 29 -33 91 -49 42 -242 -74
5510 -74 9 69 -139 -183 -282 183 34 -44 220 -209 204 -81 66 85 -50 -88 -14 44 40 -47 -223 51 93 -22 189
5535 189 -42 193 -60 2 207 14 103 4 -97 91 147 143 14 -184 113 -270 144 78 -92 -33 -167 -49 151
5558 151 151 148 -89 -97 -289 -4 -29 -25 -33 66 24 -94 49 -102 31 -124 279 28 161 -104 -185 6 30 195 -93
5583 -93 -102 -49 -61 14 -125 -110 -49 -47 -56 137 -23 106 103 4 -124 139 0 96 2 -3 96 63 110 -70 189 -13 -32 -28
5611 -28 1 -106 -28 -1 -163 28 -56 -90 99 -201 -124 -270 18 131 -190 123 -12 90 -87 139 -28 -146
5633 -146 -42 96 121 -57 -77 -84 -130 -141 -190 -49 -196 271 -146 59 -13 -106 -149 -44 -141 -163 12 -79 90 11 -115
$$ packed form
5465a56K31k45p7K50o6K61j21j18J15k20J59J66m31L96k32J38p6j50J50j03K37
5486A08j05m3J62j64j30J01K5J55j20O4j2r0N2J66j53J6K9l2o2J24j40R1k84J68
5510g4Q3O0k08m4r9M65j49p8K64m29M13k85J47J9j35l8P4N8mq7j76K74M2j15K11
5535A89k31K35k53O2K05j93Q9r9j01J88N6mj29j98K97l83M14o6j70N9j34J18K00
5558A51%lk37qj92K85k5MqR9m2j18J43j51J33j55M03k51J33k65q1J91K4J65k88
5583i3rN3j2P5j39J5O1KrJ93j60J29lr9j28K63j39R6r4nR9l3M7j80K59k02j9M
5611b8K9j07P8K7j62J91q4l4J89l00P7j46K88J13l21L13j35J02j77K26j67j18
5633a46J04J38K5j78k0pm6j1m9J41j47M67m17K05p2r3m3J05r7k2J75r1J69p9j26
$$ plain form
5658 -115 -177 384 -22 -69 138 4 -3 -23 -193 83 137 -59 -53 9 -72 47 100 119 157 135 -21 19 26 -177 -117 -70
5684 -70 -167 -255 -64 306 -30 8 257 94 -212 -16 -181 -12 146 -15 -79 133 -58 120 100 100 -129 130 259
5707 259 -103 -203 -91 60 -86 182 60 77 40 66 -387 33 136 51 108 -218 -35 191 -154 -36 24 -117
5729 -117 -14 -150 42 -196 54 -9 256 9 33 79 46 -226 -44 -143 70 128 -136 -43 -231 -99 -15 16 -57
5752 -57 -98 30 39 29 338 9 -49 276 -157 271 -157 -55 -47 -179 -98 -100 -61 130 41 -96 136 -66 234 -130
5776 -130 -94 134 -182 -365 -48 -297 5 -1 -68 144 -8 -182 229 -43 -11 198 -35 59 66 206 263 57 234
$$ packed form
5658a15o2N61m06m7K07j34pk0j70K76N4j96OO2q1J19N3J9L8k2j56M0Pk03O0M7
5684g0r7q8J91L70l36L8K49j63l06J96j65J69J58j61o4K12j91J78k0%k29K59J29
5707B59l62j00J12J51j46K68j22J7l7K6m53M20J03q5N7l26J83K26l45J18O0j41
5729a17J03j36J92k38K50o3K65k47K4M6l3k72J82r9K13N8k64R3j88J32Q4L1p3
5752e7m1J28Rj0L09l29n8L25m33M28m28J02Qj32Q1kL9J91q9j37K32k02L00l64
5776a30L6K28l16j83L17k49L02oo7K12j52j74M11k72L2K09k33R4PJ40N7k06J77
$$ [...]
8191i
##END NTUPLES=NMR FID
##END=
