##TITLE=1H_Ser 5-2
 CDCl3, 8 sc, 
 25.8.2020
##JCAMPDX= 6.0         $$ Bruker NMR JCAMP-DX V2.0
##DATA TYPE= NMR FID
##DATA CLASS= NTUPLES
##ORIGIN= UXNMR, Bruker Analytische Messtechnik GmbH
##OWNER= root
$$ XWIN-NMR		Version 3.5
$$ Tue Aug 25 12:16:51 2020 Russian Standard Time (UT+4h)  she@DPX200
##.OBSERVE FREQUENCY= 200.1315066352
##.OBSERVE NUCLEUS= ^1H
##.DELAY= (6, 6)
##.ACQUISITION MODE= SIMULTANEOUS
##.ACQUISITION SCHEME= undefined
##.AVERAGES= 8
##.DIGITISER RES= 18
##SPECTROMETER/DATA SYSTEM= spect
##.PULSE SEQUENCE= zg30
##.SOLVENT NAME= CDCl3
##.SHIFT REFERENCE= (INTERNAL, CDCl3, 0, 15.7039)
##AUDIT TRAIL= $$ (NUMBER, WHEN, WHO, WHERE, WHAT)
$$ ##TITLE= Audit trail, XWIN-NMR		Version 3.5
$$ ##JCAMPDX= 5.01
$$ ##ORIGIN= Bruker BioSpin GmbH
$$ ##OWNER= she
$$ F:/spectra/data/she/nmr/H-F/1/audita.txt
$$ ##AUDIT TRAIL=  $$ (NUMBER, WHEN, WHO, WHERE, WHAT)
(   1,<2020-08-25 12:14:06.37 +0400>,<she>,<DPX200>,
      <created by zg, POWCHK disabled, PULCHK disabled
       configuration hash MD5:
       00 E9 B6 7A A2 85 ED C7 34 08 36 98 17 FE 4E 26
       data hash MD5: 16K
       AC BD 26 FF 40 67 EE 58 91 FE 24 24 16 37 97 B9>)
$$ ##END=
$$ 
$$ hash MD5
$$ 71 CA 19 53 BA 3A 3A 04 AA 9E 60 25 B4 02 22 1F
##$RELAX= 
##$RELAX= 
##$RELAX= 
##$RELAX= 
##$RELAX= 
##$RELAX= 
$$ Bruker specific parameters
$$ --------------------------
##$DU= <F:/spectra>
##$EXPNO= 1
##$NAME= <H-F>
##$PROCNO= 1
##$TYPE= <nmr>
##$USER= <she>
##$AMP= (0..31)
100 100 100 100 100 100 100 100 100 100 100 100 100 100 100 100 100 100 
100 100 100 100 100 100 100 100 100 100 100 100 100 100 
##$AQSEQ= 0
##$AQ_mod= 1
##$AUNM= <au_zg>
##$AUTOPOS= <>
##$BF1= 200.13
##$BF2= 200.13
##$BF3= 200.13
##$BF4= 200.13
##$BF5= 200.13
##$BF6= 200.13
##$BF7= 200.13
##$BF8= 200.13
##$BYTORDA= 1
##$CFDGTYP= 0
##$CFRGTYP= 5
##$CHEMSTR= <none>
##$CNST= (0..31)
1 1 145 1 1 1 1 1 1 1 1 1 1 1 1 1 1 1 1 1 1 1 1 1 1 1 1 1 1 1 1 1 
##$CPDPRG= <>
##$CPDPRG1= <>
##$CPDPRG2= <>
##$CPDPRG3= <>
##$CPDPRG4= <mlev>
##$CPDPRG5= <mlev>
##$CPDPRG6= <mlev>
##$CPDPRG7= <mlev>
##$CPDPRG8= <mlev>
##$CPDPRGB= <>
##$CPDPRGT= <>
##$D= (0..31)
0 1.2 0 0 0 0 0 0 0 0.06 0 0.03 0 0 0 0 0.0002 0 0 0 0 0 0 0 0 0 0 0 0 
0 0 0 
##$DATE= 1598343245
##$DBL= (0..7)
120 120 120 120 120 120 120 120 
##$DBP= (0..7)
150 150 150 150 150 150 150 150 
##$DBP07= 0
##$DBPNAM0= <>
##$DBPNAM1= <>
##$DBPNAM2= <>
##$DBPNAM3= <>
##$DBPNAM4= <>
##$DBPNAM5= <>
##$DBPNAM6= <>
##$DBPNAM7= <>
##$DBPOAL= (0..7)
0.5 0.5 0.5 0.5 0.5 0.5 0.5 0.5 
##$DBPOFFS= (0..7)
0 0 0 0 0 0 0 0 
##$DE= 6
##$DECBNUC= <off>
##$DECIM= 32
##$DECNUC= <off>
##$DECSTAT= 4
##$DIGMOD= 1
##$DIGTYP= 9
##$DL= (0..7)
0 120 120 120 120 120 120 120 
##$DP= (0..7)
150 150 150 150 150 150 150 150 
##$DP07= 0
##$DPNAME0= <>
##$DPNAME1= <>
##$DPNAME2= <>
##$DPNAME3= <>
##$DPNAME4= <>
##$DPNAME5= <>
##$DPNAME6= <>
##$DPNAME7= <>
##$DPOAL= (0..7)
0.5 0.5 0.5 0.5 0.5 0.5 0.5 0.5 
##$DPOFFS= (0..7)
0 0 0 0 0 0 0 0 
##$DQDMODE= 0
##$DR= 18
##$DS= 0
##$DSLIST= <SSSSSSSSSSSSSSS>
$$ [...]
##$SUBNAM2= <"">
##$SUBNAM3= <"">
##$SUBNAM4= <"">
##$SUBNAM5= <"">
##$SUBNAM6= <"">
##$SUBNAM7= <"">
##$SUBNAM8= <"">
##$SUBNAM9= <"">
##$SW= 16.880792210976
##$SWIBOX= (0..15)
0 0 2 0 0 0 0 0 0 0 0 0 0 0 0 0 
##$SW_h= 3378.37837837838
##$TD= 16384
##$TD0= 1
##$TE= 0
##$TE2= 300
##$TE3= 300
##$TEG= 300
##$TL= (0..7)
0 120 120 120 120 120 120 120 
##$TP= (0..7)
150 150 150 150 150 150 150 150 
##$TP07= 0
##$TPNAME0= <>
##$TPNAME1= <>
##$TPNAME2= <>
##$TPNAME3= <>
##$TPNAME4= <>
##$TPNAME5= <>
##$TPNAME6= <>
##$TPNAME7= <>
##$TPOAL= (0..7)
0.5 0.5 0.5 0.5 0.5 0.5 0.5 0.5 
##$TPOFFS= (0..7)
0 0 0 0 0 0 0 0 
##$TUNHIN= 0
##$TUNHOUT= 0
##$TUNXOUT= 0
##$USERA1= <user>
##$USERA2= <user>
##$USERA3= <user>
##$USERA4= <user>
##$USERA5= <user>
##$V9= 5
##$VALIST= <valist>
##$VCLIST= <CCCCCCCCCCCCCCC>
##$VD= 0
##$VDLIST= <DDDDDDDDDDDDDDD>
##$VPLIST= <PPPPPPPPPPPPPPP>
##$VTLIST= <TTTTTTTTTTTTTTT>
##$WBST= 1024
##$WBSW= 4
##$XGAIN= (0..3)
0 0 0 0 
##$XL= 0
##$YL= 0
##$YMAX_a= 31250
##$YMIN_a= -37726
##$ZGOPTNS= <>
##$ZL1= 120
##$ZL2= 120
##$ZL3= 120
##$ZL4= 120
##$ABSF1= 10
##$ABSF2= 0
##$ABSG= 5
##$ABSL= 3
##$ALPHA= 0
##$AQORDER= 0
##$ASSFAC= 0
##$ASSFACI= 0
##$ASSFACX= 0
##$ASSWID= 0
##$AUNMP= <proc_1d>
##$AZFE= 0.1
##$AZFW= 0.1
##$BCFW= 1
##$BC_mod= 2
##$BYTORDP= 1
##$COROFFS= 0
##$CY= 11.3945322036743
##$DATMOD= 1
##$DC= 2
##$DFILT= <>
##$DTYPP= 0
##$F1P= 16.9975609425685
##$F2P= -3.02152046262296
##$FCOR= 0.5
##$FTSIZE= 0
##$FT_mod= 4
##$GAMMA= 1
##$GB= 0.15
##$INTBC= 1
##$INTSCL= 1
##$ISEN= 128
##$LB= 0.24
##$LEV0= 0
##$LPBIN= 0
##$MAXI= 10000
##$MC2= 0
##$MEAN= 0
##$ME_mod= 0
##$MI= 1.114404
##$NCOEF= 0
##$NC_proc= 0
##$NLEV= 6
##$NOISF1= 3.799351
##$NOISF2= 2.8
##$NSP= 1
##$NTH_PI= 0
##$NZP= 0
##$OFFSET= 15.70392
##$PC= 1
##$PHC0= -10126.69
##$PHC1= 3.000921
##$PH_mod= 1
##$PKNL= yes
##$PPARMOD= 0
##$PSCAL= 0
##$PSIGN= 0
##$REVERSE= no
##$SF= 200.130013532006
##$SI= 16384
##$SIGF1= 3
##$SIGF2= 2
##$SINO= 400
##$SIOLD= 16384
##$SREGLST= <1H.CDCl3>
##$SSB= 0
##$STSI= 0
##$STSR= 0
##$SW_p= 3612.71676300578
##$SYMM= 0
##$S_DEV= 0
##$TDeff= 0
##$TDoff= 0
##$TI= <>
##$TILT= no
##$TM1= 0
##$TM2= 0
##$TOPLEV= 0
##$USERP1= <user>
##$USERP2= <user>
##$USERP3= <user>
##$USERP4= <user>
##$USERP5= <user>
##$WDW= 1
##$XDIM= 8192
##$YMAX_p= 0
##$YMIN_p= 0
$$ End of Bruker specific parameters
$$ ---------------------------------
##NTUPLES= NMR FID
##VAR_NAME=  TIME,          FID/REAL,        FID/IMAG
##SYMBOL=    X,             R,               I
##VAR_TYPE=  INDEPENDENT,   DEPENDENT,       DEPENDENT
##VAR_FORM=  AFFN,          ASDF,            ASDF
##VAR_DIM=   8192,          8192,            8192
##UNITS=     SECONDS,       ARBITRARY UNITS, ARBITRARY UNITS
##FACTOR=    0.000296,      1,               1
##FIRST=     0,             0,               0
##LAST=      2.424536,      0,               0
##MIN=       0,             -37726,          0
##MAX=       2.424536,      31250,           0
$$ Real data points
##PAGE= N=1
##DATA TABLE= (X++(R..R)), XYDATA
0 0 0 0 0 0 0 0 0 0 0 0 0 0 0 0 0 0 0 0 0 0 -8 8 -8 8 -8 8 -16 16 -16 16 -24 24 -31 32 -39 40 -48 55 -56 64 -72
41 -72 80 -88 100 -111 121 -135 151 -164 183 -199 219 -241 266 -295 326 -361 402 -448 504 -569 648
62 648 -745 874 -1040 1279 -1641 2278 -3703 15121 -12607 -10723 31250 7550 -2450 4329
76 4329 9114 11292 8874 -2106 3196 11032 2546 -4097 9920 1299 -5459 14914 4947 -14053
90 -14053 6784 9479 -7746 -5214 -3461 -1804 2551 -10688 -9705 7376 84 -16220 -4272 6494
104 6494 -8711 -9457 5285 -2413 -4196 7580 -1624 -1966 6190 -4355 -212 8087 -3099 -1158
118 -1158 8377 1524 -597 5838 2857 -1935 4158 3773 -3950 5280 8704 -1187 3803 5061 -1467
133 -1467 4920 2584 -5365 4360 4537 -4036 1524 3078 -3551 -762 2110 -4319 -2782 3885 -1812
148 -1812 -5261 3005 2116 -1142 2146 -2671 -7 6408 -3952 -4595 7487 2601 -3776 2825 3435
163 3435 -213 579 -121 -1464 2867 3866 -795 2849 3695 -1306 3778 3946 -3913 2683 6942 -2950
179 -2950 -1105 5379 1715 -528 184 -874 1653 1845 -4243 -1706 4680 -124 -3228 2999 965 -2829
195 -2829 2171 -138 -3002 3068 2115 -2266 1335 1186 -563 2563 -343 -2988 2705 2987 -2874 324
211 324 4001 -424 493 3036 -570 577 3306 -1329 -50 4151 260 649 3450 -1154 -1354 3424
227 3424 -385 -2283 2255 668 -1297 1518 -184 -2330 1818 416 -3301 850 1323 -2449 1
242 1 534 -2749 1125 1437 -3773 -1214 1053 -2361 -1154 684 -2294 -352 1441 -2782 -2053 1667 -1084
259 -1084 -2283 1377 -463 -961 2061 -1132 -2242 2261 452 -2021 1623 185 -1617 1833 534
274 534 -1674 1782 1552 -1974 624 1550 -1296 857 2035 -1201 815 2699 -1423 -80 2205 -1095
290 -1095 377 2843 -856 -406 2400 -640 -626 2163 -94 -914 1781 -186 -1653 1777 254 -1791
306 -1791 1214 195 -2272 945 48 -2960 492 425 -2229 140 173 -2843 -489 532 -2499 -621
322 -621 977 -1988 -1351 930 -1881 -1199 1448 -1616 -1321 1714 -1054 -1474 1640 -790 -1221 2244 -115
339 -115 -1528 1420 421 -1215 1413 1031 -837 1433 913 -1442 1089 1635 -1363 1055 1716 -1659 771
356 771 1897 -1736 -330 1879 -796 -321 1004 -1100 -479 882 -1052 -680 1619 -994 -1643 1521
372 1521 -595 -1967 1744 496 -2299 970 647 -1409 429 -94 -683 1411 -99 -1693 1363 798
388 798 -2203 173 2123 -1235 -1021 1726 -1027 -1114 1127 -693 -253 746 -1783 -206 1510 -2254 -1188
405 -1188 1805 -763 -1848 809 126 -2018 0 455 -1208 232 257 -1377 740 -19 -2142 1828
421 1828 1175 -2316 947 1646 -1276 310 1521 -246 592 1466 124 211 1756 -85 -101 2637 67
438 67 -358 2582 -289 -955 2709 62 -928 2217 -15 -1191 1068 352 -1201 399 686 -1203 -167
455 -167 202 -1870 58 700 -3105 -63 1651 -3260 -1521 915 -2372 -1402 486 -1835 -1620 -337
471 -337 -1456 -1454 -298 -1415 -1725 1049 -1259 -3103 1571 -85 -3626 958 1127 -2838 -252 252 -1402
488 -1402 -299 -771 -863 740 -315 -2598 -88 1627 -2219 -1616 2312 -942 -2266 1753 -555 -1547
504 -1547 1021 -618 -523 904 -1034 -518 908 -1054 -908 1515 123 -2200 741 1792 -2141 -532
520 -532 1996 -388 -45 518 -822 1188 830 -1549 1102 1374 -1033 85 1255 -622 -938 922 107
537 107 -754 586 -564 -1324 962 -441 -1481 779 -509 -965 471 -1035 -1002 869 -469 -1252 449
554 449 -22 -1181 -105 399 -1174 -63 1017 -971 -358 382 -696 276 392 -719 1118 660 -1610
571 -1610 659 1795 -712 -839 1405 846 -722 70 391 224 477 -420 222 1419 -1194 -995 2036
588 2036 -401 -1685 1217 1116 -1117 -781 259 255 -143 -923 -383 1024 -339 -2068 746 1023 -2183
605 -2183 -320 1440 -916 -1001 120 -503 -39 -144 -782 231 54 -1395 -409 793 -1408 -1168 1414
622 1414 -549 -2224 391 246 -1381 -477 -657 -192 550 -1466 -1239 1084 -136 -1847 269 840 -1020
639 -1020 -570 229 -775 328 736 -1356 104 1097 -885 -97 587 -579 600 1123 -869 91 1389
656 1389 -252 -530 1159 513 -232 1191 6 -580 1267 381 -657 1220 341 -733 945 184 -675
673 -675 948 357 -771 749 572 -1159 33 952 -623 -214 858 -581 -279 403 -1319 38 1162
690 1162 -1283 -799 1014 -625 -930 371 -517 -459 538 -591 -1127 723 13 -1301 424 112 -825 681
708 681 -177 -1555 772 728 -1221 242 662 -550 149 322 -741 572 1004 -822 -54 1320 -304
725 -304 -263 1205 -237 32 1446 -265 -338 1335 60 -320 1272 272 -185 1090 60 -614 1215
742 1215 682 -819 953 794 -815 542 700 -769 527 818 -816 445 730 -1044 -2 796 -729
759 -729 -115 959 -845 -572 822 -577 -682 882 -377 -862 646 -533 -872 685 -337 -1022 782
776 782 -68 -1256 453 102 -1171 397 525 -888 52 505 -936 243 566 -887 219 896 -967
793 -967 -106 917 -733 -108 1012 -515 -335 1054 -339 -641 845 74 -235 893 -196 -555 1066
810 1066 34 -901 1163 604 -811 645 463 -716 691 675 -729 521 773 -585 187 625 -555
827 -555 370 927 -830 -48 1111 -679 -583 1053 -291 -376 833 -538 -697 614 -321 -807 508 -377
845 -377 -844 454 -394 -1231 352 114 -1301 58 156 -1287 -166 117 -1162 54 545 -1083 -143 339
863 339 -888 -4 604 -627 -114 921 -497 -369 927 -168 -309 1211 134 -501 1091 207 -448
880 -448 920 418 -40 921 275 -466 999 546 -494 828 897 -677 261 1106 -588 -102 920 -73
898 -73 25 384 -435 268 491 -942 99 1212 -614 -922 959 149 -947 404 464 -350 129 -15 -211
917 -211 535 -235 -389 1063 74 -966 672 739 -1003 -259 991 11 -340 199 -65 -44 92 -366 476
936 476 484 -964 51 947 -682 -705 964 373 -632 -37 291 -6 -87 -135 -15 733 -111 -543 761 95
956 95 -668 655 558 -351 442 366 -271 296 517 83 126 502 28 254 504 -359 231 863 -321 31 822
977 822 -539 -199 625 -350 -223 420 -136 -399 20 -187 -385 98 37 -590 -33 -206 -906 419 -132 -1262
997 -1262 405 422 -1095 -377 64 -405 -61 -314 -265 102 -190 -635 -49 614 -536 -527 994 -159 -850 634
1017 634 -33 -298 686 -219 41 720 -283 -34 585 -20 -46 751 419 -576 225 836 -421 122 1011 -347
1037 -347 153 487 -375 612 347 -822 665 779 -725 -115 566 51 -327 361 268 -410 444 -63 -674
1056 -674 544 -14 -640 779 -274 -998 686 -178 -699 331 -92 -572 85 44 -647 -303 306 -290 -309
1075 -309 394 -725 -256 642 -948 -201 821 -699 -417 396 -543 -67 264 -415 -3 368 -78 -534 327
1094 327 435 -555 282 395 -374 529 253 -769 743 489 -588 582 389 -450 286 448 -136 248 449
1113 449 -10 -13 563 -127 -195 851 -179 -236 787 -315 -287 778 -270 -389 762 -18 -324 137 -88
1132 -88 -190 228 -15 -518 246 245 -794 9 449 -771 -60 409 -694 50 129 -772 -40 291 -471 -168
1152 -168 260 -457 -413 292 -228 -421 444 -174 -661 400 -200 -531 458 -32 -454 477 21 -454 371 94
1172 94 -324 360 393 -301 148 481 -299 227 645 -198 156 677 -266 77 658 -176 177 620 -114 -71 622
1193 622 -66 -209 533 160 -124 427 72 -411 491 115 -405 472 162 -494 191 74 -576 221 222 -506 -15
1214 -15 177 -441 -139 131 -443 -17 317 -576 -251 306 -488 -314 420 -272 -254 278 -350 -383 294 -84 -290
1235 -290 339 -116 -375 317 -59 -357 349 202 -375 374 264 -432 177 381 -197 201 412 -190 208 281
1255 281 -288 243 572 -170 46 579 -155 -25 548 -18 -63 565 79 -234 357 33 -82 381 -32 -194
1275 -194 548 2 -546 388 252 -375 112 224 -398 -62 131 -345 18 80 -357 37 70 -609 -15 286 -542
1296 -542 -185 431 -336 -492 175 -180 -294 197 -139 -197 110 -299 -257 340 -208 -427 492 -21 -542 163 279
1317 279 -374 79 306 -149 128 102 -209 202 225 -193 356 350 -384 101 525 -212 -121 593 149 -105 225 69
1339 69 53 314 -6 32 535 -60 -187 506 -97 -268 496 186 -333 147 145 -184 45 53 -6 37 -57 -329 122
1362 122 48 -579 56 326 -510 -239 311 -368 -253 73 -256 -20 -75 -352 -74 58 -386 -126 258 -185 -370
1383 -370 245 -93 -533 306 106 -334 162 7 -214 233 -179 -259 486 54 -276 222 185 -171 100 389 -57
1404 -57 117 416 -74 32 473 -171 123 629 -244 20 424 -119 66 315 -90 92 320 -129 -187 206 180
1425 180 -351 215 334 -442 157 112 -381 251 60 -446 312 37 -484 140 -96 -384 79 166 -332 -381 201
1446 201 -187 -449 53 -164 -128 313 -542 -367 535 -480 -291 484 -188 -360 167 -5 -148 -64 45 12 147
1467 147 80 -412 232 448 -557 165 593 -345 126 359 -322 278 285 -124 290 256 -97 78 321 45 15
1488 15 422 145 -318 490 95 -422 512 192 -200 413 -204 -252 462 -66 -290 272 128 -244 -61 138 -196
1509 -196 -170 260 -270 -9 281 -622 -130 417 -470 -221 234 -223 -91 -84 -407 -77 207 -200 -358 108 -23
1530 -23 -381 70 111 -385 228 81 -490 275 46 -364 265 168 -213 201 106 -252 121 273 -94 18 485
1551 485 -42 -191 399 -52 39 455 -108 62 508 -191 -67 534 -23 -27 287 186 -76 148 56 -129 369
1572 369 164 -250 163 280 -358 110 207 -341 212 124 -415 54 150 -299 -32 109 -167 -138 70 -218 -288 269
1594 269 -266 -337 309 -169 -439 152 -185 -353 198 -194 -237 115 -167 -349 93 56 -307 106 188 -299 -21
1615 -21 191 -323 71 321 -350 84 297 -246 13 318 -70 102 368 -99 -15 365 125 -71 454 147 -71
1636 -71 452 121 -161 423 149 -65 403 101 -162 307 126 -168 257 274 -119 107 226 -208 73 282 -181
1657 -181 10 320 -276 -61 184 -270 -93 289 -187 -197 234 -157 -322 159 -101 -156 129 -104 -322 131 -7
1678 -7 -336 239 75 -316 125 93 -379 108 245 -215 133 211 -233 11 274 -206 7 427 -54 3 222 -70
1700 -70 12 417 -28 -87 443 52 -99 286 106 -77 397 148 -195 302 126 -182 192 259 -170 263 184 -336
1722 -336 142 303 -310 35 338 -221 -73 115 -230 -30 227 -252 -125 207 -257 -226 214 -165 -318 231
1742 231 -124 -357 123 -90 -325 83 -24 -289 96 -35 -376 78 -22 -344 127 137 -407 -22 156 -358
1762 -358 -100 123 -133 46 237 -208 -55 294 -134 -53 358 -43 -139 310 -26 -160 346 131 -167 282 110
1783 110 -187 251 136 -107 299 164 -208 214 220 -208 214 315 -144 111 277 -163 -29 319 -143 -3 298
1804 298 -169 -61 246 -183 -133 283 -186 -151 234 -158 -363 171 -10 -340 80 -14 -348 66 -94 -337 77
1825 77 39 -346 92 0 -378 41 34 -288 -5 262 -228 -146 166 -66 -55 228 -121 -43 288 -204 -123 397 -9
1848 -9 -79 388 21 -171 249 104 -69 234 195 36 167 175 -156 187 218 -112 242 364 -245 95 321 -263
1870 -263 33 355 -55 -27 130 -142 1 165 -124 -80 260 -122 -317 237 -34 -348 236 6 -293 93 -94
1891 -94 -318 82 0 -290 37 -58 -340 -24 48 -294 -25 205 -264 -124 203 -330 -181 219 -160 -117 173 -233
1913 -233 -36 190 -200 -185 359 131 -207 123 50 -115 194 89 -167 311 128 -198 197 136 -163 191 245
1934 245 -115 143 138 -197 41 240 -48 -36 289 -130 -100 216 -143 -26 202 -163 -114 242 -120 -137 132 -49
1956 -49 -125 92 -56 -217 33 -65 -324 113 135 -401 -63 16 -302 -19 -156 -221 84 -26 -348 -150 80 -139
1978 -139 -221 13 -119 -218 -8 -226 -212 206 -196 -187 210 -168 -249 94 -121 -59 119 -101 -120 114 115 -170 38
2001 38 251 -33 106 190 -156 176 225 -164 247 318 -117 162 153 40 176 219 27 96 255 -20 -70 190 137
2024 137 -185 249 37 -146 216 -160 -185 219 -59 -166 101 -131 -218 -6 -24 -62 -51 -10 -225 -97 55 -283
2046 -283 -120 205 -182 -88 95 -231 1 70 -183 39 89 -86 -127 -12 -15 15 131 21 -118 140 76 -252 153
2069 153 129 -135 176 45 -122 155 -32 -175 184 86 -60 55 15 -28 -55 45 -60 -33 160 -158 -46 171
2091 171 -219 -63 238 -128 -24 89 -116 -38 65 -66 -79 110 6 -212 -62 69 -195 32 20 -210 78
2112 78 -25 -298 -39 32 -246 7 -3 -221 -96 -60 -104 -49 33 -81 -119 -5 -226 -171 62 -112 -172 156 -159
2135 -159 -188 135 -119 -135 132 2 -92 25 33 -25 136 89 -47 141 190 -146 92 247 -30 142 236 69 157
2158 157 149 -27 118 199 13 130 264 -50 -24 188 36 -39 196 57 -18 72 20 -93 105 -34 -68 145 -63
2181 -63 -135 -28 -46 -221 32 35 -226 -78 19 -181 -96 -52 -205 -41 -27 -230 -67 -1 -210 -30 74 -159 -126 76
2205 76 -134 -115 25 -16 -74 62 -96 -67 72 -16 -72 139 57 -120 107 10 -105 79 116 -56 19 139 -28 84
2229 84 85 -18 96 125 -79 45 152 -111 40 209 19 54 184 -10 -92 141 7 -2 153 -56 -86 79 -77
2252 -77 -150 119 31 -99 38 33 -178 12 24 -145 -64 1 -103 -66 -56 -173 -27 41 -182 -49 6 -147 -149 37 -142
2277 -142 -148 87 -68 -140 39 -73 -109 19 -84 -22 89 -83 -162 86 19 -96 91 19 -70 103 92 -87 47
2300 47 155 -30 109 82 -25 75 139 -69 38 225 -9 -3 104 -39 35 179 38 -33 141 -1 0 75 8 -36
2324 -36 134 45 -166 106 48 -85 39 56 -109 -49 16 -228 -5 -30 -199 15 87 -182 -84 15 -210 -62 -25 -98
2348 -98 -100 9 -149 -150 -20 -98 -115 93 -4 -118 45 -12 -148 171 -57 -68 107 20 -85 46 98 -1 136 120 -70
2373 -70 7 181 -5 49 187 -33 61 185 -37 28 226 -75 166 212 -46 -22 92 36 -48 45 74 -6 105 -16
2397 -16 -179 167 88 -137 160 60 -115 78 -84 -81 169 -26 -106 85 14 -137 -25 69 -37 -35 57 -152 -110 147
2421 147 -169 -147 152 -116 -19 76 -244 -34 61 -60 -19 7 -33 -137 -24 94 -133 14 103 -140 100 68 -223
2444 -223 193 129 -149 99 114 -26 100 77 -4 120 104 59 -18 155 59 -82 180 1 26 209 -91 -57 288
2467 288 -52 -31 199 -19 62 102 -41 3 133 60 -103 76 145 -158 -80 124 -169 42 125 -271 40 32 -218
2490 -218 37 114 -140 5 14 -71 -135 -84 -5 -112 142 -30 -215 130 -45 -161 104 13 -84 212 -26 -66 166
2513 166 35 -20 85 140 24 29 182 -21 60 195 -2 57 268 -57 -12 248 9 56 205 20 69 163 1
2536 1 -19 214 87 -54 152 141 -113 116 70 -74 168 83 -129 105 22 -109 69 56 -69 20 33 -149 -62 54
2560 54 -79 -91 97 -87 -114 63 -136 -131 110 -135 -69 91 -95 -187 -7 -62 -140 68 7 -82 16 -17 -140 11
2584 11 106 -168 19 58 -138 67 120 -129 33 116 -124 15 116 -57 -36 123 40 14 125 -45 0 118 38
2607 38 -42 222 24 -78 133 11 -19 170 87 -44 115 27 -75 62 39 -81 58 135 -75 31 77 -135 28
2630 28 94 -121 -35 62 -121 -103 35 -102 -91 106 -82 -142 19 -112 -100 77 -6 -124 43 -2 -180 63 14 -144
2654 -144 43 -17 -100 -27 -22 -104 44 85 -83 -28 52 -111 -17 131 -14 29 101 -20 -78 138 6 13 182 11 -20
2679 -20 101 36 -37 119 47 33 172 63 -122 71 55 -102 102 124 -38 42 21 -92 74 49 -48 -11 88 -81
2703 -81 -16 55 -68 -35 109 -9 -71 88 -93 -128 76 -4 -113 62 -50 -90 -36 -34 -134 -3 41 -158 -4 6
2727 6 -145 29 33 -128 2 23 -168 -18 70 -77 2 89 -16 -35 85 -106 -13 109 26 4 120 35 -46 113 -8
2752 -8 -33 152 91 -31 76 57 -17 45 96 -58 76 101 -106 30 103 -56 88 92 -49 -8 83 -32 -44 112 -73
2777 -73 18 65 -34 -123 -12 -7 -62 33 23 -122 33 -58 -126 29 -26 -154 33 -59 -150 -7 -50 -112 31 43 -57 -100
2803 -100 -26 -78 -52 62 -61 -23 70 -85 -75 70 -27 -59 116 -60 -52 81 -17 -7 52 37 40 105 12 -34 17 119 1
2830 1 70 70 -64 47 125 2 138 100 3 28 65 -55 24 34 -13 66 49 -46 -18 -8 -44 -40 112 11 -48 67 -93
2857 -93 -80 64 -104 -88 -5 -85 -30 10 -80 -82 8 -7 -66 -33 -12 -100 -73 57 -92 -58 46 -114 -11 70 -68 -19 -9
2884 -9 -5 -26 59 -32 -36 5 9 -18 122 35 -44 33 40 -33 94 28 -26 118 18 -72 114 90 22 36 47 -14 12 102 50 14
2914 14 133 8 -57 92 23 -26 82 -18 35 61 -63 -7 33 -90 -8 24 21 -74 -63 -68 -85 24 -64 -54 21 -22 -156
2941 -156 -89 -32 -84 -76 -45 -85 8 -59 -124 -98 4 -32 -36 -53 -48 -54 42 -53 -38 89 -8 22 65 -64 -72 15 75 8 56 0 -87
2972 -87 62 59 -15 64 80 17 40 5 -40 61 23 27 99 92 -13 -7 39 5 -28 56 2 22 16 -11 26 97 -35 -5 32 -69
3002 -69 -45 18 -54 -35 13 -38 -32 27 12 -52 -40 38 -17 -63 10 -127 2 -18 -137 -30 55 -69 -19 -33 -56 16 -35 -40 52
3031 52 3 39 -18 74 -12 -11 96 14 6 61 20 -46 115 33 52 154 -12 21 28 48 28 107 103 15 38 88 -29 48 97 35
3061 35 9 57 -11 19 67 -55 107 27 -13 -11 10 16 -12 7 -32 -16 61 -37 -76 -31 -14 -24 14 -22 -96 29 -86 -128 6
3090 6 -12 -55 34 -5 -100 -25 -2 -62 -62 6 -58 -65 7 -103 -36 21 1 23 43 -44 6 2 -36 35 30 13 -58 23 -14 -15 47 78 -22
3123 -22 87 19 -34 59 17 -2 79 96 7 73 15 -52 54 62 -8 35 34 -33 6 61 -51 20 97 -50 -15 5 -30 -41 52
3152 52 -30 -35 6 -11 -43 21 -37 -59 69 -48 -105 -35 -29 -61 -39 26 -75 38 13 -78 -33 7 -47 38 -11 -122 -57 -8 -46
3181 -46 -86 1 1 -16 36 -87 -30 55 -14 1 43 -7 -47 87 -34 -35 87 50 -14 31 29 -8 89 75 33 28 44 -70 56
3210 56 108 16 -13 71 -28 5 41 -43 8 87 -30 17 -3 -9 -49 10 -19 -44 44 38 27 -17 -8 -157 -21 -24 -66 16 -2 -67 -25
3241 -25 16 -90 -39 -23 -50 -35 -19 -85 -32 -11 -68 -26 17 -85 -92 -3 -63 -1 -19 12 -34 30 -35 -31 47 30 2 4 37 -14 40
3272 40 20 -5 65 83 -31 51 39 14 55 37 43 36 66 -56 -8 18 -15 8 83 -53 28 56 -35 -40 59 -6 -12 27 -5 -77 7
3303 7 -17 -50 9 -38 -56 -23 -50 -79 -9 -14 -57 -45 -6 -91 -39 -56 -48 -29 12 -63 7 7 -42 -63 21 -38 -36 29 -45 -89 -25 -13 -15
3336 -15 29 -24 -49 7 -32 -64 34 79 33 41 70 -33 10 69 -48 71 76 3 34 54 -68 2 100 23 74 47 -11 -65 56
3365 56 -9 -62 34 11 -46 28 35 -60 48 26 29 20 -31 -48 -27 -2 -59 -39 -10 -64 -24 46 -84 -37 9 -93 -43 72 -97
3394 -97 -27 -11 -56 -33 18 -29 -58 -61 -50 -64 -35 17 -18 4 -31 -75 32 -17 -61 24 -11 -28 37 14 -39 104 0 0 -33 23
3424 23 6 -17 -20 15 -5 164 -11 -7 119 -23 -74 52 -30 36 10 10 59 70 24 15 -2 58 -26 -45 47 -53 -25 -7 -99
3453 -99 -29 -29 -100 -16 21 -91 21 -2 -47 -30 3 -40 -54 24 -28 -83 -9 -39 -140 54 -27 -66 30 -6 -69 58 -68 -81
3481 -81 50 42 -30 54 -1 -27 36 15 2 -5 88 -52 21 46 -48 26 58 13 65 57 -61 25 35 18 30 35 21 20 24 -43 -70 68
3513 68 52 -25 51 34 -107 79 2 3 83 0 -54 7 -22 -3 -27 30 -9 -46 -11 -116 10 30 -57 -38 25 -110 -39 -18
3541 -18 -65 -20 -62 -24 -63 -28 -41 -54 21 -42 -30 10 36 -77 -10 -8 -71 61 -23 -35 0 -13 -26 15 34 -17 -5 -16 -16 -10 36
3572 36 42 -21 61 -58 -74 30 -8 22 65 8 -4 60 23 -58 81 45 -24 57 71 -25 -12 63 -35 13 27 -4 35 60 -60
3601 -60 -50 3 -23 6 -2 5 -2 41 -7 -73 4 -34 -2 -32 -56 -58 -20 -44 -112 18 -47 -78 -1 -10 -46 9 28 -62 -34 10 -60 -2
3633 -2 31 7 1 31 2 9 30 20 6 51 -2 26 41 -14 12 45 43 21 50 14 -23 63 34 -40 -19 36 11 28 16 3 55 42
3665 42 -8 -8 56 -24 -24 16 -8 31 40 -28 -66 39 -56 25 30 -19 -49 18 -46 -24 10 -9 -44 15 -25 -52 -1 -23 -83 15 -31 -39
3697 -39 -31 -65 -104 -52 -19 -81 -13 -4 -38 1 35 -16 -62 44 -29 3 27 -5 -19 26 -71 -18 69 14 14 48 32 18 79 38 19
3728 19 14 17 18 24 40 48 27 48 10 15 2 -12 -12 -6 -30 57 71 32 -31 4 -25 -47 46 32 -16 -48 -24 -61 38 -1 -29 20 -26 -64
3762 -64 16 -58 -107 39 -18 -15 -18 -55 7 -10 -31 -19 -41 -6 -35 -16 -6 27 -7 39 -21 2 17 -57 -38 39 4 32 53 49 -14
3793 -14 60 -12 18 20 -5 -63 26 -9 -20 26 34 4 48 53 -10 40 26 5 57 45 10 -3 51 -8 -36 36 45 -5 94 -9 -80 33
3825 33 -6 -9 57 -22 -16 23 -61 9 -11 -17 9 18 -45 -5 16 -23 -18 -42 9 -85 -62 -2 -99 -8 7 -66 81 -32 -117 36 -40
3856 -40 -21 -43 -50 12 -37 -34 -4 -14 29 -21 -24 55 -44 -24 45 3 56 -16 -22 58 123 -43 82 -3 75 33 -11 25 -65 -38 32
3887 32 14 78 71 -35 71 44 -65 42 8 45 39 -45 -5 17 25 -2 -60 14 0 0 -62 -53 -30 31 -44 -21 24 -8 -68 -23 -21
3918 -21 -40 -48 -26 4 -19 -29 -33 47 -12 -67 -43 22 -54 -23 43 -36 17 -11 -6 -28 -57 -16 70 4 -2 -36 79 63 8 51 23 -34
3950 -34 31 81 8 44 3 22 35 18 -7 57 36 47 45 -3 59 86 54 -20 67 33 0 -27 65 27 -57 23 -56 -4 23 -7 26
3981 26 18 18 -75 32 -24 -55 17 -15 -22 11 -12 -45 17 -33 -19 -3 30 -7 -5 -95 -56 -14 -3 -1 33 -36 -63 -69 -16 -15 -27 29 -24
4014 -24 -12 9 33 39 54 -24 -11 63 55 16 -8 57 41 7 67 12 -6 -3 -28 67 11 -5 8 62 -7 22 42 5 4 34 11 -36
4046 -36 3 9 -22 27 -58 -7 25 -54 -65 -4 -95 -17 1 -15 -74 -4 -11 -44 -50 -8 -7 22 -7 -44 -12 -15 -41 -35 -4 -11 -9 -19 -31 21
4080 21 -68 16 -38 16 19 -17 64 -9 -11 13 -17 -24 52 -31 20 42 25 49 -16 22 -6 30 48 37 10 -27 -2 52 17 -13 58 37
4112 37 -28 64 -17 -15 -4 89 -35 -8 11 -1 34 -2 0 -23 16 -16 -23 -29 28 -34 -24 -36 -61 -2 6 -24 -42 -58 48 12 20 -57
4144 -57 6 -37 -37 32 -9 -27 -52 16 -23 -25 -37 9 -25 23 0 4 69 -35 -50 11 4 36 -1 13 37 -4 -38 -14 82 49 -11 -16
4176 -16 51 -7 6 16 -13 28 45 -20 -34 -3 -22 16 4 67 -1 56 31 -39 49 4 -18 -15 13 -26 13 -17 -20 57 -11 -25 -42
4207 -42 1 -8 -47 -6 -71 -5 -41 -61 -55 15 -29 -34 -17 -48 13 -8 -68 -18 17 -35 15 -25 -35 -34 -27 -38 -38 5 25 -31 32 19 71
4240 71 48 4 -36 25 16 -10 -42 -5 -27 -18 25 -9 -2 -10 16 3 89 40 -1 46 -39 -17 31 13 -37 27 -29 -38 24 -31 19 -8 -4
4273 -4 17 -28 21 -55 -20 18 -2 38 26 -40 -5 -59 -38 37 -36 0 -11 -30 -16 -8 4 -82 3 47 22 -67 -5 -17 -56 4 -30
4304 -30 -27 0 9 -47 -4 -64 22 7 -33 -44 10 -19 -34 -28 41 4 45 20 -16 57 64 3 40 60 35 -36 9 -34 26 26 -3 22 9
4337 9 -1 -5 7 15 -87 -16 -74 -56 17 -44 -28 -13 -11 -46 32 -21 -76 -87 -48 -68 -35 -7 20 -43 -29 -55 -26 -3 23 -18 -38 -49
4369 -49 -13 -9 -71 -18 -24 -3 -69 -55 -5 -20 -31 -8 -63 33 -44 -67 16 39 -20 8 -54 8 2 -8 -32 -4 43 -27 26 41 -43 3
4401 3 46 7 13 56 -33 10 80 -13 -36 -49 17 -26 -11 10 -52 -29 50 -15 -55 -43 -56 -3 -11 -47 -44 -66 -36 -39 -49 -37 -23 8 8
4434 8 -30 -21 -29 -47 -36 -15 8 15 -5 -55 25 -38 -42 11 -33 -28 25 -59 -59 6 -15 1 -15 -3 -49 -71 -14 -21 -18 0 -8 -24 -13 -26 21
4469 21 16 -16 42 5 -24 -44 2 61 -20 10 7 -47 -6 35 -25 8 22 16 15 18 30 65 -17 -51 -35 29 1 -34 37 -18 -18 -14 -58 -2
4503 -2 25 -56 9 28 -26 -45 -12 13 -1 -28 -10 -72 -22 13 -18 16 -23 -20 -25 -39 -36 -10 -56 -30 -26 11 -17 1 -20 -29 4 11 -3 9
4537 9 7 19 3 -32 28 -16 12 18 -26 47 4 17 -23 -7 -33 24 -12 34 5 21 36 19 36 28 16 25 -24 57 32 7 45 24 25
4570 25 -16 15 -10 -4 45 -3 -77 40 -17 -15 -10 7 -49 -59 -5 -19 -27 -14 -13 -9 -16 6 -7 -45 -64 19 -10 -69 -45 -21 -3 -26 -16
4603 -16 -28 -21 -37 -4 47 31 -34 -44 19 -9 -16 16 -3 15 7 19 -36 34 -15 -9 -19 -44 6 0 21 14 31 25 -21 28 2 3 -57 60
4637 60 -18 -7 54 44 -4 60 -6 -16 21 -7 -18 -40 -29 -3 17 22 25 -16 -25 -26 -3 -67 -73 9 -60 -3 -32 -21 -6 -35 -21 -37 -42
4670 -42 -9 17 18 10 22 -33 -32 26 33 -1 -27 -13 -37 -13 -38 13 -43 -36 -5 34 -50 -51 -2 -6 27 -17 -23 -10 -17 -45 19 34 10 1 24
4705 24 -27 -34 -14 12 -3 -6 -15 24 4 -27 8 -57 -19 10 19 14 -22 3 15 -23 11 9 25 3 -25 -16 -33 34 -35 11 -47 -37 -31 -41
4739 -41 -24 -9 -6 -50 -7 -38 19 4 -22 26 5 -32 -79 9 -41 -22 -46 65 -14 -29 30 -8 39 -33 1 -30 1 20 -5 6
4769 6 37 13 84 50 47 3 -39 12 -20 30 39 19 15 0 30 50 37 34 -1 60 -16 -29 -30 2 13 7 -43 23 -17 -59 -45 25 -30 -45
4803 -45 -13 16 -22 -7 18 -12 6 -8 3 -38 -40 -13 2 -70 -28 53 -19 -5 -5 16 28 -32 12 -10 -38 -43 -21 20 -9 -3 19 -44
4835 -44 -27 -13 54 3 24 1 -2 -6 -29 -20 39 0 5 27 25 51 18 9 26 -46 -20 -31 6 49 -49 16 36 7 64 21 -43 5 56
4868 56 -30 -2 -18 48 -2 -35 -53 8 -54 13 -1 12 -3 -24 12 -34 3 -26 -27 -22 -56 -31 -56 38 -73 -23 26 -2 -25 2 -10
4899 -10 -61 -41 50 -20 -31 -47 -62 -7 -3 -21 3 29 47 -14 3 6 -20 4 10 -22 28 -28 11 64 -4 -10 9 4 -20 27 -25 1 19
4932 19 54 -33 -15 -3 -13 22 -19 28 21 -7 30 -48 10 -48 -32 23 -49 -3 -54 -6 -23 -35 -6 -16 13 -21 -1 2 -18 -14 -4 14
4964 14 3 -46 -28 -11 -23 7 10 -24 -26 -6 -20 -22 -21 -3 -18 -44 -9 -13 -47 -32 -16 19 15 -5 -30 2 -51 -24 57 12 -38 -28 -11
4997 -11 -18 70 10 -12 -3 6 -33 -5 3 25 -11 16 31 -59 67 29 -9 63 -43 44 19 -1 16 -12 -10 22 -33 21 2 -8 -26 -62
5029 -62 3 -1 -33 -11 -3 -39 -59 -38 -28 -38 -29 -44 -33 11 -10 26 -71 6 23 41 6 -63 33 33 -6 1 -35 -21 -40 -27 -33 -9 69
5062 69 42 21 -15 -6 17 27 13 -40 -3 -37 -37 5 -11 12 10 13 13 11 7 7 -13 29 36 -30 -9 -31 -30 -6 12 -10 30 12 -4 -2 -35 -55
5098 -55 -12 -18 -19 -48 -21 0 -2 -30 -16 0 41 -15 -4 -7 -107 -22 8 -87 -10 8 -46 -29 -11 -16 45 -42 20 6 1 -21 -2 32 -10
5131 -10 23 16 -18 24 -11 -53 6 28 21 -29 -35 25 26 33 49 -9 65 17 19 -16 -1 21 0 -37 6 44 50 51 4 9 21 13 7 -13 -13 21
5167 21 -18 -34 8 13 27 -21 -1 -1 -2 -30 -33 -3 -10 -57 -20 32 13 -22 -40 -32 11 5 17 -7 -24 20 -16 -40 -86 -38 -21 -22 33 17
5201 17 43 -16 -38 -2 -4 0 12 5 10 48 -1 -7 -4 -1 -5 -30 54 52 -9 -74 -17 29 -28 1 8 -5 -2 1 16 -24 8 4 -35 -5 -47 -19 -64
5238 -64 3 -1 -14 2 -15 37 -44 -4 27 -32 -53 -34 25 -10 -18 -6 -3 11 -44 -7 -76 -26 9 1 6 8 -29 -43 -28 27 -18 -82 15
5271 15 -25 -28 -44 -35 -42 11 9 32 -3 -3 54 15 -26 -10 5 21 24 39 -23 -22 -6 -5 51 16 -39 21 -14 -8 10 -16 76 -23 -10 59 -10
5306 -10 -28 12 11 48 -32 21 2 -34 54 16 -29 30 21 5 10 24 -41 -14 25 10 -13 -19 33 -15 -30 21 -17 -55 8 -33 29 -16
5338 -16 -9 54 6 8 -19 -58 -22 7 -26 26 17 7 -68 0 -24 -21 37 -13 -13 -4 8 29 9 22 2 -3 39 23 -15 18 11 18 26 1 -30
5373 -30 15 -27 24 56 5 -5 41 10 50 16 -7 -31 34 -11 5 -4 -25 27 -9 -20 -25 -6 24 -32 2 29 -48 18 9 15 38 -43
5405 -43 16 16 40 -25 -19 -16 0 -18 23 4 23 23 3 -9 -13 19 -1 3 16 -58 -4 56 -36 25 -19 34 -38 20 -22 -39 -67 8 42
5438 42 40 6 39 -39 17 -2 33 -3 65 2 -7 -30 45 5 19 46 8 -7 2 -13 19 6 16 44 -33 -2 15 -35 7 13 21 -6 52
5471 52 -22 -33 21 -23 1 -21 20 -3 -13 -26 -74 -11 74 -10 0 14 -16 30 -15 -14 5 55 38 14 12 -25 12 -38 7 14 -29 -22
5503 -22 6 -2 -39 15 -17 15 -4 43 26 -34 30 7 -12 67 -51 -12 -10 30 -5 18 4 -19 9 8 1 63 37 48 17 21 44 -39
5535 -39 12 16 0 -7 4 -6 -11 -15 -13 -5 -39 13 -12 48 -39 -16 -34 -26 25 -77 -29 -27 -29 7 -9 -13 -7 14 -6 3 -26 29 30 -29 -14 -3
5571 -3 16 27 9 -14 -39 -22 -17 41 10 -37 9 23 57 -27 -17 -38 12 -17 -42 -6 13 -46 -23 -15 -17 20 -4 -24 29 2 -29 27
5603 27 -9 -19 -10 34 17 -16 -27 9 24 29 9 1 -33 6 41 -18 8 10 -2 -5 -1 -11 -34 20 -57 -25 -33 40 -10 -10 15 -5 -2 25 -41
5638 -41 16 -3 4 -4 2 -44 -98 15 44 11 8 -2 27 -6 -35 -1 -22 -4 -18 -6 5 28 -13 -30 14 41 -15 -35 -14 2 18 -13
5670 -13 -50 -23 28 31 34 59 5 -32 15 30 7 -7 -10 -6 -38 -46 -51 -10 -47 41 10 18 5 10 -21 19 -43 -41 -59 -40 13 -11 -39 10 23
5705 23 7 10 -3 -10 -6 -50 -7 -1 -37 -1 -68 25 -30 -2 -47 13 10 -78 5 -32 -29 52 -9 26 6 13 14 -1 -24 2 -3 -3 58 -3 41
5740 41 9 -7 34 -13 -19 -19 -19 -21 23 31 -2 -15 24 -42 -36 -4 32 9 16 8 -6 31 1 -12 -13 6 -33 -26 -7 9 23 -8 -25 -5 1 -31
5776 -31 2 -23 54 20 -22 -8 14 -6 -24 -17 -15 -34 11 6 -30 -19 -7 10 -16 -10 -10 -26 -50 -35 -32 17 7 37 -43 -17 25 39 -5
5809 -5 2 0 5 -27 50 -31 -5 13 54 6 1 41 -27 0 15 -18 -10 -36 2 -38 -9 -31 -10 -24 -75 14 28 -12 21 20 -2 -17 -19 -5
5843 -5 -3 -51 -11 -37 -2 -14 1 24 0 -1 -5 -10 37 -8 8 -11 -27 -39 7 -20 -25 13 -18 4 33 -30 -14 4 -11 -33 -18 -20 22 -13
5877 -13 9 6 0 -54 -18 0 25 36 -31 -22 26 21 -35 -15 17 19 34 2 -28 -25 19 8 -38 20 -25 -40 -42 -29 32 15 -19 27 -14 -9
5911 -9 -55 -35 -44 -24 -38 1 -9 -4 3 -74 16 -59 -32 -24 15 -20 -7 -18 -3 5 59 -18 18 -25 42 -14 -24 4 5 12 -81 63 8 9
5945 9 30 4 -25 16 -38 50 17 -15 2 33 3 -34 5 -1 -8 36 -63 33 33 -2 -8 -20 -37 -37 21 -24 32 -12 -35 26 26 30 -10 11
5979 11 -3 4 20 16 14 22 7 -41 -9 31 -22 -13 -13 -37 -43 -19 14 22 1 3 21 -16 63 -7 -30 -23 -15 -15 24 -49 -31 -10 -37 1 -13 -34
6015 -34 -6 -4 -34 34 -18 -18 -17 1 -14 6 -2 36 8 -20 -9 -64 1 16 -44 -42 4 -16 -23 18 -21 -39 -82 -19 6 -3 18 2 -41 22
6049 22 -60 27 26 4 21 -4 39 -51 -43 -8 -17 16 18 -33 8 -7 -40 22 20 5 1 -46 21 -5 -54 0 -13 -5 16 -3 0 -50 20 36
6083 36 -2 -42 -37 -19 -43 14 -15 -24 12 -15 3 -32 -20 -31 14 -54 -25 -36 10 3 -21 3 30 5 -23 -36 6 19 -40 0 11 4
6115 4 -9 9 -16 -22 -14 -16 -24 51 -35 35 45 -19 -4 -48 8 -11 22 12 4 -28 34 1 -3 36 10 -1 -10 -3 29 15 22 -22 -35 44 -49
6150 -49 -9 -16 -27 -6 -14 -31 -68 -7 -15 -7 4 23 22 11 -11 -28 17 0 15 15 -54 -30 -26 11 -6 9 -29 21 11 0 -3 71 14 12 2
6185 2 8 -13 53 -16 9 13 19 -9 2 14 1 21 -5 -8 -12 -24 -55 -8 5 -9 -35 19 -42 -22 -19 12 1 -14 33 26 -14 30 -22 -7
6219 -7 -29 -4 -25 14 23 14 -40 22 -18 26 19 11 21 -25 26 -45 -28 -13 -10 -11 -3 10 31 35 19 -11 11 -38 18 43 -13 -8 32 -27 28
6254 28 6 -17 -19 -32 18 30 9 28 29 13 11 -25 -11 12 1 18 -22 -18 26 -6 10 36 2 -2 15 52 -63 -33 -34 33 30 -7 17
6287 17 -8 4 53 -7 0 -15 31 -26 0 28 49 -22 -37 70 -35 -9 15 29 -9 -12 39 -10 -7 19 -34 -6 -17 -32 -19 -39 -60
6318 -60 -26 -29 -32 -17 -36 4 -11 4 14 29 -5 9 -3 -42 -5 -26 21 12 -11 28 -64 -20 -19 8 19 2 0 12 28 47 -2 -27 9
6351 9 4 -19 28 -58 13 4 8 -21 23 9 -20 -9 47 -52 -8 -18 13 8 24 -43 4 -19 -19 -23 6 3 -5 -69 -18 41 -5 -18 -25 0 -25
6386 -25 28 -14 6 27 2 -51 -8 -25 12 -16 24 52 10 -9 -20 -18 7 16 23 10 36 -45 17 -46 -19 -57 10 -25 1 -10 29 15
6418 15 20 21 -4 -16 1 31 19 -20 25 20 -13 3 6 71 -76 51 -23 -10 0 12 10 -67 -35 -19 -36 50 -2 8 -71 -18 49 19
6450 19 -15 9 -40 -6 17 -2 -26 -20 -62 -41 34 12 -35 -11 -2 -2 -22 -12 -19 -4 24 -1 -47 -23 -5 15 0 35 -21 31 10 -65
6482 -65 24 -27 -44 1 -57 -40 8 -24 -37 -57 -13 59 33 -50 -3 -33 16 -22 22 -48 -27 -7 -15 -3 -6 29 -11 -6 19 -17 -29 20
6514 20 -29 40 -14 8 -31 -54 -58 12 -30 -4 -4 2 19 -12 43 7 80 -28 -19 18 9 -19 -17 -1 -19 19 58 31 2 -14 -7 -11 -8 28
6548 28 -15 -24 -26 -1 -1 -17 -9 -63 -27 4 -55 -5 2 21 -16 17 -68 0 21 5 15 -26 -64 -28 7 60 18 27 -51 15 26 40 -23
6581 -23 -12 -15 -55 -9 -41 -29 -26 8 -6 -14 21 -53 -1 -12 -32 -50 -7 -6 -10 40 53 -33 10 -23 -42 -4 -19 -18 -34 16 -4 15 19 -37
6615 -37 -26 0 2 -25 9 -12 -4 25 -21 14 5 -42 21 -10 -45 7 -37 -31 -23 -6 19 36 -35 -29 23 -47 -32 -34 28 -1 -8 7 -16 12
6649 12 -5 29 -37 0 -34 -39 -3 -1 -37 -33 9 -16 -31 26 17 45 -29 -27 0 -4 -8 -4 -34 14 -33 24 -32 6 1 -40 -2 -10 13 32 -40
6684 -40 -15 15 22 -10 -36 9 -41 43 1 1 -24 -20 -43 7 -5 7 27 48 -43 35 41 -10 2 -35 -36 -14 38 -3 2 -24 -51 27 -39
6717 -39 72 -2 -36 -14 -42 -64 13 2 16 -37 -17 12 0 -12 1 -3 -5 39 -18 -7 -58 -54 29 -3 -7 12 -37 -10 -10 0 -34 20
6749 20 -38 -12 14 -54 -35 -84 -35 20 29 -31 6 -6 -13 -14 -25 11 -61 32 38 51 15 6 22 -16 -37 -70 -13 14 30 -3 -18 -25 -12
6782 -12 8 -37 37 44 4 36 7 -28 -13 -10 -32 3 -5 -56 31 5 -15 -6 22 -54 3 -46 -32 30 -61 -7 15 -14 -7 -21 -9 25 -10
6815 -10 -37 -36 -1 -23 21 4 33 -25 34 16 29 23 44 10 22 -61 -22 -40 -28 -48 1 22 -51 -13 18 13 -49 14 -52 26 -33 -10
6847 -10 40 -12 -16 18 -24 -14 -58 80 -5 -3 -49 8 -15 -1 23 22 -28 3 8 -36 -15 3 45 10 -4 47 32 31 0 12 -46 -34
6879 -34 -40 20 -15 21 33 38 35 -10 27 23 -37 -38 -20 57 -18 13 51 50 -1 23 -16 -8 -29 -13 -37 -50 47 -48 -38 -15 8 -38 -15 -29
6913 -29 2 -41 7 4 6 23 -38 -6 -8 -35 8 -38 -7 -20 13 25 18 -8 53 21 -16 1 -7 -37 44 -52 -33 47 -19 -10 -28 -58 -45
6946 -45 23 41 -14 -1 25 -44 -68 -27 13 -29 17 28 13 -18 -10 -24 -21 -17 39 -13 -8 -1 -28 4 -20 6 -12 -20 8 6 -20 -18 -7 -10 -22
6981 -22 14 5 10 -9 -22 -8 0 -14 5 32 -8 23 -39 -2 2 -57 0 -4 -5 -20 11 16 -3 -8 -10 -21 24 -18 -20 16 3 11 -19 3 -20 -27
7017 -27 -9 -17 -16 -2 -54 15 -75 24 -28 25 -7 13 0 -11 43 -65 -28 -32 14 -15 34 -30 -16 19 -38 -14 -34 -44 -18 30 0
7048 0 -4 -4 -22 -70 -25 5 -10 -69 30 -25 9 1 -8 2 -21 -2 -34 -19 -9 -16 -7 16 7 -13 -19 29 -40 -38 -51 -39 8 -27 29 60 -57
7083 -57 -3 -4 9 26 18 -8 -9 -18 -52 -25 11 -22 1 -22 -2 -10 -12 -12 -19 26 -10 7 1 -13 2 40 12 -31 -68 54 3 -5 8 -21 -63
7118 -63 -52 -61 -63 -26 5 4 -53 23 -8 -26 -37 2 1 31 -15 -41 16 -18 4 -21 -4 7 24 -24 -43 14 36 38 12 -7 31 4 -22
7151 -22 -14 18 24 -35 -18 13 -23 -21 0 -38 -47 -25 2 -23 0 -10 -33 -22 -6 -10 39 46 -18 -41 17 43 -4 13 9 -4 -50 -58 5 49
7185 49 31 -10 -1 8 -34 -16 -26 40 37 -39 -7 -14 8 13 -14 -4 -25 -6 -15 -7 -22 -15 5 63 26 12 -67 -9 6 43 32 -27 -20 -23 -19 10
7221 10 -16 15 -13 -15 19 -40 7 -6 -40 5 18 -18 28 16 2 -8 -7 0 -22 -31 -33 11 17 5 2 4 -5 15 53 -17 25 -54 30 -14 21
7256 21 -31 -49 -15 -23 -14 -11 -4 -22 -36 -77 -12 -24 -5 -34 10 5 -47 16 18 1 -4 -36 -44 -24 -27 -12 36 -15 28 27 -40 -27 12 -20 -28 18
7292 18 -14 40 46 1 20 3 31 -7 -1 20 -22 12 -35 -28 64 5 28 0 -21 -11 22 6 -18 15 -8 -4 -19 -49 -14 12 -34 32
7324 32 23 8 -33 -25 -51 -38 9 -2 -57 3 13 -53 -2 -3 15 -42 -46 -21 -35 1 0 -48 2 -28 -18 18 41 -14 -39 -17 9 20 1
7357 1 18 -41 10 -32 -45 29 -47 -19 -21 6 -20 -5 -12 13 27 -16 5 -4 55 -45 25 5 9 8 -34 -25 20 11 -30 -41 38 -10 22 32
7391 32 35 21 -14 -1 -4 -6 38 -13 10 -2 -53 -52 -15 26 -19 -25 -29 -8 9 -69 -31 16 -28 -16 -33 -24 1 -2 9 47 6 -4 -20 -49
7425 -49 32 27 4 2 -5 4 -24 -56 -16 -26 10 -33 -46 13 -46 -12 21 -48 5 39 -17 -6 -21 13 14 29 -27 -10 -78 59 1 -47
7457 -47 10 -20 -22 0 -14 -45 -3 15 -23 -2 3 38 -25 -16 -7 -66 -18 -2 16 -72 26 -27 -12 31 -20 -51 40 -35 -29 -32 -15 -45 -13
7490 -13 -13 -8 -13 -2 25 -21 25 -58 7 -17 14 -11 -51 2 33 37 9 12 -35 1 15 -27 6 -1 1 -29 -43 -27 12 -12 15 -61 1 22
7524 22 5 0 0 8 -15 8 -6 23 -42 -23 -33 -5 -33 -22 -15 -65 -22 -33 34 -20 4 36 49 -6 6 -87 -49 15 -21 -47 9 1 18
7557 18 -9 -28 21 -42 -37 24 -16 -39 -89 13 3 20 -50 -6 58 15 -32 -3 -6 2 -14 -5 -11 4 -4 -18 -10 13 20 18 -2 31 25 22 -49
7592 -49 -11 -44 -13 22 -5 -10 -35 -10 10 16 -24 -7 -17 -5 0 1 -34 -6 34 -23 -14 14 21 -30 -14 22 -51 17 -37 -15 41 -16 1
7625 1 8 -2 15 30 32 11 -32 -29 50 7 -52 -14 -27 -15 -14 -58 -8 3 44 8 39 34 12 -25 18 30 -33 7 17 30 -31 38 -31
7658 -31 -8 21 11 3 54 17 45 -38 -1 12 -30 8 -26 10 -18 28 13 32 49 2 -6 -32 5 -37 10 -24 -43 -25 -43 39 -36
7689 -36 12 -24 12 -21 30 -59 46 -3 22 25 -15 30 0 -20 -15 32 4 -19 -13 -5 17 -21 -2 6 -1 55 -11 -44 18 48 22 26 7
7722 7 -24 -39 51 -36 -24 -38 -6 -9 6 -8 -48 6 -15 15 -18 14 -23 29 -24 -22 -20 -44 8 30 -14 -18 -38 -15 -18 14 -16 -16 -3 -7
7756 -7 -20 11 -25 -23 21 -42 -7 -25 73 -3 -21 -24 17 58 -50 -22 26 -33 -20 -53 -63 -1 -2 22 -15 -10 30 57 -15 22 -51 15
7788 15 1 -22 -44 26 -25 -13 10 -22 -32 -11 23 35 -8 -29 -63 -13 -34 -27 4 -22 -18 18 21 17 -30 -6 -31 37 4 39 -3 -7 -12
7821 -12 -26 64 -51 55 -28 -44 24 -14 -10 19 -42 9 30 -11 4 14 -19 35 40 -24 -23 4 -9 13 4 9 -43 48 -54 -5 25
7852 25 -10 -22 -20 7 15 -26 -26 -27 -4 -14 7 3 -5 -29 -9 -20 8 -26 25 -40 -6 -59 -27 3 -2 13 36 0 8 -20 20 31 -63 -22
7886 -22 -1 8 -43 5 34 0 -18 -44 65 3 18 4 2 13 -24 35 -53 -22 23 62 30 -6 61 -51 -40 6 -33 10 -6 21
7916 21 36 25 -16 -14 -24 2 16 -16 43 38 -3 -39 -53 25 -13 64 19 41 -33 -30 -4 -27 -9 47 -52 -4 -36 -7 -4 -39 -48 17 -10
7949 -10 1 21 -36 -40 -4 -11 -22 -18 35 -47 6 -96 -21 -52 -74 -17 -7 -26 -48 40 -5 13 -34 -36 29 38 -8 -9 -1 -11 -10 10 6 5 -5
7984 -5 -2 -27 37 -8 -12 28 11 -21 11 23 34 -42 -45 -13 -9 25 24 67 -8 -24 11 25 -13 -22 -27 -28 -11 -14 -7 -55 12 -3 -14 -23 27 -17
8020 -17 17 10 -5 -33 32 -5 16 16 1 -2 5 17 -44 -9 -11 -24 -13 19 29 -3 -2 29 29 20 -76 -37 -5 -2 -57 -30 -26 0 -8 -3 36 -10
8056 -10 13 33 53 17 42 -19 14 18 51 -6 14 20 -16 4 18 -5 -32 -21 21 9 5 -7 -19 -66 0 -39 8 18 38 39 -15 -64
8088 -64 14 0 -64 46 0 -30 -24 35 27 7 50 -30 -34 2 22 36 24 -25 -45 -17 -36 27 -6 -4 8 -25 -4 -16 -88 66 -67
8119 -67 -5 -19 3 9 7 14 -17 9 -70 36 13 -12 13 -7 -22 -12 -35 10 18 -24 -24 -11 -7 -15 -40 -17 -13 5 -10 0 13 -25 -78 -20
8153 -20 24 -25 -15 -8 -30 -5 -12 -25 10 34 -26 13 -38 -37 15 -55 8 3 7 -14 9 0 -8 15 -1 -9 13 -23 -17 -18 -24 -11 -11 -4 66 10 -26
8190 -26 55
8191E5
$$ Imaginary data points
##PAGE= N=2
##DATA TABLE= (X++(I..I)), XYDATA
0 0 0 0 0 0 0 0 0 0 0 0 0 0 0 0 0 0 0 0 0 0 8 -8 8 -8 8 -8 12 -16 16 -16 24 -24 24 -32 32 -40 43 -48 56 -62 67
41 67 -74 82 -91 103 -112 123 -136 151 -165 182 -200 220 -244 270 -299 333 -371 417 -469 535 -615
62 -615 718 -851 1037 -1315 1766 -2628 4843 -22251 -37726 18633 -1947 -22097 -6887 1468
76 1468 -946 -1783 -9713 -4169 5220 208 -7900 5057 4950 -6638 8622 7684 -15032 1947 12311
91 12311 -8792 -7876 1703 -673 2501 -5660 -8244 7400 2717 -14814 -5193 8697 -4992 -11215
105 -11215 4938 1096 -8263 2857 -1916 -9455 1254 -5080 -7168 4216 -4296 -7045 4737 -143
119 -143 -5681 1861 1515 -3775 1366 4815 -2104 3380 10265 -578 570 6736 -430 2711 5504
134 5504 -2836 3955 8463 -1983 1206 6022 -878 -237 4599 -306 -1168 5600 1708 -3880 3401
149 3401 4515 -2522 58 -1306 -2739 3891 -3211 -7269 4885 2354 -7439 -999 2027 -3332 -2602
164 -2602 -972 -1673 1347 3283 -1572 -80 3396 -1591 760 4124 -2906 457 7450 -1496 -2510
179 -2510 6262 2799 -1523 998 1314 2167 3244 -1244 -149 6577 2745 -2410 3093 3611 -2216 1733
195 1733 2367 -2242 2522 3298 -2721 -317 1878 -1665 323 -410 -3697 899 2575 -3446 -2014 3157
211 3157 -1205 -2645 1247 -1426 -2317 1419 -1698 -2593 2493 -509 -2688 1039 -1815 -3450 1734 -8
227 -8 -3514 1294 1288 -2172 314 442 -2252 961 1565 -2807 363 2552 -1747 -659 1812 -1541 159
244 159 2284 -2874 -1548 2515 -644 -1123 1883 -485 -499 2213 -1303 -1741 2564 805 -1832 1813
260 1813 1388 -1044 1781 203 -2099 2052 1875 -2141 938 1530 -1607 1243 1412 -1692 808 1941
276 1941 -1979 -332 2096 -1022 -235 1937 -1040 -808 2103 -1396 -1784 1896 -860 -1141 1976 -871
292 -871 -2113 1510 -537 -2017 1329 -69 -1982 660 215 -2204 837 831 -2227 371 918 -2265 50
309 50 1173 -2370 112 1785 -1752 -359 1013 -1891 -690 1697 -1312 -827 1699 -1022 -1618 1309
325 1309 -518 -1538 1614 -520 -1809 1649 -54 -1881 1347 373 -1604 1743 637 -1939 1081
340 1081 1378 -988 1042 1948 -774 803 1651 -876 840 2464 -506 410 2606 -762 223 2737
356 2737 -604 -514 2626 301 -688 1560 -142 -537 1314 -120 -799 1390 -217 -2071 1115 312 -2221
373 -2221 821 986 -2770 -236 1029 -1998 -568 207 -1262 307 -6 -2143 264 1047 -2145 -405
389 -405 2266 -719 -1607 1827 258 -1205 1845 747 -175 1643 -43 168 2738 -144 -528 3188
405 3188 1130 -953 1742 1839 -738 796 2152 39 584 1488 -406 590 1329 -1231 1322 2191 -2071
422 -2071 133 2264 -1185 -589 1519 -342 -437 958 -384 -783 739 -226 -1271 1365 30 -1913
438 -1913 1211 -148 -2246 1538 406 -2253 1136 154 -2081 484 500 -1428 -202 720 -1176 -809
454 -809 478 -1308 -627 1114 -2092 -1062 2147 -2470 -2318 1719 -1227 -1817 1008 -1004 -1810 235
470 235 -595 -1139 85 -321 -1215 794 80 -2571 1235 1536 -2973 639 2638 -2133 -402 1987 -608
487 -608 262 895 208 1404 975 -984 829 3052 -189 -813 3310 1249 -1736 2424 1641 -1189 1758
504 1758 1091 -306 1512 132 -480 1379 -6 -723 1601 676 -1794 301 2321 -1377 -1144 2434
520 2434 -5 -1034 684 -541 297 1043 -1540 221 1565 -1247 -659 1076 -409 -1135 840 643
536 643 -894 303 153 -1093 926 677 -1306 874 691 -1006 688 18 -710 1136 353 -1079 478
553 478 538 -937 -177 732 -598 -372 1200 -663 -902 749 -299 -203 691 -583 317 799 -1536 36
571 36 1870 -707 -1206 1179 965 -1050 -202 650 38 154 -150 -217 1045 -659 -1497 1693 200 -2081
589 -2081 709 1156 -1548 -1278 340 38 -610 -1018 -614 415 -424 -2168 -70 1152 -2076 -1186 1455
606 1455 -829 -1782 140 -297 -531 -117 -852 -238 74 -1123 -551 909 -610 -1276 1381 243 -1973
623 -1973 467 1352 -947 -101 586 151 972 -483 -767 1592 874 -1253 546 1696 -506 -434 933
640 933 69 248 1153 -719 -229 1529 -478 -475 1082 -49 133 1078 -687 -476 1348 -107 -923 808
658 808 612 -765 365 109 -1092 620 446 -1199 354 456 -1286 275 378 -1145 300 418 -1110
675 -1110 -73 546 -1180 -488 917 -588 -820 626 -360 -863 449 -777 -337 1236 -797 -1092 1187
692 1187 45 -1059 611 257 -469 676 -13 -844 737 753 -978 466 908 -579 484 563 -1097
709 -1097 704 1517 -813 79 1207 -171 2 754 -178 459 1313 -436 -265 1427 61 -612 1130
726 1130 273 -440 1244 -50 -846 1062 393 -743 800 448 -768 506 127 -921 578 701 -1098
743 -1098 62 840 -1171 -347 650 -899 -276 694 -930 -424 713 -1023 -645 767 -579 -749 726
760 726 -641 -1036 747 -159 -996 695 96 -1168 410 64 -965 668 248 -900 650 489 -1081
777 -1081 315 805 -788 356 1070 -550 -66 913 -400 128 1131 -320 96 1199 -372 -297 1426
794 1426 -45 -284 1287 -1 -470 1044 298 -687 993 596 -419 595 166 -779 737 420 -1083
811 -1083 660 754 -1132 -86 548 -953 -64 590 -1110 -302 571 -890 -635 396 -598 -383 613 -863
829 -863 -775 775 -497 -1010 839 51 -957 622 -201 -944 687 245 -637 540 322 -678 579 349
847 349 -744 514 901 -672 178 1015 -620 25 967 -371 166 1074 -533 -256 1013 -296 -59 927
865 927 -189 -308 949 -83 -697 919 221 -510 862 411 -845 684 597 -644 623 688 -380 593
883 593 397 -568 660 755 -607 311 924 -662 -293 1093 -341 -564 890 -17 -513 216 -352 -302 409
902 409 -744 -374 925 -609 -1376 535 338 -1292 -54 524 -718 -389 -155 -486 42 -97 -764 541
920 541 111 -1272 229 850 -837 -527 1147 165 -558 299 301 35 380 125 408 760 -445 58 1302
939 1302 -101 -523 1167 804 -624 112 701 144 -20 143 90 489 93 -799 403 347 -802 256 531
958 531 -662 -90 284 -635 -118 332 -248 -337 107 -195 -361 151 -397 -271 558 -417 -631 511 -367 -666
978 -666 671 -157 -518 367 -61 -472 51 118 -180 218 207 -310 -50 278 -458 358 555 -896 368 1018
998 1018 -794 -334 715 -91 73 152 21 307 132 -187 103 854 8 -449 1028 385 -789 696 734
1017 734 -378 730 261 -194 746 -23 -210 700 218 -144 577 402 -449 34 845 -178 -325 952 -245
1036 -245 -507 606 -340 72 489 -801 139 792 -841 -498 535 -90 -492 4 161 -625 -104 15 -803
1055 -803 152 229 -841 308 103 -1189 439 253 -846 239 143 -562 -6 180 -342 -197 445 17 -392
1074 -392 425 -175 -420 868 -290 -445 1118 -176 -606 762 -46 -126 635 22 33 571 110 -353 354
1093 354 782 -309 86 750 -301 93 540 -693 413 782 -741 168 536 -586 -30 422 -264 -126
1111 -126 313 -120 -378 185 -111 -578 505 -81 -767 367 -219 -834 398 -156 -814 438 -29 -795 -90
1130 -90 -160 -355 -42 -17 -525 -97 257 -733 -311 530 -536 -407 556 -486 -260 439 -559 -107 568 -359
1150 -359 -250 399 -192 -255 422 163 -239 436 233 -532 369 340 -434 532 406 -359 419 372 -415 324 443
1171 443 -210 313 452 -267 -107 448 -149 -60 528 -177 -244 487 -322 -407 543 -192 -297 466 -267 -396 312
1192 312 -110 -462 251 91 -442 73 -28 -545 95 210 -599 74 160 -664 -118 179 -580 -31 383 -535
1212 -535 -252 290 -299 -206 217 -218 -151 404 -343 -336 427 -89 -356 528 76 -350 403 0 -327 423 226
1233 226 -243 336 227 -249 361 296 -203 328 499 -218 213 484 -308 118 612 -85 87 469 -138 -25
1253 -25 372 -141 119 525 -156 -253 429 -125 -378 375 16 -381 251 38 -515 94 35 -353 98 -103 -417
1274 -417 143 -80 -724 161 307 -582 -148 184 -423 -274 189 -303 -117 159 -300 -104 174 -438 -147 464
1294 464 -278 -254 525 -92 -503 269 150 -238 301 219 -152 192 68 -113 417 119 -263 541 310 -441 241
1315 241 582 -119 41 526 8 70 313 -29 180 378 -77 216 454 -332 -44 567 -132 -287 465 92
1335 92 -331 99 8 -142 86 -36 -212 225 -192 -502 268 -29 -560 137 164 -614 -180 113 -423 -175 33
1356 33 -179 -112 -147 -406 4 78 -466 -97 423 -342 -409 368 -157 -297 251 20 -65 127 -159 17 326 -132
1378 -132 -92 433 48 -232 318 235 -296 359 377 -337 196 321 -184 164 178 -189 467 268 -394 202 324
1399 324 -120 32 392 33 -97 237 -68 -168 355 -42 -213 522 -186 -362 368 -113 -248 171 -195 -145
1419 -145 194 -239 -329 89 48 -380 -72 283 -513 -185 136 -425 0 186 -545 20 187 -600 33 136 -436
1440 -436 9 214 -246 -337 242 55 -370 135 230 -145 313 -95 -344 717 -10 -392 612 175 -404 321
1460 321 261 -27 114 170 261 168 84 -177 165 607 -258 -37 708 -186 -146 476 -206 46 450 -244 70 272
1482 272 -175 -47 205 46 -193 182 40 -397 197 245 -613 131 264 -455 99 -165 -451 257 -22 -497
1502 -497 98 87 -364 -265 39 -111 -309 184 -149 -291 246 -388 -351 524 -217 -408 325 -110 -177 113 -210
1523 -210 53 320 -77 -221 142 214 -230 75 396 -176 184 401 -385 218 327 -299 274 361 -177 166 193
1544 193 -211 139 370 -16 -60 366 49 -334 282 145 -202 359 -19 -266 361 -176 -354 383 -48 -283
1564 -283 101 102 -285 -165 62 -180 42 74 -477 -120 298 -489 -270 226 -371 -52 141 -524 -163 180 -292
1585 -292 -228 160 -165 -227 81 -191 -303 197 71 -418 242 23 -456 240 106 -302 319 136 -273 283 126
1606 126 -202 203 336 -147 88 341 -169 -26 370 -53 81 466 -115 -3 402 -176 -56 398 35 -22
1626 -22 311 -10 -151 309 62 -192 289 184 -312 135 84 -354 174 182 -336 71 70 -395 57 138 -308 34
1648 34 175 -288 -184 107 -267 -169 220 -203 -281 228 -235 -339 218 -180 -238 250 -159 -335 135 -54 -317
1669 -317 101 100 -251 48 24 -278 64 197 -265 195 246 -255 107 269 -210 88 399 -134 42 327 -169
1690 -169 -63 353 -43 -38 361 -12 -199 243 27 -178 408 60 -231 248 52 -330 124 185 -266 107 69
1711 69 -343 -24 83 -292 -7 149 -259 -35 39 -369 -73 270 -321 -221 209 -196 -304 157 -162 -215 146
1732 146 -125 -268 134 -164 -333 156 -77 -313 157 54 -443 42 97 -289 61 153 -211 -23 117 -234 101
1753 101 299 -148 163 331 -220 -100 397 -45 -45 379 26 -44 305 46 -90 416 79 -57 314 79 -154
1774 -154 236 122 -190 340 194 -264 147 180 -247 91 165 -262 115 154 -334 -48 162 -255 -43 248 -279
1795 -279 -213 158 -249 -323 127 -176 -272 158 -228 -297 126 -179 -316 193 -80 -309 224 -65 -349 117 149 -261
1817 -261 11 215 -283 46 199 -213 62 226 -220 12 200 -264 1 249 -184 -38 326 -83 -214 268
1837 268 89 -110 194 92 -127 282 -30 -200 398 114 -166 314 159 -342 181 178 -170 109 171 -58 19
1858 19 123 -160 32 268 -192 -2 265 -321 -134 338 -244 -218 285 -205 -249 23 -169 -158 129 -161 -236 49
1880 49 -125 -396 57 62 -356 85 95 -372 -27 30 -299 44 124 -212 44 84 -242 15 213 -140 -53 344 -112
1903 -112 -169 245 -62 -153 353 45 -97 246 12 -16 291 9 -122 385 216 -251 125 262 -83 105 179
1924 179 -142 165 271 -250 106 229 -144 78 215 -115 -38 122 -145 -25 214 -57 -219 162 -108 -316
1944 -316 134 -101 -201 138 -189 -298 92 -86 -254 51 -48 -230 -40 -9 -268 -65 23 -310 23 173 -355
1965 -355 -153 194 -207 -10 124 -149 204 226 -151 -64 322 71 -50 245 70 -75 198 122 -80 367 144
1986 144 -93 312 111 -129 206 201 -21 257 86 -42 49 227 -29 -32 269 11 -36 199 -154 -1 227 -181
2008 -181 -24 313 -222 -96 133 -129 27 31 -108 -27 85 -98 -173 152 106 -218 -18 90 -242 4 -51 -291
2030 -291 173 15 -241 67 -37 -255 -50 -31 -100 -123 -21 -122 -142 41 -174 -136 275 -140 -205 124 -159 -86
2052 -86 192 -164 -51 236 -63 -125 69 70 -15 105 115 -3 33 175 -236 98 291 -183 115 163 -193 93 95
2075 95 -167 142 145 -129 0 77 -13 -105 72 57 -134 79 -81 -230 105 -64 -246 181 -136 -241 65 -107
2097 -107 -173 25 -121 -144 -5 -81 -203 -92 -4 -111 -62 56 -229 -12 64 -207 49 198 -168 -20 104 -89
2119 -89 43 112 -1 44 65 11 -15 207 66 -3 249 147 -12 249 128 -143 202 192 42 200 100 15 82
2142 82 109 21 148 131 -43 108 150 -83 -46 215 -58 -9 164 -111 -7 84 -136 -15 122 -80 -76 46 -155
2165 -155 -144 29 -28 -151 123 -33 -192 -39 -38 -124 -11 -71 -183 28 -49 -184 41 -24 -270 32 97 -197 -103
2188 -103 43 -160 -132 62 -97 -63 14 -212 -72 76 -87 -46 139 -50 -100 153 -5 -72 140 122 -21 45 28
2211 28 -9 142 71 1 206 136 -125 130 159 -22 117 206 -11 39 153 -11 1 148 -52 52 142 -73 -150 106
2235 106 -98 -89 109 -95 -136 40 -80 -197 33 -47 -150 45 -83 -186 -27 -88 -225 56 42 -152 20 -25
2257 -25 -158 -21 79 -111 -35 137 -110 -94 25 -99 -14 156 -84 15 154 -62 -105 109 66 -18 145 38 -75
2280 -75 137 45 -25 165 44 -21 160 77 -111 156 149 -31 108 215 -60 66 146 -62 55 158 -10 10 107
2303 107 -107 30 193 -45 -56 123 -66 -138 62 -24 -133 82 -31 -155 -32 -25 -175 -1 -39 -179 46 -44
2325 -44 -208 -54 35 -104 19 11 -130 -26 29 -168 -63 170 -125 -17 121 -183 -69 98 -101 -66 92 -52
2347 -52 -6 60 -1 -61 162 38 -65 162 98 -137 105 102 -60 149 63 -95 118 155 -93 22 81 5 62 122 -29
2372 -29 -16 195 25 -11 234 -69 -7 150 -91 -46 144 -74 13 138 -91 -141 40 0 -40 -19 23 -78 -41 -64
2396 -64 -207 29 38 -255 -87 29 -258 -63 -34 -196 23 16 -145 -54 -35 -153 -60 -15 0 -102 23 3 -187 178
2420 178 -37 -118 178 47 -114 103 -61 -60 191 -41 67 120 70 -54 71 156 -61 26 205 -69 -6 142 -118
2443 -118 93 252 -146 48 131 -98 58 -11 -56 87 103 -37 -131 50 25 -180 96 100 -200 135 -62 -181 185
2466 185 -37 -187 149 -13 -92 -29 -106 -55 12 -14 -114 -10 81 -150 -106 175 -113 -88 179 -149 -21 126 -166
2489 -166 -8 145 -68 -43 94 -10 -14 50 143 60 132 146 -87 124 175 -147 147 218 -80 153 80 -74 138 89
2513 89 -22 148 194 4 -13 154 14 -7 145 9 -42 125 -75 -114 222 -25 -76 114 -74 16 107 -42 -75
2536 -75 136 69 -128 0 24 -134 -45 106 -164 -8 17 -277 -42 51 -187 -125 82 -131 -76 -48 -130 -111 38 -27
2560 -27 -134 100 -41 -160 46 15 -112 125 -12 -132 132 -47 -90 139 96 9 167 150 -33 -5 74 37 67
2583 67 258 -58 63 242 -22 98 188 14 57 196 -51 58 147 0 -22 147 60 -51 72 9 -73 125 52
2606 52 -80 107 77 -206 67 73 -114 64 43 -112 -10 61 -99 16 49 -107 -9 58 -104 -124 87 -134 -117 91
2630 91 -88 -80 104 -74 -83 55 -40 -106 47 -24 -152 72 81 -113 76 98 -54 20 69 -87 96 102 -120 83 125
2655 125 -74 44 125 22 39 142 43 16 157 -48 -17 164 33 30 189 46 -65 122 30 -55 122 16 -106
2678 -106 65 -20 -120 28 50 -61 22 54 -176 -65 46 -103 -50 46 -57 -63 22 -156 -1 88 -66 -68 58 -99
2702 -99 -118 40 -68 -146 48 -26 -119 24 -38 -109 77 11 -87 73 -3 -152 33 37 -50 71 74 -68 43 123 -39
2727 -39 15 184 -3 53 94 -48 11 191 13 -40 167 10 22 104 53 -14 167 23 -48 89 16 -67 73 37 -42
2752 -42 115 52 -60 -22 37 -82 40 47 -87 -54 -14 -101 -43 28 -52 -116 -4 -116 -102 10 -88 -132 103 -26 -104 72
2778 72 -92 -105 10 -22 -82 25 51 -91 4 -29 -63 57 65 -131 12 73 -121 39 72 -21 -6 101 -56 37 68
2803 68 6 48 56 47 -55 79 -8 -18 112 79 -30 142 12 -32 78 54 16 146 20 16 69 27 -68 44 72 -9 -14
2830 -14 98 -99 -103 59 -64 -2 76 -88 -83 20 -107 -57 16 -113 -14 -6 -39 -108 -45 23 -140 16 -16 -77 32 -27
2856 -27 -119 52 2 -85 74 -16 -29 31 5 -13 0 3 -74 -29 76 -5 -27 76 15 15 68 -38 2 92 -13 71 108 -28
2884 -28 47 66 53 52 60 55 -8 75 83 -78 43 93 -5 -15 62 -34 43 61 -144 64 11 -62 3 -1 -25 -64 48 -8 -18 16
2914 16 -53 -108 68 -89 -102 30 -88 -129 -47 -119 -45 -1 -132 -132 -62 -39 -52 -76 -72 -52 -63 24 -110 29 36 -91 -14 82
2942 82 11 -16 34 5 39 -7 -57 -31 115 32 -49 40 53 -30 38 10 -50 135 -41 5 87 23 51 92 54 8 52 -31 -70
2971 -70 14 -21 20 47 106 -60 -42 44 1 62 50 -70 65 88 -21 -6 9 33 -37 -20 1 -53 -13 -32 -65 31 -31 -64
2999 -64 -19 21 -104 -20 -51 -83 28 -91 -74 -71 -31 -91 -64 -43 -54 0 36 -44 -22 53 -24 37 56 -67 7 60 15 53 54
3028 54 29 26 50 -16 -7 53 75 19 47 -2 -36 102 30 -71 102 35 25 23 -88 -82 54 34 20 43 2 -43 -56 39 -57 -6
3058 -6 78 -28 13 85 -57 9 19 -19 26 43 -98 1 -7 -21 -86 -14 -19 -86 -2 26 -102 -44 3 -123 -12 -51 -61 -29 -24
3087 -24 -58 28 -7 24 14 -36 -34 -14 2 51 49 22 45 -29 76 35 19 121 6 1 131 -33 -39 43 51 27 106 48 -42 15
3117 15 36 10 63 -1 -23 4 26 -67 7 19 -57 0 47 -84 -16 27 -11 1 20 -21 -44 3 -30 -88 -22 14 -53 64 -61
3146 -61 -124 -46 0 -81 40 34 -37 -10 -81 -76 -6 20 -54 -8 34 -96 -53 -11 -43 -7 54 -42 50 79 -26 25 10 39 44 24
3176 24 -25 -16 -2 -1 42 96 74 -8 89 31 19 106 70 11 61 60 -48 57 90 -40 56 52 -16 -6 71 -17 11 6 -17 -61 15
3207 15 -26 -44 2 -45 -6 5 -26 -51 -14 -88 -41 68 10 -41 -10 -71 -26 -15 -31 -37 7 -4 -76 9 -11 -67 7 31 -87 -24
3237 -24 42 -85 -3 28 -42 32 46 -88 -42 40 -8 -40 57 0 -9 67 -7 -34 77 10 24 54 48 38 79 37 6 80 92 -2
3267 -2 49 58 -54 36 48 20 28 47 17 -6 47 -61 -42 63 -68 -34 -15 -83 -81 25 -35 -33 8 -70 -119 11 -38 -76 33
3296 33 -17 -52 -4 10 -58 14 -19 -101 -22 9 -64 -6 1 -44 -14 21 6 3 28 -72 -58 8 -14 -20 43 16 -21 8 10 -3 106
3327 106 30 33 70 22 15 68 15 -1 104 7 3 80 94 2 26 108 64 49 7 -24 38 121 -27 12 78 -12 -6 56 0 -55 -5
3358 -5 12 -72 -25 -31 -121 -31 -43 -71 -18 15 -116 31 -44 -63 31 -6 -102 -35 15 -100 -41 -12 -2 0 9 -45 -22 57 -22 -30 96
3389 96 49 2 50 -35 -27 50 -1 -7 61 -3 21 -1 12 17 18 62 -42 3 95 -41 1 121 -49 62 91 -17 43 28 0
3418 0 83 27 61 6 98 24 -10 17 37 -59 102 -17 -75 54 -47 -89 102 -15 -37 43 -69 -34 -8 19 -98 -54 13
3445 13 -50 -71 47 -84 -43 17 -79 -26 35 -110 -3 54 -57 -24 43 -71 -12 8 -9 16 27 71 -34 10 3 -10 69
3472 69 69 -70 -13 20 -42 142 41 -29 47 43 9 4 -17 -22 13 60 24 -3 69 -8 -28 67 -26 -9 64 -40 -6 59 -93 26
3502 26 78 -30 57 71 47 9 26 -8 -27 46 71 -61 -33 10 -123 -16 53 -55 -17 -45 -106 -17 -8 -51 -7 -42 -20 -51
3530 -51 -37 -87 -64 29 -17 -25 42 -4 -33 44 44 70 85 53 -55 46 35 -4 53 92 39 40 59 -18 54 90 46 49 144 10 -19
3561 -19 58 -28 37 69 33 8 0 8 29 100 51 -26 43 48 -13 50 69 10 33 3 -19 32 -29 -57 -10 38 -34 -25 -43 -91 -54 16
3593 16 -47 -30 52 -20 -45 15 -47 -45 59 -23 -45 -58 -84 -56 59 -28 5 8 -54 -49 -22 15 -60 27 -2 -38 -30 21 27 -5 43 8
3625 8 31 69 11 -9 36 -3 12 44 17 -5 76 12 9 36 -54 -2 76 17 -4 53 -6 -18 16 43 -10 -15 35 -49 31 5 -54 -10
3657 -10 68 -21 37 -13 -54 40 18 11 -8 47 -33 -39 11 -12 -28 -8 -23 -39 -25 13 1 -36 -10 -20 -2 -20 -58 -26 22 -33 -47
3688 -47 8 -39 -56 -22 -36 28 33 -14 3 12 -35 3 79 7 57 46 -10 33 75 15 16 68 69 29 37 -3 40 66 26 11 79 44 30
3721 30 11 0 -18 -15 20 -16 38 33 24 -31 35 -35 53 5 -10 -2 -51 1 -43 10 41 -3 38 -22 -74 22 13 4 -18 10 -64 -41 -28
3754 -28 -35 25 -29 -70 -14 -35 -47 -23 40 -43 49 43 -71 19 10 -40 -22 23 -11 55 -23 5 -24 3 75 47 42 1 7 40 -14 24
3786 24 25 -7 69 65 -3 18 67 9 16 51 29 35 -32 70 8 2 12 -57 -23 11 -39 -20 -8 -72 -33 4 -12 -55 -98 -4 -18 -31
3818 -31 56 -36 -21 -16 -73 -19 -40 -26 38 -14 -66 -32 -30 -37 58 -3 35 -19 22 -13 -39 32 21 -64 50 -8 -45 5 -5 45 -9
3849 -9 -47 53 44 -43 -3 10 3 18 30 -20 10 38 66 103 31 92 -8 22 11 -41 125 16 3 88 -2 3 4 -39 -3 4 7 25
3881 25 -56 -12 -3 -15 2 -5 -52 -14 -37 -2 0 11 -71 10 -27 -43 -17 -81 -36 -2 29 51 -34 24 -36 -45 -13 -23 46 -1 -89 25
3913 25 34 19 -27 31 15 -10 -48 17 29 -60 -40 6 86 48 -24 32 24 27 61 -12 16 35 -43 -1 65 14 58 44 0 46 24 17
3945 17 -1 53 28 -13 8 52 -1 37 34 -56 -2 33 -28 -12 -52 -51 -11 -37 -2 -33 34 -11 -9 -48 7 -64 13 -50 -32 -45 -59 -81
3977 -81 18 -26 22 3 -23 -78 -15 33 -58 -8 37 -6 -31 -2 -38 80 40 -38 73 52 13 -4 42 35 -23 15 35 -20 -10 33
4007 33 -49 30 41 20 19 -10 26 41 19 19 95 14 33 51 -5 11 -19 -9 18 -9 23 -33 6 46 -17 21 23 -45 -9 -2 -51 14
4039 14 28 2 -23 -39 1 -55 -65 13 -17 -2 1 24 -1 -51 -52 -17 13 -20 -1 -13 -25 16 -50 -58 28 24 62 0 22 -31 20 33
4071 33 -2 4 51 25 20 45 15 0 27 4 37 58 -28 -1 52 17 63 4 9 -18 7 62 14 23 -27 -38 51 -19 16 -32 27 -20
4103 -20 16 57 -29 -7 9 7 -5 67 -26 4 24 4 -40 1 -47 -64 -17 -32 -10 -4 -61 -24 6 6 -48 -37 -22 -43 15 49 -35 -1
4135 -1 -6 -44 8 50 -21 -15 27 21 -31 -25 -53 15 -34 -47 30 51 13 1 22 57 -19 38 25 9 50 -27 -21 20 29 22 50 -13 -33 -8
4169 -8 41 -15 12 8 -30 34 -50 -19 44 53 19 -36 -31 -15 -21 -7 -3 -29 45 -10 -19 -8 14 -27 9 -9 -45 -20 39 -19 -56 -20 -51 -5
4203 -5 5 3 3 -19 -54 -8 45 4 -34 -24 25 -38 43 2 3 33 -22 25 10 13 -25 83 14 -8 30 27 -28 18 42 -49 8 12 51
4236 51 -5 47 7 44 69 13 81 47 -8 -2 -1 16 -13 4 -67 35 20 -32 53 19 -15 -38 13 0 -56 13 22 -26 4 -28 -82
4267 -82 8 31 -15 47 -50 25 5 -50 4 -34 -14 -12 -44 21 -57 22 1 6 -56 33 -35 5 -2 -15 -31 6 1 -57 27 -22 -24 25 26
4300 26 -63 43 15 8 38 43 -68 45 53 16 20 46 -34 32 -22 92 5 61 8 7 -34 -17 17 94 2 -38 27 -27 25 29 58
4331 58 -2 6 -1 3 -36 -22 -12 36 4 -20 -67 20 -106 18 -10 -63 19 -44 -49 -15 -31 -6 -24 -11 -46 -16 -5 -54 -3 40 39 -14
4363 -14 37 1 12 -41 0 -12 -20 -9 20 4 67 47 12 9 43 12 -6 35 14 31 9 18 20 65 43 -44 35 20 17 1 8 -11 44
4396 44 -1 6 24 -25 21 23 13 9 -9 9 -19 -29 -44 51 -9 23 -39 28 -19 -24 16 0 26 36 -13 -62 24 13 8 -20 -31 -38 -32 -28
4430 -28 48 -6 -7 18 2 2 16 -21 32 -20 5 -17 -8 -16 19 -23 9 -20 3 6 2 -49 51 67 -19 -14 36 -17 -15 44 1 14 55 19
4464 19 9 50 33 2 49 -7 33 -41 53 50 1 0 -39 0 11 2 -18 29 0 44 12 10 6 21 -86 -24 10 4 -9 14 28 7 -23
4497 -23 -21 -53 -9 -5 -6 -4 35 -47 18 9 -13 47 -8 0 31 18 -1 86 47 7 -33 -11 64 -13 13 15 19 -30 38 17 -26 -25 -11 46 -42
4532 -42 1 31 -52 -7 -16 42 -1 39 16 -12 3 -8 24 8 14 3 0 -6 33 20 -5 5 50 -31 -33 -37 2 -2 39 -3 -46 34 -32 6
4566 6 -100 -40 -46 -34 13 -34 -16 -18 -24 -40 -19 34 -15 -29 -33 -54 -2 -40 -40 -13 17 52 22 11 23 39 23 38 -43 -9 4 -18 -2
4599 -2 36 0 34 -20 -13 30 36 -24 65 -17 -35 23 1 18 36 25 26 17 41 -8 4 25 -58 27 20 56 -22 -6 19 10 -73 4 27 8
4633 8 -41 -16 50 -23 12 18 -24 -15 31 54 25 47 -51 -1 -2 -81 12 -58 -4 -35 -13 -49 -26 -32 -3 -27 -45 -51 16 62 1 -18 -25 34
4667 34 5 -10 50 39 30 14 3 1 3 37 -8 -14 -16 -8 44 -4 5 -1 11 -3 5 -9 6 25 -49 -45 18 48 -59 18 19 41 6 -39 22
4702 22 -17 -23 24 -59 10 -23 -21 -36 -25 35 -27 -33 -2 -26 15 -11 -41 -39 19 1 -21 1 -23 -32 -22 -54 12 -68 -10 -29 -15 -5 -10
4735 -10 -18 -46 3 30 32 -41 21 -13 -9 -58 33 -9 -13 -8 33 15 12 45 -38 38 43 -30 14 -9 24 44 3 10 54 -4 23 -37 -34 18 11
4770 11 -14 33 -33 -3 -8 -9 58 -51 1 -14 -35 8 22 50 -12 1 -50 14 -42 -79 -5 29 25 -6 -21 15 -9 22 16 20 15 -31 -16
4803 -16 11 6 -17 48 -7 -5 -24 -63 -10 -11 3 14 48 17 -46 -32 -16 51 -11 -35 66 -41 1 8 34 -13 -6 41 36 -12 3 -19
4835 -19 3 -34 94 58 -5 19 31 -30 16 72 4 30 36 -36 15 -23 35 -23 5 -51 -57 -48 34 -42 -43 13 -27 -26 11 -40 -29 26
4867 26 11 -14 5 12 -16 -1 34 -5 42 -18 -20 47 2 -59 -25 -20 -6 33 7 17 39 -29 5 -75 -31 -13 16 8 -10 10 -29 57
4899 57 16 -14 -18 -3 -19 -17 32 20 -26 11 21 -32 4 15 60 48 45 -17 -27 20 -12 22 12 16 16 26 25 26 22 4 36 5 -6 -37
4933 -37 -3 1 -47 -60 -40 -58 -12 43 -42 -44 -30 7 38 -13 -18 -6 14 -48 -10 45 -10 21 -36 -11 -10 -26 -10 56 9 42 -28 -33 8
4966 8 4 -3 8 -24 -12 -15 -22 -17 16 1 -30 18 -5 -10 9 8 28 20 20 18 81 2 18 -7 -9 50 48 18 -19 2 44 33 13 -36 36 -30 63
5003 63 -37 -9 21 -60 10 -43 -13 -16 -45 -50 -10 -19 8 -57 -53 -44 2 22 -38 -12 -24 -25 -29 -15 15 -21 4 -34 1 20 31 -14 55
5036 55 -14 10 37 48 -10 37 7 -16 31 -3 -12 56 -28 33 1 -19 31 15 65 9 -20 60 -21 29 19 18 -34 -55 -35 -33 1 14
5068 14 36 -11 17 -24 -24 13 -17 61 48 -35 21 14 43 -34 10 16 -33 -23 -37 -56 -8 11 41 -39 -35 -37 -66 6 -20 9 -22 -24 26
5101 26 8 -22 -4 -3 -11 -22 -75 -49 14 -7 -8 -14 23 28 62 26 6 36 8 -60 -5 -21 45 10 -9 -31 35 25 5 35 18 16 -38
5134 -38 26 13 0 -18 -39 -29 10 47 -23 17 2 6 22 12 7 -28 6 -10 50 -26 27 -27 -35 -5 27 -24 3 -24 -13 -11 -50 9
5166 9 31 -10 -13 -8 -1 19 -34 -25 -48 17 -21 -4 -9 0 -4 -45 50 9 11 -11 -1 -10 -22 30 -2 44 15 30 -38 4 -53 15 -3 43 20
5201 20 32 26 -35 14 -14 11 36 -8 -6 38 -27 -15 -28 26 14 -18 16 33 1 -15 45 15 5 26 -7 -23 -52 39 -63 -15 -23
5232 -23 49 34 45 -2 26 20 16 -17 5 4 52 -23 -21 29 -15 2 -69 -39 -18 3 -32 -4 -45 27 -61 -9 -31 -5 -13 -29 5 1 -10
5265 -10 -14 -40 3 1 -32 -12 5 27 41 4 29 -34 2 14 20 -39 -19 31 34 -47 35 14 6 -6 61 -9 27 -7 15 -37 -1 -26 14
5298 14 19 -15 18 -1 30 15 0 26 -2 -20 -1 -41 -9 -32 12 -20 7 -26 28 22 52 -27 61 -14 39 30 -18 2 45 -52 -8 13
5330 13 -29 -12 -41 6 -48 -7 -49 -85 50 28 -30 32 -1 31 49 -39 28 -17 20 54 5 2 -17 8 19 -2 10 21 -26 1
5360 1 36 4 13 -20 -4 -53 -5 33 -12 -1 11 -15 26 48 -17 21 -17 -30 9 -1 -21 46 -35 -21 -22 -3 -16 -12 -11 -36 28 4 -46
5393 -46 -10 18 -39 -7 2 -39 -11 -1 -46 -30 38 6 29 -19 -8 -33 9 -35 0 -8 37 -18 33 -5 -4 10 8 -25 9 3 56 50 2
5426 2 8 -14 -36 -3 23 61 -23 -32 2 24 72 -32 -6 -10 -25 -15 -18 -11 0 9 11 -42 -11 -9 36 13 -27 -31 33 -9 -16 -81 -12 -10 -2 40
5462 40 -22 -35 -38 -11 20 -6 23 4 -16 13 -18 -6 34 -6 33 27 44 57 1 -14 -3 -21 8 8 -19 9 41 18 -5 3 -31 -22 27
5495 27 -12 11 24 22 40 -34 2 -38 -15 7 3 -6 -18 -20 14 46 11 7 -10 12 -23 -9 25 -6 6 16 33 15 2 -69 41 61
5527 61 19 26 -11 21 -10 39 -8 3 17 27 1 32 7 15 13 -6 -32 -58 -13 -3 -56 -37 22 -23 37 11 -46 -42 -8 22 51 30
5559 30 19 9 23 2 4 13 15 -11 31 -4 -1 -32 21 1 13 -29 -25 38 33 -23 -1 -29 -17 20 -4 30 -14 4 -11 4 -4 0 -20 20
5593 20 -3 -6 24 -24 14 -9 8 25 -9 -11 33 -70 -39 -7 3 -57 -3 3 24 19 7 -19 -33 18 -31 -36 -9 25 -16 -25 6 -21 -15
5626 -15 -1 -31 -15 -2 -43 -24 20 13 19 -9 69 15 4 23 44 67 21 -5 91 3 44 14 16 -8 -4 -5 -15 36 71 -34 -4 -4 12
5659 12 52 9 50 -45 -50 4 -35 -18 -20 -3 -9 -48 27 -43 -46 35 7 -38 0 -11 8 -39 -18 17 36 -56 -8 -4 3 59 -22 -5 -19
5692 -19 5 -21 9 -45 13 -8 -43 12 -8 -21 -10 -16 21 -3 -1 -45 1 10 -23 11 71 20 9 39 47 12 22 7 52 -3 13 6 37
5725 37 11 17 6 -18 22 2 -21 8 4 -46 74 -5 27 34 9 -6 -34 42 -14 -40 47 2 -29 -37 -23 22 -10 -9 22 -15 -8 -60 -12
5758 -12 20 32 -45 -23 -36 47 -23 0 25 8 32 48 6 4 -15 3 -22 -4 14 41 -49 -33 22 -7 -5 -14 -49 45 -8 -20 -9 -1
5790 -1 -16 22 -16 15 14 18 4 -24 14 -17 16 47 82 15 49 -5 49 6 0 -12 31 50 -19 -3 39 -6 -6 -2 -38 15 -19 -2 -29
5823 -29 13 8 3 26 -2 -9 38 -24 -4 -16 -3 -41 32 -6 27 -13 26 19 26 27 37 3 76 8 21 12 58 -10 -15 -13 -2 -22 12 23 -16
5858 -16 9 -2 20 -8 27 1 3 23 24 -28 31 30 9 -13 13 35 35 28 21 -11 17 18 -14 6 48 5 -14 23 9 9 -51 -13 -25 17
5892 17 -45 -23 -42 -40 16 -31 17 4 -29 45 -52 -19 1 -9 -43 -25 12 28 -4 -10 26 -22 4 -12 -39 -3 26 -37 40 -6 -22
5923 -22 32 8 34 48 13 -2 10 9 -3 -2 3 42 15 37 -81 22 -16 -16 6 9 15 -29 15 -13 -14 -11 27 -26 -38 6 13 -4 34 4
5957 4 71 -18 24 18 -12 12 37 -11 12 30 36 19 27 -15 15 9 -6 -3 8 9 -19 7 8 11 19 19 -3 -20 42 -38 -32 -53 -16 -16 -24 -28 -6 32
5995 32 -8 -22 33 -46 -11 24 -20 32 29 9 33 14 -12 8 -19 64 24 49 2 7 -30 -6 -34 24 -9 -44 -36 -30 -7 -32 31 -55
6027 -55 26 -42 -4 -20 22 12 -14 3 31 54 28 -10 32 12 -1 -51 49 48 10 25 -24 23 16 43 -18 -35 18 24 -68 -29 56
6058 56 -62 5 -12 17 30 -38 -50 -4 -3 1 15 20 -16 -5 -24 -19 18 0 -5 -2 48 5 6 -38 -28 31 -5 -3 18 -1 -16 11 16 -37
6092 -37 33 20 40 -28 8 2 19 44 24 23 -25 31 -11 -9 40 -36 -2 14 -52 -5 -14 -21 24 9 17 -11 17 -9 29 12 19 25 1 -42
6126 -42 -3 10 21 -26 -57 -37 -9 16 -9 -57 41 -8 -18 -41 -17 39 -11 -5 -19 -6 -8 13 22 1 1 -43 -12 19 -15 2 -5 -8 28
6159 28 23 -8 24 -1 2 -28 -10 -9 -17 -1 15 0 31 10 45 16 47 33 -35 21 12 36 -39 15 17 55 31 1 -42 -23 32 7 -40
6192 -40 -25 -44 -45 -13 7 -46 -8 16 38 -19 -55 -7 -11 -10 -20 101 -20 17 27 3 0 -13 14 -55 -45 -20 -40 13 -12 16 8 -59
6224 -59 -5 -41 17 -51 37 9 40 -55 -1 -29 20 1 19 10 -16 35 41 10 -1 16 -14 -17 -11 24 -4 -13 -9 -55 26 3 -30 8 -34
6257 -34 -5 23 -52 -7 28 -26 -16 16 -5 -27 11 -46 -49 -9 -17 -7 27 -7 7 -3 14 57 0 10 -5 12 -14 -19 -12 60 -44 -43
6289 -43 19 -15 -3 53 -9 7 25 35 31 -33 44 -35 9 20 2 -16 39 -10 -32 31 -14 7 5 -35 -13 12 5 -22 24 -21 11 15
6321 15 20 14 -21 -23 -7 8 29 -6 54 -60 -27 53 32 7 -10 31 2 -38 -18 -17 -6 21 4 20 -38 0 26 -11 -12 19 8 -15
6353 -15 13 -7 -17 -18 -49 -2 -23 -48 7 74 24 -14 13 3 -15 -52 -36 -3 22 31 53 8 1 -7 -9 -10 7 21 -38 0 -14 28 6
6386 6 -23 12 -19 -8 5 -44 4 34 -34 -17 24 -19 4 57 41 -25 -6 -26 -35 12 65 30 -23 -38 10 -43 54 2 -10 19 32
6417 32 24 -11 29 3 -29 -15 -8 -22 -30 -19 -8 8 8 13 -11 -43 12 -37 25 -7 -19 15 2 24 -53 22 4 -33 28 16 -15 2 0
6450 0 -4 35 -1 19 30 -1 16 9 4 2 -19 -26 4 3 0 4 -28 -29 -21 -19 44 30 -2 8 28 -21 2 20 33 -4 4 -13 18 -21 -21 51 58 34
6488 34 21 41 -6 -13 2 9 3 12 -5 -24 -25 -14 28 -21 -31 -3 12 8 4 -6 29 -50 -31 -2 -8 -7 -8 7 -37 -38 -27 36 -29 9 11 10 -3
6525 -3 33 54 -8 -6 24 24 -11 -36 -15 1 5 17 38 46 28 -39 66 -4 -47 10 -30 4 -29 -19 -7 -67 21 -5 0 53 37 0 11
6558 11 46 23 49 -18 34 -6 39 -3 28 38 -51 -52 -30 -27 33 -33 -10 -6 -31 -19 -16 2 6 21 17 12 28 49 -9 -9 28 26 -21 31 37
6593 37 -32 -42 13 -3 47 -20 18 32 3 -16 28 11 24 46 16 -41 17 49 25 20 29 14 2 -20 30 22 6 -30 -32 -3 20 14 -4
6626 -4 -12 -1 -57 -19 24 38 -54 -61 -5 25 -9 10 13 29 -11 7 23 -11 -19 -22 24 -30 35 -12 -10 9 -16 -23 -40 -6 27 -5 1 -4 -29
6661 -29 5 -8 -50 -19 -82 24 21 22 6 2 -25 0 -1 10 63 -6 47 3 44 1 44 29 -4 12 -6 -16 11 42 14 2 9 1 41
6694 41 16 5 -16 27 -53 -16 30 46 12 8 -24 -50 -25 -10 35 -16 37 -10 22 -38 47 28 -17 37 3 42 11 18 -4 44 4
6725 4 5 33 3 -3 -11 -19 -23 20 -10 -8 -28 -61 -8 -27 -37 -27 35 26 12 -9 34 17 30 -1 15 -41 -4 -18 -26 -29 -58 9 2 -33 4 -29
6761 -29 31 22 12 33 27 0 -33 6 26 5 27 -24 -58 25 13 39 56 10 14 3 4 -13 21 -4 2 -31 -8 41 -44 8 -1 23 -14
6794 -14 -1 6 27 12 -47 18 30 -13 38 10 30 13 -20 27 -30 -10 -28 42 24 41 6 -7 10 -20 -14 2 -9 5 3 29 -34 -23
6826 -23 16 27 48 -30 2 13 -45 -22 5 22 -11 -54 -47 -6 14 -25 -8 -6 9 -18 1 33 -16 18 6 21 -33 -30 -14 10 20 30
6858 30 33 19 -18 -34 5 16 -7 -13 -35 18 24 9 -29 14 -16 -19 14 4 13 14 -56 -12 18 -11 -22 -24 -19 -24 26 8 -5 11 -2 21 19
6893 19 -30 8 -42 -14 -48 55 8 21 25 26 -18 -10 -12 7 27 -42 20 4 28 4 -9 40 -27 -19 4 -15 4 -15 15 9 10 -14 0
6926 0 -1 -7 0 0 -18 18 6 31 48 45 13 -17 -89 -5 12 -25 -33 1 62 -63 -12 -23 -9 7 -30 14 -23 -22 25 -2 10 13 43 -23
6960 -23 -16 -18 13 -6 13 14 2 -21 -22 9 4 28 15 -14 -35 22 -6 -3 19 6 -7 11 4 0 35 34 -11 10 7 20 -11 35 47 -12 -8 10
6996 10 -36 12 -19 -11 -32 -12 -7 -62 17 -17 39 29 -8 0 30 25 4 32 2 29 5 19 7 -2 24 54 -18 7 -20 -49 -52 -7 -4 16
7030 16 -7 -19 -43 38 19 -28 -40 -15 -37 61 18 20 31 -17 -19 0 36 21 23 -16 16 -3 47 -4 27 -2 -30 -11 50 -3 31 48
7062 48 0 -11 18 -80 50 20 16 -26 -19 -59 -5 52 11 23 -13 -32 9 -2 8 -12 44 12 -21 -18 20 24 -16 -2 31 12 38 -16
7094 -16 17 23 53 -17 21 -36 10 33 50 37 -26 6 -22 6 -36 -17 11 -12 -35 -15 13 11 15 -42 28 -16 -49 -24 10 -24 -19 10
7126 10 -19 60 -16 -46 36 10 27 31 -19 33 1 19 -21 47 46 -9 -27 -35 45 -13 -52 6 -79 52 13 -33 27 -18 -7 -36 -4
7157 -4 -21 21 -40 -29 -5 -25 -26 -22 63 3 5 -5 20 -42 -2 13 0 -17 60 -34 22 -17 25 4 -4 -7 -1 8 55 -31 13 -31 19 -11
7191 -11 -25 10 21 -16 18 -72 -14 -8 -7 5 -44 22 14 39 8 -42 14 -5 64 18 46 30 10 3 19 39 39 25 -21 -25 -22 19 -52 6
7225 6 -7 -14 -37 -65 -38 -48 15 -10 -48 5 -44 19 5 13 -8 7 29 3 31 -44 51 21 -1 8 32 -24 29 30 7 26 19 -6 9
7258 9 -3 2 6 -1 12 15 40 32 -3 7 15 -34 50 1 -57 -18 47 -58 53 30 19 9 -8 15 -3 -16 3 38 11 13 34 8 3 40
7292 40 -15 19 -5 14 29 33 -55 -22 -40 12 32 -30 -12 -84 17 -11 4 -10 -1 -61 5 31 -31 25 -4 -39 -8 -26 0 -65 9
7323 9 -21 -39 46 8 -2 -51 -56 10 27 -28 8 17 -4 -15 5 -20 -3 22 -18 36 6 -35 18 11 38 5 -59 0 20 -2 -46 -11
7355 -11 -5 14 -32 -20 -8 30 21 45 34 -13 -5 43 54 70 45 12 -11 43 -35 27 -10 44 45 39 -36 24 -30 -6 0 46 7 23 -23
7388 -23 0 51 -21 27 7 58 -14 -8 -20 -16 -18 14 9 7 -41 -6 -49 -10 -1 -7 -32 -16 16 -15 -8 64 61 -39 35 -3 -31 -46 -30 32
7422 32 32 21 -41 -35 -14 -32 14 -24 8 0 -16 25 -63 29 22 50 -68 43 25 -6 9 -25 -18 2 20 -13 19 -8 44 8 -15 20
7454 20 12 45 -18 -17 -4 -4 -20 23 -1 52 3 39 -25 -23 -32 -30 -16 0 -34 0 -6 15 7 21 -52 -46 -7 -4 -8 9 -24 13 49 -33 8 -12
7490 -12 0 -4 -12 -5 -9 25 8 29 -41 -13 71 -30 12 -20 18 -3 -2 21 3 38 -39 -21 57 23 -38 -10 37 -12 1 -18 -3 11
7522 11 -76 -26 -32 18 -15 19 29 12 -26 -20 -39 12 -3 -34 29 -11 -29 -44 -14 13 24 47 -27 -47 37 -8 -27 27 30 -12 -29 -40
7554 -40 -24 -18 -7 27 5 -4 -24 -23 -7 55 -24 -28 33 -23 19 6 15 -28 -8 -9 26 4 -9 6 21 -2 47 -20 15 -40 -33 8 -16 32
7588 32 -16 -5 -44 29 66 -48 5 -55 -53 62 -42 25 -4 -1 -9 0 -27 -11 -37 24 -38 1 27 70 89 37 -6 45 24 16 -23
7619 -23 -1 -21 -15 -8 -39 11 -25 29 36 -20 24 33 21 37 36 -46 -41 6 2 -36 -30 -18 8 -26 -21 52 32 -21 0 28 1 7 24 -40 20
7654 20 19 -3 1 21 50 -2 -54 15 10 24 -24 11 2 -24 -41 -56 -9 -44 23 40 -2 -15 -10 -41 -42 -18 -16 19 18 -9 40 -51 -45 -2 -7
7689 -7 40 -25 -5 2 -65 -22 10 -2 -14 13 -17 32 -16 25 31 -27 -31 -38 -7 -48 32 -20 -2 -24 -1 6 -39 -3 38 34 -9 26 9 -2
7723 -2 -12 -8 29 1 28 7 -17 6 -1 7 -3 -34 3 -28 34 10 21 -3 0 5 4 -10 24 -9 21 15 -27 -8 -14 3 34 24 -61 -25 21
7758 21 6 -38 5 10 15 -10 -8 34 -20 -8 -19 25 -29 5 -2 33 31 -48 56 -4 25 -13 19 -15 -12 -76 -1 28 -23 -33 -12 -6 24
7791 24 15 -37 21 -33 -13 -36 3 -22 10 -39 -29 0 5 -7 21 12 -3 -25 -7 63 -11 8 -1 10 -5 27 -45 -2 8 8 -15 -6 24
7824 24 -13 -48 -40 54 3 47 -42 38 19 -13 -28 -38 -26 -38 -13 -21 -22 -1 -25 -1 -21 -31 -52 -41 -15 13 -39 -5 1 48 26 44
7856 44 7 -42 80 2 46 1 -41 21 -9 10 24 21 -43 -4 20 -24 4 -44 41 -5 -28 39 -27 -7 -18 -3 -37 13 -14 -45
7886 -45 -16 1 13 -18 26 3 48 -5 47 20 3 36 21 31 48 12 -3 31 8 45 20 3 17 -3 -50 1 19 -4 -19 -33
7916 -33 -30 -68 -15 -58 -13 -26 1 26 43 16 28 -34 -21 -17 34 -15 27 37 -13 -4 -14 23 -32 30 -11 50 0 21 23 -20 23 -4
7948 -4 27 -76 14 -34 4 -10 -41 3 -54 -15 30 -10 -6 14 -15 -11 -6 -10 -50 17 5 46 53 -13 7 -21 -5 0 25 41 17 14 13 51
7982 51 12 -4 12 -70 24 6 -23 30 -18 41 -31 5 4 -41 -24 -35 -46 5 -19 1 9 -42 -2 -64 1 -27 -23 -6 2 2 74 -11 -15
8015 -15 -68 12 -59 6 16 13 14 7 17 -27 -43 19 -26 -6 -34 -11 10 -13 -15 -8 16 -11 21 40 11 -37 -11 -3 8 3 8 -48 21 -4
8049 -4 9 25 15 -15 45 10 35 -64 -4 -16 -33 -20 -51 -20 -73 -6 10 6 2 22 18 38 29 -67 -25 -15 29 24 -64 -2 -50 -15 -1
8082 -1 -7 8 12 1 -28 -20 -31 4 6 -21 47 27 14 -4 39 -16 49 -51 7 19 9 17 -13 23 -18 15 39 -5 -30 -25 9 -27 13
8115 13 31 9 -33 -36 32 10 6 -11 10 -10 7 -30 8 7 17 7 -34 17 2 16 6 44 47 7 57 -26 -51 60 2 34 -45 10
8147 10 26 9 48 -31 -14 -41 -16 18 -29 32 -28 -33 -15 -33 -22 -7 -8 -26 -29 8 3 36 0 -24 18 7 62 -11 7 -16 -7 53 -10
8180 -10 43 17 -43 4 4 26 40 -1 13 -33 -22
8191b2
##END NTUPLES=NMR FID
##END=
