##TITLE=1H_Ser 4954-H
 CDCl3, 8 sc, 
 1.9.2020
##JCAMPDX= 6.0         $$ Bruker NMR JCAMP-DX V2.0
##DATA TYPE= NMR FID
##DATA CLASS= NTUPLES
##ORIGIN= UXNMR, Bruker Analytische Messtechnik GmbH
##OWNER= root
$$ XWIN-NMR		Version 3.5
$$ Tue Sep  1 12:03:40 2020 Russian Standard Time (UT+4h)  she@DPX200
##.OBSERVE FREQUENCY= 200.1315066352
##.OBSERVE NUCLEUS= ^1H
##.DELAY= (6, 6)
##.ACQUISITION MODE= SIMULTANEOUS
##.ACQUISITION SCHEME= undefined
##.AVERAGES= 8
##.DIGITISER RES= 18
##SPECTROMETER/DATA SYSTEM= spect
##.PULSE SEQUENCE= zg30
##.SOLVENT NAME= CDCl3
##.SHIFT REFERENCE= (INTERNAL, CDCl3, 0, 15.7039)
##AUDIT TRAIL= $$ (NUMBER, WHEN, WHO, WHERE, WHAT)
$$ ##TITLE= Audit trail, XWIN-NMR		Version 3.5
$$ ##JCAMPDX= 5.01
$$ ##ORIGIN= Bruker BioSpin GmbH
$$ ##OWNER= she
$$ F:/spectra/data/she/nmr/H-F/1/audita.txt
$$ ##AUDIT TRAIL=  $$ (NUMBER, WHEN, WHO, WHERE, WHAT)
(   1,<2020-09-01 12:02:30.04 +0400>,<she>,<DPX200>,
      <created by zg, POWCHK disabled, PULCHK disabled
       configuration hash MD5:
       00 E9 B6 7A A2 85 ED C7 34 08 36 98 17 FE 4E 26
       data hash MD5: 16K
       D2 35 B5 08 60 39 81 08 26 45 9F D8 26 E2 68 92>)
$$ ##END=
$$ 
$$ hash MD5
$$ D0 D4 1F 23 43 D8 A2 95 71 43 45 0F AC BF 68 6F
##$RELAX= 
##$RELAX= 
##$RELAX= 
##$RELAX= 
##$RELAX= 
##$RELAX= 
$$ Bruker specific parameters
$$ --------------------------
##$DU= <F:/spectra>
##$EXPNO= 1
##$NAME= <H-F>
##$PROCNO= 1
##$TYPE= <nmr>
##$USER= <she>
##$AMP= (0..31)
100 100 100 100 100 100 100 100 100 100 100 100 100 100 100 100 100 100 
100 100 100 100 100 100 100 100 100 100 100 100 100 100 
##$AQSEQ= 0
##$AQ_mod= 1
##$AUNM= <au_zg>
##$AUTOPOS= <>
##$BF1= 200.13
##$BF2= 200.13
##$BF3= 200.13
##$BF4= 200.13
##$BF5= 200.13
##$BF6= 200.13
##$BF7= 200.13
##$BF8= 200.13
##$BYTORDA= 1
##$CFDGTYP= 0
##$CFRGTYP= 5
##$CHEMSTR= <none>
##$CNST= (0..31)
1 1 145 1 1 1 1 1 1 1 1 1 1 1 1 1 1 1 1 1 1 1 1 1 1 1 1 1 1 1 1 1 
##$CPDPRG= <>
##$CPDPRG1= <>
##$CPDPRG2= <>
##$CPDPRG3= <>
##$CPDPRG4= <mlev>
##$CPDPRG5= <mlev>
##$CPDPRG6= <mlev>
##$CPDPRG7= <mlev>
##$CPDPRG8= <mlev>
##$CPDPRGB= <>
##$CPDPRGT= <>
##$D= (0..31)
0 1.2 0 0 0 0 0 0 0 0.06 0 0.03 0 0 0 0 0.0002 0 0 0 0 0 0 0 0 0 0 0 0 
0 0 0 
##$DATE= 1598947349
##$DBL= (0..7)
120 120 120 120 120 120 120 120 
##$DBP= (0..7)
150 150 150 150 150 150 150 150 
##$DBP07= 0
##$DBPNAM0= <>
##$DBPNAM1= <>
##$DBPNAM2= <>
##$DBPNAM3= <>
##$DBPNAM4= <>
##$DBPNAM5= <>
##$DBPNAM6= <>
##$DBPNAM7= <>
##$DBPOAL= (0..7)
0.5 0.5 0.5 0.5 0.5 0.5 0.5 0.5 
##$DBPOFFS= (0..7)
0 0 0 0 0 0 0 0 
##$DE= 6
##$DECBNUC= <off>
##$DECIM= 32
##$DECNUC= <off>
##$DECSTAT= 4
##$DIGMOD= 1
##$DIGTYP= 9
##$DL= (0..7)
0 120 120 120 120 120 120 120 
##$DP= (0..7)
150 150 150 150 150 150 150 150 
##$DP07= 0
##$DPNAME0= <>
##$DPNAME1= <>
##$DPNAME2= <>
##$DPNAME3= <>
##$DPNAME4= <>
##$DPNAME5= <>
##$DPNAME6= <>
##$DPNAME7= <>
##$DPOAL= (0..7)
0.5 0.5 0.5 0.5 0.5 0.5 0.5 0.5 
##$DPOFFS= (0..7)
0 0 0 0 0 0 0 0 
##$DQDMODE= 0
##$DR= 18
##$DS= 0
##$DSLIST= <SSSSSSSSSSSSSSS>
$$ [...]
##$SUBNAM2= <"">
##$SUBNAM3= <"">
##$SUBNAM4= <"">
##$SUBNAM5= <"">
##$SUBNAM6= <"">
##$SUBNAM7= <"">
##$SUBNAM8= <"">
##$SUBNAM9= <"">
##$SW= 16.880792210976
##$SWIBOX= (0..15)
0 0 2 0 0 0 0 0 0 0 0 0 0 0 0 0 
##$SW_h= 3378.37837837838
##$TD= 16384
##$TD0= 1
##$TE= 0
##$TE2= 300
##$TE3= 300
##$TEG= 300
##$TL= (0..7)
0 120 120 120 120 120 120 120 
##$TP= (0..7)
150 150 150 150 150 150 150 150 
##$TP07= 0
##$TPNAME0= <>
##$TPNAME1= <>
##$TPNAME2= <>
##$TPNAME3= <>
##$TPNAME4= <>
##$TPNAME5= <>
##$TPNAME6= <>
##$TPNAME7= <>
##$TPOAL= (0..7)
0.5 0.5 0.5 0.5 0.5 0.5 0.5 0.5 
##$TPOFFS= (0..7)
0 0 0 0 0 0 0 0 
##$TUNHIN= 0
##$TUNHOUT= 0
##$TUNXOUT= 0
##$USERA1= <user>
##$USERA2= <user>
##$USERA3= <user>
##$USERA4= <user>
##$USERA5= <user>
##$V9= 5
##$VALIST= <valist>
##$VCLIST= <CCCCCCCCCCCCCCC>
##$VD= 0
##$VDLIST= <DDDDDDDDDDDDDDD>
##$VPLIST= <PPPPPPPPPPPPPPP>
##$VTLIST= <TTTTTTTTTTTTTTT>
##$WBST= 1024
##$WBSW= 4
##$XGAIN= (0..3)
0 0 0 0 
##$XL= 0
##$YL= 0
##$YMAX_a= 192334
##$YMIN_a= -143347
##$ZGOPTNS= <>
##$ZL1= 120
##$ZL2= 120
##$ZL3= 120
##$ZL4= 120
##$ABSF1= 10
##$ABSF2= 0
##$ABSG= 5
##$ABSL= 3
##$ALPHA= 0
##$AQORDER= 0
##$ASSFAC= 0
##$ASSFACI= 0
##$ASSFACX= 0
##$ASSWID= 0
##$AUNMP= <proc_1d>
##$AZFE= 0.1
##$AZFW= 0.1
##$BCFW= 1
##$BC_mod= 2
##$BYTORDP= 1
##$COROFFS= 0
##$CY= 11.3945322036743
##$DATMOD= 1
##$DC= 2
##$DFILT= <>
##$DTYPP= 0
##$F1P= 16.9975609425685
##$F2P= -3.02152046262296
##$FCOR= 0.5
##$FTSIZE= 0
##$FT_mod= 4
##$GAMMA= 1
##$GB= 0.15
##$INTBC= 1
##$INTSCL= 1
##$ISEN= 128
##$LB= 0.24
##$LEV0= 0
##$LPBIN= 0
##$MAXI= 10000
##$MC2= 0
##$MEAN= 0
##$ME_mod= 0
##$MI= 1.114404
##$NCOEF= 0
##$NC_proc= 0
##$NLEV= 6
##$NOISF1= 3.799351
##$NOISF2= 2.8
##$NSP= 1
##$NTH_PI= 0
##$NZP= 0
##$OFFSET= 15.70392
##$PC= 1
##$PHC0= -9976.67
##$PHC1= 16.40092
##$PH_mod= 1
##$PKNL= yes
##$PPARMOD= 0
##$PSCAL= 0
##$PSIGN= 0
##$REVERSE= no
##$SF= 200.130013532006
##$SI= 16384
##$SIGF1= 3
##$SIGF2= 2
##$SINO= 400
##$SIOLD= 16384
##$SREGLST= <1H.CDCl3>
##$SSB= 0
##$STSI= 0
##$STSR= 0
##$SW_p= 3612.71676300578
##$SYMM= 0
##$S_DEV= 0
##$TDeff= 0
##$TDoff= 0
##$TI= <>
##$TILT= no
##$TM1= 0
##$TM2= 0
##$TOPLEV= 0
##$USERP1= <user>
##$USERP2= <user>
##$USERP3= <user>
##$USERP4= <user>
##$USERP5= <user>
##$WDW= 1
##$XDIM= 8192
##$YMAX_p= 0
##$YMIN_p= 0
$$ End of Bruker specific parameters
$$ ---------------------------------
##NTUPLES= NMR FID
##VAR_NAME=  TIME,          FID/REAL,        FID/IMAG
##SYMBOL=    X,             R,               I
##VAR_TYPE=  INDEPENDENT,   DEPENDENT,       DEPENDENT
##VAR_FORM=  AFFN,          ASDF,            ASDF
##VAR_DIM=   8192,          8192,            8192
##UNITS=     SECONDS,       ARBITRARY UNITS, ARBITRARY UNITS
##FACTOR=    0.000296,      1,               1
##FIRST=     0,             0,               0
##LAST=      2.424536,      0,               0
##MIN=       0,             -143347,         0
##MAX=       2.424536,      192334,          0
$$ Real data points
##PAGE= N=1
##DATA TABLE= (X++(R..R)), XYDATA
$$ [...]
1809E39q02l86J090M46l72k91q1N60J54m53n62R59k7k96r01J30N59L9n79m89P12
$$ 539 -263 -649 441 887 515 224 143 703 857 404 -158 801 774 478 -423 -293 266 305 -274 -763 -51
1830e1L16Mq15J17Q38L83p7j266R40M79k91l93k99J71N88m67q66M61L22L22p16
$$ -51 265 269 -546 -429 409 792 715 -551 389 868 577 184 -115 56 644 177 -689 -228 94 416 -300
1851c00l10K44L67j43p07J65N42N65j012o2L98M73L22j157J79P94K0j55o93J93
$$ -300 -610 -366 1 -142 -849 -684 -142 423 -589 -651 -253 220 542 -615 -436 358 378 223 -470 -277
1871b77J022M0j277r5L97R12r64n21N43N88m0p37j56P07R82r73k54J12O49K59
$$ -277 745 785 -492 -587 -190 722 -242 -763 -220 368 328 -409 -565 142 1124 151 -103 9 658 917
1891I17r47k79P29L78j88r69J7R73K2o75r1m73J279k18j139N26kM91J20j047o9
$$ 917 -30 -309 420 798 610 -359 -342 631 653 -22 -113 -586 693 475 -664 -138 -140 351 471 -576 -645
1912f45J192j73k65n66M34R79r61j91k97P04N49q75q05Q25N26m32k17q08J161
$$ -645 547 374 109 -457 -23 956 -5 -196 -493 211 760 -115 -920 -95 431 -1 -218 -1026 135
1931A35rq78J39k63J354m93p95L46P23l17L46j237L48J655j074J29l81j38R99
$$ 135 126 -752 -613 -876 478 -15 -810 -464 259 -58 288 -949 -601 1054 -20 109 -272 -410 589
1950E89n37m31M10RL64l19j032R41j0J74j18j324J298P40o87l37K04L39P98j131
$$ 589 52 -379 31 40 404 85 -947 -6 -16 158 40 -1284 14 754 67 -270 -66 273 1071 -60
1970f0p61J175J41R8j106J49J291p29j12o03J37J057m71j268R99P3K27q5j137
$$ -60 -821 354 495 593 -513 -364 927 198 86 -517 -380 677 206 -1062 -63 10 237 152 -985
1989i85R44N59n55n82J44N69M31p89m42O57j80N79p01n03R92k5P1m84o98Q04N48
$$ -985 -41 518 -37 -619 -475 94 525 -264 -706 -49 -229 350 -351 -854 138 113 184 -300 -998 -194 354
2010C54q90L33l09O58L03r58j09M69N00l34q38L29J088m87l65j72R3J227r10p13
$$ 354 -536 -203 -512 146 449 -509 -618 -149 351 17 -821 -492 596 109 -256 -428 -335 892 -18 -731
2030g31Q75m6M06o49n71P89M17n02k08j36R56q2o00R2r0N88L9o77L5N13k7k68
$$ -731 144 98 504 -145 -716 73 490 -12 -220 -356 600 518 -82 10 -80 508 547 -130 -95 418 391 123
2052A23M2o85J006k79n2n91K92O74l39m97j69M95L75k67q84P25M16j80k78o35
$$ 123 165 -520 486 207 155 -436 -144 530 191 -306 -475 20 395 128 -756 -31 385 205 -73 -708
2072g08P42O83n34q53K67M98O8q60R9O94k8J07q47L7J024m24l91o8N81J54N5n79
$$ -708 34 717 183 -670 -403 95 163 -697 -598 96 68 175 -672 -635 389 -35 -426 -494 87 241 296 -283
2094b83J93M79j31k93l83O72j37l5k36l09N88K50m14n24L37L86K98m52m00P54
$$ -283 -90 389 258 -35 -418 254 117 82 -154 -463 125 375 -39 -563 -226 160 458 6 -394 360
2114C60K26L1p33M95K37o8j85m8K5K24K92j145K33O47J1l28p43M46K74qp76L78
$$ 360 586 617 -116 379 616 548 363 315 340 564 856 -289 -56 591 602 274 -469 -23 251 243 -533 -155
2136a55L31Q7o03J68L57J56K26q80L57L16J36m03l24l3O15N6p92q7O05K01n55
$$ -155 176 263 -340 -172 185 341 567 -313 44 360 496 93 -231 -264 351 407 -385 -472 133 334 -221
2157b21m04K97L58R2n86L1K86M57j78m42J18J25N90n06k91M89J92K3o85j70M47
$$ -221 -625 -328 30 122 -464 -433 -147 310 132 -310 -192 -67 523 17 -274 215 407 430 -255 -425 22
2178B2M94n44l88K48M20J60r42L54K15M35k83m39J39O16j2k56l68L03N14m98L7
$$ 22 516 -28 -416 -168 252 412 -530 -176 39 474 191 -248 -109 507 495 239 -129 174 688 190 227
2199B27l62N95P1n63k71N70J98n55N7m29O69J77l93j67L9P21m04m07J94J87M77
$$ 227 -135 460 531 -32 -303 267 465 -90 -33 -462 207 384 -9 -176 -137 584 180 -227 -33 154 631
2220F31o70l58J83Q84r12J26k74K57M43p40p6Q2Q19l93m20k65M59M49j26k48j67
$$ 631 -39 -397 -214 670 -242 -116 -390 -133 310 -430 -506 -424 395 2 -418 -683 -224 225 99 -149 -316
2241c16Q02j64m22l70K59M43o6n94J18N45K56o92lJ09M65k34k83m27P02L84l85
$$ -316 486 322 -100 -470 -211 232 166 -428 -310 235 491 -201 -204 -95 370 136 -147 -574 128 512 127
2262A27m53R8O22j48r6p28P50K40k26l84L32R3L19n06k19M55J94j03o79j24O23
$$ 127 -326 -228 394 246 150 -578 172 412 186 -198 134 227 546 40 -179 276 470 367 -312 -436 187
2283A87l3r2l74J94L74L1n48k12O11J8K62r34M92K79J62n67j06J57M94k94o05
$$ 187 154 62 -312 -118 256 287 -261 -473 138 156 418 -516 -24 255 417 -150 -256 -99 395 101 -504
2304e04J87K0O77l32p75P49l8Q4n29o0M59M74m60m96M57L58o8p52M34R8L98O6
$$ -504 -317 -297 380 48 -727 22 -16 68 -461 -521 -62 412 -48 -544 -87 271 203 -549 -115 -17 381 447
2326D47q17J46N69q0k78k57R2N88l31o95N95R4K77m66l25J95M32J85k81o28P38
$$ 447 -370 -224 345 265 -13 -270 -178 410 79 -616 -21 73 350 -116 -441 -246 186 371 90 -538 200
2347B00M14o66K14k99L13N15r21P4L89nk08k38J10N82m14o2l3l78J092n81k24
$$ 200 614 -52 162 -137 176 691 -230 -156 233 228 20 -218 -108 474 60 -2 -35 -413 679 98 -126
2368a26O3M28k59l5j37k9O04m03j27k58N28O9m74L6l66K90qJ03n23N31K15k55
$$ -126 -63 365 106 71 -66 -95 509 106 -21 -279 249 318 -156 -120 -486 -196 -204 -101 -624 -93 122 -133
2390a33l44k50Q30K05n52kJ49L69k17o2l25M36J70j78m55J27N04k38l17l11L49
$$ -133 -477 -727 103 308 -244 -246 -97 272 55 -7 -332 104 274 96 -359 -232 272 34 -283 -594 -245
2411b45O10j43o23L88K82p3o25K9Q00k72l1q9K00K24j02k10j49L00j06M2j93J5
$$ -245 365 222 -401 -13 269 196 -429 -400 400 128 97 8 208 432 330 120 -29 271 165 207 14 29
2433B9J60k61K25k67o9J65L44j39m13m2L68J98m62K41k98N86k39o57O81K61j75
$$ 29 189 -72 153 -114 -183 -18 326 187 -226 -268 100 298 -164 77 -221 365 126 -531 150 411 236
2454B36m73n7K86K70m42j60L44J04K81q10K56K23l5J98l92K7K39n9J8k71L70P5
$$ 236 -237 -294 -8 262 -180 -340 4 108 389 -421 -165 58 23 221 -171 -144 95 36 54 -217 153 228
2476B28k17l29L65J6J53j19j20p8J42k2R0j70k3M55n19K7j29K41M17m44j80N18
$$ 228 11 -318 47 63 216 97 -23 -101 41 19 109 -61 -84 371 -148 -121 -250 -9 408 -36 -216 302
2498C02J14j76l81j37Q12m25o7l8j68N79k85m39j1O25l01j88j36K34K98k60Q8
$$ 302 416 240 -141 -278 534 109 42 4 -164 415 130 -309 -320 305 4 -184 -320 -86 212 -48 40
2519D0k15M48j5m13Q6J92K85k94k84j18N96k73l17R6L7L19l41L8J1J04J15O0l74
$$ 40 -175 273 258 -155 -69 123 408 114 -170 -288 308 35 -282 -186 -149 170 -171 -133 -122 -18 97 157 -217
2542b17K37L1J0K08m15J17L84l83ML6J72K04j14m92L77j65J93o9m95M82N6M5j37
$$ -217 20 51 61 269 -146 -29 355 -28 -24 12 184 388 274 -218 159 -6 187 118 -377 105 161 206 69
2565F9k75P80l09n47J95M53o0Q2p93N01K10j1r6l42L94N9k87k82L08j18M24m41
$$ 69 -206 574 265 -282 -87 366 306 388 -405 96 306 295 199 -143 251 310 23 -259 49 -69 355 -86
2587h6k08M69l05R2J29k85M59M7l31l23L62K02J42o81J91K31n0J12n21K26L13
$$ -86 -294 175 -130 -38 91 -194 265 312 -19 -342 20 222 364 -317 -126 105 55 167 -354 -128 185
2608A85k66l06L37k59J50J0m73L50J46K35l03p2O33q0l79j70R4K28K98n55K99
$$ 185 -81 -387 -50 -309 -159 -149 -622 -272 -126 109 -194 -266 367 287 -92 -262 -168 60 358 -197 102
2629A02R1j55K21k80r0J23K82l80k82L58J33M5l42mM2M40m81J2L38OJ82l80p6
$$ 102 193 38 259 -21 -111 12 294 -86 -368 -10 123 168 -174 -178 -136 304 -177 -165 173 179 361 -19 -95
2652i5J08K65j90j91K11O3J12l99k7K7N24j78m44j7M79M8n27K34l13L11K7q2j18
$$ -95 13 278 88 -103 108 171 283 -116 -143 -116 408 230 -214 -231 248 296 -231 3 -310 1 28 -54 -172
2675a72K25Q2k03K0k43M09j2l37j73K11M43m54N8r7J57J05j79k79M43J12k26J06
$$ -172 53 135 -68 -48 -291 118 106 -231 -404 -193 250 -204 -146 -243 -86 19 -160 -439 4 116 -110 -4
2697dk25L14J83j95k65J66J06N8j89n3J04K77j68k37j1J74p2j39j29L27K30m4
$$ -4 -229 85 268 73 -192 -26 80 138 -51 -104 0 277 109 -128 -139 35 -37 -176 -305 22 252 208
2719B08k74N0J75K02j28m44M05P1m7J54n95M75N3j8m07l0L05K14m51j49J51M3
$$ 208 -66 -16 159 361 233 -211 194 265 218 372 -223 252 305 287 -120 -150 155 369 -82 -231 -80 -37
2741c7l9k80L73K75p1k27l75M85k10K63l92K70J42j72j07j2J34K06J18o42Q0K22
$$ -37 -76 -356 17 292 221 -6 -381 104 -106 157 -235 35 177 5 -102 -114 20 226 344 -298 -218 4
2763Dj12K70n80J64L08O5m95J46M60q5j16n97O46L4J00l15l13L55J75l0j52j40
$$ 4 -108 162 -418 -254 54 119 -376 -230 230 145 29 -568 78 112 212 -103 -416 -61 114 84 -68 -208
2785b08K78K51k15j95J90q5n0j18K28p3K75k47k63J79L36N8l09j4K6rQ3k53j8
$$ -208 70 321 106 -89 101 16 -34 -152 76 3 278 31 -232 -53 283 341 32 18 44 35 118 -135 -153
2808a53J73R1k57K58m36L59K5Ol05L06J42l15J9J77J77m3J8o55M65j7k2q8j20
$$ -153 20 111 -146 112 -324 35 60 66 -239 67 209 -106 -87 90 267 224 242 -413 52 35 13 -75 -195
2831a95K86m3n1k15L17Qj91P3l36O03l08P7O8j41K17j82j05j85M79j24j41k1P6
$$ -195 91 48 -3 -218 99 107 -84 -11 -347 256 -52 25 93 -48 169 -13 -118 -303 176 52 -89 -110 -34
2854c4L03m46N7J15J54j4K6k22j90jM95k55j71K69j42p1J77R7O1j61p0l1L48j72
$$ -34 269 -177 -120 -5 149 135 161 -61 -251 -252 243 -12 -183 86 -56 -127 50 147 208 47 -23 -54 294 122
2878A22r9J13k76N33j61N4m82j99M68j6j5J84l94J51J09m96K84L34k13K51k79
$$ 122 23 136 -140 393 232 286 -196 -395 73 57 42 226 -168 -17 92 -404 -120 214 1 252 -27
2899b7R6Oj48O9l63L93K94m21o7L84j85K66m75j00L51j56Q6j81j29M18j2k97N91
$$ -27 69 75 -73 -4 -367 26 320 -101 -168 216 31 297 -178 -278 73 -83 3 -178 -307 111 99 -198 393
2922C93k60O0M6l66K13n2lk9l53K77L59j09j52k5j23K91k22j99K49J26r3j30Q1
$$ 393 133 193 239 -127 86 34 31 2 -351 -74 285 176 24 -1 -124 167 -55 -254 -5 121 28 -102 -21
2945b1K37p9k88M01k66J88O3o06N12o6P6Nk13J52L2rn0j79N0K24m19N8K02Q7L47
$$ -21 216 137 -151 250 -16 172 235 -371 141 75 151 156 -57 95 127 118 68 -111 -61 163 -256 -198 4 91 438
2970D38m09k0pr9O6J27k19K06j27J70m06J73n2K99m89K14J72k90P9n5k35O41k73
$$ 438 29 9 2 -97 -31 96 -123 83 -44 126 -280 -107 -159 140 -349 -135 37 -253 -174 -229 -464 177 -96
2993i6Q5k30L78Nk57j77O8K53rJ67l61L64k04J0M3l28L69r5j19JQ4J55l4j59q8
$$ -96 -11 -241 137 142 -115 -292 -224 29 20 187 -174 190 -14 -4 39 -289 80 -15 -134 -133 -49 106 72 -87 -175
3018a75L00j92K36j38j8J00r2L2l5j07L66k43l3m6L46k88K63l20j0K55l38J01
$$ -175 125 -67 169 31 13 113 21 53 18 -89 277 34 1 -45 301 13 276 -44 -54 201 -137 -36
3040c6N6m9J93p6J3lk72N04o56K47J64j79M14l68j29L99l0l77L0P2O0M6r2Q5J09
$$ -36 20 -29 164 88 101 98 -174 330 -326 -79 85 -94 320 -48 -177 222 192 -185 -155 -83 -23 23 -69 16 125
3065A25j5k81J41p7K43j44l85K71j24M08l00j6K20j74K90l72l4O12l72J6lj25
$$ 125 110 -171 -30 -107 136 -8 -393 -122 -246 162 -138 -154 66 -108 182 -190 -224 388 16 32 29 -96
3087i6J34J57k67j66J62J57l6qR0K0J12l05Q2j0K19%Ql14P8L44o84K69j07K53
$$ -96 38 195 -72 -238 -76 81 45 37 127 147 259 -46 36 26 245 245 253 -61 17 361 -323 -54 -161 92
3111I2J76n15K30lK68k23L4l51K06J62Rl72M86J93l97J48k97K30P9j73N0j6J70
$$ 92 268 -247 -17 -20 248 25 59 -292 -86 76 85 -287 199 392 -5 143 -154 76 155 -18 32 16 186
3134A86r0L9j57Q0q9j18R0o7K28J44l96k41K82K90j95N4j59K47P2j12l73K59j7
$$ 186 96 135 -22 58 -31 -149 -59 -126 102 246 -150 -391 -109 181 -14 40 -119 128 200 88 -285 -26 -43
3157d3j61K68l55K62J73j11l3N8M2k59L63k62k2M20k12l00K60J60k93K00k78J86
$$ -43 -204 64 -291 -29 144 33 0 58 100 -159 204 -58 -80 340 128 -172 88 248 -45 155 -123 63
3179F3q5K87l27l8J81p9M1q1K74l32K69m14L20P9Qj40j23O6r8K22m19K99J84L3
$$ 63 -22 265 -62 -100 81 2 43 -38 236 -96 173 -241 79 158 166 26 -97 -31 -129 93 -326 -27 157 190
3203A90O0m17L31p1q5q2J12j78K14J49m22M51k93L0N4j40J38k05K97q8j97n0K28
$$ 190 250 -167 164 93 8 -74 38 -140 74 223 -199 252 -41 -11 43 -97 41 -164 133 45 -152 -202 26
3226B6J00k53K41j01K20l72J99Jj49J76no7k43L30j72Q0o0Rj0j1M11j80k8j97
$$ 26 126 -127 114 13 233 -139 60 61 -88 88 83 16 -227 103 -69 11 -49 -40 -50 -61 350 170 142 -55
3250e5J31j2O9l11J65m9q2M04k60J20N8k41K87p9k1p6N7L6j44N7J93l74Q3J47
$$ -55 76 64 133 -178 -13 -62 -144 260 0 120 178 -63 224 145 124 48 105 141 -3 54 247 -127 -44 103
3274A03j79L39l6k48J90r6j44Q5l8lJ2J09o9l9k79M36j59K6m3j90J12l0O3J43
$$ 103 -76 263 227 -21 169 73 -71 14 -24 -27 -15 94 25 -14 -293 143 -16 10 -33 -223 -111 -141 -78 65
3298F5J55l17o3J19J84L0r4n6J8m1k89N25j80M9j51N8j23o8L47n5m4O3j91r7N27
$$ 65 220 -97 -160 -41 143 173 79 23 41 0 -289 236 56 105 -46 12 -111 -179 168 113 69 132 -59 -156 371
3323C71l79n1p7J51J30k60L87j67K05j38l58K48r3K59l77K24j90R4k02K45J68
$$ 371 -8 -59 -136 15 145 -115 272 105 310 172 -186 62 -31 228 -149 75 -115 -21 -223 22 190
3344A90m53K46L1K24m38J79l2K4N3j42J33J17J6Q9l52N6J2J44k16J81k00K56M7
$$ 190 -263 -17 14 238 -200 -21 -53 -29 24 -118 15 132 148 237 -115 -59 -47 97 -119 62 -138 118 165
3367A65k69k10K51N5l1K15n73M39L1q6j29J4o9K60p0q1qL02j39k68J69k9J61Q0
$$ 165 -104 -314 -63 -8 -39 176 -397 42 73 -13 -142 -128 -197 63 -7 -88 -96 206 67 -201 -32 -61 100 180
3391A80k87J35j63M88k42R1k08K27j53k81M84l37J81k37M70l68L00k17O1ok02
$$ 180 -107 28 -135 353 111 202 -6 221 68 -213 271 -66 115 -122 348 -20 280 63 124 118 -84
3412h4L05r2k91J54PJ82l19K24j83J2j04K41l6K7K81o68K67O0o3J07M9k04o0N0
$$ -84 221 129 -162 -8 -1 181 -138 86 -97 -85 -189 52 16 43 324 -344 -77 -17 -80 27 76 -128 -188 -138
3436a38K74k84N8M55k94j55J13j95K91m85P9L71m5k29Jn9J22K26k00K20k09j02
$$ -138 136 -148 -90 365 71 -84 29 -166 125 -360 -281 90 45 -184 -183 -242 -120 106 -94 126 -83 -185
3458a85J05J02j99M08j88ojp8J75J63l71R1k57M53l08NM5L58l02K34j84j0K50
$$ -185 -80 22 -177 231 43 37 36 -42 133 296 -75 16 -241 212 -96 -91 -46 312 10 244 60 50 300
3481C00k11m1n6Q2J78oj70J75Q0m51J50L0l6j08Q4p0q0L04j36j6K8q6N1K90n41
$$ 300 89 48 -8 74 252 246 76 251 331 -120 30 60 24 -84 0 -70 -150 154 18 2 30 -56 -5 285 -256
3506b56L4L05J2K8k6r9q4Q3J07k45J22m2K47k11N8j65R3J07j16K55j76j69J07
$$ -256 -222 83 95 123 97 -2 -86 -3 104 -141 -19 -61 186 -25 33 -132 -39 68 -48 207 31 -138 -31
3529c1J7rk1j40K20o2J38j1j9j98J10K7M0j29l11L05J18MJ19m9l00J03J67QLJ40
$$ -31 -14 -23 -44 -184 36 -26 112 101 82 -116 -6 21 61 -68 -379 -74 44 48 167 118 -182 -79 88 96 99 239
3555B39j79k02J07J55J50l06K06o4P7j23m3K5J54l08J84p0P7p9R1k83J99J12j26
$$ 239 60 -142 -35 120 270 -36 170 106 183 60 17 42 196 -112 72 2 79 0 91 -192 7 119 -7
3578gk06N6J20J05J05k89J14K4k13J25Q8l24J76J85R2j32o6J8K29l00J26J96l56
$$ -7 -213 -157 -37 68 173 -116 -2 22 -191 -66 22 -302 -126 59 151 19 -47 -29 200 -100 26 222 -134
3601a34L6p8J78K0lj91K02l5K25j32j17K82j84j80L8J55r4M7J87r7p1j20N0J23
$$ -134 -98 -176 2 22 19 -172 30 -5 220 88 -29 253 69 -111 -73 82 -12 35 222 125 54 -66 -16 107
3625A07J3J30k14j66o0K57L9P7j59r0JJ26O3j11qJ28j57K01k79J59O7j00N3m8
$$ 107 120 250 36 -130 -190 67 106 183 24 -66 -65 61 124 13 5 133 -24 177 -102 57 124 24 77 29
3649B9R3k74PJ37K89k25n3j00L07k16J88k28Q0r8J36j03K9m95O80l14K82k89J59
$$ 29 122 -152 -145 -8 281 56 3 -97 210 -6 182 -46 34 -64 72 -31 -2 -497 183 -131 151 -138 21
3672B1k19J55J18j19J67j70J34j69RQJ13k66L51l3r5o2o6N7L94j83k21J81L6j70
$$ 21 -198 -43 75 -44 123 -47 87 -82 -73 -65 48 -218 133 100 5 -57 -123 -66 328 145 -76 105 141 -29
3696b9Q5l8O4J13j62L18l48J06l7K2j16R6o1K11r6M4j94k1K32o2l2Oj55M1k34
$$ -29 56 18 82 195 33 351 3 109 72 94 -22 74 13 224 128 172 -22 -43 189 127 95 101 -54 -13 -247
3721b47L08j80J47j63J80K4j04NO8j68K82k31k0k1K45k37J10N5M1r8j40J11J70
$$ -247 61 -119 28 -135 45 69 -35 -30 38 -130 152 -79 -99 -120 125 -112 -2 53 94 -4 -144 -33 137
3744A37k34J70n7J27M0l03K25j69J23m8k9K4j61J30J58j62K6J7k46L38k0j71M4
$$ 137 -97 73 16 143 183 -120 105 -64 59 11 -18 6 -155 -25 133 -29 -3 14 -232 106 86 -85 -41
3767d1j20R3J29j04j84M37l77L17M4k46K63j46J2j91J04m4m2J46j8O5j69K8j43
$$ -41 -161 -68 61 -43 -227 210 -167 150 194 -52 211 65 77 -114 -10 -54 -96 50 32 97 -72 -44 -187
3790a87J46Nl2K53l8j42K59l32P3NR0k37J38k39K41Ro5J79Q5J02j7k01k23J85
$$ -187 -41 -36 -68 185 147 5 264 -68 5 10 100 -137 1 -238 3 12 -53 126 211 313 296 95 -128 57
3814E7k73K88P7k20Q1k48M89l08p4J03Q2k10Q5P8r5K88k76j1R1K52r4k40Q4J42
$$ 57 -216 72 149 -71 10 -238 251 -57 -131 -28 54 -156 -71 7 -88 200 -76 -87 4 256 162 -78 6 148
3838A48k40J11L12j36l0j53o2l7K3O0P7j63K44l4j61J92j92K16Km13L88q3q8J32
$$ 148 -92 19 331 195 165 12 -50 -87 -64 -4 73 -90 154 120 -41 151 -41 175 177 -236 152 69 -19 113
3862A13m1J65j88Lk09Q2j7J02j60K64j54J60J78k39R7r4n8q8O9j91K19J0m4N8
$$ 113 72 237 49 52 -157 -75 -92 10 -150 114 -40 120 298 59 156 62 4 -84 -15 -206 13 23 -21 37
3886C7j62J55n5l03L87k38J57n0o1o4K53O3r1Q6p7O1o1k30J80l8n2K03k7k01K3
$$ 37 -125 30 -25 -328 59 -179 -22 -72 -133 -197 56 119 28 114 37 98 37 -193 -13 -51 -103 100 73 -128 -105
3911a05LK46m57R9L44l07J96k00L42k16j1m9L07m6m45K94lPk22J10J88o0O1K9
$$ -105 -102 144 -313 -214 130 -177 19 -181 161 -55 -66 -115 192 146 -299 -5 -8 -1 -223 -113 75 15 76 105
3935A05j53o6j66J15J21n1L8Q6j50Q6J51j80N3j43J30j49O4q7K7rK78j72jk2N8
$$ 105 -48 -114 -280 -165 -44 -95 -57 29 -121 -35 116 -64 -11 -154 -24 -173 -109 -196 -169 -178 100 -72 -73 -95 -37
3960c7J2j6J1J20j95J29j63j84M51J2k1k73J16jK52j43P3n7k99J63jl9J27j65
$$ -37 -25 -41 -30 90 -105 24 -139 -323 128 140 119 -154 -38 -39 213 70 143 86 -213 -50 -51 -90 37 -128
3984a28M3K58l93J34K14k47R8R8k37L11k13J88k93J05R6p3J83k49J74k02l8K54
$$ -128 -85 173 -220 -86 128 -119 -21 77 -160 151 -62 126 -167 -62 34 -39 144 -105 69 -133 -171 83
4006H3p7K18k09J83j93O5J0K0k16M6M6J2j03J6j94M18j56j37J61N8p4K46k54N3
$$ 83 6 224 15 198 5 70 80 100 -116 -70 -24 -12 -115 -99 -293 125 -31 -168 -7 51 -23 223 -31 22
4030B2Mk74K20J81k81J93Kl3J29j77O1n0R1m9k68N7M27k79k1O0m4j23j25L77p3
$$ 22 26 -248 -28 153 -128 65 67 34 163 -14 47 -3 88 39 -229 -172 255 -24 -45 15 -29 -152 -277 100 27
4055B7j27j09K82J07j78r3J92j90J96j53P6Oj47J99k43K55j87M0m5J24Q6n9o6
$$ 27 -100 -209 73 180 2 -91 101 -89 107 -46 30 36 -111 88 -155 100 -87 -47 -92 32 118 59 -7
4078gM8J15l62j1J27J96o2J11k15jJ33j81L46k67J46o3N8J39j67j29j26K61k7
$$ -7 41 156 -206 -217 -90 106 44 155 -60 -61 72 -109 237 -30 116 53 111 250 83 -46 -172 89 62
4101F2J30o6k96k9K09J18q8k75L07L4N6l48rpL52k41k9l1J49j70K73j33k12J86
$$ 62 192 126 -170 -199 10 128 40 -235 72 106 162 -186 -195 -202 150 -91 -120 -151 -2 -172 101 -32 -244 -58
4125e8m0K73k53K8K94J04l50l9K32k10L2M8k70L43j18p7J46M5m1k42K09j45J28
$$ -58 -98 175 -78 -50 244 348 -2 -41 191 -19 13 61 -209 134 16 -61 85 130 89 -153 56 -89 39
4148C9J0j27J77k11K84k75L7K28m3J02j31k0J36j81p9J7M9m7j06K40j25j28J07
$$ 39 49 -78 99 -112 172 -103 -66 162 119 221 90 70 206 25 -54 -37 12 -35 -141 99 -26 -154 -47
4171d7K22J5j94M25m03K18k34PK50j92r2r3J22k10K85J59r7j88p6N5n8Q3J29J2
$$ -47 175 190 -4 421 18 236 2 9 259 67 -25 -118 4 -206 79 238 141 -47 -123 -68 -126 -43 86 98
4195I8j42j44J02J74j40lK4j27L09l73L55k09R7n8m1o5M18l72J22O8m6j91L69
$$ 98 -44 -188 -86 88 -52 -55 -31 -158 151 -222 133 -76 21 -37 -78 -143 275 -97 25 93 47 -144 225
4218B25k09k37N7L75l33MjN6J08j50k3K94J26m33M05l46R9J64p5k20J69J16k1
$$ 225 16 -221 -164 211 -122 -118 -119 -63 45 -105 -128 166 292 -141 264 -82 17 181 106 -114 55 171 150
4241A50o0l07K09J29q5k16M98k29M1j29l6K25j44J23J62m64J86m7n7Q4o6j15J78
$$ 150 90 -217 -8 121 36 -180 318 89 130 1 -35 190 46 169 331 -133 53 6 -51 33 -33 -148 30
4264C0l3k19J70j24K4R7K88k66k45M28mk35J77k05K44j4P5j10j95J61l6O0n7m5
$$ 30 -3 -222 -52 -176 -152 -55 233 -33 -278 150 146 -89 88 -117 127 113 188 78 -117 44 8 68 11 -34
4288c4J45k12P7K1J11j38k0J02p8j58M84m36J49J6j23K6J05j03P3J1m7K77j05
$$ -34 111 -101 -24 -3 108 -30 -50 52 -26 -184 300 -136 13 29 -94 -68 37 -66 7 18 -29 248 143
4311A43Q0k8l05Q2J47k76L10m5k19J16O1j75J75Q1k04rJ65l18R3k5o2K03J35l29
$$ 143 223 195 -110 -28 119 -157 153 108 -111 5 66 -109 66 147 -57 -66 99 -219 -126 -151 -213 -10 125 -204
4335b04oK61jl57K87j1J3m7M9M10k82j57J21j77Qj01K08J37l22K02r4Q0J9l2n6
$$ -204 -210 51 50 -307 -20 -31 -18 -65 -16 394 112 -45 76 -101 -93 -194 14 151 -171 31 -63 17 36 4 -52
4360e2J39o4k83J47p6K43J66m3k65Ko1J45J21L4k50J37k6k5Q8k36J38J39p2k1
$$ -52 87 23 -260 -113 -189 54 220 177 -88 -86 -147 -2 119 153 -97 40 14 -11 77 -159 -21 118 46 25
4384B5P2j62kK71j27o2p1n4M5J40L9k01L24r1j41k06K51J12k97K27or1j6j92K22
$$ 25 97 -65 -67 204 77 15 -56 -110 -65 75 114 -87 237 146 5 -201 50 162 -135 92 86 -5 -21 -213 9
4409Ik20L43j41k70L11J91k78L9J68l60L15j81N2K30l30j90K68K9j27k9J60nJ93
$$ 9 -211 132 -9 -279 32 223 -55 -16 152 -208 107 -74 -22 208 -122 -312 -44 -15 -142 -171 -11 -16 177
4432A77L2m9m49K69j8k81L69l97K57O3p3K87l1j98O4k12K57J82l80K27k29N5L0
$$ 177 209 160 -289 -20 -38 -319 50 -347 -90 -27 -100 187 156 -42 22 -190 67 249 -131 96 -133 -78 -48
4455d8L0j4o7r2K49O4j14K58j51m6Q7j55K77j70J8n7k20K17j10O6K07o2j64O6
$$ -48 -18 -32 -99 -191 58 122 8 266 115 69 156 1 278 108 126 69 -151 66 -44 22 229 167 3 69
4479F9L9j52J48k24J54J23l66K75j39j01J57R1l43J58K27L0j42k56K59J6k96M82
$$ 69 108 -44 104 -120 34 157 -209 66 -73 -174 -17 74 -269 -111 116 146 4 -252 7 23 -273 209
4501B09m45L95r7k24L54k64J77M3k50J88m9r1n4L16l64J18L75k02o1q0J04j64
$$ 209 -236 159 62 -162 192 -72 105 148 -102 86 37 -54 -108 208 -156 -38 337 135 74 -6 98 -66
4523f6J15j20J12R6l06K67J5J09j30J0P2m20M73j61k09q5J29j6J20j08p4L15j51
$$ -66 49 -71 41 137 -169 98 113 222 92 102 174 -246 227 66 -143 -228 -99 -115 5 -103 -177 138 -13
4546a3J7N8k37R0j65J84J46k4J15L7j92j05K92k37Q1L8l37J35L29k82J26j11J13
$$ -13 4 62 -175 -85 -250 -66 80 56 171 208 16 -89 203 -34 47 85 -252 -117 212 -70 56 -55 58
4569E8n2K71l51n2K17o1M8j12j15J09P7J10k69Q5J54j90j04m6L4J56Jp1Kl9P5
$$ 58 6 277 -74 -126 91 30 78 -34 -149 -40 37 147 -122 -37 117 -73 -177 -223 -189 -33 -32 -103 -101 -140 -65
4594f5J12J5l19J26p0K29o7J9J34p4j72J0J01q6J46j91R5J10L0K1r7J38j1J10
$$ -65 47 62 -257 -131 -201 28 -39 -20 114 40 -132 -122 -21 -107 39 -152 -57 53 83 104 7 145 134 244
4618B44k30R3O0k55O5L9N6k24K3o5J92K37k73j77J84J52L4L5k5k80K59l37L10
$$ 244 14 107 167 -88 -23 16 72 -152 -129 -194 -2 235 -38 -215 -31 121 155 190 165 -115 144 -193 117
4641A17j44M8Oo0L4j12O9O1J56j31qj52J39j43J5K67%r9k11Q9l8O9K20l18J45
$$ 117 -27 21 27 -33 1 -111 -42 19 175 44 36 -116 23 -120 -105 162 162 63 -148 -59 -97 -28 192 -126 19
4666A9o0LQk7J76J19j69q1n0K23j25Kj13QK66j84k15K27j07J35j19K81j72N2j51
$$ 19 -41 -38 -30 -57 119 238 69 -12 -62 161 36 38 -75 -67 199 15 -200 27 -80 55 -64 217 45 97 -54
4691e4q6J29j3j66K99J02j07k22J4L85k89k8L39k31j18K18j85J7J36j43k33L94
$$ -54 -140 -11 -24 -190 109 211 104 -118 -104 281 -8 -36 303 72 -46 172 -13 4 140 -3 -236 158
4713A58l78L94j05n2N4q5J68l94K28r7K01j2k12p9K97m1l47J59J39K9r8K17j88
$$ 158 -220 174 69 17 71 -14 154 -240 -12 -109 92 80 -132 -211 86 45 -302 -143 -4 25 -73 144 -44
4736d4q1J55Nj07P4J49j8RQ5l35O7K7N0k85J90J83j14p4j70M17k93J81j25N3J64
$$ -44 -125 30 35 -72 2 151 133 142 227 -108 -41 -14 36 -249 -59 124 10 -64 -234 183 -110 71 -54 -1 163
4761A63k71p7J57J26j77J20R0N6k10L35j96l33K14J22o1J12j27j14K8P0Mj07k24
$$ 163 -108 -185 -28 98 -79 41 131 187 -23 312 116 -217 -3 119 58 170 43 -71 -43 27 31 -76 -300
4784c00N22k3k25P8k01J27R2L9j22PO1K73k77Q2k34j04M03L3j89p3j24K37l6k96
$$ -300 222 199 -26 52 -149 -22 70 109 -13 -6 55 328 51 133 -101 -205 198 231 42 -31 -155 82 46 -250
4808b50L03q2J19K3j57m5J31k1j46K65p8j0k66J45K42k72nj0M0LJ83k09J42j71
$$ -250 53 -29 90 113 -44 -89 42 21 -125 140 62 52 -214 -69 173 -99 -104 -114 -74 -71 112 -97 45 -126
4832a26L76k02k27M80k66l30L46k50K31j54J0M03l57mK64l10R3K36k78J95J16
$$ -126 250 48 -179 301 35 -295 51 -199 32 -122 -112 291 -66 -70 194 -116 -23 213 -65 130 246
4853B46l24J93j35pj79J67m9J12j21J49Jl08M9P6K12J03j75N9r0j7o1j16K52M0
$$ 246 -78 115 -20 -27 -206 -39 -88 24 -97 52 53 -255 -206 -130 82 185 10 69 -21 -38 -99 -215 37 77
4877G7j76n8J28nR7r8N7k20J88K5l36L35l37L94m9J45k88J60K75l96L05l05o2
$$ 77 -99 -157 -29 -34 63 -35 22 -198 -10 15 -321 14 -323 71 22 167 -121 39 314 -82 223 -82 -144
4900a44J73j56J99r7P3l0J38L2k34N2J38j0j94J83k16K06k7pk82R1K42j05O5k34
$$ -144 29 -127 72 -25 48 18 156 188 -46 6 144 134 -60 123 -93 113 86 79 -203 -112 130 25 90 -144
4924a44j1J49J27r9J6K38l24k04K37K6k8Nm9J99l68J57n9J84j87L3Q8KJ39j79
$$ -144 -155 -6 121 22 38 276 -48 -252 -15 11 -17 -12 -61 138 -230 -73 -132 52 -135 -102 -14 -12 127 -52
4948e2j32J58p4ORJ96k54K8K04R1j79R7j48J78j39n2R2M6K12k37j1J39j11j3j09
$$ -52 -184 -26 -100 -94 -85 111 -143 -115 89 180 1 98 -50 128 -11 -63 29 75 287 50 39 178 67 54 -55
4973e5J50J05l10K82k43R2j36lm8K86qr4j5J3O7l41K5J4K65M9kl1k17J28Q2mJ24
$$ -55 95 200 -110 172 -71 21 -115 -118 -166 120 112 18 3 16 83 -258 -233 -219 46 95 93 62 -155 -27 55 51 175
5000A75q3n6n2J81j6j78N9J41k65N2n7K68j67k1k02L88j79q0M4K93j06j10j77
$$ 175 92 36 -16 165 149 -29 30 171 -94 -42 -99 169 2 -19 -221 167 -12 -92 -48 245 139 29 -148
5023a48J56k06K27r9k0K26k11o1k8L25o5K97m21j09r0J37J68L2j52O2J2N1Oj15
$$ -148 8 -198 29 -70 -90 136 -75 -136 -164 161 96 393 -28 -137 -227 -90 78 110 -42 20 32 83 89 -26
5047b6P6N0j32k21K35O8N3L7j27j37K49k16l9O1K80k92J95L1O4m17J75j6q7l8
$$ -26 50 100 -32 -253 -18 50 103 140 13 -124 125 -91 -130 -69 211 -81 114 145 209 -208 -33 -49 -136 -174
5071a74L61K7k0j54%j74J85p1J30k08J9m3J63J66j05k62K72n2J6J2l48K18R2q7
$$ -174 187 214 194 40 40 -134 51 -20 110 -98 -79 -122 41 207 102 -160 112 60 76 88 -260 -42 50 -37
5095c7j90P4K39J07j73N4k13K92j01M0j73n6L17n38M18j20L5M9q9oJ30o9K22k18
$$ -37 -227 -153 86 193 20 74 -139 153 52 92 -81 -137 180 -358 60 -60 -25 24 -65 -71 59 -10 212 -6
5119fP2j24J83j67m2J55j33n6Q4L46l33M1p0K1K14l99L24j91J32j96J80j95L27
$$ -6 66 -58 125 -42 -84 71 -62 -118 -34 312 -21 20 -50 -29 185 -214 110 -81 51 -145 35 -160 167
5142A67o8j74J85j10p0J89j1k8Q5j45l3J70p7j86m4K13j15P4K28r9l44J90J58
$$ 167 99 -75 110 0 -70 119 108 80 165 20 -13 157 80 -106 -150 63 -52 22 250 151 -193 -3 155
5165A55j00r4j94J80O9K5J09m14K36n1K10J87l43j79K96l9K08k59J49K5j9j83
$$ 155 55 -39 -233 -53 16 41 150 -264 -28 -79 131 318 -25 -204 92 53 261 2 151 176 157 -26
5187b6J82k14j58L73j07k7j72m9L09j54k54N04l03J46R5l44L3L15l09J41MJ06
$$ -26 156 -58 -216 157 50 23 -149 -198 111 -43 -297 207 -96 50 145 -199 -166 149 -160 -19 -15 91
5209I1j93M9NO1j54K26J6J38j95O7k2r0K33k92L1O1J18j23k22L84k78j03J49L2
$$ 91 -102 -53 -48 13 -141 85 101 239 44 111 89 -1 232 -60 -29 32 150 27 -195 189 -89 -192 -43 -11
5233a1L6o9M8J33j70k03K67m1J92l78L65P0l01j36J89J85l47K36P1k47L4m7k6
$$ -11 25 -44 4 137 -33 -236 31 -10 182 -196 169 239 -62 -198 -9 176 -171 65 136 -111 -77 -124 -150
5256a50J27J16j46M8lQ5n5q0r0N7J36j06LO8j21J28p6J33l37K75k5J4j27J18r3
$$ -150 -23 93 -53 -5 -8 77 22 -58 -148 -91 45 -61 -58 10 -111 17 -59 74 -263 12 -13 1 -126 -8 -101
5281a01K50k81J44j0L8p1J22k09qL42k51P6J34k43k41L64k87J18R5K03k94K91
$$ -101 149 -132 12 2 40 -31 91 -118 -126 216 -35 41 175 -68 -309 55 -232 -114 -19 184 -110 181
5303A81l26O1J78N9j57kL3k25L86l08nJ26L2p5J52k3k17J45j50j35K68O1j13J79
$$ 181 -145 -84 94 153 -4 -6 27 -198 188 -120 -125 1 33 -42 110 87 -130 15 -135 -270 -2 59 -54 125
5327A25n55O58k18l41K54J18j04J93j78N4J48j26r1R6k23J94r4K0K60j11l3K20
$$ 125 -430 228 10 -331 -77 41 -63 130 -48 6 154 28 -63 33 -190 4 -90 -70 190 79 46 266
5349B66k11L2k6j17J20j97J95k40J77J7RM0j74O9R1k31K66J7q3l32L74j67J11
$$ 266 55 87 61 -56 64 -133 62 -178 -1 16 25 65 -109 -40 51 -180 86 103 20 -312 62 -105 6
5372Fk0J89j84j11n1J14l2J19j7N1j76k5K70k54K1J25p7M0m4J25p9J79j05m54
$$ 6 -14 175 -9 -120 -171 -57 -89 30 13 64 -112 -137 133 -121 -100 25 -52 -12 -56 69 -10 169 64 -390
5396c90N48k20r1K4j0l5K25p0K24l20M3J12P4O9j67Q9k79L86j68jJ27k95K11L9
$$ -390 158 -62 -153 -129 -139 -174 51 -19 205 -115 -72 40 114 183 16 105 -174 212 44 43 170 -125 86 125
5420A25j36K42k48J08p1j60L21k22o3N2k23K60K48k80k8NJ78O3k68K46j88R7q1
$$ 125 -11 231 -17 91 20 -140 181 -41 -104 -52 -275 -15 233 -47 -75 -70 108 171 -97 149 -39 58 -23
5443b3kQ7o4pj17pQ2K13j13l7M4Q5k48L15Rj42j60o2M2J19O3l2K30j56k83Q3J75
$$ -23 -25 62 -2 -9 -126 -133 -51 162 49 12 56 141 -107 208 217 75 -85 -147 -105 14 77 45 275 119 -164 -81 94
5470I4j33k8l2Q0n0k00J92q6Oj16K73qK29J12k63r3j45J49q3J09j89o5M15k45
$$ 94 -39 -67 -99 -19 -69 -269 -77 -163 -157 -273 0 -8 221 333 70 -23 -168 -19 -102 7 -182 -247 168 -77
5494g7J7q6K19m3o9M6j78M31n4l22M1K5L7o4o1k05K65L31l46m7J48j50J19J30
$$ -77 -60 -146 73 30 -39 7 -171 260 206 -116 -75 -50 -13 -77 -138 -343 -78 253 -93 -140 8 -142 -23 107
5518A07P7o3r9nj20J87r7J15p9j27J22j86L5P0M0L92l56j42np9J1P8J13O5J68
$$ 107 184 121 22 17 -103 84 -13 102 23 -104 18 -168 -133 -63 -23 369 13 -129 -134 -213 -202 -124 -11 54 222
5543B22l66K85j32j60R0QM07k60l32K76J00o4P2n4q2Qj58p6K32j05J52J60m05
$$ 222 -144 141 9 -151 -61 -53 354 94 -238 38 138 74 146 92 10 18 -140 -216 16 -89 63 223 -182
5566a82J80J58K4j21L7j7j86J81r9J21l60K35k5OR9p7K24j85q8J53m4j98K54j76
$$ -182 -2 156 180 59 96 79 -107 74 -25 96 -264 -29 -54 -48 51 -26 198 13 -75 78 34 -164 90 -86
5590h6NK1J76k9j62M06k92M7o5k9N6Q4j82N0q7J07j65j57L21J80j37o2K28l68
$$ -86 -81 -60 116 87 -75 331 39 86 21 -8 48 132 -50 0 -87 20 -145 -302 19 199 62 0 228 -140
5614a40R8O7p6k4J3o7J59Nk42j14L74lQp0P7N3m6J4Q4l8k53L35j90k5j9k43J90
$$ -140 -42 25 -51 -75 -62 -129 30 35 -207 -321 53 50 58 -12 65 118 72 86 170 132 -121 214 24 -1 -20 -263 -73
5641g3J52q9k6n5j59N4R3J56j05K20j35J7J45j50j40L24m5k15p6R3rn3J41l31
$$ -73 79 -10 -36 -91 -250 -196 -103 53 -52 168 33 50 195 45 -95 229 184 -31 -107 -14 -23 -76 65 -266
5665b66L33J6j4K4L5m0M9l17K51O4j92j13J88j20K11j11K71j57M8j42J50k39K7
$$ -266 67 83 69 93 128 88 137 -180 71 135 -57 -170 18 -102 109 -2 269 112 160 18 168 -71 -44
5688d4j30p1J05J68j4j08J04L8k99J82K92l43N6J31Oj4k2j5k63J76L68l30L8q8
$$ -44 -174 -245 -140 28 14 -94 10 48 -251 -69 223 -120 -64 67 73 59 37 22 -241 -65 303 -27 11 -77
5712g7q1P9K95k8k36j04K32nk26K80k62J98j34m5J68j95R0J38L9n1r7O3j69j9
$$ -77 -158 -79 216 188 -48 -152 80 75 -151 129 -133 65 -69 -114 54 -141 -51 87 126 75 -22 41 -128 -147
5736a47LJ91R3j76L39l73J02J30j14j4L0R0j42J09J3q1q8L7L9n9j80K30j09J71
$$ -147 -144 47 140 -36 303 -70 32 162 48 34 64 154 12 121 134 53 -35 2 41 -18 -198 32 -77 94
5760I4J6q8m8J9j72K93k64R3j15k8K32j09O2K4q9l3j49l6K43k02J83p2N1J24M4
$$ 94 110 22 -26 -7 -179 114 -150 -57 -172 -200 32 -77 -15 9 -80 -113 -262 -298 -55 -257 -74 -146 -95 29 73
5785G3P6l1J18j92l5n4K15L1j91p1m9jJ86p2j42L7MR6L9o8J1L20l30K70l95Q5
$$ 73 149 118 236 44 9 -45 170 201 10 -61 -110 -111 75 3 -139 -102 -98 -2 37 -31 -20 300 -30 240 -155 -70
5811g0J86q2j05q8J23p6J8J98j63L59k86q6R0J14pl3j44m1nj24K10L8R2k8r4n9
$$ -70 116 34 -71 -159 -36 -112 -94 104 -59 300 14 -72 18 132 125 92 -52 -93 -98 -222 -12 26 118 90 -4 -63
5837f3J01j54P4J39j35J29j08L34l78r3O1J17l6l8k55M23j0k7J7j64P1k3P2J7
$$ -63 38 -116 -42 97 -38 91 -17 317 -61 -154 -93 24 -12 -50 -305 118 108 81 98 -66 5 -18 54 71
5861G1l6q4o8o1J08P3J99l21j0J87k21J32J9J51K6k41k8R8J70j72L4n9M03n23
$$ 71 35 -49 -117 -178 -70 3 202 -119 -129 58 -163 -31 -12 139 165 -76 -104 -6 164 -8 26 -33 370 -153
5885a53K03j97q3K67n7L80l22n7J92k78l0L2L55k63k26K23J45k13L2K66j81pk7
$$ -153 50 -147 -230 37 -20 360 38 -19 173 -105 -135 -103 252 -11 -237 -14 131 -82 -50 216 35 28 1
5908AJ9j33K15n8R9j58J13j42J93l02M0N7O4k28K68J4L3P2R2l38J5O0J59P3k84
$$ 1 20 -113 102 44 143 -15 98 -44 149 -153 -113 -56 8 -220 48 62 95 167 259 -79 -64 -4 155 228 -56
5933e6K48j42P1j40R2N8RP6j05k66J49L3pj05K8L6L8n0K13j6j72K18k25j39L00
$$ -56 192 50 121 -19 73 131 140 216 111 -155 -6 27 20 -85 -57 -21 17 -33 180 164 -8 210 -15 -154 146
5958A46k43o4O5j47L39o9r6kk0J52k04J57n9Nj56M23j27k73L31K5k36j06J49j10
$$ 146 -97 -161 -96 -243 96 27 -69 -71 -91 61 -143 14 -45 -40 -196 227 100 -173 158 183 -53 -159 -10 -120
5982a20J84j88K42m4k52R8j14K67k0o9K36k07K00l12M0o0J01m7L6m1J75j66k6
$$ -120 64 -124 118 74 -178 -80 -194 73 53 -16 220 13 213 -99 -59 -119 -18 -65 -29 -70 105 -61 -87
6005h7K16L3k41J45k13j6J63P8J09r4J09l72J81O9j91J73r5lj3J84j18O8j32K1
$$ -87 129 162 -79 66 -147 -163 0 78 187 93 202 -170 11 80 -111 62 -33 -36 -49 135 17 85 -47 -26
6029b6l9J9j84L11l9m1j00o9J2J16K8K6K23k94J26j16J36k6l91M75l89M57q9l16
$$ -26 -65 -46 -230 81 42 1 -99 -168 -156 -40 -12 14 237 -57 69 -47 89 63 -328 147 -242 215 126 -190
6053a90L52l32r3J92m6k24J00L39r8K0l4L3No4J52n6N3k70K85K6o6k9j99J88q6
$$ -190 162 -170 -263 -71 -117 -341 -241 98 0 20 -14 19 24 -40 112 56 109 -161 124 150 84 55 -144 44 -42
6078d2R7nn2J26m54K48K77k87K65j50j03Q8K60k19m7N7M6k15p5L70o03M46N9j82
$$ -42 55 50 -2 124 -330 -82 195 -92 173 23 -80 8 268 49 2 59 105 -110 -185 185 -418 28 87 -95
6102i5J70k63K93J05p9p3P8j48J2j9j20J47M6J38j26k17J91J40l23R0K9r7K45
$$ -95 75 -188 105 210 131 58 136 -12 0 -19 -139 8 54 192 66 -151 40 180 -143 -53 -24 -121 124
6125A24k0%j2o1J70m11K61j22l69M58O0j39NJ57j08J83j27N0k5j92J81k2J01K5
$$ 124 104 104 92 31 201 -210 51 -71 -440 18 78 -61 -56 101 -7 176 49 99 74 -118 63 41 142 167
6149A67j28o0LK61k70J79l86K66l46L72l5N4j17p0o7K26j84M8r6J01L06k20M1
$$ 167 39 -21 -18 243 -27 152 -234 32 -314 58 23 77 -40 -110 -177 49 -135 -87 -183 -82 224 4 45
6172D5p9K4K3O5q3J22k2L1j41L40l65O3o4J51P3m0j8L1k38O0K17k82M5J52k1n9
$$ 45 -34 -10 13 78 -5 117 95 126 -15 325 -40 23 -41 110 183 143 125 156 -82 -22 195 -87 -42 110 89 30
6198C0L4o6J01k16m3J83k55J47P1q7N1o7NJ50l86J84L13k62M5J49q9k1rJ05mj04
$$ 30 64 -2 99 -117 -160 23 -232 -85 -14 -101 -50 -117 -112 38 -348 -164 149 -113 -68 81 -8 -29 -38 67 63 -41
6224d1J9Q0K7j51K15k33J60k93K58l24L30K69l14K2N4m9j22K71p9o5l28J19K34
$$ -41 -22 58 85 -66 149 -84 76 -217 41 -283 47 316 2 24 78 29 -93 178 99 34 -294 -175 59
6247E9j88q8J92M8O8J13j23J0K45m64K5J74j05J7r7O6R9j54QL38l85K01K1j5J30
$$ 59 -129 -217 -25 23 91 204 81 91 336 -128 -103 71 -34 -17 -114 -48 51 -103 -95 243 -142 59 80 65 195
6272A95n00L76j03r1RJ14J00P5k41J52j56J36q8j6j0P9l6j11L43j60pn2J76k93
$$ 195 -305 71 -32 -123 -114 0 100 175 -66 86 -70 66 -22 -38 -48 31 -5 -116 227 67 60 8 184 -109
6296a09o3J93N4k18J03j21O0K08o2j83Q6J01k6q9J90j64r3O6J09K08k97J55j99
$$ -109 -172 21 75 -143 -40 -161 -101 107 45 -138 -52 49 23 -66 124 -40 -133 -67 42 250 -47 108 -91
6319i1J18j2j0j31J54k51K56k44K41Jn0K52l10j19K74P0l14J26L1o2J02k21L27
$$ -91 27 15 5 -126 28 -223 33 -211 30 31 -19 233 -77 -196 78 148 -166 -40 -9 -71 31 -190 137
6342A37k79L21k27k2k0K4K09l73J09n6L94k68O8j04J56j0j71P0K25k8j68J02j50
$$ 137 -142 179 -48 -70 -90 -66 143 -230 -121 -177 217 -51 17 -87 69 59 -112 -42 183 155 -13 89 -61
6365f1R2j8q6o4L4M05l11k1Q5P1p7J26q0j9J17j8n0l07O9M6K4j17J37J85j48j5
$$ -61 31 13 -73 -137 -103 302 -9 -30 55 126 49 175 95 76 193 175 125 -182 -113 -67 -43 -160 -23 162 14 -1
6391aJ19k3j15Q7j3K2J2l27L75Pj48j53J83J80k17O0K3K6j36n8J20j42k1O9J64
$$ -1 118 95 -20 67 54 76 88 -239 136 143 -5 -158 25 205 -12 48 71 97 -39 -97 23 -119 -140 -71 93
6416I3j71j20K65j41J46J44n59M53j0l80K28J4j30m4M92l08R6O4l75J83K76j65
$$ 93 -78 -198 67 -74 72 216 -343 110 100 -280 -52 -38 -168 -212 280 -28 68 132 -243 -60 216 51
6438E1j15M0J91j83m0Q3P9j90p0J30R5j99J24L0j9J43j07l9K0k45K09J51rk56
$$ 51 -64 -24 167 -16 -56 27 106 -84 -154 -24 71 -128 -4 26 7 150 43 4 24 -221 -12 139 130 -126
6462a26J91J3L2j45K1k5j52M03qj85j79K78j32J4j27nj22L22p3N7mJ18j0K7j28
$$ -126 65 78 110 -35 -14 -39 -191 212 204 19 -160 118 -14 0 -127 -132 -254 68 -5 52 48 166 156 183 55
6487E5P4p9m7M8k47K51M6Q7j56R5k01P4m1P6j4n5K5l07L22k5q8k71N45j13J99
$$ 55 129 50 3 51 -196 55 101 188 32 127 -74 0 -41 35 21 -34 -9 -316 6 -19 -107 -378 167 54 253
6512B53m56J48j2K45l3j8k06K12P2m84L34j68M5J04R3r2L2R8n1k49m4P8P7R2p5
$$ 253 -203 -55 -67 178 145 127 -79 133 205 -279 55 -113 -68 36 129 37 69 167 116 -133 -177 -99 -22 70 -5
6537eJ40j63J4R0k3Q6r7J22q1r3Q9m6J7j22P6N0J00j27J10l10J86j8J08j79P6
$$ -5 135 -28 -14 76 53 139 42 164 83 -10 79 33 50 -72 4 54 154 27 137 -173 13 -5 103 -76 0
6562@N1k11J36j99K03P4k6M5J44j68m5%J15L1m0j29l37L47P0j54K58q4o9L0M3
$$ 0 51 -160 -24 -223 -20 54 28 73 217 49 4 4 119 150 110 -19 -356 -9 61 -93 165 81 12 42 85
6587H5l7J06k69J18l7J9K44k74J22k50R7j06L40j23j69L11j45m6R8L9l06Q6K84
$$ 85 48 154 -115 3 -34 -15 229 -45 77 -173 -76 -182 158 35 -134 177 32 -14 84 123 -183 -97 187
6610A87P1m61L34j28k14K13j35J84j64J03q1L21j68k76K68n6k20K41r3J10J67
$$ 187 258 -203 131 3 -211 2 -133 51 -113 -10 -91 230 62 -214 54 -2 -222 19 -74 36 203
6631B03j56j0j22k18L85M9N2j27J55j36q7J7p1L56m03P8j6j76K74P4Q7j69m3j66
$$ 203 47 37 -85 -303 82 131 183 56 211 75 -12 5 -66 290 -113 -35 -51 -227 47 121 208 39 -4 -170
6655a70O59n30m7O1N7j23K14l82K71j6K2j51J89r1J6j7J72q5j72K54N7l64K05
$$ -170 489 -41 -88 -27 30 -93 121 -261 10 -6 16 -135 54 -37 -21 -38 134 49 -123 131 188 -176 29
6678B9m0j91K63k09J85j03j41K10j46K9K35m1j56J94j64QJ17j10K13l12L02K0
$$ 29 -11 -202 61 -148 37 -66 -207 3 -143 -114 121 80 -76 118 -46 -38 79 -31 182 -130 172 192
6700A92l62K23J9K9J3J90l63J73L5j93j40K13nRl7j5K65j99k14K25j73J42K29
$$ 192 -170 53 72 101 114 304 -59 114 149 -44 -184 29 24 33 -4 -19 246 47 -167 58 -115 27 256
6723B56j07q8K3p1k41O4k5L53m1j55J02K14k07j73K2m6J27K4N6j53r3l1J64J14
$$ 256 149 61 84 13 -228 -164 -189 164 123 -32 70 284 77 -96 -74 -120 7 31 87 -66 -159 -190 -26 88
6747H8j84J72j80N4J47j10l8M4K48l75Q8K03n4j30M9r8J52j46m5N3j6K14m45J34
$$ 88 -96 76 -104 -50 97 -13 -51 -7 241 -134 -46 157 103 -27 22 -76 76 -70 -115 -62 -78 136 -309 -175
6771a75K39o6j31K1K88L8k71J86q9K1m3J67K44o09M8L74j28j87J55k52K11k50
$$ -175 64 -2 -133 -112 176 214 -57 129 40 61 18 185 429 -180 -132 242 114 -73 82 -170 41 -209
6793b09K44j13J45j65L04k31K5J54j51m8P9l4m4k0J2K14k06J85p9j02j7Q3j54
$$ -209 35 -78 67 -98 206 -25 0 154 3 -45 34 0 -44 -64 -52 162 -44 141 62 -40 -57 26 -128
6816a28K00k09j27M57k00J08j22q7K64m91J76L69k47Ro5J00j91K25K2k08J19k01
$$ -128 72 -137 -264 193 -7 101 -21 -108 156 -335 -159 210 -37 -28 -93 7 -184 41 63 -145 -26 -227
6838b27L68k20J91p8l9O8j9L02l13j28J90n9j74j48M3J02J30J87k28J20o9J30
$$ -227 141 -79 112 34 -5 63 44 346 33 -95 95 36 -138 -286 -243 -141 -11 176 -52 68 -1 129
6860A29m56L13J49j10N2k01K46o4J73j90j75K48j75R5R6k15m8R5N0k0j28J82k5
$$ 129 -327 -14 135 25 77 -124 122 58 231 41 -134 114 -61 34 130 -85 -133 -38 12 -8 -136 46 21
6883B1P1J85l44j0J94Lk31R8O2J1Nj8j48J01k83K96J18j41l2O4J50j1j69r0L36
$$ 21 92 277 -67 -77 117 120 -111 -13 49 60 65 47 -101 0 -283 13 131 -10 -42 22 172 161 -8 -98 238
6908B38m28k3J70j04K43l07R2R9O5j33K00j39J93j78n8J71j29M7K4j15o2J32j61
$$ 238 -190 -213 -43 -147 96 -211 -119 -20 45 -88 112 -27 166 -12 -70 101 -28 19 43 -72 -134 -2 -163
6931a63K2k1L88m3m0p0J5J7O4P9l85K82j17J05l45J27L0J28J4k93K08K59m5m13
$$ -163 -141 -162 226 183 143 73 88 105 169 248 -137 145 28 133 -212 -85 -55 73 87 -206 2 261 216 -197
6955a97L20j8j94J81j19L7q4J03K5Pj04R2P2q0r9L3L0J69j91J13Lp9po1J07J1
$$ -197 123 105 -89 92 -27 10 -74 29 54 61 -43 49 121 41 -58 -25 5 174 -17 96 99 20 13 -48 59 70
6981G0op4j60J08m3J01m8LJ25j57q0N5j40L86k51J87j05M7K53k93n8Lo8Q3P5J04
$$ 70 64 -10 -170 -62 -105 -4 -52 -49 76 -81 -161 -106 -246 140 -111 76 -29 18 271 -22 -80 -77 -145 -62 13 117
7007A17p4J18j02r6J51PR3j16q5k73R3J89J9J04p9j16j92L67k55k3L74o6l8k7
$$ 117 43 161 59 -37 114 121 214 98 13 -260 -167 22 41 145 66 -50 -242 125 -130 -153 221 155 117 90
7031I0j36l5k13N94j68j33M7N8k42L19l3j90O4M0j06J97k73L01J2l71J75N0j52
$$ 90 -46 -81 -294 300 132 -1 46 104 -138 181 148 -42 22 62 -44 153 -120 181 193 -178 -3 47 -105
7054a05J03k17M05m98N30k93J5j7K1L80l89k2L4l8K05j0j10R7r1L7K4r2k40K2
$$ -105 -2 -219 186 -312 218 -75 -60 -77 -56 324 -65 -87 -53 -91 114 104 -6 91 0 37 61 -31 -271 -249
7078b49K24k4l6J14m2n6J88k6j65J78k35Q4l7n1J24J08j98N3k29L17O0r8J67k58
$$ -249 -25 -49 -85 29 -13 -69 119 93 -72 106 -129 -45 -82 -133 -9 99 -99 -46 -275 42 102 4 171 -87
7102h7j61J88J01J9J56r5K89k57j19N1k44L6J62L55m60QL8jJ00j22m5n3M0M1K62
$$ -87 -248 -60 41 60 216 121 410 153 34 85 -159 -123 39 394 -66 -58 -20 -21 79 -43 -88 -141 -101 -60 202
7127B02j98O5j42J06Q3l16J82J71J36l26p4L30k66K30l73N10k02j86K53k40q1
$$ 202 4 69 -73 33 116 -200 -18 153 289 -37 -111 219 -47 183 -190 320 118 -68 185 -55 -136
7148a36K21Q2m51J92L18k84j8J00j81J68J26j83R1l46K94O1k2P9q4J84j66L20
$$ -136 85 167 -284 -92 226 -58 -76 24 -157 11 137 -46 45 -301 -7 54 32 111 27 211 45 365
7170C65n24J17J28k08J56j7j5J68K2j67Nl3n8M20l36ko6L22l18N6Q9J2k10K30
$$ 365 -159 -42 86 -122 34 17 2 170 192 25 30 -3 -61 359 23 21 -45 277 -41 15 104 116 -94 136
7194A36j38J10m3j59K37l32J84j00Q0K94l47M2j0Q7j74J47k05J33P6J49r4O9j83
$$ 136 -2 108 65 -94 143 -189 -5 -105 -25 269 -78 -36 -46 41 -133 14 -191 -58 18 167 73 142 -41
7217d1J72k44J92o7r3N8L23n85L10l23L65o0J61k95K1j47J24L3j14J42q3K01j40
$$ -41 131 -113 79 12 -81 -23 300 -285 25 -298 67 7 168 -127 -106 -253 -129 -96 -210 -68 -151 50 -90
7240i0K64j14q3j5l2K0L35k17Q5l40J40Q0O4p7J00j99r9J30J26J04n61M86rL3
$$ -90 174 60 -23 -38 -70 -50 285 68 153 -187 -47 33 97 20 120 -79 -178 -48 78 182 -379 107 98 131
7264A31q3j08o0J05l0q6J44p8J73m6j39K21k16N9j12L74j46O8n6J51k82L9Q2P5
$$ 131 48 -60 -120 -15 -45 -131 13 -65 108 62 -77 144 -72 -13 -125 249 103 171 115 266 -16 23 105 180
7288A80j85J76P0k28J36j79PJ14ol05L35k27K59J2j99m4J80r4R1k25N9J53J85
$$ 180 -5 171 241 13 149 -30 -23 91 85 -220 115 -112 147 159 -40 -84 96 2 93 -132 -73 80 265
7311B65l43o1J47r6J08K50k28O4j02r3J65r2k8q1R4K0J2k09J24J11k6J22k17J29
$$ 265 -78 -139 8 -88 20 270 42 106 4 -89 76 -16 -44 -125 -31 -11 1 -208 -84 27 1 123 -94 35
7335C5M0k0j05J97k35N6J66l6O1m4j41L8r9J19j15J23K8K45j04j78r3J57J79l61
$$ 35 75 55 -50 147 -88 -32 134 98 159 115 -26 12 -87 32 -83 40 68 313 209 31 -62 95 274 -87
7359h7j01P8J04K10m53K39k6J82k23J02N5p7j91J7M17l44P2K01j49K31j96K39
$$ -87 -188 -110 -6 204 -249 -10 -36 146 -77 25 80 3 -188 -171 246 -98 -26 175 26 257 61 300
7381C00j74j00k6J27J85Nl84J22J58j88k59K10p7O5J20k05M7QJ48l5Pk86J87p8
$$ 300 126 26 0 127 312 317 -67 55 213 25 -234 -24 -101 -36 84 -121 -74 -66 82 47 54 -232 -45 -123
7405a23M33l66m8K97J74l09k25K98ok06K93j15L5j94J32j1j55M4K87n16K44K19
$$ -123 310 -56 -104 193 367 58 -167 131 125 -81 212 97 132 -62 70 59 -96 -52 235 -281 -37 182
7427A82k66K21j02j01M72l18j26k4m0J83j4j50Q3K07l32K33k06J23j70J20%O9
$$ 182 -84 137 35 -66 406 88 -38 -62 -102 81 67 -83 0 207 -125 108 -98 25 -145 -25 -25 44
7449D4j50mQ1j26L8J11j18k1K34n4k41J23j1K82l05l1K11j95L2K53l90J95J68
$$ 44 -106 -110 -29 -155 -117 -6 -124 -145 89 35 -206 -83 -94 188 -117 -148 63 -132 -100 153 -237 -42 126
7472A26k68J38k86L06Q6j31J90l2k17k4L45j63j16J96j72pR1P2j31O8j78l4m8
$$ 126 -142 -4 -290 16 102 -29 161 129 -88 -112 233 70 -46 150 -22 -29 62 134 3 71 -107 -141 -189
7495a89J01j17K53LoK08j53J54j58M6k10J9K6N6N8n0Q3j76J6J49k67L20J6j64
$$ -189 -88 -205 48 51 45 253 100 254 96 142 -68 -49 -23 33 91 41 124 -52 -36 113 -154 166 182 18
7519A8L0L9l09N15l10Q9J6m9n9J24K2p4j03P3rj2p3j96K48K2j32r9K86j31K99
$$ 18 48 87 -222 293 -17 72 88 39 -20 104 126 52 -51 22 13 1 -72 -268 -20 2 -130 -229 57 -74 225
7544B25j85p8Q6r0J01j2j58J94k1R5P7k57j04j86NK62j27J66j5j46J11j03J67
$$ 225 40 -38 48 -42 59 47 -111 83 62 157 234 -23 -127 -313 -308 -46 -173 -7 -22 -168 -57 -160 7
7567Gk02J51K09j13l9j17P6k6J37j5j68L3j42J19L4m1Q8Q5k51J53O2r0n3Q5M6
$$ 7 -195 -44 165 52 13 -104 -28 -54 83 68 -100 -67 -209 -90 -56 -97 -9 76 -175 -22 40 -50 -103 -18 28
7592B8L8q4q9O0J54k15K96j3l89L15j40J35On7J08k11k21M12j48J39k21J32J32
$$ 28 66 -18 -107 -47 107 -108 188 175 -214 101 -39 96 102 45 153 -58 -279 133 -15 124 -97 35 167
7615A67l36J17J41j42N5q5J19j6j00M2n3J20jl4J3j29ok2L28q0p2J22k43J16l0
$$ 167 -169 -52 89 -53 2 -83 36 20 -80 -38 -91 29 28 -6 7 -122 -128 -150 178 98 26 148 -95 21 -9
7640iJ37k48O6J56n0j1k70N5KJ13j31Q6O4q5K71R5k28J73k50L02k30p8P7J46j38
$$ -9 128 -120 -54 102 52 41 -229 -174 -172 -59 -190 -104 -40 -125 146 241 13 186 -64 238 8 -70 7 153 15
7665A5j24J28O9K09l78J74j99J03K0j2j31J36j6j45l8J80J16k34k6K50j55N6q8
$$ 15 -109 19 88 297 -81 93 -106 -3 17 5 -126 10 -6 -151 -189 -9 107 -127 -153 97 -58 -2 -90
7688i0J42j61J97Qo6m6p2J12N3L3k7j89k2J58k8N5j97J18Q1j22K40k77J66L32
$$ -90 52 -109 88 96 30 -16 -88 24 77 110 83 -106 -128 30 2 57 -140 -22 59 -63 177 -100 66 398
7712C98l25j3m03L60j40K03j61M9j32J10K46J4o8p5k84L1J47R0j15j67k4L76r2
$$ 398 73 60 -343 17 -123 80 -81 -32 -164 -54 192 206 138 63 -221 -190 -43 47 -68 -235 -259 117 25
7735B5j70L63k12j13K0J4J79N2l25k55M35M6j95K10J08J41l02Q0n4J63j79J48
$$ 25 -145 218 6 -107 -87 -73 106 158 -167 -422 13 59 -136 74 182 323 21 101 47 210 31 179
7757A79j23J15k98L3L39l5k67QK6L0j90K17R5q6j98J59J05K4k67R5k6q0K94k53
$$ 179 56 171 -127 -94 245 210 -57 -49 -23 7 -183 34 129 43 -155 4 109 133 -134 -39 -65 -145 149 -104
7781a04K3J0R4j25J79k12J02J39P6k53PL56j32l16K01m8j60K59j54M1J66j74L9
$$ -104 -81 -71 23 -102 77 -135 -33 106 182 -71 -64 292 160 -156 45 -3 -163 96 -58 -17 149 -25 14
7804A4o9J16q8J88l45M9OP4J37K7l29L45K1k13J5m8M7R8p9J01J93k14j39j86K24
$$ 14 -55 61 -27 161 -184 -135 -129 -55 82 109 -220 125 146 -67 -52 -100 -53 45 -34 67 260 46 -93 -279 -55
7829e5L40j86j94J43J57l08pJ6k8L51k05k1J49k24P4J4O5J61q0K5k77J19M6j1
$$ -55 285 99 -95 48 205 -103 -110 -94 -122 229 24 3 152 -72 2 16 81 242 162 187 -90 29 75 64
7853F4n1Pj41J77j47P0j28K07j43L7J3j15Q4L3J55k99N3J00J66K1j65l7p3J72
$$ 64 13 20 -121 56 -91 -21 -149 58 -85 -48 -35 -150 -66 -33 122 -177 -124 -24 142 163 -2 -39 -112 60
7877F0k34J22o2p6J08K01K6J12q5l82K48jK95j96j70J6J10j89R3J56K2j14K45
$$ 60 -174 -52 -114 -190 -82 119 145 257 172 -210 38 37 332 136 -34 -18 92 -97 -4 152 174 60 305
7900C05j24j37K0j09J64l19M28m11K82k2j0J3l2r2q7L38j35k22J49Q0l1m7P5m3
$$ 305 181 44 64 -45 119 -200 228 -183 99 77 67 80 48 -44 -131 207 72 -150 -1 79 48 1 76 33
7924C3K5j36J02J40l98K50j19J66j49l0r4K43O5m9O0l18L68j96N3J20j49M5n6
$$ 33 58 -78 24 164 -234 16 -103 63 -86 -116 -210 33 98 49 109 -209 159 -37 16 136 -13 32 -24
7947b4R3o6O8n9Op5l5R0J93k66L5l8R8mm5n5J57l91J28L29k15Q1j85K91j32Q9
$$ -24 69 3 71 12 18 -57 -92 -2 191 -75 -40 -78 20 16 -29 -84 73 -318 -190 139 -76 5 -180 111 -21 68
7973F8r9r8M30l65j23L43m7k21K51j63j2K1L47k05m3J2k29J33j00Q5o7J96R4k55
$$ 68 -31 -129 301 -64 -187 156 109 -112 139 -24 -36 -15 332 127 84 96 -133 0 -100 -15 -82 114 208 -47
7997d7r9J30j26j40L80j51r7k7J84J32j87J98p9k96J67j06K07O3j54Kk6N8o0J82
$$ -47 -146 -16 -142 -282 98 -53 -150 -177 7 139 -48 150 71 -225 -58 -164 43 106 -48 -46 -72 -14 -74 108
8021A08q4j99J09j7Mj57J53LJ55nj78J85k73J28R1K17k8k61J80J07p8J8k24K05
$$ 108 24 -175 -66 -83 -79 -236 -83 -80 75 70 -108 77 -196 -68 23 240 212 -49 131 238 160 178 -46 159
8045A59j28k7OL5J23j49p5J57q8j26k77L23L18l14L1Rk29L92l40j7L40j14j53
$$ 159 31 4 10 45 168 19 -56 101 13 -113 -390 -67 251 -63 -32 -23 -252 140 -200 -217 123 9 -144
8068a44J77m5k27K83n2j0j92K08J14O8m96L53K8J40k73Q3p0K69j47l28K05M7o6
$$ -144 33 -12 -239 44 -8 -18 -210 -2 112 180 -316 37 65 205 -68 15 -55 214 67 -261 -56 -9 -75
8091g5k3O7J59k24K40k02K48k15j40J88j60L15K1k50q9J77J53j38k7q7k16M04
$$ -75 -98 -31 128 -96 144 -58 190 -25 -165 23 -137 178 199 -51 -140 37 190 52 25 -62 -278 126
8113A26j13j44J65m9k29L35j08R4r1J6k18J42M9N9j36Q7J03j01J22q5oj13N7O0
$$ 126 13 -131 34 -15 -244 91 -17 77 -14 2 -216 -74 -25 34 -102 -15 88 -13 109 24 18 -95 -38 22
8137B2j7P1m9j76M9P8Q1j55L80k24j45j06K54j39Q8pk08K74mJ8j64J83m5m3l36
$$ 22 5 76 27 -149 -100 -22 59 -96 284 60 -85 -191 63 -76 12 5 -203 71 67 85 -79 104 59 16 -320
8162c20L45r0J44J33l30J69M6J28k12n9j6O7N8l05N6J65k3J84k05j02K78k85K13
$$ -320 25 -65 79 212 -118 51 97 225 13 -46 -62 5 63 -242 -186 -21 -44 140 -65 -167 111 -174 39
8185C9m0k30O1J65j65L88
$$ 39 -1 -231 -170 -5 -170 218
8191B18
$$ Imaginary data points
##PAGE= N=2
##DATA TABLE= (X++(I..I)), XYDATA
0@%%%%%%%%%%qJ6j6J6k4L2l4M2n6O7p6R1j14J36j58J83k10K44k83L27l75M26m84
$$ 0 0 0 0 0 0 0 0 0 0 0 -8 8 -8 8 -16 16 -18 24 -32 35 -41 50 -64 72 -86 97 -113 131 -152 175 -200 226 -258
33b58N49o20O99p86Q80r84J098j221J358j509J670j848K044k254K485k738L016
$$ -258 291 -329 370 -416 464 -520 578 -643 715 -794 876 -972 1072 -1182 1303 -1435 1581
50A581l323L660m034M450m915N437o029O710p496Q418r521J0863j2538J4698j7602
$$ 1581 -1742 1918 -2116 2334 -2581 2856 -3173 3537 -3959 4459 -5062 5801 -6737 7961 -9641
65i641K1731k8092L9246o4343K20878j815l21311K30505m3793J9741K4863j48911
$$ -9641 12090 -16002 23244 -41099 179779 177964 -143347 87158 43365 63106 87969 -60942
77f0942P0765P1764j53444P4949J956o4335P0995p586o8222J9520P2260K8722
$$ -60942 9823 81587 -71857 3092 5048 -59287 11708 4122 -64100 -44580 27680 56402
89E6402j00845j700J08676o944l4456o784j8523Q6368k6205o8920N3243k0017
$$ 56402 -44443 -46143 62533 55589 21133 14349 -4174 82194 55989 -12931 40312 20295
101B0295p923M2456q1683j2744P7002l6079l7448q010K2056L1526m0628k464M494
$$ 20295 12372 54828 -26855 -39599 37403 1324 -36124 -44134 -22078 9448 -31180 -33644 -29150
114b9150O044L4130k0130j6354J5584K470M4933k4639p4027Q7514L4616q4219
$$ -29150 -23106 11024 -9106 -25460 -9876 -7406 37527 12888 -61139 26375 60991 -23228
126b3228j587L8500J0712j8374l0818J3496L1184l0347n560K4011j8903j6277
$$ -23228 -24815 13685 24397 6023 -24795 -11299 19885 -10462 -16022 7989 -10914 -27191
138b7191L5521J4402n6836J3055N0472k4575k1586J1158Q809K2588k6280k9894
$$ -27191 8330 22732 -34104 -21049 29423 4848 -16738 -5580 3229 25817 -463 -30357
150c0357N9122j8097k7285M2775l1304j0713M0962j6185j3129J389n825L6676
$$ -30357 28765 10668 -16617 26158 -5146 -15859 25103 8918 -4211 -2822 -8647 28029
162B8029k1200l4715L7349L863r718q059r410K1419Q558k0374l145j919J4688
$$ 28029 6829 -27886 9463 13326 3608 -4451 -13861 7558 16116 -4258 -7403 -9322 5366
175E366K1550m2123q344L8236p52j8404q360P597J7037p924k0895J4666J251k853
$$ 5366 26916 -15207 -23551 14685 13933 -4471 -12831 -5234 11803 3879 -17016 -2350 -1099 -3952
189c952O553j3253n855J3175J5860j9502j9363K0664K3347j8372j9732J4449J8352
$$ -3952 2601 -10652 -16507 -3332 12528 -6974 -26337 -5673 17674 -698 -20430 -5981 12371
202A2371l688k1244J0450J0614n126j298m459R23J380N844l718j4297k9K4048
$$ 12371 8683 -12561 -2111 8503 3377 2079 -2380 -1457 -77 5767 2049 -12248 -12277 11771
216A1771o365k4919Q245J3869M306j5163m197J3274O157p958k985N638K350N437
$$ 11771 5406 -19513 -11268 2601 6907 -8256 -12453 821 6978 -980 -3965 1673 4023 9460
230I460p584k226J675R126J680j8807L344J1964l715p686n7k647Q723m541p661
$$ 9460 1876 -350 1325 10451 12131 -6676 -3332 8632 4917 -2769 -2826 -5473 3250 -1291 -8952
245h952R183o749M738K910q536L635P101j849l460k399N490Q848j3767K213M404
$$ -8952 231 -6518 -1780 1130 -7406 -3771 3330 1481 -1979 -4378 1112 9960 -3807 -1594 2810
260B810m175N633n232j215K536l627J205M178j0335M959M762p639M153k927N080
$$ 2810 -1365 4268 -964 -2179 357 -3270 -2065 2113 -8222 -3263 1499 -6140 -1987 -4914 166
275A66R72o236M518K498k712M403j173n008Q775n364L061J100q499Q202n58m393
$$ 166 1138 -5098 -580 1918 -794 3609 2436 -2572 6203 839 3900 5000 -3499 4703 4145 -248
291b48J509m61j574M065o105J962K272m205O866p982J603O291l268J019r26l409
$$ -248 1261 800 -774 3291 -2814 -852 1420 -2785 4081 -3901 -2298 3993 725 1744 818 -2591
307b591Q426J034r186O728k436K467J788p415M227R25j546p52l222K93N856o033
$$ -2591 5835 6869 -2317 4411 1975 4442 6230 -1185 3042 3967 2421 1669 -1553 -1260 4596 -1437
323a437j418n9k492J0330q097n358N941J554L27k359m079N992N109p819K634j206
$$ -1437 -2855 -2914 -5406 4924 -3173 -8531 -2590 -1036 -709 -3068 -7147 -1155 3954 -3865 -1231 -2437
339b437N469K108q210L338J761K993P04p973k108J1476k976n201j824k906J1002
$$ -2437 3032 5140 -3070 268 2029 5022 5726 -2247 -4355 7121 4145 -1056 -2880 -5786 5216
354E216m243q971K288M178K662m397n739N829P560m774j621m323R915Q012j1168
$$ 5216 973 -7998 -5710 -1532 1130 -3267 -9006 -3177 4383 -391 -2012 -6335 3580 11592 424
369D24o70L026N367L724q083o880J0276K280m970n541m549J2209k361r680k635
$$ 424 -246 2780 8147 11871 3788 -3092 7184 9464 4494 -1047 -5596 6613 4252 -5428 -8063
384h063M028Q969m789j2570O250J0676k906M6r205N409J4078o882m949j386O355
$$ -8063 -4035 4934 145 -12425 -6175 4501 1595 1641 -7564 -2155 11923 5041 92 -1294 5061
399E061P089p793j0455Q323N084j470r509p950J5967J350j0117l403l05J1362
$$ 5061 12150 4357 -6098 2225 7309 5839 -3670 -11620 4347 5697 -4420 -7823 -8128 3234
413C234M626j4798j544J2320K235J594j1602J178J5056l407n994n961M560J0780
$$ 3234 7860 -6938 -8482 3838 6073 7667 -3935 -2757 12299 8892 2898 -3063 1497 12277
427A2277o084j3337L942M673N892n788j7165J3121R351n033n790m667J1381R527
$$ 12277 6193 -7144 -3202 1471 7363 1575 -15590 -2469 6882 1849 -3941 -8608 2773 12300
441A2300j0067o119O834O940N421j4284m443J3730J859l204j4140r58J7021j674
$$ 12300 2233 -3886 2948 9888 15309 1025 -3418 10312 12171 8967 -5173 -6131 10890 9216
455I216j8174k14O234P444l086j6591P665R667J236o499q495J0581J2199p758
$$ 9216 -8958 -9172 -2938 4506 1420 -15171 -7506 2161 3397 -3102 -11597 -1016 11183 3425
469C425q550J274Q655J1397j7042q690J4130K134r35j0104n150J1041M066r912
$$ 3425 -5125 -3851 4804 16201 -841 -9531 4599 6733 5798 -4306 -9456 1585 5651 -4261
483d261m845O27J0043K937j4947P96O637R036l140j4990P676J2834l025o507l397
$$ -4261 -9106 -8479 1564 4501 -10446 -9650 -3013 6023 2883 -12107 -4431 8403 5378 -1129 -4526
498d526L259J3370p034j1191M684O067M935j0682p023R069Q643o458j0355R06
$$ -4526 -1267 12103 5069 -6122 -1438 4629 9564 -1118 -8141 928 9571 3113 -7242 -6336
512f336J2678K248j3554P03L155P525R98j2552N85R908K144n004o247J224J2743
$$ -6336 6342 8590 -4964 -4261 -1106 6419 7417 -5135 -4550 5358 7502 2498 -3749 -2525 10218
527A0218m592j0036J895M703N807q267n365L661L549J724l617p965L975Q617l097
$$ 10218 5626 -4410 -2515 2188 7995 -272 -5637 -1976 1573 3297 -320 -8285 -4310 4307 1210
542A210m602n889R525P030j0142m434N977O497k485p133j982R636J469o699m102
$$ 1210 -3392 -9281 244 7274 -2868 -7302 -1325 5172 2687 -4446 -6428 3208 4677 -2022 -6124
557f124l78R468p81r265m135P757O080o535q347M710J0373m437m925k089Q077
$$ -6124 -6502 2966 2185 -7080 -11215 -3458 2622 -3913 -12260 -7550 2823 -1614 -6539 -8628 -551
572e51O293o626m844M064P267M64m890o668O955P115n852p189J352O176j526l005
$$ -551 5742 -884 -5728 -1664 5603 6067 1177 -5491 1464 8579 2727 -4462 -3110 3066 1540 -1465
588a465n596K964N430j990m650j801N968L906j547p936L544J0925p45r374N7R208
$$ -1465 -7061 -4097 1333 -657 -5307 -7108 -1140 2766 1219 -6717 -3173 7752 7007 -2367 -2310 6898
604F898N25k890o301K280P436m082n783n85L296J789j340q403J041Q786M88q654
$$ 6898 7423 4533 -1768 512 7948 3866 -1917 -2502 794 2583 1243 -7160 -6119 2667 3155 -5499
620e499l842J0143K725m140m317K157O276Q78o817n88O807k047L41l236l033O521
$$ -5499 -9341 802 3527 -613 -4930 -2773 3503 4381 -2436 -3024 3783 1736 2077 -1159 -4192 2329
636B329J591o667k833M042K065j71m804l94L327K734j084n037M140J610O89o79
$$ 2329 3920 -2747 -5580 -1538 527 356 -4448 -4842 -1515 1219 135 -4902 -762 848 1537 858
652H58m113L183N849m620n038M383J776J384n199j924M407J214p32l754P4K531
$$ 858 -3255 -72 5777 1157 -3881 502 2278 3662 -1537 -3461 946 2160 1428 -2326 -2252 279
668B79J989k183j523m10M848J636p571K250M181P19l041l235K362L863j836l526
$$ 279 2268 85 -1438 -1848 3000 4636 -2935 -685 3496 4215 1174 -2061 301 4164 2328 -1198
684a198R26q76M213j799l223K4Q33M170l335l264L070L203k633j340j001L036
$$ -1198 -272 -1148 3065 1266 -1957 -1933 -1100 3070 -265 -3529 -459 2744 111 -1229 -2230 806
700H06K868n077K64p60K802K231n016j779K737K514j275k821j936N908n06l776
$$ 806 3674 -1403 -1139 -1899 903 3134 -1882 -3661 -924 1590 315 -2506 -4442 1466 960 -2816
716b816M68Q88L394j808j987L04K750J585j400m155J691N071k157j958k911K972
$$ -2816 -2348 -1460 1934 126 -1861 -1557 1193 2778 1378 -2777 -1086 3985 1828 -130 -3041 -69
732f9L721m110k045J617J441Kp11k849K995J717l86k344j546O070q6k400j833
$$ -69 3652 -458 -2503 -886 555 557 -154 -3003 -8 1709 1323 -1021 -2567 3503 3417 1017 -816
749h16J112L515L65m908j35L570j384R60l572o03L438k71k339k353K640K455j384
$$ -816 296 3811 4176 -732 -867 2703 1319 2279 -1293 -1896 1542 1271 -1068 -3421 -781 1674 290
766B90l688J413K649J603k019m148M263J528o98j358j916J018L898j969m435J559
$$ 290 -3398 -1985 664 2267 248 -3900 363 1891 1193 -165 -2081 -1063 2835 866 -3569 -2010
782b010J936J572l976j959L315J950j171l912Q49L971J520l566m25L9L265K247
$$ -2010 -74 1498 -2478 -4437 -1122 828 -343 -4255 -3406 565 2085 -1481 -1906 -1867 1398 3645
798C645n781J63K671K227k576k944P38L914l96m283p40J739M443l170l548J579
$$ 3645 -2136 -1973 698 2925 349 -2595 -1857 2057 1661 -2622 -3362 -1623 2820 -350 -3898 -2319
814b319K853K790l655k855L065N149k691k339o0K737L123m609j951J157L351m09
$$ -2319 534 3324 -331 -3186 -121 5028 2337 -2 -62 2675 5798 1189 -762 395 3746 3337
830C337m881j673M049K280l586l346o44O609k42m949j80K197L703j374l383M75
$$ 3337 -1544 -3217 832 3112 -474 -3820 -4464 2145 1903 -3046 -3226 -1029 2674 1300 -2083 -1608
846a608M829j07k126k795K354M840l196l163j701M387K730m837m185K730L513
$$ -1608 3221 3114 988 -1807 547 5387 2191 -972 -2673 1714 4444 -393 -4578 -1848 1665
861A665j419l182k706M963J839k809k645R99N269k65l340j808L657L276q84n058
$$ 1665 246 -2936 -5642 -679 1160 -1649 -4294 -3295 1974 1709 -1631 -3439 218 3494 2610 -2448
877b448K19N937j82k578l612J731M737j271n396n61M514J168k904m230L354L314
$$ -2448 -2229 3708 3526 948 -2664 -933 3804 2533 -2863 -3424 1090 2258 -646 -4876 -1522 1792
893A792l77m139j758N641J788k488l055J624L583J652m543k779M568K156j407
$$ 1792 1415 -2724 -4482 1159 2947 459 -2596 -972 2611 4263 -280 -3059 1509 3665 2258
908B258m599P78L890M36l968k722L750K671k163m343J465L248J367k550l826L028
$$ 2258 -2341 -1563 2327 2763 -1205 -3927 -177 2494 331 -4012 -2547 701 2068 -482 -4308 -1280
924a280L643J79m407q01L568K459k467m142J934L359O43n622q21L361K382j748
$$ -1280 2363 2542 -1865 -2666 902 3361 894 -3248 -1314 2045 2688 -2934 -3755 -394 1988 240
940B40n001J257M324J430m729j563L124L489j715l510J395K637K384m226j780
$$ 240 -4761 -3504 820 2250 -2479 -4042 -918 2571 856 -2654 -1259 1378 3762 -464 -2244
955b244L147J917j043l400k21L119J652m057j594J244L377r67m006J104J700K057
$$ -2244 903 2820 1777 -1623 -1844 1275 2927 -1130 -2724 -1480 1897 930 -3076 -1972 -272 1785
971A785j593k607J595L490l68k387o40P88M365k062l688L09K821K078l885k685
$$ 1785 192 -2415 -820 2670 2302 -85 -725 63 4428 2366 -1322 -1013 1808 3886 1 -2684
987b684J912L395j717k790k127M143K073m436k64P01L160J50m060l17M538Q90
$$ -2684 -772 2623 906 -1884 -4011 132 2205 -2231 -2495 -1794 1366 1516 -2544 -2861 1677 2567
1003B567k839k005J102M759k352k584j78J195K821l457k034K434R63r06q93k020
$$ 2567 -272 -2277 -1175 3584 1232 -1352 -1530 -335 2486 -971 -3005 -571 392 -514 -1407 -3427
1019c427K584K369l208k78n4K751J273l032k69J228K104J82k869j048L804o19
$$ -3427 -843 1526 -1682 -1960 -2014 737 2010 -1022 -1291 -63 2041 2223 -646 -1694 2110 1491
1035A491n83j818j110M865j393l326J36K197J411j257l759K062L569j067j287
$$ 1491 908 -910 -2020 2845 1452 -1874 -1738 459 1870 613 -3146 -1084 2485 1418 131
1050A31k558L861J940l125l12J59J896Q01l134j338M160r54j093j534j86L294
$$ 131 -2427 1434 3374 249 -63 96 1992 2793 -341 -1679 2481 1527 434 -1100 -1286 2008
1066B008j718j294n52Q13J474m43j977Q50Q30N02O84l533K356K006j713l77q84
$$ 2008 290 -1004 -1556 -743 731 288 -1689 -839 -9 493 1177 -2356 0 2006 293 -84 -968
1083i68J130J594j447k401J295M75J567j951k573K542M55Q29k462j184L972O97
$$ -968 162 1756 309 -2092 -797 -322 1245 -706 -3279 -737 -282 547 -1915 -3099 873 1570
1099A570l281K68J213J087P00l630J529J824K1k77k637J138K116r62j759K76L70
$$ 1570 -1711 -1443 -230 857 1557 -2073 -544 1280 1301 1024 -1613 -475 1641 679 -1080 -804 -434
1116d34K246k106j921K392j55Q19j461o17J611J276r32r67k38J550J869l162k36
$$ -434 1812 -294 -2215 177 22 841 -620 -1237 374 1650 718 -249 -487 1063 2932 -230 -466
1133d66N09J240P29l296K98J872o3j318k93p65K271l1k049k50N09L282k057k435
$$ -466 43 1283 2012 -1284 -986 886 823 -495 -788 -1553 718 687 -1362 -1612 -1103 2179 122 -2313
1151b313J500J939P20k241j583K068K343l061K06k80N50J349k054r20P14J621
$$ -2313 -813 1126 1846 -395 -1978 90 2433 -628 -422 -702 -152 1197 -857 -1777 -1063 558
1167E58o41j713l42K251Q06j406j092j87L483o70j842M80J34J384N8k030l77K866
$$ 558 -83 -1796 -2138 113 919 -487 -1579 -1766 1717 1047 -795 -315 -181 1203 1261 -769 -1146 1720
1185A720p49j197j458J312K001j372j158q00K463P30j611j281J206J074L18m86
$$ 1720 971 -226 -1684 -372 1629 257 -901 -1701 762 1492 -119 -1400 -194 880 1198 712
1201G12k251K604J118j460j206K17J988R5j934j003J785L68m29k246L95J689K04
$$ 712 -1539 1065 2183 723 -483 -266 1722 1817 -117 -1120 665 1033 604 -1642 -1247 442 646
1218F46m3k773J155K139q6k229Q2J479Q86o92j998J431J054K67j739j140J824
$$ 646 603 -2170 -1015 1124 1038 -1191 -1109 370 1256 564 -1434 -3 1051 1318 -421 -1561 263
1235B63O69n91k156J99J401J351k391j593K154Q91L46k295K15J868J147j630j425
$$ 263 932 341 -1815 -1616 -215 1136 -1255 -2848 -694 197 543 -1752 -1537 331 1478 -152 -1577
1252a577J218J550O95k914NJ473J619j439k151O43J955J16k245m8K94K006n15
$$ -1577 -359 1191 1886 -1028 -1023 450 2069 630 -1521 -878 1077 1193 -1052 -1100 -806 1200 685
1269F85k327Q78J713J308k356o70J121J967q10k167N8J526J846k638j034P59J375
$$ 685 -1642 -764 949 2257 -99 -769 352 2319 1509 -658 -600 926 2772 134 -900 -141 1234
1286A234J74k023o18J348J483j698j461K49K405l6k024n62J262K522j836j831
$$ 1234 1408 -615 -1233 115 1598 -100 -1561 -1312 1093 1057 -967 -1529 -267 2255 419 -1412
1302a412N01J855O13j512j153L04K466j114j374p29J808N08j296j411M75K521
$$ -1412 -911 944 1557 45 -1108 -804 1662 548 -826 -1555 253 761 -535 -1946 -1471 1050
1318A050r44j879r5K072R97j324j388K3K455K52j754q45J820J258r66j581k48
$$ 1050 106 -1773 -1868 204 1201 -123 -1511 -1488 967 1219 -535 -1380 440 1698 732 -849 -1097
1335a097K485J35j634j224J830J052j100j269n72K140O14j301j618J304J560m96
$$ -1097 1388 1523 -111 -1335 495 1547 447 -822 -1394 746 1360 59 -1559 -255 1305 809
1351H09j031p69J936N40m35j771R29J928j072r90q52J309J003q24k108P65J368
$$ 809 -222 -991 945 1485 1050 -721 208 2136 1064 74 -778 531 1534 710 -1398 -633 735
1368G35O2j272j527J770Q84j50j725k15K240J26j332r62J353J074m0j854k53K093
$$ 735 797 -475 -2002 -232 652 502 -1223 -1438 802 928 -404 -1366 -13 1061 1021 -833 -1086 1007
1386A007J83j255j515J247J106l39j567l57R60J094r24j812J787N50O5q47j055
$$ 1007 1190 -65 -1580 -333 773 434 -1133 -1490 -530 564 -360 -2172 -385 165 230 -617 -1672
1403a672J459J347r21r06R13M24Q74j417p93R21P43L31k559P56J164J46j133q36
$$ -1672 -213 1134 213 -693 220 644 1518 101 -692 229 972 1303 -1256 -500 664 810 -323 -1159
1421a159L28J642J11k257Q84P44J159r18j553J162J346O00k074m89J357J223k011
$$ -1159 -831 811 922 -1335 -451 293 1452 534 -1019 143 1489 2089 15 -474 883 2106 95
1438I5n26K53O08J030k569j65J330O66q76j398L07J555M09j240j75N0J628l82
$$ 95 -431 -178 430 1460 -1109 -1274 56 722 -154 -1552 -1245 310 719 -521 -696 -646 982 600
1456F00j333J074n48J206m04j287K63J180o11q10m62M75J478j644m81M7R21J074
$$ 600 -733 341 -207 999 595 -692 -429 751 140 -670 -1132 -657 821 -823 -1304 -1257 -336 738
1474G38j736l49J404O76J12j342n95K350L31j907J0J55K015m58k261N9J675M01
$$ 738 -998 -1347 57 733 845 -497 -1092 1258 1589 -318 -308 -153 1862 1404 -857 -798 877 1278
1492A278j210j663J158J764j285m67m86Q54J602j663p14J121O53M5p72o71J371
$$ 1278 68 -1595 -437 1327 42 -425 -911 -57 1545 -118 -832 289 942 987 215 -456 915
1509I15M83n68m29j306K106l90q57n96o7J027L98j639k64J393k77N28j892N33
$$ 915 1398 830 401 -905 1201 811 -46 -642 -709 318 716 -923 -1187 206 -71 457 -1435 -902
1527i02K059o83j019n78J063J704j348j773J300Q28M15j290k055K500M83p26j149
$$ -902 1157 474 -545 -1123 -60 1644 296 -1477 -177 651 1066 -224 -2279 221 704 -22 -1171
1544a171j62J301R91j843j064J889K38L77j899O98J460k40K28j377O4J749l03
$$ -1171 -1333 -32 959 -884 -1948 -59 179 556 -1343 -645 815 575 803 -574 -510 1239 936
1561I36j490P15k67R08K70j900Q70K32N30n89j125R66R68m49p99m69R21J743j955
$$ 936 -554 161 -106 802 1072 -828 42 274 804 215 -910 56 1024 575 -224 -693 228 1971 16
1580A6p14J091M31R60j824p63J681O09j040r36k15J805Ok052R3L45J482r67j550
$$ 16 -698 393 824 1784 -40 -803 878 1487 447 -489 -704 1101 1107 -945 -852 -507 975 8 -1542
1599a542J000Q86M20r61o98M4K298j161q73J46Q8J284j025q75M97R36j9j223q57
$$ -1542 -542 344 764 -197 -895 -851 1447 286 -587 -441 -353 931 -94 -969 -472 464 445 -778 -1635
1618a635J299R17r91l21q49J809Q65j650o43P52J161j65j179o09J810M01q59j127
$$ -1635 -336 581 -410 -731 -1580 229 1094 -556 -1199 -447 714 549 -630 -1239 571 972 113 -1014
1636a014O67J647j179o65o9P11J054n60j553O14J495n12m41j264J359P78n52q47
$$ -1014 -347 1300 121 -544 -613 98 1152 592 -961 -347 1148 636 195 -1069 290 1068 516 -331
1654c31M6J403k91q47o28O87R24k36r61q50K063j98p35q86M12P59L41j092m72
$$ -331 -285 1118 827 -20 -648 39 963 727 -234 -1084 979 781 46 -840 -428 331 672 -420 -892
1673h92J063L88m02j163O03R48K49j341p14J056Q98n00j418O32P71L82o59j144
$$ -892 171 559 157 -1006 -403 545 794 -547 -1261 -205 693 193 -1225 -593 178 560 -99 -1243
1691a243N73R22oj318J86Q36L16n74q11N30Q12M66j715J81R58N17o83q32M80O59
$$ -1243 -670 252 246 -1072 -886 -50 266 -308 -1119 -589 223 689 -1026 -845 113 630 -53 -885 -405 254
1711B54P08r93k65M58L34qq12L4L20O49q54n36P45L14J29r99P8L67J089p92q50
$$ 254 962 -31 -296 162 496 488 -324 -290 30 679 -175 -711 34 348 477 -522 -444 -77 1012 220 -630
1732f30O01Q62k03p40N5K57R95n21j054M30M93J80j088k79K10R12o21o34PR36
$$ -630 -29 833 630 -110 -55 202 1197 676 -378 52 545 725 -363 -642 -432 480 -141 -775 -768 168
1752A68M8n44j39N3J074k36j020M04N03M87p91k98j9P43l55o21j46M76N01r01
$$ 168 216 -328 -467 -414 660 424 -596 -192 311 798 7 -291 -310 433 78 -543 -689 -213 288 -613
1772f13k19j06R95j99l17n24Q85P36r31m0J45R26k79l13l10L20J102q65p36p6
$$ -613 -832 -938 57 -142 -459 -983 -98 638 -293 -333 -188 738 459 146 -164 156 1258 393 -343 -419
1792d19R85l01k82n40M2J075n88m78j17R18N0j87k65K29R44k97n51n68J331j6
$$ -419 566 265 -17 -557 -515 560 -28 -506 -623 295 345 158 -107 122 1066 769 218 -350 981 965
1812I65m90l46j41P67j62q01o46J114j66m53Ol59Q44K8o51m93R76M79k86n84J10
$$ 965 475 129 -12 755 593 -208 -854 260 94 -359 -353 -712 132 160 -491 -984 -8 471 185 -399 -289
1833b89R59n1o05o40Q06L32m53m24k23N67R1m86o33P98J45j68l01m37J049K6R5
$$ -289 670 619 14 -626 180 512 59 -365 -588 -21 70 -416 -1049 -251 -106 -274 -575 -1012 37 63 158
1854A58o51NO71M49p79k6N48J03K70j038n7J046j11p26k86L70M11J26j330M32
$$ 158 -493 -488 183 632 -147 -173 375 478 748 -290 -347 699 588 -138 -424 -54 357 483 -847 -415
1874d15O53M42n55p99R37M17k29m17j32N46O57j033l11P66j32M98j243q0R37J6
$$ -415 238 680 125 -674 263 680 451 34 -98 448 1105 72 -239 527 395 893 -350 -430 507 523
1894E23k63p12q8P06N10j278K91l37R23J46j398P27J30K97Ro85J56J018m45m82
$$ 523 260 -452 -540 166 676 -602 -311 -648 275 421 -977 -250 -120 177 186 -499 -343 675 230 -252
1914b52l02L16J130r63m74M74K7M81j011m16J056N60p89j15k08P18O38j786M81
$$ -252 -554 -238 892 -71 -545 -71 -44 437 -574 -990 66 626 -163 -278 -486 232 870 -916 -435
1933d35L92N95j07j179K58J190l87l7m08k53J226r18k64J91l56J227k38j087L54
$$ -435 -43 552 445 -734 -476 714 327 290 -118 -371 855 -63 -327 -136 -492 735 497 -590 -236
1952b36N20L7J67j002N46O60n65L66j011Q34Q74j148n22M88K41L10m51j022J221
$$ -236 284 321 488 -514 32 692 127 493 -518 316 1190 42 -480 8 249 559 108 -914 307
1971C07K07m72l82k98J264j57j078r1K54R51j05j533R34Q68o15M3r04P49Q78p66
$$ 307 514 42 -340 -638 626 469 -609 -700 -446 505 400 -1133 -199 669 54 97 -807 -58 820 54
1991E4m96K46K71L34m83n99P14j40L10o75m20J324l38N6l78m55P42P52j046k41
$$ 54 -442 -196 75 409 -74 -673 41 -99 211 -464 -884 440 102 158 -220 -675 67 819 -227 -468
2011d68O30P1N75j176o4P41K04Lr90N9J108j73j012L19j35R54m17j022Q85K86
$$ -468 162 233 808 -368 -432 309 513 516 -474 -415 693 520 -492 -173 -308 646 229 -793 92 378
2031C78k49l13l64M71Q76p35m40L86KO62j001J28J58K61N0r04M5P50K5l76j67
$$ 378 129 -184 -548 -77 799 64 -376 10 12 674 -327 -199 -41 220 270 -634 -589 161 186 -190 -357
2052c57j78M61J87p78R7K82M59k34o73K56O44J29m32m57L30R67j018k37j86M52
$$ -357 -535 -74 113 -665 -568 -286 173 -61 -734 -478 166 295 -137 -594 -264 703 -315 -552 -738 -286
2072b86Q18p65m82M89M76k53n84n5O21J35k05j08n0Q57m72n93J67O00J81l57l19
$$ -286 532 -233 -715 -226 250 -3 -587 -642 -21 114 -91 -199 -249 608 136 -457 -290 310 491 134 -185
2093a85j8J077n85j64l05L02L94p54j96q0O82L43l66l09L5N91l21k16l95J118
$$ -185 -203 874 289 125 -180 122 516 -238 -434 -514 168 511 145 -164 -129 462 141 -75 -470 648
2113F48j30r7p52L77N63l30k17l80O76j84j7p12L13O34l43m82n3M23J58N6o97
$$ 648 518 421 -331 46 609 279 62 -318 358 174 157 -555 -242 392 49 -433 -486 -63 95 151 -546
2134e46l6P54l1m72j44M88N0l8m83l17J207k95l04l12K78J95m4p33R6O50J69j85
$$ -546 -582 172 141 -331 -475 13 63 25 -458 -775 432 137 -167 -479 -201 -6 -50 -783 -687 -37 132 -53
2156e3l64K57N67J44o03k62N64K27k71l00L64n7K72l66l77N29o7k6n80nN53M46
$$ -53 -417 -160 407 551 -52 -314 250 477 206 -94 270 213 485 119 -258 271 204 178 -402 -407 146 592
2178E92n94j91K73K43K79q68L33N73J08l93n31M02J74K46o10j60m0R18q46k82
$$ 592 -2 -193 80 323 602 -266 67 640 748 355 -176 226 400 646 36 -124 -164 754 -92 -374
2198c74L16J00L76j064K67K32O31o62oj59M66L42l43k33l9M94j11o74J76L00M52
$$ -374 -58 42 418 -646 -379 -147 484 -178 -184 -343 123 465 122 -111 -150 344 233 -441 -265 35 487
2219D87n68k42JO46l37n24K54J4L75j92m95K71O43r4n82j44O76L27o19k48L55
$$ 487 -81 -323 -322 324 -13 -537 -283 -269 106 -86 -581 -310 333 239 -343 -487 189 516 -103 -351 4
2240DM60K88p04k38M78M2j84l13k95O58K33o35j06K06N21k99k79j67O32J10n94
$$ 4 464 752 48 -190 288 330 146 -167 -462 196 429 -206 -312 -106 415 116 -163 -330 302 412 -182
2261a82P8P5N56k17k85j17L37K08k75m01pN91k14l63j20L61K73l42l70pN21l0
$$ -182 -104 -29 527 310 25 -92 245 453 178 -223 -230 361 147 -216 -336 25 298 -44 -414 -421 100 70
2283G0j00k92L15M15l32m22j26R65k99l14k16K89K12j54j17l77N26K07m67j48
$$ 70 -30 -322 -7 408 76 -346 -472 493 194 -120 -336 -47 165 11 -106 -483 43 250 -217 -365
2303c65J59K23J04l91l43N47L68l45k02K49O9L57j35n21M88p2J72l35j66M88J33
$$ -365 -206 17 121 -270 -613 -66 302 -43 -245 4 73 430 295 -226 262 190 362 27 -139 349 482
2324D82m17l12j24O72P2n65q2L31M8M21q63L28K19J67o0n11L39N6K40m69j24j1
$$ 482 65 -247 -371 301 373 -192 -274 57 105 526 -337 -9 210 377 317 -194 145 201 441 -28 -152 -163
2346a63P44m26m19J51K83L20o88k67L44K29k86k52J78P01O7r57M8Q1K92N6o14
$$ -163 581 155 -264 -113 170 490 -198 -465 -121 108 -178 -430 -252 449 516 -441 -393 -312 -20 36 -578
2367e78M59K27J24m57m7K53N52n73l61L00J72K15l71l55K09K31Lj39m32P52K09
$$ -578 -119 108 232 -225 -272 -19 533 -40 -401 -101 71 286 -85 -440 -231 0 3 -136 -568 184 393
2388C93o17K44l28K66K87l43j56j9O27p1l48l11N35P6j17n10J51O13k33n22K17
$$ 393 -224 20 -308 -42 245 -98 -254 -273 354 283 -65 -376 159 235 118 -392 -241 372 139 -383 -166
2409a66M1M87l9o21K01K97R2k70m19M33L09l36l2l28M57J88m75k02K21K60q0j97
$$ -166 -125 362 323 -298 -97 200 292 22 -397 36 345 9 -23 -351 106 294 -181 -383 -162 98 18 -179
2431a79j66M48j25n3k10K28j6K3j50n7Q9J61J91n70K52o5K19r5m49M40K12k0l81
$$ -179 -345 103 -22 -75 -285 -57 -73 -50 -200 -257 -168 -7 184 -386 -134 -199 20 -75 -524 -84 128 108 -273
2454b73k88M88M62m42m79M11J80K80n64j02N09J80o1n21K60L42j61l38J07J63
$$ -273 -561 -73 389 -53 -532 -121 59 339 -225 -327 182 362 301 -220 40 382 221 -117 -10 153
2474A53Q3l27k49L67K4Q7k15j25M54j96m5n0K35k24M20l88J61J56l99L17l07j19
$$ 153 236 -91 -340 27 51 138 -77 -202 252 56 11 -39 196 -28 392 4 165 321 -78 239 -68 -187
2496a87J33J44k42p3j74K37L86o23M3l4N47k7n50K32L13k56o8R5j75O76l25j54
$$ -187 -54 90 -152 -225 -399 -162 224 -399 -356 -390 157 130 -420 -188 125 -131 -199 -104 -279 397 72 -82
2518h2p9K21J80n93P9L73L2j36k57j42N00J21o07M50k16L11k08l1J96P0J13k07
$$ -82 -161 60 240 -353 -274 99 131 -5 -262 -404 96 217 -390 60 -156 155 -53 -84 112 182 295 88
2540H8m2P3K91k57Q0l22l6M32o4k85K46k57L24k65l99L44J82J24j09l20M06K71
$$ 88 46 119 410 153 233 -89 -125 307 243 -42 204 -53 271 6 -393 -49 133 257 148 -172 234 505
2562E05m80m5M6K01K55m85n7N12k20j23l85K07M66l41k42r7K00K53j87m06K18
$$ 505 25 -20 26 227 482 -3 -60 452 232 109 -276 -69 397 56 -186 -283 -83 170 -17 -423 -205
2583b05J91L3j7j45M1K77l66M00m14K57j17K7J21k32M2K50l23j91O78m58L07n80
$$ -205 -14 19 2 -143 -102 175 -191 209 -205 52 -65 -38 83 -149 -107 143 -180 -371 307 -151 156 -424
2605d24K48J33J28l14q3M58L2J6k12J99J19k89R4on7J80P9l48K91qJ18m09j45
$$ -424 -176 -43 85 -229 -312 146 178 194 -18 181 300 11 105 99 42 222 301 -47 244 236 354 -55 -200
2628b00O99j79p9l08O0J50j84m1k22K62p7L65l28J49l4J44L0m16N68k54qk24j45
$$ -200 499 320 241 -67 -7 143 -41 -82 -304 -42 -119 246 -82 67 33 177 207 -209 359 105 97 -127 -272
2651b72J39J78l33j27K73J91N1m51lL69K77k72j24J41M3Jl20J3K39RK20n43J95
$$ -272 -133 45 -288 -415 -142 49 100 -351 -354 15 292 20 -104 37 80 81 -239 -226 13 22 242 -301 -106
2674a06J74J52m67j07K06J78L07m74j59R4N01l88Lj20P5K53k72P4N4M21l31k74
$$ -106 68 220 -247 -354 -148 30 337 -137 -296 -202 299 -89 -86 -206 -131 122 -150 -76 -22 399 68 -206
2696b06K84J81K14p29K24l2K01O5l42J66K16K1k37Q7l49M22L38l15l41J4L06l29
$$ -206 78 259 473 -256 -32 -64 137 202 -140 26 242 263 26 113 -236 186 524 209 -132 -118 188 -141
2718a41l6J05N79k46q3n25L06M15r5m38k9M45j10l11j85M39J59m22p7J1L42Q4
$$ -141 -177 -72 507 261 178 -347 -41 374 279 -159 -188 257 147 -164 -349 90 249 -173 -250 -239 103 187
2740A87k36j75j66O42k65q1p0k6K44j12k28J73K06J0J5l85J75L3K20p8j08J19
$$ 187 -49 -224 -390 252 -13 -94 -164 -190 54 -58 -286 -113 93 103 118 -267 -92 -59 161 83 -25 94
2762I4j11L4l31L36K48M5o73K18R6K82r5l16L85n3M3J02m83K82J3j28J82l4j76
$$ 94 -17 17 -314 22 270 315 -358 -140 -44 238 143 -173 212 159 202 304 -179 103 116 -12 170 136 -40
2785d0J33R9l16J25O5l2n6p2K43PL4l07J1K36P1k73j52J54L29j09l57L5K89j7
$$ -40 93 192 -124 1 66 34 -22 -94 149 156 190 -117 -106 130 201 -72 -224 -70 259 150 -207 -172 117 100
2809A00l61J80j20L48O9k25j08n8K60j91j17o8L37J55j72k9j10K58l28q1R0m1
$$ 100 -261 -81 -201 147 216 -9 -117 -175 85 -106 -223 -291 46 201 29 0 -110 148 -180 -261 -171 -212
2831b12K02k63J88M8K24k85J15j62L49j07l59L31l27O15l65l93R6N88J15k74j7
$$ -212 -10 -273 -85 -37 187 -98 17 -145 204 97 -262 69 -258 357 -8 -401 -305 283 398 124 107
2852A07j57M22j93k95J27j30M71l40N0J8o3J8P0l26K71M8l71K80j48K61Q3l57
$$ 107 -50 372 179 -116 11 -119 352 12 62 80 17 35 105 -221 50 98 -273 7 -141 120 203 -154
2874a54K00N1l9j74K92l38K12K6k06Q8o6J56P9m1q7k97J37L96m60J21K29k85P9
$$ -154 46 97 58 -116 176 -162 50 76 -130 -42 -108 48 127 86 -1 -298 -161 235 -225 -104 125 -160 -81
2897h1k91M09L29n08R3j47L70Kj35n03O78k37n0k8k44M74J00k01r3J49j28M16
$$ -81 -372 37 366 -142 -49 -196 174 176 41 -462 216 -21 -71 -99 -343 131 231 30 -63 86 -42 374
2919C74o49L41n0J08N3r6J22M3l19J71j19k11L64n8k13j13K85j42N38n97K55J03
$$ 374 -275 66 16 124 177 81 203 246 -73 98 -21 -232 132 74 -139 -252 33 -109 429 -168 87 190
2941A90J34n49oM78j8l34L41j53j76L94n16J21k4O2J25k15QL64k83J41j35J18
$$ 190 324 -225 -231 247 229 -105 236 83 -93 301 -215 -94 -118 -56 69 -146 -138 226 -57 84 -51 67
2963F7p7J75l88L64j62p0J43j41J93l54j41L71R1k75M03l56m9K9Q2R4k10k5p9
$$ 67 -10 165 -223 141 -21 -91 52 -89 104 -250 -391 -20 71 -204 199 -157 -206 -177 -95 -1 -211 -236 -315
2986c15K18L26k24k03N94k0n62P8P3N2n3pN2R7k8n8k78K62J11k86J82l9L77j86
$$ -315 -97 229 5 -198 396 376 -186 -108 -35 17 -36 -43 9 106 78 20 -258 4 115 -171 11 -28 349 163
3010A63l22Q8J26K36j07j05m8P3Q7r3K5J4J72r0l37J64q2N2J12o9j66J23k93K09
$$ 163 -159 -71 55 291 184 79 31 104 191 98 123 137 309 219 -118 46 -36 16 128 59 -107 16 -277 -68
3034f8pj23R4l0J5M0J80l2l57K60nK58k83oj24J17O8N7j44m5L4K10k85J30J50
$$ -68 -75 -198 -104 -134 -119 -79 101 69 -288 -28 -33 225 -58 -64 -188 -71 -3 54 -90 -135 -101 109 -176 -46 104
3059A04l95M24k39J89P5k29K56m37K88m8M6m2m8R2J56J70m58J96J45oj58j82J39
$$ 104 -291 133 -106 83 158 -71 185 -252 36 -12 34 -8 -56 36 192 362 -96 100 245 239 81 -101 38
3082C8O2p8R8k30K49pl24K00QK09R1k42j03K18qk62J56j7j45J60k57L60l62K73
$$ 38 100 22 120 -110 139 132 -192 8 16 225 316 74 -29 189 181 -81 75 58 -87 73 -184 176 -186 87
3106H7J2j48J10j82m8j65R2J41K08j00l13MK32J49L0n9M7m63L60k24K12K4J38
$$ 87 99 -49 61 -121 -169 -334 -242 -101 107 7 -306 -302 -70 79 109 50 97 -366 -6 -230 -18 6 144
3129A44k40j64J03J89m0l16K26J32J35k52M2l59L73J34l3m38K57K48l37J35J5
$$ 144 -96 -260 -157 32 -8 -324 -98 34 169 -83 -41 -400 -27 107 74 -364 -107 141 -196 -61 -46
3150d6L60l11R5j56j41Q50n83K8o3J45j82j6k11M37J39m95M6K98k27O4o4J28l1
$$ -46 314 3 98 -58 -199 651 68 96 33 178 -4 -20 -231 206 345 -150 -104 194 -33 31 -33 95 64
3173F4m4l9J17k4J8n3j01O7j21N90n79O9N7L2K52m11n2j44K81m3J29l23K22K23
$$ 64 20 -19 98 74 92 39 -62 5 -116 474 -105 -36 21 53 305 -106 -158 -302 -21 -64 65 -258 -36 187
3197A87j68j72J45p8J13J76l81K96nj11m6j09J43J49j68k02jK82j40O2Qn5L1j14
$$ 187 19 -153 -8 -86 27 203 -178 118 113 2 -44 -153 -10 139 -29 -231 -232 50 -90 -28 -20 -75 -44 -158
3221a58J08J62J85k67K00l49J57R9p4J5nJ20k06K98o0k37J27J7k51J72o0j36K42
$$ -158 -50 112 297 30 230 -119 38 137 63 78 73 193 -13 285 225 -12 115 132 -119 53 -7 -143 99
3244I9J14k99n5L13j33l18N67j04k67nK88j39OJ03q5pl65K77q6J59L9r1J34k4
$$ 99 213 -86 -141 172 39 -279 288 184 -83 -88 200 61 67 170 85 78 -287 -10 -96 63 102 11 145 121
3268A21l71N23l81J6j6Q5L5jj38K61L2k38n0j5K10j21J53k92K05J11m4k64K27
$$ 121 -250 273 -108 -92 -108 -23 12 11 -127 134 166 -72 -122 -137 73 -48 105 -187 18 129 85 -179 48
3291D8L79m39j23k0Q7K06K5r0m9l8m5L03k12j7j48K91k16N2j98L12o9p7J61j8
$$ 48 427 -12 -135 -155 -68 138 163 73 24 -14 -59 244 32 15 -133 158 -58 -6 -204 108 39 -38 123 105
3315A05K62m85J61L6l00L01j57K64k04K69k30J26r2k07Q2J49M3j05K1K3N5k68
$$ 105 367 -118 43 79 -221 80 -77 187 -17 252 22 148 56 -151 -69 80 123 18 39 62 117 -151
3337a51J20n9O0P8l8K17m26J84K7J35J01l72J3j89L71j31k9j10K52q7k8J02l8
$$ -151 -31 -90 -30 48 10 227 -199 -15 12 147 248 -124 -111 -300 71 -60 -89 -199 53 -34 -62 40 2
3360Bl74K06P3K08kl18J91N2p1K26k44L10q7j79K86k04J80l56L15m4k49J17j66
$$ 2 -372 -166 -93 115 113 -205 -14 38 -33 193 -51 259 172 -7 279 75 255 -101 214 170 -79 38 -128
3383a28L42k87L90l72N2n7j11O8J66J09K6j26j64M1O1L14k96P3Q8m73M25k32J63
$$ -128 214 -73 317 -55 -3 -60 -171 -103 63 172 198 72 -92 -51 10 324 28 101 189 -284 141 -91 72
3406G2o0Q4k17L27k20o9J01j07k0K0J40O8j05j50J84k91K18l5Q4kj98K65k00j4
$$ 72 12 96 -121 206 -14 -83 18 -89 -109 -89 51 119 14 -136 48 -243 -25 -60 24 22 -176 89 -111 -125
3430a25K40l83J16K20j41M0O9j22R9j11mj31M5L00q5p7m0N9JK74m37k3L67q8%
$$ -125 115 -268 -152 68 -73 -33 36 -86 13 -98 -102 -233 -188 112 27 -50 -90 -31 -30 244 -193 -216 151 63 63
3455F3P4l6J4l7l0K34j94l2k15OJ98K92m06J44j27K1K55n79M90j52J28J18j79
$$ 63 137 101 115 78 48 282 88 56 -159 -153 45 337 -69 75 -52 -31 224 -355 135 -17 111 229 50
3478E0l49N18k08K81l89J9M48l55J27k74K24j83n0m8J87k80L27q8k1L21l84Q1
$$ 50 -299 219 11 292 -97 -78 370 15 142 -132 92 -91 -141 -189 -2 -282 45 -43 -64 257 -127 -46
3500d6j26J08M3j0q8J28Q3k82j04N7J12K28p5P6l2K23j98M4j68J30j11J18J9j11
$$ -46 -172 -64 -21 -31 -119 9 92 -190 -294 -237 -125 103 28 104 72 295 97 141 -27 103 -8 110 129 18
3524A8p5Q6K30j94k00J78j91L21j31j03n7l0J78j44J58J31k38J57l6L2m6Pj29
$$ 18 -57 29 259 65 -135 43 -148 173 42 -61 -118 -148 30 -114 44 175 -63 94 58 90 44 51 -78
3547g8J45J86l07m3R9l1M2p0k57K43j94K15J71l1J22j10o8R9J10n12L80j11p7
$$ -78 67 253 -54 -97 2 -29 13 -57 -314 -71 -265 -50 121 90 212 102 34 133 243 -269 111 0 -77
3570g7k7R3m7n5j43K16K85l57J31Q4j7r4m3K7p0J82O5j55j91J47J80k6Pj47q9
$$ -77 -104 -11 -58 -113 -256 -40 245 -112 19 103 86 -8 -51 -24 -94 88 153 -2 -193 -46 134 108 115 -32 -121
3595a21M8M9L44m65K64j13l5j21M38m70P1L06j90J12j89%J20L04l77k4K34k25
$$ -121 -73 -24 320 -145 119 6 -29 -150 288 -182 -111 195 5 117 -72 -72 48 352 -25 -49 185 -40
3617d0L35k89Q7Q1q7j88k3%J66J7J46p9k03K31p8j47P3o6K67l28l6J72m0K3R5
$$ -40 295 6 93 174 87 -101 -124 -124 42 59 205 126 -77 154 76 -71 2 -64 203 -125 -161 11 -29 -6 89
3642H9n1p3Q1k03P6j05L20j64K21j14o8Kk04J90o4n6QO0R8j45J56l7J44l28R7
$$ 89 38 -35 46 -157 -81 -186 134 -30 191 77 9 11 -193 -3 -67 -123 -115 -55 43 -102 54 17 161 -167 -70
3667g0r0M64j75j77l6Q9J03k07M0J19J80l97L87k18M0n8J0K04j25j87O2j88L87
$$ -70 -160 304 129 -48 -84 5 108 -99 -59 60 240 -157 230 12 52 -6 4 208 83 -104 -42 -230 157
3690A57j71J16k57n4J74J44R7m17M2K89mR9k3P9j64k22j32J46j8K20j4j00K46
$$ 157 -14 102 -155 -209 -35 109 206 -211 -169 120 116 215 192 271 107 -115 -247 -101 -119 101 87 -13 233
3713B33j28J5k99J36J89k05j7M9M8J04j72l7J18n6rJ41j27r7K54j81j6J55m4q1
$$ 233 105 120 -179 -43 146 -59 -76 -27 21 125 -47 -84 34 -22 -31 110 -17 -114 140 -41 -57 98 54 -27
3737b7O1j53L3j24L11m45L55J54k49M17k67j3n3K76m92k9N5J86q7J25N6p1o6J03
$$ -27 34 -119 -86 -210 101 -344 11 165 -84 333 66 53 0 276 -216 -245 -190 -4 -91 34 90 19 -47 56
3761E6r9%L87k85o9J40o7r2o6K13k63R9R1o0k41L81j55M0K32l51J64p4JJ6K04
$$ 56 -43 -43 344 59 -10 130 63 -29 -95 118 -145 -46 45 -15 -256 125 -30 10 242 -109 55 -19 -18 -2 202
3786B02q4j32n6k08P3K65Ql63L35m9P1K2O9m6q9j8m3o6r1J09N8j67L88j80L9j52
$$ 202 118 -14 -70 -278 -205 60 68 -295 40 -9 62 84 153 107 18 0 -43 -109 -200 -91 -33 -200 188 8 47 -105
3812a05J90j4J4q9J84nk70K79j67O1r9k2J68L4k06k2R6r3J99K3j07K18k51J70
$$ -105 85 71 85 -4 180 175 -95 184 17 78 -21 -43 125 159 -47 -69 27 -66 133 156 49 267 16 186
3836A86J20k62j7j75n6L46l20J6K24l18J82J39p8L4j17k3K00k33P0N9L2J81n4
$$ 186 306 44 27 -148 -204 142 -178 -162 62 -256 -74 65 -13 21 -96 -119 81 -152 -82 -23 9 190 136
3859A36n6J45m24N5L06l48J71k41K85J5J37m15K62O1k65K84l23K05K2j40j59L63
$$ 136 80 225 -199 -144 162 -186 -15 -256 29 44 181 -234 28 89 -176 108 -215 -10 12 -128 -287 76
3881G6L4O3k39J03Jq2O6p1j51K60r4j05p4p7K52kj52L91l43L52j14l14M79k63
$$ 76 110 173 -66 37 38 -44 22 -49 -200 60 -34 -139 -213 -290 -38 -40 -192 199 -144 208 94 -220 259 -4
3905dK39j29M9k34K5j10Q3k59M65j7k2l6J32k55j89K78J3rK5L6l0k14N2R5r4J01
$$ -4 235 106 155 -79 -54 -164 -81 -340 125 108 86 50 182 -73 -262 16 29 20 45 81 51 -163 -111 -16 -110 -9
3931iq3J94r3Jn7r3J68O1j80K6Q1r1R0J5k54P8Q0l5J14K5m9K18k77j66J03j1L75
$$ -9 -92 102 9 10 -47 -140 28 89 -91 -65 16 -75 15 30 -224 -146 -66 -101 13 38 -11 207 -70 -236 -133 -144 231
3958B31k33K79l59K11l63M7J53Q5j7k62L43Mm4j84R1j62K9K14k07l0J61J08k43
$$ 231 -2 277 -82 129 -234 -187 -34 51 34 -228 115 119 75 -109 -18 -180 -151 63 -144 -174 -13 95 -148
3981a48l5L49k62L6J49k39K36k18K09P2n7k71O4J75k36J71L1m6P0J59j96J38j33
$$ -148 -183 166 -96 -60 89 -150 86 -132 77 149 92 -179 -115 60 -176 -5 26 -20 50 209 13 151 18
4004A8p4l6P0k43K95l1J95k11r7Q5j9N7k38J72K9J37j42j84N08m32J25k00L13
$$ 18 -56 -92 -22 -265 30 -1 194 -17 -114 -29 -48 9 -229 -57 -28 109 -33 -217 291 -141 -16 -216 97
4027I7p6j1J36k72k16K43P1J62j25J67P0k19jn2N2l72M84l57J40r1J58K82q2m4
$$ 97 21 10 146 -126 -342 -99 -28 134 9 176 246 27 26 -26 26 -346 138 -219 -79 -170 -12 270 188 144
4051A44J44j86l3j5q6Q5M7O5r2p6M2J13j32m9R7O5Q8m2k50O0jj5j37K45M2l2o3
$$ 144 288 102 69 54 -32 53 100 165 73 -3 39 152 20 -29 68 133 221 179 -71 -11 -12 -27 -164 81 123 91 28
4078B8m8k70K83Q1N6j53j14N27k57l06L1O0j3J19j66L8J30l7j4l3J04j7j77O0
$$ 28 -20 -290 -7 74 130 -23 -137 390 133 -173 -142 -82 -95 24 -142 -104 26 -11 -25 -58 46 29 -148 -88
4102h8p6L30j71K1L0P8M7k57J36l14J39K06k3l7JJ83k09K30j93M2j86L79l20J5
$$ -88 -164 166 -5 16 46 124 171 -86 50 -264 -125 81 58 21 22 205 -4 226 33 75 -111 268 -52 -37
4126c7k07K14J93j55K8r1O6O6J73o3l04M8k59K01J78M4j00R1o0M3K47k48k16O4
$$ -37 -244 -30 163 8 36 -55 11 77 250 187 -117 -69 -328 -127 51 95 -5 86 26 69 316 68 -148 -84
4150h4J13Jj27J37q9kM8k15J49L2j06K85j94P7O6l25K76j02J20j36N8J06j47R5
$$ -84 29 30 -97 40 -49 -51 -3 -218 -69 -37 -143 142 -52 25 91 -234 42 -60 60 -76 -18 88 -59 36
4174C6r0j30J21n6J38j1j12n0L84k58q8pK00k24L49k74N6J97l15J59l55O18k68
$$ 36 -54 -184 -63 -119 19 8 -104 -154 230 -28 -116 -123 77 -147 202 -72 -16 181 -134 25 -330 288 20
4197B0k18K43%J47j83J5J84j55m1J11Q8k51J96q2j14N4l1M4L4q5J68R5k70p8J29
$$ 20 -198 45 45 192 9 24 208 53 12 123 211 -40 156 74 -40 14 -17 27 61 -24 144 239 -31 -109 20
4222B0j51J98j85J49N7j33J42n8k83M8L25J07l39O4J74j07k44N6L32j28l1J21
$$ 20 -131 67 -118 31 88 -45 97 39 -244 -196 129 236 -103 -39 135 28 -216 -160 172 44 13 134
4244A34k71K10J3J12j96q0J15j66J93k21J55j37J72j0j99J20P2q8J41Qk19K59
$$ 134 -137 73 86 198 2 -78 37 -129 64 -157 -2 -139 33 23 -176 -56 16 -72 69 77 -142 117
4266A17j75r5K0K64j13p2K0r0K29j20K26j90N0R3j62j51L33P4l02R3n4n3J88j70
$$ 117 -58 -153 -133 131 18 -54 -34 -124 105 -15 211 21 71 164 2 -149 184 258 -44 49 -5 -58 130 -40
4290d0K52j41J29m35K93k37J76j84K30o1Q6j13L41l18J36k47J09m8q3k0J25K47
$$ -40 212 71 200 -235 58 -179 -3 -187 43 -18 68 -45 296 -22 114 -133 -24 -72 -155 -175 -50 197
4312A97j72j4q8K1j91N2J64J86k99K12l01J57K01l09L2J65p0j79L88l79J52J89
$$ 197 25 11 -77 -56 -247 -195 -31 155 -144 68 -233 -76 125 -184 -152 13 -57 -236 152 -227 -75 114
4334A14k94J74L2J31j1k85kL5Q5J50k76R2J96Qk63R8m0q1K73p6j22J54J8j47J59
$$ 114 -180 -6 26 157 146 -139 -141 -106 -21 129 -147 -55 141 149 -114 -16 -56 -137 136 60 -62 92 110 -37 122
4359A22j44k8K4L41k40m4l1O4O2j55p4K19j7o7M3l82K76M5j8J30k46K55o8j47
$$ 122 -22 -50 -26 315 75 31 0 64 126 -29 -103 116 99 32 75 -307 -31 14 -4 126 -120 135 67 -80
4383h0J97m3j96N5j8j53L25j44j8J00j79K81j27Pk31LL60j43l82M44j22r9J31
$$ -80 117 74 -122 -67 -85 -238 87 -57 -75 25 -154 127 0 7 -224 -221 139 -4 -386 58 -64 -163 -32
4406c2nq9J73j18l0L18m98L59k39R0J02j5J81l64qK17j77P5Q4j53PM52m90L14
$$ -32 -37 -126 47 -71 -101 217 -281 78 -161 -71 31 16 197 -167 -175 42 -135 -60 24 -129 -122 330 -160 154
4430A54J1l24J25J52n5j95P3K43j10j03J07N9k58n6K46m9L43j93jj67P0q7K10
$$ 154 165 -159 -34 118 63 -132 -59 184 74 -29 78 137 -121 -177 69 20 363 170 169 2 72 -15 195
4453A95l01L46j19l49K10J9n9L1K03l33L07k33N2rO6j41P1j6KJ61j96P3M5M6J78
$$ 195 -106 240 121 -228 -18 1 -58 -27 176 -157 150 -83 -31 -40 26 -115 -44 -60 -58 103 -93 -20 25 71 249
4478B49q0j22N4M9o8k10J66q1J48j63J08k10J0K69K5j15N8j96J84J28k42J27j17
$$ 249 169 47 101 150 82 -128 38 -43 105 -58 50 -160 -150 119 144 29 87 -109 75 203 -39 88 -29
4501b9N8R6j07L06m39Q6R3L8N5o7r5R9M8j27J88k52o6J09OP2pj11PJ38K8mK3j42
$$ -29 29 125 18 324 -115 -29 64 102 157 90 -5 94 142 15 203 -49 -115 -6 0 72 65 -46 -39 99 127 123 146 4
4529Dj47K85l07lM13k34P7P8m89K70J73j93K7M8j26K24o4j14L14l87J22O8K47
$$ 4 -143 142 -165 -168 245 11 88 166 -323 -53 120 -73 -46 2 -124 100 36 -78 236 -151 -29 39 286
4552B86q1j88J31l09J9R6J04j80K3K11k49L01q1j48j17L7P5K46k52Q3j14N5j7
$$ 286 205 17 148 -161 -142 -46 58 -122 -99 112 -137 164 83 -65 -182 -145 -70 176 -76 7 -107 -52 -69
4575f9q2L51j88k01K27K63m16J02K78j28p8K5j44K62j62qL5%r8J18p5j78K15J41
$$ -69 -151 200 12 -189 38 301 -115 -13 265 137 59 84 -60 202 40 32 67 67 -31 87 12 -166 49 190
4599A90j09k34N86m74j04j06J63p4K93j37k06J19r9J67j01J41p8r2K87k29rJ68
$$ 190 81 -153 433 -41 -145 -251 -88 -162 131 -6 -212 -93 -192 -25 -126 15 -63 -155 132 -97 -106 62
4621F2j60L26j54l64K90J64l4k72J26J55j12n6j60K42r2k03L21m2j8j26M0P5k65
$$ 62 -98 228 74 -290 0 164 130 -142 -16 139 27 -29 -189 53 -39 -242 79 37 19 -107 -67 8 -257
4644b57L87K2r6r2j3Mj03L85l12J51j39j72N8J05K87k38L01j97R0k00J13J02j35
$$ -257 130 152 56 -36 -49 -45 -148 237 -75 76 -63 -235 -177 -72 215 -23 278 81 171 -29 84 186 51
4667E1K2k9Q3k04K64k8l47K79j20j5L17l16k38M47l99K51j86K52j22n1R1P0j6
$$ 51 73 44 127 -77 187 159 -188 91 -29 -44 273 -43 -281 166 -233 18 -168 84 -38 -89 2 72 56
4690E6j23J96j90J02j03L15l09R0p3k5J30n6n2K19j98j42J33O3n7J58m87K22K63
$$ 56 -67 129 -61 41 -62 253 -56 34 -39 -64 66 10 -42 177 -21 -163 -30 33 -24 134 -353 -131 132
4713A32j74K24j31J24n8J2k99K18j07J49j03k18K95j45J56J05k58J2J20J26j77
$$ 132 -42 182 51 175 117 129 -170 48 -59 90 -13 -231 64 -81 75 180 -78 -66 54 180 3
4734CM3O6lo7k5J30j53M8q0J53n3J6k1pk1J7M4N4k41N0M03l82n5o8j04M23m07
$$ 3 46 112 109 42 17 147 -6 42 -38 115 62 78 57 50 29 46 90 144 -97 -47 356 -26 -81 -149 -253 170 -237
4761b37J28o7J93p1J23q9Q1J31l28K70k47R1P5k47K5KJ94K3j50J21o7q7J00M0
$$ -237 -109 -176 17 -54 69 -20 61 192 -136 134 -113 -22 53 -194 -169 -167 27 50 -100 21 -46 -133 -33 7
4785GOP7j0k1m1J43n4j64JJ01q4j63L85j21j97J83L3k01J91P7j27L0l49L44J22
$$ 7 13 90 80 59 18 161 107 -57 -56 45 -39 -202 183 62 -135 48 81 -120 71 148 21 51 -298 46 168
4810A68k84M8K2N7Q4j71n5L12J88j99N0k44M2j93P5m1L5J09l4J05k07K8p2K02
$$ 168 -116 -68 -46 11 95 -76 -131 181 369 170 220 -24 18 -175 -100 -141 -106 3 -31 74 -133 -105 -177 25
4834B5o3J29j28O0j0Q6j76Q9L5k4j29k82K41K10n9k9K09k94q8K07K24l29Q8K5
$$ 25 -38 91 -37 23 13 99 -77 12 47 23 -106 -388 -147 63 4 -25 184 -110 -198 9 233 -96 -8 17
4858A7n6Q4n5l5M9J5j8j34J67j23J93p9p8n6K68P2j01j32j06o5O1R8J26l57M12
$$ 17 -39 45 -10 -45 4 19 1 -133 34 -89 104 25 -53 -109 159 231 130 -2 -108 -173 -112 -14 112 -245 167
4883A67j77j06K73l00O41m52k46J18K09rk02L1R4j91Q9n2K28k13P2j24K13o1J11
$$ 167 -10 -116 157 -143 498 46 -200 -82 127 118 -84 -53 41 -150 -61 -113 115 -98 -26 -150 63 2 113
4906A13q0K11j22q7L47l62M8Q8k13J08j64J15R9nK4p5l83K99J51j48J8M9o1O3
$$ 113 33 244 122 35 382 20 68 156 -57 51 -113 2 101 96 120 45 -338 -39 112 -36 -18 31 -30 33
4930C3m0J8R7k88K15kj45P2N6q0N2J1KK0O5m2k08K46O8j78j47J58M2r5J57l0K53
$$ 33 -7 11 108 -180 35 33 -112 -40 16 -64 -12 -1 1 21 86 44 -164 82 150 -28 -175 -17 25 -70 87 57 310
4957C10j69l5j10o2P9K95m31J58j63Q1O1J62j34j06J35Qk6l12L98k21J31l7p1
$$ 310 141 106 -4 -66 13 308 -123 35 -128 -47 14 176 42 -64 71 79 53 -259 139 -82 49 12 -59
4980e9O3k21J18L46j81j3q3p5J05j06M0J91l76J42L12n20K45L61l89J16j23J53
$$ -59 4 -217 -99 247 66 53 -30 -105 0 -106 -66 125 -251 -109 203 -317 -72 289 -100 16 -107 46
5002D6J0K16l57J02m5K2j96L52m17J55K09j08J14o1k60L46k30K94l27J22P6J29
$$ 46 56 272 -85 17 -28 -6 -202 150 -267 -112 97 -11 103 42 -218 128 -102 192 -135 -13 63 192
5024A92l8q4J1j06R5J29j48J26j35r5K44l22J6n2L16l51K98j10j03K21k67Q4q2
$$ 192 154 70 81 -25 70 199 51 177 42 -53 191 -131 -115 -167 149 -202 96 -14 -117 104 -163 -79 -161
5047a61K19o0k18P1J02m6J13O6l0O9k32R8o3j80K43L04k45m2j14J35j11Q6J29
$$ -161 58 -2 -220 -149 -47 -93 20 86 56 125 -107 -9 -72 -252 -9 295 50 8 -106 29 -82 4 133
5070A33j44j13k2K14P7j25J6n3k10L9k6P8K56N6j30J62l09L0j83L51k47J75J27
$$ 133 -11 -124 -146 68 145 20 36 -17 -227 -188 -214 -136 120 176 46 208 -101 -71 -254 97 -150 25 152
5093A52r1j40J23Q5j09k53P2L89l32J93k18J65o7n5J21J0j49lj94K41K39N4j31
$$ 152 61 -79 44 129 20 -233 -161 228 -104 89 -129 36 -31 -86 35 45 -104 -107 -301 -60 179 233 102
5116A02J24k84o1K17Jj72J03q6o1O8oQ9q7K6J51j67j06O3pJ64k09k0R8J56R9k8
$$ 102 226 -58 -119 98 99 -73 30 -56 -117 -49 -55 34 -53 -27 124 -43 -149 -86 -93 71 -138 -158 -60 96 195 167
5142A67l08J40j81K13K7J31j08k14Q0Q0qJ45j91m9Q0j12L36n04L38j07J84m0k20
$$ 167 -141 -1 -182 31 58 189 81 -133 -53 27 19 164 -27 -76 4 -108 228 -276 62 -45 139 99 -121
5165a21l7K88l0o7m8J43m2k21K52k1L8p4Jj03o5J11j46K77K53k65j28k8j17J1
$$ -121 -158 130 100 33 -15 128 86 -135 117 96 134 60 61 -42 -107 4 -142 135 388 123 -5 -33 -150 -139
5189a39K83j75m5k8N08o18L02k48L0K27k4j24J21J06m2k30Q0k1L33l09O0j36K85
$$ -139 144 -31 -76 -104 404 -214 88 -160 -130 97 73 -51 70 176 134 -96 -16 -37 296 -13 47 -89 196
5212A96q7j7o8o0J66o9K92l14j4J49j81nj3j65J29K54m50J37L47m50L31OOk58
$$ 196 109 92 24 -36 130 61 353 39 25 174 -7 -12 -25 -190 -61 193 -257 -120 227 -223 108 114 120 -138
5236a38M01j79J90j97k36L24k67K35l76L58j69j66L33o4Q7Qk38K48N1j31j99K61
$$ -138 263 84 274 77 -159 165 -102 133 -243 115 -54 -220 113 49 136 144 -94 154 205 74 -125 136
5258A36j32J19k35R1J06j05n7J48j19M6q5R1O8qJ52k03L0K93l44J1J30k64j8M
$$ 136 4 123 -112 -21 85 -20 -77 71 -48 -2 -87 4 72 64 216 13 43 336 -8 3 133 -131 -149 -145
5282a45J65j16J5O8n9k2J34j62L40r4j35K08o3O0R3j65j67J04J54o2p0r4j33L8
$$ -145 20 -96 -81 -13 -72 -94 40 -122 218 124 -11 197 134 194 287 122 -45 59 213 151 81 -13 -146 -108
5306a08n4M09l97J79j20R6J1j41o5K05nj63J10m5K33n08M72M2l43O3J50L0k3j27
$$ -108 -162 247 -150 29 -91 5 16 -125 -190 15 10 -153 -43 -88 145 -363 109 151 -192 -129 21 51 28 -99
5330i9J08r3j57J52L33j58l96J70K65o5O6J03k74q2N28l62j6J42k14J50J3K57
$$ -99 9 -84 -241 -89 244 86 -310 -140 125 60 126 229 -45 -127 401 39 23 165 -49 101 114 371
5352C71l38P9k65J45m2J72q4j31J19n1m8%N3J6j37j53J44K57j33L2m4J50J6k20
$$ 371 33 112 -153 -8 -50 122 38 -93 26 -25 -73 -73 -20 -4 -141 -294 -150 107 -26 6 -38 112 128 -92
5376i2j8J11J30r6o0j5r1K3M5J14R9K35m51N7k7J63j23p7MK27r0j39K1J61O1l23
$$ -92 -110 1 131 35 -25 -40 -131 -108 -63 51 150 385 -66 -9 -36 127 4 -73 -69 158 68 -71 -50 111 172 -151
5402a51P7L9j0M7J38j11Q7r0j26l3K07r9P5R8p1p5J17k51O7r2n4J24L06r4j49
$$ -151 -74 -35 -45 2 140 29 116 26 -100 -133 74 -25 50 148 77 2 119 -132 -65 -157 -211 -87 219 125 -24
5427b4m0R3N0j7k46Q5K83j42R9R5l06N1J91l65R1q8K14j22Q0L6K08j84P4l19O4
$$ -24 -64 29 79 62 -184 -99 184 42 141 236 -70 -19 172 -193 -102 -190 24 -98 -18 18 226 42 116 -203 -139
5452a39O7J30k5J41l1o3j72J34J15k60O4j38Q6J21J14P1k39K1Q0J6r3J1M5Nj26
$$ -139 -72 58 33 174 143 80 -92 42 157 -103 -39 -177 -91 30 144 215 -24 -3 77 93 0 11 56 61 -65
5477f5J39j14k6j1K67P3k79P1K9O2j89m5J52j18J59N6m7J2ok04R6O2k5p6L4j69
$$ -65 74 -40 -66 -77 190 263 -16 55 84 146 -43 -88 64 -54 105 161 114 126 120 -84 12 74 49 -27 7 -162
5503a62K3L98k61RM9plK1j13j26J17Jp8L66m54M47j24j10J46J9k47J40o0O6p6
$$ -162 -139 259 -2 7 56 49 46 67 -46 -172 -55 -54 -132 234 -220 227 103 -7 139 158 -89 51 -9 57 -19
5528a9j29J42K45k97p1K67m42J72R2r4mJ73r2p8J97p6j58M6O7J07k22L4O2J13
$$ -19 -148 -6 239 -58 -129 138 -304 -132 -40 -134 -138 35 -57 -135 62 -14 -172 -126 -59 48 -174 -140 -78 35
5552C5K8j6r7p8R8J45j7k96K72J9Nk26Q3K60q8P8k26J88k04OO4n4K17p1k88K22
$$ 35 63 47 -50 -128 -30 115 98 -198 74 93 98 -128 -45 215 127 205 -21 167 -37 -31 33 -21 196 125 -163 59
5578E9J29Nk43p9K56j05l21J71M7P9kM0r0J42j51k3L9J50p0j88J42K29pl9k17
$$ 59 188 193 -50 -129 127 22 -299 -128 -81 -2 -4 36 -54 88 -63 -86 -47 103 33 -155 -13 216 209 170 -47
5603d7J2J30J21l12K63j37r4J79k71M43n44K60m0l6P9O5K5p9J5j45K25r4j10J83
$$ -47 -35 95 216 -96 167 30 -64 115 -156 287 -257 3 -37 -73 6 71 96 17 32 -113 112 18 -92 91
5627I1p6J20j41k00L62m81J72P6R8j43J8Nn3K25j64L02q6j8l3J92m65J70m3M3
$$ 91 15 135 -6 -206 156 -325 -153 -77 21 -122 -104 -99 -152 73 -91 211 125 107 74 266 -199 -29 -72 -29
5651b9K4j06j7K38p2l27K59o5J51k57J09o2m3K45J13j47M3m9P6j11N3k7R3k30
$$ -29 -5 -111 -128 110 38 -289 -30 -95 56 -201 -92 -154 -197 48 161 14 57 8 84 -27 26 -1 92 -138
5675a38p0K54j06J01K0j19N8Q1l54L22O0j35K8n6J00k64N95j91n4j87J02jJ08
$$ -138 -208 46 -60 41 61 -58 0 81 -273 49 109 -26 2 -54 46 -218 377 186 132 -55 47 46 154
5698A54j32J73j39k06J65j70K76j0l6J95k33M8q0j28L49J0l16L2O4K15k37R2l14
$$ 154 22 195 56 -150 15 -155 121 111 75 270 37 85 5 -123 226 236 -80 -48 16 231 -6 86 -228
5721b28J61j06L21k37J28r1J13j59L10k92R6j5N7R6m7k02j8M9K44k00J14n0J4
$$ -228 -67 -173 148 -89 39 -52 61 -98 212 -80 16 1 58 154 107 -95 -113 -64 180 -20 94 44 58
5744E8OQ0k24j3j54K25K33l26J84j36l4J14J08l36J57n9J75j39K38q2p3m4O8J
$$ 58 64 144 -80 -93 -247 -22 211 -115 69 -67 -101 13 121 -215 -58 -117 58 -81 157 75 2 -42 26 27
5768B7l5P7j25K6N0k52L42j1j03K54k37K67n10L61j26J67P0k88Q3j42J99j02L2
$$ 27 -8 69 -56 -30 20 -232 110 99 -4 250 13 280 -230 131 5 172 242 -46 37 -105 94 -8 24
5791B4L2j54J06K23Q7j17l03m5J26j1J80j72l7j54L48L0k02j8k01J66l8K82N8
$$ 24 56 -98 8 231 318 201 -102 -147 -21 -32 148 -24 -61 -215 133 163 -39 -57 -258 -92 -130 152 210
5814B10q0k06K80r2k86K47J52j94k09J24M8J0p9L62k39q7R0p6j29K51k00L47j74
$$ 210 130 -76 204 112 -174 73 225 31 -178 -54 -6 4 -75 287 48 -39 51 -25 -154 97 -103 244 70
5837G0l5j27j34J25J3J61j56lo4O1J92K5j80m8K08k13M53j44J35k65j27m5p3K02
$$ 70 35 -92 -226 -101 -88 73 -83 -86 -150 -89 103 128 -52 -100 108 -105 348 204 339 74 -53 -98 -171 31
5861C1R4j16P8j91R5J77j82j1P4j95K72L3j5j51m2N1P5o9N7N9j76J52k66K44j1
$$ 31 125 9 87 -104 -9 168 -14 -25 49 -146 126 159 144 -7 -49 2 77 8 65 124 -52 100 -166 78 67
$$ [...]
8191a6
##END NTUPLES=NMR FID
##END=
