##TITLE=1H_Ser 4645-Van4
 CDCl3, 8 sc, 
 31.1.2020
##JCAMPDX= 6.0         $$ Bruker NMR JCAMP-DX V2.0
##DATA TYPE= NMR FID
##DATA CLASS= NTUPLES
##ORIGIN= UXNMR, Bruker Analytische Messtechnik GmbH
##OWNER= root
$$ XWIN-NMR		Version 3.5
$$ Fri Jan 31 15:36:37 2020 Russian Standard Time (UT+4h)  she@DPX200
##.OBSERVE FREQUENCY= 200.1315
##.OBSERVE NUCLEUS= ^1H
##.DELAY= (6, 6)
##.ACQUISITION MODE= SIMULTANEOUS
##.ACQUISITION SCHEME= undefined
##.AVERAGES= 8
##.DIGITISER RES= 18
##SPECTROMETER/DATA SYSTEM= spect
##.PULSE SEQUENCE= zg30
##.SOLVENT NAME= D2O
##.SHIFT REFERENCE= (INTERNAL, D2O, 0, 15.7039)
##AUDIT TRAIL= $$ (NUMBER, WHEN, WHO, WHERE, WHAT)
$$ ##TITLE= Audit trail, XWIN-NMR		Version 3.5
$$ ##JCAMPDX= 5.01
$$ ##ORIGIN= Bruker BioSpin GmbH
$$ ##OWNER= she
$$ F:/spectra/data/she/nmr/H-F/1/audita.txt
$$ ##AUDIT TRAIL=  $$ (NUMBER, WHEN, WHO, WHERE, WHAT)
(   1,<2020-01-31 15:35:31.35 +0400>,<she>,<DPX200>,
      <created by zg, POWCHK disabled, PULCHK disabled
       configuration hash MD5:
       00 E9 B6 7A A2 85 ED C7 34 08 36 98 17 FE 4E 26
       data hash MD5: 16K
       18 38 85 32 63 DC 1B 6F 58 4D 1B B2 66 25 F4 0C>)
$$ ##END=
$$ 
$$ hash MD5
$$ 4E EF 6B 47 83 36 42 26 37 F7 E2 BF E5 D1 F4 74
##$RELAX= 
##$RELAX= 
##$RELAX= 
##$RELAX= 
##$RELAX= 
##$RELAX= 
$$ Bruker specific parameters
$$ --------------------------
##$DU= <F:/spectra>
##$EXPNO= 1
##$NAME= <H-F>
##$PROCNO= 1
##$TYPE= <nmr>
##$USER= <she>
##$AMP= (0..31)
100 100 100 100 100 100 100 100 100 100 100 100 100 100 100 100 100 100 
100 100 100 100 100 100 100 100 100 100 100 100 100 100 
##$AQSEQ= 0
##$AQ_mod= 1
##$AUNM= <au_zg>
##$AUTOPOS= <>
##$BF1= 200.13
##$BF2= 200.13
##$BF3= 200.13
##$BF4= 200.13
##$BF5= 200.13
##$BF6= 200.13
##$BF7= 200.13
##$BF8= 200.13
##$BYTORDA= 1
##$CFDGTYP= 0
##$CFRGTYP= 5
##$CHEMSTR= <none>
##$CNST= (0..31)
1 1 145 1 1 1 1 1 1 1 1 1 1 1 1 1 1 1 1 1 1 1 1 1 1 1 1 1 1 1 1 1 
##$CPDPRG= <>
##$CPDPRG1= <>
##$CPDPRG2= <>
##$CPDPRG3= <>
##$CPDPRG4= <mlev>
##$CPDPRG5= <mlev>
##$CPDPRG6= <mlev>
##$CPDPRG7= <mlev>
##$CPDPRG8= <mlev>
##$CPDPRGB= <>
##$CPDPRGT= <>
##$D= (0..31)
0 1.2 0 0 0 0 0 0 0 0.06 0 0.03 0 0 0 0 0.0002 0 0 0 0 0 0 0 0 0 0 0 0 
0 0 0 
##$DATE= 1580470530
##$DBL= (0..7)
120 120 120 120 120 120 120 120 
##$DBP= (0..7)
150 150 150 150 150 150 150 150 
##$DBP07= 0
##$DBPNAM0= <>
##$DBPNAM1= <>
##$DBPNAM2= <>
##$DBPNAM3= <>
##$DBPNAM4= <>
##$DBPNAM5= <>
##$DBPNAM6= <>
##$DBPNAM7= <>
##$DBPOAL= (0..7)
0.5 0.5 0.5 0.5 0.5 0.5 0.5 0.5 
##$DBPOFFS= (0..7)
0 0 0 0 0 0 0 0 
##$DE= 6
##$DECBNUC= <off>
##$DECIM= 24
##$DECNUC= <off>
##$DECSTAT= 4
##$DIGMOD= 1
##$DIGTYP= 9
##$DL= (0..7)
0 120 120 120 120 120 120 120 
##$DP= (0..7)
150 150 150 150 150 150 150 150 
##$DP07= 0
##$DPNAME0= <>
##$DPNAME1= <>
##$DPNAME2= <>
##$DPNAME3= <>
##$DPNAME4= <>
##$DPNAME5= <>
##$DPNAME6= <>
##$DPNAME7= <>
##$DPOAL= (0..7)
0.5 0.5 0.5 0.5 0.5 0.5 0.5 0.5 
##$DPOFFS= (0..7)
0 0 0 0 0 0 0 0 
##$DQDMODE= 0
##$DR= 18
##$DS= 0
##$DSLIST= <SSSSSSSSSSSSSSS>
$$ [...]
##$SUBNAM2= <"">
##$SUBNAM3= <"">
##$SUBNAM4= <"">
##$SUBNAM5= <"">
##$SUBNAM6= <"">
##$SUBNAM7= <"">
##$SUBNAM8= <"">
##$SUBNAM9= <"">
##$SW= 24.9337058887773
##$SWIBOX= (0..15)
0 0 2 0 0 0 0 0 0 0 0 0 0 0 0 0 
##$SW_h= 4990.01996007984
##$TD= 16384
##$TD0= 1
##$TE= 0
##$TE2= 300
##$TE3= 300
##$TEG= 300
##$TL= (0..7)
0 120 120 120 120 120 120 120 
##$TP= (0..7)
150 150 150 150 150 150 150 150 
##$TP07= 0
##$TPNAME0= <>
##$TPNAME1= <>
##$TPNAME2= <>
##$TPNAME3= <>
##$TPNAME4= <>
##$TPNAME5= <>
##$TPNAME6= <>
##$TPNAME7= <>
##$TPOAL= (0..7)
0.5 0.5 0.5 0.5 0.5 0.5 0.5 0.5 
##$TPOFFS= (0..7)
0 0 0 0 0 0 0 0 
##$TUNHIN= 0
##$TUNHOUT= 0
##$TUNXOUT= 0
##$USERA1= <user>
##$USERA2= <user>
##$USERA3= <user>
##$USERA4= <user>
##$USERA5= <user>
##$V9= 5
##$VALIST= <valist>
##$VCLIST= <CCCCCCCCCCCCCCC>
##$VD= 0
##$VDLIST= <DDDDDDDDDDDDDDD>
##$VPLIST= <PPPPPPPPPPPPPPP>
##$VTLIST= <TTTTTTTTTTTTTTT>
##$WBST= 1024
##$WBSW= 4
##$XGAIN= (0..3)
0 0 0 0 
##$XL= 0
##$YL= 0
##$YMAX_a= 960661
##$YMIN_a= -526501
##$ZGOPTNS= <>
##$ZL1= 120
##$ZL2= 120
##$ZL3= 120
##$ZL4= 120
##$ABSF1= 10
##$ABSF2= 0
##$ABSG= 5
##$ABSL= 3
##$ALPHA= 0
##$AQORDER= 0
##$ASSFAC= 0
##$ASSFACI= 0
##$ASSFACX= 0
##$ASSWID= 0
##$AUNMP= <proc_1d>
##$AZFE= 0.1
##$AZFW= 0.1
##$BCFW= 1
##$BC_mod= 2
##$BYTORDP= 1
##$COROFFS= 0
##$CY= 11.3945322036743
##$DATMOD= 1
##$DC= 2
##$DFILT= <>
##$DTYPP= 0
##$F1P= 16.9975609425685
##$F2P= -3.02152046262296
##$FCOR= 0.5
##$FTSIZE= 0
##$FT_mod= 4
##$GAMMA= 1
##$GB= 0.15
##$INTBC= 1
##$INTSCL= 1
##$ISEN= 128
##$LB= 0.24
##$LEV0= 0
##$LPBIN= 0
##$MAXI= 10000
##$MC2= 0
##$MEAN= 0
##$ME_mod= 0
##$MI= 1.114404
##$NCOEF= 0
##$NC_proc= 0
##$NLEV= 6
##$NOISF1= 3.799351
##$NOISF2= 2.8
##$NSP= 1
##$NTH_PI= 0
##$NZP= 0
##$OFFSET= 15.70392
##$PC= 1
##$PHC0= -9787.451
##$PHC1= 13.80081
##$PH_mod= 1
##$PKNL= yes
##$PPARMOD= 0
##$PSCAL= 0
##$PSIGN= 0
##$REVERSE= no
##$SF= 200.130013532006
##$SI= 16384
##$SIGF1= 3
##$SIGF2= 2
##$SINO= 400
##$SIOLD= 16384
##$SREGLST= <1H.CDCl3>
##$SSB= 0
##$STSI= 0
##$STSR= 0
##$SW_p= 3612.71676300578
##$SYMM= 0
##$S_DEV= 0
##$TDeff= 0
##$TDoff= 0
##$TI= <>
##$TILT= no
##$TM1= 0
##$TM2= 0
##$TOPLEV= 0
##$USERP1= <user>
##$USERP2= <user>
##$USERP3= <user>
##$USERP4= <user>
##$USERP5= <user>
##$WDW= 1
##$XDIM= 8192
##$YMAX_p= 0
##$YMIN_p= 0
$$ End of Bruker specific parameters
$$ ---------------------------------
##NTUPLES= NMR FID
##VAR_NAME=  TIME,          FID/REAL,        FID/IMAG
##SYMBOL=    X,             R,               I
##VAR_TYPE=  INDEPENDENT,   DEPENDENT,       DEPENDENT
##VAR_FORM=  AFFN,          ASDF,            ASDF
##VAR_DIM=   8192,          8192,            8192
##UNITS=     SECONDS,       ARBITRARY UNITS, ARBITRARY UNITS
##FACTOR=    0.0002004,     1,               1
##FIRST=     0,             0,               0
##LAST=      1.6414764,     0,               0
##MIN=       0,             -526501,         0
##MAX=       1.6414764,     960661,          0
$$ Real data points
##PAGE= N=1
##DATA TABLE= (X++(R..R)), XYDATA
0@%%%%qJ6j6K2l0L9m8N7p6R9j19J42j74K07k43K88l42M01m65N40o23P14q15R30
28D96j057J198j353J520j710J918k140K389k664K960l287L649m043M477m956N485
44B882o077O736p474Q309r262J0358j1638J3154j4981J7241k0115K3916k9214
57a6165L7171n0618P9158k41347L54250L54671o71636l71985K15373K73072j65349
68b03405j7036K89957J19719l57980k13583K59170L11195j00843j78769Q0212
78a1363J37651j25848j55491R7346K23335M9783q5146r2818j01813q8196J09687
89d2873K67606R5799k32513k60279m555J55370R2147J9616j2912r8942j42433
100a63969O466J60344P9611r0110o8741L5444j6305r3874L5330J83192N5583j58966
$$ y = [0, 0, 0, 0, 0, -8, 8, -8, 14, -16, 23, -25, 32, -44, 55, -64, 78, -96, 111, -132, 156, -186, 215, -250, 290, -333, 381, -434, 496, -561, 637, -716, 804, -906, 1012, -1128, 1261, -1403, 1557, -1730, 1919, -2124, 2353, -2603, 2882, -3195, 3541, -3933, 4376, -4886, 5472, -6166, 6988, -7993, 9248, -10867, 13049, -16165, 21006, -29612, 49546, -191801, 162449, 517120, -154516, -526501, -311128, -38056, -203405, -220441, 69516, 189235, -168745, -382328, -123158, 188037, 87194, -91575, -11363, 126288, 440, -155051, -57705, 165630, 215413, 130267, 37449, -64364, -152560, -42873, 224733, 320532, 88019, -172260, -176815, -21445, 70702, 90318, 77406, -21536, -163969, -157503, 2841, 82452, -7658, -76399, -40955, -57260, -151134, -115804, 67388, 122971, -35995]
112c5995r2954J11428N8663j33879m7421K15621J61652j82467k62342N1508K53778
123I7592P0047j43692p5401O7637K0837p8330j4750J07197P5840o2419j12155
134d7597l4468N7074Q1062L6772l3910o6287k6924K2194J8390J639K7984M1620
146G7549j8040p9691m0763M9808O2378m384m2458j4539J2741J35j6150n944J5072
159d286K8757Q128n1861q1046J704J16558Q7934p0673j35257j1708J01859M7828
171C7937n0703k7665L8817M662n5311m510P6168L3777o4510n1565L7135M8693
183B2925r324k2885J894p970j3442L4329M8657l6094q4228J4138J09149K3354
195H0503j10772o0779R2126Q8460n4993q7282K9479P8894r378n8531Q106M7811
$$ y = [-35995, -128949, -17521, 41142, -92737, -140158, 75463, 237115, 54648, -207694, -156186, 97592, 167639, 23947, -51454, 16183, 37020, -41310, -56060, 51137, 126977, 64558, -47597, -82065, -24991, 56071, 92843, 58933, -7354, -34278, -12084, 6306, 7945, 35929, 77549, 59509, -20182, -60945, -11137, 51241, 46857, 4399, -10140, 2601, 2736, -13414, -19358, -4286, 24471, 32599, -19262, -100308, -98604, 17954, 105888, 35215, -100042, -111750, -9891, 37937, -12766, -40431, -1614, 3048, -52263, -56773, 19395, 53172, -11338, -62903, -25768, 22925, 13601, -9284, -7390, -15360, -28802, 5527, 54184, 18090, -66138, -52000, 57149, 80503, -30269, -91048, 1078, 89538, 34545, -52737, -23258, 55636, 46258, -12273, -4167, 43644]
207D3644j6579n7577J3416Q4896L6095o9700r0951p419Q0438Q0398j2854j01361
219a7554p3500M5884R8269R249p9136l5937M5160J7817n9406l1404O5082O3905
231D8429l7944p4721k231M7055J1766j3949J9560L0556k0390m9948q981M4266
243f532N1214K6036j1345n1859n2601J7073Q6054N3189m1999o9618q610L3979
255B4981R549p784J9819K4396k9380o6248k5055M3563N5309M661m1910l6421N52
268b3968J6907o069j6028K1731M9855k839q2777n9571O0730J11352J4359q8488
280d806n5982L5476M0071j4247j0036M1108L0829m1052o4238n195N4582M8094
292E4604J035l6556m4754j6182K6680L7134O053j3449K636M85m0749l9304L9389
$$ y = [43644, 27065, -30512, -17096, 67800, 103895, 34195, -56756, -64175, 16263, 96661, 83807, -17554, -91054, -45170, 53099, 62348, -16788, -52725, -7565, 10252, -49154, -80558, -15476, 48429, 10485, -64236, -66467, -19412, -7646, -21595, -2035, 28521, 8131, -41817, -50798, -6532, 44682, 70718, 59373, 7514, -45087, -28014, 58040, 111229, 69230, -388, -8998, 24981, 34530, 26746, 46565, 70961, 41581, -24667, -49722, -6159, 49150, 53811, 11901, -24520, -23968, -7061, -13130, -29158, -7427, 42428, 39589, -43188, -102759, -42029, 69323, 83682, -4806, -60788, -25312, 14759, 512, -9524, 31584, 62413, 21361, -42877, -48072, 6510, 54604, 55639, 19083, -25671, -41853, -15173, 21961, 28014, 14565, 17201, 17686, -23063, -62367, -22978]
305b2978Q4199J5071p3704n4772K7556M6653J942p065K4150J2025m4695n2223
317d3841J2667O4772M5733j2284n2757m8898j887M9070M2020j6677m0065m482
329f629J3974k3103l1991L4754P6065J361r2401o1238M6744P3541N393l5204o489
342e223J2071j1450j9135J3761L7723K1526j1540l3137l1278L999M9362M4468
354G1147j7118n3241j3599K9752N986k5330Q164M4908l58o5940l6874M7708N6805
367E2010j3749m7498p868K2731L27j8561L244K5501J4641r514k1719j9701N902
380a4254L8590K8422k8007m7903P441N0232O627m6788j3700M8486K5155m9510
392D791n0297K4920N3529j784m0778j2293K0723P338j3784p771O858Q865O033
$$ y = [-22978, 61221, 76292, 2588, -52184, -24628, 22025, 23967, 16902, 41052, 53077, 8382, -43841, -31174, 33598, 79331, 67047, 14290, -34608, -36495, 12575, 54595, 37918, -2147, -6629, 7345, -15758, -47749, -12995, 63070, 64431, -27970, -89208, -42464, 31077, 36470, 1266, -5223, 6848, -4602, -23737, -9976, 27747, 49273, 37733, 4596, -26682, -22683, 26679, 71147, 54029, 788, -12811, 16941, 22927, -2403, 5761, 50669, 50311, -15629, -52503, -4795, 52010, 38261, -9237, -17105, 5626, 5953, -12608, -9364, 16137, 30778, 21264, -455, -20156, -14254, 24336, 52758, 24751, -23152, -15711, 34521, 41148, -5640, -19340, 29146, 54301, 4791, -45506, -20586, 32943, 31159, -9619, -21912, -1189, 6149, -7635, -15406, -8548, 317, 6350]
405F350m035j8557j1187K3856L4926o139l6307m256L5164Q815l5315j0559M5232
418B7988L0128l8677m5288J8751M5576N16l5241r720J9010N320j9434j2764J0037
431c798J7680P609j3943l1003j5678K5058L6506r398m1603n190L9965J1283m1250
444b3762j9520M6116M1417l1220n6697J786M9142K3481j8709j5135N269K365q922
457d389l435Q661J3372J0095m867k9007k2332K1894M5082O450l9548k1847J9734
470a37J1404k2688m917M1969K8815l9647n5890N956N2136K3439k0832k1448l085
483d925j712n896L774J5596J5759K433k0942l9245j9332L5687N7129L488n7074
496a5260l8528K4245L3406o817j3355K2130J8389l2741m6462R334N6429L3338
$$ y = [6350, 2315, -16242, -27429, -3573, 31353, 25214, -11093, -15349, 19815, 28630, -6685, -17244, 27988, 58116, 19439, -25849, -7098, 38478, 38994, 3753, -5967, 13043, 18363, -1071, -13835, -3798, 13882, 21491, 7548, -23455, -39133, -14075, 22431, 13033, -28570, -33760, 6205, 17488, -23762, -43282, 2834, 44251, 13031, -43666, -41880, 7262, 30743, 12034, -3101, 2168, 4533, -4389, -7824, 837, 14209, 24304, 19437, -9570, -31902, -10008, 35074, 41524, 1976, -19871, -137, 11267, -11421, -16338, 25631, 54446, 14799, -41091, -35135, 17001, 40440, 19608, -1840, -4925, -6637, -12533, -8759, 6837, 22596, 25029, 4087, -35158, -54490, -18803, 38326, 41814, -15260, -53788, -29543, 3863, -2954, -16309, 5821, 24210, -8531, -54993, -45659, 10770, 44108]
508D4108j7117l4331j7051L566J7195K0652R676p267j0563r018j5106p171K8813
521F386M4681k999n9163l9610K4868M0466M54j7649N474O158k8738l4560J7243
534c6989N1589J8015l3602l9743p754J9463K6381J4972n906j5580m806L449q961
547a9472q425K6694M5065l112n9035l6385L8294N5671r36l6597j0005J2829q164
560c578k0636R601L4753J2366k6974l3827r750J4400K4072J3732j1238k5628r940
573c2647J2226O697n175J0098K6758l615m5285k5708L6949M9187k941l4198p164
586a4818J7528q72j6676Q228L2145R715k8741l0733j160K4775K6363O066k2245
599I575l0009k901K2783Q168j5992k782K3926M544l8967k7505L1123M8107l907
$$ y = [44108, 26991, -7340, -24391, -20825, -3630, 17022, 26698, 19431, 8868, -150, -15256, -22427, 6386, 51067, 48068, -11095, -50705, -25837, 14629, 15083, -2566, 2908, 9066, -19672, -54232, -36989, 14600, 32615, -987, -40730, -48484, -29021, -2640, 12332, 6426, -9154, -13960, -10511, -19472, -27897, -1203, 43862, 40750, -18285, -54670, -16376, 39295, 38359, 1762, -8243, 4586, -3578, -24214, -14613, 20140, 32506, 5532, -28295, -38045, -23645, 427, 14159, 2921, -22707, -32647, -20421, -13724, -18899, -8801, 17957, 14342, -30943, -56651, -19702, 29485, 26544, -7654, -14818, 2710, 1838, -14838, -6610, 25535, 35250, 6509, -24224, -25384, -609, 25754, 31820, 9575, -20434, -23335, -552, 7616, -8376, -11158, 12768, 17312, -21655, -49160, -18037, 30070, 26163]
612B6163m3213j7658K0948J4450p861o85J5260N486j5279j7268q12J3164J8401
625A1096P894j5737k5461k796K4406J2821j4853j0157J4445O579k6778k0990K5077
638a4454L6607p062l6742q225K3221J0958j3823o882J3638J0684r471j5305k976
651a9832J1793J8947Q573j5164k5761j076K7242J3022k1441j5392K1321J9205
663B1437k2829l1298J2305L7702M868l2261j8279J3865J4172m735m754P209M747
676B149p624j0441l634M145J3745J3086q150k3899o460K2818J5578j4808j4892
689a8387J4937J4751j9931k6647J4165L7354M188l2270j7439J5790J4510o418
701e397p470P312Q745m705j0751n657O703J8163J4403j0977k7833o945K7589K2246
$$ y = [26163, -17050, -34708, -13760, 690, -7171, -7856, 7404, 12890, -2389, -19657, -20469, -7305, 11096, 18990, 3253, -22208, -25004, -598, 12223, -2630, -12787, 1658, 8237, -18541, -39531, -14454, 22153, 15091, -21651, -29876, -6655, 4303, -9520, -16402, -2764, 7920, -1551, -16856, -19832, -8039, 10908, 19481, 4317, -21444, -22520, 4722, 17744, -3697, -19089, 2232, 21437, -1392, -32690, -20385, 17317, 22185, -10076, -28355, -14490, -318, -5053, -9807, -2598, 2149, -5475, -15916, -19550, -15405, -1660, 11426, 3276, -20623, -27083, -4265, 11313, -3495, -18387, -3450, 11301, -8630, -35277, -21112, 16242, 20430, -11840, -29279, -13489, 1021, -5397, -12867, -5555, 3190, -1515, -12266, -17923, -11220, 6943, 21346, 10369, -17464, -24409, 3180, 25426]
715B5426j4579j9921J1684K1925j1708k8868M436L3651J1314k5558k2837N518
727i517J5144K983k349l14k533p578o146j736K370R776J2466n605k4832r854K2130
742e595K0808j0204j8042Q329J6166j0774k2493R947L4904J0470k7493k2988Q362
755h603J8981N404m524k167j035l446k532k875r7J2057J4337q652l1845j3960
769b8957K7553K9788r370k8035j464J9033r68j9497J840K6799R622k2601k0734
782a6991O528J8533R957r88o359r248n238M084N858p5J929Q939l043k3698j2978
797b2790K1898K6433r567l0033m054J8643J082j6865J738K3969O693k5047k1711
810b9611R867K4011Q518q743j0652m309M239J0840K937o569K60J2759K158k1189
$$ y = [25426, 10847, -9074, 2610, 24535, 12827, -16041, -11605, 22046, 33360, 7802, -15035, -9517, 5627, 8610, 6261, 5947, 3414, -4164, -10310, -12046, -9676, 100, 12566, 6961, -17871, -27725, -5595, 15213, 5009, -13033, -4704, 11462, 688, -21805, -11858, 23046, 33516, 6023, -16965, -8603, 10378, 15782, 11258, 9091, 8056, 4610, 2078, -797, -894, 11163, 25500, 16848, -14997, -28957, -1404, 28384, 19014, -9021, -10485, 8548, 7580, -11917, -10077, 16722, 26344, 3743, -16991, -10463, 8070, 18027, 17039, 10680, 1432, -3806, 278, 6136, 6061, 7990, 16929, 13886, -9812, -22790, -892, 25541, 15974, -14059, -18113, 530, 1612, -15253, -13515, 10454, 17147, -7900, -29611, -19744, 4267, 12785, 4042, -6610, -10919, -6680, 4160, 7097, 528, 788, 13547, 15705, -5484]
824e484j3805K1209K9795n433l0163q248J9472Q793j4064n834J4635O711j6670
837I14j6048O386J6375N573n484j0310q702K55R670O249o371m642Q126M918j4507
852g598j3118J5170K4833n568k7495n841K1101R628j4228n913J5771R444j5698
865D88j8350N449J9670Q718p546j3814o131O346J3908L801j2103p872J0903R990
879A3457j2936j6575J1343K6246K66k4620j0933J5163J1610q422p359P954O769
892A1963r425j1308K979J2260M928l823q614r233l28J0822P173p490q160O834
906a422P974j0116j4775Q847K2836O00k3142r882J6587J3216q239q671R321J0095
920A3229p555j4636q19J2714J1800Q05j1193j3222L59J5002R303j0151j2275O382
$$ y = [-5484, -19289, 1920, 31715, 26282, -3881, -12129, 7343, 16136, 2072, -3762, 10873, 17584, 914, -15134, -8748, 7627, 13200, 7716, -2594, -11296, -11041, -1371, 4878, -1493, -6135, 1991, 6909, -7598, -20716, -5546, 19287, 13719, -13776, -19617, 1484, 11112, -3116, -9029, 6742, 16186, 488, -17862, -12413, 7257, 15975, 8429, -5385, -11516, -5170, 8738, 12539, 436, -7436, 3467, 13457, 521, -16054, -4711, 21535, 21801, -2819, -13752, 1411, 13021, 4599, -2760, 5194, 11963, 2538, -8770, -5791, 6469, 11397, 7574, -1040, -10273, -10601, 221, 7394, -96, -8256, -1422, 6552, -3564, -18339, -9492, 13344, 13944, -9198, -19080, -2493, 10723, 2484, -6187, 3134, 13229, 5674, -8962, -9781, 2933, 14733, 15538, 4345, -8877, -8518, 6484, 15787, 5636, -6639, -257]
934b57J0363r338j7569P210K5444M265k4273j6643J1530J5201j700o503K709L696
948D135n542p534K926R598O654O39p575j2507k662J3949J2954n083j2003K255
962B04P948q027j2943Q850K3209M73k5999j5989J5099J9666k547j1310k94M921
976C261m353p578J784R482Q217J337q850j4073k275J7921J6484p896j8468j182
990f189J3688N82j2334K680J9821L647k2347j6585J1402J8513J015j0327l624
1003e8N41k738j961M356O161P69j779o515r208j291J4312J4985o186j7716k176
1018h504J2582J751j0029K568J6543K784k1586j4230J3843K1819Q69j4869q202
1031d661J843K697N0K501K035Q20M47m832j0380k671J4823J5692p614k2085m446
$$ y = [-257, 10106, 768, -16801, -9591, 15853, 20118, -4155, -20798, -9268, 5933, 4233, -2270, 439, 4135, -1407, -8941, -6015, 3583, 10237, 10876, 3301, -9206, -11868, 2081, 15035, 9952, -2051, 204, 8152, 125, -12818, -3968, 19241, 19714, -6285, -22274, -7175, 12491, 9944, -1366, -1660, 3261, -1092, -8670, -6886, 2596, 10813, 12150, 3300, -10773, -13048, 4873, 21357, 13461, -5007, -6189, 7499, 8081, -4253, -1573, 18248, 21895, -452, -17037, -5635, 12878, 13893, 3566, -58, 483, -2255, -4216, 140, 6301, 7070, 5291, -1224, -10432, -11723, 2589, 17574, 11388, -6328, -8504, 4078, 5829, -4200, -1632, 14911, 17695, -3891, -18121, -4278, 17541, 18410, 3541, -4661, -2818, -121, -71, 2430, 4465, 5285, 5732, 900, -9480, -12151, 2672, 18364, 10750, -11335, -15781]
1046a5781J6959R037q941m353J0633M532j4255j2319R894J7844J519j1131p233
1059c595O56J983L010M185Q4l453k694k374n479j147J1750J2040q429k0180l589
1074a7232J7033Q104j1215o417J0792O301j2829j1651J0239J8455J459j2998r306
1087i265K171P222N857J802l094l341J813J769n651n412R547J4345n200k1532
1101h969o124J6921J2731q817j0427M875N469q140r856O684J4381O01j0817o788
1115h276J613M378M757K670k410n556k86L232j758k789Q400J0958n602j8095m206
1130a2970J6643J1665r888j0778N726Q943o933j0552N106J3798J908j1048r806
1143h186M98P058P191K139o440p463K070O716j416p353L582J2277p03j7432p483
$$ y = [-15781, 1178, 10215, 1274, -3079, 7554, 12086, -2169, -14488, -4594, 13250, 14769, 3638, -3595, -2939, -956, 2054, 6239, 6323, 2870, 176, -2198, -7677, -8824, 2926, 14966, 6537, -13643, -17232, -199, 7905, -3310, -9727, 1065, 7366, -5463, -17114, -6875, 11580, 13039, 41, -9265, -7094, 128, 5985, 7787, 4693, 1352, 3165, 4934, -717, -6129, 3418, 17763, 12563, -8969, -15093, 1828, 14559, 5742, -4685, 190, 5659, -2481, -12337, -5653, 8728, 9329, -1488, -8276, -6663, -2285, 2472, 5142, 2732, -2824, -3110, 122, -1636, -4425, 3975, 14933, 9331, -8764, -12970, 3673, 15338, 5450, -5328, 398, 9341, 2408, -8144, -3038, 10760, 12668, 1620, -8186, -7688, -630, 6561, 8700, 2260, -5203, -3133, 3583, 2167, -5186, -1604, 10673, 9970, -7462, -14945]
1158a4945J5493J3739o549j1848J084O626l302o425M129R936M81q677n780O19
1172e419M801M916K154m927p691J107O947k94o367L412J1252j537j6395o875J4702
1187b14J3364o948j3133J989R682j975q524J746R664K624p540q180j286N526Q504
1202E299L337p399j0361J612R752J762q632j121J0455K490j3088q358J1961J3840
1216A1549m324j2310o73P287j7n425K659P697J000o700n516P46L901N619K594
1231H087o068q860O38R326J470p556m99R452M91j4441p209J2658J4485n089j4049
1246g164j426R260K981m995p95N633J775m177m422o01L596P574M692o505j1384
1261e958J11J1483M178q237m950P597M004r882q223Q385J2286l487j2864k964
$$ y = [-14945, 548, 14287, 7738, -4110, -3026, 3600, 298, -6127, -1998, 7938, 8419, -258, -6038, -5419, -618, 4298, 6452, 1525, -6166, -5059, 1888, 1594, -4773, -1361, 9891, 8354, -8041, -14916, -214, 13150, 6202, -6931, -4942, 4740, 2765, -5759, -4013, 5651, 8275, 735, -7445, -8731, -3205, 5299, 8636, 1237, -9124, -7512, 2240, 4002, -4630, -5751, 4704, 7194, -5894, -14252, -2291, 11549, 7225, -5085, -5758, 1529, 1512, -3913, -1254, 6443, 7443, 743, -4773, -4027, -126, 5493, 8087, 2019, -6841, -6203, 3123, 4593, -2963, -3462, 5990, 6481, -7960, -15169, -2511, 11974, 6885, -7164, -8590, 670, 3651, -1344, -2139, 3494, 5269, 1092, -3330, -3931, -335, 7239, 11931, 5426, -5958, -5847, 5636, 9814, 1577, -3373, 4224, 8228, -1654, -9877, -1492, 10794, 7307, -5557, -8521]
1275h521O227K627k820K22L877m58m010k735N31K784N103L415n724r167J622J1246
1291D219M654q469m562P863M818j0526q052R645J3602k972j4329m081P836N910
1305E556k577l605n8P52j561j475j284K55M799N186m603j1642j862J1683O823
1320F387p814p912O052O386n894p714O061J1610j859j1857m012P291N080j494
1334C11j057N84q30k174j1J43J62L552L684m059r438%J1435O025q928p648O324
1351a925P477o067r767N347J3563k72j2393n752O604P121q37l154j750n50P1J455
1367h29p22j359K491N152k397j0773l139J0779Q544o808q834L154P577l660p178
1382h002M011J0332o71j0349m506O519O183l02j948l70j070j176J230N80o08K279
$$ y = [-8521, -2294, 333, -2487, -2265, 1612, 1154, -2856, -5591, -5060, -2276, 2827, 6242, 518, -8649, -7027, 4219, 8873, 404, -4158, 3705, 8523, -2003, -10055, -410, 13192, 10220, -4109, -8190, -354, 5556, 2979, -626, -684, 68, -1493, -2968, -4252, -3997, 802, 5988, 1385, -10257, -12119, -436, 6387, -1427, -9339, -3287, 3099, -2795, -10509, -4448, 7162, 5303, -6554, -10566, -3275, 1805, 311, -746, -162, -992, -3166, -3177, -3034, -2872, 680, 4364, 305, -9133, -9133, 2302, 8327, -601, -8249, -1925, 5552, -515, -10282, -4935, 8628, 8356, -4037, -9789, -3185, 3936, 3099, -55, -1805, -2355, -2284, -829, -1551, -2910, -419, 4733, 2336, -8437, -11576, -797, 7747, 939, -7895, -4741, 2836, -824, -8002, -3991, 6341, 5670, -4679, -9185, -2666, 3517, 3215, 1267, 897, -173, -1349, -119, 461, -147, 2132]
1398B132M511k577r830j809J0848P945p245j0468K913Q292k908q496K682J0624
1412F614J680j0675o577M522O849J974k361l124k892O15M345J381k964p4M868
1427D181k09r009l956Q903J0095m985j0610O05P585j86n825R69P588R7r003m542
1443h302N182O093Q40j975k887k270J25K965J408k108M51M936r68q986l115J0782
1459B171R481o324j2638O07R390J778o558o04O907J920p561n909L346O313J916
1474D235j872m457m139J266O174K720m736k653M213J596p032m260Q741R639m305
1489E130j1298m65Q700K632n519o81N940N10p034l500N015N893J102l150l951
1504f76l453J503N412K081m395k912M037J867o348m190Q142R597n275j3181r49
$$ y = [2132, 6643, 4066, -5764, -7573, 3275, 11220, 3975, -6493, -3580, 4712, 1804, -6692, -4010, 6614, 8294, -2381, -8958, -4436, 2413, 4387, 2026, -1098, -3990, -3375, 970, 2351, -613, -687, 4181, 3972, -5037, -8993, -90, 10005, 5020, -5590, -4985, 2600, 2414, -3411, -2442, 5146, 5243, -3760, -8302, -3120, 2973, 3813, 1838, -1049, -3319, -3194, -229, 1179, -929, -478, 4458, 3490, -5496, -8611, 2171, 11652, 5328, -7310, -6703, 2687, 4465, -2093, -2697, 4210, 6130, -1431, -7340, -3994, 2319, 4235, 2363, -2094, -6233, -4967, 1207, 3927, -809, -3462, 751, 2347, -4685, -8945, -204, 9435, 5130, -6168, -6633, 2067, 4699, -820, -1501, 4439, 4949, -2085, -5585, -570, 5323, 6425, 3275, -676, -4129, -2626, 2786, 4867, 472, -2440, 1597, 3464, -2884, -7074, 1068, 10665, 5390, -7791, -8740]
1519h740J0108M798n157l561M182K156m361l699K666N063J497j182m061m084J261
1534c114P210L725n379n482K678L400m153m084O107Q202m023j1081j806R279M300
1549E779m859l611L185J223l821k066L493M537O36k511m002l284K231P042K916
1564F888o371n099L200N223l725n615N095Q791l248j2043k983R739O643l836n581
1579b922O54K405j853j357J440K698Q58q80k970l723J265P369M077n806p336J998
1595d083O699j302n158L012P576k276j0252k166Q602O168m650n458R21K575j698
1610a490j007K165K615l16j717l016k991J984P209K765o323o744L340P348j594
1625B228n993J898P713m74r765l767Q641P069l137n951r05K214N52k53J318J55
$$ y = [-8740, 1368, 6166, 1009, -2552, 1630, 3786, -575, -4274, -1608, 3455, 4952, 3770, -291, -4375, -3114, 4096, 7821, 2442, -3040, -362, 3038, -1115, -5199, 908, 9110, 5087, -5994, -7800, 1479, 5779, 920, -2691, 494, 1717, -2104, -4170, -677, 3860, 4496, 1985, -2017, -5301, -3070, 3972, 6888, 517, -4582, -1382, 3841, 116, -5499, -404, 8387, 5139, -6904, -9887, -148, 6495, 2659, -2922, -2268, 137, -1716, -3073, -1633, 1065, 1923, 1043, -1927, -5650, -4385, 2984, 7061, 1255, -6081, -4083, 2616, 1314, -3844, -832, 6744, 4468, -5784, -7950, 652, 6820, 2170, -3288, -2367, 208, -1490, -2497, -332, 2283, 1967, 250, -2766, -5757, -3773, 3436, 6201, -122, -6866, -3526, 3822, 2228, -3765, -1867, 5846, 5372, -4393, -8160, 481, 7550, 4413, -1538, -2443, -229, 323, 70, 1388, 1543]
1641A543n52n63r54k437J1N788L528n421p369K039P598J86n884M26O297J06q216
1658c874k831P487N973l401o059K68K702P15l0O06J32o76k27j131l118M95O472
1675C503L880o162q666L007Q587O62p673j311O301J684o829m087O557O323j997
1690C779n685j598J676J519J579M93j653j303J218Q79k447j665M566M168m701
1705H25p651J433Q389J328o510k203N688J828o420l525N409O076k852n794p98
1720d777K835K348P44n11j933p60J378Q95k752r95M943M864m703q618J423R880
1736D261J807p665l735N428L550m771m018M044N231j166n088k074K046J758J532
1751A140K18k134j954J672K369k117k250L593M519l673p298R54Q459K543n808
$$ y = [1543, 991, 428, -526, -2963, -2952, 2836, 6364, 943, -6426, -4387, 3211, 3397, -2487, -2061, 4236, 4342, -3874, -6705, 782, 6755, 3354, -2705, -2437, 265, 980, 950, 1556, 1688, 1012, 785, -346, -3464, -2969, 3503, 7383, 1221, -7445, -4438, 4149, 4811, -2862, -4173, 2128, 3812, -3017, -7104, -547, 5776, 3779, -1906, -3504, -1828, -309, 1270, 1763, 110, -1193, 25, 904, -1543, -3208, 1358, 5526, 825, -6826, -5393, 2996, 4324, -2186, -4389, 1299, 3127, -3293, -6818, -1409, 4667, 1815, -3979, -4777, -1942, 406, 1150, 639, -1294, -2054, -676, 219, -2533, -3528, 1415, 6279, 1576, -7042, -5619, 4261, 6068, -1597, -5332, 96, 3646, -1125, -5143, -1099, 4132, 2966, -2122, -4196, -2150, -392, 1140, 1358, -776, -2730, -1058, 1311, -806, -3056, 537, 5056, 1383, -5915, -4961, 3498, 6041, 233]
1766B33l723L907L320m208l692M145M933j591n006j560K170K816J414r07l324
1781a073j689K740K440k403l145L641N358k613q648j35Q683L847o355n326L701
1796i77M434k562l717K529M136n40m057j926O82K550J968N22k938l305J477L786
1812B062j478l609K023N069j884p750k60P912L938n600n034L077M110k212m000
1827c636K016M634R8l938k285J433K114K544%l869l265L101L739j711m365J752
1843a638N837o29q403k186P404N749m844p088J704N074n08l165R90L121j61k917
1859a660j778O79J896K915O04l515l368J984M859o42m538J70N522j69o775k141
1875e957P728M941m735o644J930M696m37l545L44L479R01k930k173N71K112K722
$$ y = [233, -3490, 417, 3737, -471, -4163, -18, 4915, 3324, -1682, -3242, -1072, 1744, 3158, 2251, -1073, -2762, -22, 2418, 15, -3130, 511, 5869, 3256, -5392, -5527, 3156, 7003, 648, -4678, -977, 3457, 895, -2822, -293, 3843, 3303, -754, -2680, -1998, 552, 2520, 3042, 104, -3201, -1724, 2062, 584, -3025, -1002, 4067, 2183, -5567, -5827, 2085, 6023, 423, -4611, -1534, 2576, 364, -3636, -1620, 3014, 3112, -826, -3111, -1678, 436, 2980, 2980, -889, -4154, -1053, 2686, 975, -3390, -1638, 4199, 3570, -4833, -7019, 385, 6134, 1290, -5798, -4094, 980, 472, -2693, -1703, 1418, 1257, -1660, -3438, -2759, -863, 2052, 2656, -859, -4227, -2243, 2616, 1974, -2564, -2394, 3128, 2959, -3816, -5957, 1771, 6712, 1977, -4667, -2737, 1959, 1522, -2023, -1679, 1800, 2701, -229, -2402, -1831, 281, 3003]
1891C003O59m221m126K434N767J16n462p23N874J056o807l089O296N996l864o577
1907c668L07M809J185k553n42J608Oj621r38J42Q22K681J362l322m464J633N394
1924B841R24n009r22M740J347n740k879O233N734l784p000j49N458J482k558r23
1940b05J420M55j139j481l71Q32K941R83l740n165K175P002O94n693k894M811
1956F25L019n260l900M692O039k281o711n94M378K615j437j481L03j37o45r5j51
1973a021N71J899K030l461m911R16O929J433n905k732L875L421m028l900M620
1988b64N462k582o899j028M881L598j794k136k97N22O92n7o77l63K046K206l003
2005C07n160J229P525K500o543m581L889M512l082m302K819N695j418n918j384
$$ y = [3003, 3662, -559, -4685, -2251, 3516, 3632, -1830, -2553, 3321, 4377, -2430, -5519, 777, 6773, 2909, -3668, -3361, 1448, 2633, 80, -462, 1146, 1152, -469, -1407, -1265, -443, 2238, 3600, 278, -4186, -2553, 2841, 3765, -1244, -2166, 2574, 3921, -1819, -4698, 1535, 7269, 3485, -3515, -3664, 1794, 3276, 718, -205, 1215, 1670, 531, -950, -1321, -489, 2452, 3435, -305, -5470, -3295, 3707, 4401, -1292, -4186, 625, 3644, -1616, -5516, -824, 5215, 2934, -3777, -4371, 7, 2622, 1185, -296, 7, -130, -775, -870, -1021, -450, 1449, 3479, 18, -4893, -3977, 2952, 4385, -1520, -4252, -377, 3044, -984, -4884, -264, 5198, 2616, -4283, -5311, -430, 3168, 1374, -762, -1059, -537, 155, 98, -579, -942, 1104, 3310, 307, -4853, -3624, 3901, 6401, -142, -4723, -834, 3678, 596, -3706, -887, 4808, 3390, -2528, -3912]
2020c912M129K940p27k382p48m45Q04J125M8p14J279K067k607m602Q19O909K370
2037F353o030m851L715M843k235m378K124N032j352n912j682M567L802j038k788
2052A70j294m75J743J687n35k128P02L388j364n132j82O739L688n572o222K440
2068b347O057r43m210O36M097M4m768j790L379L146o58k482j692o56J677K400
2084A890n15k649R8K866p86m622k24O020L272n154n748K524O392n59n012j14M174
2101A853L18l880k162K928L827J3k414k560n74K579L259j671l644m3L722P95m736
2118b390j574N409M319m750o657J731O500P70m242j440L578Q04k869j660K461
2133a0K221k49j819j864q02K227L587p56l811q24L780O41l980k332N447M194m776
$$ y = [-3912, 217, 3157, 2430, 48, -700, -1145, -341, 784, 832, 118, 1397, 3464, 857, -3745, -2926, 3983, 6353, 323, -4528, -813, 4030, 1795, -2583, -459, 4573, 3221, -2691, -4373, 194, 3996, 2958, 170, -1124, -1599, 144, 1831, 1296, -832, -130, 3258, 1894, -3238, -3420, 3319, 7007, 1435, -4787, -2347, 3710, 2767, -1443, -807, 3290, 3334, -1434, -3224, 155, 3301, 2643, 161, -1531, -2187, -510, 1890, 1375, -1274, -1176, 1690, 904, -3718, -3942, 2078, 5350, 196, -5552, -3028, 3364, 2805, -2207, -2321, 1853, 2171, -1709, -3871, -943, 2884, 2897, 483, -2077, -2651, -72, 3187, 1516, -2128, -2171, 1551, 2346, -2390, -3964, 1445, 5764, 1014, -5643, -3912, 2588, 3358, -884, -2324, 1254, 2058, -811, -2471, -10, 2211, 1962, 143, -1721, -2523, -296, 3291, 2535, -1276, -2100, 1680, 2321, -1659, -3991, 1456, 5650, 874]
2150H74n982J696O682P91m801j669L061J226k097j884J967K289M65j265k425j479
2166b551K921L600n04m586j658M293K340l649l008L906M746l740o068N72O089
2181B703J723l979k740K126J841j114j780J016J580P9j002j680j122J824L728
2196C203l6m706j916L966K647l054l565L412M858k624o343K97O646J942m193l832
2212c298K055K803p24j923M20J000P41p5k104k078J451M683R1m870k672L898L815
2229C213k210m650K146M794j150n877n78N456L104l895k915P48K459K82j661J7
2245g17J76J065K48j843j907J299M683J75m804k932L582M135k295m254J175N411
2261C197p67n811r10N603K969l415l757L70L150R14j180n68k21J110Q65j544k571
$$ y = [874, -5108, -3412, 3270, 4061, -740, -2409, 652, 1878, -219, -2103, -136, 2153, 2618, 1353, -1072, -2551, 370, 3970, 3466, -1120, -2778, 1515, 3855, 206, -2802, 1104, 5850, 2110, -3958, -3386, 2703, 4426, 447, -2293, -167, 1674, 560, -1220, -204, 1376, 1455, 453, -1227, -2349, -525, 3203, 3167, -1539, -3455, 511, 3158, 104, -3461, -49, 4809, 2185, -4158, -3861, 2785, 4727, 534, -3298, -1243, 1560, 836, -1087, -667, 333, 1074, 999, -1105, -3183, -1732, 2951, 3042, -1828, -4500, -602, 3213, 1003, -3647, -1501, 3293, 2143, -3734, -4312, 1144, 4248, 353, -2562, -1814, 645, 927, -734, -717, -541, 524, 772, -1071, -2978, -1679, 3004, 3179, -1625, -4557, -975, 3160, 865, -3389, -2214, 3197, 2430, -3381, -4291, 1312, 4281, 866, -2891, -2521, 629, 1543, 363, -205, -426, 684, 1549, 5, -2566]
2278b566O69M822J116m881l600L321M856j297m898J00N149k4m925j693M545L308
2294D002k567l087q0K227O88l27q76l42P24R38q91k282M49L680J773m514m087
2311d572L129N186j210n534P83M806M54m555k467M035L566k159l344n34K226J670
2327A480N3j193j682R75J832n29k808r09M349K727m050m479J835N741K5n567j026
2344c226M317J435l891k563L371L268j695l168n22J391J853K78r77j581K15J961
2360D66N87l130p70L654K855l762m794J856N834N33n327j469M283K067l604k844
2376c565K683L453p43l321j375J467K313N93j041k570k63K931Q87l042j823L474
2392E8L383l010n007J179N588J575m891k732L495K546j983k913J794L061q4l092
$$ y = [-2566, -1897, 2925, 4041, -840, -4440, -1119, 3737, 2440, -2458, -2358, 2791, 2767, -2158, -3851, 694, 4002, 1435, -1652, -1732, 495, 1183, 856, -20, -362, 362, 1300, 409, -1873, -1424, 2256, 4029, -485, -4572, -1443, 3743, 2533, -3001, -2218, 2588, 3042, -1513, -3980, 55, 3621, 1462, -1882, -2416, -190, 1480, 1533, 340, -1342, -367, 1465, 936, -1872, -2781, 1568, 4295, 245, -4234, -2399, 3342, 3367, -2200, -3226, 1091, 2526, -1365, -3928, -557, 2711, 1016, -2152, -2674, -1283, 570, 848, -129, -1710, -1495, 466, 1053, -2077, -2847, 807, 3662, -100, -4894, -3038, 2796, 3329, -1998, -3467, 816, 2883, -721, -3565, -882, 2571, 1828, -1493, -2868, -1401, 912, 1505, 464, -2106, -2369, 562, 1449, -1593, -3416, 58, 3441, 431, -4576, -3397, 2191, 3766, -1125, -3857, -362, 2184, 201, -2712, -918, 2143, 2059, -1033]
2408a033j027J029J730J379r27k548m14K571J551k984j873K963L135k659n016
2423d123P70N727J683n006k640K813L482k339k524O34L271J99k394j554K72K552
2439H23J516q00l169r79K731K416k149k845J917L835j105n491j22N426K237m160
2455H1l575K270L122r28j938j55K344O48k495j330L21J905J669j57l505j466K789
2472d00L329k230l293J234L949j159n131P8N110K718m073m213J520M060j58k695
2488a354n03J916R63j060k166L60J514K541l85l685k130L163L611j557l855O80
2504a947L610J49m351j143M823K994l865m005J198L657L09k121q63J508Q41r82
2520a88j109o97J605K297ll337j969K900L531r43m346m17M742L86m116j815M354
$$ y = [-1033, -2060, -1031, 699, 2078, 1151, -1397, -1811, 760, 2311, -673, -2546, 417, 3552, 893, -4123, -3353, 2374, 4057, -949, -3589, -776, 2706, 367, -2157, -1523, 1748, 1947, -447, -2001, -1729, 823, 2339, 1539, -1630, -2609, 122, 2538, 389, -2456, -539, 3296, 2191, -3300, -3422, 2004, 4241, 81, -3494, -1224, 1898, 970, -968, -1123, 1221, 1869, -626, -1956, -1635, 270, 1939, 1782, -1723, -3189, -400, 2929, 699, -2594, -1360, 2589, 1430, -3701, -3623, 1487, 4205, 132, -4081, -2561, 1499, 1341, -1354, -1857, 59, 1022, -38, -2204, -1844, -330, 2211, 1826, -1859, -3989, -826, 2785, 1228, -2627, -1947, 1663, 1812, -2539, -3682, 1141, 4135, 270, -3735, -2537, 1120, 1429, -692, -1555, -47, 794, -188, -1297, -1994, -389, 1908, 1905, -1432, -3401, -501, 3030, 2087, -2259, -2676, 2066, 2452, -1664, -3479, 875]
2537H75L429k910m306N52L511J248j990j498N93J056L7j021q47J044J748P12l201
2554i68k571K514M055p58l856j334M138J391l236k449L504L251k375l888L50L553
2570A321J167j894j366L88N94R19q42j057M54K117J151l230k496J777M393o2n114
2587a780j311L574K728l676k731K846L833j833m244m70L526J736j194k193l48
2602a537R61J256R9j667o15J899K079k706l409J811M689N63n221k092L659L058
2618B827k662k965J605L563r54l843m78K730K242j011k247q46J015J443M78j596
2634f99r51J939J879j850l547J260M779N22m594k379L104L694j925l634J368L453
2650B419k30l794j251K542K324m03k106j258N60K126P66j872j886J738K758j672
$$ y = [875, 4304, 1394, -2912, -2360, 1151, 2399, 409, -1089, -496, 560, 597, -424, -1271, -227, 1521, 2233, -968, -3539, -1025, 3030, 2272, -1584, -2918, 1220, 2611, -625, -3074, 430, 3681, 1306, -2582, -2232, 1321, 2488, 594, -772, -384, 210, 1129, 287, -770, -316, 1801, 2952, -278, -2774, -997, 3396, 3334, -1780, -3091, 483, 3211, -465, -3196, -350, 3483, 1650, -2594, -3064, 462, 2198, 1004, -1189, -1537, -576, 680, 779, -888, -1503, 396, 2475, -231, -3640, -1829, 2860, 3423, -1798, -3890, -231, 2827, 165, -2800, -1195, 2368, 1414, -2429, -2907, -177, 2065, 1054, -1193, -2039, -1024, 419, 897, -699, -1650, 289, 2168, 318, -3229, -1969, 2810, 3332, -1262, -3641, -537, 3157, 1232, -2402, -1034, 2419, 2189, -1605, -2856, -314, 2010, 1607, -499, -1757, -1197, 929, 1695, -177, -2063, -325, 2433, 761]
2666G61l283L82M595J297m227l171L054L453j154l019J76K897O23l011j454K085
2682DK337n38j610j728L49K201J353j583k144J155K644q10l812N0M391J685l602
2699C42l894K730M249q40l863k80K833R09k302j660J281K271N04k016j758O6K394
2716I66J641j672k987J123K692j90l341p89L936K492l748l840K059L944l73k902
2732i89r01K288J275j705j503O46K381L73j368k406M4K036K242j447k710J29L165
2749A550N94l677j312L505K903k977l871J184M121P94l407j491J947J632j153
2764C42j956K83J742J239j060j479j160K045K493r68l367l40L065J372l154j856
2780b759L374L310k922m057R75L932O09k569j796J807J795p19j059o12J385R71
$$ y = [761, -2522, -2140, 2455, 3752, -475, -3646, -592, 2861, 1707, -1312, -1136, 1761, 2384, -627, -2081, 4, 2341, 1803, 193, -1535, -1186, 1015, 2368, 785, -1359, -204, 2440, 1630, -2182, -2132, 2259, 3944, 342, -3552, -822, 3427, 2587, -1276, -1556, 1277, 2186, -116, -1776, -495, 1776, 2280, 264, -1494, -1428, 966, 2607, 935, -2052, -929, 1763, 1573, -1768, -2557, 1379, 3871, 123, -3717, -1658, 2286, 1913, -989, -1890, 398, 1673, -32, -1535, -889, 1492, 1865, 497, -1909, -1865, 171, 2413, 966, -1744, -1615, 1550, 2144, -1533, -2845, 660, 3563, 586, -3285, -2101, 2020, 2814, -593, -2084, -137, 1495, 342, -1614, -1331, 411, 1650, 590, -889, -2049, -4, 2489, 1521, -1846, -2186, 879, 2251, -903, -2759, 615, 3925, 1003, -3054, -2079, 1853, 2462, -107, -1903, -96, 1699, 980, -79, -691, 694, 1665]
2796A665m51k323q71K328K777j045l320o38L279J931l487k302K559L728k252l921
2812b343M02L881J520k802k272J047J756J72j184r63P72J385M13j731j771J267
2828d51K989j8l782j100L151K549k655k776J807L516j319l645l83L486J831k325
2844H75k430Q55K030L18j293j077K66J705J30j200k351J563L365Km058j602K868
2861c4K784j794l542J234L665k22l897p64L353J940k068k150m2J927J131r17j295
2878f91m0J206J050j311k277Q08L023R41l628k473K880L170j663l301R04K972
2894A570Ml158j126K765K537j477k760p9J563J363l36j770m17J272J456r94k135
2911a722M39L659M87l491k860K643L937j348l912J6L742N25l028j422K025K552
$$ y = [1665, 1214, -1109, -1980, 348, 3125, 2080, -1240, -1878, 1401, 3332, -155, -2457, 102, 3830, 1578, -2343, -1941, 1940, 3460, 658, -1614, -567, 1189, 1361, 177, -786, -14, 1371, 1784, 53, -1718, -451, 2538, 2520, -1262, -2362, 789, 3338, 683, -2093, -286, 3230, 1911, -1734, -2117, 1369, 3200, 875, -1555, -700, 1330, 1648, 355, -722, -456, 1249, 1379, 179, -2172, -609, 2756, 2758, -1300, -2902, -34, 2750, 956, -2586, -1352, 2313, 2091, -1806, -2570, 783, 2723, 655, -1495, -1537, 390, 1521, 604, -691, -731, 475, 1525, 214, -2063, -1255, 1768, 2709, -919, -3392, -512, 2658, 995, -2306, -1402, 1570, 1574, -1584, -2710, 55, 2592, 1115, -1645, -1724, -161, 1202, 866, -904, -1321, -49, 1407, 413, -1722, -1283, 2376, 2863, -628, -3488, -845, 3092, 1744, -2168, -2152, 1590, 2115, -913, -2335, -310, 2242]
2927B242q12k620m49J085J773j86j309q95J042J528o76k301j06L091J423l215
2943c85k697K213L991q15l435o60K958J171k670j475J986K072k42k745p06R95
2959d44J873K55j608j309M40K232pk452p85K892K226l038l469J446M329k24l608
2976a251j008K537J836j968k112J223K206R9k093j401R22J679J029j286j897M6
2992a439K434O97k874j028K484K173k157l173Q83M199M22l476j669K458J920j226
3008F28k216O93J953K92j657j521K07K075J125j344k213L72K171J191k512j623
3024b379K071K656j668l747L95M375R07l125k535K346K290j075j582L21J196P35
3040A181j178j478M81J685J403j116k879K79K302J591k298k126J900K424j316
$$ y = [2242, 1430, -1190, -1639, -554, 1219, 1033, -276, -1171, -129, 1399, 723, -1578, -1684, 1407, 2830, -385, -3082, -869, 3122, 2307, -1128, -1788, 1170, 2341, -329, -1804, 182, 2254, 2012, -733, -1439, -444, 1429, 1684, 76, -1233, -793, 1439, 1432, -1020, -1805, 1087, 3313, 275, -3194, -1748, 2581, 2357, -1251, -2259, 278, 2114, 146, -1966, -743, 1463, 1562, -531, -1932, -1010, 669, 1698, 412, -1485, -1439, 995, 1692, -1182, -2210, 274, 2447, 290, -2883, -2000, 2199, 2621, -855, -2524, -66, 1854, 628, -1588, -895, 1058, 1350, -307, -1828, -1621, 454, 1579, 235, -1978, -1606, 565, 1756, -756, -2379, -308, 2348, 680, -3067, -2672, 1703, 2610, -515, -3050, -704, 1586, 511, -1071, -750, 446, 1181, 3, -1475, -994, 691, 2094, 978, -1901, -1622, 680, 2271, -27, -2153, -253, 2171, 855]
3055H55l331L22L648J096k581k556J532K490m94j982l34J460P30m49j674RJ506
3072B47J472o23k299j019K913J940k062k719J437K857q01l130n91L386J880k769
3088A19k571J103K641J62j519j222J120R38j68j333p23J328J858n89k524j178
3104b558K655K199j608k822M65L428J29l456q83K980K290k522l129R09L064N37
3120A678j736j389O81J227k28q75p62O69K070p6k622j678K440K796j208l556J65
3137b404L408O66l362j439K955K558k101k956N21K448J087j429j390K50J061Q70
3153G43q65j396O26K160J34k610j656K089L112j039l283m49L124J536k896j873
3169b543K140K428j493k760L29K145J293j091j764JJ297R91q66j366o4K027Q25
$$ y = [855, -2476, -2154, 1494, 2590, 9, -2547, -1015, 1475, 981, -1001, -1335, 125, 855, 406, -1268, -1259, 247, 1719, 1096, -1203, -2222, 691, 2631, 569, -2150, -713, 2144, 1343, -1787, -2378, 1008, 2888, 119, -2452, -1349, 1292, 1454, -65, -1287, -167, 771, 603, -730, -1453, -125, 1733, 1144, -1380, -2558, 97, 2296, 688, -2134, -1669, 1759, 1888, -1568, -2451, 529, 2819, 297, -2832, -1923, 1141, 1678, -58, -1447, -766, 461, 233, -642, -1404, -735, 1335, 1259, -1363, -3041, -601, 2195, 987, -2569, -2404, 1004, 1670, -1692, -3131, -176, 2382, 281, -2675, -2154, 294, 1381, -48, -1438, -1188, -127, 743, -122, -1518, -892, 1268, 1402, -1208, -2864, -775, 2337, 1298, -1985, -2434, 690, 2226, -670, -2543, -403, 2025, 532, -2228, -1899, 246, 1539, 448, -1316, -1315, -18, 973, 107, -1259, -1323, 704, 1529]
3186A529k174k077J645L549o16l868l17L137J378k118k411J763K553n92k687p10
3202b016K252J647q66j779m42Q96J628l66j707l52J787J338j801k514J443L636
3218B784p07l207j270K864J930k078k176R63K413k94k258o71J514J767l97j590
3234d13r51R28J360J65j925q69J933J575j392k722R50L252M68l488j620K293K528
3251B072j366k508N55K328J77k303o17J171J597r0j605r72O13J644M67j744j238
3268a819J477K200j541k557K53L171J031k932j904K155K252j020k288k46K593
3283H25M96j861r45P89J220Q08j716j279P1K294J103k292j713J441K426p85l090
3300b208l8L239J875l181k443J761L049o36k528k64J901O32j323j079M29J725
$$ y = [1529, -645, -2722, -1077, 2472, 1856, -2012, -2329, 808, 2186, 68, -2343, -580, 1973, 1381, -1306, -2016, 236, 1883, 1017, -762, -1204, -308, 1320, 954, -753, -1105, 682, 2020, 219, -2295, -852, 2784, 2077, -1130, -2400, 464, 2394, 316, -1860, -897, 1516, 1222, -1036, -1707, -193, 1574, 1177, -413, -1364, -436, 924, 1089, -836, -1705, 228, 1803, 411, -2311, -1361, 1891, 2359, -1129, -2749, -456, 2072, 706, -1802, -1247, 1081, 1258, -1045, -1662, -491, 1106, 1016, -589, -1561, -948, 696, 1163, -581, -1819, -342, 1858, 317, -2240, -1987, 1184, 2215, -717, -2621, -466, 1786, 766, -1522, -1768, 825, 1321, -540, -1485, -696, 524, 1332, -384, -1663, -1592, 702, 1805, -487, -2200, -759, 1667, 882, -2208, -2246, 993, 2868, -313, -2756, -995, 2054, 1418, -1110, -1374, 527, 1159, -164, -1243, -814, 911]
3316I11N30j369j236J01J963R52j535j888R79K043m3k745n73L047J660k679k299
3333b181J169K664Q3k553p85J834J178j028j263J51J668Q84j367j545j77K186
3349I18J543j863k262N81K869O0k661r88K525J669j858k600P61K632P20k265j390
3366a609J422J358n68j413m27J309J162o67j681n15J859K014j443k230j58K966
3382A379K87k519j158K273K241j675k879N69K651R58k367j383P36J508K19j344
3398e04n30O81J594q47j262j114J540K508q53k831n19L004J295k559j829J639
3414e87K570j413k259KK533J095j690j997Q62J481K83j119q30O29J281L57j663
3431d65j159J318K163o28k515p92K729J552k092k108J506K645r18k464m86K608
$$ y = [911, 1441, 72, -1164, -1063, 900, 1852, 317, -1571, -592, 1451, 1408, -1337, -1910, 1137, 2797, 118, -2181, -1012, 1652, 1735, -818, -1603, 231, 1409, 381, -882, -731, 937, 1821, 454, -1091, -1268, 918, 2461, 598, -1664, -1083, 1786, 1846, -815, -1803, 722, 2391, 533, -2067, -1306, 1326, 2046, -219, -1609, -187, 1171, 603, -810, -1237, 72, 1234, 567, -1114, -1629, 230, 2244, 801, -1429, -1587, 1379, 1666, -853, -2011, 262, 2503, 828, -2051, -1482, 1169, 2127, -240, -1623, -887, 621, 840, -504, -1034, -353, 1241, 394, -868, -1982, -442, 2066, 1213, -1618, -2137, 867, 2162, -397, -2226, -587, 1983, 570, -1689, -1687, 846, 1941, 251, -1746, -884, 597, 880, -239, -1069, -440, 841, 1198, -465, -1624, -306, 1857, 1229, -1286, -2078, 651, 2203, 111, -1997, -491, 2154, 1236, -1228, -1714, 894]
3447H94J017j637j408J99J424Q49j004j254M74J359M49j426j398J076K083K58
3463A955k859j025K421J544j465k320J113K456k07k628l56J966J288j085j882
3478a084j37J438J010o18j136k03J316J053j372j326M76K294o8k507j045K071
3494A62K386j589k672L29K817J54k213j140J887J470o45j948k21J063J149K00
3510A189j829o23J118J110o81j866L33K774K30k770j683K123K640j212k711j61
3526b019K580P94k021q56J485J436o99j460p72Q94J881m84j437r84J342J614n84
3543G10k015j72K520Q61k685j636J829K385n54k663l42K227J104j746j272R94
3559d55J578m94j392r15J302J329M62j481j502Q86J958M8k445l96K271J125j956
$$ y = [894, 1911, 274, -1134, -935, 489, 1338, 334, -920, -446, 913, 1362, -64, -1462, -386, 1697, 1955, -904, -1929, 492, 2036, 571, -1749, -636, 1820, 1613, -1015, -1371, 595, 1883, 798, -1084, -1221, 217, 1227, 609, -527, -730, 586, 1639, 267, -1059, -583, 1711, 1643, -864, -1909, 162, 2548, 959, -1713, -1384, 1433, 1587, -626, -1766, 121, 1591, 946, -1002, -1223, -160, 989, 1189, -640, -1263, -145, 965, 284, -1582, -1249, 1525, 1755, -1015, -2698, -575, 2065, 853, -1858, -2019, 561, 1355, -666, -1522, -37, 1399, 700, -760, -1532, -638, 1243, 759, -678, -1662, -320, 1294, 710, -1305, -1477, 1043, 1904, -781, -2417, -588, 1797, 1243, -1420, -1762, 465, 1569, -177, -1449, -455, 1123, 629, -763, -1678, -376, 953, 1415, -66, -1568, -682, 1276, 1324, -1121, -1517, 754, 1879, -77]
3576g7k354J662K655n66k267q89K356J364j523j370P76J319J55j344j117O95J563
3593A038P87j799j439P39J905Q0j649j076J816J660k036k257J477K731J79k957
3609h01q68J602J525q76j347K39J192O03j021j124k4J677O08q47j613q8K200P61
3627A798k124j160J873J602j191k581P82K682L46k516j423J757J703n36j834p8
3643i00J541J93l62j293J05Q61J105p63k150N50K059R11k043j470J619J629p86
3660H06k190j19K358J101k319j411J268J815m36j585k99R47J066k84j207q83J151
3677b21J441p33j481k57J970J409k258j567J184K568r58k473pK179J178k063j748
3694a837J132K106l66j155p10Q12O90j30q07q70J102J122j21j822l16J802J559
$$ y = [-77, -2431, -769, 1886, 1320, -947, -1836, 520, 1884, 361, -1009, -233, 1086, 1241, -103, -1220, -525, 1038, 1825, 26, -1413, -674, 1231, 1311, -338, -1414, 402, 2062, 26, -2231, -754, 1977, 2156, -801, -1669, -67, 1458, 582, -765, -526, 666, 1269, 248, -876, -900, 777, 1385, 538, -1075, -1163, 1037, 1798, -326, -1486, 387, 1989, 798, -1783, -1001, 1681, 2027, -489, -1912, -155, 1548, 1012, -822, -900, 641, 834, 472, -821, -716, 145, 1250, 487, -1663, -1113, 946, 1857, -186, -1656, -37, 1592, 806, -1384, -1503, 855, 1956, -363, -1774, -506, 1309, 873, -712, -1011, -64, 1002, 718, -489, -1372, -221, 1220, 487, -994, -1251, 719, 2128, -130, -1697, -513, 2055, 1097, -1376, -1383, 796, 1974, -89, -1837, -705, 1401, 1035, -120, -830, -18, 672, 542, -265, -1135, -33, 1089, 968, -854, -1170, 632, 2191]
3711B191j989j534P09K240j44k225l96K094J046j644j753P46J705J78j095r27
3727g98N50J211J44r39r49Q78J225Q0k473m73K137J637j461k473J108K068M23
3744A895k704o52J848J229j049j608K71J414O15p39j246K31Q89L68r13q23K79
3761f95J878K08k134j143J623K267j173k468J57K126O18j927j186J672J380p06
3777D97j777p6J430J112q35j624M2J413R75q86j330m2J777N99j814j522J444K509
3795A892q96k612mJ942J097j950j215J421J512m32j809n31J452R12k12j468l69
3812a270J436Q73n03j339l27J546R17j676j198Q87K400n84k473j09J840J233j580
3829G3j393O52J808j93j628o11J281R51k63j326k85Q36J128j79j475m98J521J159
$$ y = [2191, 202, -1332, -623, 1617, 1473, -752, -1148, 946, 1992, 348, -1405, -659, 1046, 1224, 129, -798, -248, 963, 1107, 168, -781, 97, 1322, 1402, -1071, -1544, 593, 2230, 769, -1704, -596, 1472, 1895, -809, -1461, 387, 1616, 567, -1041, -770, 644, 1259, 520, -726, -495, 394, 762, -151, -974, -695, 1183, 1391, -743, -1886, -263, 2004, 831, -1637, -1480, 646, 1264, -663, -1849, -177, 1203, 497, -1280, -1356, 74, 1186, 351, -1273, -1231, 182, 1157, 271, -1059, -1101, 676, 1275, -539, -2061, -617, 1892, 996, -1616, -1620, 322, 1419, -531, -1746, -325, 1187, 755, -1054, -1585, -133, 779, 567, -901, -1270, 166, 1039, 536, -803, -1130, 416, 1333, -343, -1541, -654, 1746, 1162, -1311, -1420, 420, 1653, 73, -1320, -668, 1140, 947, -681, -1292, -11, 940, 677, -649, -934, -98, 1030, 851, -624, -1122, 399, 1558]
3847A558j424j545N69K539n16j961r39J956J448j145j661O79J398J17j382o19
3863i28Q33J234k88j352l85L45J749m16j270n77J498J175j033k077N61K324K22
3880A615k265r77J784J658j064k320Q85J163Q87j296j040N47J233K2r88r21N43
3897e34J702l73j123r46J086J486j072j721L43K092O17j980j545J647J633m54
3913H58k127J39J348Q16r09q95J91J153J71p78r49L00J484J01r80j551J118J821
3931A311m55j895p3J838P17j803j328J193J907p80j565k25R96O34m32q64O3J185
3949D24M89n96j290j64J711Q54j354j380N75K188j59k078m21J791R51j605j549
3966a613J112J627qj240r52J328O76n55r35k10J119N44k98j382j17J565N61j244
$$ y = [1558, 134, -1411, -842, 1697, 1181, -780, -1719, 237, 1685, 540, -1121, -442, 956, 1073, -309, -928, -95, 1139, 851, -501, -886, -541, 1208, 792, -478, -1055, 443, 1618, 585, -1492, -931, 1393, 1615, -650, -1627, 157, 1815, 751, -1569, -684, 479, 1366, 70, -970, -423, 810, 832, -156, -1077, -534, 1168, 795, -328, -1274, -188, 1298, 226, -1495, -1152, 940, 1557, -423, -1968, -321, 1312, 858, -1269, -1130, 218, 1034, 125, -770, -579, 574, 745, -33, -982, -682, 802, 903, -77, -1628, -510, 1311, 856, -1039, -1112, 726, 1443, -360, -1688, -495, 1412, 632, -933, -1158, -162, 472, 40, -824, -761, 424, 913, 317, -973, -1137, 574, 1428, 74, -1306, -731, 1457, 1298, -780, -1201, 590, 1541, -64, -1613, -501, 1126, 1118, -122, -1074, 254, 930, 375, -560, -770, 349, 893, 595, -787, -904, 661, 1222, -22]
3984b2j248P18J729J24k225j77J470Q88r03j902J188J299N08j521j015R07J112
4001I30l36o58o54P65Q35k68j269m13J385Q41m42k329O43J958O17j887j066J311
4019c7J512q49k005L49J722N26j388p98J42J148J89q28o83O18J137r6j193n96
4037a130R31J561n92j883l04J987R60k013p55J001J393n43j853J95J506O21q94
4054A88j316M31J040M81q21p43K63R81K01j118p42Q73J545o42j597p17K258J149
4072A714j880j211J067J299m71j246l75J496N85p42q33o2R08O60q57n24l51J190
4090C67N77r56j085J087J273j56j831p99J922J182j445j495Q19J659j00j647n93
4107a221J454R04p13j240J71J106O00l17j178k80J204O55q89j473P24J695J22
$$ y = [-22, -1270, -552, 1177, 1301, -924, -1101, 369, 1257, 354, -1548, -360, 939, 1447, -74, -1089, -182, 930, 594, -64, -718, 47, 882, 614, -655, -1068, 317, 1158, 716, -1613, -970, 988, 1605, -282, -1348, -37, 1475, 626, -1379, -1030, 692, 1218, -170, -968, -826, 322, 511, -317, -1000, -382, 755, 659, -534, -1130, -199, 1362, 770, -1113, -1417, 570, 1530, -483, -1238, -237, 1156, 613, -1240, -1045, 461, 1082, 188, -1128, -697, 343, 824, 3, -740, -477, 504, 705, -413, -1155, -282, 1263, 621, -976, -1693, 565, 1714, -166, -1377, -310, 989, 518, -728, -1103, 393, 978, 236, -597, -659, 249, 909, 52, -472, -823, 367, 944, -12, -1097, -10, 1263, 1107, -724, -1523, 399, 1581, 136, -1359, -540, 1119, 1019, -628, -1221, 233, 1137, 424, -816, -645, 461, 1061, 744, -434, -714, 490, 1145, 256, -1217, -493, 1202, 1324]
4124A324j867j087J850J336j039j838P50J274K94j249p27J124Q99m91j063k33
4140g43N72J255q9j488k34P42J043m31j638K93J284M17j441r59J217J823j148
4157D75j378j74J590Q86j542r78R53J002l02r79l04P02R22j41j342l68R87R02
4175I11p01j356MJ823M17j629q17Q62J814o68j932m6J612P04r06q86K67Q65J14
4194D52p83o97P63P00N26j369l71N12J525m71j732n2J354J103j512j503J153J754
4212A352m54j619m80J397N93m63p77q3J207k23k58q91O8J193N21j195j046M84
4230f74J903l45j405o96J558O14r50r09M52J576p6j467q06J181R47m54j009Q0
4248d80P53K44n93n89O2J070J96l40j261K18J389K38j256q40J199J017r29j209
$$ y = [1324, -543, -1630, 220, 1556, 517, -1321, -571, 703, 997, -252, -979, 145, 1044, 553, -510, -743, -171, 1084, 995, -493, -727, 15, 1058, 627, -1011, -718, 566, 983, -458, -1417, -200, 1623, 475, -903, -1077, 513, 1399, -143, -1121, -168, 834, 532, -447, -751, -49, 873, 732, -610, -978, 9, 911, 210, -1146, -1142, 681, 1098, -531, -1348, -486, 1328, 660, -1272, -1318, 294, 998, 92, -794, -527, 338, 452, -331, -1028, -265, 435, 961, -408, -779, -267, 1258, 787, -945, -997, 357, 1460, -52, -1555, -402, 1352, 898, -721, -1201, 196, 789, 326, -451, -534, 673, 450, 192, -699, -631, 562, 1083, -112, -1158, -674, 1229, 884, -521, -1217, 341, 955, 5, -904, -452, 1124, 1048, -419, -1225, -44, 903, 449, -560, -480, 273, 517, -76, -665, -603, 467, 663, 323, -938, -720, 669, 907, -349, -1189, 10, 1027, 98, -1111]
4266a111M49J634M1j287j113J498Q16m79r19oL98Q52k69j206o6J036Q64p68j334
4285i70q5J672L50j156j167R74J548n83j762L85J395M98j457q30N27J517j68r34
4303b46m24M58P50l73l75o70J011P14k66j708K12J406N74j351r70Q36J339k73
4321F44j462m09J778M41j203q19M52J045M93j238n35N36N94J66q15m55L63J542
4339A118m27j310o15J576J028j229j351O21J443k7j776J25J218N12r61r82M80
4356e57J016N80p49p04J66O20K82n52p44O32Q64l35j348k30Q81J350p09j460O08
4375c89J680j65j503o03J105N63m03r56N18N56L52n67n76r6O48N65n60j068O27
4394b72J137j23j169q09J524O80o54j360M04J543J17j362r17J234Q90o44j202
$$ y = [-1111, -662, 972, 1013, -274, -1387, 111, 927, 448, -471, -477, -79, 773, 504, -702, -768, 268, 1132, 364, -970, -1055, 617, 967, -189, -1356, -382, 1166, 583, -1179, -794, 601, 1099, -358, -1188, -661, 856, 688, -246, -670, -212, 538, 165, -210, -880, 131, 845, 579, -1129, -917, 489, 1063, -288, -1258, -422, 917, 644, -818, -1227, 551, 992, -211, -1030, -578, 467, 960, -278, -813, -277, 317, 483, -332, -787, -424, 1118, 691, -619, -1234, 342, 1370, 141, -1210, -589, 854, 827, -949, -824, 394, 906, -55, -1037, -557, 459, 1039, 290, -414, -248, 372, 654, 102, -642, -10, 854, 519, -829, -1059, -178, 1172, 463, -997, -389, 1291, 1126, -377, -980, 125, 688, 285, -671, -153, 403, 755, 188, -388, -484, 164, 729, 169, -899, -272, 865, 742, -427, -1236, 288, 968, 314, -1046, -642, 901, 1018, -344, -1261, -27, 863, 219, -983]
4411i83M47Q71K62l97q58K21O12L40n25p26L29Q76J79j238n28R78J510j071j406
4430a107Q4J469O77j265j102J024J102l17j219j90O93O49k12p63n41R16Q31l87
4448C42j065j63J098Q94j360j160J135J046l76j232k47J364R88j146j087M70J013
4465E14J80j108k54N73N19J6p14o50J056N05P4j279k72J102O05j019r97J058R21
4484H30q9j324m81J308Q99q54j425P14R27j52n83k25Q45J13J72p81k90K17J091
4503I12k42j007p34J177J162j056j021L94J278J15j225q00J365P04o80r27J21
4520d64J062J44n68o86K00P97J6q09q0K45P63L31j165p66R98J096o15j208k5J468
4540G34J93j348q56J383N57j39j147k50J133N04o33n88j60R76L09o70p02J02Q44
$$ y = [-983, -536, 335, 597, 200, -658, -437, 175, 515, -10, -736, -407, 469, 648, -590, -1118, -140, 1370, 299, -1107, -1023, 446, 1123, -142, -1244, -220, 882, 565, -654, -844, -151, 498, 286, -477, -1018, -102, 729, 342, -723, -886, 212, 1106, -254, -1414, -279, 767, 391, -841, -1088, 276, 1264, 118, -969, -499, 514, 694, -414, -668, -95, 424, 440, -274, -924, 132, 637, 711, -568, -840, 262, 867, -152, -1149, -91, 830, 741, -583, -1064, 244, 1143, 289, -1136, -422, 505, 353, -230, -455, 390, 503, 675, -106, -396, -179, 912, 670, -337, -1071, 106, 1268, 212, -809, -415, 863, 978, -247, -1047, 318, 1022, 342, -585, -464, 598, 742, 174, -512, -312, 485, 501, -308, -388, -143, 620, 951, -214, -980, 18, 1114, 499, -709, -734, 734, 927, -421, -1277, 106, 663, 524, -623, -873, 260, 764, 131, -457, -617, 359, 668, -2, -704, -602, 242]
4559B42P03j275o39Q37R76k13j463k03J735K63j428p51R91J149l51j009n05J068
4577A27L27j34p85j74R29K52n41r19K69J223L67q85q83P71P53j71j157m73J272
4596A68O22j100o14L98J290j6p07o84O05N57j94r65J23Q60K87m12q60OJ065M39
4616H68r55n87L02J377j39j240m50J097R33j178p14L6J323J33r08n07M66P19o1
4635E15m96l87N49M69O2j162k18J034P22r92q79L20J282J23j464k42J068P41q47
4654A98q19K11Q40M45r48o74L70O25O54j157m43O45N87O9r65m28R69O27m80j239
4674i13L17J060L68j043j004J152P71m02j022J42J038K59q05p39J88Q80L63n38
4692G2p98M11Q13k0q29o36P22J131n42j262K13J007R45j381p66O74P54q2q00k19
$$ y = [242, 945, -330, -969, -132, 844, 631, -832, -1035, 700, 963, -465, -1216, -225, 924, 573, -436, -941, 127, 454, 320, -465, -639, 290, 542, 1, -918, -649, 574, 941, 56, -827, -56, 697, 526, -631, -1104, 168, 790, -310, -924, -526, 764, 748, 41, -643, -38, 519, 325, -640, -517, 343, 630, 218, -642, -636, 429, 868, -87, -674, -372, 1005, 866, -374, -824, 273, 1206, 28, -686, -650, 673, 806, -102, -609, -143, 576, 515, 19, -368, 181, 650, 712, -450, -668, 366, 1088, 96, -783, -463, 819, 942, -522, -764, 304, 1045, 198, -621, -410, 430, 875, -73, -747, -377, 248, 902, -255, -698, -53, 534, 603, -362, -790, 179, 806, 326, -913, -596, 464, 832, -211, -1215, -63, 708, 306, -716, -574, 464, 723, -82, -821, -633, 247, 610, 72, -726, -315, 498, 478, -351, -987, -265, 866, 324, -938, -725, 282, 1227, -154, -920, -246, 508, 426, -374, -593]
4712e93P97L92n89m48m09J050K26l77p13J40R08L61p62p34N82Q92l18j115l65
4731a075J376Q47j369q18N54J211j99q67j38N45N14m79n31n9M83O56l72q59j8
4750e98Q54N11q25q32O14R37m2r33l10R56M09o40r53P09O69J48p80n75P73N31
4770F23J50r36l92O86L23k35m98k65Q28L56k91r63J84J199P7j199m02O88Q23n07
4790B49j119M56R91K35p55o88L89M96L3l99l78O10L66L8j005j65L24R54o57r66
4810i91L00J099K52r47o90R75P60m25j089m8J032K22n45n67L15N63R5n72n98K71
4830e88J002J77p52p94P75J263p54p46j82Q91M06q13o02N55Q68j95r98j12P01
4849A02N31m01n87J53K01M50m37l77J41N15J40m30m37J44J001j16r14k84P60O55
$$ y = [-593, 204, 596, 7, -441, -850, 200, 426, 49, -664, -524, 384, 745, -17, -751, -169, 723, 405, -710, -1075, 301, 1148, -221, -1039, -485, 726, 527, -340, -478, 67, 581, 102, -429, -488, -5, 651, 279, -580, -598, 256, 767, -58, -890, -276, 661, 619, -314, -624, 332, 741, 101, -852, -143, 526, 674, -106, -681, 92, 623, 773, -163, -555, 131, 454, 219, -279, -544, 284, 640, 349, -614, -430, 769, 846, -353, -755, -67, 756, 249, -870, -414, 577, 812, 57, -631, -242, 254, 287, -112, -490, 120, 486, 524, -481, -646, -322, 632, -25, -991, -691, 408, 660, -287, -977, -2, 758, 333, -756, -804, 228, 450, -95, -662, -347, 216, 311, -261, -859, -588, 414, 591, -161, -955, -180, 1083, 329, -417, -599, 292, 698, -115, -717, -162, 706, 511, -487, -599, 102, 633, 232, -355, -202, -1, 449, 12, -365, -224, 291, 431, 1, -436, -292, 709, 593, -321, -605, 155, 810]
4869H10r80n49N51R58j04q86n98J165N06n91o88L27L55L17k77q84L24M09K87o35
4889a83m51M21N89N20j194m57R42N22l88q78Q7J122k68p43m50N91P91l22l84r3
4909b26K60L42k43m98k04Q79M84q24q01N90J033l37p52o57N91J263l43j195J18
4928e20Q45J46o08n82M47N75k2m73n37O39O35j35o64j84M71O28n37j006J12J224
4948D54L49j070o31N44J168n98o00l31J060M28r33o55O82N80P3n72o16M13R11
4967F56l76n62n72R25N35l97p85m3R54L18r22n92O38P53k00r93J6O95M60m95m35
4988d22J10P99k16l34o84M97L74M37r44l54N74Q76k50q83l67J051O06p25j106
5007i61M20J123m8q73k21P21O11k57j082k47J243L18o21l26k19O00K12k43q08
$$ y = [810, -170, -719, -168, 790, 686, -200, -798, 367, 873, 282, -406, -79, 276, 593, 316, -568, -244, 165, 452, -183, -634, -213, 376, 896, -298, -755, 187, 709, 321, -557, -470, 652, 384, -359, -809, -218, 573, 251, -133, -226, 34, 376, 133, -365, -569, 310, 794, -30, -831, -241, 792, 455, -297, -954, -363, 900, 557, -638, -520, 325, 471, -137, -719, -272, 303, 281, -192, -729, -90, 545, 410, -254, -438, 33, 661, 124, -882, -770, 454, 803, -267, -898, -354, 814, 216, -384, -715, 345, 773, -160, -815, -133, 447, 520, -52, -668, -255, 656, 280, -282, -854, 71, 606, 209, -576, -619, 335, 653, -269, -861, -223, 530, 330, -663, -647, 48, 508, 13, -422, -312, 487, 271, -63, -747, -250, 124, 561, -383, -737, -163, 713, 463, -420, -787, 264, 870, 145, -961, -541, 582, 534, -339, -560, 161, 772, 515, -567, -814, 429, 747, 126, -200, -419, 181, 393, 150, -658]
5026f58P00O88K0r20n67Q69N78l16r41J97N59L85o31p27Q66M22l24p55J47P02
5046B94K95n20m05k36P49L53m07n65Q2O59K75p06o72Q78L82m87p24K81R35J0m85
5067a4p54M66J053o37n00k78Q38J66R2q50q8L92Q28l36j175M32P14K19p33o47
5087h12P56M22k06p25j16R40O42j284k03O09K61K46r41k4j5O65J16o30l29M34
5107a94P33m32r13K0J178K65n24q93N59Q13m24o79m4Q37M51p19l10l7O30m4o55
5128c82J62rN14m9m65l53O03N34m1q01n00R23N87n24n14j3R53%r19j55Q09K07
5150E67m12n45L00K50N94n37o07J8R98k97m16r0P1M29O3m84m80P46P34q99p07
5171g04M06Q68J46j021l98N55Q98k01q83O0J25O42k36o45J9P74l9m06n51J57Q58
$$ y = [-658, 42, 730, 750, -170, -737, 132, 710, 394, -547, -350, 209, 594, -37, -764, 102, 524, 200, -555, -408, 294, 589, 69, -336, -572, 177, 530, 123, -442, -360, 299, 574, -132, -804, 74, 456, -31, -755, -474, 461, 471, -14, -768, -302, 751, 114, -386, -664, 174, 340, 432, -418, -506, -114, 714, 378, -797, -365, 349, 568, -165, -812, -56, 366, 160, -565, -681, 259, 901, -383, -586, 23, 284, 530, -411, -435, -450, 215, 331, -299, -628, -194, 539, 107, -806, -786, 392, 657, 133, -760, -201, 612, 188, -491, -535, 302, 753, 34, -276, -313, 317, 273, -382, -220, -229, 285, 236, -229, -582, 21, 555, 514, -287, -787, 136, 723, 199, -315, -328, 625, 625, -294, -449, 360, 567, 155, -390, -90, 160, 754, 217, -390, -372, 626, 329, -87, -177, -106, 323, 386, -98, -578, 168, 902, 3, -704, -298, 570, 716, -305, -703, -148, 750, 549, -334, -274, -149, 493, 257, -388, -369, 405, 366, -40, -591, -434, 424]
5192D24K8r47k32O54P59l73q61M06M68J73o80k85K00J017n26m26N2j77P08k16
5212A66m85O1L75N43o66o04L99M79K61q82m14O57N17l48m05l97J064J20n54l74
5232d87L26N75J23j003k30R27M32n11l19k42M25P10m72p03n6Q37L23n50n12J48
5252b59M12K50r39k08Q07O24o43k54p5L97L45o21j80L57M92p4m00n46P44k1K90
5273D98q35j81P13M85n75p21N68Q33j69r51j61O99N4Mp48J46P18L07j015N5l4
5294c10N58L74n88m15M66M05l7m37n35O07N46m53n41M34ML01m85m06P23J81q2
5315C10n81n2N66K72m54l16L8M00L03k42q89L14P48L27q93o25N51O22k62p07P71
5336B01J47J75o29o76N92M10J04n67j28N85K75m52m73j50L93O95m67m49K52M84
$$ y = [424, 452, -495, -727, -73, 686, 313, -548, -142, 326, 499, -181, -466, -266, 751, 225, -201, -149, -326, 382, 166, -319, -258, 117, 660, -6, -610, -211, 268, 529, -353, -767, -110, 407, 59, -346, -743, 321, 441, -113, -487, -161, 414, 537, -466, -696, 231, 663, 152, -167, -409, 16, 726, 254, -449, -505, 332, 655, 105, -407, -259, 153, 403, -536, -744, 63, 687, 44, -210, -285, 112, 457, -164, -344, 13, 505, 431, 31, -515, 229, 208, 498, -337, -518, 195, 680, 105, -616, -48, 785, 616, -335, -496, 203, 257, 261, -487, -341, 377, 684, -331, -276, -310, 248, 622, 34, -381, 85, 490, 453, 16, -519, 88, 634, 181, -360, 74, 78, 379, -106, -512, 211, 392, 310, -271, -323, 243, 515, 61, -255, -217, 183, 486, 244, -645, -331, 417, 744, -149, -774, -223, 399, 137, -570, 201, 348, 523, -106, -782, -190, 220, 324, -243, -371, 214, 489, 37, -436, -586, -193, 502, 35, -414, -162, 322]
5356C22K31m13n15M68M36o7j057p9N70M09l09q53O29O26M3p80o5O67M4J30o61
5377b24j52O54J45m33j53j66M79J94m4q44O14Q42m15r47k52R42M95q68k49M11
5397B9N04j54m25j05L60J58M8o23j80M01N14m15n11k09J081K84n55o28M03M28
5417D05j25m35n14P09O35k70j241M56O62K95o36k88M7P82r5o70q5K42O75m16l49
5438b16m19O14N15l81m83O5Q52R4o06p00P88K53j65p73J27N84K61l53p61M77N58
5459C31J0n03Kj17P11k44l42k44M49J87J90j152J35R41J9p69l09Q49J57J08q67
5480d58l3N62L57l32m89j71O56J75l74l34k2P25K74p47r3M08J16K56j116K84P06
5501C50o7l35l54J52L85N74q66o57R39N38k91k02n78M92K11o8n10K34K78M3M0
$$ y = [322, 553, 140, -375, 93, 529, 462, -595, -674, -104, 305, -4, -857, -228, 398, 441, -339, -404, 263, 307, 437, -224, -376, 278, 423, -10, -163, -329, 150, 344, 300, -544, 70, 912, 497, -450, -702, 240, 735, -133, -382, 29, 533, 379, -46, -151, 209, 367, 415, -208, -388, 13, 527, 112, -399, -608, 473, 757, 202, -426, -23, 405, 280, -155, -669, 40, 675, 405, -836, -380, 282, 577, -59, -347, -300, 482, 387, -283, -368, -126, 549, 133, -216, -635, -21, 494, 113, -370, -305, 547, 641, 35, -665, 123, 376, 211, -562, -435, 149, 410, 57, -704, -227, 331, 341, -162, -160, -277, 434, 190, -152, -396, 53, 240, 430, -722, -587, 354, 373, -396, -705, 144, 301, 409, -458, -491, 71, 428, 96, -393, -564, 92, 267, -107, -441, -463, 262, 536, -211, -304, 104, 220, 476, -640, -356, 350, 283, -52, -406, -254, 131, 705, -161, -818, 121, 659, 368, 166, -412, 80, 291, 223, -287, -53, 225, 268, 308]
5522C08j000L64Q98l48n45k16M15O80l73n44J24O18K83r79r2M63K47J83m53l87
5542c54L40QK44m72k40O07M43o69k19J73N27j98l92j60L92O35o10k26J6N18J68
5563E31m45o48K45P44j81m09k72M12N43k48n10j83N16K44o05k43L38N27J9p25
5583c50j41N59K77l06l59L9M78K62m52o22J97N21J63m89m61N16L90J25q06N7M47
5604D5L51k41p95O2J053J12p48m95M40O81k51o46r1O44K63k76o28L96N38j99M2
5625B57n14K20K14J24m12m31M13N12k81l36k17M70N20n36m36L23L84j41k32k69
5645c68J75O64l41n17r9L82O98o88l67J3Q40K61n27l47oN76K1o78j53P34M76p87
5667c8n59N30O67k04n67j6J26O91o09j97l9R9N16j39m91J56K85L19n82k32o1O13
$$ y = [308, -692, -328, 570, 222, -323, -539, -124, 556, 183, -361, -237, 381, 664, -315, -407, 56, 303, 486, 33, -354, -14, -6, 238, -234, -474, 133, 576, -93, -312, -139, 388, 190, -202, -362, 30, 665, 55, -171, -155, 363, 531, 86, -562, -317, 427, 246, -163, -435, -23, 520, 272, -238, -421, 95, 339, -266, -509, -171, 356, 375, -350, -491, 68, 345, 39, -320, -281, 197, 459, 7, -615, -418, 103, 266, -223, -684, -168, 222, 347, -459, -402, 45, 396, 155, -640, -578, 475, 587, -161, -656, -216, 465, 214, -432, -523, 121, 384, 108, -520, -124, 414, 215, 257, -257, -37, 177, 301, -111, -542, -129, 383, 102, -234, -451, 19, 539, 3, -433, -110, 274, 133, -99, -368, -193, 471, 130, -387, -486, -104, 594, -94, -461, -448, 392, 653, 126, -221, -227, 349, 370, -308, -461, 273, 749, -38, -597, -67, 600, 396, -171, -187, -61, 630, 21, -176, -215, -116, 400, 261, -230, -74, 211, 530, -52, -284, -345, 268]
5689B68J00j007J46K05O29k79k72lO94Ql73l67j5N65j97l55J13J79L84m61j55
5710a93k74N14L97l94o12J44N62j30J14m82M83R6j4r39J70M72K50k95o35N69K92
5731I5K90l89k38m4L83m0l94k23L12O23rj136N02M97J52k18o33J77N34N0r43R
5753f43O86J27l06j81O8N80J23o02j51Q1P02j83j54p54N16M52L1r27J08K87M79
5774C39j90p39N64L58j20n31L1K95K94M5o43J61K92K44l09l92j33M27O15l66l01
5795e9k4N97Oq50J54M37J37j93l31k23P57j48m29l26O25L95j25o99j0N91kk91
5817a1k92p1N82J37m25m33N83M24k58l74n40P74L30m33k58J46L70P7k89k86K83
5838C6K34J41o89j49K68M09J40p83n0M72L86l10l22j41P00k00k70l91K31N94n09
$$ y = [268, 368, -639, -493, -288, 341, 62, -210, -213, 481, 489, 116, -251, -266, 299, 102, -253, -140, 39, 423, -38, -193, -467, 47, 444, 50, -562, -418, 144, 14, 128, -354, 129, 225, 211, -728, -558, -86, 164, -131, -766, -197, 95, 385, -4, -242, -286, 97, 57, -337, -560, -248, 375, 366, -770, -268, 229, 381, 163, -470, -293, 241, 291, -652, -643, 43, 170, -136, -317, -249, 331, 454, -148, -299, -218, 484, 301, 147, -607, -91, 361, 392, -535, -427, -140, 339, 149, -590, -26, 332, 212, -319, -288, 7, 301, 346, -297, -136, 156, 400, 91, -301, -434, -7, 608, 242, -59, -83, 514, 520, -330, -176, 261, 398, 205, -126, -349, 408, 260, -169, -495, 130, 525, 400, -299, -309, 282, 280, -11, -303, -374, 208, 345, -80, -513, 70, 494, 236, -138, -678, 96, 426, -7, -265, -119, 251, 328, 39, -247, 36, 270, 411, -278, -427, -159, 250, 390, -393, -443, 29, 415, 105, -217, -358, 342, 142, -128, -519, -288, 306, -203]
5859b03j59J84M32K04n32k54K18O00l98j53j60O5O38k33m71l85P94J21j41n44
5879c77K18L98J22o04l04M43L23j87k15j63K80L79m43l24J32M16K64m10o32P27
5899D3J26J72k08m57K20M67o3o12J11L28K34k94m35O8O01Lo84J11J99K45j96j25
5921a46j37L63L31l94k60K31K57k7l30j07J53N13k6p41R1N09J82m62l91M13J44
5942A66L01l75l08M6M41J16o79j0Q12j76l31j19K6J13J87K0n98M85P0J51o09j20
5964c91K29M85m83p4K4N49O7l78m16L56M13m36j00j93L81K4P9m01J98MK75l18
5986a06k3R0L93j68n93K37J42N56k86m29LK43N12n05m82L68K61k00l35J29o4M46
6008A89m30j97K06M32J07k81l59L37K23J5m60l41N35M25l80m22n0O82P9l47j99
$$ y = [-203, -362, -178, 254, 458, -74, -328, -110, 490, 92, -61, -221, -156, 482, 249, -222, -607, 187, 308, 167, -377, -159, 239, 361, -243, -547, -104, 219, 32, -183, -346, -66, 313, -130, -454, -322, 94, 358, -52, -684, 43, 169, 341, 133, -324, -104, 363, 300, -312, -201, 127, 361, 67, -368, -300, 301, 304, -380, -269, -70, 175, -21, -146, -283, 80, 411, 17, -243, -12, 245, 218, -112, -219, -66, 447, 421, -320, -229, 280, 462, 0, -391, 22, 166, 467, 92, -216, -170, 271, 387, -292, -302, 510, 334, 3, -116, -90, 23, 210, 230, -368, 117, 187, 338, -271, -391, -162, 323, -160, -234, -210, 339, 406, 28, -388, -32, 381, -55, -155, -348, 33, 57, 136, -265, -67, -63, 212, -106, -129, -39, 354, 186, -407, -170, -28, 528, 242, -187, -184, 59, 571, 66, -416, -48, 213, 13, -322, -193, -257, 189, -241, -438, -232, 200, 307, 26, -333, 4, 227, 242, -218, -559, -24, 401, 21, -401, -451, 231, 310, -37, -236]
6029b36n6O55j7n65m36P57N7M6q4k98J25L02q7n59N2M12L25n14k28N9O43j71l33
6052a51k63N32M10l72k10N0N05o6p8o42N5O56j28m11j34L03m4L13k16l89K89N55
6074E64n12m41K11N96j94m20P4L53R3k85l94J31P4O53m27l35L32M43l83J11l19
6095g5J26L77k86m04l81M55O17n93n22M84L22n1k97M9J12K87j85m90o4Q95k8l90
6117d2m31L09M44j33k16l66K99L18J52o34J31J16K81j16p42K49N03J45l93l96
6137e22M24J92J37m27j41L54K46l7k47j45M06P1k74n06L99K72J68n18l02O06L92
6158E48m38p25N31M26J08l48n14K95L27j62P5k69K56L66l08m48P8L63M2l17m2
6179a56M4M10O1j13m45J58K35P8r11Q6N89K94Pp58K37K48K32l08m3J96R9J01o32
$$ y = [-236, -292, 363, 346, -219, -655, 102, 159, 205, 121, -177, -52, 250, 163, -396, -344, 68, 393, -121, -349, -290, 353, 182, -151, -414, 118, 528, 156, -54, -4, 501, 435, 357, -285, -230, 426, 298, -113, -247, 56, 12, 325, 109, -280, 9, 564, 52, -389, -178, 418, 224, -196, -122, 231, 324, 39, -355, -224, -150, 503, 76, -259, 73, 516, 133, 244, -75, 51, 428, 142, -262, -643, -188, 429, -164, -686, -202, 120, 69, -228, -179, -67, 220, 35, -455, -519, 376, 348, -42, -473, -164, 280, 147, -69, -435, -136, 182, 334, -300, -169, -53, 228, 112, -630, -381, 122, 267, -126, -522, -98, 94, 231, -196, -337, 17, 263, 226, -21, -166, 240, 311, 37, -469, -70, 202, 370, -148, -450, 156, 548, 110, -615, -84, 342, 450, 102, -412, -117, 210, 48, 123, -146, 110, 476, 168, -280, -202, 161, 203, -114, -156, -112, 298, 359, 246, -199, -41, 194, 272, -639, -553, 36, 330, 337, -421, -184, 64, 296, -12, -55, 141, 240, 341, -291]
6202b91K66J88J63j99r7j70K92K49k53p24L58O17J22p95r4L86K97k06m48q4N31
6223A08J4l17k03K93M17l22p7l09J18L86J20n99m7N40K90k10m07m4O11l9k17o22
6245e16L87R14r40Jj26M52Q3j98j42l09K26L66m11j98L60N45l9m52l13K52K10
6266A52n8n94L28K22J07j88l95K91L05Q2m36p6P2K38Ok11P5J09M2j71l16J91M08
6289A83J42m13j10J78J96qn37K19O1M16m34j53K30N74q3p00pJ72O20m09j27j2
6311bl5K20k49n5l23P02p6N5o98M46L63K99p89j53L66K40p8j78r3M06k18l78P0
6334a58k75P90j19l42k67L40K23J70o02j32O69O9m93j49K90J0J75l65j36N87J25
6355D10l40m04J31M95j83k74m6j50N98J43n77q4K79M37n16o4J13K3J12j5l67r2
$$ y = [-291, -25, 163, 326, 127, 30, -140, 152, 401, 148, -576, -218, 399, 521, -274, -368, 18, 315, 109, -339, -423, 108, 122, -195, -398, -105, 312, -10, -87, -396, -278, 108, 228, -371, -418, 122, 412, 202, -205, -249, 362, 323, 106, -516, -129, 785, -155, -154, -280, 172, 255, 57, -85, -394, -168, 198, -213, -411, -51, 494, 455, 3, -310, -58, 152, 94, -500, -172, 50, 157, -31, -426, -135, 170, 252, -184, -260, -188, 50, 56, -155, -80, 29, 71, -100, -416, -225, 183, 325, -88, -198, -20, 176, 168, -369, -150, -89, 327, -107, -260, -30, 544, 461, -239, -246, -74, 546, 137, 10, -2, -37, 183, -66, -121, -444, 258, 182, 237, -461, -15, 348, 647, -142, -295, 71, 311, 233, 55, -38, 368, 150, -228, -158, -433, 357, 238, -104, -371, -31, 192, 362, -240, -372, 297, 366, -127, -276, 14, 24, 199, -166, -302, 285, 410, 70, -334, -203, 292, 109, -165, -211, -361, 237, 380, -197, -281, -2, 435, -81, -145, -32, -9, 103, 88, -279, -371]
6377c71L41J46l24j33K7Q10n36k37j44O01M27o87j86j6N35o2l10O2j74J80J11
6398F0l24l79Q86J3l25J58k89N15N4n44k59N64q0l3j5r1K01Q3k73k14K28K75J13
6421C24k94k59R9K49O0l11j1N6L71k72j55k24P68K0l03n39L56K03p7p9m44L80
6443h2k0M60j81o36O40J51j29j32q9J56J99j29n29J43L39J8m47J11L88K15k05
6464B41k70O4J94j21j37l58M73K75k55l81J56J67K07l43j84K18J87P5n15L31j57
6485a33K45L5k55j9l0M17m1l98P5N02k1o66o4K16M00j88k20k14L20k09M75l77
6507a50j7M25K9l18p4M3K53m2m05j6J83N02l46k93k4L53K07o29Q8P3L64Q4k64
6530B6m02J51L39N2k36k69L12K89n47j49K47J67L88j49l30j29L13J43k33l63N22
$$ y = [-371, -30, 116, -208, -341, -314, 496, -40, -277, -421, 180, 607, -80, -266, -282, 253, 191, -119, -57, -231, -51, 60, -264, -643, 243, 256, -69, 89, -200, 315, 369, -175, -434, 130, 50, 17, 2, -89, 112, 195, -78, -292, -64, 211, 324, 30, -229, -130, 119, 179, -132, -143, -87, 284, 12, -143, -367, 401, 421, 118, -421, -65, 138, 61, -18, -462, -82, -102, 358, 177, -459, 181, 332, 203, 71, -18, 138, 337, 208, -321, -178, 161, 179, -268, -157, 231, 446, 241, -29, 35, 229, 108, -29, -387, 86, 361, 106, -275, -119, 48, 255, -88, -272, -54, 133, 208, -307, 24, -133, 112, 147, -108, -127, -157, 260, 219, -179, -104, 398, 377, -289, -353, -137, 263, 75, -145, -359, -39, -248, 227, -150, -167, 258, 287, -31, -105, -62, 191, 149, -256, -272, -89, 413, 67, -226, -250, 103, 310, -319, -231, -158, 206, 290, 26, -376, -225, 114, 166, -70, -339, -27, 262, -285, -434, -187, -20, 368, 219, -111, -240, 73, 216, -17, -380, 142]
6551A42K59l48k19J33j27N84l1p75K10M29J18m77l93P14J24j43o13J1Q36j7k27
6572A90l65LL72K57n54j24K56L42m59j14k3L12N6j44k32N0L78Q1o19J13K81m1
6594A6L20n50j79N88R4j68k92Q7N20o0l83j89j93P30l21k48o5J31L70k8p6n4l
6617D7K69l25k88K90J42p4n4n59P83M9k14j82j34P01j57n77L0K83J23K59n57l24
6639d69L41L03n0k01k18L57L4k02k86K44K19K39l03l04L99J92k84k43JK28L94
6660C91l30k72L09L0K5m48M3J70K31K77n19K4k9M32k75l63kN44m1l75k4K03K97
6683B98j13l96QL08L98m46k35J42K81o7j69k33K77K0K11l01r3J96K67k64o61M07
6705a65K51J96j78n03L0J133o26l51k75P06J03k34m82L42J27K61l77k15j8N01
$$ y = [142, 401, 53, -166, -33, -160, 424, 393, -382, -172, 257, 375, -102, -495, 219, 343, 200, -413, -402, 434, 417, 190, -175, -172, 200, 457, -97, -221, 35, 377, -82, -196, -219, 93, 149, 5, -227, -177, 201, 282, -337, -224, 57, 16, 336, -214, -393, 195, 289, 121, -171, -84, 436, 376, -7, -196, -389, 341, 20, -228, -293, -162, 208, 180, 104, 50, 47, 316, -9, -297, -7, 135, 61, 7, -552, 231, 280, 66, -116, -250, 451, 294, -283, -253, 30, 153, 412, -145, -469, -128, 175, 125, -76, -294, 63, 97, -105, -391, -147, 72, 311, 8, -296, 103, 295, 11, -232, -231, -3, 391, 61, -211, 98, 128, 153, -295, -252, -82, 149, 426, -93, -69, -98, 334, 59, -304, -306, 238, 197, -178, -202, 1, 298, 185, -211, -203, 105, 503, 57, -178, -36, 245, 178, 9, -224, 53, 73, 284, -17, -110, 86, 353, 89, -572, -165, 86, 282, 104, -399, -369, 764, 138, -213, -488, 218, 321, 87, -395, -53, 74, 335, -42, -257, -275, 226]
6725B26J07m89K37j31K65L6n36k4N58K51o51j50L09K76j43k72j3L28J89k19j96
6746d2k85J48L37j04k78k23N16J35k97k22K62K69l6m99o4M53n0o6k41J09K4L36
6768A82k03l97O7O32k15l64Q7J70O5J68k87p7J85K89n59l47K46M44l8j86k41M83
6790A04R9qo32l2L89K05l51Q6M1N74l38j88n0K07K22l21L6k74J16K66j39j02k91
6813c81N45J22k79j53K8O20k38m41j10K63L00q8m34rM09K56l25j49J14P4j42Q6
6835F8m36q0O59L61o53j27J58M45o42J97k2K58L83m20m92M10L47m74k21K43J24
6856H6L9J04l28M00j74J01k95k43L35L56p5o89M39l09M67r9l02K99K70q6l93n0
6878a47K06K37k55l17o7M91R9n27L0KL82m1j44k15J88J67J07l12l16N36J0nn86
$$ y = [226, 333, -156, 81, -50, 215, 251, -285, -309, 249, 500, -151, -301, 8, 284, 141, -131, -144, 184, 373, 154, -42, -327, -179, 158, 54, -224, -447, 69, 204, -93, -315, -53, 216, 180, -319, -383, 70, 20, -46, -287, -178, -154, 182, -21, -418, -351, 281, 66, -298, -211, -41, 24, 192, -95, -172, 13, 302, -257, -604, -358, 86, 48, -138, -379, 104, 203, 195, -437, -469, -80, 125, -226, -140, -99, 475, 137, -51, -101, 106, 328, 7, 43, -231, -115, 151, 12, -90, -381, 164, 286, 7, -146, -118, 502, 264, -177, -287, -24, 276, 188, -246, -255, 154, 410, 85, -64, 50, 124, -18, 68, -368, -448, 211, 572, -81, -208, -50, 395, -247, -50, -72, 186, 569, 149, -343, 67, 414, -60, -281, -38, 86, 125, 229, -99, 301, 127, 228, -67, -310, 25, 381, 306, -383, 56, -253, 214, 115, -187, 112, 382, 296, -97, -147, 59, 296, 41, -276, -343, 148, 247, -280, -250, -248, 134, 93, -51, -266, -78, 89, 196, -116, -432, 104, 114, 109, -477]
6901d77J37O64k37k13l63L70J74R7k42k54N52J20k10m18M59j49L17o07j08k3M34
6922B3L36m19k99Q3L25Q6k29j33J43N44m13k44J25K37Qm10K59J42J7q8q4l11K62
6945d0M93l41m04j20L93K49k17j78R9K54J46m12j8K76k17K61m52K19J03M4n5l99
6967c16L31M17k89p0k68O1L95k23K6k87O42j96k27P5k6K95j70k38k12L14N57m88
6989A03l58J27J01K94k57o8J5O1r6j55n4J81M45k0m94PK43J04o7n52J03M00J74
7012B37j40j3m7J81k38m5k63J21N64m18j29p5J18J87k07M4NL31m1o32k2M30J08
7035E6J06o49K33J58M4k63M17l93L06K7l89P5M57M62o24k13K4o1K58r0n0J81P5
7058A47P7m24k80N06J46O2j53j22JK34l11j07j22N37K84m59J5k75P95l26l63%
$$ y = [-477, -340, 324, 87, -126, -489, -119, 55, 152, -90, -344, 208, 328, 118, -300, 159, 10, 327, -280, -388, -411, 23, 359, -60, -359, -276, 49, 135, -94, -227, -84, 460, 47, -197, -72, 165, 173, -237, 22, 164, 181, 93, 9, -302, -40, 453, 112, -292, -412, -19, 230, 13, -165, -66, 188, 334, -78, -96, 180, -37, 224, -228, -9, 94, 138, 83, -316, 15, 432, 143, 73, -195, -134, 261, 38, 64, -223, 419, 223, -4, 71, 45, 340, 170, -68, -280, 34, 591, 103, -255, -128, -27, 267, 10, -58, -43, 18, -78, -233, -287, -106, 339, 319, -175, -168, 75, 179, 112, -440, -337, 63, 237, 97, 84, 37, 218, -20, -65, -328, -207, 357, -61, -190, -265, -147, 40, -167, -123, -118, 213, 172, -460, -482, -52, 56, 162, -487, -254, -96, -52, -315, 102, -291, 15, 42, -347, -272, 185, 647, 23, -190, -166, -227, 31, -59, -109, 72, 147, 224, -200, -480, 26, 172, 234, 81, -41, -40, 194, -117, -224, -346, 191, 475, 16, 31, -244, 551, 225, -138, -138]
7080a38K27J11j61k38K6L41L5j68k83K59M3J72l51q7K59j79M8p1K19J0K25l52
7102e3q1J90J89K55l22n05M82k02J60k55j34K49O3k03k78K46K81o1j05m5R6K81
7124B48n4l73J03K94J87m77j18J01K40J21k87j28J13L35k39j9j86K6K32j55j39
7145a75L2j06L01J19l96j7N10k69p2m5J88K5k13MLN04j41j55n10N65j58j77L5
7168a48k4K41k26L08m84J45M42Ql76j89R1L84j3l61N6L27j83p9j25pM62j2l92
7191a55P8K33N2Mk23K8NK20L21q08J83L07q3O9o57L01N56m84j61J06O5K24n1k95
7215a65q4N18k4j51l87J30M05K20n4k93k61M58l11NL25j58K17k97o16N41K02L7
7237B57k17j18m2L44j98j24j53L16J43m74L17k73L39J2K3k56j33M61r5k40M4J58
$$ y = [-138, 89, 200, 39, -199, -173, 168, 203, 35, -248, 11, 54, 226, -125, -212, 47, -132, -84, -155, 64, 74, 299, -53, -134, 56, 245, 500, 178, -327, 155, -47, 113, -142, -276, -27, 36, -167, -445, -199, 82, 21, -84, -129, -33, 248, 194, -179, -76, 218, 405, -72, -190, -89, 151, 272, -15, -143, -30, 305, 66, 47, -139, -113, 119, -36, -175, -143, -249, 52, 171, -225, -242, 268, -1, -73, -118, 70, 95, -118, -114, -111, 393, 252, 97, -413, 152, -6, -183, -148, -172, 69, -157, 151, -333, -188, 254, 262, -114, -303, -212, 172, 159, -202, -146, 181, -2, -81, -206, -213, 249, 237, -155, -77, 156, 208, 212, -11, 17, 22, 242, 563, -245, -62, 245, 162, 231, -426, -125, 431, -53, -214, -108, -43, 181, 130, -165, -249, 269, 245, 94, -293, -163, 242, 462, 408, 115, -146, 312, 1, 6, 331, 173, 390, 93, -523, 18, 220, 257, 40, -78, -120, 224, 26, -98, -251, 65, 208, -266, 51, -222, 117, 129, 152, -104, -237, 224, 129, -111, -67, 91]
7259I1M58n17m9k85L43j07J12j26L2L62k0r8m20J63P4J64m74j27O67K03j49p42
7281d45L1O51j7l60l9Q7M46l40k35J21M7K33k28r9K7K30J43l48l22K84J04m6J20
7304D5k22K85%q3m58j9P61j76j25l44n3O92l7l27k66J86k9K3p3m1M07L27m50j07
7328h4K41L3j83K3m6M4R8N5n07M11J23o7l27p8M8N41Q8m08K08p1k07K0J1J07k36
7353a63M30k19j05l4K29L18n51j61J97K45j48j43j16K86J35l5k40k16M21J99n09
7374a80k22N53J32l53J39l21J46K13j87j35MK02J82m55M2M99j32o2j3l36J30M41
7396B87k50j37j8K11K80j75n19N2L33J6q8m1K22J61k51J08l46M9N0R2o53M90L09
7419A82J44m52j51L41J27l1l50J10M4J95k22r9j42P06o83L10k10K1K90o0j49j6
$$ y = [91, 549, 32, -17, -302, 41, -66, 46, -80, -48, 314, 294, 196, -224, -61, 13, 177, -297, -424, 243, 446, 297, -445, -414, 237, 220, -140, -179, -92, 354, 14, -221, -100, -53, 180, -48, -147, -120, 110, 253, -95, -417, -133, -29, -75, 45, -177, 108, 108, 25, -433, -452, 309, 133, 8, -336, -389, 303, 266, -61, -327, -141, -170, -147, -220, -261, 146, 473, 23, -84, 157, 190, 7, 30, -16, 28, 126, 181, -326, 85, 208, 141, -186, -264, -216, 325, 413, 5, 213, 142, -65, -45, -34, 73, -163, 267, 48, -57, -91, 138, 456, -95, -256, -59, 186, 38, -105, -221, 65, 200, 165, -75, -291, 130, 329, -180, -402, 151, 283, -70, 69, -252, -106, 107, -80, -215, -211, -9, 173, -282, -240, 259, 127, 65, 52, -284, -154, 287, 37, -100, -118, 93, 373, 198, -321, -269, 64, 80, -8, -49, 173, 334, 83, 191, -155, -106, -56, 36, -617, -127, 182, 326, -126, -277, 64, 191, 160, -190, -80, -36, 159, -63, -162, -304, 402, -281, 29, -181, -160, 130, 70, -79, -95]
7441i5J86J58Q6o19K26K02OO8m35M0M35l45l4k5L52j38j10K03k69L56q6p9j40
7464e7j70M22k32L1j04j74P92m76j81Q5J74L06m35k93K34P9Jo2m79O19p4M44q81
7487d31M32L14j52j26Rl0k2J54p7m22J84M07l54K24m26M61j65k22p0L46J61l6
7509A59k85j11K14K97o8j83l9J69J09K9l72k98M17J91m25j16K33J76J54k53l96
7530c98K61M69n81K00L1j83J64r9K57j53K8L9k4k20M15j44j78n7P0K75K54o66
7552b40K49j80M74j28l04%J53j08P5j05n9K31N1k23R0q7K20Q1l01j13K14J93J80
7575C63o23l75O85J10K33n82N9J50M60p27J7L46J01qk61l67O68j66k95L03k9K91
7597C53k48J06j70P8J60l89p4o5R2N40n35J70r7L09n8k8j85q0L23J23m67qL43
$$ y = [-95, 91, 249, 335, -284, -58, 144, 150, 218, -217, -177, 258, -87, -121, -146, 206, 68, -42, 161, -108, 248, 162, 83, -57, -227, 195, -37, -6, -110, -284, 508, 32, -149, -64, 110, 416, -19, -312, -78, 1, 2, -60, -539, 80, 6, 450, -431, 1, 315, 163, 37, 46, 16, -6, 148, 71, -351, -167, 240, -114, 110, -316, 145, -20, -242, -312, 34, 195, 159, -126, -237, -23, 274, 206, 23, -16, 153, 262, 291, -81, -379, 38, 229, -196, -312, -79, 97, 251, -2, -398, -137, 332, -249, -49, -18, -201, -37, -136, 121, -32, -4, 35, 11, -209, 206, 62, -116, -173, -103, 172, 426, -240, 9, -171, 303, 175, -129, -129, 24, -84, -9, -114, -173, 58, 109, -114, -24, -111, 109, 190, -111, -224, -10, 183, 363, -260, -635, 50, 160, 393, -189, -130, 20, 480, -247, -230, 116, 217, 209, -52, -419, 249, 83, -212, 91, 62, 353, 105, 211, 41, 119, 279, -110, -184, -249, -157, 383, -152, 18, -79, 230, 172, 144, -41, -121, 202, 325, -142, -150, 193]
7620A93m8K8k38j03K64K16m10K85l90N61m02N2O7l0K01p0K23p97N67J47m77oJ28
7643c9J26L22m05j01P9L81N0n18k0J60R4k92j58L45k78M10k09l43M57%M2j99j48
7666b44k0J24K52m94J93L17j53m7m15J79L91j48p4j38l6K00L50m90K65L2J16l19
7688a59J33k92N44j11P7l70L47J41l44j48j21L08J37m7k54P4J36p1O2l31K19L09
7710B39j60p5r0k8L46k60j88J46M00j74Pl24O3M14k52l46p3L40M09j64j89k94
7732b53N53n9j5l43l1M13R8m89J13K70r9l10l4RJ02kJ93k22J43q6J76k18K7K21
7756A57J88nm65j31M30J74m98j51O2L48N8j74j28L5J63J71l34Q7M3j69M28l89
7778a00n3L42L2j91k56L29L01j27n67K6K44M1Q5j30k55J43J64j4l87K47M86j03
$$ y = [193, 145, 173, -65, -168, 96, 312, -98, 187, -203, 358, -44, 8, 75, 45, 246, 176, 399, -398, 169, 316, -161, -167, -39, 87, 409, 4, -97, -18, 363, 413, -105, -125, 35, 129, -163, -321, 24, -254, 156, -53, -396, 61, 61, 103, -96, -244, -264, -140, 112, -382, -189, 128, -25, -72, -487, -308, 83, -65, -139, -277, -313, -113, 237, -253, 12, 44, 160, -159, -26, -318, 226, 115, 192, -178, 169, 310, -34, -182, -303, 5, 142, 95, -159, -85, 51, -20, 42, -289, -70, 239, 79, 4, -86, -114, 232, -28, -216, -70, 330, 156, 163, -161, -98, 316, 64, -282, -355, -15, 394, 230, 41, -253, 300, 241, 226, -117, -148, 265, 363, -126, -13, 257, 158, -152, -186, -177, -75, -77, 116, -106, 37, -49, 127, -91, -64, 157, 345, 340, -125, -256, 174, 348, -150, -301, -239, 109, 167, -7, -135, -100, 63, 234, -100, -13, 30, -139, 289, -100, -153, 189, 221, 30, -226, 103, 404, 277, -290, -264, -20, 21, 106, -24, -279, -136, 28, 14, -373, -126, 360, 257]
7800B57k49j27J56r5L31q89K46N56N6k54j43J06J68j9l66J56M04j23k45k8Q7K70
7822B55k17J50j08k50N04J13l96k26J17n6L13n32M31J08j55R8m93J84M53k84K53
7843B62n35L2L92P1l28q2K86L74k96l96L34k23J30o4j23j5L39M8k38p7K70j72
7865a1O5l80J73K69l7k14K3K14J59j32j76L4J49j86J62%l06L92pm63K86j9K57
7888B52%l87K25j79N78l83j81L1L6M1j93j27J53K29K4M9k82K0P61m97l18j67N49
7911B34J3k32k45j40N06Q3m67K58L00j30K9l48j55M39J2j61j41r0K97J57k10k18
7933b09J43L14j93l30M98k87L21k60k62K61j51J58l2k15J93K10l88J4m0J89K47
7954A81J29m64J77j9j6J1j15p3L43j53k23J0L41J10j99k21J03k7J03j1n2m7L65
$$ y = [257, 8, -119, 37, -58, 273, -616, -370, 186, 242, -12, -155, -49, 119, 100, -266, -110, 294, 171, -74, -102, -15, 255, 38, 188, 80, -170, 334, 447, 51, -175, -58, -114, 199, -333, 98, 206, 51, 149, -344, -160, 293, 9, 262, -273, -241, 151, 222, -106, -188, 98, 472, 176, -220, 114, -109, 21, -43, -166, -181, 158, 206, -32, -109, 161, -11, 54, -326, -153, 116, 79, -135, -112, 102, 261, 129, -47, -13, 136, -50, 112, 112, -194, 198, 191, -272, 14, -5, 252, 252, -135, 90, -89, 489, 106, -75, -44, -8, 33, -160, -287, -134, 95, 119, 168, -114, -94, 667, 170, -148, -315, 234, 247, 15, -230, -370, 136, 219, -248, 10, 310, 180, 209, -139, -294, 145, 157, -4, -145, -235, 62, 219, 9, -209, -66, 248, 55, -275, 223, -64, 257, -3, -265, -4, -155, 3, -29, -244, -51, 159, -229, -215, -255, -66, 181, 310, -154, 23, 4, -12, -1, -116, -189, 154, 1, -222, -212, 129, 239, 40, -181, -78, -105, -2, -13, -65, -112, 253]
7977B53j59k71r3L29K44m3l76R5K46j29j72m0r0J70K34m60M4J17L73j04n3p3J8
8000F0L11l55J13m15M17J99m53L6K08R3q7l42L7K49K67j91m53J8K54L93j77l65
8022a83J18p6L24j88l72L20J31K90o80J14L45J87m92j4k29P71qj62m01K24K11
8043B30l00o2j2K06r5j2jpJ82O9Q0k79K1k5Jj57l05N66o2j02k09K13J17L25l59
8068B3k39j46P28o8l22j91K44j5J76m17K37J22J78l51k12J65J21K5L5n77O04k0
8090A00j1l08M6L62j10J1k49M32m55M31n0n36K64J71j42m48L40L81K45l17k50
8111i3P7L09N2l51j30Q8M59l27j03J5K7L37k27m8k55L20k51J6k1j32K41j75J82
8134A0r3O4K24N9o24Q3N42j58jj81K5K60m5p14L74K42r8Q3j79K44j23R9o0j99
$$ y = [253, 94, -177, -270, 59, 303, 260, -116, -21, 225, 96, -76, -116, -206, -36, 198, -262, -218, -101, 272, 168, 115, 42, 60, 371, 16, 129, -286, 131, 330, -123, -87, 121, 214, 127, -215, -178, 71, 338, 147, -306, -288, -34, 359, 182, -183, -65, -141, 183, -5, -377, -57, 74, 364, -316, -202, 143, 330, -162, -176, -405, 366, 358, 196, -205, 19, 230, -70, -132, -144, 62, -33, -45, -46, -53, 129, 198, 278, -1, 20, -5, -4, -161, -466, 100, 38, -64, -273, -60, 57, 382, 23, -216, -362, 366, 298, -24, -215, 29, 14, 190, -227, 10, 132, 310, -41, -253, -88, 33, 58, 93, -484, 120, 100, 89, -219, -173, 189, 79, 90, -159, 273, -182, 249, 199, -337, -73, 98, -44, -492, -152, 229, 474, 157, -93, -16, 293, 345, -6, -136, -48, 411, 84, -19, -4, 23, 360, 133, 85, -170, 150, -101, -85, -106, -238, 3, -172, 10, -83, -19, 205, 264, -360, -277, 265, 107, 106, -75, -50, 210, 165, -549, -175, 67, -31, 52, -127, 117, -6, 93, 33, -166]
8158a66L79k4P5k22l8K20l7k73j66j5L67n4Q5m37L67J52k98J55l35K0N58m27j
8181a15K98k64L43j20l69J80K12k87j67N7
$$ y = [-166, 213, 189, 264, 42, 4, 224, 187, -86, -252, -267, 100, 46, 131, -306, 61, 213, -85, 70, -265, -245, 313, -114, -115, 183, -81, 262, 142, -227, -47, 165, -122, -289, -232]
8191b32
$$ Imaginary data points
##PAGE= N=2
##DATA TABLE= (X++(I..I)), XYDATA
0@%%%qJ6j6K4m0M8n6P2r6J20j44J76k16K64l12L68m36N12n95O91q00R20j053J203
27F42j369J552j756J977k223K496k792L118l479L871m300M773n290N862o492P184
43C774p957Q817r775J0856j2085J3491j5119J7033j9322K2113k5604L0123l6235
56a9890M5016n8782Q3627j42482N25448N27724r41441l44959L26182L74837k06470
67A68810j03603J80103N4629l76863j61895K97306K83452j97932k54467N4341
77e6119J50980j12324j26062J27048K11404l1464j71040j01636j0171K4222J50913
88E5751K03337o708k75431j91971J23175K42342P6406o2157p3757q1599p1982
99f2594O7164J71446M8514j30458q9336M7113K1961n8267L5763J40772J761j85974
$$ y = [0, 0, 0, 0, -8, 8, -8, 16, -24, 24, -32, 40, -56, 64, -80, 96, -120, 144, -168, 200, -236, 276, -319, 372, -428, 492, -561, 642, -727, 825, -931, 1046, -1177, 1319, -1473, 1645, -1834, 2037, -2263, 2510, -2780, 3082, -3410, 3774, -4183, 4634, -5141, 5715, -6370, 7121, -7998, 9035, -10287, 11826, -13778, 16345, -19890, 25126, -33656, 49971, -92511, 432937, 960661, 19220, -325739, 443, 375280, 168810, 65207, 245310, 299939, -76924, -238819, 58487, 341939, 144007, -110460, -56119, 94861, -17463, -143525, -16477, 194927, 163463, -7577, -109213, -119384, -95162, 55751, 259088, 252380, -23051, -215022, -91847, 150495, 226901, 164744, 90987, 9388, -62594, 4570, 176016, 224530, 94072, 4736, 51849, 73810, 15543, 51306, 192078, 193839, 7865]
111G865q6168J31098Q1944j10023m1498J74224Q8263k22716k27214J20247K73616
122A89638J9716k03426q7408R2168M4149p0645j5384R0078L4441j00374j06355
133a13402J3870R6215P0061q120o8036o6119m569M6060L1616j5J0096K0048k6180
146A525o1162n696P5221O1432k4751n6670r520K7247J1066p943L970K0595J5970
159E1284j0807m8940m7700L0886J02624L9124j05899j23717K7182J25343L6524
170G5904p7489m6546L4001R014m9021k884O8557K0158p0592m2287N4577N4541
182B7933k1721l8188J880P836l791K6440L3370l3954o3204L0178R9947K325j15063
195d6012m5005J02054P6415p3675q8272M3350Q5741j7439o9058M489M8283j4136
$$ y = [7865, -78303, 52795, 134739, 24716, -16782, 157442, 245705, 22989, -204225, -83978, 189638, 209354, 5928, -81480, 10688, 54837, -15808, -31192, 58886, 93327, -7047, -113402, -99532, -3317, 66744, 58624, -9412, -75531, -80100, -34040, -2424, -2439, 7657, 27705, 1525, -59637, -65333, 9888, 71320, 46569, -10101, -19621, 7626, 18692, 10749, 14719, 35314, 51284, 40477, -8463, -56163, -25277, 77347, 116471, 10572, -113145, -85963, 39380, 75904, -1585, -48131, -14130, -5116, -54137, -57021, 11536, 31694, -38898, -81185, -26608, 27933, 6212, -31976, -30096, -22260, -26051, 389, 33759, -195, -63399, -33221, 66726, 69051, -46012, -91017, 11037, 87452, 13777, -74495, -31145, 54596, 37157, -31901, -27412, 20871, 6735]
207F735n0779J9197P4051Q820q2257o4070L8172R6507M7978n3987j02387l5513
219i7533P9110R5219j3877r0955k7202N8849K6495n1781k3378O1071M2963n9408
231d27p6028J5271O4906J3387k6988J471J5171k8113m5112Q795N4936L7675p553
244B7391l5552m2459j6290M6612Q0579K1484o8748o8785J5700N8924K0401j1574
256B7683Q145J1974l1430m9720K943N8550M1983k3500n7709k9000J7436K7640
268D995j158j5260J0072K4009k4614p5413k8530P9446R2761k3538j06233m0425
280a03888O3239N4515j6589k0257K7452J7188m3087m4798K8028P3036L6051k5720
292D5170m9361k8634J0308M1428L4000q009k7813o948J943k3197j5656M4592O1584
$$ y = [6735, -44044, -24847, 49204, 58024, -24233, -88303, -50131, 46376, 94354, 40367, -62020, -97533, -18423, 76796, 62919, -28036, -55238, 3611, 30106, -21675, -45053, 16018, 58981, -427, -76455, -61184, 3722, 17109, -9879, -8408, 6763, -21350, -66462, -57667, -2731, 34944, 27391, -8161, -50620, -66910, -20298, 60281, 81765, 13017, -55768, -40068, 18856, 39257, 27683, 35828, 47802, 16372, -33348, -30405, 28145, 70128, 46628, -11081, -40081, -22645, 4995, 3837, -11423, -1351, 22658, -1956, -77369, -105899, -26453, 66308, 42770, -63463, -103888, -40649, 13866, -2723, -22980, 4472, 21660, -21427, -66225, -38197, 34839, 70890, 45170, -4191, -32825, -22517, 18911, 52911, 44902, 17089, 10141, 12084, -11113, -26769, 17823, 79407]
305G9407k0184r1749m2902N0295N7031n583k4545P004K661m0476l2030L4530O5932
318C9391J8796m3128n5437j9318L2452O0135K8210l3875m7514r69K3299p220j6712
331b1890L4643N4365k2569r1901l4606P2315P2552j9769o0504j4405J8535j817
343a5051j0456J9487L2921L656k9811l2949j0429K3853M7619K4158l3898n1700
355c2600J727M5153J5284k2819R92L0815j0830n9829j8457O1034N0326l1075n6957
368b7236l008L1123J947k1463j66J9984K589k0721k0869l401J8657L3043J1526
381B2005l6356m1044J7734N2110L752m4928o529N0956K1216m9086l6584L9605
393g149N4070j3294m9889q188L0347J1224j5774o944R238N938m422j1812j6275
$$ y = [79407, 59223, -32526, -75428, -25133, 31898, 26315, 1770, 8774, 11435, -29041, -61071, -26541, 39391, 58187, 15059, -40378, -59696, -27244, 32891, 61101, 27226, -20288, -21257, 2042, -5178, -21890, 12753, 67118, 44549, -47352, -81958, -9643, 62909, 43140, -17364, -31769, -13234, -15051, -25507, -6020, 26901, 30557, 746, -32203, -42632, -18779, 28840, 52998, 19100, -32600, -30873, 14280, 29564, 6745, 7737, 38552, 27722, -32107, -50564, 10470, 60796, 29721, -27236, -30244, 879, 2826, -18637, -18803, 1181, 3770, -16951, -37820, -41221, -22564, 10479, 22005, -14351, -55395, -37661, 14449, 18201, -26727, -33256, 17700, 38916, -10170, -46754, -7149, 46921, 33627, -16262, -24450, 5897, 17121, 1347, -5597, 3641, 9579, 5157, -6655, -22930]
406b2930m780K1689K2966j5646l7032L73L5958O986l4940q901L9973J9245m3138
419b0177l6464L2568N0962m863l9872n814K6073P251j9130q307J6148J7026j249
432A4152j7913k0465L25K9955K5682k0020m3801r66L9614Q746l9127j3062M5781
445H901L0117m2249n2231J6253N5886J3601l3294k1295J1121J0101l970O27J1395
458D963Q332k018j3948k2100p649K9178L7579p568m4830j7755K7312J7240j9730
471a0994p431L1590J2901m4786m3445K6669O0400J3101l7811k7478M380R165J806
484a1933P373J4875O948r141k1272k1886N065M2881L9715k0576o4126k6137M1421
497a6793M0862j1259k2101J1058R697l3041l4261K3270N5044J3203m0489l9409
$$ y = [-22930, -27710, -6021, 16945, 1299, -35733, -35360, 598, 7584, -27356, -36257, 3716, 22961, -20177, -56641, -24073, 26889, 22026, -17846, -23660, 2413, 9664, -9466, -17773, -1625, 15401, 14152, -3761, -24226, -23901, 6054, 31736, 11716, -32085, -33051, 6563, 15309, -23818, -36880, 8901, 39018, -3231, -55462, -39209, 16677, 30278, -3016, -24311, -13190, -3089, -7059, -6432, 4963, 13295, 11277, -2671, -24771, -32420, -3242, 34337, 26769, -18061, -35816, -8504, 8736, -10994, -18425, 13165, 26066, -18720, -62165, -35496, 24904, 38005, 194, -27284, -22904, -13739, -11933, -4560, 10315, 17263, 8122, -13150, -35036, -29971, 12910, 52625, 32049, -32077, -58214, -16793, 24069, 12810, -9291, 1767, 11464, -21577, -55838, -32568, 22476, 35679, -4810, -44219]
509d4219k060K2515K3456J3850l357j7870j4443k815P65Q034K9454K9196j7882
522B4624n5271j9405M5718M5454r484l0575j864P408j8163j7492K8169M6141j919
535D3341n0396l6779R799L0978K0193j333j9047j9779k586Q695P0k694K0010K4703
549B5175k0252n5806j5705N5441N3486j5865m7392p667K2771K551j3067J2546
561c784L0297N73l4211k4684R897K8653K0625m30k2494k6104k467J9286J0724
574E881n442K427J3702j0935l8635j0346M4028M0431k1040m4875m417K6274O649
587C702j1579Q589K5969j711l4364k2591J5354L2485J6416r728k7235k1032R168
600a6557K7774O669k0644q457J5376j755l4005j5475L8065L9504j9687n0630j0813
$$ y = [-44219, -46279, -23764, -308, 13542, 10185, -7685, -22128, -24943, -24178, -16144, 13310, 42506, 24624, -30647, -50052, -4334, 41120, 31636, 1061, -803, 6605, -11558, -29050, -881, 45260, 43341, -7055, -43834, -34035, -3057, 17136, 15803, -3244, -23023, -25609, -16914, -16844, -19538, 472, 25175, 4923, -50883, -66588, -11147, 42339, 26474, -20918, -28585, -5814, -3263, -16330, -3784, 26513, 27086, -7125, -31809, -21912, 6741, 27366, 26936, 4442, -21662, -24129, -4843, 5881, 439, 2866, 16568, 5633, -33002, -43348, 680, 41111, 20071, -24804, -29221, -2947, 3702, -7877, 712, 26681, 24970, -9394, -31985, -16631, 15854, 32270, 22542, -4693, -25725, -16557, 11217, 17886, -2758, -11215, 4161, 2406, -31599, -47074, -9009, 30495, 10808, -39822, -50635]
613e0635L1055J7153j2600o532J1283K521j5477r439J1034K0062J2855l354j8345
626a0419j8138Q569K9124J1924j6134j0846J4291P377k0756j2818K7497K8397
638C8068j8535l9752k223K9875J0959j7804j0127J1347N183j5255j5594K638J4764
651f456J1966k175j9312j9291P713K8260P526k4994j5748K0441J6715k1286k3511
664d0152K1324L6930l627l6542j3481K3266J8139p385q027O747N005p157o188
677a1148M142R764J0184L452j2708j9423J957K6735J3977j7121j4695J3851J3496
690B2463j8056k0580J7992L2785o172l7167j2515K4025J6847j0580j2072M495
702A465M692r181j1681o81J0526J3516L112j7223k2471K186K9823J5795k0791
$$ y = [-50635, -19580, -2427, -15027, -21559, -10276, -7755, -23232, -32671, -21637, -1575, 11280, 7926, -10419, -28557, -19988, 9136, 21060, 4926, -5920, 8371, 15748, -5008, -17826, 9671, 38068, 19533, -20219, -22442, 7433, 18392, 588, -9539, 1808, 6991, -8264, -23858, -21220, -6456, 5510, 3335, -15977, -35268, -27555, 705, 8231, -16763, -32511, -12070, 4645, -16641, -40152, -18828, 18102, 14475, -22067, -35548, -12282, 5857, -1528, -9555, -2808, 2197, -4960, -11148, -7006, 2758, 12942, 16394, 3686, -15737, -13780, 12955, 26932, 9811, -4884, 8967, 22463, 4407, -16173, 1819, 34604, 28432, -8735, -21250, 2775, 19622, 9042, -3030, 1465, 6157, -3024, -14705, -15386, -4860, 8656, 11768, -5455, -27926, -25740, 4083, 19878, -913]
715i13k1994J3806K2216j0001k2440J1981L4466M606l0845j8367J6157K1623J993
728B2288p459k137l71m800j897L884M334M672K367j1559k1580k188K4394J6515
742B6463j7103k1391O326J4625j0994j8890J1830K9316j74l2530j7280K0509K4207
755A4914Q30j1001m823m74l49J199K918M389R675P215j2471k5027k119L1264K2709
770C8849j9509l1982J968K3324J040j8423K017K2218J577k7892j7861J4570K1959
783A1855M072r778r680m894O78P971P519j429j897L038l966j6389k229K6188K1948
798C3007j6502l0265J203K3424K984j6591M54K0180Q75k6071j4715J9051K4737
811B1771r61j8599j2788J021Q134R023R55p176j010R040l6j7644o403K3024K3186
$$ y = [-913, -22907, -9101, 13115, 3114, -19326, -7345, 27121, 31727, 882, -17485, -1328, 20295, 22288, 14829, 12692, 12321, 7521, 5624, 9508, 13842, 18514, 20881, 9322, -12258, -14446, 9948, 26463, 9360, -12031, -5705, 8920, -2074, -20964, -9134, 20182, 20008, -12522, -29802, -9293, 14914, 15744, 4743, -80, -554, -903, 296, 3214, 7603, 17278, 24493, 12022, -13005, -15124, 16140, 38849, 19340, -12642, -10674, 12650, 13690, -4733, -2716, 19502, 21079, -6813, -24674, -10104, 11855, 15927, 6149, -3531, -8425, -7747, 224, 7743, 6314, 4417, 7455, 3489, -12900, -15129, 11059, 33007, 16505, -13760, -12557, 10867, 13851, -2740, -2286, 17894, 18769, -7302, -22017, -2966, 21771, 20810, 2211, -10577, -9556, -1422, 7601, 8556, 1380, 370, 9410, 9374, -8270, -14673, 8351, 31537]
826C1537j4176l1089j527K6463J0970j4889o783J2698M291j7428j2359J2859J7558
839A8125L30j1996j0242k623N095R542K925q970p053N472M126j0904p209J7078
853C696J9024j1279k8188r78K5037Q783j6316p091J5161P807j6042j3334J2511
866a209K0144J554j5453j3228k93J1559J1691n01j3224o607J0858P613j2887j3455
880a3438J2413K1748o068k6307n941K0566J3123j0826r771O857N611r585q355
893i973P331J3340J995p706q596l134M550J0536L789j0181r051O281P898q637
907a558j0528J0661J8970n544k5545p069J9927J2733j1503j0210Q653R185q690
920e18j2259M714J4981O868o783j2936p312P672J6273O465j2099j1569P208J0528
$$ y = [31537, 17361, -13728, -15255, 11208, 22178, 7289, 506, 13204, 17495, 67, -12292, 567, 18125, 18455, 6459, -3783, -6406, -1311, 8231, 11156, 2186, -4867, 605, 4731, -6173, -13382, 3696, 22720, 11441, -16747, -17725, 7312, 16095, -221, -7312, 7849, 15656, -386, -13720, -1209, 18935, 20489, 5036, -8192, -8485, 3074, 14765, 14264, 1040, -5567, 5291, 12904, 17, -13438, -1025, 20723, 14655, -11652, -17593, 2973, 16096, 5270, -4501, 2356, 7967, -1618, -9973, -2642, 10698, 12693, 4987, -3609, -6743, -2193, 8343, 12132, 1951, -7100, -819, 7079, -1558, -12086, -1425, 17545, 12001, -13544, -20613, -686, 12047, 544, -9666, -1013, 8172, -518, -12777, -8063, 6918, 13786, 7003, -5933, -13245, -5573, 10700, 17165, 5066, -6503, 705, 11233]
934A1233q486j3679R262K1688k311k6096j1256J8238J6712n723j2185p1K955n211
948d930m535N469J0100K654m992r046p013L599J4355R223r828j3370L453J0873
962F012m144q536R911J8300n960k6836r204K1760J8903p483j5836n86P050k565
976G86n716K881Q698K512o214j0431p846N035J8424J0369j3572j8997K063J5724
990C716J895j1502K180J6020J72k1636r599J8370J9293n140j5585m136M011M36
1004a505K91N214M351k046o081n363m580L330J2612P961j1465j7708J269J5769
1018B049L788r814M08J2573j807k0427q362K0295K0072n767j9251n767Q686N917
1032B593M25j11L79j696k352l354n020K668J4105Q902j3129k1547M57J9571Q162
$$ y = [11233, 2747, -10932, -1670, 20018, 17707, -8389, -19645, -1407, 15305, 9582, -2603, -2674, 281, -4930, -9465, -3996, 6104, 8758, 3766, -5280, -12293, -8694, 5661, 14884, 5056, -8314, -4861, 6012, 1868, -6668, 3243, 21543, 15583, -11253, -20457, 1303, 20206, 12723, -3113, -3699, 3351, 786, -4930, -2049, 6649, 9161, 2947, -7484, -15330, -10295, 8129, 18498, 4926, -14071, -12008, 3716, 5611, -5891, -3711, 12309, 12481, -9155, -18754, -384, 18909, 13769, -1816, -5952, -1941, -1505, -1214, 4000, 8351, 6305, 224, -5139, -9719, -6389, 6223, 14184, 2719, -14989, -13720, 2049, 5837, -3977, -3569, 9004, 7197, -13230, -21592, -1297, 18775, 13008, -6243, -12010, -3324, 2593, 3018, 2907, 3286, 1590, -762, -4116, -9136, -6468, 7637, 16539, 3410, -18137, -17680, 1891, 10053]
1047A0053j2286o918R075L933j2789p321J3503J6476m398j5904n135N839O513
1060F41L409K803j031m379k479O0q79J644R609N990j1757j7039K262J9702O414
1075A4970j3962q414Q474M726j2779q826J3306J5479m779j7228o534P861Q948
1088A242K751k272m963l323K783L767k238j708Q922R908q369j9164j61K0878J0625
1103A8678j2220j1891O263P769o199p279P850J1685m396j4291m944N949P180K417
1117F571q90m604n783K44L613q10k091N220O409p624j5254J362J9100Q933j3495
1132I01j2655P009R092n804q415P220J2964j519j3738o589O232Q550M890l288
1146D850q026n222M198Q258r35o258K725R029l467j5863k355J7200J1346j0552
$$ y = [10053, -2233, -9151, -76, 3857, -8932, -16253, -2750, 13726, 9328, -6576, -11711, -5872, 641, 4050, 6853, 5822, 1443, -1036, -976, -1855, -211, 9398, 15388, 3631, -13408, -11146, 8556, 14970, 1008, -7406, 1068, 5794, -6985, -15811, -2505, 12974, 8195, -9033, -15567, -7706, 1242, 3993, 1721, -3242, -6565, -3782, -15, -2253, -3961, 4961, 14869, 6500, -12664, -12825, 8053, 18678, 6458, -5433, 830, 8599, 2400, -4879, 2971, 14656, 10260, -4031, -8975, -3026, 4154, 6571, 5681, 1077, -4706, -4462, -849, -1659, -3750, 1470, 7879, 255, -14999, -13637, 5463, 14396, 901, -11754, -4745, 4347, -1457, -9872, -2652, 10312, 8793, -4945, -11534, -5302, 3248, 8138, 4850, -3176, -8398, -4200, 4058, 3123, -3135, -410, 8619, 5152, -10711, -13066, 4134, 15480, 4928]
1160D928j3420L394R314j797o311L861P714k523j0337l866N405O697K252j544
1174C767o694n997K730P021p36o047J845Q225l031j4036k225J6834J0489j1564
1188E81j3729L953J1449q65p992K763J0122N86r437n802L595P821N685q36q937
1203a043p439N044J1266L20r200j538Q781M15j2545n162J3237J2076q484j3840
1217h112R80R259P24n785J723N614j396p207l440M418O219L708j559o991o314
1232h159L509Q966J272p740j206Q436j15j2200l745J4083J1239r966j5645J114
1246a0157J2106L154o491j462N350P79n640l429J731N190M433Q24p761p826M360
1261d839J2532K917r996n196P380L892q621n338R789J0995o524j3620m33R005
$$ y = [4928, -8492, -5098, 4216, 2419, -3892, -31, 7683, 5160, -5177, -9043, -3638, 3059, 5311, 3767, -2927, -8924, -6194, 827, 91, -5956, -4111, 4114, 1083, -12953, -15178, 1656, 12145, 581, -13148, -9195, 2254, 1389, -6603, -3840, 6282, 6868, -2569, -8371, -4776, 3045, 8730, 7894, -1043, -8482, -3438, 7828, 8148, -1052, -2590, 6191, 6606, -5939, -11101, 2136, 14212, 5728, -8112, -7132, 2127, 2851, -2934, -1211, 4403, 3007, -4200, -7640, -3222, 2997, 6705, 5146, -1845, -8159, -4650, 4316, 5588, -2152, -3358, 5078, 4963, -7237, -10982, 3101, 14340, 4374, -11271, -10157, 1949, 5103, -1388, -2850, 2500, 3279, -2361, -5790, -4059, 1131, 5564, 6388, -1373, -9199, -4839, 7693, 10610, 614, -4582, 2798, 6690, -1931, -7269, 2520, 13515, 6991, -6629, -7062, 1943]
1275A943K766m754j423K161j395m497q29K570L034K658j105o606o747L580J1389
1290B745J970r439m400Q108N061q492o135J1104J1505p113j4329m07J2027O196
1304H401m391m173Q07J245j709p60j37J229L095J892n473q670J744J2121M396
1319I617j0656q453N717O789n767o103P051R636m205j2516j100R615N019l581
1333A063l451J098K79j116J088J888R99J680Q56m444p140K752J1275L472j0204
1348I5p105P239P674o405q374O267J1191l290j3691l024J0492P133k543n401j778
1363a520R11Q60R81l19p04J914L240l417p568n6J1243N673r197r744M394P699
1379D390k731o230M012R078l191j1051k342Q549N967l255m369j32O64q7J651J362
$$ y = [1943, 4709, -45, -1468, 693, -702, -5199, -6028, -3458, -424, 2234, 1129, -5477, -12224, -8644, 2745, 4715, -4724, -9124, -1016, 4045, -4447, -10582, 522, 12027, 4914, -9415, -9822, 2205, 8401, 4010, -163, 644, 1889, 180, -580, -717, 512, 3607, 5499, 26, -8644, -6900, 5221, 9617, -1039, -9492, -3775, 3014, -2753, -8856, -1805, 7831, 3626, -8890, -9990, -375, 4644, 1063, -2388, -1290, -1011, -2127, -1039, 849, 1848, 3528, 4384, -60, -7200, -4448, 6827, 10299, 95, -7010, 229, 7903, 1498, -6876, -609, 10582, 7292, -6399, -9423, 1069, 8202, 5659, 258, -1520, -609, 251, 1232, 913, 209, 2123, 5363, 1946, -5622, -5678, 5565, 11238, 2041, -7703, -3309, 4390, 1659, -4571, -559, 8519, 5328, -5723, -8065, 484, 6451, 3196, -1173, -1305, -641, -728, 923, 2285]
1395B285n10L98J882k879p201Q20J1539N452r467r785M760R361k644q643K414
1410b218R599j562j1101m118Q335P313j174n397l366j448J927M254N80k993q44
1425b213L850o09o717j355J0131P063p933j0816K487R917K77o151J142O562j458
1440D177q601k871P041O235k040m959k148m05J749L412P25k977j239L066j331
1455a66o634p61J1006P117r080j1829L179J1613R91p798r40O640J083o971l645
1470f195O436O411o94m520m388r87K729N463J486n492k838L555J695n102k590
1485e031P595O618o836j1007J523J0333K623o737j327N110j71o501j773O620N138
1500F177j611n024l176J63L530M802N36n703k833L400K402n115j985P741O938
$$ y = [2285, 1775, 2173, 4055, 1176, -6025, -5205, 6334, 11786, 2319, -7466, -2706, 6655, 4011, -4632, -2218, 7381, 5819, -5282, -9400, -1065, 6248, 5074, -323, -3689, -5137, -3210, 1044, 1624, -1369, -2213, 1637, 1028, -5689, -7044, 3087, 10150, 2217, -8599, -6112, 3805, 4082, -2069, -927, 5635, 4177, -4424, -7295, -254, 5981, 3941, -1018, -3166, -3571, -1822, 1590, 2315, -662, -1901, 1165, -166, -6800, -7561, 3445, 10562, 1482, -10347, -7168, 4445, 5436, -2362, -3302, 3338, 4421, -2550, -6195, 241, 6652, 5958, 1438, -2950, -3937, -1208, 4255, 5741, 249, -2589, 966, 2661, -2441, -5031, 2564, 9182, 2346, -8661, -7138, 3195, 5818, -919, -2246, 2864, 2693, -3808, -5581, 1039, 6177, 4566, -458, -3634, -3471, 59, 4861, 5397, -306, -3139, 261, 2663, -2452, -4437, 3304, 10242]
1515A0242p932j1789J876J2061L197p971l942L689K651l610k722L996M534j69
1529D111m280l746j191L208O846J382o390m822L508M560l251l568N264N791n497
$$ y = [10242, 2310, -9479, -7603, 4458, 7655, -316, -4258, -569, 2082, -1528, -4250, -254, 4280, 4111, -169, -3915, -5106, -1898, 4948, 6330, -60, -4882, -1374, 3186, -65, -3633, 1631, 7422, 1925]
$$ [...]
8191A24
##END NTUPLES=NMR FID
##END=
