##TITLE=1H_Ser 4645-Van3
 CDcl3, 8 sc, 
 30.1.2020
##JCAMPDX= 6.0         $$ Bruker NMR JCAMP-DX V2.0
##DATA TYPE= NMR FID
##DATA CLASS= NTUPLES
##ORIGIN= UXNMR, Bruker Analytische Messtechnik GmbH
##OWNER= root
$$ XWIN-NMR		Version 3.5
$$ Thu Jan 30 15:40:21 2020 Russian Standard Time (UT+4h)  she@DPX200
##.OBSERVE FREQUENCY= 200.1315
##.OBSERVE NUCLEUS= ^1H
##.DELAY= (6, 6)
##.ACQUISITION MODE= SIMULTANEOUS
##.ACQUISITION SCHEME= undefined
##.AVERAGES= 8
##.DIGITISER RES= 18
##SPECTROMETER/DATA SYSTEM= spect
##.PULSE SEQUENCE= zg30
##.SOLVENT NAME= CDCl3
##.SHIFT REFERENCE= (INTERNAL, CDCl3, 0, 15.7039)
##AUDIT TRAIL= $$ (NUMBER, WHEN, WHO, WHERE, WHAT)
$$ ##TITLE= Audit trail, XWIN-NMR		Version 3.5
$$ ##JCAMPDX= 5.01
$$ ##ORIGIN= Bruker BioSpin GmbH
$$ ##OWNER= she
$$ F:/spectra/data/she/nmr/H-F/1/audita.txt
$$ ##AUDIT TRAIL=  $$ (NUMBER, WHEN, WHO, WHERE, WHAT)
(   1,<2020-01-30 15:39:02.01 +0400>,<she>,<DPX200>,
      <created by zg, POWCHK disabled, PULCHK disabled
       configuration hash MD5:
       00 E9 B6 7A A2 85 ED C7 34 08 36 98 17 FE 4E 26
       data hash MD5: 16K
       68 BE CF 71 CF 20 3D 1A FD BC 10 DA B8 6E 26 7C>)
$$ ##END=
$$ 
$$ hash MD5
$$ 06 5B DC 73 FC B0 8F 61 6D 3D 50 ED AD BD D0 79
##$RELAX= 
##$RELAX= 
##$RELAX= 
##$RELAX= 
##$RELAX= 
##$RELAX= 
$$ Bruker specific parameters
$$ --------------------------
##$DU= <F:/spectra>
##$EXPNO= 1
##$NAME= <H-F>
##$PROCNO= 1
##$TYPE= <nmr>
##$USER= <she>
##$AMP= (0..31)
100 100 100 100 100 100 100 100 100 100 100 100 100 100 100 100 100 100 
100 100 100 100 100 100 100 100 100 100 100 100 100 100 
##$AQSEQ= 0
##$AQ_mod= 1
##$AUNM= <au_zg>
##$AUTOPOS= <>
##$BF1= 200.13
##$BF2= 200.13
##$BF3= 200.13
##$BF4= 200.13
##$BF5= 200.13
##$BF6= 200.13
##$BF7= 200.13
##$BF8= 200.13
##$BYTORDA= 1
##$CFDGTYP= 0
##$CFRGTYP= 5
##$CHEMSTR= <none>
##$CNST= (0..31)
1 1 145 1 1 1 1 1 1 1 1 1 1 1 1 1 1 1 1 1 1 1 1 1 1 1 1 1 1 1 1 1 
##$CPDPRG= <>
##$CPDPRG1= <>
##$CPDPRG2= <>
##$CPDPRG3= <>
##$CPDPRG4= <mlev>
##$CPDPRG5= <mlev>
##$CPDPRG6= <mlev>
##$CPDPRG7= <mlev>
##$CPDPRG8= <mlev>
##$CPDPRGB= <>
##$CPDPRGT= <>
##$D= (0..31)
0 1.2 0 0 0 0 0 0 0 0.06 0 0.03 0 0 0 0 0.0002 0 0 0 0 0 0 0 0 0 0 0 0 
0 0 0 
##$DATE= 1580384341
##$DBL= (0..7)
120 120 120 120 120 120 120 120 
##$DBP= (0..7)
150 150 150 150 150 150 150 150 
##$DBP07= 0
##$DBPNAM0= <>
##$DBPNAM1= <>
##$DBPNAM2= <>
##$DBPNAM3= <>
##$DBPNAM4= <>
##$DBPNAM5= <>
##$DBPNAM6= <>
##$DBPNAM7= <>
##$DBPOAL= (0..7)
0.5 0.5 0.5 0.5 0.5 0.5 0.5 0.5 
##$DBPOFFS= (0..7)
0 0 0 0 0 0 0 0 
##$DE= 6
##$DECBNUC= <off>
##$DECIM= 24
##$DECNUC= <off>
##$DECSTAT= 4
##$DIGMOD= 1
##$DIGTYP= 9
##$DL= (0..7)
0 120 120 120 120 120 120 120 
##$DP= (0..7)
150 150 150 150 150 150 150 150 
##$DP07= 0
##$DPNAME0= <>
##$DPNAME1= <>
##$DPNAME2= <>
##$DPNAME3= <>
##$DPNAME4= <>
##$DPNAME5= <>
##$DPNAME6= <>
##$DPNAME7= <>
##$DPOAL= (0..7)
0.5 0.5 0.5 0.5 0.5 0.5 0.5 0.5 
##$DPOFFS= (0..7)
0 0 0 0 0 0 0 0 
##$DQDMODE= 0
##$DR= 18
##$DS= 0
##$DSLIST= <SSSSSSSSSSSSSSS>
$$ [...]
##$SUBNAM2= <"">
##$SUBNAM3= <"">
##$SUBNAM4= <"">
##$SUBNAM5= <"">
##$SUBNAM6= <"">
##$SUBNAM7= <"">
##$SUBNAM8= <"">
##$SUBNAM9= <"">
##$SW= 24.9337058887773
##$SWIBOX= (0..15)
0 0 2 0 0 0 0 0 0 0 0 0 0 0 0 0 
##$SW_h= 4990.01996007984
##$TD= 16384
##$TD0= 1
##$TE= 0
##$TE2= 300
##$TE3= 300
##$TEG= 300
##$TL= (0..7)
0 120 120 120 120 120 120 120 
##$TP= (0..7)
150 150 150 150 150 150 150 150 
##$TP07= 0
##$TPNAME0= <>
##$TPNAME1= <>
##$TPNAME2= <>
##$TPNAME3= <>
##$TPNAME4= <>
##$TPNAME5= <>
##$TPNAME6= <>
##$TPNAME7= <>
##$TPOAL= (0..7)
0.5 0.5 0.5 0.5 0.5 0.5 0.5 0.5 
##$TPOFFS= (0..7)
0 0 0 0 0 0 0 0 
##$TUNHIN= 0
##$TUNHOUT= 0
##$TUNXOUT= 0
##$USERA1= <user>
##$USERA2= <user>
##$USERA3= <user>
##$USERA4= <user>
##$USERA5= <user>
##$V9= 5
##$VALIST= <valist>
##$VCLIST= <CCCCCCCCCCCCCCC>
##$VD= 0
##$VDLIST= <DDDDDDDDDDDDDDD>
##$VPLIST= <PPPPPPPPPPPPPPP>
##$VTLIST= <TTTTTTTTTTTTTTT>
##$WBST= 1024
##$WBSW= 4
##$XGAIN= (0..3)
0 0 0 0 
##$XL= 0
##$YL= 0
##$YMAX_a= 150405
##$YMIN_a= -256824
##$ZGOPTNS= <>
##$ZL1= 120
##$ZL2= 120
##$ZL3= 120
##$ZL4= 120
##$ABSF1= 10
##$ABSF2= 0
##$ABSG= 5
##$ABSL= 3
##$ALPHA= 0
##$AQORDER= 0
##$ASSFAC= 0
##$ASSFACI= 0
##$ASSFACX= 0
##$ASSWID= 0
##$AUNMP= <proc_1d>
##$AZFE= 0.1
##$AZFW= 0.1
##$BCFW= 1
##$BC_mod= 2
##$BYTORDP= 1
##$COROFFS= 0
##$CY= 11.3945322036743
##$DATMOD= 1
##$DC= 2
##$DFILT= <>
##$DTYPP= 0
##$F1P= 16.9975609425685
##$F2P= -3.02152046262296
##$FCOR= 0.5
##$FTSIZE= 0
##$FT_mod= 4
##$GAMMA= 1
##$GB= 0.15
##$INTBC= 1
##$INTSCL= 1
##$ISEN= 128
##$LB= 0.24
##$LEV0= 0
##$LPBIN= 0
##$MAXI= 10000
##$MC2= 0
##$MEAN= 0
##$ME_mod= 0
##$MI= 1.114404
##$NCOEF= 0
##$NC_proc= 0
##$NLEV= 6
##$NOISF1= 3.799351
##$NOISF2= 2.8
##$NSP= 1
##$NTH_PI= 0
##$NZP= 0
##$OFFSET= 15.70392
##$PC= 1
##$PHC0= -9947.699
##$PHC1= 15.80081
##$PH_mod= 1
##$PKNL= yes
##$PPARMOD= 0
##$PSCAL= 0
##$PSIGN= 0
##$REVERSE= no
##$SF= 200.130013532006
##$SI= 16384
##$SIGF1= 3
##$SIGF2= 2
##$SINO= 400
##$SIOLD= 16384
##$SREGLST= <1H.CDCl3>
##$SSB= 0
##$STSI= 0
##$STSR= 0
##$SW_p= 3612.71676300578
##$SYMM= 0
##$S_DEV= 0
##$TDeff= 0
##$TDoff= 0
##$TI= <>
##$TILT= no
##$TM1= 0
##$TM2= 0
##$TOPLEV= 0
##$USERP1= <user>
##$USERP2= <user>
##$USERP3= <user>
##$USERP4= <user>
##$USERP5= <user>
##$WDW= 1
##$XDIM= 8192
##$YMAX_p= 0
##$YMIN_p= 0
$$ End of Bruker specific parameters
$$ ---------------------------------
##NTUPLES= NMR FID
##VAR_NAME=  TIME,          FID/REAL,        FID/IMAG
##SYMBOL=    X,             R,               I
##VAR_TYPE=  INDEPENDENT,   DEPENDENT,       DEPENDENT
##VAR_FORM=  AFFN,          ASDF,            ASDF
##VAR_DIM=   8192,          8192,            8192
##UNITS=     SECONDS,       ARBITRARY UNITS, ARBITRARY UNITS
##FACTOR=    0.0002004,     1,               1
##FIRST=     0,             0,               0
##LAST=      1.6414764,     0,               0
##MIN=       0,             -256824,         0
##MAX=       1.6414764,     150405,          0
$$ Real data points
##PAGE= N=1
##DATA TABLE= (X++(R..R)), XYDATA
0@%%%%%%%qJ6j6J6k4L2m0M8n6P2q8J04j20J37j61J88k14K48k87L28l74M23m78
$$ 0 0 0 0 0 0 0 0 -8 8 -8 8 -16 16 -24 24 -32 40 -48 56 -64 73 -88 100 -114 134 -153 175 -199 224 -254
30b54N39o06O82p62Q51r52J060j179J308j449J607j781J971k181K417k680K974
$$ -254 285 -321 361 -401 450 -502 558 -621 687 -762 845 -936 1035 -1146 1271 -1409 1565
47A565l308L690m131M647n260O003o926Q108r689J1924j5354K1351l4867J19017
$$ 1565 -1743 1947 -2184 2463 -2797 3206 -3720 4388 -5301 6623 -8731 12620 -22247 96770
61I6770k28j68555J06065J14121K232r8358o911L1205q549n6685R372M4765Q824
$$ 96770 96542 -72013 34052 148173 150405 52047 45136 76341 67792 11107 20479 65244 74068
74G4068n0314k7803m865q133j3671K6015K9385j7637n3338j2272K5265Q396j9486
$$ 74068 23754 -4049 -8914 -17047 -30718 -4703 24682 7045 -46293 -58565 -33300 -24904 -44390
87d4390J0480L7645j873o4545m6283L8070Q1283L0159m5928o5944j7020M4158
$$ -44390 -33910 3735 1862 -62683 -108966 -70896 10387 40546 -5382 -71326 -88346 -44188
99d4188N4048J173m9955k9889L3029L8323k2220m6340J6473O5579Q664p4107n1656
$$ -44188 9860 11033 -38922 -68811 -35782 2541 -19679 -66019 -49546 16033 24697 -49410 -101066
112a01066M4072O9901n62m7520j0597L0971Q488k8486j5106K4185L0846M584j7931
$$ -101066 -56994 12907 12345 -35175 -45772 -14801 -6313 -34799 -49905 -25720 5126 9710 -8221
125h221k2027q469K0094L8929J4244l4719m1109J0792M7882J7221k8951j7465
$$ -8221 -30248 -38717 -18623 20306 34550 -169 -41278 -30486 17396 34617 5666 -11799
137a1799K6024K3220k4514l7558J1963N4102K6105l4678m6309K161M3777K7880
$$ -11799 14225 37445 12931 -24627 -12664 41438 67543 32865 -13444 -11283 32494 60374
149F0374j8112l2834j433K9687J7772k0097k8999O698L7088J5183l2420l9956
$$ 60374 42262 9428 7995 37682 55454 35357 6358 13056 50144 65327 32907 -7049
161g049N049M2391K3009k5299l8108l559K5887J1313j8902j6092J4004K0788j2196
$$ -7049 -2000 40391 63400 38101 -7 -3566 22321 33634 14732 -1360 12644 33432 21236
174B1236l5927r013L4454L0246j9536m4472q826L6623K9857j5532l7253j1747
$$ 21236 -14691 -23704 10750 40996 21460 -23012 -31838 4785 34642 19110 -18143 -29890
186b9890K2879K5066k970k5859j6650J3757K7273K943l0266k4752J6572L4739
$$ -29890 -7011 18055 15085 -10774 -27424 -13667 13606 16549 -13717 -38469 -21897 12842
198A2842Q18l5308j7805K6961K9207j4113l5292k936L0937J5458k2185k1880J4660
$$ 12842 13660 -21648 -39453 -12492 16715 2602 -32690 -35626 -4689 10769 -11416 -33296 -18636
211a8636K9800l94l1973j9165K1849L6371L659l4986k9087J5741M1758J4244l0174
$$ -18636 11164 10770 -21203 -40368 -18519 17852 21511 -13475 -42562 -26821 14937 29181 -993
224i93l2594P304L2328J0489k1315j6786J3418K2029k660k3615j1013J7404K4673
$$ -993 -33587 -26283 6045 16534 -4781 -21567 -8149 13880 11220 -12395 -23408 -6004 18669
237A8669K729k1739j8818Q270K5353R384j7577j5758J2499K2138n925k9114o344
$$ 18669 21398 -341 -19159 -10889 14464 23848 6271 -9487 3012 25150 19225 -9889 -16233
250a6233L3248K7607k0640m3020o034L7685K8048j6815l3232m702K2561J1987
$$ -16233 17015 44622 23982 -19038 -25072 12613 40661 23846 -9386 -14088 8473 20460
262B0460j5390j7250Q007K3161N511k2629k4064N095K9115J7049j6279k7399k576
$$ 20460 5070 -12180 -4173 18988 24499 1870 -22194 -17099 12016 29065 12786 -14613 -17189
275a7189K2611J3957j2798j6560P041J9893j090k6739j6754K0027L3560K976l3078
$$ -17189 5422 19379 6581 -9979 -2938 16955 15865 -10874 -27628 -7601 25959 28935 -4143
288d143k8502Q966K9748J0095j9353j8232P247J6403m399k1269m518K4399K1210
$$ -4143 -32645 -23679 6069 16164 -3189 -21421 -14174 2229 -2170 -23439 -27957 -3558 17652
301A7652j3967l4655j0787K7747L1285k466k7418j3618J4845J7414m467j4929
$$ 17652 3685 -30970 -41757 -14010 17275 14809 -12609 -26227 -11382 6032 1565 -13364
313a3364K545K1068R325k0156k5464N147L3133K0542j7449l2548p599K2789J9978
$$ -13364 -10819 10249 19574 -582 -26046 -20899 12234 32776 15327 -17221 -24820 -2031 17947
326A7947o873j7681j78J5113K807j7974j3013J5068K6965K709k7930k3583J1149
$$ 17947 11074 -6607 -6785 8328 11135 -6839 -19852 -4784 22181 24890 -3040 -26623 -15474
339a5474L1005J1833j8630j9882M004J8069K647j5771q299J5362J9471o344k7528
$$ -15474 15531 27364 8734 -11148 -7144 10925 13572 -2199 -10498 4864 24335 17991 -9537
352i537j2992J9609K6821j161k7016j7141J2719K1088o81j8209o206J5416J2545
$$ -9537 -22529 -2920 23901 22740 -4276 -21417 -8698 12390 11709 -6500 -12706 2710 15255
365A5255j1940k2281q74K4632J8794j1896k6270n900K1094J8342q274k0173k217
$$ 15255 3315 -18966 -19840 4792 23586 11690 -14580 -20480 614 18956 10682 -9491 -11708
378a1708J7971R984j5006j8500O747K4136Q095k1294k3260M042K4430J0776j5992
$$ -11708 6263 16247 1241 -17259 -10512 13624 21719 425 -22835 -18793 5637 16413 421
391D21j9147L696J8265M523j5997j2799J0475K0005P01k1721j5123J3064K4769
$$ 421 -18726 -15030 3235 7758 -8239 -21038 -10563 9442 10143 -11578 -26701 -13637 11132
404A1132L730k0652j5670J0002J9244K07j7780q358J4070J5922o424k1236o635
$$ 11132 14862 -5790 -21460 -11458 7786 7993 -9787 -18145 -4075 11847 5423 -15813 -22448
417b2448J7442J7723o532k2315q454J5747J7008n267j8633l871J7163J3204j0668
$$ -22448 -5006 12717 6185 -16130 -24584 -8837 8171 2904 -15729 -19600 -2437 10767 99
430I9j9841O0K1734J4421j1891k0020N95K0324J1616j1993j6742L322J8785O981
$$ 99 -19742 -19682 2052 16473 4582 -15438 -14843 5481 17097 5104 -11638 -8316 10469 17450
444A7450j5659j6317O889K1842O948j7945j8906M682J9804O459j4997j3224Q103
$$ 17450 1791 -14526 -7637 14205 21153 3208 -15698 -11016 8788 15247 250 -12974 -4871
457d871J6683o78j8256r501J4708J9976k096k2093j2676J3282K1407K380j6721
$$ -4871 11812 11134 -7122 -16623 -1915 18061 15965 -6128 -18804 -5522 15885 18265 1544
470A544j0914Q811J2991l349j4646k670J5999J2423j1186k2273l989J9751J7507
$$ 1544 -9370 -559 12432 9083 -5563 -8233 7766 20189 9003 -13270 -17259 2492 19999
483A9999p681k2070p881J3319J2839n545j3136Q82J4210N053j4846j6417N807
$$ 19999 12318 -9752 -17633 -4314 8525 2980 -10156 -9274 4936 9989 -4857 -21274 -15467
496a5467K3109J1164j5416k1797k96J9602J2620q515j3788J350J1899J353j3311
$$ -15467 7642 18806 3390 -18407 -18703 899 13519 5004 -8784 -7434 4465 5818 -7493
509g493p614J2651J8206j649k1970j5230J0400K1628N128j5914j4162N319J3463
$$ -7493 -15107 -2456 15750 14101 -7869 -23099 -12699 8929 14057 -1857 -16019 -10700 2763
522B763R1j2638m382J3042J2275q625k1622o091J8936K0500l348k1177j1314J0425
$$ 2763 2854 -9784 -14166 -1124 11151 2526 -19096 -25187 -6251 14249 10901 -10276 -21590 -11165
536a1165J4622j047j1610k080J1313O312j1099j4585M286K0992J1573j2890k1451
$$ -11165 3457 2410 -9200 -11280 33 6345 -4754 -19339 -15053 5939 17512 4622 -16829
549a6829k792J7928J4907m976j3200p18J0993L908j0559q621R587J8003J924j9021
$$ -16829 -19621 -1693 13214 8238 -4962 -5680 5313 9221 -1338 -9959 -372 17631 19555 534
563E34j6584P494K2118Q973j3595j6497O26J2287L663r532n710R184J1261n754
$$ 534 -16050 -8556 13562 22535 8940 -7557 -6931 5356 9019 -513 -6223 2961 14222 8468
577H468j8569p221J5141J8899j349j9479j2360R121J6128J965j1062n068Q695
$$ 8468 -10101 -17322 -2181 16718 15369 -4110 -16470 -7349 8779 10744 -318 -5386 3309
590C309P693p569j3755J175J7904J2175j0470k0437m855J5548J4459m648j5304
$$ 3309 11002 3433 -10322 -9147 8757 20932 10462 -9975 -14830 718 15177 10529 -4775
603d775m966R037O343p525j0140M021J3830L250j5400j6076M203J8990R018j2067
$$ -4775 -9741 -704 5639 -1886 -12026 -8005 5825 9075 -6325 -22401 -18198 792 9810 -2257
617b257j6098P39J3909N953r324q866O140J2350p99j4850q596J1258J7609J125
$$ -2257 -18355 -17616 -3707 2246 -7078 -15944 -9804 2546 1747 -13103 -21699 -10441 7168 8293
631H293j6359j2362O820J5107K875j1273p371P615J0320l204j2976k989J3554
$$ 8293 -8066 -20428 -13608 1499 4374 -6899 -14270 -6655 3665 461 -12515 -15504 -1950
644a950J2664n541j6827n153J3583J4728k030j2969l938J0180Q955n018j0286
$$ -1950 10714 5173 -11654 -16807 -3224 11504 9474 -3495 -7433 2747 11702 6684 -3602
657c602J703J3995P738r953j4106J753J6262R571r207j4661n25J2747P102q215
$$ -3602 -1899 12096 19834 9881 -4225 -2472 13790 23361 14154 -507 -1032 11715 18817 10602
671A0602j0476L300J2256K414j2473j1059N583J4976L763j2731j1802M502J3387
$$ 10602 126 3426 15682 18096 5623 -5436 147 15123 18886 6155 -5647 -1145 12242
684A2242L166j0889q669N995J1040j221j2969o338R906J2825k585j5201p763Q893
$$ 12242 15408 4519 -4150 1845 12885 11664 -1305 -7643 2263 15088 12503 -2698 -10461 -1568
698a568J1978k377j3573n970R101R542m907j3655l587J1312R626o589j4846l413
$$ -1568 10410 8033 -5540 -11510 -2409 7133 2226 -11429 -15016 -3704 5922 -667 -15513 -18926
712a8926J1815R781n633j2046j142J0772O183p768j0810K206J2985O070r368j2080
$$ -18926 -7111 2670 -2963 -15009 -16151 -5379 804 -6964 -17774 -15568 -2583 3487 -5881 -17961
726a7961J844J3129O545q311j0940J718J0781L290r236p857O190J2176M58j2908
$$ -17961 -16117 -2988 3557 -4754 -15694 -13976 -3195 95 -9141 -16998 -10808 1368 1826 -11082
740a1082r359P043J3938K560j1196q732N717J1359J089r235m428Q472J0098k899
$$ -11082 -20441 -13398 540 3100 -8096 -16828 -11111 248 1337 -7898 -12326 -3854 6244 3345
754C345j2370l719J2225J3576k146j3457n774R548J1356j565r817j917R364O928
$$ 3345 -9025 -12744 -519 13057 10911 -2546 -8320 1228 12584 11019 1202 -715 8649 15577
768A5577n985j0103J409J2758P586p880j3193j069J2086Q946n095j0158l01Q769
$$ 15577 9592 -511 898 13656 21242 13362 169 -900 11186 20132 15037 4879 4578 13347
782A3347L678p986p994M581J2019K126j2341j1215M605J3865M562j0299j1242
$$ 13347 17025 9039 1045 5626 17645 19771 7430 -3785 820 14685 19247 8948 -2294
795b294J666R615K378q183n956N751Q723k355j2122o327Q362J1942n07j2305p990
$$ -2294 -628 8987 11365 3182 -2774 2977 11700 9345 -2777 -9104 -742 11200 10693 -1612 -9602
810i602N671R848J64q410l972N971N524n526j0552n87J1566Q377p097j4515l925
$$ -9602 -3931 5917 6081 -2329 -6301 -330 5194 -332 -10884 -11471 95 8472 1375 -13140 -17065
825a7065J0487R734l940j1283l146P597N246n528q123K434J0586L739r683j1003
$$ -17065 -6578 3156 -784 -12067 -15213 -7616 -2370 -7898 -16021 -13587 -3001 738 -8945 -19948
839a9948K524J3246O812p056r892R57R185L851n961n277M901Q732m68j0065n701
$$ -19948 -17424 -4178 2634 -4422 -14314 -13357 -4172 -321 -6282 -11559 -6658 2074 1606 -8459 -14160
854a4160P845J2304J130j0874q630M593J0747K407p552n079N627P961k020r520
$$ -14160 -6315 5989 7119 -3755 -12385 -7792 2955 5362 -2190 -7269 -1642 6319 4299 -5221
868e221k627R836J0134l228j2241m560R324J0845q49r106l499O338N911l567p456
$$ -5221 -7848 1988 12122 8894 -3347 -7907 1417 12262 11413 2307 -1192 5146 11057 7490 34
883C4R30R413N132p228j0554M8J0709P014n798j0321j223Q068M524n507o575K907
$$ 34 964 10377 15509 8281 -2273 -2225 8484 15498 9700 -621 -1844 6224 10748 5241 -1334 1573
899A573Q424R78r435p817M554J1393L400q903r072K134R274L124o617o090L477
$$ 1573 9997 10975 1540 -6277 -1723 9670 13070 4167 -4905 -2771 6503 9627 3010 -3080 397
914C97P282j161r195m443P595R908j778j1767o730O016R625j8q500m404N078N916
$$ 397 7679 6518 -2677 -7120 475 10383 8605 -3162 -9892 -3876 5749 5731 -2769 -7173 -2095 3821
930C821k642p710j122P995O403m970j0526k294R365Q552l094r334k531O812N126
$$ 3821 1179 -6531 -7653 342 6745 1775 -8751 -11045 -1680 6872 3778 -5556 -8087 -1275 3851
945C851m548o995J777Q808K998p989q844K498J0703M966o938r482J1Q257M411
$$ 3851 -697 -7692 -5915 2893 5891 -2098 -10942 -8444 2259 7225 287 -9195 -9184 -927 3484
960C484m797n701K713P229O16p926n718N588J0264J430r016p060M154R076J786
$$ 3484 -1313 -7014 -4301 2928 3544 -4382 -10100 -4512 5752 7182 -1834 -8894 -4740 4336 6122
975F122o405m412M043N761j944p543j658P800P516l100j0364m350P069Q786q77
$$ 6122 -283 -4695 -652 5109 3165 -4378 -6036 1764 9280 6180 -4184 -8534 -1465 7321 6444
990F444q265l528N495N509k884o610N00P931M480o240r227K45R818O986m424q889
$$ 6444 -1821 -5349 146 5655 2771 -3839 -3339 4592 9072 2832 -6395 -6150 3668 10654 6230 -2659
1006b659j607O590M306l840n615J800O779J103p703o521M048R871K531q614q582
$$ -2659 -4266 2324 6630 2790 -2825 -1025 5754 6857 -846 -7367 -3319 6552 9083 469 -8113
1021h113J864Q475L092n557n016K927N804q44p274l301O491Q231j239r476n329
$$ -8113 -6249 2226 5318 -239 -5255 -2328 3476 2632 -4642 -7943 -1452 6779 5540 -3936 -9265
1036i265N765Q893P96o972m368L764N093j819n988l90P093N013m787r115j593
$$ -9265 -3500 5393 6189 -783 -5151 -1387 3706 1887 -4101 -4491 2602 7615 2828 -6287 -7880
1051g880Q095P254k998q524k831N813N163k656n395O54O249K149o278o821K611
$$ -7880 215 7469 4471 -4053 -6884 -1071 4092 1436 -3959 -3305 2944 5093 -1185 -8006 -5395
1066e395R359M193o260q123M51P460M107m292n461J601N812N36o264l980M989
$$ -5395 3964 8157 1897 -6226 -5775 1685 5792 1500 -3961 -2360 3452 3988 -2276 -6256 -1267
1081a267Q073M0q729o431M014Q567J909o365m823L179N436q19n849j614N950N547
$$ -1267 6806 6846 -1883 -8314 -4300 4267 6176 -189 -5012 -1833 3603 2784 -3065 -4679 1271 6818
1097F818l193q597k466P280P818j593q153l716M636N429j554n610n21N545L237
$$ 6818 3625 -4972 -7438 -158 7660 6067 -2086 -5802 -1166 4263 2709 -2901 -3422 2123 5360
1112E360m685o719O49P688M581m907p980p70O790M566l292n451O87N350J427n507
$$ 5360 675 -6044 -5395 2293 6874 1967 -6013 -6783 7 4573 1281 -4170 -3483 1867 3294 -2213
1128b213m797L411P768J520p044o433K524P825K607n524n400J737N562N28n256
$$ -2213 -7010 -3599 4169 5689 -1355 -7788 -5264 2561 5168 -356 -5756 -4019 1543 2071 -3185
1143c185k987M421N902j369p665l855N144P359k55o820l727M199N537r63n509
$$ -3185 -6172 -1751 4151 2782 -4883 -8738 -3594 3765 3510 -3310 -7037 -2838 2699 1736 -3773
1158c773j153N095M356l464o780m33P151N600l126p343j734N689M734k586n628
$$ -3773 -4926 169 4525 1061 -5719 -6152 999 6599 3473 -3870 -5604 85 4819 2233 -3395
1173c395K5N633K786m604n583J775P029K931n441o533R43O918L276m037m759J392
$$ -3395 -3370 2263 5049 445 -5138 -3363 3666 6597 1156 -5377 -4434 2484 5760 1723 -3036 -1644
1189a644N332R77n100l806L562O413L84o498m637L562O821Q64n887m276K908N236
$$ -1644 3688 4665 -435 -4241 -679 5734 6118 -380 -5017 -1455 5366 6230 343 -3933 -1025 4211
1205D211n17n436k101M703N050k045o830k484N250N820j317o277k299M440M484
$$ 4211 3694 -1742 -3843 860 5910 3865 -2965 -5449 -199 5621 4304 -1973 -4272 168 4652
1220D652j956n260k91N192L171m043o256K46O611M138l833o649q09N115L275l414
$$ 4652 2696 -2564 -2855 2337 5508 1465 -4791 -4545 2066 6204 2371 -4278 -5087 28 3303 -111
1236a11m911P41M818J419m886m458K274O310J633n709n402J897O258K047m241
$$ -111 -5022 -4281 537 1956 -2930 -7388 -5114 1196 2829 -2880 -8282 -6385 -127 1920 -2321
1251b321l600K447M971m3n265k518M547O163o50o601l504M352O460K67n566l322
$$ -2321 -5921 -3474 1497 1454 -3811 -6329 -1782 4381 3731 -2870 -6374 -2022 4438 4705 -861 -4183
1267d183L195M380j217m615p07M840L710l086o168j054N605M831k188n783j381
$$ -4183 -988 3392 2175 -2440 -3147 1693 5403 2317 -3851 -4905 700 5531 3343 -2440 -3821
1282c821M342L633j986l956M38M659J851m396m779J847O758K994m605n840M06
$$ -3821 521 4154 2168 -1788 -1350 3309 5160 764 -4015 -2168 4590 7584 2979 -2861 -2455
1297b455N577K810l332m062J188M255N30m458l090L305N604J62o120m691K703
$$ -2455 3122 5932 2600 -1462 -274 3981 4511 53 -3037 268 5872 6034 -86 -4777 -2074
1312b074O141J323m517l582K078L855p03m381j373M217M004k518o343j859N137
$$ -2074 4067 5390 873 -2709 -631 3224 2521 -1860 -3233 984 4988 2470 -3873 -5732 -595
1327e95N451j357o025k891L289L936j345m157l34M115K369l707n224N60N937L493
$$ -595 4856 3499 -2526 -5417 -2128 1808 463 -3694 -4028 87 2456 -1251 -6475 -5915 22 3515
1343C515l710o034n21M990L465k299l719L58L620R00l919l118K743N724J104n373
$$ 3515 -195 -6229 -6750 -1760 1705 -594 -4313 -3955 -335 565 -3354 -6472 -3729 1995 3099 -2274
1359b274m757J876N976K300l837l960J129L972M68l329j380L539M217j386n518
$$ -2274 -7031 -5155 821 3121 -716 -4676 -3547 425 893 -2436 -3816 -277 3940 2554 -2964
1374b964k426M319N809J63m908l013K753M183q8l526q97L600K827k731m867M1
$$ -2964 -5390 -1071 4738 4901 -7 -3020 -267 3916 3828 302 -595 3005 5832 3101 -1766 -1725
1390a725N667M251k649n915j670M127L825j359l834k54L414J487l390l452J716
$$ -1725 3942 8193 5544 -371 -2041 2086 5911 4552 718 464 3878 5365 1975 -1477 239
1405B39N396J589m864n221R74N633K780l138m088M22L428N43l366k252K812M132
$$ 239 5635 7224 2360 -2861 -1887 3746 6526 3388 -700 -278 3150 3693 327 -1925 887 5019
1421E019p48n296l260L112N266O41m752l886J564L807J28l278j352K791K789k112
$$ 5019 4271 -1025 -4285 -1173 4093 4734 -18 -3904 -2340 1467 1595 -1683 -3035 -244 2545 433
1437D33m978j175M412M337j613n245k257L171L792o16l612j029K831J720k654
$$ 433 -4545 -5720 -1308 3029 1416 -3829 -6086 -2915 877 261 -3351 -4380 -1549 171 -2483
1452b483l690J021M944K460l618n175j73M588L215k230l805J02L255J456k710
$$ -2483 -6173 -5152 -208 2252 -1366 -6541 -6714 -2126 1089 -1141 -4946 -4844 -1589 -133 -2843
1467b843k421K140M364N52m550l566K305N462J910l487l516J343L840O42k987
$$ -2843 -5264 -3124 1240 1792 -2758 -6324 -4019 1443 3353 -134 -3650 -2307 1533 2175 -812
1482h12j622K882L463j118m493j614L876M612m94m782k723K542L805K5l168r53
$$ -812 -2434 448 3911 2793 -1700 -3314 562 5174 4680 -102 -2825 -283 3522 3547 379 -574
1498e74K796K151k013l813O3M466L057k502m830q50M215L388j403l606o86K783
$$ -574 2222 4373 2360 -1453 -1390 3076 6133 3631 -1199 -2049 2166 5554 4151 545 -141 2642
1514B642J599k379k803J153M178J154l743m049Q39M545J923k994l784N00L223
$$ 2642 4241 1862 -941 212 4390 5544 1801 -2248 -1409 3136 5059 2065 -1719 -1219 2004
1529B004R98k723j900J838L124m92m272k503K761M573K78m155l030J746L534K06
$$ 2004 3002 279 -1621 217 3341 2849 -1423 -3926 -1165 3408 3686 -469 -3499 -1753 1781 1987
1545A987l084j699K271K381j515l675o64L625L321j841m706j560L126L303q99
$$ 1987 -1097 -2796 -525 1856 341 -3334 -3998 -373 2948 1107 -3599 -5159 -2033 1270 371
1560C71l302q83K691J945k022l025N89L739J950l019l940L79M230K757k170l543
$$ 371 -2931 -3814 -1123 822 -1200 -4225 -3636 103 2053 -966 -4906 -4527 -297 2460 290 -3253
1576c253j09K969J461k199k291J574L372L88l402k788J848M307J061l561l095
$$ -3253 -3362 -393 1068 -1131 -3422 -1848 1524 1912 -1490 -4278 -2430 1877 2938 -623 -3718
1591c718J164L591R30k527j697J929K728p39l465j366L136L731n68m015j974K557
$$ -3718 -2554 1037 1967 -560 -2257 -328 2400 1661 -1804 -3170 -34 3697 3129 -886 -2860 -303
1607c03L406j39l015j357K172K184j426k825j31L474K334k216l997n09L382K708
$$ -303 3103 2964 -51 -1408 764 2948 1522 -1303 -1434 2040 4374 2158 -1839 -2348 1034 3742
1623C742j482l217k59K643J555j915k477R03L342R91l179l227J175M134J679k702
$$ 3742 2260 -957 -1216 1427 2982 1067 -1410 -507 2835 3826 647 -2580 -1405 2729 4408 1706
1639A706l301N64K903R54k115k276J673K409j58l094j519K100K768J48l415k451
$$ 1706 -1595 -1031 1872 2826 711 -1565 108 2517 2359 -735 -2254 -154 2614 2762 -653 -3104
1655c104J766L274k4k641j302K040K290j227l179q15L148K798j267l688j178K624
$$ -3104 -1338 1936 1912 -729 -2031 9 2299 1072 -2107 -2922 226 3024 1757 -1931 -3109 -485
1671d85K751p71k846q16K030J535j557k479M77L107J506k476l395R8L322K071
$$ -485 2266 1495 -1351 -2167 -137 1398 -159 -2638 -2161 946 2452 -24 -3419 -3321 1 2072
1687B072j955k921J92K557J256j921k038J089K896M33k940k451J529L641J028
$$ 2072 117 -2804 -2612 -55 1201 -720 -2758 -1669 1227 1660 -1280 -3731 -2202 1439 2467
1702B467k651k441R10K651M20k260j345J817K452o82l099j213K683L125o13l445
$$ 2467 -184 -2625 -1715 936 1356 -904 -2249 -432 2020 1338 -1761 -2974 -291 2834 2221 -1224
1718a224j778K042K831k77k340q42K027J758j328k778j27L053K185j777l362n15
$$ -1224 -3002 -960 1871 1594 -746 -1588 439 2197 869 -1909 -2036 1017 3202 1425 -1937 -2452
1734b452K995K255j168k625m57K180J149j765j954R70K884Q37k569k803P32L285
$$ -2452 543 2798 1630 -995 -1452 728 1877 112 -1842 -872 2012 2849 280 -2523 -1791 1494
1750A494J451k056k492M07K388R06j837j391J389K377k78k961j605K012L228L95
$$ 1494 2945 889 -1603 -1196 1192 2098 261 -1130 259 2636 2358 -603 -2208 -196 3032 3427
1766C427k816k203J146K486L04k134j139J493J734r61k547m77K674K410j380l396
$$ 3427 611 -1592 -446 2040 2344 210 -929 564 2298 1337 -1210 -1687 987 3397 2017 -1379
1782a379j235K360K575n51k391o22J772J347j488k103N02K730J235k269k974L46
$$ -1379 -2614 -254 2321 1770 -621 -1243 529 1876 388 -1715 -1213 1517 2752 483 -2491 -2145
1798b145L131J869j477k655k59J878Q74j473j353J184K244k3k687j909J447L179
$$ -2145 986 2855 1378 -1277 -1536 342 1216 -257 -1610 -426 1818 1795 -892 -2801 -1354 1825
1814A825O98k515k357N69K461Q16j530j158J066J594p11k427p05K374K535m87
$$ 1825 2523 8 -2349 -1780 681 1497 -33 -1191 -125 1469 758 -1669 -2374 0 2535 2048
1830B048l023j637J640K530R9k209j068J295J243r51j758J89K474J473j845l129
$$ 2048 -975 -2612 -972 1558 1657 -552 -1620 -325 918 -33 -1791 -1602 872 2345 500 -2629
1846b629m34K700K301q38k411o75J649J120r75j333P14K057K66k437j984J196
$$ -2629 -3063 -363 1938 1100 -1311 -1986 -337 783 -192 -1525 -811 1246 1512 -925 -2909 -1713
1862a713L196J195k071k580P9K161J050j169j251R05J523k51k271q44J890K644
$$ -1713 1483 2678 607 -1973 -1894 267 1317 148 -1103 -198 1325 1074 -1197 -2041 -151 2493
1878B493j92k782j837J250K522O03j504j099R51J137o34j804l5K291J697j300
$$ 2493 2301 -481 -2318 -1068 1454 2057 553 -546 405 1542 908 -896 -931 1360 3057 1757
1894A757k807q19K247K418m37k291j041J180J193o74j240M36J910O84k040k325
$$ 1757 -1050 -1869 378 2796 2359 68 -973 207 1400 726 -514 -78 1832 2516 476 -1849
1910a849N67K760J527j433k506j82J870J301p91j384M53J457j14k016j193J570
$$ -1849 -1282 1478 3005 1572 -934 -1116 754 2055 1264 -120 333 1790 1676 -340 -1533 37
1926C7K555K78k395k094N84K178P83j500j257N98J197l49j720m52J817J786r55
$$ 37 2592 2870 475 -1619 -1035 1143 1926 426 -831 -233 964 615 -1105 -1557 260 2046 1091
1943A091k685j257J800K348M7j931j281J028J233n12j403M6J727R07j512k143
$$ 1091 -1594 -2851 -1051 1297 1344 -587 -1868 -840 393 -119 -1522 -1476 251 1158 -354 -2497
1959b497P8K365J674j091k296o76J636J211o26j256L05J577L38j750j445R36K419
$$ -2497 -2419 -54 1620 529 -1767 -2443 -807 404 -222 -1478 -1173 404 742 -1008 -2453 -1517 902
1976I02P91j795j958L37K144J030j038j248L30J448j99j514n53J408J972k96k254
$$ 902 1693 -102 -2060 -1723 421 1451 413 -835 -505 943 744 -770 -1323 85 2057 1761 -493
1993d93j269J109K178L28j794j316P26J514l38q45o69K017O70r82k017m23J943
$$ -493 -1762 -653 1525 1853 59 -1257 -531 983 645 -200 -869 1148 1818 836 -1181 -1604 339
2010C39J558j20k123n91J489R60j04j592k92J979J26j051k025O98J995J653j263
$$ 339 1897 1777 -346 -937 552 1512 1408 -184 -476 1503 1629 578 -1447 -749 1246 2899 1636
2027A636k635j05J795J125q72j187K11J257J89j359j039J107J758k6j962j355
$$ 1636 -999 -1104 691 1816 944 -243 -32 1225 1414 55 -984 123 1881 1855 -107 -1462
2043a462R62J751N98j537j227O11J100k05j211m90J377J033n72j987p02J457J710
$$ -1462 -500 1251 1849 312 -915 -304 796 591 -620 -1110 267 1300 728 -1259 -1961 -504 1206
2060A206k36j916j086R83J224k05j140k28J248R05j138j885L21J762J202r62j664
$$ 1206 970 -946 -2032 -1049 175 -30 -1170 -1398 -150 755 -383 -2268 -1947 -185 1017 55 -1609
2077a609l86J358J123m82j250N1J142L46j144j060P21J838N85j501j653K26J779
$$ -1609 -1995 -637 486 4 -1246 -1195 -53 293 -851 -1911 -1190 648 1233 -268 -1921 -1695 84
2094H4Q20j062r83L41J199J72j155o80J031J554j72j843q50J004J850K82j284
$$ 84 904 -158 -1141 -800 399 571 -584 -1264 -233 1321 1149 -694 -1544 -540 1310 1592 308
2111C08j067P28J022Qj374o4J465P13o47j644l61J443J480m64j609o96R63J056
$$ 308 -759 -31 991 999 -375 -439 1026 1739 1092 -552 -913 530 2010 1546 -63 -759 204 1260
2129A260k24r92j4J172M50j108j285L10J636Q37r60j552r2J291R06p29j139J40
$$ 1260 1036 44 30 1202 1652 544 -741 -431 1205 2042 1082 -470 -562 729 1635 906 -233 -93
2147i3R97J67j103j022Q03J552K47j470j449M67J458L88j092q68M10R68m2j190
$$ -93 904 1071 -32 -1054 -251 1301 1548 78 -1371 -904 554 942 -150 -1018 -608 360 318 -872
2165h72m07J064J052m09j730p14J105J623n1j223q81O80Q26k78r46q5J115O07
$$ -872 -1279 -215 837 428 -1302 -2016 -911 712 661 -562 -1443 -763 63 -215 -1161 -1246 -131 476
2183D76q20j373K4J513J060p27j512l99J091P56l52q33J51J048L12j046j055N48
$$ 476 -344 -1717 -1693 -180 880 153 -1359 -1758 -667 89 -263 -1096 -945 103 415 -631 -1686 -1138
2201a138J506N80j065j261P4J327P73p28q14J43Q28K8r17n29J015J287o2j462
$$ -1138 368 948 -117 -1378 -1304 23 796 68 -746 -603 225 253 -664 -1193 -178 1109 1047 -415
2219d15j000O45J542L23j071p36L36R68j02p85j05R55P48o48j441l75J246J330
$$ -415 -1415 -770 772 1095 24 -712 -376 592 490 -295 -400 555 1303 655 -786 -1161 85 1415
2237A415j96j262p21O77Q36k29p67L5Q56K38q39j013K86J456P19r07j453k31J085
$$ 1415 1219 -43 -764 -87 749 520 -247 -212 644 882 43 -970 -684 772 1491 584 -869 -1100 -15
2256a5Q22l25p55N4P31L1q72n84P52J154J32j399j102N59J341O23q17r92K0P29
$$ -15 807 482 -273 -219 512 543 -329 -913 -161 993 1125 -274 -1376 -817 524 1147 330 -662 -642 87
2276H7l3o51j97P25Q90m77j315o22R85J362qj125q88M16Q64N0m83j32Q17L38q39
$$ 87 54 -597 -794 -69 821 344 -971 -1593 -608 754 746 -379 -1267 -851 13 63 -420 -552 265 603 -236
2297b36j053J17J356J016n18j392m80Q80R43j28o94r4M53N2n90n18O34J236K25
$$ -236 -1289 -1172 184 1200 682 -710 -1190 -310 633 505 -189 -283 170 222 -368 -886 -252 984 1209
2316A209j212j248J71J206P93m34q40j02N67J97n18k49O11Q09k87j209o93P49
$$ 1209 -3 -1251 -1080 126 919 485 -355 -457 110 307 -211 -460 151 960 673 -536 -1229 -480
2334d80J437L45r71r52M0O75J74l90k27O63L66o46j021mJ095J040l72j407o58
$$ -480 957 1302 331 -621 -581 94 268 -122 -349 314 680 34 -987 -991 104 1144 772 -635 -1293
2353a293P26R85J27n47k42N21J62n98o32L76J151N64q78j183J3J008Q50k82p99
$$ -1293 -567 418 545 -2 -244 277 439 -159 -791 -415 736 1300 422 -761 -748 260 1110 828 29
2372B9j94L99J42m90j82O46P88j25j081r03M27J175M97o93q26p8O01L40l48k30
$$ 29 -165 234 376 -114 -296 350 1138 1013 -68 -971 -544 631 1128 435 -391 -469 132 472 124 -106
2392a06L81M33m61r46k07Q97J076nj128q27K87Q33K75n42l14L03L50m19o64J73
$$ -106 275 708 247 -699 -906 -9 1067 1062 -66 -893 -606 227 502 -40 -354 -51 299 -120 -784 -611
2412f11R79N37o91j182k32Q92Q31n5p02l14M07K10l51m10L74P56J10q45p85L64
$$ -611 368 905 214 -968 -1200 -308 523 468 -234 -548 -141 69 -282 -692 -318 438 548 -297 -1082 -718
2432g18R96O85n91r39m7M64L41k96j76L83M19j39q65l52N77J027N1q11q18K71
$$ -718 278 963 372 -567 -614 -150 191 -105 -281 102 521 382 -483 -835 -258 769 820 9 -809 -538
2452e38Q84K75m27l46J86K82l19o10P7P87O09l19r43m08O20P37K0o62k90L56K66
$$ -538 346 621 194 -152 34 316 -3 -613 -536 251 860 541 -402 -810 -190 547 567 -95 -385 -29 237
2473B37k05l36J85P40K95p57p75J00Q88P62l57o46k47M65L00k02k72K40L97k3
$$ 237 32 -304 -119 621 916 159 -616 -516 372 1134 777 131 -116 349 649 447 175 415 812 789
2493G89o97l95M71Q32K36q31p44J48O07K59m17k70K72L69j85n90j71N54O37j38
$$ 789 92 -303 168 1000 1236 405 -339 -191 416 675 258 -12 260 629 444 -146 -317 237 874 736
2513G36q51m52M55P57J25m21l76K59K28k49l98M6O70L57m13p80k09P35N81k29
$$ 736 -115 -567 -112 645 770 349 -27 232 460 211 -187 -141 529 886 473 -307 -516 219 800 571
2533E71o79l16L15L25p5k99P8M94J15p12n11P9Q27L81l75p72k4N30K29l05k66
$$ 571 -108 -424 -109 216 141 -158 -80 414 529 -183 -694 -615 212 593 218 -554 -578 -48 181 -124 -390
2554c90J74L53j52n66l40N58P29Lo80n82J42N37J79k64k09K13K75j82m30p8O16
$$ -390 -216 137 -15 -581 -921 -363 366 369 -311 -893 -751 -214 -35 -299 -508 -295 -20 -202 -632 -710 -94
2575i4N13k58p80k57N40O48Q7m32k08K42J35j92k57J68N06K81m66n92k1O53N27
$$ -94 419 161 -619 -876 -336 312 399 -33 -241 1 136 -56 -313 -145 361 642 176 -416 -437 216 743
2596G43k97n22k04L26K29j43k74K14M76k7n68m33K07O56K97l70n93P1M24J80j23
$$ 743 446 -76 -280 46 275 132 -142 72 548 521 -47 -480 -273 383 680 310 -283 -212 212 392 269
2617B69k77K40K02k46m45r0N15O31p9o74m13K20M81K01l42j12J26J21q5l23L3
$$ 269 -8 232 434 188 -257 -347 168 799 720 46 -367 -147 334 535 193 81 207 328 243 -80 -47
2638d7N39K32k26o89j80M60N33O7m14j95J90J54k46k07K15L50J64n34m95P7O15
$$ -47 492 724 498 -191 -371 89 622 689 275 80 270 424 178 -29 186 536 700 166 -329 -252 363
2659C63M36k98o51j21J74K45m2j25J51K84k45m62k36L24N70O5n47m37J09M70K19
$$ 363 799 501 -150 -271 -97 148 106 -19 132 416 171 -291 -527 -203 367 432 -115 -552 -443 27 246
2680B46k49j44P6L1j90k42k7N17L88k13n58l21L76M53N2k87k52R1J37n0j39K15
$$ 246 -3 -147 -71 -40 -230 -472 -499 18 406 193 -365 -686 -310 143 195 -92 -344 -253 -116 -166 -305 -90
2702i0L06J47n25m82N5N42N25p0m90k24J34J97J2j45J52J96j08l75k23K58O40
$$ -90 216 363 -162 -644 -589 -47 478 408 -82 -306 -172 25 37 -108 44 240 132 -243 -466 -208 432
2723D32K00m23n47r6L29L89r6j07K3J23j51l50m6N00M29j12o05l32K27N33K42
$$ 432 632 209 -338 -434 -105 284 188 81 104 227 76 -274 -320 180 609 497 -108 -440 -213 320 562
2744E62k77j75j14L4n0j06J55M31J85m36n46q1N03N48j08m23l80L7L15N6J9Q0
$$ 562 285 110 -4 30 -20 -126 29 460 645 209 -337 -418 85 633 525 102 -278 -241 74 130 149 229
2766B29J27j29m12l58K70N83L15l00n43k56L48K74K8j50pk6j33k43o9M15M69J3
$$ 229 356 227 -185 -543 -273 310 625 325 -218 -474 -126 148 176 26 19 -7 -140 -383 -452 -37 432 445
2788D45n37n53O4M57K79n4k38j66L9N6j87J89L71J10l50m77j62L39O11J25m06
$$ 445 -92 -645 -581 -124 155 101 -137 -303 -264 -208 -395 -206 165 275 -75 -552 -714 -375 236 361 -45
2809d5l69l4J25K6R3P3R8N5l74l18J34N16L63k28m95k94K00L50J34m7K5mj29k89
$$ -45 -414 -448 -323 -297 -204 -131 -33 22 -352 -670 -536 -20 343 115 -380 -674 -474 -124 10 -37 -12 -16 -145 -434
2833d34j23L79L83J03m23l61n9M36L27l5k10j67M0n3q3N7L91L25k34n45k12K78
$$ -434 -557 -178 205 308 -115 -476 -535 -99 228 193 -17 -184 -144 -197 -280 -223 168 493 259 -286 -498 -220
2855b20N15J61k86l59O9J21R6J3m6K41ol06l15K3M66L94q5m86k15O0K65P1l0l4
$$ -220 295 456 170 -189 -120 1 97 110 64 305 299 -7 -322 -299 167 561 476 -10 -225 -165 100 171 141 107
2879A07R7j11k07j45K20L92J02k72m50j55L44M41n6j40l2o2m1j43J23K14J53j16
$$ 107 204 93 -114 -259 -39 353 455 183 -267 -422 -78 363 307 167 135 73 32 -111 12 226 379 263
2901B63l12k32J88M04J47k23l03j27M6J60p2J7K12M5j55l71m9L17K75jl36k98
$$ 263 -49 -281 -93 311 458 235 -68 -195 -149 11 -61 -44 168 213 58 -313 -362 -45 230 229 -107 -405
2923d05J12K98L5o3m9J93j57k11j41J17M48K28k64m28q7J99L40m0k62l4n5L9n4
$$ -405 -293 5 40 -23 -72 121 -36 -247 -388 -271 177 405 141 -287 -374 -175 165 125 -137 -171 -226 -187 -241
2946b41m5J83K21j02k78k92Q8K69K62r0k92n9P8P3j0k3J14J08j25k15r6K29L87
$$ -241 -286 -103 118 16 -262 -554 -466 -197 65 -25 -317 -376 -298 -225 -235 -258 -144 -36 -161 -376 -472 -243 144
2969A44O1k27k59o6J80J16L5J3R4j2q7k65J22L11J44j37k31k08J50L03O6o0r8
$$ 144 205 -22 -281 -347 -167 -51 -16 -3 91 79 -8 -273 -151 160 304 167 -64 -272 -122 181 247 187 89
2992H9mlj61k1J88J95M8j98k69N8K44J45o8j57p3J00L7j33mK74J32q1l41j05P3
$$ 89 85 82 -79 -100 88 283 331 133 -136 -78 166 311 243 86 13 113 150 17 13 287 419 338 -3 -108 -35
3017c5K79K19j92j27o8N0J35Lk1LLl8k61j05L06L84m8l09j51k5J47J6K4k2R5J7
$$ -35 244 463 271 144 76 126 261 264 243 246 249 211 -50 -155 151 535 487 178 27 2 149 165 189 167 262 279
3043B79j68j35J38J57J03j01k97j61J71K11L3o3r1M2p6j23l6J26K18j9k04k41
$$ 279 111 -24 114 271 374 273 -24 -185 -14 197 230 167 76 118 42 -81 -117 9 227 208 4 -237
3065b37m7K41J84%j64j46j1l1L8P0J51P5j10k21j90Q4K89P9o6k67K0J02O6n7N8
$$ -237 -284 -43 141 141 -23 -169 -180 -211 -173 -103 48 123 13 -208 -398 -314 -25 54 -12 -279 -259 -157 -91 -148 -90
3090i0K2p9q8j36J8J89L52r2j43k19l5J00J73j5p1K9r7p9l3J21K01J54j99l22
$$ -90 -68 -147 -235 -371 -353 -164 188 96 -47 -266 -301 -201 -28 -43 -114 -85 -182 -261 -294 -173 28 182 -17 -339
3114c39n1J89L05O6j24p9r3n4M4N7QK80r3k42p8N8K10J78j48j63j65R3L5R3Q4
$$ -339 -390 -201 104 170 46 -33 -126 -180 -136 -79 -71 209 116 -126 -204 -146 64 242 94 -69 -234 -141 -106 -13 71
3139G1J27Mj57k42k9J70K60N8k14j51m4K12J41R3o9n3j59j23n3J61K24J24j00
$$ 71 198 202 45 -197 -226 -56 204 262 48 -103 -147 65 206 299 230 177 18 -105 -158 3 227 351 251
3162B51l39j38J55J90P4o5k03m3j2J5J1J48J47l2k93j75K6K88K01Kj95j14m1N1
$$ 251 -88 -226 -71 119 193 128 -75 -118 -130 -115 -104 44 191 159 -134 -309 -283 5 206 208 13 -101 -142 -91
3186i1J07L4J25rj29k73J2K44K89L5j69k99r5R3J50J02K9q3l8j40r5Q9K07P7j00
$$ -91 16 50 175 166 37 -236 -224 20 309 344 175 -124 -219 -126 24 126 155 72 34 -106 -201 -112 95 172 72
3211G2j82j86N6K68R3m0n7k39p4P9R1J47J08k6j98k29nL18J76M9j97k40rR5J88
$$ 72 -110 -296 -240 28 121 81 24 -215 -289 -210 -119 28 136 110 -88 -317 -322 -4 172 221 24 -216 -225 -130 58
3236E8N1Q6Mr5k37j07K47K28J38r7k57j31R7K18J04Rm6j55o8q9J56J95K26j63
$$ 58 109 195 199 104 -133 -240 7 235 373 276 19 -112 -15 203 307 316 270 115 47 -42 114 309 535 372
3260C72j93k41N8K02J61k1m1j30pp7N7J01J74m5j71k15o1J63L06P8j48j81q5m1
$$ 372 179 -62 -4 198 359 338 297 167 160 83 140 241 415 370 199 -16 -77 86 392 470 322 141 56 15
3284A5K6J20J19R0j95j93j47J86J83J23p0k72j89K0K29J12M4l4j37m1j84J17J08
$$ 15 41 161 280 370 175 -18 -165 21 204 327 257 -15 -204 -184 45 157 201 167 30 -11 -195 -78 30
3307C0J24L9j36m92J59N77l00K36O0k78j98K2j51K04J43J64j65j96j25Q9K26M2
$$ 30 154 193 57 -435 -276 301 1 237 297 19 -179 -157 -308 -104 39 203 38 -158 -283 -194 32 74
3329G4n9j84n1M1P4N5K9O2q9j10j68P5J82J57N1k55j47M0J43J21J3o2n2k1l9k6
$$ 74 15 -169 -220 -179 -105 -50 -21 41 -48 -158 -326 -251 -69 88 139 -116 -263 -223 -80 41 54 -8 -60 -81 -120 -146
3355a46J77P2L8j45k01j09J86K06N1Lj40l5k3lN8J11K9J9j89j43J33J72J82j67
$$ -146 31 103 141 -4 -205 -314 -128 78 129 132 -8 -43 -66 -69 -11 100 129 148 -41 -184 -51 121 303 136
3379A36p0j97J07l7J59JK15M2l77L26l70L64j17L31o33K57j69M5J47R2k06m2j41
$$ 136 66 -131 -24 -61 98 99 314 356 -21 305 -65 299 182 513 -120 137 -32 13 160 252 46 4 -137
3402a37M38k75L18k56L42j27l56J43j45K33J34j09K4l0k24nQ1K0J87k7l21oN8
$$ -137 301 26 344 88 430 303 -53 90 -55 178 312 203 227 197 -27 -32 49 69 256 229 -92 -98 -40
3425d0N1K40L5j63p0j59J72P0j15K41l21J06k59O5J98P6O8j42j70O4Lj0J21q1
$$ -40 11 251 286 123 53 -106 66 136 21 262 -59 47 -212 -147 51 127 195 53 -117 -53 -50 -60 61 -20
3449b0M5n5r5J4Q9N7Jj4j53p2j6J02J33OJ5j5r3o8N1j1J56Q9j29j37r5J73P5Q7
$$ -20 25 -30 -125 -111 -22 35 36 22 -131 -203 -219 -117 16 22 37 22 -71 -139 -88 -99 57 146 17 -120 -215 -42 33 120
3477A20j44m1j02N6Q9J23L0n8j3J14l01j8k30N91j50j77R8j00K20j31J96P7l08
$$ 120 -24 -65 -167 -111 -22 101 131 73 60 174 -127 -145 -375 216 66 -111 -13 -113 107 -24 172 249 -59
3500e9J62j78p8N54L04n35j78j08J6lJ68O4j54K69k33L2j17J73o1P3pp4j81J12
$$ -59 103 -75 -153 401 705 170 -8 -116 -100 -103 65 129 -25 244 11 43 -74 99 38 111 104 30 -151 -39
3524c9R9Q8n9N1p4j16qM6Q0P4Nn2j95%J09J08l4m4r3Lp3L9J00k9R2j17p8j08Q9
$$ -39 60 148 89 140 66 -50 -58 -12 68 142 147 95 -100 -100 9 117 83 39 -54 -51 -124 -85 15 -14 78 -39 -117 -225 -136
3553a36L0J78o8j53n6K4L8Q6m1N8j62k2n3k9K23J14l3j10j63L0k0J04K6l8J4j13
$$ -136 -106 72 4 -149 -205 -181 -143 -57 -98 -40 -202 -224 -277 -306 -83 31 -2 -112 -275 -245 -265 -161 -135 -173 -159 -272
3579b72k9N7J31J5K5j05j00p1P4J66N2j0o1j28M6K4O0qJ20n8j47P1mN7J89k2p7
$$ -272 -301 -244 -113 -98 -73 -178 -278 -349 -275 -109 -57 -67 -128 -256 -210 -186 -126 -134 -14 -72 -219 -148 -152 -95 94 72 -5
3606ej42J7R0L3N0Kk8Pj24k3J46Q8L6r9j59Q2L7M1J24jr3n2m6OP4J47O3l8r5j11
$$ -5 -147 -130 -40 -7 43 45 17 24 -100 -123 23 111 147 48 -111 -29 8 49 173 172 79 27 -19 -13 61 208 271 233 138 27
3636B7N4J19J4N0p7n6r4N4J30M6Q5q0j06j43R8N7J21R6j48o8j46P8Q5Q9n0oj73
$$ 27 81 200 214 264 187 131 37 91 221 267 352 272 166 23 121 178 299 395 247 179 33 111 196 285 235 229 56
3663E6q0J04K8J52k0r1j97p3lJ44K9M5l9j38m3m1Q2O9J03q8j27j52R8Q8J49l7
$$ 56 -24 80 108 260 240 149 -48 -121 -124 20 49 94 55 -83 -126 -167 -85 -16 87 -1 -128 -280 -182 -94 55 18
3689A8j00j22q9m3R5R6O9k7o0j69m6L9K51M9j87j27q3%J44J87j7j06k6j87l1J07
$$ 18 -82 -204 -293 -336 -241 -145 -76 -103 -163 -332 -378 -339 -88 -39 -226 -353 -436 -436 -292 -105 -122 -228 -254 -441 -472 -365
3715c65J70M2n0j28o6K2Q7J53M0q1q6q0O5jJ16J62o1j23j62K6P3K06Q2r7m9j04
$$ -365 -195 -153 -203 -331 -397 -375 -288 -135 -95 -176 -262 -342 -277 -278 -162 0 -61 -184 -346 -320 -247 -41 41 -56 -105 -209
3741b09LQ6J38L7K4j63p1KJ04J17M9K2r5j36QJ41M0N7N7q3j18RO6J51J4Jp3j56
$$ -209 -206 -120 18 55 79 -84 -155 -153 -49 68 117 139 44 -92 -84 57 97 154 211 128 10 19 85 236 250 251 178 22
3769B2j52J82N5R0j95J55j37J13M2R1J22J06ol54k05M0M27j3Jl46M8O2n7J22q
$$ 22 -130 52 107 197 2 157 20 133 175 266 388 494 488 134 -71 -31 396 383 384 38 86 148 91 213 205
3794B05L7q2q8O9lJ45K88l63k70Q5m2J00O5J2Q5k95j92J61L3J58K4lk4j53o0N6
$$ 205 242 160 72 141 138 283 571 208 -62 23 -19 81 146 158 243 -52 -244 -83 -50 108 132 129 105 -48 -108 -52
3820e2N4J01j09o3j60JR8Q6N0j3n5j80m6R9R9Rk1q5m6o3J28NJ3O3j07q8lP8P6
$$ -52 2 103 -6 -69 -229 -228 -130 -44 6 -7 -62 -242 -288 -189 -90 -81 -102 -187 -233 -296 -168 -163 -150 -87 -194 -282 -285 -207 -131
3849a31O7k7k6j24J9J2L0P1N8p6k7m7MJ17R2j8j04j09k7P2J45O6RMj08r1R5q2
$$ -131 -64 -91 -117 -241 -222 -210 -180 -109 -51 -127 -154 -201 -197 -80 12 -6 -110 -219 -246 -174 -29 37 46 50 -58 -149 -54 -136
3877a36J70J4m8o4k1P5P8J26k8j47o8j2P4Q2O6nk1r0p0M6J30JM0J3j15J9r0J04
$$ -136 34 48 0 -64 -85 -10 68 194 166 19 -49 -61 13 95 161 156 135 45 -25 21 151 152 192 205 90 109 19 123
3905A23P0Qmj14k9m1J80J4Q7m4q9j12L4L8Q3lO3j17j38Q9JL6O1o3o6m8m2N8O6
$$ 123 193 201 197 83 54 13 193 207 294 250 161 49 83 121 204 201 264 147 9 98 99 135 196 133 67 19 -23 35 101
3934A01N4rp9l4j8m5O1K8L9l9p0o5KJ01L1j03l0j0k9j6P2Q9m2qq4p7j6J37OLj0
$$ 101 155 146 67 33 15 -30 31 59 98 59 -11 -76 -74 27 58 -45 -75 -85 -114 -130 -58 31 -11 -19 -103 -180 -196 -59 -53 -50 -60
3965f0l7p8O7O7KL1j14j7l1k5O1Q1Q8p3n5p6l5J16n3J62p1m6o2K4j4J17l0K6o7
$$ -60 -97 -175 -108 -41 -39 -8 -122 -139 -170 -195 -134 -53 35 -38 -93 -169 -204 -88 -141 21 -50 -96 -158 -134 -148 -31 -61 -35 -102
3994a02q7KL8J05J49p8j06k6l9M9J27Rl4j2o7oQ2Q4M9j11k3m9O6oP7L8K7r2q0
$$ -102 -189 -187 -149 -44 105 27 -79 -105 -144 -95 32 41 7 -5 -72 -78 4 88 137 26 3 -46 20 14 91 129 156 64 -16
4023a6lJ5R8j4M6k5k8l7KN9LN7q3k4j0K4L2J2J4M7q2o3j8M2Q2r4L0%o3L2K7M5
$$ -16 -19 -4 94 80 126 101 73 36 38 97 100 157 74 50 40 64 96 108 122 169 87 24 6 48 130 36 66 66 3 35 62 107
4055A07N8j45k5j2KP4N8K1j12l7J8ON0J5j1k9p9J2J1M2P2L7r1r3n6N4L5L5N5j01
$$ 107 165 20 -5 -17 -15 59 117 138 26 -11 7 13 63 78 67 38 -41 -29 -18 24 96 133 42 -51 -107 -53 -18 17 72 -29
4085b9m3m0J6R7J6l5jn5RJ8lJ53l1p3j17k0nJ34L8lKn9j37R8Q4J4j9r5p3N0PP0
$$ -29 -72 -112 -96 1 17 -18 -19 -74 -65 -47 -50 103 72 -1 -118 -138 -143 -9 29 26 28 -31 -168 -70 14 28 9 -86 -159 -109 -102 -32
4117c2P0j3o9m1r1J5J46oM4K4j10lr2J28Q4J9o9o8q1O9P4O7Jk8n4j09Q8j1R0M2
$$ -32 38 25 -44 -85 -176 -161 -15 -21 23 47 -63 -66 -158 -30 54 73 4 -64 -145 -76 -2 65 66 38 -16 -125 -37 -48 42 84
4147H4o8j1r2QO6N0K6Jj08o3nJ14M2Q2m4j40j04L1J05L4O3k4j11k2J6N8J02m6
$$ 84 16 5 -87 -79 -13 37 63 64 -44 -107 -112 2 44 126 82 -58 -162 -131 -26 8 71 47 -64 -86 -70 -12 90 44
4175D4k6j10q3R3N2J12J3m4p0o2OK2O3N0j6o0r0kN2R9J9o1j8j01l5J36Q1Mm4m6
$$ 44 18 -92 -175 -82 -30 82 95 51 -19 -81 -75 -53 10 60 44 -16 -106 -108 -56 43 62 1 -17 -118 -153 -17 64 68 24 -22
4205b2r9M2M3L3Q0K9j14n4L5L6J06l6k5j10l0K3K0Q5R1J7j00j24J8M0R8K7o0k6
$$ -22 -121 -79 -36 -3 77 106 -8 -62 -27 9 115 79 54 -56 -86 -63 -43 42 133 150 50 -74 -56 -16 82 109 49 23
4233B3j0m5M4J50m3j1q4Nl7K5N9J39q7p9j0r0P2M7j2M9k7m1PqR1qlm7o1o8Q9Q0
$$ 23 13 -32 12 162 119 108 24 29 -8 17 76 215 128 49 39 -51 21 68 56 105 78 37 44 36 127 119 116 69 8 -60 29 109
4265A09J7k7kj01k6O1kO8Qj04n7N2K5OJ56m9j27k5j07P8P6J0Nj6o3k2j1N2P0m1
$$ 109 126 99 97 -4 -30 31 29 97 105 1 -56 -4 21 27 183 134 7 -18 -125 -47 29 39 44 28 -35 -57 -68 -16 54 13
4295A3J6j26rP3N2j8j4n1m2k6j0N8P2K8q6n1J7J2P7m8Rn4%k6M9K8N1k8l9p1k7
$$ 13 29 -97 -106 -33 19 1 -13 -64 -106 -132 -142 -84 -12 16 -70 -121 -104 -92 -15 -63 -54 -108 -108 -134 -85 -57 -6 -34 -73 -144 -171
4326a71K9J01N4L0j29j5O1m1mN4l1nm7lM6P6J9L6n9r8NJ8J6Q3lJk4l5K1oJ10j4
$$ -171 -142 -41 13 43 -86 -101 -40 -81 -85 -31 -62 -67 -114 -117 -71 5 24 60 1 -97 -92 -74 -58 25 22 23 -1 -36 -15 -21 89 75
4358G5m3j09rO8R3JK9L2p8l4k3N2O6J9K7q8m8J0R2L7pp9o5L8lK2N4N5m9m1o0j1
$$ 75 32 -77 -86 -18 75 76 105 137 59 25 2 54 120 139 166 78 30 40 132 169 162 83 18 56 53 75 129 184 135 94 34 23
4390B3M3N0J5j8j8j00R5o0M8J7J1j5m3K6j13J67l5K8o3p8oO3pK9Jl2j0nl3M8O
$$ 23 66 116 131 113 95 -5 90 30 78 95 106 91 48 74 -39 128 93 121 58 -20 -26 37 30 59 60 28 18 13 -20 28 34
4421C4Klq1r4M4J69l9L0k2q5l0n9R9K4lj5J1r8K0K5N0Llj07K1j0L0O2m2P7m9p4
$$ 34 36 33 -48 -142 -98 71 32 62 40 -45 -75 -134 -35 -11 -14 -29 -18 -116 -96 -71 -21 -18 -21 -128 -107 -117 -87 -25 -67 10 -39 -113
4453a13m1M9QN1M6p0r3kL8J48o6K6o9m1J0J3Q5M8Pr5p2N0M6K9M8l3m8n0M2M6J0
$$ -113 -154 -105 -97 -46 0 -70 -163 -165 -127 21 -45 -19 -88 -129 -119 -106 -21 27 34 -61 -133 -83 -37 -8 40 7 -41 -91 -49 -3 7
4484GP8k0p4ml1O1pR1j2j6q5l7P9%l7J29p6L1j7L9jN7m0l1j6l3K3J5M5K0k3k9
$$ 7 85 65 -9 -13 -44 17 10 101 89 73 -12 -49 30 30 -7 122 46 77 60 99 98 155 115 84 68 35 58 73 118 138 115 86
4516H6l9K4%R2J3j27m7K4L7N0r2J15j5j04p2O7MJ01J2j4j00OMlN2mm3p6j5K5L7
$$ 86 47 71 71 163 176 49 2 26 63 113 21 136 121 17 -55 12 16 117 129 115 15 21 25 22 74 70 27 -49 -64 -39 -2
4547bRL2p5n3j8K1P9Q7k5r4n6K5M7%m8P3q6J3r1M2J32mP1q4j60M3oJ18J0J3l0
$$ -2 7 39 -36 -89 -107 -86 -7 80 55 -39 -95 -70 -23 -23 -71 2 -84 -71 -162 -120 12 8 79 -5 -165 -122 -128 -10 0 13 -17
4578a7n7J9n5KO7k9Rq2j8jJ10N8L9j19o0O2m9P7M0N9o2nq2p0J42Q8Lj21o4j6J04
$$ -17 -74 -55 -110 -108 -41 -70 -61 -143 -161 -162 -52 6 45 -74 -134 -72 -121 -44 -4 55 -7 -12 -94 -164 -22 66 69 -52 -116 -132 -28
4609b8L5K2K0k2m3o2M9mR7lK3j27O0k3P8K5ql6k0m4j0J01k1R5m1p8M3j98K07O4
$$ -28 7 29 49 27 -16 -78 -29 -33 64 61 84 -43 17 -6 72 97 89 53 33 -11 -21 80 59 154 113 35 78 -120 87 151
4639A51o1M9j55R8l0J5K9kJ0n0q7K8O3N9qK1j36j2k7J09n3Q4l6l2p7N4K9L8L3
$$ 151 90 139 -16 82 52 67 96 94 104 54 -33 -5 58 117 109 130 -6 -18 -45 64 11 95 59 27 -50 4 33 71 104
4668A04m7m3m9L6rR1n2N2j03J3o9M3j3J07r5m3mR9j38N25k59m34q2J47L25L0k22
$$ 104 57 14 -35 1 -8 83 31 83 -20 -7 -76 -33 -46 61 -34 -77 -81 18 -120 405 146 -288 -370 -223 102 132 -90
4695i0J48p8O9k32J89J25mk41K1K39j72L4m9MK4J7l2k2n6L0L4M4Pk7%n4O7K7%
$$ -90 58 -20 49 -183 6 131 127 -114 -93 146 -26 8 -41 -37 -13 4 -28 -50 -106 -76 -42 2 9 -18 -18 -72 -5 22 22
4724B2k6J8m2l2QM3M6j7o7j0J2K7R7n5l1M0q0jQ0k6N5n5nn6K1J3J25l8N0j34m
$$ 22 -4 14 -28 -60 -52 -9 37 20 -47 -57 -45 -18 79 24 -7 33 -47 -48 32 6 61 6 1 -55 -34 -21 104 66 116 -18 -22
4755b2p4P4k27J03J35l7k18J07Q4J91j32j63J23k33J70K08J78M3m93j48K49%M0
$$ -22 -96 -22 -249 -146 -11 -48 -266 -159 -75 116 -16 -179 -56 -289 -119 89 267 310 -183 -331 -82 -82 -42
4778d2K3J53r7J5j12j7R4n3R2rj12R0o2lK8O3k5j8q3rJ6Q4l7M9m4L0K8o8K7m8
$$ -42 -19 134 37 52 -60 -77 17 -36 56 47 -65 25 -37 -40 -12 51 26 8 -75 -84 -68 16 -21 28 -16 14 42 -26 1 -47
4808d7Q7o6pj0l4lJ37p5NJ7j4m5P2PrQKn4k1J4oR3l5o4l7lQ5K5j2O0o5m5rL2K2
$$ -47 40 -26 -33 -43 -77 -80 57 -18 -13 4 -10 -55 17 24 15 23 25 -29 -50 -36 -42 51 16 -48 -85 -88 -3 22 10 70 5 -40 -49 -17 5
4843EQ9m9l5m4Q0j5mrj9Q3j01L8p2N7M6M5j0o0k7L8Q4m9L3m8l0ll3J0L7M5kl4
$$ 5 94 45 10 -34 46 31 27 18 -1 82 -19 19 -53 4 50 95 85 25 -2 36 120 71 104 56 26 23 -10 0 37 82 80 46
4875D6n7M5J3M0qm2k6j7J2k0J7MJ9M7p3Kj6J4M8j11L4pO2l8M5J5J0k0n8j3l1R5
$$ 46 -11 34 47 87 79 37 11 -6 6 -14 3 7 26 73 0 2 -14 0 48 -63 -29 -36 26 -12 33 48 58 38 -20 -33 -64 31
4907C1K3o0l2m9M7M6l8Mk4j1k8l1P3O8k2l4Op1L7J4PK2j9k4K8j7J1j4l3J6J8k9
$$ 31 54 -6 -38 -87 -40 6 -32 -28 -52 -63 -91 -122 -49 19 -3 -37 -31 -102 -65 -51 -44 -22 -41 -65 -37 -54 -43 -57 -90 -74 -56 -85
4939h5K6Oj9N9%m3o5N7l1Q1j9k5L9o8k1M7O7k9N0q5m1N8M9NR3q7k6QK6L6mk9L2
$$ -85 -59 -53 -72 -13 -13 -56 -121 -64 -95 -14 -33 -58 -19 -87 -108 -61 6 -23 27 -58 -99 -41 8 13 106 19 -7 1 27 63 59 30 62
4972F2k6l8M5O5l7L5K4p5K5k3JM4mL6o9K2r0N7QqL3l4l7O5k2O3K0j02L1n0mj0
$$ 62 36 -2 43 108 71 106 130 55 80 57 58 102 98 134 65 87 -3 54 62 54 87 53 16 81 59 122 142 40 71 21 17 7
5004GQ2MN0r2j6l5J8P9j1k6l5m5K9K3L6K5o8L1n1r2O7K8M7J1m5rl9J5l7M3kr1
$$ 7 89 93 143 51 35 0 18 97 86 60 25 -20 9 32 68 93 25 56 5 -87 -20 8 55 66 21 12 -27 -12 -49 -6 -8 -99
5036i9P2pr5K04n9j6l6m3K4o0O9J4N6l6l2m4PM0O1o6l4j3K0MM1N9n1k9Kp4L6J7
$$ -99 -27 -34 -129 75 16 0 -36 -79 -55 -115 -46 -32 24 -12 -44 -88 -81 -41 20 -46 -80 -93 -73 -69 -28 31 -20 -49 -47 -121 -85 -68
5068f8Q8o6Q7j03k0JQ4K0Rl6q5M1oL2M1j0n6N0p2qR9Kj5M6n1l0o0J89q7P2n6n3
$$ -68 20 -46 41 -62 -82 -81 3 23 32 -4 -89 -48 -54 -22 19 9 -47 3 -69 -77 22 24 9 55 4 -26 -86 103 16 88 32 -21
5100b1n4MJ65N1k7o3m1n1L0O6K4L4o5KN0o9N4OpM1q1n0KM5o2R6J1m8l1J9j1L2
$$ -21 -75 -71 94 145 118 55 14 -37 -7 59 83 117 52 54 104 35 89 95 88 129 48 -2 0 45 -17 79 90 42 11 30 19 51
5132E1M4J0m5n8M3N4k3j8m7K9p0K1RN8k0jn7J4k8j6R1Kk7j1NKq1R6l3L3k4l8j3
$$ 51 95 105 60 2 45 99 76 58 11 40 -30 -9 0 58 38 37 -20 -6 -34 -50 41 43 16 5 10 12 -69 27 -6 27 3 -35 -48
5165d8L0L2K7k2jp2L6L3Nl8J2j7ml3J1L2j3On0k3N1l6J08n9NMj23J19m3K5rN3
$$ -48 -18 14 41 19 18 -54 -18 15 20 -18 -6 -23 -27 -60 -49 -17 -30 -24 -74 -97 -46 -82 26 -33 -28 -24 -147 -28 -71 -46 -55 -2
5197bp8mL0k5N3L2j1k7n8L2R5o9K1j0J6%q8N6L8j4N1r7j1M9j8nN1m7M2rn6N9M9
$$ -2 -80 -84 -54 -79 -26 6 -5 -32 -90 -58 37 -32 -11 -21 -5 -5 -93 -37 1 -13 38 -59 -70 -21 -39 -44 7 -40 2 -7 -63 -4 45
5230D5M2r3K2k6K6O0j9Kj03R0l7j8R0Kl1J6K7j22M4j4O0Lk9l9mJ06o8ML2M6r3
$$ 45 87 -6 16 -10 16 76 57 59 -44 46 9 -9 81 83 52 68 95 -27 17 3 63 66 37 -2 -6 100 32 36 68 114 21
5261B1OKl3P9Nj6m5m2P1j7M3p9J10p9k6K6%n9J08m6M0j07l0P0m8O0L6k9m0j3M7
$$ 21 27 29 -4 75 80 64 19 -23 48 31 74 -5 105 26 0 26 26 -33 75 29 69 -38 -68 2 -46 14 50 21 -19 -32 15
5292A5o8J4N1kp1L4RK1o6Q5q9K5m7JO7k2J9K0k9j06M5l1J00K9Kn6Lj4L0%K3j9
$$ 15 -53 -39 12 10 -61 -27 -18 3 -63 22 -67 -42 -89 -88 -21 -43 -24 -4 -33 -139 -94 -125 -25 4 6 -50 -47 -61 -31 -31 -8 -27
5324b7M4p4L9Mn7M0J9L1n6n6O2L5K8l2K9l6k0m2M1K8M0l7m3j6J9K7%K3K2r5N7
$$ -27 17 -57 -18 -14 -71 -31 -12 19 -37 -93 -31 4 32 0 29 -7 -27 -69 -28 0 40 3 -40 -56 -37 -10 -10 13 35 -60 -3
5355cnl4N7RJ0j4N1o8M0l3Pk3Ll5P4l4L9M7lm2m2K8J9n8L8j4k7ML4n6M5Rk3n2
$$ -3 -8 -42 15 24 34 20 71 3 43 10 17 -6 -3 -38 36 2 41 88 85 43 1 29 48 -10 28 14 -13 -9 25 -31 14 23 0 -52
5389e2RK5j0J03L1j26rN2k1K7j16O1%L5j00M2J6L7l2M4n0m1rP8m4%j1J6m5P5l1
$$ -52 -43 -18 -28 75 106 -20 -29 23 2 29 -87 -26 -26 9 -91 -49 -33 4 -28 16 -34 -75 -84 -6 -50 -50 -61 -45 -90 -15 -46
5420d6M6n1K7k8J8KRjqM2j15N0No0O7J0N7m9J4m8k0O9Nk2RK3m4Q0m5R3p9n1R4
$$ -46 0 -51 -24 -52 -34 -32 -23 -24 -32 10 -105 -55 -50 -110 -43 -33 24 -25 -11 -59 -79 -10 -5 -27 -18 5 -39 41 -4 89 10 -41 53
5453E3q9O3J0N2m7m0j5Q3p7J22p4l6O2l9l6K2L6J8j6l6M2j10J05M5k6j0q8L9M5
$$ 53 -36 27 37 89 42 2 -13 70 -7 115 41 5 67 28 -8 14 50 68 52 16 58 -52 53 98 72 62 -26 13 58
5482E8jk9o9Q0Nn4o6Q1OQ3k3r0QqjK5n8Q7o5mlk1J10p2M6p1l3L6M3J9Q4j29k8
$$ 58 57 28 -41 39 44 -10 -76 5 11 94 71 -19 -11 -19 -20 5 -53 34 -31 -35 -38 -59 51 -21 25 -46 -79 -43 0 19 103 -26 -54
5515e4J8J1l4o4J25M2j5p5n8P3J1K0l2m0j8R0n9j2L5J1J5j5j15j5N8J42j15P6
$$ -54 -36 -25 -59 -123 2 44 29 -46 -104 -31 -20 0 -32 -72 -90 0 -59 -71 -36 -25 -10 -25 -140 -155 -97 45 -70 6
5543Fn0k4M3JoL6l1o6jL7L1J11r8L4m8L8p5J8O3n6K1k7L9k3j1P0L6o1o0L0J1j2
$$ 6 -44 -68 -25 -24 -30 6 -25 -91 -92 -55 -24 87 -11 23 -25 13 -62 -44 19 -37 -16 -43 -4 -27 -38 32 68 7 -53 -23 -12 -24
5575b4M2P0jq4n2L9J9P0j3j3l8m7K3P8l8qqN2o9j7Q9o8K2L6k1Rr9K9J18k9l7k2
$$ -24 18 88 87 3 -49 -10 9 79 66 53 15 -32 -9 69 31 23 15 67 -2 -19 70 2 24 60 39 48 -51 -22 96 67 30 8
5607HK3Qj5l1j7J21q3L9p0M0J3L6K3jj59R2n0Q0k9n3P4%k3o7J26l1K4p7jk2R5
$$ 8 31 39 24 -7 -24 97 14 53 -17 23 36 72 95 94 -65 27 -23 57 28 -25 49 49 26 -41 85 54 78 1 0 -22 73
5638G3o3O6k7m6l1L6Om4k4J1N9nl7K6j6P7o4o9k2Q5Ql3L2k1j7K1q9J7L8n1N6k6
$$ 73 10 76 49 3 -28 8 14 -30 -54 -43 16 11 -26 0 -16 61 -3 -72 -94 -9 -1 -34 -2 -23 -40 -19 -108 -91 -53 -104 -48 -74
5670g4o0M7O3ql2l8P2k0R2q1K3m4lP6j8m5O1k3J7l4m0oj8J29k8o9K6J6Rr9N5K8
$$ -74 -134 -87 -24 -32 -64 -102 -30 -50 42 -39 -16 -60 -63 13 -5 -50 11 -12 5 -29 -69 -75 -93 36 8 -61 -35 -19 -10 -109 -54 -26
5702b6j0O4l7m9M2N6J8j30J11L1l9K0o5Q6Oj3j1m3L5jN8o6N9J7o8o2Q3k3K3N3
$$ -26 -36 28 -9 -58 -16 40 58 -72 39 70 31 51 -14 72 78 65 54 11 46 45 103 37 96 113 45 -17 66 43 66 119
5732A19q2j6M8p4Q0K4m9nN5k5k8k6N5k7lM2nm2N0l0%l9p5P9lJ0qMk4k0j1n6K3
$$ 119 37 21 69 -5 75 99 50 45 100 75 47 21 76 49 46 88 83 41 91 61 61 22 -53 26 23 33 25 29 5 -15 -26 -82 -59
5765e9J00n5j3L3oL8Kk9n9N0q0N9%n7J5N4J7j10K0J7N7m5Op2P8J4PL9r5L6OJ4
$$ -59 41 -14 -27 6 0 38 40 11 -48 2 -78 -19 -19 -76 -61 -7 10 -100 -80 -63 -6 -51 -45 -117 -39 -25 -18 21 -74 -38 -32 -18
5797a8o4J9NJ1N4j6o3R4m8l5m7K8N9Qo0L2M9qm6J03j38k0J01J3k1k2M2L5m0m0
$$ -18 -82 -63 -58 -47 7 -9 -72 22 -26 -61 -108 -80 -21 -13 -73 -41 8 0 -46 57 -81 -101 0 13 -8 -30 12 47 7 -33
5827c3p9P2N4m4k0K5Lj0L6lj2J7rk5j2J05m9M4K9j48Q0l7L1N2k5J6o1N9n9l1L8
$$ -33 -112 -40 14 -30 -50 -25 -22 -32 4 1 -11 6 -3 -28 -40 65 16 60 89 -59 21 -16 15 67 42 58 -3 56 -3 -34 4
5858DL9J2o2jK0J5KJ7o8L4K8o3J05j00N8J4P3p7m2J9L2M4q9K2n5QK7K5n2Q6J0
$$ 4 43 55 -7 -8 12 27 29 46 -22 12 40 -23 82 -18 40 54 127 50 8 27 59 103 14 36 -19 -11 16 41 -11 75 85
5889H5j4n2o2R6j8Pmo2q0Q2L3oj0O6o7k3m0Q2L3l1j1n0K4P4J9m7n5qOK5m7J4P
$$ 85 71 19 -43 53 35 42 38 -24 -104 -22 11 5 -5 61 -6 -29 -69 13 46 15 4 -46 -22 52 71 24 -31 -39 -33 -8 -55 -41 -34
5922c4O6o1K7m5oJ10n9j9pRl4O4km4KQ4j09K1r0M8J04o3nl1O3L3q6RnK2L9kj1
$$ -34 32 -29 -2 -47 -53 57 -2 -21 -28 -19 -53 11 9 -35 -33 51 -58 -37 -127 -79 25 -38 -43 -74 -11 22 -64 -55 -60 -38 1 -1 -12
5955a2o0J01k7J1q9L3M0l7P2j6j2k8J2J5J6l9Q2j5n5l9l6N5O7M3o9k4M3L6q9P0
$$ -12 -72 29 2 13 -76 -43 -3 -40 32 16 4 -24 -12 3 19 -20 62 47 -8 -47 -83 -28 39 82 13 -11 32 68 -21 49
5985D9%k5N5p3j7N4L3Qn0j5m0O2J3k5kJJ2j7j1rJ00mm0r2pL9L8L3ok4j1j3k6N5
$$ 49 49 24 79 6 -11 43 76 84 34 19 -21 41 54 29 27 28 40 23 12 3 103 99 59 -33 -40 -1 37 70 64 40 29 16 -10 45
6019D5k5L2j4J0p6Rl8J28p5Jp4O3l1L7l5j7Q2jo2o8N5rN2l6J9m5O1J4m9M2o2L0
$$ 45 20 52 38 48 -28 -19 -57 71 -4 -3 -77 -14 -45 -8 -43 -60 22 21 -41 -109 -54 -63 -11 -47 -28 -73 -12 2 -47 -5 -67 -37
6051c7J4Qn0K9Q2m6m2qk0N2j4k6j1j5P7l0n5Q8j9NK6q9j0K4Q8k4q3O8jP6o0MP4
$$ -37 -23 -15 -65 -36 46 0 -42 -50 -70 -18 -32 -58 -69 -84 -7 -37 -92 -4 -23 -18 8 -81 -91 -67 21 -3 -86 -18 -19 57 -3 1 75
6084G5n6l9N3j19Q5K3Q8j21k3j6J07J9o2L6o9N4L8m7n1L7O5J5k0m3j9N1N9k8m5
$$ 75 19 -20 33 -86 -1 22 110 -11 -34 -50 57 76 14 50 -19 35 73 26 -25 12 77 92 72 29 10 61 120 92 47
6113D7J1M1o5l4N1K6pRq3onJ04pk7p8j8N1j0k7K3J1j6j9J3K5Q%J5q4K3kO2m9j3
$$ 47 58 99 34 0 51 77 70 79 -4 -10 -15 89 82 55 -23 -41 10 0 -27 -4 7 -9 -28 -15 10 18 18 33 -51 -28 -30 32 -17 -30
6147c0k6k5J16j08m1rJ02N7l6n4l6M7J8p4K2M8m5N8Qo8MP4N7j28k1K0N9J4o9M9
$$ -30 -56 -81 35 -73 -114 -123 -21 36 0 -54 -90 -43 -25 -99 -77 -29 -74 -16 -8 -76 -72 2 59 -69 -90 -70 -11 3 -66 -17
6177a7o2R9p2RJ7oM3q1j4Q8m0Q6p3lm4R7j5o2K6kQJ02r7J4l5N8L1mq6N4J7LJr
$$ -17 -79 20 -52 -43 -26 -32 11 -70 -84 4 -36 50 -23 -26 -70 27 12 -50 -24 -26 -18 84 -13 1 -34 24 55 51 -35 19 36 39 40 31
6211C1rK7R7r3l6o6Q1L2j5n4nO9Ll7l2J0J4Q3o1o9L5Q5r2J8p5N4J7K8o3J6j9L2
$$ 31 22 49 146 53 17 -49 32 64 49 -5 -10 59 62 25 -7 3 17 100 39 -30 5 90 -2 16 -59 -5 12 40 -23 -7 -26 6
6243FLj3l2M7J6L6j10kP1N8Qr4k3N7j6j9l4qP1J7L0j29k5R8O5r4n5KQ6m9O1r6
$$ 6 9 -4 -36 11 27 63 -47 -49 22 80 88 -6 -29 28 12 -7 -41 -49 22 39 69 -60 -85 13 78 -16 -71 -69 17 -32 29 -67
6275f7MP7Om7m0N8L3j4l5n1M5P9k7jq5O0M8m5jr8J31k1mo4j6J2Q0n3%K9k5O5j0
$$ -67 -63 14 20 -27 -67 -9 24 10 -25 -76 -31 48 21 20 -65 -5 43 -2 -3 -101 30 9 5 -59 -75 -63 17 -36 -36 -7 -32 33 23
6308B3n1o9O5M9n7nQN7j3M9q0rP1p0L6l0m1N5K1lq4Q0MO1q1l1j1Q0M2qq0J8NL9
$$ 23 -28 -97 -32 17 -40 -45 -37 20 7 56 -24 -33 38 -32 4 -26 -67 -12 9 6 -78 2 6 67 -14 -45 -56 24 66 58 -22 -4 1 40
6342D0Np1P3R3q9l9p0O0OJ24r0j25J30L9j9l3l2O5j0m7m7P2m3N8j0k0k0J1M8n
$$ 40 45 -26 47 140 51 12 -58 2 8 132 42 -83 47 86 67 34 2 67 57 10 -37 35 -8 50 40 20 0 11 59 54
6372E4n7o4M9N6k2k7N5lN3j07L7LnN4r8p1K2Q8lj9M1j86J42o6j41J32L9K4L4p7
$$ 54 -3 -67 -18 38 16 -11 44 41 94 -13 24 27 22 76 -22 -93 -71 17 14 -5 36 -150 -8 -74 -215 -83 -44 -20 14 -63
6402f3j0O7J1Q5r7j14P5N7n9K1m3L3J08jm6k3rJ07j19m7M9J5k0Qo0O1N3nn1o4
$$ -63 -73 -6 5 90 -7 -121 -46 11 -48 -27 -70 -37 71 70 24 1 -8 99 -20 -67 -18 -3 -23 -15 -75 -14 39 34 -17 -81
6432h1Q5j3Qn4qP1J0j5J4l5J7N7l0L0j03J0O9l6J9n7kO2O7p1j5L9J6%p9J4LQ0
$$ -81 4 -9 -1 -55 -63 8 18 3 17 -18 -1 56 26 56 -47 -37 32 -4 15 -42 -44 18 85 14 -1 38 54 54 -25 -11 -8 72
6464G2L0n5o4PN4j5Nm8O9Qj4p0NNN7l3n6rJ11J7o1n3%N3m2L6m7J2K0N0o3j04Q8
$$ 72 102 47 -17 -10 44 29 34 -14 55 63 49 -21 -16 -11 46 13 -43 -52 59 76 15 -38 -38 15 -27 9 -38 -26 -6 44 -19 -123 -35
6497c5N6lro4J4O1n0J1J8n0O7Pl6j5NLM5q5J9J9M5j8l1Ll3J24p2m1oQ7lj5l6p
$$ -35 21 18 9 -55 -41 20 -30 -19 -1 -51 16 23 -13 -28 -23 -20 25 -60 -41 -22 23 5 -26 -23 -56 68 -4 -45 -51 36 33 18 -18 -25
6531b5N1M0o7o4R4K0q6M0o3L8O1%l4n6R5jJ2o1j9K6kM1o8l6j9P9L3o6j5P1%M2
$$ -25 26 66 -1 -65 29 49 -37 3 -60 -22 39 39 5 -51 44 43 55 -6 -25 1 -1 40 -28 -64 -83 -4 29 -37 -52 19 19 61
6563F1j12N9mQK6p9n0J15Qj9q6j4J01K6J0N4k42R4%J07K8j51J19n3L5j46R2oQ0
$$ 61 -51 8 4 12 38 -41 -91 24 32 13 -73 -87 14 40 50 104 -138 -44 -44 63 91 -60 59 6 41 -105 -13 -19 61
6592F1j07j6K6Q4N4j59J0k0Q2J5n6o4Q1Q4n9K2p1J0L9M7l1o9N3j5M6k2MM1M3n4
$$ 61 -46 -62 -36 48 102 -57 -47 -67 15 30 -26 -90 -9 75 16 38 -33 -23 16 63 32 -37 16 1 47 25 29 70 113 59
6622E9o8qK3K0QL3r1Q1l7Q0m1r0M7MN2qm4j1N8k8r9M9kR0Rj27P0J4Mk6j6pJ1O
$$ 59 -9 -17 6 26 34 67 -24 57 20 100 59 -31 16 20 72 64 20 9 67 39 -60 -11 -13 77 86 -41 29 43 47 21 5 -2 9 15
6656A5Jp6J20n5P6l8j12O9kk8K4o1j1J03n3n3LL6M3J0j6r7Q4j8N1n0l2J8M8k2
$$ 15 16 -60 60 5 81 43 -69 0 -2 -30 -6 -67 -78 25 -28 -81 -78 -42 1 11 -5 -102 -18 -36 15 -35 -67 -49 -1 -23
6686b3o6j3M9LM1j4l7J9Q7m1j35O7L4pj2L6l8K2Q8q1m2l4R5K6l4l4J1O4L1l7q3
$$ -23 -89 -102 -53 -50 -9 -23 -60 -41 46 5 -130 -63 -29 -36 -48 -12 -50 -28 60 -21 -63 -97 -2 24 -10 -44 -33 31 62 25 -58
6717e8L6j0Q3Jq8pJ24K5m2m1k5Q5J5p9j5PJ01o5J0n1J4P8pp0J0k3J00n3k1m5J10
$$ -58 -22 -32 51 52 -36 -43 81 106 64 23 -2 83 98 19 4 11 112 47 57 6 20 98 91 21 31 8 108 55 34 -11 99
6748I9k9J6q8NL3N7l7m8j0O0l2K1r2R2j6j5N8j97J80k8L7j05J8J7J2J9n2oj6J1
$$ 99 70 86 -2 3 36 93 56 8 -2 58 26 47 -45 47 31 16 74 -123 57 29 66 -39 -21 -4 8 27 -25 -31 -47 -36
6778c6L2np5P2O0m7%j09J17%j6q1k2M8N6qo9K1l3J02k3j5p2R9Kk1p0k3J22J8j1
$$ -36 -4 -9 -84 -12 48 1 1 -108 9 9 -7 -88 -110 -62 -6 -14 -83 -62 -95 7 -16 -31 -103 -4 -2 -23 -93 -116 6 24 13
6809A3k0J8k6k0N9n8q2R1P7j4r3nK2O6p8J2m4R4M2l0kl7M7Pl1l8nR2M6Kj05k5
$$ 13 -7 11 -15 -35 24 -34 -116 -25 52 38 -55 -60 -38 28 -50 -38 -82 12 54 24 22 -15 32 39 8 -30 -35 57 103 105 0 -25
6841b5L5J05q4m2L8pP9j12MlJ09l7lr1O5k2K9j3n3N1N5l7m1L7l7M7L7r2m1J0Q4
$$ -25 10 115 31 -11 27 20 99 -13 -9 -12 97 60 57 -34 31 9 38 25 -28 23 78 41 0 37 0 47 84 -8 -49 -39 45
6872D5J0l7kK3J0k8j5l3O8j06L5KK2K3Q2j27K6o0O1J4qn2Q8m5M2n0j6j%Q5r2k4
$$ 45 55 18 16 39 49 21 6 -27 41 -65 -30 -28 -6 17 99 -28 -2 -62 -1 13 5 -47 41 -4 38 -12 -28 -29 -29 56 -36 -60
6904f0mJ14m1Ll5mn4L4Q0o5P8N0q2j2m7l9J13l5M7j20mR2k4rK2P8k2m9l9K4m2
$$ -60 -64 50 9 12 -23 -27 -81 -47 33 -32 46 96 14 2 -45 -84 29 -6 41 -79 -83 9 -15 -24 -2 76 54 5 -34 -10 -52
6935e2J03q1KQON3or9P4L0O2j44P0p5J37m7Pj24N3L6N6q9K8k8K1Qm0pJ7O0m6J4
$$ -52 51 -30 -28 -20 -14 39 33 -66 8 38 100 -44 26 -49 88 41 48 -76 -23 13 69 -20 8 -20 1 9 -31 -38 -21 39 -7 7
6967Gl9K8N8Jo0j8L8k3J00r1J0m3M8Lk1q5J8O8L4o0J0mQ4k3m0L7l6oL7j26K5K1
$$ 7 -32 -4 54 55 -5 -23 15 -8 92 1 11 -32 16 19 -2 -87 -69 -1 33 -27 -17 -21 63 40 0 37 1 -5 32 -94 -69 -48
6999d8P9k4ok5j1J22j29n1N8N5k4k9M9oP6j1r0j1m0M8R2r5K0qP5j9r0K0k8J31
$$ -48 31 7 1 -24 -35 87 -42 -93 -35 20 -4 -33 16 10 86 75 -15 -26 -66 -18 74 -21 -1 -9 66 47 -43 -23 -51 80
7029H0j16J2L5k9N9k5j5p3Q6K0J9m6n8K3j2Q5p8rlO9J9n5k1RP2L3j18j2Q3J3m4
$$ 80 -36 -24 11 -18 41 16 1 -72 14 34 53 7 -51 -28 -40 45 -33 -42 -45 24 43 -12 -33 -24 48 81 -37 -49 34 47 3
7060Ck5k0Q2L9o7k4K1RM6k9m2kK5k4K3m9N5om3N7q8Q1l4%Jo4P0J4jn3N2l0M6m2
$$ 3 -22 -42 40 79 12 -12 9 18 64 35 -7 -9 16 -8 15 -34 21 15 -28 29 -59 22 -12 -12 -11 -75 -5 9 8 -45 7 -23 23 -19
7094a9m3l3O0Q1n8k5mk8O5m8mK8J8oRl2mN7%j4l7p6R9O2l6k8K5Q3l5qn2k1N0J6
$$ -19 -62 -95 -35 46 -12 -37 -41 -69 -4 -52 -56 -28 -10 -16 -7 -39 -43 14 14 0 -37 -113 -14 48 12 -16 9 92 57 49 -3 -24 26 42
7128D2l9nn8O2M7q5QLk7J00m5l6N4Oj7N4r9P5j0J9n7l1O8N3o1n0nO4J6J7q7L3
$$ 42 3 -2 -60 2 49 -36 -28 -25 -52 48 3 -33 21 27 10 64 -35 40 30 49 -8 -39 29 82 21 -29 -34 30 46 63 -24 9
7160IM2Km7p5N2K0J14j01j5k0QM6j7Lm6K8M6n3nj1O9Mm2ro9J13j4o1k3O4j3K6
$$ 9 51 53 6 -69 -17 3 117 16 1 -19 -11 35 18 21 -25 3 49 -4 -9 -20 49 53 11 2 -67 46 32 -29 -52 12 -1 25
7192B5m7M3q8N9L4o3K9k1M2k1L4m6l1J01q1j9Q6J8oon5q7P8L1j8m4K1RO2j3r1
$$ 25 -22 21 -67 -8 26 -37 -8 -29 13 -8 26 -20 -51 50 -31 -50 36 54 48 42 -13 -100 -22 9 -9 -53 -32 -23 39 26 -65
7223f5M6K0K8k3j2jm9L9m9M4qrO6q7L7j3L7L1k5m2P1nK6k4j5o8Q7J8n3MJ5j7J6
$$ -65 -19 1 29 6 -6 -7 -56 -17 -66 -22 -30 -39 27 -60 -23 -36 1 32 7 -35 36 31 57 33 18 -50 37 55 2 6 21 4 20
7256B0nn4P7k0L5q2m8J01k7l2l5M2K3M2K5o0j5L4J4j3m3m9O4N2j7m8K7NL4l3n0
$$ 20 15 -39 38 18 53 -29 -77 24 -3 -35 -70 -28 -5 37 62 2 -13 21 35 22 -21 -70 -6 46 29 -19 8 13 47 14 -36
7287c6l0L2L2N8j12MO8j4j3j8jOP1j4j5L6k6k6Ql1L4K3P0q3p0OJ06l8n1JL6P9
$$ -36 -66 -34 -2 56 -56 -52 16 2 -11 -29 -30 -24 47 33 18 54 28 2 10 -21 13 36 106 23 -47 -41 65 27 -24 -23 13 92
7319I2o1K1j33L7K3O6k4jK8j8om2k3L2L1n9l4K7P8M9r7L2nl1J2J9o8L2M5k2j5
$$ 92 31 52 -81 -44 -21 45 21 20 48 30 24 -18 -41 -9 22 -37 -71 -44 34 83 -14 18 13 -18 -6 13 -55 -23 22 0 -15
7350a5k2j4K2O9o7j0J3M8Kon7Q3l0Qm9Rl5R9l8m9oLP1j5j8m1P2j9J6o4N0M7l2
$$ -15 -37 -51 -29 40 -27 -37 -24 24 26 20 -37 46 16 24 -25 -16 -51 48 10 -39 -45 -42 29 14 -4 -45 27 8 24 -40 10 57 25
7383B5L2p0p4J13j3L1n3J1K7J5qn3M4L1p6j8M5j4L2m1R5j03rL8%N9j05N0M2o9
$$ 25 57 -13 -87 26 13 44 -9 2 29 44 36 -17 27 58 -18 -36 9 -5 27 -14 81 -22 -31 7 7 66 -39 11 53 -16
7413a6O4o1K8o3O3k3n8J19j4Nk5m3j0K4J8k5j1LM5n8O6r6K6J0jlJrN7p6N6l6k
$$ -16 48 -13 15 -48 15 -8 -66 53 39 44 19 -24 -34 -10 8 -17 -28 -25 20 -38 28 -68 -42 -32 -33 -36 -35 -44 13 -63 -7 -43 -45
7446d5R6n9o5N8n8Q9p0K4pO1J8Jn5l9M0O6r3N0NOJ0k9n0O4J6J8l3l7O5m5J04r1
$$ -45 51 -8 -73 -15 -73 16 -54 -30 -37 24 42 43 -12 -51 -11 55 -38 12 17 23 33 4 -46 18 34 52 19 -18 47 2 106 15
7478A5o0P5m0O7k4p3K0K8k2K4k8R2lKn9JJ4J0k7k2k2J04l3l5K0n3j0J01m7n1N0
$$ 15 -45 30 -10 57 33 -40 -20 8 -14 10 -18 74 71 73 14 15 29 39 12 -10 -32 72 39 4 24 -29 -39 62 15 -36 14
7509A4Jk1L9o9O6j1K1o0J0nN3ok5n9R3m3J4jr3k6O0M9j9l0O2L4rl1q5MQ7J6rq4
$$ 14 15 -6 33 -36 30 19 40 -20 -10 -15 38 32 7 -52 41 -2 12 11 -82 -108 -48 1 -18 -48 14 48 39 8 -77 -73 14 30 21 -63
7543f3L9K1qj6k0O6K3m1k9m9O4O1n6K3p2J9N8ol8J9qK9L8j27M1o9J21l9k6l0N6
$$ -63 -24 -3 -11 -27 -47 19 42 1 -28 -77 -13 48 -8 15 -57 -38 20 14 -24 -5 -13 16 54 -73 -32 -101 20 -19 -45 -75 -19
7574a9M3J3o7LK9JJ3n7N8K1m0j3p4Q4J29j34K3K5j6j3M0k3r6R7pOj9n4N3K4K7
$$ -19 24 37 -30 -27 2 3 16 -41 17 38 -2 -15 -89 -5 124 -10 13 38 22 9 49 26 -70 27 20 26 7 -47 6 30 57
7605E7m3m0M2OK7o5N5o3M0k4Nnj0K8j7M8k2J0m5k8K0k5L0Q4n1K8m1M0k9l7K4J5
$$ 57 14 -26 16 22 49 -16 39 -24 16 -8 -3 -8 -18 10 -7 41 19 29 -16 -44 -24 -49 -19 65 14 42 1 41 12 -25 -1 14
7637A4j8Oj5m6O0Q3r2l4K5m5J6P3p7L4l7L1Q6q8k3K3O5K7o3l5J1jM7l1k9JP6q8
$$ 14 -4 2 -13 -59 1 84 -8 -42 -17 -62 -46 27 -50 -16 -53 -22 64 -24 -47 -24 41 68 5 -30 -19 -20 27 -4 -33 -32 44 -44
7669d4m1N7J7M5M1r4j3N3K3m8Rj4J9N0o3Om6N1P0j2n8j0J0O8n5n4MjQ7l3r0R4
$$ -44 -85 -28 -11 34 75 -19 -32 21 44 -4 5 -9 10 60 -3 3 -43 8 78 66 8 -2 8 76 21 -33 -29 -30 57 24 -66 28
7701B8l6j9j1P9q9N0kK6m3M7K8n7k0p2N2L6Pj8M5Qm6Rmk4j2J6jM9n8M6k5o1L0
$$ 28 -8 -27 -38 41 -48 2 0 26 -17 30 58 1 -19 -91 -39 -3 4 -14 31 39 -7 2 -2 -26 -38 -22 -23 26 -32 14 -11 -72 -42
7734d2J0L7P4j20M6m2L6J0l8n6P9l6N8Mo0M9j6K2p5J8K2k8M6N3j17N6N0p5N4l6
$$ -42 -32 5 79 -41 5 -37 -1 9 -29 -85 -6 -42 16 20 -40 9 -7 15 -60 -42 -20 -48 -2 51 -66 -10 40 -35 19 -17
7764a7n7Q7jJ5Jj2M7p2l6K1j8O9Mp5M0J7M9q6nL2r4P7LO2r0L2J8k6K4M0j1m5M1
$$ -17 -74 13 12 27 28 16 63 -9 -45 -24 -42 27 31 -44 -4 13 62 -24 -29 3 -91 -14 -11 51 -39 -7 11 -15 9 49 38 -7 34
7797C4l1k0L8K5p6L3Jk9O6J7p1j0O6j8J6o7J1KK5J8j9j4L4k5j5l2M5O6r5Rl8L8
$$ 34 3 -17 21 46 -30 3 4 -25 41 58 -13 -23 43 25 41 -26 -15 -13 12 30 11 -3 31 6 -9 -41 4 70 -25 -16 -54 -16
7829a6O3o1K1k8m0J05jm6j2L9k3k3L1j7rM9m1j6Oj5K3M9pn6l8P8p7K0P6J3m2j3
$$ -16 47 -14 7 -21 -61 44 43 -3 -15 24 1 -22 9 -8 -17 32 -9 -25 -19 -34 -11 38 31 -25 -63 15 -62 -42 34 47 5 -8
7861hm4J8J8%L8n3MP9J2r9M9j5j0N1n4nN6o6J2j0m1kJ03l4k2K9j7L1n0K8o6P2
$$ -8 -52 -34 -16 -16 22 -31 -27 52 64 -35 14 -1 -11 40 -14 -19 37 -29 -17 -27 -68 -70 33 -1 -23 6 -11 20 -30 -2 -68 4
7893DlMM2ro9PK9n6J16n4k4k0mK9l2Q1n8JM7l9K0J7n0O4j4l8K9m2K3K5k0o1J3
$$ 4 1 5 47 38 -31 -24 5 -51 65 11 -13 -33 -37 -8 -40 41 -17 -16 31 -8 12 29 -21 43 29 -9 20 -22 1 26 6 -55 -42
7926d2L0j0J16r1m2nKM6J8k3K4j8L0o8K0KP9qn2m6K7L8m7m1O8jj0PM2k7k1j1K5
$$ -42 -12 -22 94 3 -39 -44 -42 4 22 -1 23 5 35 -33 -13 -11 68 60 8 -38 -11 27 -20 -61 7 6 -4 3 45 18 -3 -14 11
7959A1J0n2j8M9Nk9Mk9L4nM5j8J0L2q9O0o3K6N1o3L2JL1k8K9o1mM8J0k6m8rK5
$$ 11 21 -31 -49 0 5 -24 -20 -49 -15 -20 25 7 17 49 -40 20 -43 -17 34 -29 3 4 35 7 36 -25 -29 19 29 3 -45 -54 -29
7992b9QK7J0j6l9l8M5j5l9Q0J2j7J5N8l0J2j5j8L3n7O0K5J3l9o4K0j6L9K5j7l6
$$ -29 -21 6 16 0 -39 -77 -32 -47 -86 -6 6 -11 4 62 32 44 29 11 44 -13 47 72 85 46 -18 2 -14 25 50 33 -3
8023cj3l0J05l0LK6q1Q3k0m0L9m0O5j06M3p1O4O9q7L9l4O2o6K6Kj9k0N7j32J14
$$ -3 -16 -46 59 29 32 58 -23 60 40 0 39 -1 64 -42 1 -70 -6 63 -24 15 -19 43 -23 3 5 -14 -34 23 -109 5
8053EPr0P9Ok7l9L6K9l5J4n7P4mJ0Km9M0M1p9M6j4q0N2N6o8L9j6O6o8JN0k7M9
$$ 5 12 -78 1 7 -20 -59 -23 6 -29 -15 -72 2 -2 8 10 -39 1 42 -37 9 -5 -85 -33 23 -45 -6 -22 44 -24 -23 27 0 49
8086D9r6O0PJ1n8KJ2j1j05J84k0k0o9M9Kl3M9p1P9n6P8n4k0K9k7j3j7O3L8oj6
$$ 49 -47 13 20 31 -27 -25 -13 -24 -129 55 35 15 -54 -5 -3 -36 13 -58 21 -35 43 -11 -31 -2 -29 -42 -59 4 42 36 20
8117B0m6nP2Po5M8j2j6M3m1Qj7m0P0m6j6P9j2L0o1LopL4K7j5n9M2k7k5l5J09j0
$$ 20 -26 -31 41 48 -17 31 19 3 46 5 13 -4 -44 26 -20 -36 43 31 61 0 3 -3 -10 24 51 36 -23 19 -8 -33 -68 41 31
8150C1Oq0Q4p9K7L1M7n9k1l5k1L0j5J04m4k9j9J4M4j5Or4J25l0J9n9%M9lp5K6
$$ 31 37 -43 41 -38 -11 20 67 8 -13 -48 -69 -39 -54 50 6 -23 -42 -28 16 1 7 -87 38 8 27 -32 -32 17 14 -61 -35
8181c5J3LN2j11R7j0n6N6n9L8
$$ -35 -22 -19 33 -78 19 9 -47 9 -50 -12
8191a2
$$ Imaginary data points
##PAGE= N=2
##DATA TABLE= (X++(I..I)), XYDATA
0@%%%%%%%Nj3J6j6J6k4L2l2M0m8N6p2Q3r4J10j30J51j71J97k28K59k92L29l70
$$ 0 0 0 0 0 0 0 0 5 -8 8 -8 8 -16 16 -16 24 -24 32 -40 43 -51 59 -71 80 -91 106 -122 137 -155 174 -196
31a96M16m67N23n84O51p24Q06q95R91j098J214j343J487j650J831k031K263k528
$$ -196 220 -247 276 -308 343 -381 425 -470 521 -577 637 -706 781 -869 962 -1069 1194 -1334
49a334K834l194L625m154M818n680O852q547J1230j6145K8072j08378j66823J70342
$$ -1334 1500 -1694 1931 -2223 2595 -3085 3767 -4780 6450 -9695 18377 -90001 -256824 -86482
63h6482J36421k6184j21025p988M8214N90m6790J8389N3733P578m8268j6397K0262
$$ -86482 49939 23755 -97270 -105258 -57044 -56454 -103244 -84855 -31122 -23544 -71812 -88209 -67947
76f7947J2959n876J6170J3643k8886m7788M448M4343K0220j5659L666K3650j3739
$$ -67947 -54988 -60864 -44694 -31051 -59937 -107725 -103277 -58934 -38714 -54373 -50707 -27057 -40796
89d0796n7438k0566N9888P4451N30o4227m8300K1474O6004M4809j9372n4151j6335
$$ -40796 -98234 -118800 -58912 15539 16069 -48158 -96458 -74984 -8980 35829 16457 -37694 -54029
102e4029M4193L9644k0250l5103K6208N9589n436p2463k9724O2937O6094k0192
$$ -54029 -9836 29808 9558 -25545 663 60252 54816 -17647 -47371 15566 81660 61468
114F1468o0095p149L9275J1692k6893r044K8539K3256j2318k8803j5805O927K6559
$$ 61468 1373 -5776 33499 45191 18298 9254 37793 61049 48731 19928 4123 11050 37609
127C7609K7724l414m0297k9910K3733M6823M021m0263k0110K5294J8941k5664
$$ 37609 65333 61919 21622 -8288 15445 62268 66289 26026 5916 31210 50151 24487
139B4487k9123K0886M7130M129n0572m1466J7313M7467J4755l2121l2620O898
$$ 24487 -4636 16250 63380 67509 16937 -24529 -7216 40251 55006 22885 -9735 -2837
151b837L1061Q974k7066k5143J2903L2838K690l7448k8870K0230M3555Q435l8154
$$ -2837 28224 37198 10132 -15011 -2108 30730 33420 -4028 -32898 -12668 30887 39322 1168
164A168l6056P723L1737Q099k2582j4814J4858J5911j6241l0655R51L5502J8487
$$ 1168 -34888 -27165 4572 12671 -9911 -24725 -9867 6044 -10197 -40852 -39901 -4399 14088
177A4088k9959m0026N857M3406K1010k7187l6007J073L1889K0597j2393k5908
$$ 14088 -15871 -55897 -50040 -6634 14376 -12811 -48818 -47745 -15856 4741 -7652 -33560
189c3560n899K2664K4738m590k9186j3459K5444L1701p386l5549q879L3157K5265
$$ -33560 -39459 -16795 7943 3353 -25833 -39292 -13848 17853 10467 -25082 -33961 -804 24461
202B4461k0120l2744N911L4167R792k6801j8905J8809K6429p604l1003q055K9714
$$ 24461 4341 -28403 -22492 11675 21467 -5334 -24239 -5430 20999 13395 -17608 -25663 4051
215D051K9426j0324l8319j7276K7643L8651J81l7582k4778J9771L4814K950k7606
$$ 4051 33477 23153 -15166 -32442 -4799 33852 34033 -3549 -28327 -8556 26258 29208 1602
228A602j5232J6513J9082q695k3163l187K2379J9213q519k5873j2724J5206K3594
$$ 1602 -13630 2883 21965 13270 -9893 -13080 9299 28512 19993 -5880 -18604 -3398 20196
241B0196J202k1783j2863J5567J9445r070k5250Q65L2041J6277k9386l7181Q467
$$ 20196 21398 -385 -13248 2319 21764 12694 -12556 -11691 20350 36627 7241 -29940 -21473
254b1473M3721J9360k8158l3505L820K7352Q185j9816j5564J1149J9654k988k5333
$$ -21473 22248 41608 13450 -20055 -16235 11117 19302 -514 -16078 -4929 14725 11737 -13596
267a3596j6105J4648K7709N004k5837k5451N980K6422J0123j6695j5089J0069
$$ -13596 -29701 -15053 12656 17660 -8177 -33628 -27648 -1226 8897 -7798 -22887 -12818
279a2818J8048m762k3583o284K6466K7332q797l5024j5952K3788L2995K623k5250
$$ -12818 5230 468 -23115 -29399 -2933 24399 15602 -19422 -35374 -11586 21409 24032 -1218
292a218j5938J2139J7199n240j7673J751K4211J2487k1568l0240J812L3496K2811
$$ -1218 -17156 -5017 12182 6942 -10731 -8980 15231 27718 6150 -24090 -22278 11218 34029
305C4029j6090l1814o970K2163J7844p714j5243L880J7603K054k1870j6904J5615
$$ 34029 17939 -13875 -20845 1318 19162 11448 -3795 85 17688 19742 -2128 -19032 -3417
318c417L2930Q936k6882k8950M739K9530J5590j4906k0572J595J5436J149j6455
$$ -3417 29513 38449 11567 -17383 -12644 16886 32476 17570 -3002 -1407 14029 15178 -1277
331a277p040J7578J9544r046l1147j5022K0571K9575R50k6014j7297J0216J9897
$$ -1277 -8317 9261 28805 19759 -11388 -26410 -5839 23736 24686 -1328 -18625 -8409 11488
344A1488j88j6424n597J5898J3514j2034k4248k072K6340K1857j1252k9484r907
$$ 11488 11300 -5124 -10721 5177 18691 6657 -17591 -19663 6677 28534 17282 -12202 -22109
357b2109J9866K0115o329k0089l367J6460Q897j4834j8248O012K4193R234k0343
$$ -22109 -2243 17872 11543 -8546 -11913 4547 13444 -1390 -19638 -13626 10567 19801 -542
370e42k4570L035K5817J3956j4246j9894K446J9393O022j6592j3728J2183K2653
$$ -542 -25112 -22077 3740 17696 3450 -16444 -13998 5395 11417 -5175 -18903 -6720 15933
383A5933J146k3722j6421J3994K5325L478k1893j6812R105J9019O45j7304q559
$$ 15933 17079 -6643 -23064 -9070 16255 19733 -2160 -18972 -9867 9152 9797 -7507 -16066
396a6066J3590J6071o335k2736q684J8434K1344m456k3514r970J6563J9025m026
$$ -16066 -2476 13595 7260 -15476 -24160 -5726 15618 11162 -12352 -22322 -5759 13266 9240
409I240j8375m269J6505J2656j0221j8365J384K1465J3452j2505k1368j443J9491
$$ 9240 -9135 -13404 3101 15757 5536 -12829 -11445 10020 23472 10967 -10401 -11844 7647
422G647J3314j0955j8647O06J8427Q586j4607j7171N478K1316O884j7977j8454
$$ 7647 20961 10006 -8641 -8035 10392 18978 4371 -12800 -7322 13994 20878 2901 -15553
435a5553O709K1768O826j5971j4197Q130J8352J643j7857j1735J2322K0544R7
$$ -15553 -8844 12924 19750 3779 -10418 -2288 16064 17707 -150 -11885 437 20981 21078
448B1078k0833j3633J1589K0152O16j9029j1539J0542J4424n219j8279m338J7004
$$ 21078 245 -13388 -1799 18353 18969 -60 -11599 -1057 13367 8148 -10131 -14469 2535
461B535J4443j0321k3403o518J8417J8237n326j9967p139J3306J2906n470j3404
$$ 2535 16978 6657 -16746 -23264 -4847 13390 8064 -11903 -19042 -5736 7170 1700 -11704
474a1704Q72J5726P190j4491j7474N043K3560J2128j4569k1525j124J7799J1054
$$ -11704 -10832 4894 12084 -2407 -19881 -14838 8722 20850 6281 -15244 -16368 1431 12485
487A2485r389j3430K764J3218J423j5365j0875J1204K0426J636k1666j8393P932
$$ 12485 3096 -10334 -7570 5648 7071 -8294 -19169 -7965 12461 14097 -7569 -25962 -18030
500a8030K2569Q083j3852j3972M265J2538M1j2396l642J4089J3441q008k1060
$$ -18030 4539 12622 -1230 -15202 -10937 1601 1642 -10754 -14396 -307 13134 5126 -15934
513a5934o395J8115K0383k291k0397j1156J0303J4535j505j2272j383J3514P992
$$ -15934 -22329 -4214 16169 13878 -6519 -17675 -7372 7163 5658 -6614 -7997 5517 13509
526A3509j2112j7726K049K2013J4462j1850k2479m490J7090J4820m728j3306j241
$$ 13509 1397 -16329 -14280 7733 22195 10345 -12134 -16624 466 15286 10558 -2748 -3989
539c989J0595L355j1838r989R217J9204L543j8674j8326M987K0961R906j1864
$$ -3989 6606 9961 -1877 -11866 -2649 16555 20098 1424 -16902 -11915 9046 18952 7088
552G088j5301J211J2022K789r964n116J0956J3254n104k0274r691J4988K1578
$$ 7088 -8213 -7002 5020 7809 -2155 -7271 3685 16939 11835 -8439 -18130 -3142 18436
565A8436J546j8683j4116O636J5001K006j0995n165Q710P432q891j5815k08J8050
$$ 18436 19982 1299 -12817 -6181 8820 10826 -169 -5334 3376 10808 1917 -13898 -14106 3944
579C944J3310r975k1965p489J4229J5139l249j4074m240R423N991q398j0547N238
$$ 3944 17254 7279 -14686 -22175 -7946 7193 3944 -10130 -14370 -4947 1044 -7354 -17901 -12663
593a2663J6727N265j5499j7146L726K0320J1458r865j5753j056J2094N873p913
$$ -12663 4064 9329 -6170 -23316 -19590 730 12188 2323 -13430 -14486 -2392 3481 -4432
606d432p825O338J2222j101j5900r999J0583J8479K073j7280j4163O129J5865
$$ -4432 -12257 -5919 6303 5202 -10698 -20697 -10114 8365 10438 -6842 -21005 -14876 989
619I89L570j1012p293P894J0467l860j3948l229J4839J4597m639j7352o510J3018
$$ 989 4559 -6453 -13746 -5852 4615 755 -13193 -16422 -1583 13014 8375 -8977 -15487 -2469
633b469J5675r37j3228n331R467R217n019j0992J216J4287Q100j0644j6076q6
$$ -2469 13206 12269 -959 -6290 3177 12394 7375 -3617 -2401 11886 19986 9342 -6734 -6820
647f820J5934J0626q276j4727j494J1765O842p696r885L341J1877K202j3116j1307
$$ -6820 9114 19740 11464 -3263 -4757 7008 13850 6154 -3731 -390 11487 13689 573 -10734
661a0734O438J6358M365j3511j3390L624J3739L652j1280r531N377J1042j116
$$ -10734 -4296 12062 16427 2916 -10474 -6850 6889 10541 -739 -10270 -4893 6149 5033
674E033j3406p399R035J2814k113j5738r368Q311J2969o71j2659o305Q279R599
$$ 5033 -8373 -15772 -6737 6077 3964 -11774 -21142 -12831 138 -533 -13192 -19497 -11218 -1619
688a619m110j2508k590J2193J0223o351j4354k062J3255J1006n372j3277j967
$$ -1619 -5729 -18237 -20827 -8634 1589 -4762 -19116 -21178 -7923 3083 -2289 -15566 -17533
701a7533J1718Q196o934j1611J338J3396O865r479j3196J409J3806O809r023j1384
$$ -17533 -5815 2381 -4553 -16164 -14826 -1430 5435 -4044 -17240 -15831 -2025 4784 -4239 -15623
715a5623K304J2078M095r192q385N469J2591J996j1469q984O858J4407L745j0179
$$ -15623 -13319 -1241 2854 -6338 -14723 -9254 3337 5333 -6136 -15120 -8262 6145 9890 -289
729b89q588N705J1790J578r559m872Q801J0994k455j2364m378J1090J2709k206
$$ -289 -8877 -3172 8618 10196 637 -4235 4566 15560 13105 741 -3637 7453 20162 17956
743A7956j3407o257Q735J0783j838j0047k510R052P217o337j1842l22J3051R041
$$ 17956 4549 -1708 7027 17810 15972 5925 3415 12467 19684 13347 1505 1183 14234 23275
757B3275p718j4351j903J2276R339n572j1333r18R132L955q264q682M164J1888
$$ 23275 15557 1206 -697 11579 20918 15346 4013 3095 12227 16182 7918 -764 3400 15288
771A5288K658j1665j1747K890J2723M933r525j0653J591R264J857q762o132O041
$$ 15288 17946 6281 -5466 -2576 10147 15080 5555 -5098 -3507 5757 7614 -1148 -7280 -1239
785a239R404k542j3616p419Q878J3215q5j3106r177N410J0368N2r646m681O599
$$ -1239 8165 5623 -7993 -15412 -6534 6681 6596 -6510 -15687 -10277 91 143 -9503 -14184 -7585
800g585O808m685j0942j854J0898R388n148j3467m518R253R887k060q941j811
$$ -7585 -777 -5462 -16404 -18258 -7360 2028 -3120 -16587 -21105 -11852 -1965 -4025 -12966 -14777
814a4777P457M945n716p767L343J2080M730r659j1765K459J4071P978o939j1133
$$ -14777 -7320 -2375 -8091 -15858 -12515 -435 4295 -5364 -17129 -14670 -599 7379 440 -10693
828a0693o9R487M579o304o282M687R933M86j0693p460O797J3026K541j0521q861
$$ -10693 -10762 -1275 3304 -3000 -9282 -4595 5338 5824 -4869 -12329 -5532 7494 10035 -486 -9347
843i347M439J0543K666o755l986N921P284k789r421j843J0313J0243l030j2025
$$ -9347 -4908 5635 8301 1546 -2440 3481 10765 7976 -1445 -3288 7025 17268 14238 2213
857B213n042Q366J0612q93r664m241O201O469l972q749J4J0015O183p653j2633
$$ 2213 -2829 5537 16149 15256 5592 1351 7552 14021 10049 1300 1314 11329 17512 9859 -2774
872b774j279J1092Q270n260j0743j795P773M842n127o902K141Q229J657r248q126
$$ -2774 -4053 7039 15309 10049 -694 -2489 5284 10126 4999 -1903 238 8467 10124 876 -7250
887g250M062J1491L746r049r715J624Q913K767p024n922M111P270j466r545m652
$$ -7250 -3188 8303 12049 3000 -6715 -5091 3822 6589 -435 -6357 -2246 5024 3558 -5987 -10639
902a0639P330R848j068j1266p022N741R979J110p870m692N012O565k597q390j421
$$ -10639 -3309 6539 5471 -5795 -12817 -7076 2903 4013 -3857 -8549 -3537 3028 431 -7959 -9380
917i380R234P585m980j1321k501R558Q855l012r728k891O575N246l803o574J165
$$ -9380 -146 7439 2459 -8862 -11363 -1805 7050 4038 -5690 -8581 -2006 3240 -563 -7137 -5972
932e972Q263L664p270r096J394J0595N979o173r385L06Q738M383n244n928L351
$$ -5972 2291 5955 -1315 -10411 -9017 1578 7557 1384 -8001 -7695 1043 5426 182 -5746 -2395
947b395P948N02q797n822O297J0779J771r479p830L344R284K413o633n227L723
$$ -2395 5553 6055 -2742 -8564 -2267 8512 10283 804 -7026 -3682 5602 8015 1382 -3845 -122
962a22O548j073p711k910P231Q229k439j0616m670P136R001o56p688l242N262
$$ -122 6426 5353 -2358 -5268 1963 10192 7753 -2863 -7533 -397 8604 7948 260 -2982 2280
977B280N043l214o701K89Q153M795o039r507m93R388P129m459r391k095O508M468
$$ 2280 7323 4109 -2592 -2303 5850 10645 4606 -4901 -5394 3994 11123 6664 -2727 -4822 1686 6154
993F154m213n986J870P409J608p974p406L354J0167L526p586q481J409Q289L576
$$ 6154 1941 -4045 -2175 5234 6842 -1132 -8538 -5184 4983 8509 923 -7558 -6149 2140 5716
1008E716m900n013K713O016p78p541l556O695Q941q03r903o115N160Q938P29p377
$$ 5716 816 -4197 -1484 4532 3754 -3787 -7343 -648 8293 7490 -2413 -8528 -3368 5570 6299 -1078
1024a078m551M013N497j994o551r40P293N685m562r743k212Q264P911k069q140
$$ -1078 -5629 -1616 3881 1887 -4664 -5604 1689 7374 2812 -6931 -9143 -879 7032 4963 -3177
1039c177k767N503N069k676n380R81O767K638o279p181K204R498M913n967q756
$$ -3177 -5944 -441 4628 1952 -3428 -2447 4320 6958 679 -6502 -4298 5200 10113 4146 -4610
1054d610l96P251M168l969n322J745N777M51o726m583M692Q390N95q608o635L487
$$ -4610 -5006 2245 6413 2444 -2878 -1133 4644 5095 -1631 -6214 -1522 6868 7463 -1145 -7780 -4293
1070d293Q699K284n811n035K669N406p26o132j994O224O463k732q949l456O768
$$ -4293 4406 6690 879 -4156 -1487 3919 3193 -2939 -4933 1291 7754 5022 -3927 -7383 -615
1085f15Q028j118q018l898M523N425j697n497k26O058L408n269p683N67Q587N573
$$ -615 7413 6295 -1723 -5621 -1098 4327 2630 -2867 -3093 2965 6373 1104 -6579 -6012 2575 8148
1101H148m541q433j276O652N125l091n798K25N524J645n325n043L224P798J942
$$ 8148 3607 -4826 -6102 550 5675 2584 -3214 -2989 2535 4180 -1145 -6188 -2964 4834 6776
1116F776o987p017J794P547K929n087n242J820N527L88n529l056M686O465j242
$$ 6776 -211 -7228 -5434 2113 5042 -45 -5287 -3467 2060 2448 -3081 -6137 -1451 5014 3772
1131C772p910m230N433Q023N32o756m334L617N669m57n430j650N223M600k975
$$ 3772 -4138 -8368 -2935 5088 5620 -1136 -5470 -1853 3816 3359 -2071 -3721 1502 6102 3127
1146C127p050j062O866N964k948p788k228N629M984k302n362j94N464K736m776
$$ 3127 -3923 -4985 1881 7845 4897 -2891 -5119 510 5494 3192 -2170 -2364 3100 5836 1060
1161A060n840J694P416L295n441o813Q19P119L595m182n544J179N524J237n255
$$ 1060 -4780 -3086 4330 7625 2184 -4629 -3810 3309 6904 2722 -2822 -1643 3881 5118 -137
1176a37m095L532O789M54o814n229L177O858J263n724m258K786N166j13n174k374
$$ -137 -4232 -700 6089 6543 -271 -5500 -2323 4535 5798 74 -4184 -1398 3768 3655 -1519 -3893
1192c893M436N182j988o961k625N499O279j243o536k788M187M749j879n660q79
$$ -3893 543 5725 3737 -3224 -5849 -350 5929 4686 -1850 -4638 -451 4298 2419 -3241 -4120
1207d120N107L530l789o240k68O308M138l646o817q39N365L565l119m829R37N394
$$ -4120 987 4517 728 -5512 -5780 528 4666 1020 -5797 -6636 -1271 2294 -825 -5654 -4717 677
1223F77J746m972m868K441O830K264n428n468J800O483K506m270m147J849M914
$$ 677 2423 -2549 -7417 -4976 1854 4118 -1310 -6778 -4978 1505 4011 -259 -4406 -2557 2357
1238B357K77n102k772M021N797m44o489l774L698O092J33n487l030L457M564j146
$$ 2357 2634 -2468 -5240 -1219 4578 4134 -2355 -6129 -2431 3661 3794 -1693 -4723 -1266 3298 2152
1254B152n022q66N184M493k875o682j345O111N646j672o086j816M569L957k096
$$ 2152 -2870 -3736 1448 5941 3066 -3616 -4961 1150 6796 5124 -962 -2778 1791 5748 3652
1269C652m546J95M925K204m248n184J203O291K999m495o038n2N044K603l138m010
$$ 3652 -894 -699 4226 6430 2182 -3002 -1799 4492 7491 2996 -3042 -3094 1950 4553 1415 -2595
1285b595J249M251M19m936l536L231O044M57o111m650K640O178J575m583l665
$$ -2595 -1346 2905 3324 -1612 -5148 -1917 4127 4584 -1527 -6177 -3537 2641 4216 -367 -4032
1300d032K029M033m59m559j541M215M575j826o328k579M535N624p96n782k804
$$ -4032 -2003 2030 1571 -2988 -4529 -314 4261 2435 -3893 -6472 -1937 3687 2891 -2891 -5695
1315e695L224L912j245m006j84M265K415l881n519M78O279L968l366o033r08M911
$$ -5695 -2471 1441 196 -3810 -3994 271 2686 -1195 -6714 -6236 43 4011 645 -5388 -6296 -1385
1331a385L665k271m259L73M111J385l948l651K597O095J637n223n184J552N951
$$ -1385 2280 9 -4250 -3877 234 1619 -2329 -5980 -3383 2712 4349 -874 -6058 -4506 1445
1346A445K486l391l477J409L995M85l677j698L734M671j024n717k910M217O064
$$ 1445 3931 540 -2937 -1528 2467 2952 -725 -2423 1311 5982 4958 -759 -3669 548 6612
1361F612N89m955l516K389M004l19l570p91L672K684k668n105n10N396M219k494
$$ 6612 7201 2246 -1270 1119 5123 4804 1234 443 4115 6799 4131 -974 -1484 3912 8131 5637
1377E637n991j990L995L928j255l727m58L373J564l481m123J471N574K176m467
$$ 5637 -354 -2344 1651 5579 4324 597 139 3512 5076 1595 -2528 -1057 4517 6693 2226
1392B226n545L92N289K902k846m301J08L360P46l594k390K853M455n21n629l909
$$ 2226 -3319 -2927 2362 5264 2418 -1883 -1775 1585 2331 -1263 -3653 -800 3655 3134 -2495 -6404
1408f404K823N864Q41m703l746J676L813J29l399j407L082L017k239n105j184
$$ -6404 -3581 2283 3124 -1579 -5325 -3649 164 293 -3106 -4513 -1431 1586 -653 -5758 -6942
1423f942M619M751j174n488k546L092L896o42l619p85L032K080k592l811P31N078
$$ -6942 -2323 2428 1254 -4234 -6780 -3688 208 -434 -4053 -4838 -1806 274 -2318 -6129 -5398 -320
1439c20K839l318n190m19M624L602j649l514QL221J470k756k653K261M761Q43
$$ -320 2519 -799 -5989 -6408 -1784 1818 169 -3345 -3337 -116 1354 -1402 -4055 -1794 2967 3810
1455C810m466l821K027N642K050l446l890Q58L819O87k796j706K807L587r52m760
$$ 3810 -656 -4477 -2450 3192 5242 1796 -2094 -1236 2583 3270 474 -1232 1575 5162 4210 -550
1471e50k140L729M812k51m749k855K674L900l6l181j125K848K301k201m176k4
$$ -550 -2690 1039 5851 5600 851 -2004 670 4570 4534 1353 228 3076 5377 3176 -1000 -1024
1487a024M578L369k303n023j375L708L330j371l711p80K776J493k570l026J203
$$ -1024 3554 6923 4620 -403 -1778 1930 5260 3889 178 -602 2174 3667 1097 -1929 -726
1502g26M205J298m163m449P62M690K297k798l714J13L217J111k614k324J787L511
$$ -726 3479 4777 614 -3835 -3073 1617 3914 1116 -2598 -2485 732 1843 -771 -3095 -1308 2203
1518B203l05m176k672K585M617O97m187l291J494L447K53l005j425K339K687j460
$$ 2203 1898 -2278 -4950 -2365 2252 2949 -1238 -4529 -3035 412 665 -2340 -3765 -1426 1261 -199
1534a99m006r35L709L644j446m691j853L148L700n13l236r51K586J996k003l025
$$ -199 -4205 -5140 -1431 2213 767 -3924 -5777 -2629 1071 558 -2678 -3629 -1043 953 -1050 -4075
1550d075O45M024K105k803m064P4M231K757k135l617q8L071J502k180k316J506
$$ -4075 -3430 594 2699 -104 -4168 -4094 137 2894 759 -2858 -2946 125 1627 -553 -2869 -1363
1566a363L688N89l782l150J831M557J393l187l182J134L492J032k558j733J769
$$ -1363 2325 2914 -868 -4018 -2187 2370 3763 576 -2606 -1472 2020 3052 494 -1239 530
1581E30K864o85l568j385L099L912m98m170k457K395L452j76l043j328K316K246
$$ 530 3394 2709 -859 -2244 855 4767 4269 99 -2358 37 3489 3313 270 -1058 1258 3504
1597C504j518l193j92L500K451k234m174q04L540L072j165l336p69K562J592j841
$$ 3504 1986 -1207 -1399 2101 4552 2318 -1856 -2660 880 3952 2787 -549 -1318 1244 2836 995
1613I95k658Q31L287J061k937l304Q40L887J691k688l319L60K894R09k243j922
$$ 995 -1663 -832 2455 3516 579 -2725 -1885 2002 3693 1005 -2314 -1954 940 1849 -394 -2316
1629b316J519K931j70l552k339K241L901K82l448k780J942L233L55k627j908K084
$$ -2316 -797 2134 1964 -1588 -3927 -1686 2215 2497 -951 -3731 -1789 1444 1799 -828 -2736 -652
1645f52K394j032l445o96L160K748p85l938j499K759K614p06l141r18K606J734
$$ -652 1742 710 -2735 -3431 -271 2477 1692 -2246 -3745 -986 1628 922 -2219 -3137 -531 1203
1661A203j633k695L29L219J871k462l457J8L391K297j466k815j09K493J282j915
$$ 1203 -430 -3125 -2796 423 2294 -168 -3625 -3607 -216 2081 615 -2200 -2309 184 1466 -449
1677d49k014J121K959N89k919k475J412L703J067k835k770Q86K840O92k217j572
$$ -449 -2463 -1342 1617 2206 -713 -3188 -1776 1927 2994 159 -2611 -1725 1115 1807 -410 -1982
1693a982J759K539m13l169j497K361L172k14l177j847J931K896j29k475r16K001
$$ -1982 -223 2316 1903 -1266 -2763 -402 2770 2556 -621 -2468 -537 2359 2230 -245 -1161 840
1709H40J809j471k793j60L204K284j666l518p06K827K264j091k827l38K147J500
$$ 840 2649 1178 -1615 -1775 1429 3713 2047 -1471 -2177 650 2914 1823 -1004 -1342 805 2305
1725B305j701k293Q33K929J080k711k979O70L298J716j950k640M46K346P40k008
$$ 2305 604 -1689 -856 2073 3153 442 -2537 -1867 1431 3147 1197 -1443 -997 1349 2089 81
1741H1j600J361K459j39k894j844J890L225M21l029k180J035K456L05k020j061
$$ 81 -1519 -158 2301 2162 -732 -2576 -686 2539 2960 -69 -2249 -1214 1242 1547 -473 -1534
1757a534J678J905r55k789o68K584K545r66l224j325K097K631l08k354q89J799
$$ -1534 144 2049 1094 -1695 -2363 221 2766 1800 -1424 -2749 -652 1979 1671 -683 -1572 227
1773B27J218j429k190L70K890J387k123l104o3L031J917j565k675j93K050J047
$$ 227 1445 16 -2174 -1804 1086 2473 350 -2754 -2817 214 2131 566 -2109 -2302 -252 795
1789G95j608j573J163K518K21k861k177J397L259R88k215k394O85K391O32j776
$$ 795 -813 -2386 -1223 1295 1516 -1345 -3522 -2125 1134 2122 -93 -2487 -1802 589 1221 -555
1805e55j016J352J654o52k555q06K357K794m55l182j812J573K495K42k024r61
$$ -555 -1571 -219 1435 783 -1772 -2578 -221 2573 2118 -1064 -2876 -1303 1192 1434 -590 -1551
1821a551J283J428j005k039N9K545J630j632l059n68K596K431o19k421p70J502
$$ -1551 -268 1160 155 -1884 -1825 720 2350 718 -2341 -2909 -313 2118 1499 -922 -1692 -190
1837a90J173j119j538P88K297N43k296k352Q20L170J454j899k671LK093J059j101
$$ -190 983 -136 -1674 -886 1411 1954 -342 -2694 -1874 1296 2750 851 -1820 -1817 276 1335 234
1854B34j102J041J701m11k444j080J996K752K02k820k003J091K628O76j743j167
$$ 234 -868 173 1874 1463 -981 -2061 -65 2687 2889 69 -1934 -843 1785 2461 718 -449
1870d49Q73J286q19j804r3K324J841j179l044j033K136K294l07k076j065J270
$$ -449 424 1710 891 -913 -1006 1318 3159 1980 -1064 -2097 39 2333 2026 -50 -1115 155
1886A55J224p20j482M06K101P74k041k549L76K854J863j239k617n44J786J126
$$ 155 1379 659 -823 -417 1684 2458 417 -2132 -1756 1098 2961 1722 -895 -1439 347 1473
1902A473r17j249N76J554r9j990j477J412K651M85k442k333M41K305R77j350j266
$$ 1473 556 -693 -117 1437 1338 -652 -2129 -717 1934 2419 -23 -2356 -1915 390 1367 17 -1249
1919a249O77J281l56j863n47J827K011p33k640j270J619K421J24j952j202R10
$$ -1249 -572 709 353 -1510 -2057 -230 1781 1048 -1592 -2862 -1243 1178 1302 -650 -1852 -942
1935i42J144n61j405J47J901J129j565k435k08K490J902r73k294o43J516J416
$$ -942 202 -359 -1764 -1617 284 1413 -152 -2587 -2795 -305 1597 624 -1670 -2313 -797 619
1951F19o26j183L90J531L52j702j595J033K439J057j641k178K34K078J048j121
$$ 619 -7 -1190 -800 731 1083 -619 -2214 -1181 1258 2315 674 -1504 -1270 808 1856 735
1967G35j321M64J415Nj629p60J526K017j45k411j500J030K280L92j441j278P99
$$ 735 -586 -122 1293 1298 -331 -1091 435 2452 2307 -104 -1604 -574 1706 2098 657 -621 178
1984A78J497m24j309l66J528J197r72k179o13J962J947l58k127r49J121J354o76
$$ 178 1675 1251 -58 -424 1104 2301 1329 -850 -1463 499 2446 2088 -39 -988 133 1487 811
2001H11j062l9J750J92j113j517J96J730J316j229k261R0J395J643m00j915k91
$$ 811 -251 -290 1460 1652 539 -978 -782 948 2264 1035 -1226 -1136 259 1902 1502 -413 -704
2018g04J679J73j179j454J349J587J72j867j375O16J858Q79j555j328L65J267
$$ -704 975 1148 -31 -1485 -136 1451 1623 -244 -1619 -1003 855 1734 179 -1149 -784 483
2034D83o3j307n16J297J452m83k381p23J250J918k81j691q61Q22J444l46j167
$$ 483 420 -887 -1403 -106 1346 863 -1518 -2241 -991 927 646 -1045 -1906 -1084 360 14 -1153
2051a153k87J391Q04j144j780K50J775J538r32j817m79J400J182n71j254Q7J261
$$ -1153 -1440 -49 755 -389 -2169 -1919 -144 1394 462 -1355 -1834 -434 748 177 -1077 -990 271
2068B71N55j233j086N12J933L23j071j662J32J816R46p28j116K17J182J18j184
$$ 271 826 -407 -1493 -981 952 1275 204 -1458 -1326 490 1436 708 -408 -191 991 1109 -75
2085g5o51R99J609n6j657j188J071J790K46j441j058N73J143p6j096l90J347J008
$$ -75 -726 273 1882 1826 169 -1019 52 1842 2088 647 -411 162 1305 1229 133 -257 1090 2098
2103B098o68j809n56J624J381m12j629o57J030J101k85j490N03Q33M39r98j492
$$ 2098 1430 -379 -935 689 2070 1658 29 -628 402 1503 1218 -272 231 1064 1503 505 -987
2120i87L79J716R91r96j743k90J351Q19p06j107J09J047K58j197q57O85J475J64
$$ -987 -608 1108 2099 1103 -640 -930 421 1240 534 -573 -464 583 841 -356 -1213 -528 947 1111
2138A111j517j328L57J589O74j105j021M49R65n1j183n91J102J249l35j589q27
$$ 1111 -406 -1734 -1377 212 886 -219 -1240 -791 174 123 -1060 -1651 -549 700 365 -1224 -2051
2155b051J023J556L4j323q18O64Q59k31r72r2J170Q55q33j491j91J542J217n82
$$ -2051 -1028 528 562 -761 -1579 -915 -56 -287 -1259 -1351 -181 674 -159 -1650 -1841 -299 918 336
2173C36j467m40J128R74l84r80K26J056K86j094r73N18J591O41j085j329Q9J324
$$ 336 -1131 -1571 -443 531 147 -833 -607 449 735 -359 -1332 -814 777 1418 333 -996 -907 417
2191D17O78p51q70K98R56Q4r57n76Q03J425k2j495j057O10J444M80r24p91L65
$$ 417 1095 344 -526 -228 728 812 -145 -721 82 1507 1485 -10 -1067 -457 987 1467 543 -248 117
2210A17Q55j50r54k62R84R13n32j479m28J213J378k09j375p63N89Q90k04q29K
$$ 117 972 822 -132 -394 590 1503 971 -508 -936 277 1655 1446 71 -692 -103 787 583 -246 -244
2229b44R95M25r25j140M0J509Q66q74j376l29J115Q19m14p26J8P59Qj006o97P45
$$ -244 751 1176 251 -889 -849 660 1526 652 -724 -1053 62 881 467 -259 -241 518 526 -480 -1177 -432
2249d32J277K91j264j227K88J316N85p49r10J13O24J07p46k41Q64R11l20j511
$$ -432 845 1136 -128 -1355 -1067 249 834 85 -825 -712 -88 19 -727 -968 -104 807 487 -1024
2267a024o95R57J391J33j040q54M61Q23P0o34j76P17M27o73j086K2J350J064n69
$$ -1024 -1719 -762 629 762 -278 -1132 -671 152 222 -412 -588 129 556 -117 -1203 -1181 169 1233 664
2286F64j335o36P65Q55j09p10PO53K03p95p60O41J280L98j107j401J49J278R47
$$ 664 -671 -1307 -542 313 204 -506 -499 154 357 -438 -1198 -557 723 1121 14 -1387 -1238 40 987
2305I87l62q83j41N77k9n36l14P29R60k11j242q53P51J340L11r42j017J24P48
$$ 987 625 -258 -399 178 149 -387 -701 28 988 777 -465 -1318 -567 773 1084 142 -875 -751 -3
2324cJ27m49j27O32M76o11j217j68J069J168j66j301p17N94R67P3n69j15M17J70
$$ -3 124 -325 -452 180 656 45 -1172 -1340 -271 897 731 -570 -1287 -693 274 347 -222 -337 80 250
2344B50p21o32M36J300N94q70j377j86R83Q33j70p73k47M59K27m46l31O53Q67
$$ 250 -471 -1103 -667 633 1227 357 -1020 -1206 -223 610 440 -333 -580 -121 106 -340 -671 -18 849
2363H49j04j173r01M37J352O44p10q52o0N25K00l32k29M58N62l29j118l53R26
$$ 849 745 -428 -1329 -892 460 1104 394 -458 -518 7 207 -125 -354 104 666 337 -781 -1134 -208
2382b08J063p0j059r45L13Q01K11l62k78L68K88n30o77M1J036O28m70j222l34
$$ -208 855 785 -274 -1219 -906 -105 106 -256 -534 -166 122 -408 -1085 -1044 -8 620 150 -1072 -1406
2401a406P64J066l3o56l53K83K39l26l64M09R70K06r33r41K24J117N89n20p80
$$ -1406 -642 424 391 -265 -618 -335 -96 -422 -786 -377 593 799 -134 -1075 -851 266 855 335 -445
2420d45k04N86L18k74k54M30N69k64r57m58O08J146J50q05p41J33O40L00l73l09
$$ -445 -649 -63 255 -19 -273 157 726 462 -495 -953 -345 801 951 146 -595 -462 178 478 105 -204
2440b04L99K16l66o52K0R48P30m51j023m81O05Q27J15n34l44L50L33l36m06K02
$$ -204 195 411 45 -607 -587 361 1091 640 -383 -864 -259 568 683 149 -195 155 488 152 -254 -52
2460e2O41L23n92q18j15R21P45k93q00k17M35J72k30k45J97N56L5p69o48M65Q22
$$ -52 589 912 320 -498 -613 308 1053 760 -40 -257 178 350 120 -125 72 628 663 -106 -754 -289 533
2481E33L74p20p89k1O68L74k64j95J43L09k20n86k37O57O75l2r54n10M09P52Q6
$$ 533 907 187 -602 -623 45 419 155 -40 103 412 192 -394 -631 26 701 669 -285 -795 -386 366 452
2502D52n73k79J29L36k39m26M5O69M01m68q86j94O27O32j50n42k06L40K54k68
$$ 452 -121 -400 -271 65 -174 -600 -555 114 515 47 -839 -1033 -406 226 76 -466 -672 -332 -78 -346
2522c46k69J86N32J0o01o11K29Q86M21m11o80j21M45K38k14k83J34M55k4o12k98
$$ -346 -615 -429 103 113 -488 -1099 -870 16 437 26 -654 -775 -330 -92 -306 -589 -455 0 -24 -636 -934
2543i34M38P47L2o94n97K37O05K78l53l28L44K58k52l80n9N96N30j38p39k29L61
$$ -934 -496 251 283 -411 -1008 -771 -166 112 -241 -569 -225 33 -219 -599 -658 -62 468 330 -409 -638 -277
2564b77O53P6l92l12K20K75j87l24J80O50K88n57o71m5O69M33j40n22j80L64K88
$$ -277 376 452 60 -252 -32 243 56 -268 -88 562 850 293 -378 -423 246 679 539 17 -163 201 489
2585D89j88k26K29L63k6n26n28K98P23L47m53o30N2L09K07k01k32J76L29j81n76
$$ 489 301 75 304 667 641 115 -413 -115 608 955 502 -128 -76 233 440 239 7 183 512 331 -245
2606b45j46M98N72M8p65m68J76N82K15k99j61J88K19l55l14J27M45L77l06o61
$$ -245 -391 107 679 727 -38 -506 -330 252 467 168 7 195 414 59 -255 -128 317 694 388 -273
2626b73j37N06N32l0m05k66Q6K33j01k51J38M88Q3m89n67P9N67L30k49n17j44
$$ -273 -410 96 628 598 193 -73 13 246 145 -106 32 520 603 114 -453 -374 193 523 274 -243 -387
2647c87L56J98k21j38K11K21j14n37l14L87O21K16n16m26m5L78K02j40k17J43
$$ -387 -31 167 -54 -192 19 240 126 -411 -725 -338 283 499 -17 -443 -488 -110 92 -48 -265 -122
2667a22J12j61l00L6M93M31k27o50l00K94N60J68k56k93K10J67j30k08M8M66J85
$$ -122 -10 -171 -471 -435 58 489 262 -388 -688 -394 166 334 78 -215 -5 162 32 -176 -128 338 523
2688E23l54o32L1O29M53j10m57k54J28J51J8j21J74K84n7m39l39K50O34J99l60
$$ 523 169 -463 -432 197 650 540 83 -171 -43 108 126 5 179 463 406 -33 -372 -122 512 711 351
2709C51n35p6L98L04l9j51R3J1k18k64j01M04N34l4n53l86J77N59J10k03k61p6
$$ 351 -184 -260 138 442 403 252 345 356 138 -126 -227 177 711 677 124 -262 -85 474 584 381 120 44
2731D4J43r5j29Q3M50K39m06n86k24N10N73l4l85l33J34J34Rm5J20K19j11m90
$$ 44 187 92 -37 46 496 735 329 -257 -481 29 602 568 183 -150 -16 118 127 82 202 421 310 -180
2753a80l38J52O93L06k84n91k27K19L11N9j88L9J16j35k71q1L29N18m7m95n68
$$ -180 -518 -366 327 633 349 -242 -469 -250 61 120 -68 -29 87 -48 -319 -400 -71 447 400 -95 -663
2774f63R1M98L38k0j92j02q4k4j68N7M58K44k28n27k84L68N77J09k46m76p0R4
$$ -663 -572 -74 264 244 52 -50 -134 -158 -326 -269 189 433 205 -322 -606 -238 339 448 202 -274 -344 -250
2796b50J61M8J29K44N6m83l49lN11N57k77m24k65J12L92J33l9n0J03j65l28j24
$$ -250 -89 -41 88 332 388 -95 -444 -447 64 621 344 -80 -345 -233 159 292 253 203 306 141 -187 -311
2818c11L77N43Q7l28n83o6M15L17K5k44j16J22o0j36P2L96K13k09m46l82K41N56
$$ -311 66 609 696 368 -215 -281 134 451 476 232 116 238 178 42 114 510 723 514 68 -314 -73 483
2840D83K49j72l44r0J25Pk7M3K47m3k03l88N4L96M11k3m78l98R6L26Q3m9M4M2
$$ 483 732 560 216 126 251 258 231 274 521 478 275 -113 -59 337 748 725 247 -151 -55 271 354 305 349 391
2864C91l1k93k14K15L92K02l50m20j09L34L34j1j54j31q2j6j69m8K90K37rm53
$$ 391 360 67 -147 68 460 662 312 -108 -217 117 451 440 286 155 73 57 -112 -160 130 367 358 -95
2886i5l80K15L60J78j39l73o7J46M5NR2J34J2j85l66r3K93M46P0l29k69K8K16
$$ -95 -475 -260 100 278 139 -234 -301 -155 -110 -105 -13 121 133 -52 -418 -511 -218 228 298 -31 -300 -272 -56
2909e6J57o6j42J10j9j59k22J11L66J71k03l89k21J73L39n8j06o7J1Nj44nR4K92
$$ -56 101 35 -107 3 -16 -175 -397 -286 80 251 48 -341 -562 -389 -50 -108 -214 -281 -270 -265 -409 -414 -320 -28
2933b8Pl29l02J01L37L16j12j66j47K2N2NJ8J79J07j40k34m3J65L62O5l23k51
$$ -28 -21 -350 -652 -551 -214 102 -10 -176 -323 -301 -249 -244 -226 -47 60 -80 -314 -357 -192 170 235 -88 -339
2956c39K0J63K07l1p8Q8J18k41k38O2K37K83j3l69j52J89K83J05j33o5k3l4p1
$$ -339 -319 -156 51 20 -58 30 148 -93 -331 -269 -32 251 238 -131 -283 -94 189 294 161 96 73 39 -32
2979c2j2J13L74M6j97m12kK33K32M3l20K5K0MQl4Q1J94j06k89j88O8L03J74j31
$$ -32 -44 69 443 489 292 -120 -122 111 343 386 66 91 111 115 123 89 170 364 258 -31 -219 -151 152 326 195
3004A95k08l2J4M7o5K6P5J72j81k03o1K64K64lk77k35M1J48J64m7K4P6k9j94j82
$$ 195 -13 -45 -31 16 -49 -23 52 224 43 -160 -221 43 307 304 27 -208 -167 -19 145 98 122 198 169 -25 -207
3029b07Q9K91J52j38l51p7J75K30oo5r7p3K2j82j5J64J62O8k35k71o7K19K05m2
$$ -207 -118 173 325 187 -164 -241 -66 164 158 93 -4 -77 -55 -237 -252 -88 74 142 -93 -364 -431 -212 -7 -49
3053d9j55m1L6qo9Q6P8J41j23k32k55J95L99K6p4j85r3Q1J2N9K2RP9j39j65Q9
$$ -49 -204 -245 -209 -217 -286 -200 -122 19 -104 -336 -591 -396 3 29 -45 -230 -323 -242 -230 -171 -149 -140 -61 -200 -365 -276
3079b76K20K53o4k76k13R5J52R6P7j17J11q1p9j16R7J96J77j74k45j07J69K36
$$ -276 -56 197 133 -143 -356 -261 -109 -13 64 -53 58 -23 -102 -218 -121 75 252 78 -167 -274 -105 131
3101A31J1k9k14k0m9p1N0J22J96P4k85k72R8K27K11r3j56q6L9R2O4L2J21K6j48
$$ 131 142 113 -101 -121 -170 -241 -191 -69 127 201 -84 -356 -258 -31 180 87 -69 -155 -116 -24 40 72 193 219 71
3126G1k55j8K06J67J51k79r5j13J95M3m1K0p1M2k24l9O5K72J06j23k57k43J26
$$ 71 -184 -202 4 171 322 43 -52 -165 30 73 32 52 -19 23 -201 -240 -175 97 203 80 -177 -420 -294
3149b94J97J78q3n6p7o2j4K6J24J82q4j87k10kL03K00Mj51j90j1JO2P7R8Q0j73
$$ -294 -97 81 -2 -58 -135 -197 -211 -185 -61 121 37 -150 -360 -362 -59 141 145 -6 -196 -207 -206 -144 -67 31 111 -62
3175f2k08m1J43K00J72k18k14r3J39J52P4J09q8m4k58l2M0K83J89j20k20k01J14
$$ -62 -270 -311 -168 32 204 -14 -228 -321 -182 -30 44 153 65 21 -237 -269 -229 54 243 123 -97 -298 -184
3198a84J76J72k1j29j18q4l1J12R1K47L2k63j90j42K46K84N6j74j85NN7jJ62J41
$$ -184 -8 164 143 14 -104 -188 -219 -107 -16 231 263 0 -190 -332 -86 198 254 80 -105 -100 -43 -44 118 259
3222B59j65m0k66L3J26L07J53j92j44j45m0J72J22R6Kn6j95p1L7K84J71j34k33
$$ 259 94 54 -212 -179 -53 254 407 215 71 -74 -114 58 180 276 278 222 27 -44 -7 277 448 314 81
3245H1k28J1K68J78N5j41r3j68PM3Q9J53Q2k05k73J9J44J92P3j26k08j39rQ4J10
$$ 81 -147 -136 132 310 365 224 131 -37 -30 13 102 255 337 132 -141 -122 22 214 287 161 -47 -186 -195 -111 -1
3270aJ27Kj07j21j89PK69J72q2k12j29L4P1J85O8k3j17k05j07j3L14J53P2k43
$$ -1 126 128 21 -100 -289 -282 -13 159 77 -135 -264 -230 -159 26 94 71 -46 -251 -358 -371 -57 96 168 -75
$$ [...]
8191A0
##END NTUPLES=NMR FID
##END=
